##TITLE=AC1648_SPIAH14381_8569946_z4p5mIpEj6
##JCAMPDX= 6.0         $$ Bruker NMR JCAMP-DX V2.0
##DATA TYPE= NMR SPECTRUM
##DATA CLASS= NTUPLES
##ORIGIN= BRUKER
##OWNER= Administrator
$$ 1.72 TOPSPIN		Version 2.1
$$ 2014-04-10 20:30:13.228 -0700  Administrator@X
$$ Compression mode = diff/dup
##.OBSERVE FREQUENCY= 400.02188249412
##.OBSERVE NUCLEUS= ^1H
##.ACQUISITION MODE= SIMULTANEOUS (DQD)
##.ACQUISITION SCHEME= undefined
##.AVERAGES= 8
##.DIGITISER RES= 22
##SPECTROMETER/DATA SYSTEM= spect
##.PULSE SEQUENCE= zg30
##.SOLVENT NAME= COFFEE_meoh
##.SHIFT REFERENCE= INTERNAL, COFFEE_meoh, 1, 14.98509
##AUDIT TRAIL= $$ (NUMBER, WHEN, WHO, WHERE, PROCESS, VERSION, WHAT)
$$ ##TITLE= Audit trail, TOPSPIN		Version 2.1
$$ ##JCAMPDX= 5.01
$$ ##ORIGIN= Bruker BioSpin GmbH
$$ ##OWNER= Administrator
$$ $$ E:\/data/COFFEE/nmr/AC1648_SPIAH14381_8569946_z4p5mIpEj6/10/pdata/1/auditp.txt
$$ ##AUDIT TRAIL=  $$ (NUMBER, WHEN, WHO, WHERE, PROCESS, VERSION, WHAT)
(   1,<2014-04-10 20:30:05.229 -0700>,<Administrator>,<X>,<go>,<TOPSPIN 2.1>,
      <created by zg
	started at 2014-04-10 20:28:59.929 -0700,
	POWCHK enabled, PULCHK disabled,
       configuration hash MD5:
       C8 4E 4E 5D D3 5C D8 9E 9F 52 82 E0 59 8A DE 15
       data hash MD5: 64K
       7D 0A 49 BB 71 73 7A B5 52 6F BD BB F4 E8 94 BD>)
(   2,<2014-04-10 20:30:09.045 -0700>,<Administrator>,<X>,<proc1d>,<TOPSPIN 2.1>,
      <Start of raw data processing
       efp LB = 0 FT_mod = 6 PKNL = 1 PHC0 = 0 PHC1 = 0 SI = 32K 
       data hash MD5: 32K
       63 3D F2 87 86 96 C3 06 7B 74 1A 75 CD B7 E3 44>)
(   3,<2014-04-10 20:30:09.457 -0700>,<Administrator>,<X>,<proc1d>,<TOPSPIN 2.1>,
      <pk PHC0 = 95.89966 PHC1 = 0 
       data hash MD5: 32K
       FC 22 7E C4 3A 09 8C E8 35 13 09 20 F7 60 40 39>)
(   4,<2014-04-10 20:30:09.595 -0700>,<Administrator>,<X>,<proc1d>,<TOPSPIN 2.1>,
      <abs ABSG = 1 
       data hash MD5: 32K
       A1 C6 33 14 15 7E 78 0C 46 33 1B 61 2B 68 4E 4E>)
(   5,<2014-04-10 20:30:09.698 -0700>,<Administrator>,<X>,<proc1d>,<TOPSPIN 2.1>,
      <abs ABSG = 2 
       data hash MD5: 32K
       F9 53 76 13 4B D7 D1 C5 42 7C CA 0E 1C 02 B0 02>)
(   6,<2014-04-10 20:30:09.818 -0700>,<Administrator>,<X>,<proc1d>,<TOPSPIN 2.1>,
      <abs ABSG = 3 
       data hash MD5: 32K
       FC EA 1F 1B 89 A2 E8 74 19 B3 7F 11 86 94 7C D9>)
(   7,<2014-04-10 20:30:09.904 -0700>,<Administrator>,<X>,<proc1d>,<TOPSPIN 2.1>,
      <abs ABSG = 4 
       data hash MD5: 32K
       1F 57 A2 CD 59 CF 08 A3 AA 79 38 B4 85 AA 83 36>)
(   8,<2014-04-10 20:30:09.956 -0700>,<Administrator>,<X>,<proc1d>,<TOPSPIN 2.1>,
      <abs ABSG = 5 
       data hash MD5: 32K
       EF 5B C0 75 F1 C9 9B B0 46 F0 7F 41 57 B1 3A 66>)
$$ ##END=
$$ 
$$ $$ hash MD5
$$ $$ 4E 97 02 6B 18 EE A9 CD 0F 20 65 7D 16 D6 56 62
##$RELAX= 
##$RELAX= 
##$RELAX= 
##$RELAX= 
##$RELAX= 
##$RELAX= 
##$RELAX= 
$$ Bruker specific parameters
$$ --------------------------
##$DU= <E:\>
##$EXPNO= 10
##$NAME= <AC1648_SPIAH14381_8569946_z4p5mIpEj6>
$$ [...]
150 150 150 150 150 150 150 150
##$TP07= 0
##$TPNAME0= <>
##$TPNAME1= <>
##$TPNAME2= <>
##$TPNAME3= <>
##$TPNAME4= <>
##$TPNAME5= <>
##$TPNAME6= <>
##$TPNAME7= <>
##$TPOAL= (0..7)
0.5 0.5 0.5 0.5 0.5 0.5 0.5 0.5
##$TPOFFS= (0..7)
0 0 0 0 0 0 0 0
##$TUNHIN= 0
##$TUNHOUT= 0
##$TUNXOUT= 0
##$USERA1= <user>
##$USERA2= <user>
##$USERA3= <user>
##$USERA4= <user>
##$USERA5= <user>
##$V9= 5
##$VALIST= <valist>
##$VCLIST= <CCCCCCCCCCCCCCC>
##$VD= 0
##$VDLIST= <DDDDDDDDDDDDDDD>
##$VPLIST= <PPPPPPPPPPPPPPP>
##$VTLIST= <TTTTTTTTTTTTTTT>
##$WBST= 1024
##$WBSW= 4
##$XGAIN= (0..3)
0 0 0 0
##$XL= 0
##$YL= 0
##$YMAX_a= 586542
##$YMIN_a= -497470
##$ZGOPTNS= <>
##$ZL1= 120
##$ZL2= 120
##$ZL3= 120
##$ZL4= 120
##$ABSF1= 14.98509
##$ABSF2= -5.573092
##$ABSG= 5
##$ABSL= 3
##$ALPHA= 0
##$AQORDER= 0
##$ASSFAC= 0
##$ASSFACI= 0
##$ASSFACX= 0
##$ASSWID= 0
##$AUNMP= <proc_prof1d_extract_pilot.lims>
##$AXLEFT= 0
##$AXNAME= <>
##$AXNUC= <1H>
##$AXRIGHT= 0
##$AXTYPE= 0
##$AXUNIT= <>
##$AZFE= 0.1
##$AZFW= 0.1
##$BCFW= 0
##$BC_mod= 0
##$BYTORDP= 0
##$COROFFS= 0
##$CY= 15
##$DATMOD= 1
##$DC= 0
##$DFILT= <>
##$DTYPP= 0
##$F1P= 0
##$F2P= 0
##$FCOR= 0.5
##$FTSIZE= 32768
##$FT_mod= 6
##$GAMMA= 0
##$GB= 0
##$INTBC= 1
##$INTSCL= 1
##$ISEN= 128
##$LB= 0
##$LEV0= 0
##$LPBIN= 0
##$MAXI= 10000
##$MC2= 0
##$MEAN= 0
##$ME_mod= 0
##$MI= 0
##$NCOEF= 0
##$NC_proc= -8
##$NLEV= 6
##$NOISF1= 0
##$NOISF2= 0
##$NSP= 0
##$NTH_PI= 0
##$NZP= 0
##$OFFSET= 14.98509
##$PC= 1
##$PHC0= 95.89966
##$PHC1= 0
##$PH_mod= 1
##$PKNL= yes
##$PPARMOD= 0
##$PPDIAG= 0
##$PPIPTYP= 0
##$PPMPNUM= 2147483647
##$PPRESOL= 1
##$PSCAL= 4
##$PSIGN= 0
##$PYNMP= <proc.py>
##$REVERSE= no
##$SF= 400.02
##$SI= 32768
##$SIGF1= 0
##$SIGF2= 0
##$SINO= 400
##$SIOLD= 32768
##$SPECTYP= <>
##$SREGLST= <1H.CDCl3>
##$SSB= 0
##$STSI= 32768
##$STSR= 0
##$SW_p= 8223.68421052631
##$SYMM= 0
##$S_DEV= 0
##$TDeff= 65536
##$TDoff= 0
##$TI= <>
##$TILT= no
##$TM1= 0
##$TM2= 0
##$TOPLEV= 0
##$USERP1= <user>
##$USERP2= <user>
##$USERP3= <user>
##$USERP4= <user>
##$USERP5= <user>
##$WDW= 1
##$XDIM= 32768
##$YMAX_p= 426281722
##$YMIN_p= -750341
##$CURPLOT= <Network HP LaserJet P1505>
##$CURPRIN= <$Network HP LaserJet P1505>
##$DFORMAT= <normdp>
##$LAYOUT= <+/1D_H.xwp>
##$LFORMAT= <normlp>
##$PFORMAT= <normpl>
##$SURQMSG= 1
$$ End of Bruker specific parameters
$$ ---------------------------------
##NTUPLES= NMR SPECTRUM
##VAR_NAME=  FREQUENCY,     SPECTRUM/REAL,   SPECTRUM/IMAG
##SYMBOL=    X,             R,               I
##VAR_TYPE=  INDEPENDENT,   DEPENDENT,       DEPENDENT
##VAR_FORM=  AFFN,          ASDF,            ASDF
##VAR_DIM=   32768,         32768,           32768
##UNITS=     HZ,            ARBITRARY UNITS, ARBITRARY UNITS
##FACTOR=    0.250966925370066, 1,           1
##FIRST=     8223.43324360094, -179021,      -167739
##LAST=      0,             205603,          -95218
##MIN=       0,             -750341,         0
##MAX=       8223.43324360094, 426281722,    0
$$ Real data points
##PAGE= N=1
##DATA TABLE= (X++(R..R)), XYDATA
$$ [...]
$$ plain form
19554 -5106 -101968 142655 -361595 -9776 117142 -231165 -45402 176736 -60001 -54011 199429
19542 306730 -31144 -74381 138538 41145 -46951 -211342 57785 -29557 164930 -203127 -25095
19530 -172675 48970 -246276 -234329 -1157 -194069 -105694 -193697 -530658 -229421 -105289 -173222
19519 -173222 75258 29211 -199545 -71625 -318356 314805 -281854 115490 109342 -44618 76600
19507 -223984 -159140 -118174 39583 54032 124026 24412 -101791 -118938 226934 -22371 312622
19495 -14543 24626 62158 67459 -59378 -271404 -300695 120706 64286 -185150 245439 -185761
19483 -140735 -226618 75327 14084 58219 -270761 -153970 -188644 -63392 -122105 -10773 -80592
19472 -80592 188782 -31443 354785 -170758 -89746 -21192 -114459 76272 135015 -273124 -261467
$$ packed form
19554e106r6862A42655c61595i776A17142b31165d5402A76736f0001N990A99429
19542C06730c1144m3237A38538D1145d6951j64391E7785b9557A64930b03127b5095
19530a72675D8970b46276J1947a157j92912Q8375q8003l36961b29421a05289o7933
19519a73222G5258B9211a99545g1625k46731C14805b81854A15490o148d4618G6600
19507b23984O4844M0966C9583J4449O9994B4412a01791j7147B26934b2371C12622
19495a4543B4626L7532N301e9378k12026k9291A20706n6420a85150B45439a85761
19483a40735q5883G5327A4084M4135b70761J16791l4674f3392n8713a0773o9819
19472h0592A88782c1443C54785a70758Q1012b1192r3267G6272N8743b73124J1657
$$ plain form
19461 -261467 -336385 -1747 -22249 124898 -414760 220364 58088 143101 -162809 159010 -194589
19449 160780 29173 -202605 -13392 -19182 14800 139906 -36801 -7178 -45797 -103093 444287
19437 -126194 -15642 144421 -455831 266846 149318 -203302 66578 -15810 -7043 54838 273202
19426 273202 -226816 146982 -179521 -378239 -220487 -117723 160415 66937 -53028 -187952
19416 -187952 -13010 29392 52908 -28222 142309 335972 -363 -95829 269436 -454724 33920
19404 -113372 -429250 64116 -337351 61959 -273777 59957 37635 -169738 15488 -131866
19393 167014 -68468 -4957 -13268 -92591 30547 -201114 -112845 -151546 -21599 -214017 -287299
19382 -287299 243234 -455539 173469 -276956 -13485 216860 223629 -139832 -154854 -3315 -18213
$$ packed form
19461b61467p4918a747k0502A24898d14760B20364E8088Q5013a62809A59010a94589
19449A60780B9173b02605a3392n790A4800J25106c6801g178l8619n7296D44287
19437a26194a5642A44421d55831B66846j17528b03302F6578a5810g043E4838K18364
19426B73202b26816A46982a79521j98718J57752J02764A60415F6937e3028j34924
19416a87952a3010B9392K3516b8222A42309J93663c63r5466B69436d54724C3920
19404a13372l15878F4116c37351F1959b73777E9957k2322a69738A5488a31866
19393A67014f8468d957q311p9323C0547b01114Q8269l8701b1599j92418p3282
19382b87299B43234d55539A73469b76956a3485B16860O769a39832j5022c315j4898
$$ plain form
19371 -18213 12010 -40179 -181937 -360972 -85571 -174718 -249819 -77306 -105983 -19502 -228037
19360 -228037 87036 369256 -288605 -34366 -315205 -240819 -87153 -138397 -67108 -162612 -10884
19348 79529 26914 -19157 122945 75578 -187178 -276856 24457 -94822 23139 37327 -201158
19336 -129709 -84858 -65910 -64832 -173246 134630 226490 -73825 208710 -94758 -152042 -124785
19325 -124785 -218928 37685 -108671 35620 -15415 95935 -147854 85090 127846 157890 -420474
19313 -200892 -215465 106063 -92667 317837 184612 -47924 -234836 -113830 -77878 -190407
19303 -190407 -117027 -272368 -299128 71075 110644 259402 -59085 236387 176711 -111449 -10091
19291 22846 42975 220526 57247 -282621 -193173 -51048 -242384 -5884 -218309 -23284 2242
$$ packed form
19371a8213A2010d0179j41758j79035h5571q9147p5101g7306k8677a9502k08535
19360b28037H7036K82220b88605c4366k80839P4386h7153n1244f7108r5504a0884
19348G9529B6914a9157A22945m7367a87178q9678B4457i4822B3139J4188b01158
19336a29709M4851J8948J078j08414A34630R1860g3825B08710i4758n7284K7257
19325a24785r4143C7685a08671C5620a5415I5935a47854H5090M2756L0044d20474
19313b00892j4573A06063i2667C17837j33225d7924j86912a13830L5952j12529
19303a90407P3380j55341k6760G1075L9569J48758e9085B36387n9676a11449a0091
19291B2846K0129J77551E7247b82621Q9448e1048j91336e884k12425b3284B242
$$ plain form
19279 -48036 193585 237977 -22674 -271787 144915 635 278994 354619 -162642 110038 159908
19268 159908 -16993 -12223 291687 -89920 -9367 37055 92843 34876 225372 -147144 -159616
19257 -159616 -156172 211626 104775 86239 -137484 16055 -152283 -157577 83831 -145908 -312258
19246 -312258 -11751 110471 30981 -406877 134209 46790 -17516 59979 -331381 44697 148080
19235 148080 144972 -16623 -90861 -229148 13870 -25326 13104 34729 59077 -303075 -29351
19223 -153599 -36725 58593 63651 236081 172422 -232534 -207923 -47446 -34335 -83152 6746
19211 34510 -195058 -33982 73693 -210057 -285023 -205575 -52834 39160 -124984 -393588 391701
19199 166031 19487 -292014 -93873 -212994 9750 -382288 -170558 -258484 -320146 98416 -37498
$$ packed form
19279d8036A93585M4392b2674k49113A44915F35K78359P5625a62642A10038M9870
19268A59908a6993M770B91687h9920i367C7055N5788C4876J90496a47144j2472
19257a59616L444B11626A04775j8536a37484A6055a52283n294H3831a45908j66350
19246c12258a1751A10471C0981d06877A34209D6790a7516E9979c31381D4697J03383
19235A48080l108a6623p4238j38287A3870b5326A3104K1625K4348c03075b9351
19223a53599c6725E8593N058J72430o3659b32534K4611d7446J3111m8817F746
19211C4510a95058c3982G3693b10057p4966P9448e2834C9160a24984k68604C91701
19199A66031A9487b92014i3873j19121I750c82288a70558q7926o1662I8416c7498
$$ plain form
19187 -50496 -2832 -260045 -246979 -4134 -1934 205560 12999 55959 43731 -52783 -80462 -215944
19175 -215944 52506 -267196 12488 -143055 -142538 -72170 146500 200546 -168252 -141251 -234901
19164 -234901 -436369 256738 140467 -974 126551 -789 106132 -343224 -298919 129241 42103
19152 -196120 -434360 -165678 -161801 271279 11207 108511 -20055 -54802 -1546 -230379 273046
19140 -58627 -137610 246533 -12640 14600 5622 66103 -31204 74628 80443 -216290 -50500 -42808
19128 -42808 94728 72471 -118648 69306 -53012 -257771 -335450 289590 -18997 47711 211527
19117 211527 120077 166618 -81874 44630 -201774 189455 -165515 -199274 50116 -359454 -545874
19106 -545874 12291 145436 -188467 134940 -34582 -60574 -9897 -199506 -131095 -1304 -382486
$$ packed form
19187e0496b832k57213J3066d134a934B05560A2999M2960j2228e2783k7679j35482
19175b15944E2506b67196A2488a43055N17P0368A46500N4046a68252K7001r3650
19164b34901k01468B56738j16271i74A26551g89A06132c43224M4305A29241D2103
19152a96120k38240a65678L877B71279A1207R7304b0055l4747a546k28833B73046
19140e8627p8983B46533a2640A4600E622O0481c1204G4628N815b16290e0500P692
19128d2808I4728k2257a18648F9306e3012k04759p7679B89590a8997D7711J63816
19117B11527r1450M6541h1874D4630b01774A89455a65515l3759E0116c59454j86420
19106e45874A2291J33145a88467A34940c4582k5992i897j89609O8411a304l81182
$$ plain form
19095 -382486 -147219 71340 46863 -12048 -29659 -376867 -211579 -82235 -220176 -254488 -373155
19084 -373155 119810 -24558 180838 -123275 -294957 -128719 -329581 100585 -32571 -94118
19074 -94118 -35123 -147245 -64326 41113 71726 -256458 195847 -117167 -126613 -310699 121208
19062 19987 -7537 25404 -260733 -118644 -50267 161389 -144671 -199700 167002 -382288 64964
19050 369977 -157814 -52962 170286 473627 -25750 -176596 47805 278454 59034 -152555
19039 -97148 68810 -101834 -105871 -70235 -183897 -161043 -390856 222583 138872 -79181 87071
19027 143292 123410 -14337 161259 118029 148929 -11350 364410 73000 -96559 76156 -261919
19015 128074 -72875 26545 136715 191853 -6699 -176223 -174313 107473 -219212 -78952 74282
$$ packed form
19095c82486a47219G1340k4477a2048j7611l47208J65288h2235j37941l4312j18667
19084c73155A19810b4558A80838a23275j71682a28719k00862A00585c2571o1547
19074i4118c5123j12122f4326D1113L0613b56458A95847a17167r446j84086A21208
19062A9987g537B5404b60733a18644e0267A61389a44671n5029A67002c82288F4964
19050C69977a57814e2962A70286L03341b5750j50846D7805K30649E9034a52555
19039i7148F8810a01834m037L5636j13662K2854k29813B22583q3711g9181H7071
19027A43292j9882a4337A61259m3230L0900a1350C64410G3000i6559G6156b61919
19015A28074g2875B6545J10170N5138f699j69524J910A07473b19212g8952G4282
$$ plain form
19003 302959 102656 -149135 101211 -250588 312566 384324 51287 -76798 -309236 62683
18992 86495 44538 108260 -166141 183558 -154086 -67962 -107220 215011 -97693 -85638 -369857
18981 -369857 6973 -134086 -306394 314189 -36908 -277894 41529 80350 -28652 175381 -399461
18969 -287935 124009 -74108 90476 -81698 -149357 -26251 12614 282334 -139197 121911 -158141
18957 251632 -168362 -73629 49586 74605 314698 38099 -339141 -368631 -167766 215350
18946 -193097 15802 46235 -23198 18540 11748 -57336 -284053 150316 370718 -67710 -49209
18935 -49209 283518 24660 -63017 -233110 169254 -66988 3411 68736 -293372 69299 -340001
18923 159750 294062 -28359 184914 145907 -325479 88345 -290371 -20631 63848 -331435
$$ packed form
19003C02959A02656a49135A01211b50588C12566P1758E1287g6798k32438F2683
18992H6495m1957O3722a66141A83558a54086f7962l9258B15011i7693J2055k84219
18981c69857F973a34086j72308C14189c6908k40986D1529L8821b8652A75381c99461
18969b87935A24009g4108I0476h1698o7659b6251A2614K69720a39197A21911a58141
18957B51632a68362g3629D9586K5019K40093C8099c39141k9490a67766B15350
18946a93097A5802L0433b3198A8540o792e7336k26717A50316K20402f7710J8501
18935d9209B83518B4660f3017j70093A69254f6988C411O5325b93372F9299c40001
18923A59750J34312b8359A84914l9007c25479H8345b90371b0631F3848c31435
$$ plain form
18912 -44841 104839 -117568 -200799 -366517 28112 -41916 -156057 59787 201347 172955 -57017
18900 -68916 -344568 136019 31445 -121936 170915 -90399 276894 -173399 41490 -199652
18889 136699 193064 261172 -212279 -241360 -239667 115603 19786 -125849 -370378 -334134 15671
18877 -32109 13241 -54125 32438 -48804 112475 -178748 158309 -89172 -258573 -26391 -50475
18866 -50475 117756 -190124 122589 -252749 4643 148342 -15 -154305 81789 -86550 -73719
18855 -73719 -49347 174724 -267402 -335887 -144077 116954 90816 13599 6162 231426 149969
18844 149969 -187502 -4350 -77041 454846 -458601 -118709 -191603 303135 9148 148333 238288
18833 238288 -352434 -219254 48809 31217 -217452 387612 29550 -353273 145095 246179
$$ packed form
18912d4841A04839a17568q3231j65718B8112d1916j14141E9787J41560k8392e7017
18900f8916k75652A36019C1445a21936A70915i0399B76894a73399D1490a99652
18889A36699N6365O8108b12279k9081J693A15603A9786a25849k44529L6244A5671
18877c2109A3241e4125C2438d8804A12475a78748A58309h9172j69401b6391k4084
18866e0475A17756a90124A22589b52749D643J43699a5j54290H1789h6550J2831
18855g3719K4372A74724b67402o8485a44077A16954k6138A3599F162K25264q1457
18844A49969a87502d350p2691D54846d58601a18709p2894C03135I148J39185Q9955
18833B38288c52434J33180D8809j7592b17452C87612B9550c53273A45095J01084
$$ plain form
18823 246179 217570 -212620 172346 93709 -223522 -32333 7892 -185733 10145 3772 59020
18812 59020 267823 22908 11318 275406 -324303 -140559 63487 116652 -225183 -9134 287911
18800 -120881 167853 73751 -58763 218444 111394 -324065 -120757 169658 -267415 -295486
18790 -295486 61793 -159293 -306457 23211 75060 228442 77302 201215 -148947 -201144
18780 -201144 -47427 172196 -274874 -420633 -185881 -150632 -8508 -80965 -333506 -60012 109015
18768 -261729 -185585 286690 -48008 -447330 117342 -135260 -249358 162708 4676 -420714
18757 55474 -45312 145987 -37419 25797 -122577 -43601 -143576 -29435 -23066 151457 91561
18746 91561 177838 86964 -117680 -232971 -107191 -333769 162679 32612 -270883 -248409
$$ packed form
18823B46179k8609b12620A72346p8637b23522c2333G892a85733A0145C772N5248
18812E9020K08803B2908A1318K64088c24303a40559F3487N3165b25183i134B87911
18800a20881A67853G3751e8763B18444j07050c24065a20757A69658b67415k8071
18790b95486F1793a59293j47164B3211N1849J53382G7302J23913a48947n2197
18780b01144d7427A72196b74874j45759a85881L5249h508p2457k52541f0012A09015
18768b61729P6144B86690d8008l99322A17342a35260j14098A62708D676d20714
18757E5474d5312A45987c7419B5797a22577d3601r9975b9435O369A51457n9896
18746I1561Q6277H6964a17680j15291a07191k26578A62679C2612b70883K2474
$$ plain form
18736 -248409 204483 27881 97545 132284 -122764 -175925 -117399 365356 2670 136338 -39418
18724 -34415 -59274 157945 -51773 -82096 -61256 -105439 131533 171107 -31857 193069 -126199
18712 -392073 30900 -88680 79673 -415736 -287921 3193 215700 -93706 80036 -191583 234596
18700 75078 -94334 -307953 -40907 -177691 -198468 -489651 -36333 198794 -172440 414317
18689 -305472 -308468 -20948 -19298 14710 -102096 -260000 -70102 210255 25641 257184 -61380
18677 320521 310772 76357 -204033 -58308 198929 -63412 -126345 -160606 -88015 209345 168227
18666 168227 -53938 261806 228461 90574 -220661 55773 68213 -1389 -267902 337990 -273581
18654 -6628 196929 18312 -130165 -22454 38663 133253 -161687 56075 4469 165627 -85789
$$ packed form
18736b48409B04483B7881O9664L4739a22764n3161N8526C65356B670J33668c9418
18724c4415k4859A57945e1773l0323K0840m4183A31533L9574c1857A93069a26199
18712c92073C0900h8680G9673d15736J27815C193K12507i3706H0036a91583B34596
18700G5078i4334k13619d0907j36784k0777k91183c6333A98794a72440D14317
18689c05472k996b0948J650A4710a02096j57904g0102B10255B5641K31543f1380
18677C20521r749G6357b04033e8308A98929f3412o2933l4261P2591B09345m1118
18666A68227e3938B61806l3345I0574b20661E5773J2440a389k66513C37990b73581
18654f628A96929A8312a30165b2454C8663R4590a61687E6075D469J61158h5789
$$ plain form
18642 56369 -110407 -387660 15383 -392413 -79860 -338977 -348823 10248 -155329 -410725 184050
18630 -12886 22842 -91766 -141013 -103560 112913 -135815 205587 85156 66438 -50713 -157788
18619 -157788 224378 -205726 -21869 -113472 -98463 104029 110863 -255529 53389 -209568 -271018
18608 -271018 135553 -335006 -431203 253158 23166 65990 -274756 -104899 37839 -109468
18597 -45998 -61065 261698 249571 -360679 151897 90926 54919 169475 -161004 -49733 9510
18585 -229039 -139066 13778 35870 -258502 -3086 -127605 -316697 13712 131483 -129629 -49071
18573 -49555 -71580 62392 -222852 -124223 -87292 -102110 19218 2006 4470 262689 -7647 -189234
18561 -189234 154580 -190363 11719 -53923 -84906 -10702 -380308 380094 448 165361 -237987
$$ packed form
18642E6369a10407k77253A5383c92413g9860k59117r846A0248a55329k55396A84050
18630a2886B2842i1766m9247L7453A12913a35815B05587H5156j8718e0713j07075
18619a57788B24378b05726b1869r1603J5009A04029O834b55529E3389b09568o1450
18608b71018A35553c35006r6197B53158B3166M2824b74756a04899C7839a09468
18597d5998j5067B61698j2127c60679A51897o0971l6007J14556a61004d9733I510
18585b29039Q9973A3778K2092b58502c086j24519j89092A3712J17771a29629d9071
18573d9555k2025F2392b22852R8629L6931j4818A9218B006K464K58219g647j81587
18561a89234A54580a90363A1719e3923l0983a0702l69606C80094D48J64913b37987
$$ plain form
18549 -122013 105038 63366 -14501 -301479 -157365 -130811 -110478 -89200 -96267 211963 207986
18538 207986 -109226 -167539 -269902 122576 -27258 -131429 110508 -50001 362826 155868
18527 -232898 23533 -373741 -101864 -12501 296357 15978 58020 -191850 -83975 135468
18516 411281 -191683 -236611 11423 234872 -102879 174432 -83833 -179682 -62820 4661 104112
18505 104112 -48724 89882 -187842 -89760 -36288 60921 86429 242025 -88807 103830 -233827
18493 151030 -19872 19155 -176561 -69135 -200482 -282896 -222193 -75297 249312 -281148 -168468
18482 -168468 244800 -59888 89715 51293 -25303 110784 -357238 101715 -258266 39915
18471 -327604 145513 45367 -317295 -21363 -111584 -6263 24967 -220919 -144457 -59824 -52565
$$ packed form
18549a22013A05038m1672a4501k86978J44114K6554K0333K1278p067B11963l977
18538B07986a09226n8313j02363A22576b7258j04171A10508e0001C62826A55868
18527b32898B3533c73741a01864a2501B96357A5978M2042a91850h3975A35468
18516D11281a91683m4928A1423K23449a02879A74432h3833r5849f2820D661R9451
18505A04112d8724H9882a87842h9760c6288F0921K5508J55596h8807A03830b33827
18493A51030a9872A9155a76561f9135j31347q2414O0703g5297B49312b81148J12680
18482a68468B44800e9888H9715l8422b5303A10784c57238A01715b58266C9915
18471c27604A45513D5367c17295b1363r0221f263B4967b20919P6462e9824P259
$$ plain form
18460 -52565 -334128 -230443 -113402 -144693 38319 5786 -2010 -287321 -342113 189433 -170408
18448 -59518 -125345 -82689 51178 35645 14296 -179460 -151372 -56864 -52159 92548 -241735
18436 147310 167417 -177526 -38496 -27031 215835 216480 -358148 -268713 89667 -427467 339591
18424 11589 195119 -160877 -188451 -203590 101555 -197757 -271015 -24364 10873 -234369 -292541
18413 -292541 -187802 153627 56922 -33952 203467 -304524 -90909 255154 405881 -34908
18402 -218332 -86848 -74022 160977 -128788 -181531 -170556 66567 -146114 -37241 -204435 661556
18390 -191158 -56819 -47769 169688 -149553 29241 160714 17300 141569 21762 179579 -199841
18378 -36052 101482 95465 167768 292476 -49855 65601 -513 18055 -5416 -85694 -71751 19812
$$ packed form
18460e2565k81563J03685a13402l1291C8319E786b010k85311n4792A89433a70408
18448e9518o5827M2656E1178j5533A4296a79460K8088e6864M705I2548b41735
18436A47310K0107a77526c8496J1465B15835O45c58148Q9435H9667d27467C39591
18424A1589J83530a60877k7574j5139A01555a97757p3258b4364A0873b34369n8172
18413b92541J04739A53627E6922c3952B03467c04524i0909B55154J50727c4908
18402b18332h6848J2826A60977a28788n2743J0975F6567a46114c7241j67194F61556
18390a91158e6819R050A69688a49553B9241J31473A7300J24269B1762J57817a99841
18378c6052A01482o017P2303J24708d9855F5601e13A8055e416q0278J3943A9812
$$ plain form
18365 -300 131898 -172666 88507 -349025 -9100 -70126 30738 -43934 -86583 32922 -197159
18353 -269637 62823 63790 134146 46977 -294593 -300929 -346021 -227525 114552 -12648 223182
18341 98133 -116081 -320159 -20491 -130544 11461 -96397 105413 -246006 -318009 -151970
18330 -234658 -24374 -10297 -279803 172136 -182202 -8516 141251 -183127 -96847 -87953 -33242
18318 171683 -167948 37108 89473 -16440 -460173 70688 -36492 257636 -20528 185307 194340
18307 194340 127481 13331 -85190 49713 51021 -2701 47502 227275 -317985 -114589 18886
18295 -49013 68647 42352 -123854 214651 150798 -93775 26837 -212103 -276285 133192 -53291
18283 -15626 74402 72353 -83468 64178 45674 337905 167352 -69404 68212 -85625 -161983
$$ packed form
18365c00A31898a72666H8507c49025i100o1026C0738d3934m2649C2922a97159
18353b69637F2823R67P0356D6977b94593o336m5092J18496A14552a2648B23182
18341I8133a16081k04078b0491j10053A1461i6397A05413b46006p2003a51970
18330b34658b4374a0297k69506A72136a82202h516A41251a83127Q6280Q894c3242
18318A71683a67948C7108N2365a6440m43733G0688c6492B57636b0528A85307R033
18307A94340o6859A3331h5190D9713J308b701D7502J79773c17985a14589A8886
18295d9013F8647k6295a23854B14651o3853i3775B6837b12103o4182A33192e3291
18283a5626G4402k049h3468F4178j8504K92231A67352f9404F8212h5625p6358
$$ plain form
18272 -161983 64409 -100150 -97105 -225197 236489 -51857 105416 133636 -23833 54328 187722
18261 187722 280457 -69797 177196 -9607 167677 19119 -124483 -79391 -284748 26844 -92156
18249 -149761 62813 -65165 -11048 -185862 180362 7731 -276333 14016 287919 17382 -255049
18237 -425146 -136071 -147563 -120004 170824 89421 117055 -11662 -120033 -249224 -126305
18227 -126305 -40347 -42849 132682 -3275 196266 -231076 -163633 326379 92719 -94874 -71068
18216 -71068 184482 -274178 82281 158930 94453 177651 -69012 -211371 -205684 59082 66121
18205 66121 143165 107841 173454 -377795 -148480 -131862 47229 -74024 221909 80745 -6654
18193 -280415 17523 -182230 -29631 -135405 -28196 46891 142081 104315 -126023 206517 -57970
$$ packed form
18272a61983F4409a00150L045j28092B36489e1857A05416K8220b3833E4328J33394
18261A87722R2735f9797A77196i607A67677A9119a24483M5092k05357B6844i2156
18249a49761F2813f5165a1048j74814A80362G731b76333A4016K73903A7382b55049
18237d25146a36071j1492K7559A70824q1403K7634a1662j08371j29191J22919
18227a26305d0347k502A32682c275A96266b31076O7443C26379I2719i4874K3806
18216g1068A84482b74178H2281P6649o4477Q3198f9012j42359N687E9082P039
18205F6121P7044l5324O5613c77795a48480J6618D7229g4024B21909H0745f654
18193b80415A7523a82230b9631j05774b8196D6891R5190l7766a26023B06517e7970
$$ plain form
18181 -164852 207063 -156633 85260 76367 -100987 -50615 -249891 -106988 -128137 -338858
18171 -338858 183864 55997 405449 138725 175954 203889 252096 165156 -342713 -32490 -169487
18160 -169487 -81259 33215 -196983 31261 -140286 -14886 -44338 -214841 68480 -46611 -158399
18149 -158399 -154974 -114525 105653 -264950 -93350 98053 88800 -136601 273077 -72352 95505
18137 -297084 -276173 158727 126369 197998 -113762 36785 163553 -258488 7711 -53076 -64493
18126 -64493 301792 -192011 -198456 -50999 8741 -214366 37787 55579 -179600 -197683 159400
18114 254678 46740 -193598 91864 -204394 -104587 186311 105067 -317168 -126283 -105994
18104 -105994 203247 -187730 92323 -78021 -266 -141116 -118958 342214 -156918 -133173 111711
$$ packed form
18181a64852B07063a56633H5260q893a00987N0372j99276a06988k1149k10721
18171c38858A83864E5997L49452A38725L7229K7935M8207q6940c42713c2490j36997
18160a69487h1259C3215a96983C1261a40286a4886k9452j70503F8480d6611j11788
18149a58399L425M0449A05653b64950i3350I8053r253a36601B73077g2352I5505
18137b97084K0911A58727l2358P1629a13762C6785J26768b58488G711e3076j1417
18126f4493C01792a92011o445e0999H741b14366C7787J7792a79600j8083A59400
18114B54678D6740a93598I1864b04394R9807A86311q1244c17168a26283K0289
18104a05994B03247a87730I2323g8021b66j40850K2158C42214a56918K3745A11711
$$ plain form
18092 -254052 -23919 -254668 -34534 -139205 -76003 123355 -9886 120267 74103 172920 -231272
18080 -59397 -119432 -227773 -88881 -171809 -341865 -257721 63350 37301 283231 -67425 -137929
18069 -137929 103288 100342 171896 -199718 -147495 -30436 63835 43248 -35182 -19423 283357
18057 -165518 -177406 -138037 179 -80868 -156133 123083 -217997 326102 -21106 37752 404142
18046 404142 98949 317512 91990 -152836 -125928 -508381 65002 130955 183769 -295374 84903
18034 173604 163948 -157808 103620 -195527 -296067 -286113 184544 26614 123850 155457 -277845
18022 -105747 80837 143986 201050 83847 -42326 136372 522078 -91573 -98942 76589 -115455
18010 -229436 137930 -75496 -119572 418544 107607 -167504 -321861 -279992 -6138 -4532 215524
$$ packed form
18092b54052b3919k30749c4534j04671O3202A23355i886A20267m6164R8817b31272
18080e9397o0035j08341h8881q2928j70056Q4144F3350k6049K45930f7425p0504
18069a37929A03288k946P1554a99718N2223c0436F3835k0587c5182J5759B83357
18057a65518j1888L9369A79h0868p5265A23083b17997C26102b1106C7752L66390
18046D04142I8949K18563I1990a52836K6908l82453F5002O5953N2814b95374H4903
18034A73604r656a57808A03620a95527j00540R954A84544B6614R7236L1607b77845
18022a05747H0837O3149N7064H3847d2326A36372L85706i1573p369G6589a15455
18010b29436A37930g5496m4076D18544A07607a67504j54357M1869f138J606B15524
$$ plain form
17998 212895 -240676 -306899 -207763 444188 172896 -290988 163160 -102830 22501 -174698
17987 -298027 -10708 -63007 -193698 -256947 -24984 -77128 17478 10766 3026 -270283 -206867
17976 -206867 270922 53886 -162219 -277896 -169537 43945 111533 174417 32323 -135030
17965 -43564 160721 -35412 -473480 136709 402123 28965 4787 -16331 -77622 -221863 -19820
17953 -24898 123809 -139344 -247992 382218 -298393 -70420 -20928 119135 -230344 73828
17942 25787 771 154992 -82959 113344 184670 153554 -133716 75579 186501 -72039 -156305
17931 -156305 92208 14547 268028 -43882 -320906 -307417 -144167 294223 -141965 -47733
17920 -256604 151612 -58993 -21961 -21744 -95972 -14300 412972 -35103 -14597 -251225 -152735
$$ packed form
17998B12895b40676o6223R9136D44188A72896b90988A63160a02830B2501a74698
17987b98027a0708n2299j30691o3249b4984n2144A7478o712C026b70283O3416
17976b06867B70922E3886a62219j15677J08359D3945O7588O2884C2323a35030
17965d3564A60721c5412m38068A36709K65414B8965D787a6331o1291j44241a9820
17953b4898A23809a39344j08648C82218b98393g0420b0928A19135b30344G3828
17942B5787G71J54221h2959A13344P1326l1116a33716G5579J10922g2039q4266
17931a56305I2208A4547K53481d3882k77024J3489a44167B94223a41965d7733
17920b56604A51612e8993b1961K17p4228a4300D12972c5103a4597k36628R8490
$$ plain form
17909 -152735 158073 -349395 -134816 -14834 40245 -7428 241381 -134729 -44773 -60701 17843
17897 251015 -146261 -251747 -7348 254183 61066 105997 -154124 -37865 -36143 -15857 21586
17885 7599 -90003 -23883 -141332 190919 84901 180741 -192882 -14711 342745 -555470 53109
17873 124230 -338710 302383 67290 -915 78035 -339325 -179730 -139169 31697 50896 138634
17862 138634 -307187 -352638 220287 -87654 -64539 52212 30018 33669 500740 -82745 146352
17850 172803 -34041 -182417 -50140 242302 31346 58661 32509 18765 65836 -799 -45559
17839 -45559 343311 -169256 26920 194074 -22575 -85106 12649 155493 -209823 166728
17828 101811 21731 24157 153487 121871 82800 -222521 159782 -83836 -62242 -6090 -5319 429451
$$ packed form
17909a52735A58073c49395a34816a4834D0245g428B41381a34729d4773j5928A7843
17897B51015a46261j05486g348B54183F1066M4931a54124c7865J722a5857B1586
17885G599i0003b3883j17449A90919H4901R5840a92882a4711C42745e55470E3109
17873A24230c38710C02383F7290i15G8035c39325J59595M0561C1697J9199Q7738
17862A38634c07187m5451B20287h7654K3115E2212k2194L651M67071h2745A46352
17850A72803c4041j48376e0140B42302C1346K7315k6152j3744M7071g99m4760
17839d5559C43311a69256B6920J67154b2575o2531A2649J42844b09823A66728
17828A01811B1731K426J29330l1616l9071b22521A59782h3836K1594f090P71D29451
$$ plain form
17815 43600 -374161 -30675 -182912 -86188 -90323 -400656 121315 472294 -37874 162269 201899
17804 201899 2692 177287 -35810 -180263 86311 -27266 -197950 -227824 29818 -58077 132666
17792 -177886 97717 -42417 -197136 -260194 -187728 -138428 -343560 89554 253735 -266477 220729
17780 -42735 9796 176810 -189056 330888 -56979 -21867 -226795 86007 -206100 -129120 240558
17768 -285311 158248 -499 40806 320348 171559 128134 -196713 -22199 46665 220371 -139631
17756 413257 -176563 -184132 135585 308110 -212535 235155 -378909 126514 16110 -33820
17745 -258571 -50190 -70291 -86694 -136210 190010 31381 -454776 -10755 -15886 -88133 -145291
17734 -145291 -256565 -18708 271270 224135 -67018 179681 63999 178520 221296 137379 -129887
$$ packed form
17815D3600c74161c0675j52237h6188m135l10333A21315L50979c7874A62269L9630
17804B01899B692J74595c5810j44453H6311b7266j70684k9874B9818e8077A32666
17792a77886I7717d2417j54719o3058P2466M9300k05132H9554J64181b66477B20729
17780d2735I796J67014a89056C30888e6979b1867k04928H6007b06100P6980B40558
17768b85311A58248d99D0806K79542j48789m3425a96713b2199D6665J73706a39631
17756D13257a76563p569A35585J72525b12535B35155c78909A26514A6110c3820
17745b58571e0190k0101j6403m9516A90010C1381d54776a0755n131p2247n7158
17734a45291j11274a8708B71270m7135f7018A79681F3999J14521M2776q3917a29887
$$ plain form
17722 -63451 -119481 145823 136544 10077 17693 -120016 111304 8089 -214438 -78378 246996
17710 291359 11088 81686 149964 -155708 50127 72488 251619 -124496 -161131 190108 -108444
17698 -74823 -14462 38335 338960 22459 482790 -79521 -41708 159476 212410 110103 -252346
17686 -46556 17536 134616 -23544 -112284 -63643 -176715 -4281 -122631 32817 154233 -126642
17674 -42971 331597 3703 185720 -50932 -384100 -159773 60378 62982 138474 -137810 37600
17662 83395 246179 208295 -144254 -78919 -99041 -176462 74324 33411 -134272 84945 -220494
17650 -189594 116008 152861 280066 -113808 201264 190244 -145926 79282 -37411 72468
17639 298972 -233103 197252 -195 -64168 -103060 308311 -155268 198882 -109516 20841 -119909
$$ packed form
17722f3451n6030A45823r279A0077P616a20016A11304H089b14438g8378B46996
17710B91359A1088P0598O8278a55708E0127K2361J79131a24496l6635A90108a08444
17698g4823a4462C8335L00625B2459M60331g9521L7813A59476N2934j02307b52346
17686d6556A7536J17080b3544q8740M8641j13072d281j18350C2817J21416a26642
17674d2971C31597C703J82017e0932l33168a59773F0378K604P5492a37810C7600
17662H3395J62784l7884a44254O5335k0122p7421G4324C3411a34272H4945b20494
17650a89594A16008L6853J27205a13808B01264j1020a45926G9282c7411G2468
17639B98972b33103A97252a95o3973l8892C08311a55268A98882a09516B0841a19909
$$ plain form
17627 100471 35208 -134178 -144269 -13062 51603 195212 -306645 25141 -119924 414062
17616 122053 17772 248626 -65808 70516 91287 33326 -52318 -137335 92195 123029 -130432
17604 84758 -288831 -104280 -47092 98027 175041 -81207 -81044 -87959 110688 -338175 -179316
17593 -179316 119066 151149 380666 35752 -5914 18975 184613 51155 -297209 189924 -58555
17581 110970 -402427 382990 156279 -121794 124418 -243717 -45509 -215496 -16868 81525
17570 -1455 -82253 109913 464780 187152 206641 -108872 152754 150226 -192351 -363012 -162237
17558 279036 -303074 27040 38458 237755 127834 133333 59979 19133 253233 245283 -153191
17546 155121 -290561 104340 48990 406570 22784 201779 -453 2268 44143 138215 43602
$$ packed form
17627A00471C5208a34178j0091a3062E1603J43609c06645B5141a19924D14062
17616A22053A7772K30854f5808G0516K0771C3326e2318q5017I2195L0834a30432
17604H4758b88831a04280d7092I8027P7014h1207J63o915A10688c38175J58859
17593a79316A19066L2083K29517C5752e914A8975J65638E1155b97209A89924e8555
17581A10970d02427C82990A56279a21794A24418b43717d5509j69987a6868H1525
17570a455q0798A09913L54867A87152J9489a08872A52754k528a92351j70661a62237
17558B79036c03074B7040J1418J99297j09921N499E9979A9133K34100p950a53191
17546A55121b90561A04340D8990L57580B2784J78995d53B268M1875R4072D3602
$$ plain form
17534 82758 209114 -12528 16622 -184286 56121 207878 -13269 -12714 123296 166695 89965
17523 89965 144356 312894 -138193 -59119 190889 -60188 45408 204193 187565 80275 136607
17512 136607 77235 233389 137159 -88990 193291 411127 -22481 64716 72009 -36076 -103297
17501 -103297 108734 246160 -229808 385690 -157209 204895 -125371 220077 321857 47113
17490 -85839 217727 232070 93358 1008 111911 306936 41842 64732 -25376 250018 60084
17478 140861 78498 134153 -67819 146907 153726 304207 -51962 117393 393647 254672 316467
17467 316467 327745 229529 124465 -60256 -175232 147582 50823 -54135 381381 108834
17456 -89488 563134 293207 242776 179190 92800 -109916 381779 374686 556306 575739 351328
$$ packed form
17534H2758J26356a2528A6622a84286E6121J51757a3269N55A23296M3399p6730
17523H9965N4391J68538a38193e9119A90889f0188D5408J58785j6628H0275N6332
17512A36607n9372J56154r6230h8990A93291K17836b2481F4716P293c6076o7221
17501a03297A08734J37426b29808C85690a57209B04895a25371B20077J01780D7113
17490h5839B17727J4343I3358A008J10903J95025D1842K2890b5376B50018F0084
17478A40861o2363N5655f7819A46907O819J50481e1962A17393K76254j38975O1795
17467C16467J1278r8216j05064f0256j14976A47582E0823e4135C81381A08834
17456h9488E63134k69927n0431o3586q6390a09916C81779p093J81620J9433k24411
$$ plain form
17445 351328 283704 222665 343056 321611 182727 -66004 460675 146563 547691 468274
17435 468274 283615 -128862 72698 302530 427670 95962 140494 -38768 7788 96308 97888
17424 97888 10547 422183 346299 3338 171568 128108 161390 541038 256377 70586 210349
17413 210349 164798 -10445 165131 381276 178759 83140 100645 190780 7190 119934 196393
17402 196393 90485 277127 265156 260060 -38036 244470 -253892 218475 101498 14564 -49058
17390 253215 76287 -59877 501498 137799 186830 249536 182302 -44147 348397 286314 69458
17378 -61151 278191 -62108 136277 -319983 225355 47207 126140 184093 402493 -116557
17367 256095 358881 38538 206017 235553 30391 -31754 164965 185663 163423 -34170 135467
$$ packed form
17445C51328o7624o1039J20391k1445j38884f6004D60675A46563M01128p9417
17435D68274j84659a28862G2698K29832J25140I5962M4532c8768G788Q8520J580
17424I7888A0547M11636p5884C338J68230m3460L3282L79648B56377G0586J39763
17413B10349m5551a0445A65131K16145A78759H3140J7505R0135G190J12744P6459
17402A96393I0485J86642j1971n096c8036B44470b53892B18475A01498A4564d9058
17390B53215G6287e9877E01498A37799M9031O2706o7234d4147C48397o2083F9458
17378f1151B78191f2108A36277c19983B25355D7207P8933N7953K18400a16557
17367B56095J02786C8538J67479K9536C0391c1754A64965K0698k2240c4170A35467
$$ plain form
17355 29983 5601 144880 530838 68914 25584 199933 420041 51761 -58831 284393 -216779
17343 331833 134315 277073 49475 -34178 101592 74298 -9135 -44073 229890 314620 471329
17332 471329 -172733 113016 102415 98581 146076 247301 28776 240861 -55621 105368 200943
17321 200943 174071 -5612 -88031 -73099 195935 -171301 185061 219058 157243 416169 261565
17310 261565 252863 49144 -41660 223437 107406 117520 31296 120457 201230 -49716 -84038
17299 -84038 221648 357662 59632 174735 107512 -2667 139074 442740 135242 412416
17289 412416 324595 195170 293696 358780 240786 142018 26055 210314 518658 316472
17279 316472 353245 -82297 109311 205278 435600 225232 362876 81989 108055 100542 26992
$$ packed form
17355B9983E601J39279L85958F8914B5584J74349K20108E1761e8831B84393b16779
17343C31833A34315J42758D9475c4178A01592k7294i135l4938B29890Q4730J56709
17332D71329a72733A13016j0601l834M7495J01225B8776K12085e5621A05368R5575
17321B00943k6872e612q2419J4932A95935a71301A85061L3997o1815K58926j54604
17310B61565q702D9144d1660B23437A07406J0114C1296Q9161Q0773d9716l4322
17299h4038B21648J36014E9632J15103o7223b667A39074L03666A35242K77174
17289D12416q7821j29425R8526O5084j17994r8768B6055J84259L08344k02186
17279C16472L6773h2297A09311R5967K30322k10368J37644H1989K6066p513B6992
$$ plain form
17267 253004 -29660 226156 501959 -115512 -201247 84996 -90132 325231 70759 189466
17257 189466 559894 95233 589828 137057 260812 395276 216310 137570 483431 -25774
17246 152097 68401 368995 243193 9809 -57498 -112444 265358 -3576 194949 217631 176910
17235 176910 112844 -233021 -103815 236570 379518 387234 300016 -136214 185091 117512
17225 117512 148244 209679 -453507 328019 641911 209988 105569 -15213 170766 -28828
17214 208294 209414 243296 -14641 215819 125654 113026 256474 307616 220010 63267 90219
17203 90219 214620 475762 467470 291223 295887 515029 343343 278669 34176 457091 344002
17192 344002 436181 316315 302093 594068 226455 150611 -55451 188261 -14528 270445
$$ packed form
17267B53004b9660B26156K75803a15512q5735H4996i0132C25231G0759J18707
17257A89466L70428I5233M94595A37057J23755J34464j78966p8740L45861b5774
17246A52097F8401L00594j25802I809e7498n4946B65358c576A94949K2682m0721
17235A76910o4066b33021a03815B36570J42948P716q7218a36214A85091o7579
17225A17512L0732O1435d53507C28019L13892B09988j04419a5213A70766b8828
17214B08294J120L3882a4641B15819r0165j2628J43448N1142q7606F3267K6952
17203I0219J24401K61142q292j76247M664K19142j71686o4674C4176M22915j13089
17192C44002R2179j19866j4222K91975B26455p5844e5451A88261a4528B70445
$$ plain form
17181 -2447 24802 81152 217500 114301 -50184 468899 466826 454628 237291 359792 326463
17170 326463 205871 474738 309245 201973 256161 448715 247251 52223 360799 53221
17159 402482 202154 248998 350316 366777 192074 473362 449127 231201 439088 478659
17149 478659 562804 476947 574628 586858 390817 445017 358599 353385 149025 441757 597197
17138 597197 469886 270246 419966 146785 390530 534969 327710 355684 408327 368114
17128 368114 453975 333817 448410 357638 338357 588145 454261 309361 576845 185047
17117 366721 599649 331707 92295 28777 180620 142211 181295 394566 425765 485069 115317
17105 547115 368356 437886 410184 619307 545554 107054 433881 516554 468917 480151 504473
$$ packed form
17181b447B4802N6350J36348j03199e0184D68899k073j2198k17337J22501l3329
17170C26463j20592K68867j65493j07272N4188J92554k01464E2223L08576E3221
17159D02482k00328M6844J01318J6461j74703K81288k4235k17926K07887L9571
17149D78659Q4145q5857R7681J2230j96041N4200q6418n214A49025K92732J55440
17138E97197j27311j99640J49720A46785K43745J44439k07259K7974N2643m0213
17128C68114Q5861j20158J14593r0772j9281K49788j33884j44900K67484A85047
17117C66721K32928k67942I2295B8777J51843l8409L9084K13271L1199N9304A15317
17105E47115j78759O9530k7702K09123p3753A07054L26827Q2673m7637J1234K4322
$$ plain form
17094 504473 496531 353347 224773 262606 317334 291159 755174 140387 708846 480464
17084 480464 71956 588110 467578 284000 643320 382759 331487 723135 769451 563557
17074 563557 387939 431907 287347 522929 1021881 308146 747345 477953 528791 515674
17064 515674 490152 588011 425522 379151 506791 591716 550476 334224 538495 651452
17054 651452 500080 722366 274347 191028 492710 498857 525097 605421 156886 559731
17044 559731 74780 851333 822299 866813 622020 536449 870842 829226 915748 388883 841077
17033 841077 381415 682424 816002 664236 807043 511669 797455 575641 533145 536040
17023 536040 560517 453837 369371 438831 420703 519109 504083 644419 626822 1057455 896930
$$ packed form
17094E04473p942j43184j28574L7833N4728k6175M64015A40387N68459k28382
17084D80464G1956N16154j20532j83578L59320k60561n1272L91648M6316k05894
17074E63557j75618M3968j44560K35582M98952C08146M39199k69392N0838j3117
17064E15674k5522R7859j62489m6371J27640Q4925m1240k16252K04271J12957
17054F51452j51372K22286B74347q3319L01682O147K6240Q0324A56886M02845
17044E59731G4780P76553k9034M4514k44793q5571L34393m1616Q6522C88883M52194
17033H41077C81415L01009J33578j51766J42807k95374K85786k21814m2496K895
17023E36040K4477j06680q4466O9460j8128R8406j5026J40336j7597M30633j60525
$$ plain form
17012 896930 625434 949431 770199 735104 935333 759553 622014 963768 469744 775891
17002 775891 764945 591425 623327 762437 727938 837703 506139 741795 779683 924145
16992 924145 676753 687743 916662 926788 718198 834768 902364 667171 1052331 796493
16982 796493 717117 553218 969531 949187 830915 857417 795749 893785 1083837 999371 994105
16971 994105 1087821 682309 813254 1405311 787209 964722 855882 925217 951416 973550
16961 973550 1122859 1133635 916323 1068543 1035841 930630 851378 1130189 1210188 1091257
16951 1091257 1249895 1319330 962446 1051009 1046619 1272301 1039025 964172 1181013 958937
16941 958937 1377786 1024778 1200387 1346580 1126349 1326775 1166307 1236994 1496687 1311108
$$ packed form
17012H96930k71496L23997j79232l5095K00229j75780j37539L41754D69744L06147
17002G75891j0946j73520L1902J39110l4499J09765l31564K35656L7888J44462
16992I24145k47392J0990K28919J0126k08590J16570O7596k35193L85160k55838
16982G96493p9376j63899M16313k0344j18272K6502o1668R8036J90052q4466n266
16971I94105R3716m05512J30945N92057o18102J77513j08840O9335K6199K2134
16961I73550J49309J0776k17312J52220l2702j05211p9252K78811P9999j18931
16951A091257J58638O9435l56884Q8563m390K25682k33276p4853K16841k22076
16941I58937M18849l53008J75609J46193k20231K00426j60468P0687K59693j85579
$$ plain form
16931 1311108 978341 992006 1186372 1633521 1260029 1077924 1523234 1412313 1232530 1615629
16921 1615629 1288147 1383431 1473149 1455401 1449242 1413618 1520844 1218041 1783998 1497051
16911 1497051 1802935 1665461 1729745 1323923 1420928 1563655 1965473 1548283 1683069 1698755
16901 1698755 1647617 1648363 1879317 1781908 1836299 1698199 1869082 1855469 1977200 2102581 1963178
16890 1963178 2182525 1979647 1899335 1792260 2263070 2144983 2188801 1939126 2132212 2217761
16880 2217761 1858399 2148114 1974995 2359654 2070791 2497553 2112788 2744150 2053042
16871 2053042 2320636 2447306 2644639 2502538 2537744 2222971 2624750 2715306 2629860 2952352
16861 2952352 2672425 2683255 2954743 2874905 3015504 2982325 3360585 3065546 2820324 3206806
$$ packed form
16931A311108l32767J3665J94366M47149l73492j82105M45310j10921j79783L83099
16921A615629l27482R5284Q9718j7748o159l5624J07226l02803N65957k86947
16911A497051L05884j37474O4284m05822R7005J42727M01818m17190J34786J5686
16901A698755n1138P46K30954r7409N4391j38100J70883j3613J21731J25381j39403
16890A963178K19347k02878q0312j07075M70810j18087M3818k49675J93086Q5549
16880B217761l59362K89715j73119L84659k88863M26762l84765O31362o91108
16871B053042K67594J26670J97333j42101L5206l14773M01779R0556q5446L22492
16861B952352k79927J0830K71488p9838J40599l3179L78260k95039k45222L86482
$$ plain form
16851 3206806 3274648 3271759 3278098 3027371 3506349 3102549 3291444 3514888 3764857 3898112
16841 3898112 3793276 3661406 3562490 3993070 3967105 3913799 4048404 4270620 4066869 4111891
16831 4111891 4332494 4533900 4493943 4529846 4541232 4625805 5091011 4940937 4876797 5135809
16821 5135809 5350804 5176628 5256525 5367724 5912677 5772804 5703420 5872789 5768073 5921817
16811 5921817 5995111 6026897 6310151 6257961 6864387 7043520 6798340 7075137 7424661 7155668
16801 7155668 7438065 7848216 8137113 7955030 8177469 8581193 8341163 9136896 9091277 9380800
16791 9380800 9346376 9928769 10300566 10344370 10743212 10561795 11107050 11332021 11778173 12072756
16781 12072756 12256542 12635261 12547687 13293416 13779013 14152709 14428645 14933156 15419939
$$ packed form
16851C206806O7842k889O339k50727M78978m03800J88895K23444K49969J33255
16841C898112j04836j31870r8916M30580k5965n3306J34605K22216k03751M5022
16831D111891K20603K01406l9957L5903J1386Q4573M65206j50074o4140K59012
16821E135809K14995j74176P9897J11199N44953j39873o9384J69369j04716J53744
16811E921817P3294L1786K83254n2190O06426J79133k45180K76797L49524k68993
16801G155668K82397M10151K88897j82083K22439M03724k40030P95733m5619K89523
16791I380800l4424N82393L71797M3804L98842j81417N45255K24971M46152K94583
16781A2072756J83786L78719q7574P45729M85597L73696K75936N04511M86783
$$ plain form
16772 15419939 16042804 16732715 16966891 18065739 18379747 18677987 19700131 20142973 21009356
16763 21009356 21517254 22356681 23390000 24209863 24851435 26195062 27006250 28248276 29381976
16754 29381976 30475559 31889527 33211460 34529651 36268816 38173631 39641543 41451367
16746 41451367 43374007 45677961 47937445 50542370 52820211 55534897 58414406 61486559
16738 61486559 64735240 68461067 72012057 76100790 79999362 84791378 89148948 94187372
16730 94187372 98990002 104812922 110104603 115803241 121157304 127338636 132612761 138533789
16722 138533789 143726917 148611196 153295203 157425904 160587499 162405612 163898623 164577981
16714 164577981 164080094 162922999 160759489 157551585 153650982 148920544 143933146 138507391
$$ packed form
16772A5419939O22865O89911K34176J098848L14008K98240J022144M42842Q66383
16763B1009356N07898Q39427J033319Q19863O41572J343627Q11188J242026J133700
16754B9381976J093583J413968J321933J318191J739165J904815J467912J809824
16746D1451367J922640K303954K259484K604925K277841K714686K879509L072153
16738F1486559L248681L725827L550990M088733L898572M792016M357570N038424
16730I4187372M802630N822920N291681N698638N354063O181332N274125N921028
16722A38533789N193128M884279M684007M130701L161595J818113J493011O79358
16714A64577981m97887j157095k163510l207904l900603m730438m987398n425755
$$ plain form
16706 138507391 133224445 126812095 120975331 114897958 109336623 103692062 97872361 92869383
16698 92869383 87602622 82829239 78556852 74188841 69709727 66109427 62201369 59352167
16690 59352167 56331543 53041787 50235163 47634832 45069717 42956760 40774219 39237068
16682 39237068 37356962 35649182 33940659 32428189 30828857 29972448 27952983 26829244
16674 26829244 25900795 24950740 23656109 23199936 22181349 21150740 20422127 19534774 18789673
16665 18789673 17968898 17207323 17018292 16361559 15714133 15151252 14765908 14088922 13590287
16656 13590287 13720082 12930692 12381444 12086608 11776657 11414868 11023883 10639994 10149754
16647 10149754 10177031 9744339 9629157 9105661 9096633 9012946 8342337 8465170 8296899 7916593
$$ packed form
16706A38507391n282946o412350n836764o077373n561335n644561n819701n002978
16698I2869383n266761m773383m272387m368011m479114l600300l908058k849202
16690E9352167l020624l289756k806624k600331k565115k112957k182541j537151
16682C9237068j880106j707780j708523j512470j599332q56409k019465j123739
16674B6829244r28449r50055j294631m56173j018587j030609p28613q87353p45101
16665A8789673q20775p61575j89031o56733o47426n62881l85344o76986m98635
16656A3590287J29795p89390n49248k94836l09951l61789l90985l83889m90240
16647A0149754K7277m32692j15182n23496r028q3687o70609J22833j68271l80306
$$ plain form
16637 7916593 7973272 7625929 7304550 7196926 7064231 6949405 6569645 6482401 6578587 6079526
16627 6079526 6042361 5776644 5553714 5686061 5382818 5405849 5202375 5122301 4972066 4765900
16617 4765900 4710577 4952011 4620241 4221869 4513799 4528301 4465853 3901054 4344806 4192105
16607 4192105 3932475 4151049 4084258 3659292 3679931 3544465 3638568 3785493 3449510 3342966
16597 3342966 3163849 3157136 3048839 2781590 3045078 3114837 2985572 2894358 2934095 2861664
16587 2861664 2492149 2562065 2667912 2775280 2665442 2606432 2310081 2436757 2243768 2030007
16577 2030007 2187665 2160681 2510491 2026667 2405464 2022826 2015470 1991878 2078228 2162732
16567 2162732 1715351 1875952 2287867 1780518 1913648 1698072 1848373 1848980 1883160 1475690
$$ packed form
16637G916593N6679l47343l21379j07624j32695j14826l79760q7244R6186m99061
16627F079526l7165k65717k22930J32347l03243K3031k03474q0074j50235k06166
16617D765900n5323K41434l31770l98372K91930J4502o2448n64799M43752j52701
16607D192105k59630K18574o6791m24966K0639j35466R4103J46925l35983j06544
16597C342966j79117o713j08297k67249K63488O9759j29265r1214L9737p2431
16587B861664l69515O9916J05847J07368j09838n9010k96351J26676j92989k13761
16577B030007J57658k6984L49810m83824L78797l82638p356k3592Q6350Q4504
16567B162732m47381J60601M11915n07349J33130k15576J50301O07L4180m07470
$$ plain form
16557 1475690 1875624 1763349 1903245 1512128 1370574 1870738 1816288 1608359 1536982 1745541
16547 1745541 1476104 1219609 1413955 1544054 1436098 1363729 1354445 1591742 1329829 1559427
16537 1559427 1727949 1223151 1267645 1350015 1334301 1487369 1291556 1143017 1396024 1295426
16527 1295426 1224650 904752 1241695 974771 1098180 1220238 965163 1024739 1103258 1174173
16517 1174173 1052792 1294142 1118408 1163837 933993 1110693 920233 814757 1036324 915153
16507 915153 790964 675877 716011 828638 1070189 741023 790152 691337 832284 538411
16497 538411 944056 1070556 925349 680257 640665 852642 573345 624003 527985 850542
16487 850542 660557 671501 473474 647304 479552 556814 985905 360360 635818 696300
$$ packed form
16557A475690L99934j12275J39896l91117j41554N00164n4450k07929p1377K08559
16547A745541k69437k56495J94346J30099j07956p2369r284K37297k61913K29598
16537A559427J68522n04798M4494Q2370j5714J53068j95813j48539K53007j00598
16527A295426p0776l19898L36943k66924J23409J22058k55075N9576P8519P0915
16517A174173j21381K41350j75734M5429k29844J76700j90460j05476K21567j21171
16507I15153j24189j15087M0134J12627K41551l29166M9129r8815J40947k93873
16497E38411M05645J26500j45207k45092l9592K11977k79297N0658r6018L22557
16487H50542j89985J0944j98027J73830j67752P7262M29091C60360K75458O0482
$$ plain form
16477 696300 774895 523967 637887 451033 927439 687174 278764 654609 463269 769850
16467 769850 533389 208378 613730 497278 659572 407949 538693 316825 433098 266861
16457 266861 348659 284105 764470 661598 622181 576763 151373 355690 400862 73325 743456
16446 743456 788605 656759 185299 580971 451765 641658 37056 323724 503021 524758
16436 524758 470889 487965 296864 453171 342222 651779 429200 636503 691260 734410
16426 734410 434748 562587 425265 395583 486096 268233 303943 240629 450677 -21142
16415 584388 321179 440437 411600 401305 281807 313584 459523 229392 302536 352241
16405 352241 327294 157885 604864 149039 142410 318526 462437 134702 287107 378930
$$ packed form
16477F96300P8595k50928J13920j86854M76406k40265B78764L75845j91340L06581
16467G69850k36461B08378M05352j16452J62294k51623J30744k21868J16273j66237
16457B66861Q1798o4554M80365j02872l9417m5418A51373K04317M5172G3325O70131
16446G43456M5149j31846A85299L95672j29206J89893C7056K86668J79297K1737
16436E24758n3869J7076j91101J56307j10949L09557k22579K07303N4757M3150
16426G34410k99662J27839j37322k9682R0513k17863L5710o3314K10048b1142
16415E84388k63209J19258k8837j0295j19498L1777J45939B29392P3144M9705
16405C52241k4947A57885M46979A49039o629J76116J43911A34702J52405R1823
$$ plain form
16395 378930 160069 259286 199944 289150 294034 414032 331761 219328 125057 183896 390168
16384 390168 -98449 220318 -10027 197321 368796 371016 237587 382504 3475 270307 -7525
16372 216548 407415 506428 86775 169478 257660 268626 123148 -44453 285473 335212 553615
16361 553615 358421 261445 -74941 -63332 341807 102455 251369 -138969 -74630 -8356 324851
16349 190858 257301 234060 408654 115413 234829 327434 92023 79663 321705 128263
16338 441847 39290 175696 107053 382174 -9334 175504 134128 151864 204833 66577 310205
16327 310205 413314 192875 204571 217949 -4671 196219 82783 651397 359616 280460 227859
16316 227859 -351166 -32539 231487 -41214 444903 340121 49881 -33118 105347 461804
$$ packed form
16395C78930A60069R9217n9342Q9206M884J19998q2271j12433r4271N8839K06272
16384C90168i8449B20318a0027A97321J71475K220j33429J44917C475K66832g525
16372B16548J90867R9013H6775Q2703Q8182J0966A23148d4453B85473M9739K18403
16361E53615j95194r6976g4941J1609C41807A02455J48914a38969O4339h356C24851
16349A90858O6443k3241J74594A15413J19416R2605I2023j2360K42042A28263
16338D41847C9290J36406o8643K75121i334A75504m1376J7736N2969F6577K43628
16327C10205J03109A92875J1696J3378d671A96219H2783N68614k91781p9156n2601
16316B27859c51166c2539B31487d1214D44903j04782D9881c3118A05347L56457
$$ plain form
16306 461804 34505 195000 -17705 -124410 52574 -7253 169380 206633 371750 242329 88959
16294 -5306 152759 108141 44711 211823 214544 33164 -132708 139669 -154790 104719 -328610
16282 29655 605837 163876 -86024 145683 141189 143897 474783 -122659 -201971 299434 129721
16270 179882 328823 141406 4314 -61528 -107682 205354 333992 -25053 71541 208163 -101680
16258 -104693 51546 -204897 282195 -99239 81832 128300 23178 115466 44310 99933 258436
16247 258436 -172517 147340 -161875 18019 -155549 -19818 -68686 -31890 -158930 188671
16236 60546 132971 81651 205459 -363005 272587 -154227 11912 440468 -35414 -83977 169880
16224 84116 156480 375473 -199373 35975 299839 238773 -247852 -81912 36187 -1089 99142
$$ packed form
16306D61804C4505J60495a7705j06705E2574g253A69380L7253J65117j29421H8959
16294e306A52759m4618D4711J67112K721C3164a32708A39669a54790A04719c28610
16282B9655N76182A63876h6024A45683m494K708L30886a22659p9312B99434A29721
16270A79882J48941A41406D314f1528m6154B05354J28638b5053G1541J36622a01680
16258a04693E1546b04897B82195i9239H1832M6468B3178R2288D4310N5623J58503
16247B58436a72517A47340a61875A8019a55549a9818m8868c1890j27040A88671
16236F0546P2425n1320J23808c63005B72587a54227A1912M28556c5414m8563A69880
16224H4116P2364K18993a99373C5975K63864o1066b47852h1912C6187a089I9142
$$ plain form
16212 -106980 -63099 -284060 281465 45118 -117884 -50539 -78587 198462 236093 87159 -16876
16200 319356 130944 -121259 71846 274541 -92879 413015 82048 170865 163607 100033 -300139
16188 335991 152117 13438 45874 -97263 -62054 -126771 -114036 286721 64008 -101985 143686
16176 -8154 -6280 -69782 190967 289405 137944 -238953 -105844 -200395 27473 -50694 -49806 -32655
16164 -32655 -95078 34545 75220 -76002 96010 96630 65258 286169 213292 161181 335796 81305
16151 -42515 -181642 -82616 59988 -101123 -241839 102587 215235 98466 -214086 236809
16140 -78002 -89731 -17535 -511 -24228 -243993 -161139 216693 -33809 165544 37770 -356791
16128 155608 177811 -31020 -211564 99101 -263478 278990 72948 -319406 -97274 -314095
$$ packed form
16212a06980M3881k20961B81465D5118a17884e0539k8048A98462L7631H7159a6876
16200C19356A30944a21259G1846K02695i2879D13015H2048Q8817p258o3574c00139
16188C35991A52117A3438L2436i7263L5209o4717J2735B86721F4008a01985A43686
16176h154J874o3502A90967R8438A37944b38953a05844r4551B7473e0694Q88J7151
16164c2655o2423C4545M0675g6002I6010O20l1372K20911p2877n2111J74615H1305
16151d2515j39127h2616E9988a01123j40716A02587J12648I8466b14086B36809
16140g8002j1729a7535e11k3717k19765Q2854B16693c3809A65544C7770c56791
16128A55608K2203c1020j80544I9101b63478B78990G2948c19406i7274k16821
$$ plain form
16118 -314095 -220755 257595 -83491 -378218 188592 152744 -97514 -78757 -128402 222630 117629
16107 117629 -14861 124118 180615 249907 -137532 210522 -62071 249992 -89336 175846
16096 -48758 18000 -85663 -52684 -94872 -32952 171346 -117759 -122701 230462 -332668 -269035
16085 -269035 -176591 170203 -213670 -106650 258075 92821 62616 166802 119230 196238
16075 196238 -20760 -67885 -56164 100972 33920 -53781 -235941 -90533 192908 -114836 -82535
16064 -82535 -228248 -301973 -247025 -297128 29044 37058 -74351 -248323 -413128 9690 -66778
16052 392224 -191165 238595 27819 -389755 215164 -332 -295444 -55133 -207083 125211
16041 4887 -49300 -3430 -121633 -178694 -31832 68748 19510 -292844 129337 266497 -326905
$$ packed form
16118c14095R3340B57595h3491k94727A88592l5848i7514J8757m9645B22630j05001
16107A17629a4861A24118N6497O9292a37532B10522f2071B49992h9336A75846
16096d8758A8000h5663L2979m2188c2952A71346a17759m942B30462c32668O3633
16085b69035R2444A70203b13670a06650B58075I2821l0205J04186m7572P7008
16075A96238b0760m7125J1721A00972C3920e3781j82160i0533A92908a14836L2301
16064h2535j45713p3725N4948n0103B9044Q014g4351j73972j64805I690f6778
16052C92224a91165B38595B7819c89755B15164c32k95112e5133j51950A25211
16041D887d9300c430j18203n7061c1832F8748A9510b92844A29337J37160c26905
$$ plain form
16029 -335738 98555 163717 113882 364491 96261 -226469 67691 218219 139318 114065 -108775
16017 -84038 241515 -187898 132696 -33769 22079 31942 166139 -177213 -67485 -155808 -122566
16006 -122566 -133209 172642 -49452 33530 -223770 -239596 -166139 -49878 -459503 -1020 -2175
15995 -2175 110115 -322595 117646 -49001 -106438 8024 -102161 -133424 -119569 89740 243871
15984 243871 339303 357327 412274 199621 277332 355083 312193 -507572 20479 107922 -77263
15972 -190482 -296970 22185 -186276 -22186 -216354 -183585 107960 162380 -40025 -310684
15962 -310684 165373 -177933 221770 -109271 176148 113402 235283 -329284 -186723 1237
15951 134247 -35328 39721 1925 126989 19961 -257341 44171 -84771 -123618 1336 -36326
$$ packed form
16029c35738I8555O5162m9835K50609I6261b26469F7691J50528p8901k5253a08775
16017h4038B41515a87898A32696c3769B2079R863J34197a77213f7485q8323L3242
16006a22566j0643A72642d9452C3530b23770j5826P3457d9878m09625a020j155
15995b175A10115c22595A17646d9001n7437H024a02161l1263J3855H9740J54131
15984B43871R5432J8024N4947A99621P7711P7751m2890e07572B0479Q7443g7263
15972a90482j06488B2185a86276b2186j94168L2769A07960N4420d0025k70659
15962c10684A65373a77933B21770a09271A76148o2746J21881c29284J42561A237
15951A34247c5328C9721A925J25064A9961b57341D4171h4771l8847A336c6326
$$ plain form
15939 -155446 504526 160378 93163 166862 139523 95822 76634 -237426 143521 60066 95893
15928 95893 -212071 149705 -195357 -310235 -342721 159763 128633 -28773 98266 203707
15918 203707 10593 284504 163687 -275687 -162913 26834 52498 -82576 -92130 -239481 58531
15906 -206099 -204381 -325705 -129214 -104600 -118523 190482 254956 147157 64782 38197 -52404
15894 29213 -244538 -179443 -100445 99051 97461 -184123 -115117 -120192 104826 -225005 150127
15882 88728 -9211 -67514 13018 -127641 76576 -131827 -112879 -57451 514873 -136224 -220182
15871 -220182 118070 323784 77891 -253111 456195 30064 -143655 57637 79205 -252631
15860 249241 -406409 35684 -10813 -20333 169452 44681 -384601 -83439 113669 145312 -152398
$$ packed form
15939a55446E04526A60378o7215P3699k7339m3701j9188b37426A43521F0066L5827
15928I5893b12071A49705a95357j14878l2486A59763l1130b8773I8266J05441
15918B03707A0593K73911j20817b75687J12774B6834K5664h2576r554j47351E8531
15906b06099J718j21324a29214K4614j3923A90482O4474j07799F4782k6585e2404
15894B9213b44538O5095P8998I9051j590a84123O9006n075A04826b25005A50127
15882H8728i211n8303A3018a27641G6576a31827J8948N5428E14873a36224q3958
15871b20182A18070K05714G7891b53111D56195C0064a43655E7637K1568b52631
15860B49241d06409C5684a0813r520A69452D4681c84601h3439A13669L1643a52398
$$ plain form
15848 -55649 -329526 -92391 -147881 -93707 -187515 -182382 157406 -122250 67574 116646 -93557
15836 406032 168337 126996 224490 -228335 -97000 27053 29298 3887 125224 331650 -65948
15824 -128659 -65119 57074 -218222 -80264 1414 -39653 237016 -41637 -197224 181801 -110173
15812 -83251 85693 112210 -159458 238050 -37562 56233 162779 -61243 254619 -102774 -81171
15801 -81171 -241357 237654 87064 77601 -55416 144291 -54925 -37401 -162412 -10614 -102964
15790 -102964 149989 -151499 -191792 -62 -123305 -96281 -288840 432981 -72341 43002 -233589
15778 -244380 -339843 -314385 -418210 322416 100124 141914 -267856 -82910 -528259 -11944
15767 75471 104744 92368 21318 176077 -159663 378015 226471 -24139 -214177 -127728 -75444
$$ packed form
15848e5649k73877i2391n5490N4174r3808N133A57406a22250F7574M9072i3557
15836D06032A68337m1341R7494b28335i7000B7053K245C887J21337K06426f5948
15824a28659O3540E7074b18222h0264A414c9653B37016d1637j55587A81801a10173
15812h3251H5693K6517a59458B38050c7562E6233J06546f1243B54619a02774K1603
15801h1171j60186B37654H7064r463e5416A44291e4925J7524j25011a0614r2350
15790a02964A49989a51499m0293f2j23243K7024j92559D32981g2341D3002b33589
15778b44380r5463K5458j03825C22416A00124M1790b67856h2910m45349a1944
15767G5471K9273j2376B1318J54759a59663C78015j51544b4139j90038Q6449N2284
$$ plain form
15756 -75444 -103499 192985 -140121 -126714 162270 135210 -17700 -165184 142530 -214311
15745 -42553 288928 -214352 49179 13517 -4390 91501 -152215 -321447 75027 -143071 41047
15733 -39277 -371386 296230 -18684 -77249 150247 -134175 29719 -35311 -194391 214583
15722 -148060 -65166 -302252 6297 -133334 -274720 -146356 260082 -144621 -191198 -150797
15712 -150797 -12875 -29246 239816 -144760 302214 347618 29116 -221459 261603 38373
15701 -196991 -78121 -411703 -187731 -81665 -33371 29626 -252367 -71408 303410 104938
15690 123509 -39508 325145 -136023 133836 -117199 -320945 58825 -66545 111494 23019
15679 17134 -75409 -32203 236982 302138 -436132 75168 282956 -119202 -25735 81081 355683
$$ packed form
15756g5444k8055A92985a40121J3407A62270k7060a7700j47484A42530b14311
15745d2553B88928b14352D9179A3517d390I1501a52215j69232G5027a43071D1047
15733c9277l32109B96230a8684n8565A50247a34175B9719c5311j59080B14583
15722a48060f5166k37086F297a33334j41386J28364B60082a44621m6577M0401
15712a50797a2875j6371B39816a44760C02214M5404B9116b21459B61603C8373
15701a96991g8121l33582a87731h1665c3371B9626b52367g1408C03410A04938
15690A23509c9508C25145a36023A33836a17199k03746E8825f6545A11494B3019
15679A7134g5409c2203B36982O5156d36132G5168K07788a19202b5735H1081K74602
$$ plain form
15668 355683 -209627 112655 -32014 -1894 -244793 55523 -19505 -108622 -232945 -10895 -239103
15657 -239103 93915 -77769 -363553 -124080 123953 -60789 144441 -22153 -153218 160197
15646 -358733 -59592 154018 109456 290388 83488 89853 183448 149653 338451 -157227 -235155
15635 -235155 67779 -39290 -105774 222833 137933 -30509 -19564 -218100 -117766 -206154 -227682
15624 -227682 -342460 309888 -167301 4487 -171624 -288385 -151660 -192606 -167981 8683 -310354
15612 68762 66917 -427774 -197333 -28878 -35299 234122 -63863 150432 -154174 -221566 138687
15600 -40035 -142326 -314606 -53682 -223657 -113993 -306747 191399 -76675 280714 79006
15589 -118210 153470 -129084 169955 -91963 415470 335944 128825 193617 -172659 145534
$$ packed form
15668C55683b09627A12655c2014a894k42899E5523a9505q9117j24323a0895k28208
15657b39103I3915g7769k85784a24080A23953f0789A44441b2153j31065A60197
15646c58733e9592A54018m4562J80932H3488O365R3595l3795J88798a57227p7928
15635b35155F7779c9290o6484B22833q4900c0509J0945j98536J00334q8388k1528
15624b27682j14778C09888a67301D487a71624j16761J36725m0946K4625H683c10354
15612F8762j845d27774a97333b8878o421B34122f3863A50432a54174o7392A38687
15600d0035j02291j72280e3682j69975J09664j92754A91399g6675B80714G9006
15589a18210A53470a29084A69955i1963D15470p9526A28825O4792a72659A45534
$$ plain form
15578 -145976 -19045 -266864 172747 -235078 -164170 87119 -178286 -398667 238892 175973
15568 175973 56989 -171638 133412 -228533 -296239 228833 7318 278205 39211 82250 49860
15557 49860 -13357 -22237 151478 20247 81349 193157 -132147 105788 141670 -109254 -81576
15546 -81576 -104895 207684 96252 246384 30421 183040 -30105 -49311 -147183 105610 123032
15535 123032 125812 167021 -203567 43930 47514 -117694 29653 -8668 -362162 313684 -63613
15523 114016 196590 16471 97464 47251 42984 -81730 386448 -29877 -1764 -4951 -155505 -353056
15511 -353056 -267116 -13979 77549 159835 -173096 -20988 -32568 -92279 -170416 -165568 -121111
15500 -121111 51573 -84237 54004 22408 115962 -114850 -176637 -335429 -27382 219795 12843
$$ packed form
15578a45976a9045k47819A72747b35078P0908H7119a78286k20381B38892o2919
15568A75973E6989a71638A33412b28533o7706B28833G318K70887C9211M3039l2390
15557D9860a3357q880A51478B0247O1102J11808a32147A05788L5882a09254K7678
15546h1576k3319B07684I6252J50132C0421J52619c0105j9206r7872A05610J7422
15535A23032K780M1209b03567D3930L584a17694B9653h668l53494C13684f3613
15523A14016Q2574A6471Q0993D7251m267h1730C86448b9877a764l187j50554j97551
15511c53056Q5940a3979G7549Q2286a73096b0988j1580n9711p8137M848M4457
15500a21111E1573h4237E4004B2408R3554a14850o1787j58792b7382B19795A2843
$$ plain form
15488 -412441 341836 -435560 -411624 -212782 39687 46872 51343 295424 -213529 135549 -233582
15476 -256710 -146953 -47225 -47839 23883 75101 147908 -41853 -273875 -8827 -15357 63331 530
15463 -86019 221012 148286 -75616 28880 -137836 144825 227646 175155 201298 -133937 47907
15451 -6404 13529 157208 -81208 81961 -53426 -209349 -171343 23590 -97309 192240 -1587
15439 71641 -262686 173024 -142420 -289986 -76421 -96843 -213865 156230 -13289 -32230
15429 -32230 89936 104191 75156 -13350 50279 -114808 -105557 -27623 -33327 174522 -38422 9842
15416 337253 216829 -40088 -46226 14682 163707 51949 217915 154861 -2907 -152910 -170333
15405 -170333 -66850 -3550 182617 113999 -321129 -39322 -306305 56966 -163145 107796 300741
$$ packed form
15488d12441C41836d35560K3936J98842C9687P185M471K44081b13529A35549b33582
15476b56710J09757d7225o14B3883N1218P2807d1853k32022h827o530F3331E30
15463h6019B21012p2726g5616B8880a37836A44825Q2821n2491K6143a33937D7907
15451f404A3529J43679h1208H1961e3426j55923L8006B3590i7309A92240a587
15439G1641b62686A73024a42420j47566g6421k0422j17022A56230a3289j8941
15429c2230H9936J4255k9035a3350E0279a14808R251b7623n704A74522c8422I842
15416C37253j20424d0088o138A4682J49025E1949J65966o3054b907j50003j7423
15405a70333f6850c550A82617o8618c21129c9322k66983E6966a63145A07796J92945
$$ plain form
15394 300741 -376515 19219 187194 113785 189146 -7131 -122703 52811 161932 117220 66850
15383 66850 215068 -100694 -117237 228182 -164138 -32499 324644 135790 -175942 -339528
15373 -339528 -152181 208598 -159938 -65740 140352 252957 -148186 -66180 -127007 -73453
15363 -73453 -123794 42123 233579 225503 117773 -14207 132190 -31464 -104832 69804 -254209
15351 169435 135227 50487 223017 -217996 -274831 -490193 147292 -87548 -86221 -31021 -105139
15340 -105139 -88800 56849 -84632 -237397 21189 297609 307146 8844 392289 -42582 -118233
15329 -118233 21914 339945 -46180 101255 -245998 -109858 11283 -58734 224399 11292
15318 315627 251218 -137473 7230 -125473 -163667 56793 18050 213706 108650 -81794 340301
$$ packed form
15394C00741c76515A9219J67975p3409P5361g131j15572E2811J09121m4712n0370
15383F6850J48218a00694j6543B28182a64138c2499C24644A35790a75942j63586
15373c39528a52181B08598a59938f5740A40352J12605a48186f6180o0827N3554
15363g3453n0341D2123J91456q076j07730a4207A32190c1464p3368F9804b54209
15351A69435l4208E0487J72530b17996n6835k15362A47292h7548J327c1021p4118
15340a05139J6339E6849h4632j52765B1189K76420R537H844L83445d2582p5651
15329a18233B1914L18031d6180A01255b45998a09858A1283e8734B24399A1292
15318C15627o4409a37473G230a25473l8194E6793A8050J95656j05056h1794C40301
$$ plain form
15306 196233 -309776 50491 -269832 35796 -84818 298613 340959 206249 -113729 186512
15295 -125858 50522 -28304 -179085 74110 91293 108855 130966 198270 307489 31626 83635
15284 83635 71040 -143719 -93776 -54570 34380 106266 408211 276541 -119612 -82170 363798
15272 223807 -122801 278032 150016 89243 174408 -183444 68183 93928 179830 -31631 236907
15260 -247287 -176974 -12323 253820 -277924 23713 -76464 2684 -50679 379407 428891 396453
15249 396453 -8027 663954 650824 1566453 1518003 1250267 1710744 778376 101871 154154
15239 154154 224871 -47204 294396 206158 20475 152448 110473 -28864 -116498 86590 -35469
15227 -34741 -54502 -254946 -184033 150578 -8926 -54456 186974 -45519 66595 -92874 38169
$$ packed form
15306A96233c09776E0491b69832C5796h4818B98613M2346j34710a13729A86512
15295a25858E0522b8304j50781G4110J7183J7562K2111O7304J09219C1626N2009
15284H3635j2595a43719M9943L9206C4380P1886L01945j31670a19612L7442C63798
15272B23807a22801B78032j28016o0773Q5165a83444F8183K5745Q5902c1631B36907
15260b47287P0313a2323B53820b77924B3713g6464B684e0679C79407M9484l2438
15249C96453h027F63954j3130R15629m8450k67736M60477G78376A01871N2283
15239A54154P0717d7204B94396q8238B0475J31973m1975b8864q7634H6590c5469
15227c4741j9761k00444P0913A50578h926m5530A86974d5519F6595i2874C8169
$$ plain form
15215 29119 204819 142362 -3948 150393 240744 264626 209554 128668 108643 36266 128114
15204 128114 221024 -18966 222823 143885 200325 277136 101234 2508 -202030 38552 -60572
15192 -8029 325667 -67980 -305703 -450 287720 -27964 380485 -123728 68006 -167852 -99408
15181 -99408 269894 336341 30355 262530 -14538 93104 -344849 101344 150698 -245070 84891
15169 366796 173834 278559 180654 220442 442964 245594 -17318 93222 384834 -197828
15158 360758 -166669 61287 211540 11095 272412 212524 251068 -126889 71646 10923 -65749
15146 -124472 -56073 -93545 90049 427075 117283 216429 55901 285752 201963 -94021 131780
15134 237181 -166992 222931 255070 365151 309403 -160222 58090 -18160 190535 140271
$$ packed form
15215B9119J75700o2457c948A50393R0351K3882n5072q0886k0025C6266R1848
15204A28114R2910a8966B22823p8938N6440P6811A01234B508b02030C8552f0572
15192h029C25667f7980k37723d50B87720b7964C80485a23728F8006a67852O8444
15181i9408B69894O6447C0355K32175a4538I3104c44849A01344M9354b45070H4891
15169C66796A73834J04725r7905L9788K22522j97370a7318I3222K91612a97828
15158C60758a66669F1287J50253A1095K61317n9888L8544a26889G1646A0923f5749
15146a24472e6073l7472I0049L37026A17283R9146E5901K29851q3789i4021A31780
15134B37181a66992B22931L2139J10081n5748a60222E8090a8160A90535n0264
$$ plain form
15124 140271 78293 286706 16096 130269 -40784 -148098 -170655 217209 -212000 344807
15113 202196 231352 86108 232929 85852 514912 -6801 250115 122637 96931 -179621 -169183
15102 -169183 -154060 212547 -18775 135756 372327 134781 293787 -481836 184983 350356
15092 350356 183027 183922 -26871 -43506 20655 36457 -280962 -65162 286607 59015 92320
15081 92320 210967 -3045 -22300 65734 298188 -60286 170099 15845 256377 -121979 904
15069 366595 370365 182030 121637 89735 140131 316728 35716 -59794 340946 327330 -105544
15057 329297 279872 -17472 96334 172972 197188 140876 332251 88639 107639 -109855 158011
15045 384766 216026 -161795 162115 243172 -1116 144659 151499 326151 -46681 21365 17645
$$ packed form
15124A40271o1978K08413A6096J14173d0784j07314k2557B17209b12000C44807
15113B02196K9156H6108J46821H5852M29060f801B50115A22637k5706a79621J0438
15102a69183J5123B12547a8775A35756K36571A34781J59006d81836A84983J65373
15092C50356j67329Q95b6871j6635B0655J5802b80962f5162B86607E9015L3305
15081I2320J18647c045j9255F5734K32454f0286A70099A5845K40532a21979I04
15069C66595L770A82030o0393l1902N0396J76597C5716e9794C40946j3616a05544
15057C29297m9425a7472I6334P6638K4216n6312J91375H8639J9000a09855A58011
15045C84766j68740a61795A62115Q1057a116A44659O840J74652d6681B1365l720
$$ plain form
15034 17645 37824 23570 562082 199471 -25786 409149 61962 126679 284182 152031 -58828
15022 363784 -44065 498125 165479 189206 435797 231656 303249 -116622 -11662 190347
15011 231813 8500 512093 230154 74671 218499 619655 -101567 468750 168240 695 277001
15000 277001 249145 91412 49803 186931 659665 490579 247784 338893 -92512 -72437 417262
14988 134677 170645 167827 67159 462036 -134263 133871 85388 277281 222807 453975 263730
14977 263730 184984 534849 66184 -106477 341742 274642 154534 211515 193784 237996 102262
14965 -100467 299023 94695 144486 222260 108301 136345 283484 101898 164665 267543
14955 267543 19621 128807 136949 456810 108778 130492 488249 21759 135634 374882
$$ packed form
15034A7645K0179j4254N38512A99471b5786D09149F1962O4717J57503j32151e8828
15022C63784d4065D98125A65479K3727K46591k04141P1593a16622a1662A90347
15011B31813H500N03593B30154G4671J43828M01156a01567D68750A68240F95K76306
15000B77001k7856I1412m1609J37128M72734j69086k42795R1109i2512K0075D17262
14988A34677L5968k818F7159L94877a34263A33871m8483J91893n4474K31168j90245
14977B63730p8746L49865F6184a06477C41742o7100j20108N6981j7731M4212A02262
14965a00467B99023I4695M9791P7774A08301K8044J47139A01898O2767J02878
14955B67543A9621J09186Q142L19861A08778K1714L57757B1759J13875K39248
$$ plain form
14945 374882 136850 388022 428152 158686 269871 160446 458770 290658 276909 221600
14935 221600 449577 164952 339933 416505 583357 480692 668621 87559 280552 213126
14925 213126 -19587 518937 344303 29460 83608 474651 223940 168645 403031 560107
14915 560107 276815 191505 263749 361119 373480 87004 150265 11506 476294 92236 372413
14904 372413 524710 120555 116478 312656 73731 49558 230580 496470 371557 265826
14894 265826 211038 240535 369511 575574 392918 516241 363110 738824 212377 203554
14884 203554 461243 359559 466402 566582 -14989 356575 444988 585330 298284 92238
14873 253903 478617 735523 508797 697086 341082 88940 239746 216543 286892 268694
$$ packed form
14945C74882A36850K51172M0130A58686J11185j09425K98324j68112j3749n5309
14935B21600K27977A64952J74981P6572J66852j02665J87929H7559J92993o7426
14925B13126a9587E18937j74634B9460N4148L91043B23940n5295K34386J57076
14915E60107B76815q5310P2244R7370J2361H7004O3261A1506M64788I2236K80177
14904C72413J52297A20555m077J96178G3731k4173J81022K65890j24913j05731
14894B65826n4788K9497J28976K06063j82656J23323j53131L75714B12377q823
14884B03554K57689j01684J06843J00180a4989C56575Q8413J40342k87046I2238
14873B53903K24714K56906k26726J88289C41082H8940J50806k3203P0349j8198
$$ plain form
14863 268694 389030 539082 391817 42475 455101 410727 332159 608481 144508 187914
14853 187914 485543 243152 310769 469380 473348 513043 149830 178345 358860 392676 576888
14842 576888 708396 305129 633957 369327 406937 246674 667597 255272 671404 680358
14832 680358 399233 397715 356330 401888 690905 701516 303183 388656 717965 287161 298013
14821 298013 488091 881820 304156 579280 663534 752690 606505 294500 574805 436096
14811 436096 189343 290466 402837 460677 294252 661192 512511 342707 856191 420171
14800 280584 506428 269428 488701 94099 663790 756672 684726 75792 420306 299278
14790 299278 398812 582764 324250 350031 408455 605900 460377 601089 491436 806610
$$ packed form
14863B68694J20336J50052j47265D2475M12626m4374p8568K76322A44508M3406
14853A87914K97629k42391O7617J58611L968L9695A49830K8515J80515L3816J84212
14842E76888J31508C05129L28828k64630L7610j60263M20923B55272M16132Q954
14832F80358k81125j518m1385M5558K89017J0611C03183Q5473L29309B87161J0852
14821B98013J90078L93729C04156K75124Q4254Q9156j46185B94500K80305j38709
14811D36096A89343J01123J12371N7840j66425L66940j48681j69804N13484D20171
14800B80584K25844k37000K19273I4099N69691R2882p1946G5792L44514j21028
14790B99278R9534J83952k58514K5781N8424J97445j45523J40712j09653L15174
$$ plain form
14780 806610 366459 694254 654298 886717 721621 554183 615522 616515 630344 543959 988533
14769 988533 561309 606403 452293 529666 468228 547603 189112 459945 675290 777529
14759 777529 811261 535666 662987 234789 220997 519397 389014 684971 669347 524154
14749 524154 431125 551716 799695 1001782 765991 670889 485722 1108780 842331 611907
14739 611907 693000 554514 593298 849967 536721 356057 663077 1004920 547425 659195
14729 659195 292488 760992 977437 853133 645355 451994 264106 796002 906930 961183
14719 961183 1024755 700643 929664 766426 600095 975725 681997 479020 602520 843680
14709 843680 765524 803412 822635 826485 647790 776523 651212 703551 747894 1000646 853907
$$ packed form
14780H06610C66459L27795l9956K32419j65096j67438O1339R93J3829q6385M44574
14769I88533m27224M5094j54110P7373o1438P9375A89112K70833K15345J02239
14759G77529L3732k75595J27321B34789j3792K98400j30383K95957j5624j45193
14749E24154r3029J20591K47979K02087k35791r5102j85167O23058k66449k30424
14739F11907Q1093j38486L8784K56669l13246j80664L07020L41843m57495J11770
14729F59195B92488M68504K16445j24304k07778j93361j87888N31896J10928N4253
14719I61183O3572l24112K29021j63238j66331L75630k93728k02977J23500K41160
14709H43680p8156L7888J9223L850j78695J28733j25311N2339M4343K52752j46739
$$ plain form
14698 853907 910865 849660 800509 846013 760599 897162 710784 681858 848183 693051 979645
14687 979645 915674 1017687 1446528 896986 1036045 834444 703606 906983 1182790 891587
14677 891587 904964 609058 905994 1047978 1254993 1264663 1070256 1038295 981591 825018
14667 825018 910775 913335 940394 913206 562140 1053233 1095320 905676 1071126 1025998 1179881
14656 1179881 904945 989737 1007330 1260554 1108939 982717 1321916 1168071 887422 1166233
14646 1166233 906244 1235605 1076666 1088653 1352518 1172462 1055738 1399441 1018734 1126058
14636 1126058 1190693 1158038 1239718 1350561 1033802 1375392 1049702 1384218 1259066 1631730
14626 1631730 997789 1316291 994097 1016401 1217029 1047224 928908 1330223 1009176 1385446
$$ packed form
14698H53907N6958o1205m9151M5504q5414J36563j86378k8926J66325j55132K86594
14687I79645o3971J02013M28841n49542J39059k01601j30838K03377K75807k91203
14677H91587J3377k95906K96936J41984K07015R670j94407l1961n6704j56573
14667H25018Q5757K560K7059k7188l51066M91093M2087j89644J65450m5128J53883
14656A179881k74936Q4792J7593K53224j51615j26222L39199j53845k80649K78811
14646A166233k59989L29361j58939J1987K63865j80056j16724L43703l80707J07324
14636A126058O4635l2655Q1680J10843l16759L41590l25690L34516j25152L72664
14626A631730o33941L18502l22194K2304K00628j69805j18316M01315l21047L76270
$$ plain form
14616 1385446 1241958 1543008 1417476 1436999 1276569 1294932 1379377 1055690 1373967 1311044
14606 1311044 1305912 1493303 1461799 1600209 1640954 1245848 1382224 1507240 1597070 1428288
14596 1428288 1858474 1395614 1844692 1293259 1561462 1774868 1727653 1514203 1848159 1618782
14586 1618782 1825819 1613242 1541686 1713862 1659295 1976166 1679715 1865435 2092856 1718199
14576 1718199 1954140 2082122 1923303 1667129 1780423 1947835 1905628 2141209 1798896 1968570
14566 1968570 2282368 2159553 1890615 2321549 2199466 2328663 2611814 2426143 2534878
14557 2534878 2683866 2666897 3025344 2786993 3254166 3814555 3795569 4764294 6661464 10535568
14547 10535568 18155609 35916708 44740602 17653595 7922274 5982738 4450670 2408895
$$ packed form
14616A385446j43488L01050j25532J9523j60430J8363Q4445l23687L18277o2923
14606A311044n132J87391l1504J38410M0745l95106J36376J25016Q9830j68782
14596A428288M30186m62860M49078n51433K68203K13406m7215k13450L33956k29377
14586A618782K07037k12577p1556J72176n4567L16871k96451J85720K27421l74657
14576A718199K35941J27982j58819k56174J13294J67412m2207K35581l42313J69674
14566A968570L13798j22815k68938M30934j22083J29197K83151j85671J08735
14557B534878J48988j6969L58447k38351M67173N60389j8986R68725J897170L874104
14547A0535568P620041J7761099Q823894A7653595G922274j939536j532068k041775
$$ plain form
14539 2408895 2256678 2041313 1569433 1508223 2013732 1623252 1762382 1791741 1991438 1933409
14529 1933409 2039325 2065837 1910011 1980392 2306421 2311577 1962260 2153233 2236651 2146552
14519 2146552 2361963 2455360 2194199 2600012 2122384 2253966 2594994 2673212 2695392 2844499
14509 2844499 2588278 2223375 2395403 2504362 2820763 2539606 2908448 2665345 2790516
14500 2790516 3043624 2799672 3033669 2755161 2872594 2783041 3037928 2951981 3077574 3171284
14490 3171284 3367257 3223536 3054955 2972752 3309970 3300464 3392000 3633602 3527873 3536567
14480 3536567 3511596 3292109 3550061 3348509 3748912 3638247 3812043 3482992 3823040 4030845
14470 4030845 3857536 4018409 3986856 4057152 4026900 4077712 4067062 4147347 4073196 4513289 4448273
$$ packed form
14539B408895j52217k15365m71880o1210N05509l90480J39130K9359J99697n8029
14529A933409J05916K6512j55826P0381L26029N156l49317J90973Q3418r0099
14519B146552K15411R3397k61161M05813m77628J31582L41028P8218K2180J49107
14509B844499k56221l64903J72028J08959L16401k81157L68842k43103J25171
14500B790516K53108k43952K33997k78508J17433q9553K54887q5947J25593R3710
14490C171284J95973j43721j68581q2203L37218r506R1536K41602j05729Q694
14480C536567k4971k19487K57952k01552M00403j10665J73796l29051L40048K07805
14470D030845j73309J60873l1553P0296l0252N0812j0650Q0285p4151M40093o5016
$$ plain form
14459 4448273 4294097 4379382 4531424 4324505 4731580 4565732 4504400 4743286 4626719 5025029
14449 5025029 4856172 4775496 5083096 4869657 5130862 5193280 5375093 5572729 5275603 5523967
14439 5523967 5564209 5388686 5436616 5698565 5764077 5985555 5853796 6041735 6040676 5907002
14429 5907002 6496512 6189393 6365331 6298191 6629946 6726242 6778569 6963407 6813431 7075618
14419 7075618 7034067 7072764 7568642 7860658 7503120 7775645 7789382 8011542 7972149 8103840
14409 8103840 8144222 8427462 8993044 8711500 8502938 8588867 8791433 9058056 9436937 9284819
14399 9284819 9646693 9655567 9757184 9982800 10441846 10338087 10716394 10412054 10820993 11328421
14389 11328421 11257624 11157669 11456650 11790891 12197221 12129351 12452991 12675197 12592414 13262365
$$ packed form
14459D448273j54176Q5285J52042k06919M07075j65848o1332K38886j16567L98310
14449E025029j68857q0676L07600k13439K61205O2418J81813J97636k97126K48364
14439E523967M0242j75523M7930K61949O5512K21478j31759J87939j059j33674
14429E907002N89510l07119J75938o7140L31755R6296N2327J84838j49976K62187
14419G075618m1551L8697M95878K92016l57538K72525J3737K22160l9393J31691
14409H103840M0382K83240N65582k81544k08562Q5929K02566K66623L78881j52118
14399I284819L61874Q874J01617K25616M59046j03759L78307l04340M08939N07428
14389A1328421p0797r9955K98981L34241M06330o7870L23640K22206q2783O69951
$$ plain form
14379 13262365 13053805 13478787 13725181 13968802 14321747 14686697 14837946 15392529 15393882 15618753
14369 15618753 16033397 16176565 16894814 17194437 17668397 17942845 18263115 18675874 18835246
14360 18835246 19496248 19905533 20313244 20743467 21160437 21618125 22065514 22565076 23102828
14351 23102828 23901517 24538731 24868164 25429692 26622337 26837604 27415739 28210077 28734513
14342 28734513 29694304 30602499 31260015 32428114 33383415 34244741 35287891 36010418 37035819
14333 37035819 37959669 39321847 40320766 41979639 43032059 44117842 45731703 47463810
14325 47463810 48670799 50719963 51850694 53681186 55488915 57631333 59847223 61734556
14317 61734556 64250814 66910947 69424937 72002499 74902719 77666492 80800347 84094828
$$ packed form
14379A3262365k08560M24982K46394K43621L52945L64950J51249N54583J353K24871
14369A5618753M14644J43168P18249K99623M73960K74448L20270M12759J59372
14360A8835246O61002M09285M07711M30223M16970M57688M47389M99562N37752
14351B3102828P98689O37214L29433N61528J192645K15267N78135P94338N24436
14342B8734513R59791R08195O57516J168099R55301Q61326J043150P22527J025401
14333C7035819R23850J362178R98919J658873J052420J085783J613861J732107
14325D7463810J206989K049164J130731J830492J807729K142418K215890J887333
14317F1734556K516258K660133K513990K577562K900220K763773L133855L294481
$$ plain form
14309 84094828 87664727 91236281 95324659 99087341 103841487 108363338 113329102 118657445
14301 118657445 124146432 129998029 136337097 142789079 149957409 157604411 165434909 174028397
14293 174028397 182898368 192269400 202183147 212461813 223500827 235082223 246926975
14286 246926975 259846678 272359070 286066074 299719442 313827062 327501161 341994981
14279 341994981 355860404 369633643 382731618 394546664 405683643 415367604 421611216
14272 421611216 423585715 424457985 424494764 426281722 424581678 421849619 417148015 409192458
14264 409192458 399432710 388081263 375275239 361608071 347562500 332906018 317603446
14257 317603446 302788606 288171311 274071630 260070839 246892805 235787054 223764800
$$ packed form
14309H4094828L569899L571554M088378L762682M754146M521851M965764N328343
14301A18657445N488987N851597O339068O451982P168330P647002P830498Q593488
14293A74028397Q869971R371032R913747J0278666J1039014J1581396J1844752
14286B46926975J2919703J2512392J3707004J3653368J4107620J3674099J4493820
14279C41994981J3865423J3773239J3097975J1815046J1136979R683961O243612
14272D21611216J974499Q72270L6779J786958j700044k732059m701604p955557
14264D09192458r759748j1351447j2806024j3667168j4045571j4656482j5302572
14257C17603446j4814840j4617295j4099681j4000791j3178034j1105751j2022254
$$ plain form
14250 223764800 212107297 201368461 190942897 181301367 172187997 163696904 155928716
14243 155928716 148167894 141546540 134409107 128262070 122140137 116997720 111811233 106765605
14235 106765605 101944760 97623441 93480294 89936900 86468980 82910142 79481174 76336652
14227 76336652 73164588 70452410 67772049 65345497 62829963 60341437 58525011 57196787
14219 57196787 54971380 52578994 51393458 49284833 47560849 46557263 45208206 43580969
14211 43580969 42122455 40950535 39563382 38364174 38273900 36858566 35706091 34213685
14203 34213685 33475512 32515513 32143152 31461540 30188973 29108268 28515390 27514258 27165303
14194 27165303 26632916 26067365 25329101 24423637 24050041 23489591 22883955 22167402 21746641
$$ packed form
14250B23764800j1657503j0738836j0425564r641530r113370q491093p768188
14243A55928716p760822o621354p137433o147037o121933n142417n186487n045628
14235A06765605m820845m321319m143147l543394l467920l558838l428968l144522
14227G6336652l172064k712178k680361k426552k515534k488526j816426j328224
14219E7196787k225407k392386j185536k108625j723984j003586j349057j627237
14211D3580969j458514j171920j387153j199208r0274j415334j152475j492406
14203C4213685p38173r59999l72361o81612j272567j080705n92878j001132l48955
14194B7165303n32387n65551p38264r05464l73596n60450o05636p16553m20761
$$ plain form
14185 21746641 21284503 20643207 20137852 19909234 19646262 18961782 18572860 18390694 17939261
14176 17939261 17511688 17027244 16956733 16169150 16435669 15750688 15561773 15396361 14659361
14167 14659361 14561701 14251718 13815438 13940210 13390725 13228661 13164900 12795986 12980074 12179753
14157 12179753 12111814 11895412 11276329 11632801 11557095 11091911 10967910 10702438 10540406 10290525
14147 10290525 10141085 9845264 10109652 9950672 9474099 9558371 9363970 9075325 9207399
14138 9207399 9119505 8847068 8696700 8325590 8648918 8382973 8074380 8113031 7974274 8025287
14128 8025287 7795056 7568779 7188992 7333097 7603342 7198876 7060783 6924382 6967323 6543663
14118 6543663 6720701 6685425 6636065 6535415 6251394 5925123 6309939 6265396 6196295 5818875
$$ packed form
14185B1746641m62138o41296n05355k28618k62972o84480l88922j82166m51433
14176A7939261m27573m84444p0511p87583K66519o84981j88915j65412p37000
14167A4659361r7660l09983m36280J24772n49485j62064o3761l68914J84088q00321
14157A2179753o7939k16402o19083L56472p5706m65184j24001k65472j62032k49881
14147A0290525j49440k95821K64388j58980m76573Q4272j94401k88645J32074
14138I207399q7894k72437j50368l71110L23328k65945l08593L8651j38757N1013
14128H025287k30231k26277l79787J44105K70245m04466j38093j36401M2941m23660
14118F543663J77038l5276m9360j00650k84021l26271L84816m4543o9101l77420
$$ plain form
14108 5818875 6035488 5670275 5751186 5787500 5525597 5458418 5446580 5416163 4990013 5379045
14098 5379045 5148297 5357994 5146785 4986601 5235753 4782477 5156564 4772534 5039093
14089 5039093 4616851 4762069 4693503 4239577 4629644 4562812 4400706 4447776 4500765 4353154
14079 4353154 4248691 4262409 4178919 3798686 4090338 3911891 3983584 3854617 3802269 3912354
14069 3912354 3605308 3579642 3690668 3791268 3653594 3444639 3521647 3521713 3817239 3634415
14059 3634415 3490468 3792762 3495997 3238072 3686460 3315850 3111219 3136195 3152377 3065508
14049 3065508 3212507 3432411 3018712 3038462 2857154 2782818 2913981 2838194 3269773 2908571
14039 2908571 2912428 2451372 2597105 2959710 2775647 2856382 2688091 2953477 3054317 2831474
$$ packed form
14108E818875K16613l65213Q0911L6314k61903o7179j1838l0417m26150L89032
14098E379045k30748K09697k11209j60184K49152m53276L74087l84030K66559
14089E039093m22242J45218o8566m53926L90067o6832j62106M7070N2989j47611
14079D353154j04463J3718q3490l80233K91652j78447P1693j28967n2348J10085
14069C912354l07046k5666J11026J00600j37674k08955P7008O6K95526j82824
14059C634415j43947L02294k96765k57925M48388l70610k04631K4976J6182q6869
14049C065508J46999K19904m13699J9750j81308p4336J31163p5787M31579l61202
14039B908571L857m61056J45733L62605j84063Q0735j68291K65386J00840k22843
$$ plain form
14029 2831474 2678630 2736675 2734267 2720704 2628310 2163509 2334611 2332034 2435517 2264960 2281156
14018 2281156 2214854 2027614 2353630 2305959 2240849 1949176 2350110 2242193 1989243 2200745
14008 2200745 2297895 1824307 2043416 2125577 2243030 2038846 1829029 1732021 1993572 1848515
13998 1848515 1774515 1474917 1924436 1574935 2114794 1827171 1604032 1548778 2347781 2714426
13988 2714426 5545666 11527331 29121182 47332053 24755193 11949282 6590963 4902239
13980 4902239 4130020 3818835 3359981 2891817 2634164 2402271 2231965 2469495 2395852 2330636
13970 2330636 2330291 1671178 1931978 2042371 2280249 1985425 1766474 1979173 1845080 1945280
13960 1945280 1895748 1606857 2030970 1907650 1467396 1607336 1590226 1756256 1836011 1519488
$$ packed form
14029B831474j52844N8045k408j3563r2394m64801J71102k577J03483j70557J6196
14018B281156o6302j87240L26016m7671o5110k91673M00934j07917k52950K11502
14008B200745R7150m73588K19109Q2161J17453k04184k09817r7008K61551j45057
13998A848515p4000k99598M49519l49501N39859k87623k23139n5254P99003L66645
13988B714426K831240N981665J7593851J8210871k2576860A1949282n358319j688724
13980D902239p72219l11185m58854m68164k57653k31893j70306K37530p3643o5216
13970B330636l45o59113K60800J10393K37878k94824k18951K12699j34093J00200
13960A945280m9532k88891M24113j23320m40254J39940j7110J66030P9755l16523
$$ plain form
13950 1519488 1648144 1720630 1870125 1818352 1471444 1422203 1634574 1473326 1711435 1701717
13940 1701717 1661885 1316497 1575265 1546771 1526250 1269780 1569851 1364186 1418651 1363436
13930 1363436 1546836 1653278 1402590 1200204 1273052 1220403 1613537 1144135 1395833 1346039
13920 1346039 1151996 1285706 1261546 1379743 1436853 1259913 1379095 1084301 1231362 1372133
13910 1372133 1277667 1519399 1240813 1307763 1412406 1477594 924701 1122135 977386 1245604
13900 1245604 1493436 1197966 1043693 1453642 1062927 1143808 1471608 1345487 1399526 1078733
13890 1078733 1104069 1240352 1241313 1015389 831333 1032428 938028 1024883 1105027 928503 1389376
13879 1389376 1119772 999665 978883 1011841 990752 816434 684279 1033005 1061161 1032135
$$ packed form
13950A519488J28656P2486J49495n1773l46908m9241K12371j61248K38109r718
13940A701717l9832l45388K58768k8494k0521k56470L00071k05665N4465n5215
13930A363436J83400J06442k50688k02386P2848n2649L93134m69402K51698m9794
13920A346039j94043J33710k4160J18197N7110j76940J19182k94794J47061J40771
13910A372133r4466K41732k78586O6950J04643O5188n52893J97434j44749K68218
13900A245604K47832k95470j54273M09949l90715Q0881L27800j26121N4039l20793
13890A078733K5336J36283R61k25924j84056K01095r4400Q6855Q0144j76524M60873
13879A389376k69604j20107k0782L2958k1089j74318j32155L48726K8156k9026
$$ plain form
13869 1032135 1007745 854195 1165461 1305508 850728 667585 1244179 926735 1110411 1140502
13859 1140502 1097165 901276 973694 729366 1039896 846218 670514 951348 748487 503309
13849 503309 888536 813649 643670 987481 609801 1077233 1248739 838995 1022881 844884
13839 844884 624215 834499 968728 1054420 653840 721286 895641 555893 789959 811124
13829 811124 839355 705216 817752 763497 636648 682884 527691 1161178 798054 745066
13819 745066 676372 532968 1002522 708069 783986 376411 886482 954582 831128 791763
13809 791763 736029 779130 977600 619125 467927 482061 181247 673842 676144 537379
13799 537379 737694 901723 552790 673504 637016 667377 338741 823041 742237 283511
$$ packed form
13869A032135k4390j53550L11266J40047m54780j83143N76594l17444J83676L0091
13859A140502m3337j95889P2418k44328L10530j93678j75704K80834k02861k45178
13849E03309L85227p4887j69979L43811l77680M67432J71506m09744J83886j77997
13839H44884k20669K10284J34229Q5692m00580O7446J74355l39748K34066K1165
13829H11124K8231j34139J12536n4255j26849M6236j55193O33487l63124n2988
13819G45066o8694j43404M69554k94453P5917C76411N10071O8100j23454l9365
13809G91763n5734M3101J98470l58475j51198J4134A81247M92595K302j38765
13799E37379K00315J64029l48933J20714l6488L0361l28636M84300q0804B83511
$$ plain form
13788 960579 668699 475796 672521 688176 804500 462587 603568 539831 425660 777325
13778 777325 656229 450614 573681 877373 453762 403288 554905 461726 807728 695183
13768 695183 491715 768444 524724 690626 634457 764409 662538 599261 551975 536112
13758 536112 500764 390547 823579 645185 345234 630025 581987 459540 821395 430420
13748 430420 221887 556010 282842 316667 521303 470159 446938 774293 119604 693453
13738 693453 509921 367586 316993 648253 536108 661495 377794 525793 452895 384230
13728 384230 525620 363605 473724 484208 443350 750943 387103 428585 661705 570711
13718 570711 759519 463578 400327 243732 369150 560663 572857 538540 615862 475890
$$ packed form
13788I60579k91880j92903J96725J5655J16324l41913J40981o3737j14171L51665
13778G77325j21096k05615J23067L03692m23611n0474J51617r3179L46002j12545
13768F95183k03468K76729k43720J65902n6169J29952j01871o3277m7286j5863
13758E36112l5348j10217M33032j78394k99951K84791m8038j22447L61855l90975
13748D30420k08533L34123k73168L3825K04636n1144k3221L27355A19604N73849
13738F93453j83532j42335n0593L31260j12145J25387k83701J47999p2898o8665
13728C84230J41390j62015J10119J0484m0858L07593l63840M1482K33120r0994
13718E70711J88808k95941o3251j56595J25418J91513J2194l4317P7322j39972
$$ plain form
13708 475890 428325 190722 565567 416394 440875 84912 597604 606167 651633 450906 524357
13697 524357 359650 647336 97973 225632 455447 204419 430722 472425 396029 416922
13687 416922 -91324 317392 625982 459805 193262 767467 589786 343885 458276 779574
13677 779574 698959 653117 518045 560652 72516 236206 152254 493809 662984 464397
13667 464397 462472 433283 636453 392074 483115 515277 282305 329500 349248 310452 573642
13656 573642 249173 592991 431570 90872 567990 344973 307709 239204 274764 177619
13646 177619 416707 247417 559643 509490 338364 706173 431027 37213 472299 418597
13636 418597 136545 130702 387854 175166 488418 235595 180811 379169 177764 352858
$$ packed form
13708D75890m7565A90722L74845j49173K4481H4912N12692Q563M5466k00727P3451
13697E24357j64707K87686I7973J27659K29815B04419K26303M1703p6396K0893
13687D16922i1324C17392L08590j66177A93262N74205j77681k45901J14391L21298
13677G79574q0615m5842j35072M2607G2516J63690q3952L41555J69175j98587
13667D64397j925k9189K03170k44379R1041L2162k32972M7195J9748l8796K63190
13656E73642B49173L43818j61421I0872M77118k23017l7264o8505L5560r7145
13646A77619K39088j69290L12226n0153j71126L67809k75146C7213M35086n3702
13636D18597A36545n843K57152A75166L13252B35595n4784J98358A77764J75094
$$ plain form
13626 352858 326018 600004 468789 719865 163745 328103 72350 436737 33045 425410
13616 425410 273757 730181 -29599 411409 79839 394862 -211318 1562 464576 185850
13605 352459 400625 48659 200820 174238 340315 373147 192832 232664 190311 439956 515148
13594 515148 213429 227805 441713 280955 228583 122865 38408 326445 48433 311350
13584 311350 312040 356312 -145383 274152 144797 166410 134648 42965 72899 355818 427196
13573 427196 52032 209580 189588 639294 206728 564762 246882 199763 247042 81990
13562 213089 309471 522864 287533 287871 326214 419623 190718 243424 143022 108975 172820
13551 172820 -75025 536145 349023 521083 366743 155841 13195 147692 155389 497709
$$ packed form
13626C52858k6840K73986j31215K51076A63745J64358G2350L64387C3045L92365
13616D25410j51653M56424b9599D11409G9839L15023b11318A562M63014A85850
13605C52459M8166D8659J52161k6582J66077L2832j80315L9832m2353K49645P5192
13594E15148B13429J4376K13908j60758n2372j05718C8408K88037D8433K62917
13584C11350O90M4272a45383B74152j29355K1613l1762D2965K9934K82919P1378
13573D27196E2032J57548j9992M49706B06728L58034B46882m7119M7279H1990
13562B13089R6382K13393k35331L38L8343R3409A90718N2706j00402l4047O3845
13551A72820g5025E36145j87122J72060j54340A55841A3195J34497P697L42320
$$ plain form
13541 497709 -19927 465805 153342 277532 385784 531681 260233 176951 240337 97789
13530 214649 344516 129873 436461 283695 367037 293233 172505 284651 -91063 261919
13519 280754 237652 384480 288911 179175 -6955 401032 292312 28573 230869 138881 127098
13508 127098 37245 248188 165649 16957 445843 390032 67857 344906 214771 229705 414470
13497 414470 183194 382620 -15802 643222 -2977 547331 400290 -259263 237522 304839
13487 304839 242621 293246 127244 250054 134524 326867 118336 211110 90859 78362
13477 78362 -27232 166010 394316 62831 241984 235563 51968 97090 43133 721361 243850
13465 292213 39501 240163 169376 367888 236916 139192 -29697 207454 436492 433852 281761
$$ packed form
13541D97709a9927D65805A53342J24190J08252J45897B60233q3282O3386I7789
13530B14649J29867A29873L06588j52766Q3342p3804j20728J12146i1063B61919
13519B80754m3102J46828r5569j09736f955D01032j08720B8573K02296r1988j1783
13508A27098C7245K10943q2539A6957M28886n5811F7857K77049j30135J4934J84765
13497D14470A83194J99426a5802F43222b977E47331j47041b59263B37522O7317
13487C04839o2218N0625A27244J22810j15530J92343A18336R2774I0859j2497
13477G8362b7232A66010K28306F2831J79153o421E1968M5122D3133O78228B43850
13465B92213C9501K00662p0787J98512j30972r7724b9697B07454K29038k640j52091
$$ plain form
13454 281761 -141951 399830 40837 311062 -150382 195880 198768 -88602 216147 267401
13444 267401 83818 55680 -154385 205698 235474 113945 264801 295319 111894 262990
13434 262990 171663 42975 48952 69209 267180 285202 415014 -69860 775984 307832 28607
13422 500710 294981 261917 175513 228642 589809 269106 58207 439127 328875 48608
13411 -182770 186390 -5109 127085 207941 318465 220655 6376 213061 -13977 107052 185980
13400 185980 104885 621786 307342 25842 577107 93608 437571 36680 137736 147810
13390 147810 126286 -12550 105905 83246 160680 363053 255136 136695 149323 50759 36168
13379 36168 359929 84693 215646 180640 -64893 148865 373437 228510 147085 241728 223870
$$ packed form
13454B81761a41951C99830D0837K70225a50382A95880K888h8602B16147N1254
13444B67401H3818k8138a54385B05698K9776A13945J50856L0518A11894J51096
13434B62990r1327D2975N977K0257J97971J8022J29812f9860G75984C07832B8607
13422E00710k05729l3064q6404N3129L61167B69106E8207L80920j10252D8608
13411a82770A86390e109A27085Q0856J10524r7810F376K06685a3977A07052P8928
13400A85980q1095N16901C07342B5842N51265I3608L43963C6680J01056J0074
13390A47810k1524a2550A05905k2659P7434K02373j07917j18441J2628E0759j4591
13379C6168L23761H4693J30953l5006f4893A48865K24572j44927q1425R4643j7858
$$ plain form
13368 223870 97231 -50957 -110588 228757 515150 207320 -28404 20005 -89585 259005 146838
13357 146838 180899 218835 -182393 -58270 340777 153942 7476 360095 264193 174286 360748
13346 360748 -11356 182341 336180 223770 437193 318073 182884 362931 314696 262214
13336 262214 159244 -29584 214433 142202 445200 272638 99224 274667 523582 -42864
13325 -122619 -44429 419507 107269 192539 164945 225560 14500 115760 206416 212395 192848
13314 192848 93948 137085 -74745 383708 457964 31414 243283 71508 318485 -39948 283563
13302 617170 403913 50435 80327 290876 214882 53723 196295 -18892 182614 -33498 -171682
13291 -171682 -53333 -63896 200937 245123 -103662 -18587 206541 248374 207159 -286489 -25696
$$ packed form
13368B23870I7231e0957n9631B28757K86393B07320b8404B0005h9585B59005j12167
13357A46838L4061L7936a82393e8270C40777A53942G476L52619r5902q9907J86462
13346C60748a1356A82341J53839j12410K13423j19120j35189J80047m8235n2482
13336B62214j02970b9584B14433p2231L02998j72562I9224J75443K48915d2864
13325a22619d4429D19507A07269Q5270k7594O0615A4500J01260R0656N979j9547
13314A92848I3948M3137g4745C83708P4256C1414K11869G1508K46977c9948B83563
13302F17170k13257E0435K9892K10549p5994E3723J42572a8892A82614c3498j38184
13291a71682e3333j0563B00937M4186a03662a8587B06541M1833m1215b86489b5696
$$ plain form
13279 -119183 202669 353192 137258 206404 -177835 251400 171650 -231274 22308 471923
13269 471923 -176238 484350 306282 -59374 -91120 -265203 -163034 254383 308888 131657
13258 287962 41991 3127 72118 89283 -124014 183887 161165 738 -359936 83852 -72128
13246 -218935 -114073 89757 94886 98920 231805 152608 129134 -159132 24755 256888 390152
13235 390152 330254 -36716 26320 547807 -253987 -39231 71456 -100583 -110620 205849 99903
13223 262581 -65171 104773 -19811 213771 -29626 4476 207232 -175891 -63069 52355 42468
13212 42468 87856 209156 -52527 10764 185704 -201002 -1250 -277996 225591 45040 -68020
13200 145234 130810 -208763 -73333 78418 103547 -47545 49299 384530 -174868 -48528 225456
$$ packed form
13279a19183B02669J50523A37258O9146a77835B51400p9750b31274B2308M49615
13269D71923a76238D84350j78068e9374l1746j74083J02169B54383N4505A31657
13258B87962D1991C127O8991J7165a24014A83887k2722G38c59936H3852g2128
13246b18935J04862H9757N129M034J32885p9197k3474a59132B4755K32133J33264
13235C90152n9898c6716B6320N21487b53987c9231G1456a00583j0037B05849I9903
13223B62581f5171A04773a9811B13771b9626D476K02756a75891f3069E2355r887
13212D2468M5388J21300e2527A0764J74940b01002a250k76746B25591D5040f8020
13200A45234j4424b08763g3333G8418K5129d7545D9299L35231a74868d8528B25456
$$ plain form
13188 -37351 76028 -29273 147912 230298 -86432 216766 -131588 244363 278002 -34789 -15594
13176 151912 266068 -19353 150456 -72677 -8377 52933 80299 -446815 324356 52236 56061
13165 56061 2570 -10370 198675 133662 180727 98741 -229408 -486020 192648 384887 66809
13153 416429 245723 190559 247893 212259 -75032 440405 76048 -210480 -112462 9730 128571
13142 128571 -273407 181314 33123 175997 -527386 -132577 109297 193321 151391 -156128
13131 270058 -50773 207852 -105559 -23161 -163780 181041 98162 184509 230690 -173994
13120 150248 58278 109211 204305 -146737 -149466 -175895 165801 -220600 -349781 -26802 40503
13108 -28025 195995 101246 50582 203825 -60092 334697 -273094 491579 16319 192922
$$ packed form
13188c7351G6028b9273A47912Q2386h6432B16766a31588B44363L3639c4789a5594
13176A51912J14156a9353A50456g2677h377E2933K7366d46815C24356E2236L825
13165E6061B570a0370A98675o5013M7065q1986b29408k56612A92648J92239F6809
13153D16429j70706n5164N7334l5634g5032D40405G6048b10480R8018I730J18841
13142A28571b73407A81314C3123J42874e27386a32577A09297Q4024m1930a56128
13131B70058e0773B07852a05559b3161j40619A81041q2879Q6347M6181a73994
13120A50248E8278N0933R5094a46737k729k6429A65801b20600j29181b6802D0503
13108b8025A95995r4749E0582J53243f0092C34697b73094D91579A6319J76603
$$ plain form
13098 192922 17329 1785 -97025 144342 -26524 167747 368032 272299 153899 194710 236033
13087 236033 -109813 -167764 217737 -38943 100875 -237847 -9646 -26717 108149 -70971 -129190
13076 -129190 -137782 393988 192620 -10009 -73805 11147 -33777 -82446 414337 -96336 -107326
13065 -107326 -56436 287813 17048 31992 -6959 -134109 -33268 274877 -223537 54451 92893
13054 92893 145784 -155216 270660 137088 63055 158834 299939 -5754 -37203 -117289 -159936
13043 -159936 -129374 65405 -121183 218884 159774 132159 79254 184486 -92899 291011 100777
13031 110910 129898 -101698 61212 -83153 325060 377937 82394 -192985 -51919 18896 -137861
13019 69647 -41141 59391 -197306 442863 48019 151650 70419 220262 205750 -108659 336101
$$ packed form
13098A92922A7329A785i7025A44342b6524A67747K00285r5733j18400M0811M1323
13087B36033a09813n7951B17737c8943A00875b37847i646j7071A08149g0971n8219
13076a29190q592C93988A92620a0009o3796A1147c3777m8669D14337i6336j0990
13065a07326N0890B87813A7048J4944f959j27150c3268B74877b23537E4451L8442
13054I2893N2891a55216B70660j33572F3055R5779J41105e754l1449q0086m2647
13043a59936L0562F5405a21183B18884n9110k7615n2905J05232i2899B91011A00777
13031A10910J8988a01698F1212h3153C25060N2877H2394a92985e1919A8896a37861
13019F9647d1141E9391a97306D42863D8019J03631G0419J49843j4512a08659C36101
$$ plain form
13007 19809 -369620 27408 -97089 -15238 -37893 128792 -117914 276612 299776 281627 -1224
12995 -74669 22140 19381 -202370 -65554 82318 19058 148263 261791 -17755 1173 -193531
12983 280354 -179068 237547 53228 -67295 63083 -71630 162273 -36391 181305 46290 -56576
12971 215847 -16412 -78657 -126355 147188 300646 13151 74753 -113962 67072 -68452 72289
12959 164586 -55991 -5159 -164765 -150477 -184622 -66108 -141985 23067 -73180 -51873 -214195
12948 -214195 357419 72002 71451 -9538 22720 305099 -389249 -85631 -132054 70302 -74899
12936 -10898 122251 344357 -78778 -53686 180116 -420055 116667 126574 268836 177808 -188972
12924 -178239 96981 -103822 118431 -63445 -583 237525 179421 88204 116454 -10245 17232
$$ packed form
13007A9809c69620B7408i7089a5238k2655A28792a17914B76612K3164j8149a224
12995g4669B2140k759b02370f5554H2318A9058J29205J13528a7755A173a93531
12983B80354a79068B37547E3228f7295F3083g1630A62273c6391A81305D6290e6576
12971B15847a6412o2245m7698A47188J53458A3151O1602a13962F7072f8452G2289
12959A64586e5991e159j59606J4288l4145f6108p5877B3067g3180K1307j62322
12948b14195C57419G2002n51i538B2720K82379c89249h5631m6423G0302g4899
12936a0898A22251K22106g8778K5092A80116d20055A16667R907J42262r1028a88972
12924a78239I6981a03822A18431f3445e83B37525n8104H8204K8250a0245A7232
$$ plain form
12912 -179007 -82200 258783 -218825 151547 -18165 81151 107983 85695 -83515 358511 47786
12900 -76267 -154906 -80684 68859 -129943 -351398 -47970 -141902 -231126 -243514 -153504 -68920
12888 422464 -135286 48294 126863 5861 -168852 -123793 -249974 69752 -118602 85504 229580
12877 229580 -31411 18597 63756 624128 16008 2712 14476 -280659 27710 484884 241524
12865 -138095 -291153 -37248 265873 51123 75179 114587 53926 183457 -7996 -448293 -47121
12853 -203571 150533 75856 -133072 -153257 308890 141497 -275102 -39628 11018 47698
12843 47698 -53085 -371819 -60886 -60107 173708 278061 105948 193396 -64255 -13229 -13621 82344
12830 -7216 -29363 -199148 -35168 -159458 188291 310453 -85474 162046 -45780 34860 -110565
$$ packed form
12912a79007h2200B58783b18825A51547a8165H1151K6832k2288h3515C58511D7786
12900g6267p8639P4222F8859a29943k21455d7970r3932q9224j2388R0010f8920
12888D22464a35286D8294P8569E861a68852M5059j26181F9752a18602H5504J44076
12877B29580c1411A8597M5159N60372A6008B712J1764b80659B7710M57174B41524
12865a38095j53058c7248B65873E1123K4056L9408E3926J29531g996m40297d7121
12853b03571A50533p4677a33072k0185C08890A41497b75102c9628A1018L6680
12843D7698e3085l18734f0886P79A73708J04353A05948Q7448f4255a3229l92H2344
12830g216k2147j69785c5168j24290A88291J22162h5474A62046d5780C4860a10565
$$ plain form
12818 308795 66033 577449 -52684 -212260 -190825 109180 255275 -213904 79149 -112192
12807 199378 225488 28497 -206159 -60036 -162373 -90765 -37754 159168 29685 -71815 49166
12795 144773 86404 266044 23410 -46290 23617 -254006 -126663 -196380 180418 -24397 121019
12783 -200125 21971 -136142 -41838 141312 -37458 -548035 317562 -66929 41241 41787 -79225
12771 116668 55168 149602 32467 -76907 -91166 -104755 -398422 -70936 297513 -91379 -228595
12760 -228595 -137664 70122 287935 -109977 204813 -146909 -44709 200338 103175 26121
12749 68988 -158108 -133207 -359530 224173 210324 -193793 -200286 72112 -5818 57928 39889
12738 39889 101749 -180039 -61454 -28322 85566 240747 33007 34482 120485 -39167 -119918
$$ packed form
12818C08795F6033N11416e2684j59576K1435A09180J46095b13904G9149a12192
12807A99378K6110B8497b06159f0036j02337P1608c7754A59168B9685g1815D9166
12795A44773n8369J79640B3410d6290B3617b54006a26663o9717A80418b4397A21019
12783b00125B1971a36142d1838A41312c7458n10577C17562f6929D1241N46g9225
12771A16668E5168R4434C2467g6907j4259j3589k93667g0936B97513i1379j37216
12760b28595R0931G0122K17813a09977B04813a46909d4709B00338r7163B6121
12749F8988a58108K4901k26323B24173j3849a93793o493G2112e818E7928j8039
12738C9889O1860a80039f1454b8322H5566J55181C3007J475Q6003c9167q0751
$$ plain form
12727 -119918 142729 259090 -90330 114474 -26723 -42562 189971 246349 167439 -246148
12716 -17015 -88962 186095 47290 -337784 305342 -2627 -18516 158678 373164 363157 145789
12704 118238 499184 260208 97843 -24938 -119090 -115635 -49658 -97427 79351 -89015 15366
12692 183157 214926 370755 -61610 73632 57210 -326870 76657 -130815 179138 39916 -42262
12680 165723 -13598 10201 126160 157345 49751 327072 325505 -224840 -33157 301658 -187957
12668 -87135 -37880 150464 33202 185468 2338 61365 64699 225270 34891 -63462 68478
12656 328143 -35252 140901 -94132 101286 210471 122550 159303 216289 407583 -45955 -202572
12645 -202572 -58031 -139778 166903 54489 56795 -80485 23640 29227 54598 41707 125682 376010
$$ packed form
12727a19918A42729J16361i0330A14474b6723j5839A89971N6378p8910b46148
12716a7015p1947A86095D7290c37784C05342b627j5889A58678K14486j0007A45789
12704A18238L80946k38976I7843b4938r4152L455d9658m7769G9351h9015A5366
12692A83157L1769J55829f1610G3632j6422c26870G6657a30815A79138C9916d2262
12680A65723a3598A0201J15959L1185D9751K77321j567b24840c3157C01658a87957
12668h7135c7880A50464C3202J52266B338N9027L334J60571C4891f3462F8478
12656C28143c5252A40901i4132A01286J09185q7921L6753N6986J91294d5955j56617
12645b02572e8031q1747A66903E4489K306h0485B3640N587K5371j2891Q3975K50328
$$ plain form
12633 376010 90342 126280 -12847 154633 419489 72635 -165201 -4654 332146 3154 -129302
12621 252222 39634 197259 -142850 132658 -28791 -42064 -82883 -293557 118449 233048
12611 233048 -7521 -46179 64034 -33401 98236 172909 104567 193761 -42746 176121 69168
12599 410742 65569 182620 172464 219493 -7104 -164882 78328 104851 -65280 -142687 -179468
12588 -179468 387428 -60425 -83879 -14879 35411 -41763 194779 -72959 113584 -307332 -104677
12576 61687 138923 189620 -85635 -263594 66078 98253 87590 70617 107843 -27736 -54880
12565 -54880 295397 -32447 196539 56140 -46192 -56349 -96572 -43191 -299495 -31314 66005
12553 124958 -16087 -212489 125925 -304498 -91237 -96564 12011 -50401 -57057 14356 -64434
$$ packed form
12633C76010I0342L5938a2847A54633K64856G2635a65201d654C32146C154a29302
12621B52222C9634J57625a42850A32658b8791j3273m0819k10674A18449J14599
12611B33048g521l8658F4034c3401I8236P4673o8342Q9194d2746A76121F9168
12599D10742F5569J17051j0156M7029g104j57778G8328K6523f5280p7407l6781
12588a79468C87428f0425k3454a4879C5411d1763A94779g2959A13584c07332a04677
12576F1687P7236N0697h5635j77959F6078L2175j0663j6973L7226b7736k7144
12565e4880B95397c2447A96539E6140d6192j0157m0223d3191k56304c1314F6005
12553A24958a6087j96402A25925c04498i1237n327A2011e0401o656A4356f4434
$$ plain form
12541 86272 -136292 -115438 126242 57056 -82331 -9696 -55996 -208533 -119131 369543 315666
12530 315666 128858 -213190 138072 -56342 116075 -33106 86514 371796 -122486 133179
12519 -61512 1522 -124418 179878 71318 294262 209990 99547 -108772 109298 158173 55609
12507 59042 -112461 63034 37441 -98310 201014 -115593 89622 -263984 114600 85571 15777
12495 186405 303397 -137566 -288101 823 -91208 94540 -34659 -241473 -391978 4795 57994
12484 57994 -197605 46740 115447 -120164 -144119 -138122 121834 -161934 -283577 260074 -89824
12472 -8096 -72628 -299562 -60024 41642 100722 -22037 -233308 104492 156527 149207 2132 -353456
12459 -113459 125600 28651 -55603 10403 185594 126380 -172117 -216890 155600 111271 76970
$$ packed form
12541H6272a36292K0854A26242E7056h2331i696m6300j52537Q9402C69543n3877
12530C15666A28858b13190A38072e6342A16075c3106H6514K85282a22486A33179
12519f1512A522a24418A79878G1318K22944q4272I9547a08772A09298M8875E5609
12507E9042a12461F3034k5593i8310B01014a15593H9622b63984A14600k9029A5777
12495A86405J16992a37566j50535H23i1208I4540c4659k06814j50505D795N3199
12484E7994a97605D6740O8707a20164k3955N997A21834a61934j21643B60074h9824
12472h096o4532k26934f0024D1642N9080b2037k11271A04492N2035p320B132c53456
12459a13459A25600B8651e5603A0403J75191n9214a72117m4773A55600m4329l4301
$$ plain form
12448 76970 -51666 -3245 -33074 302777 -104112 -10275 66381 149032 -71523 108826 -205329
12436 89486 -153456 70430 32768 -96626 70115 -245805 -475142 446573 178747 -187701
12425 -40957 -177368 103319 -46696 168917 -78045 95516 -114088 98453 -116640 239645
12414 37240 51482 21096 -22835 -129706 110693 -289328 -103130 -105430 16220 -301311 196462
12402 -18867 125218 -131422 214207 111866 309158 -218371 -205862 165841 -153917 -97522
12392 -97522 123816 110574 -165044 72764 -3423 10416 -450474 94103 -282380 95734 47008
12380 -282556 157128 -96651 145821 56063 185934 3123 -147416 289830 -314672 44935
12369 -191591 -88192 122738 -86368 59910 99572 -74233 -170297 -66857 28111 134023 -108184
$$ packed form
12448G6970e1666c245k9829C02777a04112a0275F6381Q2651g1523A08826b05329
12436H9486a53456G0430C2768i6626G0115b45805k29337D46573A78747a87701
12425d0957j36411A03319d6696A68917g8045I5516a14088I8453a16640B39645
12414C7240J4242B1096b2835j06871A10693b89328a03130k300A6220c01311A96462
12402a8867A25218a31422B14207j02341J97292b18371J2509A65841a53917N6395
12392i7522A23816j3242a65044G2764c423A0416d50474I4103b82380I5734D7008
12380b82556A57128i6651A45821E6063J29871C123a47416B89830c14672D4935
12369a91591h8192A22738h6368E9910L9662g4233r6064f6857B8111J05912a08184
$$ plain form
12357 -193833 279469 -202228 204468 -99564 42550 -78181 -153875 155112 138157 -110970
12346 44726 97285 -247271 408525 12552 66630 11396 22860 -9662 284285 -106643 -54783
12335 -54783 -204476 369323 20280 -145525 -147344 51905 -174140 79215 -151162 -100644 54743
12323 43234 130487 159225 282584 -55812 -176362 -322959 182841 307834 131517 50690
12312 -14784 26195 222263 -56808 69552 -349115 145516 5493 -55813 -61178 -194046 -322697
12301 -322697 35784 98056 151966 -100328 -82031 -30667 -191882 2104 -383369 39267 -120537
12289 23390 68368 5587 730 -279741 270038 89855 -17465 107344 99650 7741 529186 301936
12277 301936 214428 412155 276672 127229 114847 124489 194416 211088 258186 226997 -25791
$$ packed form
12357a93833B79469b02228B04468i9564D2550g8181p5694A55112j6955a10970
12346D4726N2559b47271D08525A2552N4078A1396J1464i662B84285a06643N1860
12335e4783j49693C69323B0280a45525j819E1905a74140G9215a51162N0518E4743
12323D3234Q7253K8738J23359e5812j20550j46597A82841J24993A31517E0690
12312a4784B6195J96068e6808F9552c49115A45516E493e5813n365j32868j28651
12301c22697C5784O2272N3910a00328J8297c0667j61215B104c83369C9267a20537
12289B3390M4978E587G30b79741B70038H9855a7465A07344p694G741N21445k27250
12277C01936q7508J97727j35483A27229j2382R642O9927J6672M7098l1189b5791
$$ plain form
12265 -109301 355838 170189 -3735 -86094 267111 1663 -138252 313838 -179663 -151444 -335965
12254 -335965 135209 135636 392872 -121259 248081 295782 -64704 246886 327384 119353 155356
12243 155356 -32358 214006 254806 -104074 402787 -28352 387880 94252 444968 -89572
12232 151531 -35325 -40822 -64253 127851 171769 243137 205584 79437 166415 588468 253695
12220 69447 46119 449782 171967 23519 -278225 178456 267781 -125240 -18338 274144
12209 106100 168096 -138008 213573 -31833 9684 67037 207036 -122528 -107144 167547 188121
12198 188121 388929 282002 93355 315401 276236 237586 -186200 -20801 33360 261300
12188 261300 226847 1097 11119 126065 -4710 264694 123758 148906 -134833 360569 168472
$$ packed form
12265a09301C55838A70189c735q2359B67111A663a38252C13838a79663K8219j84521
12254c35965A35209M27K57236a21259B48081M7701f4704B46886Q0498A19353L6003
12243A55356c2358B14006M0800a04074D02787b8352C87880I4252L50716h9572
12232A51531c5325n497k3431A27851M3918P1368l7553G9437Q6978M22053B53695
12220F9447k3328M03663A71967B3519b78225A78456Q9325a25240a8338B74144
12209A06100O1996a38008B13573c1833I684N7353J39999a22528J5384A67547K0574
12198A88121K00808j06927I3355K22046l9165l8650a86200b0801C3360K27940
12188B61300l4453A097J0022J14946d710B64694A23758K5148a34833C60569A68472
$$ plain form
12176 -156987 370945 175435 -167943 13561 -56119 396481 -192152 86951 -124683 -17809
12165 60165 286813 174504 -121962 120346 -32717 158386 -13577 24405 -3362 -110189 -192259
12154 -192259 37829 -115055 151858 82772 185698 382702 -37338 -213879 -69506 247779
12143 185231 349797 -162076 -342539 94322 114171 -227039 8148 -333117 269712 333386
12133 333386 -71164 171015 -56057 -114064 63388 198952 -171027 216614 -41564 318654
12122 -269693 179032 130164 317857 -47919 192380 -195363 89806 52096 160345 25411
12111 104331 -197909 209904 193596 -364693 -292966 -142197 -55010 -199705 49355 -122027
12100 -215370 198056 349567 -132143 192610 6162 24728 -77305 67853 -15776 179933 32249
$$ packed form
12176a56987C70945A75435a67943A3561e6119C96481a92152H6951a24683a7809
12165F0165K26648j12309a21962A20346c2717A58386a3577B4405c362j06827q2070
12154a92259C7829a15055A51858o9086J02926J97004c7338j76541f9506B47779
12143A85231J64566a62076j80463I4322J9849b27039H148c33117B69712O3674
12133C33386g1164A71015e6057n8007F3388J35564a71027B16614d1564C18654
12122b69693A79032m8868J87693d7919A92380a95363H9806l7710J08249B5411
12111A04331a97909B09904j6308c64693P1727a42197e5010j44695D9355a22027
12100b15370A98056J51511a32143A92610F162J8566g7305F7853a5776A79933C2249
$$ plain form
12088 -74376 -173051 211350 -112096 178193 192189 -247329 114855 82605 560538 422422
12078 422422 1451430 1894680 354003 350011 65588 -211139 -398697 -86633 -185990 -178187 -71957
12066 60020 -59209 99898 -32636 -205671 127642 103195 -3522 -107778 -36353 114553 5855
12054 -22664 115266 -30238 -326451 -247883 278674 63588 -566 -267343 -145222 118460 60787
12043 60787 60779 263780 -164022 -35839 -159131 106498 -239047 -80616 218130 -160205 -105737
12032 -105737 71296 -82891 -29913 -235447 -166615 -5794 -13819 65531 -99979 30630 115041 498
12019 -323782 -52360 -123953 -171224 -10688 2913 101848 -105043 230753 137462 181087 161044
12008 161044 171566 54723 -139946 -152974 -220960 141557 -141502 116606 134186 310040
$$ packed form
12088g4376r8675B11350a12096A78193J3996b47329A14855l2250M77933j38116
12078D22422J029008M43250C54003l992F5588b11139j87558h6633r9357P803g1957
12066F0020e9209I9898c2636j73035A27642k4447c522j04256c6353A14553E855
12054b2664A15266c0238k96213P8568B78674F3588e66k66777J22121A18460n7673
12043F0787qK03001a64022c5839j23292A06498b39047h0616B18130a60205N4468
12032a05737G1296h2891b9913k05534O8832e794q025F5531i9979C0630Q4411D98
12019c23782e2360p1593m7271a0688B913R8935a05043B30753r3291M3625k0043
12008A61044J0522E4723a39946j3028o7986A41557a41502A16606J7580J75854
$$ plain form
11998 310040 63182 -61624 -82760 145875 96297 -105241 -302638 -91589 47446 -163252 -369337
11987 -369337 -61666 5617 63481 -19276 -236551 -164260 -98464 185155 -31975 -176829 -238217
11976 -238217 252184 66729 -101172 -11068 -109257 200815 166638 166240 -131783 -270844 -204341
11965 -204341 -33476 55490 -62180 22221 -14636 114853 -1422 123646 4862 -147916 -29951
11953 569727 -303937 -202422 -48784 -58741 -92974 61484 228360 -207785 85438 -75385 -261189
11942 -261189 223299 -134424 47607 174018 -313450 84300 90419 -80450 111267 -102613
11931 -182259 181655 35703 -98391 -50827 -189389 72088 74560 214140 -114227 -282197 -4994
11919 259490 165704 115244 165444 -36901 -109375 -374063 -52261 127087 -45752 -229878 238870
$$ packed form
11998C10040F3182f1624k1136A45875m9578a05241j97397i1589D7446a63252k06085
11987c69337f1666E617N7864a9276k17275P2291O5796A85155c1975j44854o1388
11976b38217B52184F6729a01172a1068r8189B00815l4177l98a31783j39061O6503
11965b04341c3476E5490f2180B2221a4636A14853a422A23646D862a47916b9951
11953E69727c03937J01515d8784r957l4233F1484J66876b07785H5438g5385j85804
11942b61189B23299a34424D7607J26411c13450H4300O119h0450A11267a02613
11931a82259A81655C5703i8391M7564j38562G2088K472J39580a14227j67970d994
11919B59490r3786n0460N0200c6901p2474k64688e2261A27087d5752j84126B38870
$$ plain form
11907 -154396 72799 -122573 -50144 -9927 240186 169159 -198409 -208449 -288170 -348998 -183608
11896 -183608 -33498 -23009 -80464 132268 33400 184525 21675 -95099 -51151 94535 -90874
11884 -64082 -224342 -121393 46589 -115519 -212560 -38048 62810 -103894 -219382 252937
11873 -121169 50295 -136758 -62029 -33458 33699 145361 121429 -216980 -25898 359392 315
11861 -117892 67499 -345728 -288555 110419 -115297 -175578 -100920 -319242 -20444 -174548
11851 -174548 65235 -37383 74560 -139569 201599 61761 -84299 57583 92848 52894 -189731
11839 -280304 235470 -73105 -189785 98591 229136 -156613 4612 -154222 -98429 4856 -179012
11827 -136701 -43065 249975 -380191 -175014 52428 227843 247691 -133926 86438 -211944
$$ packed form
11907a54396G2799a22573e0144i927B40186p1027a98409j0040p9721o0828J65390
11896a83608c3498J0489n7455A32268C3400J51125B1675i5099M3948I4535i0874
11884f4082j60260J02949D6589a15519r7041c8048F2810a03894j15488B52937
11873a21169E0295a36758f2029K8571C3699J11662k3932b16980b5898C59392C15
11861a17892F7499c45728N7173A10419a15297o0281P4658k18322b0444j54104
11851a74548F5235c7383G4560a39569B01599F1761h4299E7583L5265l9954a89731
11839b80304B35470g3105j16680I8591J30545a56613D612a54222N5793D856a79012
11827a36701d3065B49975c80191a75014E2428J75415J9848a33926H6438b11944
$$ plain form
11816 -236064 39327 -20378 -188291 -50387 -71485 -349488 127221 -287767 -5034 -257922 -415729
11805 -415729 153672 -287493 256253 -72094 105146 11239 -51990 -75930 -123303 -30719 -298014
11794 -298014 -60996 -17490 166383 -333836 -91905 22168 151228 101060 129777 -210825 37630
11782 -56702 152566 -151877 -343897 124909 47180 9875 -93965 18572 -140038 45555 183884
11771 183884 142947 -145183 -41631 -43534 -108716 41896 223452 -76758 27121 -81359 -82717
11760 -82717 -144875 114460 57414 -333553 -154805 -225473 -204278 -484632 -240154 263335
11749 28629 18697 131926 223576 49663 2568 216876 -12983 -78052 -59979 -81456 -61526 44812
11736 -34087 80176 229303 20520 58071 70960 -96165 128209 144603 252452 -66172 127656
$$ packed form
11816b36064C9327b0378j67913e0387k1098k78003A27221b87767e034k52888j57807
11805d15729A53672b87493B56253g2094A05146A1239e1990k3940m7373c0719k67295
11794b98014f0996a7490A66383c33836i1905B2168J29060n0168K8717b10825C7630
11782e6702A52566a51877j92020A24909D7180I875i3965A8572a40038D5555J38329
11771A83884m0937a45183d1631j903o5182D1896J81556g6758B7121h1359j358
11760h2717o2158A14460n7046c33553a54805p0668K1195k80354b40154B63335
11749B8629r932J13229R1650D9663B568K14308a2983o5069J8073k1477J9930D4812
11736c4087H0176J49127B0520L7551J2889i6165A28209J6394J07849f6172A27656
$$ plain form
11724 -22586 -157357 -184118 269944 28328 230155 -7105 53099 -3873 17021 246846 11424
11712 -200108 97184 65336 222136 -24484 40972 -121992 -101915 -107410 -8375 -186374 376964
11700 409011 7207 -337476 -64088 185804 318366 -105234 -236116 110595 -150995 201850
11689 214912 -245786 -333226 51051 -180332 20689 151557 69466 -84227 10780 -57480 -16941
11677 -311992 209132 7387 -223446 -70334 15777 501647 -30815 35714 204690 -11800 267398
11665 -166813 -337332 386401 94368 237116 -81456 -124464 52374 158465 258321 -30798 61515
11653 112960 -150595 -102433 49244 -272162 74569 128998 50604 -81064 98696 -120501 -33924
11641 -100699 212320 -116186 90897 137067 173179 -183313 301369 91697 18219 -3495 -103509
$$ packed form
11724b2586j34771k6761B69944B8328K01827g105E3099c873A7021K29825A1424
11712b00108I7184l1848J56800b4484D0972a21992K0077n495h375j77999C76964
11700D09011G207c37476f4088A85804J32562a05234j30882A10595a50995B01850
11689B14912b45786q7440E1051a80332B0689J30868F9466h4227A0780e7480a6941
11677c11992B09132G387b23446g0334A5777M85870c0815C5714J68976a1800B67398
11665a66813j70519C86401I4368J42748h1456m3008E2374J06091R9856c0798F1515
11653A12960a50595M8162D9244b72162G4569N4429E0604h1064I8696a20501c3924
11641a00699B12320a16186I0897M6170L6112a83313C01369I1697A8219c495j00014
$$ plain form
11630 -103509 316367 285672 -210302 122118 95847 -74049 -47508 138720 -15632 32292 -276789
11618 34405 128224 200047 393033 -142657 -77037 -126137 68653 -56544 -60619 -101171 181936
11606 -184991 -132867 190711 190551 -22986 130676 9718 140250 1274 148620 -342186 103521
11594 347976 296272 111456 -52300 45499 139301 -215663 342271 383578 433728 289097 355831
11583 355831 65040 70738 -61557 34718 85457 216944 95964 71086 376203 -31487 -257350
11572 -257350 -79498 292578 -139403 -42000 364078 80985 -112786 31631 -239042 272533
11561 186037 188989 397884 36108 -17405 -42290 194858 -29430 71331 57326 91804 -29379
11549 74186 -120254 -151628 88773 -76855 177164 -857 15599 446988 216955 150936 165010
$$ packed form
11630a03509C16367l0695b10302A22118k6271g4049K6541A38720a5632C2292b76789
11618C4405R3819P1823J92986a42657O5620m9100F8653e6544m075m0552A81936
11606a84991N2124A90711j60b2986A30676I718J30532A274J47346c42186A03521
11594C47976n1704A11456e2300D5499R3802b15663C42271M1307N0150j44631O6734
11583C55831F5040N698f1557C4718N0739J31487I5964k4878L05117c1487k25863
11572b57350g9498B92578a39403d2000C64078H0985a12786C1631b39042B72533
11561A86037K952K08895C6108a7405k4885A94858b9430G1331j4005L4478b9379
11549G4186a20254l1374H8773g6855A77164h57A5599M31389B16955o6019J4074
$$ plain form
11538 165010 205136 -24086 91488 160698 295486 49077 267823 144064 149053 196131 -132472
11526 65297 -76871 -243092 46534 -54603 349343 344677 -14001 13681 138984 25892 63752
11515 63752 -83987 75822 120120 92652 -45782 278510 607387 -90893 122804 -155845 219577
11503 230970 242533 502888 168415 573632 92876 233496 116591 120649 101479 -329642
11492 234862 145503 219087 11354 37154 153597 -267957 84937 363949 -59997 -21638 -84749
11481 -84749 324253 159870 147834 66376 127632 182908 381798 15425 219988 -117290 -144428
11470 -144428 273358 233747 87130 121492 422285 223632 90925 138206 274890 -32106 -184228
11459 -184228 -147670 -19943 43286 179924 129447 -54150 215028 -85819 180976 286217 282736
$$ packed form
11538A65010M0126b4086I1488O9210J34788D9077K18746j23759M989M7078a32472
11526F5297g6871j66221D6534e4603C49343m666a4001A3681J25303B5892L7860
11515F3752h3987G5822M4298k7468d5782B78510L28877i0893A22804a55845B19577
11503B30970J1563K60355A68415M05217I2876J40620A16591M058j9170c29642
11492B34862q9359P3584A1354K5800J16443b67957H4937K79012e9997b1638o3111
11481h4749C24253A59870j2036F6376O1256N5276J98890A5425K04563a17290k7138
11470a44428B73358l9611H7130L4362L00793j98653I0925M7281J36684c2106j52122
11459a84228L6558a9943D3286J36638n0477e4150B15028h5819A80976J05241l481
$$ plain form
11448 282736 -31409 314951 -123628 29294 166357 81279 -17389 195196 -53011 -52658 95970
11436 226947 159125 58614 287333 -156347 182730 -38346 -27472 -278478 -166752 -21166
11425 -267282 259777 -56308 -141933 84300 131102 336185 155112 96491 206114 209434 183809
11414 183809 193776 38925 84075 -169434 -91708 -143898 -161108 120466 -103417 -38589 -125543
11403 -125543 253361 45459 304261 41911 -226577 16568 -127694 -39643 -308590 -22962
11392 174107 -29099 -198230 -65000 -69198 -392432 146681 138740 -69016 -219340 349664 142601
11380 159974 22715 387771 -10994 -52176 62502 97872 91526 118091 -88443 202153 225924
11369 225924 4493 -52197 -191795 -42929 -45282 35853 -24705 -3178 -133620 -81626 120499
$$ packed form
11448B82736c1409C14951a23628B9294J37063H1279a7389A95196e3011L53I5970
11436B26947o7822E8614K28719a56347A82730c8346J0874k51006J11726b1166
11425b67282B59777e6308q5625H4300M6802K05083A55112n8621J09623L320k5625
11414A83809R967C8925M5150a69434P7726n2190j7210A20466a03417c8589q6954
11403a25543B53361D5459K58802D1911b26577A6568a27694c9643k68947b2962
11392A74107b9099j69131f5000m198l23234A46681p941f9016j50324C49664A42601
11380A59974B2715L65056a0994m1182F2502L5370o346K6565h8443B02153K3771
11369B25924D493e2197j39598d2929k353C5853b4705c178j30442N1994A20499
$$ plain form
11357 -12070 56229 -49494 139376 81802 151233 -188690 -88448 -174049 161582 523 84406
11346 84406 -10759 40032 67653 107159 223833 284024 -71717 -45698 -146805 202081 -195309
11334 -31218 -36580 120599 212374 -212461 -10184 160273 12595 99635 -53250 -218567 -373838
11323 -373838 241565 -142984 63608 -172847 124538 863 187018 19829 -46982 -75569 17321
11311 -134700 277842 -77656 -80374 190461 -47675 -84893 -402399 -18031 -119892 -254477 -181952
11300 -181952 95740 94943 279850 -17668 69400 94287 -139958 -98721 -87076 -235386 187718
11288 59853 55237 21478 -41621 -97630 -302509 -30052 41682 -81583 -47006 205080 43342
11276 125280 81914 -168230 167516 -464621 123452 -112129 -293502 93501 182020 136295
$$ packed form
11357a2070E6229d9494A39376n7574O9431a88690h8448q5601A61582E23Q3883
11346H4406a0759D0032K7621L9506J16674O0191g1717K6019j01107B02081a95309
11334c1218n362A20599R1775b12461a0184A60273A2595Q7040e3250j65317j55271
11323c73838B41565a42984F3608a72847A24538H63J86155A9829d6982k8587A7321
11311a34700B77842g7656k718A90461d7675l7218l17506a8031j01861j34585P2525
11300a81952I5740p97J84907a7668F9400K4887a39958M1237J1645j48310A87718
11288E9853m616B1478d1621n6009k04879c0052D1682h1583L4577B05080D3342
11276A25280m3366a68230A67516d64621A23452a12129j81373I3501Q8519m5725
$$ plain form
11266 136295 -63288 -6195 -109994 -25895 -81796 -14069 622 190631 -81216 -153188 -33185 -214645
11254 -214645 -339504 -87640 -136565 -274445 -296395 -327846 -41388 61780 -219973 -142465 -29662
11242 -55557 85448 180349 504 -348429 241318 115727 285815 -243562 -152122 -313605 -15519
11230 148599 -66126 -74984 113053 198970 137525 -119739 9550 9747 92984 -185322 237143
11218 128371 -365075 -88159 33378 1829 -29584 -63586 -26373 171209 -335496 129702 231248
11207 231248 -26690 22187 -47872 -74272 173221 -160476 -19962 54329 -190272 -82532 -64263
11196 -64263 -44569 -82961 436243 -38599 37033 -49174 -11841 -151208 83523 30550 -272228
11184 -180904 265040 -165425 381075 -149517 -186290 -114684 391588 -547440 -51967 -47168
$$ packed form
11266A36295f3288f195j03799b5895n5901a4069F22J90009h1216p1972c3185j81460
11254b14645j24859h7640m8925j37880k1950l1451d1388F1780b19973P7508b9662
11242e5557H5448R4901E04c48429B41318A15727J70088b43562R1440j61483a5519
11230A48599f6126q858A13053Q5917o1445a19739I550J97Q3237a85322B37143
11218A28371c65075h8159C3378A829b9584l4002b6373A71209c35496A29702J01546
11207B31248b6690B2187d7872k6400A73221a60476a9962E4329a90272h2532J8269
11196f4263J9694l8392D36243c8599C7033d9174a1841j39367H3523C0550b72228
11184a80904B65040a65425C81075a49517l6773P1606C91588e47440e1967M799
$$ plain form
11174 -47168 -159279 -144531 169932 728 -21178 256996 -119551 177772 -327469 -272436 106708
11162 -37889 -192614 135358 17954 27618 112040 -70517 -65645 -69644 -54910 137729 36918 40558
11150 40558 4058 90409 -82549 -190873 -55092 -213830 -57734 151335 121021 -282907 -114355
11138 -4512 327047 397600 -123350 265773 4588 -92412 -173605 -233815 -183446 -23570 161306
11126 -38579 -82397 181848 125579 16470 -241137 -12969 -4914 -153018 80445 460759 158524
11114 248378 -80414 -85775 -146934 83379 21042 23487 -6753 74023 71199 5520 169064 437217
11102 437217 47647 -43593 416066 102027 161109 19274 1498 -68752 95296 278964 243042
11091 243042 327905 267364 71746 104580 14902 354682 107128 -4111 420652 -161033 147047
$$ packed form
11174d7168j12111J4748A69932G28b1178B56996a19551A77772c27469N5033A06708
11162c7889j54725A35358A7954R664Q4422g0517M872l999J4734A37729C6918L640
11150D0558D058Q6351h2549j08324e5092j58738e7734A51335l0314b82907a14355
11138d512C27047P0553a23350B65773D588i2412q1193o0210N0369b3570A61306
11126c8579m3818A81848n6269A6470b41137a2969d914j48104H0445L80314A58524
11114B48378h0414n361o1159H3379B1042K445f753G4023k824E520J63544K68153
11102D37217D7647d3593D16066A02027N9082A9274A498f8752I5296J83668l5922
11091B43042Q4863o0541G1746L2834A4902L39780A07128d111D20652a61033A47047
$$ plain form
11079 135330 407769 251127 401482 237507 574675 529320 534042 274924 55576 219687
11069 219687 279766 273729 102360 393097 164310 429403 426522 358905 462993 718932 781279
11058 781279 556671 85811 462692 407201 272321 713241 514240 652337 767630 690185
11048 690185 544841 515071 692941 356868 586798 814319 551093 572558 626013 862080
11038 862080 446184 613336 648257 446703 476675 836231 621654 793023 681619 692427
11028 692427 604478 595684 836543 626816 864968 655226 349205 584482 800370 768022
11018 768022 688992 607333 671521 608456 365672 332501 625016 623634 369141 494922 523161
11007 523161 796281 679553 381235 558932 619153 552041 1030043 352788 620583 591554
$$ packed form
11079A35330K72439j56642J50355j63975L37168m5355M722k59118E5576J64111
11069B19687O0079o037A02360K90737A64310K65093k881o7617J04088K55939O2347
11058G81279k24608H5811L76881n5491j34880M40920j99001J38097J15293p7445
11048F90185j45344k9770J77870l36073K29930K27521k63226K1465N3455K36067
11038H62080m15896J67152L4921k01554K9972L59556k14577J71369j11404J0808
11028F92427q7949q794K40859k09727K38152k09742l06021K35277K15888l2348
11018G68022p9030q1659O4188o3065k42784l3171K92515j382k54493J25781K8239
11007E23161K73120j16728k98318J77697O0221o7112M78002C52788K67795k9029
$$ plain form
10997 591554 727682 720629 651181 618970 764261 675136 852172 683430 585398 587311 477293
10986 477293 903163 805227 944402 917319 986817 1090416 1342456 1223804 1546943 870249
10976 870249 1653455 1592676 1549937 1950838 2221147 2432474 2272933 2096715 2408069 1980866
10966 1980866 1944669 1890259 1786156 1648932 1591094 1521004 1603726 1643069 1589200 1412458 1671534
10955 1671534 1513759 1765170 2039169 1588975 1453209 773158 1141112 917230 557474
10946 557474 422449 388493 455346 61211 31894 190484 140280 171205 140713 318542 326368
10935 326368 -121292 158266 203636 80210 328886 90497 146290 -45934 104297 -88313 149890
10923 241091 226019 -143954 123436 86372 -68852 -64729 -87760 293920 -48371 187045 81878
$$ packed form
10997E91554J36128p053o9448l2211J45291q9125J77036j68742r8032J913j10018
10986D77293M25870r7936J39175k7083O9498J03599K52040j18652L23139o76694
10976H70249P83206o0779m2739M00901K70309K11327j59541j76218L11354m27203
10966A980866l6197n4410j04103j37224n7838p0090Q2722L9343n3869j76742K59076
10955A671534j57775K51411K73999m50194j35766o80051L67954k23882l59756
10946E57474j35025l3956O6853F1211k9317J58590n0204L0925l0492J77829P826
10935C26368a21292A58266M5370H0210K48676I0497N5793d5934A04297h8313A49890
10923B41091j5072a43954A23436l7064f8852M123k3031B93920d8371A87045H1878
$$ plain form
10911 56767 168401 66211 -21718 -19583 132856 22259 26341 378449 -8862 -193686 4172 67236
10899 67236 236789 17850 -59886 105312 -38542 -180115 65847 -111135 178485 167124 -123778
10887 -6366 -211333 337224 -261824 -191377 -86078 -141504 -265384 -317367 -121736 -113339 -197927
10876 -197927 -55735 -67571 -219413 86520 12602 -28537 -91939 -47174 114064 -206885 -135174
10865 -135174 63174 -175675 -148084 -125645 -109280 -49776 189589 -80050 -47937 -89946 -249487
10854 -249487 -165144 86998 -234446 37157 79892 6129 -35289 123027 153758 -70111 82419
10842 170795 50809 -2734 359936 -114187 3844 -118477 203934 108143 51615 174515 -198558
10830 -97219 213327 -39716 213056 56249 -219517 41958 -98029 -362958 92474 -12945 215459
$$ packed form
10911E6767J11634F6211b1718K135A32856B2259M082L52108h862j84824D172O3064
10899F7236J69553A7850e9886A05312c8542j41573F5847a11135A78485j1361a23778
10887f366k04967C37224b61824P0447h6078n5426j23880n1983a21736Q397q4588
10876a97927e5735j1836j51842H6520A2602b8537o3402M4765A14064b06885P1711
10865a35174F3174a75675K7591K2439J6365d9776A89589h0050L2113m2009j59541
10854b49487Q4343H6998b34446C7157M2735F129c5289A23027L0731g0111H2419
10842A70795E0809b734C59936a14187C844a18477B03934r5791E1615J22900a98558
10830i7219B13327c9716B13056E6249b19517D1958i8029k64929I2474a2945B15459
$$ plain form
10818 -330070 16343 279075 71714 49624 -232752 -136252 51386 35674 -272189 -152873 245905
10806 134129 -203560 -178414 -21891 248915 -52143 -138982 -124615 144847 -97310 -60269 -78744
10795 -78744 33224 -213391 -234449 17791 -266777 -156906 -58799 -201069 201158 264113 -76496
10783 197661 263497 -601778 -114388 -42225 -351398 105631 -59406 -32650 78560 -197485
10772 -324340 -32815 -54999 98506 179912 18786 -43479 198741 -755 -196513 -245159 88470
10760 -226616 -139280 -1404 -81404 191898 -408507 58991 -46707 138522 82943 -173646 -242104
10749 -242104 78450 -30578 -953 135485 403255 186729 -162607 34725 106073 -45842 -227075
10738 -227075 -170614 -67452 -47293 -74280 67347 -217533 -374046 -86992 -33628 -67593 -28872
$$ packed form
10818c30070A6343K62732G1714k2090b32752R6500E1386j5712b72189J19316B45905
10806A34129b03560K5146b1891B48915e2143q6839J4367A44847i7310L7041j8475
10795g8744C3224b13391k1058A7791b66777J09871e8799j42270B01158O2955g6496
10783A97661O5836f01778a14388d2225l09173A05631e9406K6756G8560a97485
10772c24340c2815k2184I8506Q1406A8786d3479A98741g55j95758m8646H8470
10760b26616Q7336a404q0000A91898d08507E8991d6707A38522n5579a73646o8458
10749b42104G8450c0578i53A35485K67770A86729a62607C4725P1348d5842j81233
10738b27075N6461f7452K0159k6987F7347b17533j56513h6992c3628l3965b8872
$$ plain form
10726 130288 103901 -62876 -47414 -204253 314786 -253933 -248882 6207 473912 -87038 4863
10714 -142833 -51333 -244471 -240922 65289 136406 48156 -90613 179870 -107382 98869 44570
10702 -239154 -62526 -112111 280509 -112788 -333680 -222080 -75668 -95637 68130 56996 112988
10691 112988 -1162 -152230 -24280 114881 186981 145943 -243241 -388772 -168601 -276587
10681 -276587 -129094 -143560 79580 73772 -104678 -14917 -90266 -143915 109461 -202360 -79058
10669 -247254 -8316 208810 197379 113930 64363 179841 149410 10821 102832 55087 -16422
10657 -386301 -58515 -225572 -251178 -207989 202707 -104262 -75430 -42159 -45378 -176036 -97114
10646 -97114 141362 104902 120689 236422 -113575 179755 -87924 174860 -71859 125844
$$ packed form
10726A30288k6387f2876J5462j56839C14786b53933N051F207M67705h7038D863
10714a42833e1333j93138L549F5289P1117D8156i0613A79870a07382I8869D4570
10702b39154f2526m9585B80509a12788k20892J11600g5668j9969F8130j1134N5992
10691A12988a162j51068b4280A14881P2100m1038b43241j45531a68601j07986
10681b76587a29094j4466G9580n808a04678a4917p5349n3649A09461b02360g9058
10669b47254h316B08810j1431q3449m9567J15478l0431A0821R2011m7745a6422
10657c86301e8515j67057k5606M3189B02707a04262K8832L3271l219j30658P8922
10646i7114A41362l6460J5787J15733a13575A79755h7924A74860g1859A25844
$$ plain form
10635 -529621 -30695 119993 -313403 -251060 -207073 -140955 82539 59781 172637 103244 -80135
10623 -195568 -293205 114597 50134 -112198 -43872 -262276 185811 -52609 -149828 -80720 -299369
10612 -299369 -194979 79130 37425 255623 74875 68580 12172 -313410 -318929 -158354 159535
10600 -42597 11034 -109650 -200154 -195233 32515 392064 -227687 -195695 -188708 -290189 -166284
10589 -166284 100888 -207467 -486 -84277 -269754 -151849 -99713 61745 378852 -15697 -132801
10578 -132801 73035 -223845 105485 -212075 -122501 -259399 8615 -132823 59899 -217799
10567 -67265 60349 -19039 75706 -60688 213973 362367 -172003 299533 -83150 231162 -195658
10555 -146376 -44389 255147 152966 -89183 70518 -151312 116444 -29439 -146626 210597
$$ packed form
10635e29621c0695A19993c13403O2343M3987O6118H2539k2758J12856o9393h0135
10623a95568r7637A14597E0134a12198d3872k18404A85811e2609r7219O9108k18649
10612b99369J04390G9130C7425K18198G4875o295A2172c13410n519a58354A59535
10600d2597A1034a09650r0504M921C2515L59549b27687L1992O987j01481J23905
10589a66284A00888b07467d86q3791j85477J17905N2136F1745L17107a5697j17104
10578a32801G3035b23845A05485b12075Q9574j36898H615a32823E9899b17799
10567f7265F0349a9039G5706f0688B13973J48394a72003B99533h3150B31162a95658
10555a46376d4389B55147j02181h9183G0518a51312A16444b9439j17187B10597
$$ plain form
10544 -304020 208947 143889 174664 -96103 -156997 -59491 -453305 161187 -11553 126792 -57033
10532 -1081 -147717 12482 39545 -169074 -215591 38644 187593 241217 295546 -154197 -266882
10521 -266882 -123682 -180242 220287 455 162503 138444 -125113 -83764 -201870 166410 45050
10509 304231 -198202 -199754 -133632 74849 -135008 -142771 29840 -327746 -42341 -48373 -173835
10498 -173835 -78353 -39330 -283339 80796 -544787 -301690 160066 -269292 -209710 -245681
10488 -245681 -348027 -302236 43828 -100090 -229488 -87692 113209 110047 -38995 332855 496383
10477 496383 809314 604456 379428 51641 58400 -27577 107857 326505 21886 4347 51791
10466 51791 -164401 297834 -244972 235280 -40964 -64692 240203 -158521 -149508 206861
$$ packed form
10544c04020B08947o5058L0775i6103o0894e9491l93814A61187a1553A26792e7033
10532a081j46636A2482K7063a69074m6517C8644J48949N3624N4329a54197j12685
10521b66882a23682n6560B20287D55J62048k4059a25113M1349j18106A66410D5050
10509C04231a98202j552O6122G4849a35008p763B9840c27746d2341o032j25462
10498a73835g8353L9023k44009H0796e44787K43097A60066b69292N9582l5971
10488b45681j02346M5791D3828a00090j29398h7692A13209l162c8995C32855J63528
10477D96383L12931k04858k25028E1641O759b7577A07857K18648B1886D347M7444
10466E1791a64401B97834b44972B35280d0964k3728B40203a58521R013B06861
$$ plain form
10455 -153523 322276 -2152 93875 264377 -186965 -175062 5684 -45781 228588 135656 2319
10443 -236874 -195711 -2068 136770 -44326 42217 157393 325680 14078 -150747 -243417 -123723
10432 -123723 -38289 213281 8874 -291075 293172 -505293 54065 -144845 -55968 -152273 51264
10420 -381620 2799 -234572 141102 -24148 251598 -26962 8836 109587 -24669 169374 -68053
10408 -253266 -202030 -77707 -88205 210824 6149 -182692 -144738 31735 -97479 -185756 76299
10396 141754 43401 101331 -182245 291274 127316 -30251 -34589 401590 -163659 64157 213359
10385 213359 164372 -51700 -302662 -325038 69953 212848 238932 116637 -41349 88667 -42635
10373 216715 434817 67278 210835 194496 371117 119814 143372 483548 228283 431312
$$ packed form
10455a53523C22276b152I3875J70502a86965J1903E684d5781B28588r2932B319
10443b36874M1163b068A36770d4326D2217J15176J68287A4078a50747r2670J19694
10432a23723c8289B13281H874b91075B93172e05293E4065a44845e5968r6305E1264
10420c81620B799b34572A41102b4148B51598b6962H836J00751b4669A69374f8053
10408b53266N1236g7707j0498B10824F149a82692L7954C1735i7479q8277G6299
10396A41754D3401N7930a82245B91274A27316c0251m338D01590a63659F4157J49202
10385B13359m8987e1700k50962k2376F9953J42895K6084A16637d1349H8667d2635
10373B16715K18102F7278J43557j6339J76621A19814K3558L40176B28283K03029
$$ plain form
10363 431312 560015 246762 74959 279688 182805 79976 432065 -100498 230262 -163645
10352 -125612 408211 324441 474799 446041 302456 328449 329327 633795 243970 54500 453327
10341 453327 69069 500457 205347 423383 343371 5079 -25507 281288 168411 62910 -6658
10329 230499 152274 264772 -202180 13673 231416 9552 478406 217834 341004 -273044
10318 105423 -155854 -104621 -114105 -41145 189623 127888 -165134 57723 106354 52097 135667
10307 135667 356212 -65100 -87041 61911 21175 4786 212178 258716 193300 -126130 90862
10295 41706 -66907 135170 113511 -246601 45453 -50445 16075 65959 35276 98872 117131
10284 117131 -100101 83985 -370264 -72121 -229898 370380 -377584 -34971 138337 -178329
$$ packed form
10363D31312J28703B46762G4959K04729r6883G9976L52089a00498B30262a63645
10352a25612D08211q3770J50358k8758j43585K5993Q78L04468B43970E4500L98827
10341D53327F9069M31388B05347K18036q0012E079b5507B81288j12877F2910f658
10329B30499p8225J12498b02180A3673K17743I552M68854B17834J23170b73044
10318A05423a55854N1233r484d1145A89623o1735a65134E7723M8631E2097Q3570
10307A35667K20545f5100k1941F1911B1175D786K07392M6538o5416a26130I0862
10295D1706f6907A35170k1659b46601D5453e0445A6075M9884l0683O3596J8259
10284A17131a00101H3985c70264g2121j57777C70380c77584c4971A38337a78329
$$ plain form
10273 -174895 92427 -266621 -170133 119322 141308 211460 -49994 -61454 43328 -39760 -428499
10262 -428499 503242 177354 120033 392454 -72420 146350 216554 -6872 166910 262404 -75821
10250 504560 -223472 -220176 92627 -178087 -8085 -241203 -231577 229076 195081 337285 -465020
10238 -94212 16173 -112514 98480 -99679 -44861 -72472 85537 -217251 -58575 91523 -393621
10226 -251852 -193950 87590 321348 -151680 -28252 -212887 -267497 -89858 -58166 123529 -58198
10214 104150 -328056 -77436 -49171 -142280 -413900 -46349 61691 113503 -15788 276330 44407
10202 62793 -66312 -101981 49014 -52896 18345 409450 -284890 -15364 -232734 -107111 -61951
10191 -61951 77639 -65371 -345642 -154431 123621 -25322 -20217 -45612 -43154 -2579 -95627 63172
$$ packed form
10273a74895I2427b66621R6488A19322K1986P0152d9994j1460D3328c9760l88739
10262d28499E03242A77354n7321K72421g2420A46350P0204f872A66910R5494g5821
10250E04560b23472L296I2627a78087h085k33118R626B29076l3995J42204d65020
10238i4212A6173a12514I8480i9679d4861k7611H5537b17251e8575I1523c93621
10226b51852N7902H7590K33758a51680b8252j84635n4610h9858L1692A23529e8198
10214A04150c28056g7436K8265r3109k71620d6349F1691N1812a5788B76330D4407
10202F2793f6312l5669D9014e2896A8345L91105b84890a5364k17370a07111M5160
10191f1951G7639f5371k80271a54431A23621b5322N105k5395K458b579r3048F3172
$$ plain form
10178 238260 -5615 -32918 -194804 135560 -192333 -186331 263723 -414807 97278 -492280 -217309
10166 496351 -346605 107829 -177496 -115183 -314007 145267 134505 -136437 -531627 -91777
10155 -141917 -159126 24939 -130656 65436 -10561 -316824 43377 -203431 -161564 82083 -86726
10143 44327 69694 -223349 -204379 -2435 19996 -281181 162960 -76988 -113394 -130615 -110958
10132 -110958 -168659 -318416 -123385 -215088 -55511 -84560 -98832 -159029 336106 -10385 18398
10120 -110383 58135 89216 -277443 25935 71620 -353132 -8922 228566 -244314 35336 565607
10109 565607 -59380 -289395 93189 -150993 -260914 117680 -336809 30430 -425032 70030
10098 72302 -211141 -100060 -35246 66338 -314838 -40440 -9966 -362321 -84804 -9101 295222
$$ packed form
10178B38260e615k7303j61886A35560a92333O002B63723d14807I7278d92280b17309
10166D96351c46605A07829a77496O2313j98824A45267j0762a36437l95190i1777
10155a41917j7209B4939a30656F5436a0561l06263D3377b03431M1867H2083h6726
10143D4327K5367b23349J8970b435A9996b81181A62960g6988l6406j7221J9657
10132a10958n7701j49757a23385r1703e5511k9049j4272o0197C36106a0385A8398
10120a10383E8135L1081b77443B5935M5685c53132h922B28566b44314C5336N30271
10109E65607e9380k30015I3189a50993j09921A17680c36809C0430d25032G0030
10098G2302b11141a00060c5246F6338c14838d0440i966l52355h4804i101B95222
$$ plain form
10086 9085 -83550 284326 -412377 -120034 -451064 -205187 -252418 148690 41031 -97632 -73250
10075 -73250 72990 -28218 62462 -51805 31861 -125260 -50305 -281986 -274691 -362695 96026
10063 195966 -60384 69440 80186 -294924 49566 -190803 294321 -245164 171076 26419
10052 -32581 95860 254333 -170506 -57671 -94126 13358 -227623 -201356 -21266 134885 -78254
10040 -205347 -38295 259344 -69255 -341117 8012 -99765 389650 -141938 17139 196037 136392
10029 136392 -263256 -5577 -342767 -55908 -197774 -257189 82576 94176 171085 -234236 127218
10017 -29649 47396 -152843 -23289 2963 190387 -146211 -275754 115134 -46273 202667 134139
10006 134139 91473 -35738 134624 65212 -224385 15683 161951 43227 142384 183322 -96621
$$ packed form
10086I085h3550B84326d12377a20034l31030b05187m7231A48690D1031i7632K4382
10075g3250G2990b8218F2462e1805C1861a25260e0305k31681P295q8004I6026
10063A95966f0384F9440J0746b94924D9566a90803B94321b45164A71076B6419
10052c2581I5860J58473a70506e7671l6455A3358b27623K6267b1266A34885g8254
10040b05347c8295B59344f9255k71862H012i9765C89650a41938A7139J78898n9645
10029A36392b63256e577l37190e5908j41866n9415H2576J1600P6909b34236A27218
10017b9649D7396a52843b3289B963J87424a46211j29543A15134d6273B02667o8528
10006A34139m2666c5738A34624F5212b24385A5683J46268D3227R9157M0938i6621
$$ plain form
9994 -210836 219105 92195 -309201 -8451 -71837 -333346 -345514 -201111 -176275 239328 -125100
9982 -114405 -334753 -298739 -338132 160573 -183480 -252232 303708 97503 -873 143010 -274752
9970 -160480 -27907 54330 -68925 124559 146531 -26635 -127925 -134426 -86562 -364154 -338032
9959 -338032 -81384 -29876 -248802 -60255 -132871 -48182 35206 178326 4319 -170351 -173516
9948 -173516 185627 -23504 16398 100794 85789 264651 -23999 28091 -103411 -35988 -60000
9937 -60000 -254013 -70883 -253124 -172256 15400 -210234 -284632 -72356 -110629 -347583 -15186
9925 -191911 173392 139309 -476700 -375161 9512 152474 -63589 104351 157062 -17591 75297
9913 37897 118633 -62987 -208581 -163153 -320959 87231 -405988 -25272 -190496 -107703 90411
$$ packed form
9994b10836B19105I2195c09201h451o3386k61509j2168J44403K4836B39328a25100
9982a14405k20348L6014l9393A60573a83480o8752C03708I7503h73A43010b74752
9970a60480b7907E4330f8925A24559K1972b6635j01290o501M7864k77592K6122
9959c38032h1384b9876k18926f0255p2616d8182C5206J43120D319a70351l165
9948a73516A85627b3504A6398Q4396j5005J78862b3999B8091a03411c5988k4012
9937f0000j94013g0883j82241Q0868A5400b10234p4398g2356l8273k36954a5186
9925a91911A73392l4083d76700J01539I512J42962f3589A04351N2711a7591G5297
9913C7897Q0736f2987j45594M5428j57806H7231d05988b5272j65224Q2793I0411
$$ plain form
9901 -127546 97233 56338 -116001 -75762 -48139 -13807 -99999 152615 136301 269589 -199638
9889 -265889 131218 -80630 -184696 -4116 104111 -290129 -132317 31081 11068 20563 -20710
9877 -115603 -141011 -211446 128470 -283972 -274273 -58532 -178404 -199279 -19327 1508 -57807
9865 -4492 -73474 36189 -173220 274496 -234945 -247003 75502 -64556 -293768 305991 -234189
9853 152561 -269209 -191202 204522 37601 -191267 114262 53077 202399 -85000 147650
9842 -163553 2357 188187 -109256 82129 -295603 -367255 -156614 -218375 -65064 -31883 -239825
9831 -239825 -91175 146885 -73022 -79903 232382 -43325 61050 -77260 -6607 -258374 -105951
9819 -71409 165532 -207220 133200 -29549 53490 168432 -114080 71973 8809 -35734 140431
$$ packed form
9901a27546I7233m0895a16001M0239K7623a3807q6192A52615j6314J33288a99638
9889b65889A31218h0630j04066d116A04111b90129a32317C1081A1068R495b0710
9877a15603k5408p0435A28470b83972R699e8532j19872k0875a9327A508e7807
9865d492o8982C6189a73220B74496b34945j2058G5502f4556k29212C05991b34189
9853A52561b69209P8007B04522C7601a91267A14262E3077J49322h5000A47650
9842a63553B357J85830a09256H2129b95603p1652a56614o1761f5064c1883k07942
9831b39825i1175A46885g3022o881B32382d3325F1050g7260f607k51767a05951
9819g1409A65532b07220A33200b9549E3490J14942a14080G1973H809c5734A40431
$$ plain form
9807 126621 -92105 -178319 8106 -106744 7669 281243 -148381 -208806 -253677 2031 -273339
9795 -148937 103217 -125680 56063 -8754 51304 126385 165084 -133035 134374 -349838 97735
9783 31518 215639 -312432 74474 112551 -99533 -273565 -32652 37557 -9097 -93100 -313100
9772 -313100 -252275 114494 -85898 -43064 -166055 -435572 77355 -132932 -6945 -185266 261052
9760 -121356 -24507 -110934 -138854 -171506 -37989 134787 -88627 -45577 -356659 -17392 -277979
9749 -277979 322365 71349 -218315 -182142 43671 -63553 25494 -133553 6799 261512 186124
9738 186124 -121136 -131222 -186513 -71509 -21935 158165 40867 -62312 -204926 -95007 -16044
9726 -224904 -254431 -49295 203735 124431 158932 40188 -431440 197897 50090 201335 -40457
$$ packed form
9807A26621i2105q6214H106a06744G669K73574a48381o0425m4871B031b73339
9795a48937A03217a25680E6063h754E1304P5081L8699a33035A34374c49838I7735
9783C1518J84121c12432G4474L8077i9533j74032c2652C7557i097q4003k20000
9772c13100O0825A14494h5898M2834j22991k69517G7355a32932f945j78321B61052
9760a21356b4507q6427k7920l2652c7989A34787h8627M3050l11082a7392k60587
9749b77979C22365G1349b18315L6173D3671f3553B5494a33553F799K54713p5388
9738A86124a21136j0086n5291g1509b1935A58165D0867f2312j42614i5007a6044
9726b24904k9527d9295B03735p9304L4501D0188d31440A97897E0090J51245d0457
$$ plain form
9714 -363300 163994 48073 -208741 -67519 62999 -225666 112468 -221532 -239813 -138451
9704 -138451 315284 -94221 206075 -88628 100302 -255376 158433 -415345 -38457 -14251
9693 16934 -488907 -58708 -79478 -184895 85198 -7746 -203294 -226094 -466961 -143863 -129221
9682 -129221 -255033 -82261 -196765 -120662 -110216 134796 100210 -74857 -182668 -309366 -74489
9670 -322985 85233 6671 -138605 -350260 -49544 -88837 79490 -67206 -18951 -63138 -296717
9659 -296717 -59821 44086 100521 -364192 213957 114459 -100232 209479 154028 -319722 -170619
9648 -170619 -49193 309565 -158885 -29528 36323 10412 18006 54993 -266126 -57474 -14290
9636 -110436 -53947 42351 226696 1932 -40534 -323041 -52945 163680 -134810 -549926 96814
$$ packed form
9714c63300A63994D8073b08741f7519F2999b25666A12468b21532j8281J01362
9704a38451C15284i4221B06075h8628A00302b55376A58433d15345c8457a4251
9693A6934d88907e8708k0770j05417H5198g746j95548k2800k40867a43863J4642
9682a29221j25812h2261j14504P6103J0446A34796l4586g4857j07811j26698g4489
9670c22985H5233F671a38605k11655d9544l9293G9490f7206a8951m4187k33579
9659b96717e9821D4086N6435c64192B13957r9498a00232B09479n5451c19722J49103
9648a70619d9193C09565a58885b9528C6323A0412P594L6987b66126e7474a4290
9636a10436e3947D2351J84345A932d0534k82507e2945A63680a34810m15116I6814
$$ plain form
9624 -172128 -377261 -152937 -170626 81177 192606 -315645 648 -450505 338833 -45439 -88992
9613 -88992 79587 -79601 -195694 -71219 -171225 73075 246285 -127765 -447040 -307056 -206103
9602 -206103 -166796 100067 -3447 -473332 -52372 -161463 -42471 -82807 -234037 -109481 -55424
9591 -55424 74794 -122297 -217642 -258109 23854 -80517 -124401 -477052 -11679 10866 -263267
9579 -218886 -125607 129215 -285491 -14296 -249568 -107560 -34960 -289235 -66453 55711 78818
9568 78818 -248033 -533071 -342025 37929 -11423 36299 -82730 -205264 -113562 -24442 156823
9556 246439 254391 -105273 -425754 39381 -388086 -142912 64679 83000 75568 -106817 211425
9544 10269 -325445 222134 285254 -151676 -3673 -175035 -288691 50686 -220723 99866 -101231
$$ packed form
9624a72128k05133a52937j7689H1177J11429c15645F48d50505C38833d5439m3553
9613h8992G9587g9601j16093g1219j00006G3075J73210a27765l19275J39984J00953
9602b06103L9307A00067c447m69885e2372j09091d2471m0336j51230a09481N4057
9591e5424G4794a22297r5345m0467B3854h0517m3884l52651a1679A0866b63267
9579b18886R3279A29215b85491a4296k35272a07560c4960k54275f6453E5711K3107
9568G8818b48033k85038J91046C7929a1423C6299h2730j22534R1702b4442A56823
9556B46439P952a05273l20481C9381c88086a42912F4679J8321p432a06817B11425
9544A0269c25445B22134O3120a51676c673j71362j13656E0686b20723I9866a01231
$$ plain form
9532 -71697 3340 334688 -344456 -60768 -42593 -187942 78453 322141 283193 60079 -78559
9520 -211124 77801 -174194 -140055 91153 -383670 -144016 28012 -287348 -303334 -148121 108679
9508 -160535 153353 -129351 -105312 -13774 -35764 4895 -77058 132595 -5780 -326014 -90071
9496 -163621 34893 -165122 -12880 2979 135088 -137971 66033 -67479 47664 -13430 -21035
9485 -21035 -130140 -39868 45284 181217 45307 134878 44 23140 257852 -152017 -298298
9474 -298298 177486 53625 -160712 -33408 -160706 -15756 -117822 -304246 108106 108093 -164216
9462 -194635 -113184 -85125 -135161 -100313 -23102 -17155 219739 -62541 -34537 58609 -54775 47086
9449 -10621 -266440 20775 41218 -346427 -260159 203366 -133734 -110712 -136159 -124320 60741
$$ packed form
9532g1697C340L31348c44456f0768J8175j45349G8453K43688l8948F0079g8559
9520b11124G7801a74194L4139I1153c83670a44016B8012b87348j5986a48121A08679
9508a60535A53353a29351K4039a3774k1990D895g7058A32595e780l20234i0071
9496a63621C4893a65122a2880B979J32109a37971F6033f7479D7664a3430p605
9485b1035j09105c9868D5284J35933D5307Q9571D4K3096K34712a52017j46281
9474b98298A77486E3625a60712c3408j27298a5756j02066j86424A08106j3a64216
9462a94635Q1451K8059n0036L4848b3102N947B19739f2541K8004E8609e4775D7086
9449a0621k55819B0775K0443c46427Q6268B03366a33734K3022k5447J1839F0741
$$ plain form
9437 76267 8479 180823 80352 57321 -140384 4373 159135 -89580 144292 -315261 -117128
9425 119324 -310449 109320 -2307 -101291 -51231 -73723 329696 -88449 -144247 129615 -414190
9413 77408 -47636 67083 -71098 51799 -8989 -426352 -143253 -9942 -167505 -61403 -165087
9402 -165087 -70757 -474527 -115750 -60022 52226 -122577 -365534 -221083 -256176 111433
9391 -29480 -212447 -31289 346300 -19909 -144542 -23188 -256406 8232 -48527 -120057 -175521
9380 -175521 96394 -56256 -117981 -169541 -204330 -563585 -539843 -113031 -394386 105121 228817
9369 228817 -475081 -171844 -344112 277801 100992 -181879 -23610 -244746 -22956 151826
9358 -27262 -111349 -104212 -68529 -5963 -54051 -310809 -187566 -116825 105336 141399 -191594
$$ packed form
9437G6267H479J72344H0352k3031a40384D373J54762h9580A44292c15261a17128
9425A19324c10449A09320b307r8984N0060k2492C29696h8449n5798A29615d14190
9413G7408d7636F7083g1098E1799h989m17363a43253i942j57563f1403j03684
9402a65087g0757m03770a15750N5728E2226a22577k42957J44451l5093A11433
9391b9480j82967c1289C46300a9909j24633b3188k33218H232d8527p1530n5464
9380a75521I6394e6256o1725n1560l4789l59255K3742a13031k81355A05121J23696
9369B28817d75081a71844j72268B77801A00992a81879b3610k21136b2956A51826
9358b7262q4087P137L5683e963m8088k56758J23243P0741A05336L6063a91594
$$ plain form
9346 -126142 -48550 99308 -309721 -78372 159657 -159690 -53319 161947 -334670 -181151
9336 -181151 206064 -269905 -265044 -81108 -163427 -60265 1914 3941 80027 138325 -91039 -22504
9323 248462 -161499 -12594 147098 -124787 -117867 -117566 -128686 -286214 -13144 -254150 -165954
9312 -165954 -288001 -114801 -350529 -9061 -101310 -78457 -140582 -5601 -160658 -290482 48328
9300 142001 -29308 -98734 -77365 -73411 -371981 -91737 -577922 -93084 -236709 192724 -170286
9288 193040 -7369 103850 -45768 73364 -249146 79553 -286689 -261619 135878 101227 21709
9276 -90903 -153383 48403 -115832 -116609 27986 -4010 -39998 -96347 29344 -253687 -168502 -7865
9263 163538 83202 -301599 -47294 -508418 -214020 -166445 -125058 -232687 -57185 171408 -17071
$$ packed form
9346a26142d8550I9308c09721g8372A59657a59690e3319A61947c34670J53519
9336a81151B06064b69905M861h1108q2319f0265A914K027P6086N8298i1039b2504
9323B48462a61499a2594A47098a24787O920L01j1120j57528a3144k41006Q8196
9312a65954j22047a14801k35728i061r2249K2853o2125e601j55057j29824D8328
9300A42001b9308o9426K1369L954k98570i1737m86185i3084j43625A92724a70286
9288A93040g369A03850d5768G3364b49146G9553b86689K5070A35878l4651B1709
9276i0903o2480D8403a15832p77B7986d010l5988n6349B9344b53687Q5185g865
9263A63538q0336c01599d7294m61124b14020M7575M1387j07629e7185A71408a7071
$$ plain form
9251 -130222 31593 -185078 -341010 -273021 267968 -198866 -9235 -95173 -198860 -140996 -198773
9240 -198773 13034 20763 -69661 -54908 33694 -126129 -70024 -229258 42674 -252935 -247036
9229 -247036 -274955 -354599 -11007 -94258 -297389 -163222 -133290 28450 -55549 -236928 -249318
9218 -249318 -47795 -83543 18105 -80987 -71477 139998 -404519 77973 -39023 192145 9353
9206 -281278 -174797 -24640 -137141 -120968 -231011 -87122 -38290 149415 40840 32832 161357
9195 161357 35007 247132 -177170 -250349 -63433 -25192 -220090 -155023 87025 -163845 4056
9183 -211234 125916 78801 -317937 -18150 70942 163055 -293603 -136117 69449 457464 -72263
9171 -50795 24003 -143141 -275365 46721 -83244 17105 94305 98281 -291079 23428 -163844
$$ packed form
9251a30222C1593a85078j55932O7989B67968a98866i235q5938j03687N7864n7777
9240a98773A3034P729f9661J4753C3694a26129N6105j59234D2674b52935N899
9229b47036k7919p9644a1007q3251k03131J34167K9932B8450e5549j81379j2390
9218b49318d7795l5748A8105h0987R510A39998d04519G7973c9023A92145I353
9206b81278J06481b4640j12501J6173j10043h7122c8290A49415D0840q008J28525
9195A61357C5007K12125a77170p3179f3433b5192j94898O5067H7025a63845D056
9183b11234A25916m7115c17937a8150G0942R2113b93603a36117F9449L88015g2263
9171e0795B4003a43141j32224D6721h3244A7105P7200L976b91079B3428a63844
$$ plain form
9159 262857 -172996 3656 -64751 307645 104644 -176691 137226 49719 -15146 -66605 -126016
9148 -126016 162475 201006 -99120 -60552 -212616 -239855 -3916 -216186 235804 172865 -243859
9136 283398 -232548 -216868 -28194 97897 -60175 -201503 89126 -118638 209860 -45572 -220947
9125 -220947 -1909 -101667 63414 -185935 82100 187550 341229 36888 -81049 -122386 -49220
9113 166354 -64041 -66626 -178961 -56745 41424 -68646 61862 -135233 4609 79504 -268813
9101 -4980 -307 323325 22029 -322970 26340 19354 212403 154361 57793 -218237 -203537 92741
9088 -218561 -114214 39035 331 41394 -310044 -128996 111386 68006 -119148 -272947 199372
9076 -300665 -471200 -143305 132132 115625 386426 -338432 -58923 -159851 265996 276098
$$ packed form
9159B62857a72996C656f4751C07645A04644a76691A37226D9719a5146n1459n9411
9148a26016A62475L8531i9120L8568j52064k7239c916k12270B35804o2939b43859
9136B83398b32548J5680b8194I7897f0175j41328H9126a18638B09860d5572j75375
9125b20947a909r9758F3414a85935H2100J05450J53679C6888h1049m1337d9220
9113A66354f4041k585j12335e6745D1424f8646F1862a35233D609P4895b68813
9101d980c07C23325B2029c22970B6340o986J93049n8042E7793b18237J4700I2741
9088b18561J04347C9035C31M1063c10044a28996A11386m3380a19148j53799A99372
9076c00665j70535a43305A32132j6507K70801c38432e8923j00928B65996J0102
$$ plain form
9066 276098 -224363 126293 -216026 109622 -214013 -138459 -251838 127105 -144954 -170156
9056 -170156 684 -3914 -34665 262478 -134564 -83433 177179 97920 161537 -70067 169246
9044 -141054 -59742 101062 -56592 146150 2881 -90003 -11855 17638 -53794 187588 -297752
9032 -191112 243048 40407 -74199 969 -40479 -112454 -36821 17472 -86351 -87469 257557 193449
9020 193449 -276585 -313880 -155533 93467 -164401 -120825 1545 -92454 -140562 -198648 -224683
9009 -224683 -400051 -228211 -503026 -262389 39797 8932 393190 -130028 153985 192740
8999 192740 -568901 -130186 -138492 142237 9958 -524 203935 125186 -11493 -154803 -216797
8988 -216797 328506 222391 -34043 62199 25782 125540 -8901 -315216 199340 -275347 -26622
$$ packed form
9066B76098b24363A26293b16026A09622b14013P5554j13379A27105a44954k5202
9056a70156F84c914l0751B62478a34564N1131A77179p9259O3617g0067A69246
9044a41054e9742A01062e6592A46150B881i0003a1855A7638e3794A87588b97752
9032a91112B43048D0407g4199I69d0479p1975c6821A7472h6351j118B57557o4108
9020A93449b76585l7295a55533I3467a64401M3576A545i2454m8108n8086k6035
9009b24683j75368J71840k74815K40637C9797H932L84258a30028A53985L8755
8999A92740e68901a30186q306A42237I958e24B03935p8749a1493j43310o1994
8988b16797C28506j06115c4043F2199B5782R9758h901l06315A99340b75347b6622
$$ plain form
8976 -59082 -466135 28327 -403520 -228556 -113952 -119677 -96501 -165545 -108672 -37306 -59215
8965 -59215 55053 -58932 -438323 -114669 164206 64878 -296612 164800 -170617 -13960 217565
8953 310984 -293610 56267 -238804 -542292 -151282 -67293 -313371 -353655 31065 -207160
8942 13915 -125109 -88819 -285666 -153224 -93223 50292 196323 -16761 70234 79964 169263
8931 169263 -303490 -185145 -240509 81512 -3450 136220 367606 403405 920296 2875229
8921 2875229 7976836 3286004 826091 483031 254066 -89947 -47095 -185732 -65873 84216
8910 -8180 -40198 40937 -43111 37565 -382394 -234527 125676 -272730 -314536 131867 -51041
8898 -187185 75186 92256 -3376 277157 234296 52592 112848 222457 -126790 -259040 149909
$$ packed form
8976e9082m07053B8327d03520J74964a13952n725K3176o9044N6873c7306k1909
8965e9215E5053e8932l79391a14669A64206F4878b96612A64800a70617a3960B17565
8953C10984b93610E6267b38804l03488a51282f7293k46078m0284C1065b07160
8942A3915a25109L6290j96847J32442O0001E0292J46031a6761G0234R730Q9299
8931A69263c03490J18345n5364H1512c450A36220K31386L5799N16891J954933
8921B875229N101607C286004H26091l43060k28965h9947M2852j38637f5873H4216
8910h180l2018D0937d3111C7565c82394J47867A25676b72730m1806A31867e1041
8898a87185G5186J7070c376B77157m2861E2592O0256J09609a26790j32250A49909
$$ plain form
8886 -165631 -77236 128531 -101885 -53379 9800 -42451 204007 -5386 128011 -15080 336135
8874 -181393 15110 -16708 -94992 -113408 -13799 1837 -125057 217112 -38539 155530 -419657
8862 212169 -133399 -160153 2153 71657 -373481 126870 126150 -273544 -143008 -47001 -267702
$$ packed form
8886a65631g7236A28531a01885M8506I800d2451B04007e386A28011a5080C36135
8874a81393A5110a6708p8284j8416a3799A837a25057B17112c8539A55530d19657
8862B12169a33399k6754B153O9504c73481A26870p20b73544J30536d7001k20701
$$ [...]
##END NTUPLES=NMR SPECTRUM
##END=
