##TITLE=AC1648_SPIAH14381_8569946_z4p5mIpEj6
##JCAMPDX= 6.0         $$ Bruker NMR JCAMP-DX V2.0
##DATA TYPE= NMR SPECTRUM
##DATA CLASS= NTUPLES
##ORIGIN= BRUKER
##OWNER= Administrator
$$ 1.72 TOPSPIN		Version 2.1
$$ 2014-04-10 20:43:12.046 -0700  Administrator@X
$$ Compression mode = diff/dup
##.OBSERVE FREQUENCY= 400.02188249412
##.OBSERVE NUCLEUS= ^1H
##.ACQUISITION MODE= SIMULTANEOUS (DQD)
##.ACQUISITION SCHEME= undefined
##.AVERAGES= 64
##.DIGITISER RES= 22
##SPECTROMETER/DATA SYSTEM= spect
##.PULSE SEQUENCE= noesygpps1d.comp
##.SOLVENT NAME= COFFEE_meoh
##.SHIFT REFERENCE= INTERNAL, COFFEE_meoh, 1, 14.96129
##AUDIT TRAIL= $$ (NUMBER, WHEN, WHO, WHERE, PROCESS, VERSION, WHAT)
$$ ##TITLE= Audit trail, TOPSPIN		Version 2.1
$$ ##JCAMPDX= 5.01
$$ ##ORIGIN= Bruker BioSpin GmbH
$$ ##OWNER= Administrator
$$ $$ E:\/data/COFFEE/nmr/AC1648_SPIAH14381_8569946_z4p5mIpEj6/12/pdata/1/auditp.txt
$$ ##AUDIT TRAIL=  $$ (NUMBER, WHEN, WHO, WHERE, PROCESS, VERSION, WHAT)
(   1,<2014-04-10 20:43:05.965 -0700>,<Administrator>,<X>,<go>,<TOPSPIN 2.1>,
      <created by zg
	started at 2014-04-10 20:31:36.856 -0700,
	POWCHK enabled, PULCHK disabled,
       configuration hash MD5:
       C8 4E 4E 5D D3 5C D8 9E 9F 52 82 E0 59 8A DE 15
       data hash MD5: 64K
       56 96 B8 B8 F5 12 45 F9 7B 70 74 57 1A A4 AC 3C>)
(   2,<2014-04-10 20:43:09.481 -0700>,<Administrator>,<X>,<proc1d>,<TOPSPIN 2.1>,
      <Start of raw data processing
       efp LB = 0.3 FT_mod = 6 PKNL = 1 PHC0 = 0 PHC1 = 0 SI = 128K 
       data hash MD5: 128K
       A3 E0 57 0D 26 FD D4 44 0E CC 86 1A 6A CC 49 79>)
(   3,<2014-04-10 20:43:10.590 -0700>,<Administrator>,<X>,<proc1d>,<TOPSPIN 2.1>,
      <pk PHC0 = -80.85938 PHC1 = 0 
       data hash MD5: 128K
       25 36 78 AD B1 C3 77 9F A8 EA AB C4 96 76 18 FD>)
(   4,<2014-04-10 20:43:11.325 -0700>,<Administrator>,<X>,<proc1d>,<TOPSPIN 2.1>,
      <abs ABSG = 1 
       data hash MD5: 128K
       C6 0D 11 AD 9C 0E CD E0 EC 3D 12 73 22 20 51 DB>)
(   5,<2014-04-10 20:43:11.479 -0700>,<Administrator>,<X>,<proc1d>,<TOPSPIN 2.1>,
      <abs ABSG = 2 
       data hash MD5: 128K
       46 22 67 B5 CF B7 51 4E 25 6A 5B 92 DC 67 56 69>)
(   6,<2014-04-10 20:43:11.582 -0700>,<Administrator>,<X>,<proc1d>,<TOPSPIN 2.1>,
      <abs ABSG = 3 
       data hash MD5: 128K
       EE A0 0A D5 96 29 C7 42 D2 49 6E 0D 9F 6C 17 69>)
(   7,<2014-04-10 20:43:11.703 -0700>,<Administrator>,<X>,<proc1d>,<TOPSPIN 2.1>,
      <abs ABSG = 4 
       data hash MD5: 128K
       2B DA 59 A4 E9 30 07 47 1D E5 80 74 79 25 D5 BE>)
(   8,<2014-04-10 20:43:11.806 -0700>,<Administrator>,<X>,<proc1d>,<TOPSPIN 2.1>,
      <abs ABSG = 5 
       data hash MD5: 128K
       1B 7E 05 60 2F 55 DA AB 5E 82 2B EB 0D E3 13 E6>)
$$ ##END=
$$ 
$$ $$ hash MD5
$$ $$ 00 B0 D0 B3 FF 3F 1D 9A D0 D7 8D 73 49 84 15 7E
##$RELAX= 
##$RELAX= 
##$RELAX= 
##$RELAX= 
##$RELAX= 
##$RELAX= 
##$RELAX= 
##$RELAX= 
$$ Bruker specific parameters
$$ --------------------------
##$DU= <E:\>
##$EXPNO= 12
$$ [...]
##$TP07= 0
##$TPNAME0= <>
##$TPNAME1= <>
##$TPNAME2= <>
##$TPNAME3= <>
##$TPNAME4= <>
##$TPNAME5= <>
##$TPNAME6= <>
##$TPNAME7= <>
##$TPOAL= (0..7)
0.5 0.5 0.5 0.5 0.5 0.5 0.5 0.5
##$TPOFFS= (0..7)
0 0 0 0 0 0 0 0
##$TUNHIN= 0
##$TUNHOUT= 0
##$TUNXOUT= 0
##$USERA1= <user>
##$USERA2= <user>
##$USERA3= <user>
##$USERA4= <user>
##$USERA5= <user>
##$V9= 5
##$VALIST= <valist>
##$VCLIST= <CCCCCCCCCCCCCCC>
##$VD= 0
##$VDLIST= <DDDDDDDDDDDDDDD>
##$VPLIST= <PPPPPPPPPPPPPPP>
##$VTLIST= <TTTTTTTTTTTTTTT>
##$WBST= 1024
##$WBSW= 4
##$XGAIN= (0..3)
0 0 0 0
##$XL= 0
##$YL= 0
##$YMAX_a= 6359404
##$YMIN_a= -14123147
##$ZGOPTNS= <>
##$ZL1= 120
##$ZL2= 120
##$ZL3= 120
##$ZL4= 120
##$ABSF1= 14.96129
##$ABSF2= -5.596891
##$ABSG= 5
##$ABSL= 3
##$ALPHA= 0
##$AQORDER= 0
##$ASSFAC= 0
##$ASSFACI= 0
##$ASSFACX= 0
##$ASSWID= 0
##$AUNMP= <proc_prof1d_extract.lims>
##$AXLEFT= 0
##$AXNAME= <>
##$AXNUC= <1H>
##$AXRIGHT= 0
##$AXTYPE= 0
##$AXUNIT= <>
##$AZFE= 0.1
##$AZFW= 0.1
##$BCFW= 0
##$BC_mod= 0
##$BYTORDP= 0
##$COROFFS= 0
##$CY= 15
##$DATMOD= 1
##$DC= 0
##$DFILT= <>
##$DTYPP= 0
##$F1P= 0
##$F2P= 0
##$FCOR= 0.5
##$FTSIZE= 131072
##$FT_mod= 6
##$GAMMA= 0
##$GB= 0
##$INTBC= 1
##$INTSCL= 1
##$ISEN= 128
##$LB= 0.3
##$LEV0= 0
##$LPBIN= 0
##$MAXI= 10000
##$MC2= 0
##$MEAN= 0
##$ME_mod= 0
##$MI= 0
##$NCOEF= 0
##$NC_proc= -2
##$NLEV= 6
##$NOISF1= 0
##$NOISF2= 0
##$NSP= 0
##$NTH_PI= 0
##$NZP= 0
##$OFFSET= 14.96129
##$PC= 1
##$PHC0= -80.85938
##$PHC1= 0
##$PH_mod= 1
##$PKNL= yes
##$PPARMOD= 0
##$PPDIAG= 0
##$PPIPTYP= 0
##$PPMPNUM= 2147483647
##$PPRESOL= 1
##$PSCAL= 4
##$PSIGN= 0
##$PYNMP= <proc.py>
##$REVERSE= no
##$SF= 400.020009519583
##$SI= 131072
##$SIGF1= 0
##$SIGF2= 0
##$SINO= 400
##$SIOLD= 131072
##$SPECTYP= <>
##$SREGLST= <1H.CDCl3>
##$SSB= 0
##$STSI= 131072
##$STSR= 0
##$SW_p= 8223.68421052631
##$SYMM= 0
##$S_DEV= 0
##$TDeff= 65536
##$TDoff= 0
##$TI= <>
##$TILT= no
##$TM1= 0
##$TM2= 0
##$TOPLEV= 0
##$USERP1= <user>
##$USERP2= <user>
##$USERP3= <user>
##$USERP4= <user>
##$USERP5= <user>
##$WDW= 1
##$XDIM= 131072
##$YMAX_p= 390395049
##$YMIN_p= -11584
##$CURPLOT= <Network HP LaserJet P1505>
##$CURPRIN= <$Network HP LaserJet P1505>
##$DFORMAT= <normdp>
##$LAYOUT= <+/1D_H.xwp>
##$LFORMAT= <normlp>
##$PFORMAT= <normpl>
##$SURQMSG= 1
$$ End of Bruker specific parameters
$$ ---------------------------------
##NTUPLES= NMR SPECTRUM
##VAR_NAME=  FREQUENCY,     SPECTRUM/REAL,   SPECTRUM/IMAG
##SYMBOL=    X,             R,               I
##VAR_TYPE=  INDEPENDENT,   DEPENDENT,       DEPENDENT
##VAR_FORM=  AFFN,          ASDF,            ASDF
##VAR_DIM=   131072,        131072,          131072
##UNITS=     HZ,            ARBITRARY UNITS, ARBITRARY UNITS
##FACTOR=    0.0627417313425164, 1,          1
##FIRST=     8223.62146879497, -1179,        -64990
##LAST=      0,             1541,            -65817
##MIN=       0,             -11584,          0
##MAX=       8223.62146879497, 390395049,    0
$$ Real data points
##PAGE= N=1
##DATA TABLE= (X++(R..R)), XYDATA
$$ [...]
63846A014402j0313j2852j6098j9617k2587k4862k6768k8386k9596l0494l1067
$$ 1014402 1004089 991237 975139 955522 932935 908073 881305 852919 823323 792829 761762
63835G61762l0897k9846k8588k7749k6924k5335k3092k0952j9136j7348j5713
$$ 761762 730865 701019 672431 644682 617758 592423 569331 548379 529243 511895 496182
63824D96182j4741j4335j3741j2615j1374j0336r303q153p186o570n977n134m315
$$ 496182 481441 467106 453365 440750 429376 419040 409737 401584 394398 387828 381851 376717 372402
63811C72402l960m001l900l184j921p09k67q62k086l223l779l702l313l161l552
$$ 372402 368442 364441 360541 357357 355436 354727 354460 353598 351512 348289 344510 340808 337495 334334 330782
63796C30782m176m406m137l902m022m109l741l117k600k118j572j365j751k053
$$ 330782 326606 322200 318063 314161 310139 306030 302289 299172 296572 294454 292882 291517 289766 287713
63782B87713j352J06J013O06n02j289j445j288j083r19r03j070j197j030o90n78
$$ 287713 286361 286467 287480 288086 287584 286295 284850 283562 282479 281560 280657 279587 278390 277360 276670 276092
63766B76092q02r34n51R2K82j74n97l35L51P32O46N09M39J77j65l6O49J267J477
$$ 276092 275290 274356 273805 273897 274179 274005 273408 273073 273424 274156 274802 275311 275750 275927 275762 275726 276375 277642 279119
63747B79119J691K245K719K619K173J966K244K926L828M449M169L128K332K331
$$ 279119 280810 283055 285774 288393 290566 292532 294776 297702 301530 305979 310148 313276 315608 317939
63733C17939K407J733P31M63J156K153K940L367L228K551K105K675L892M634M576
$$ 317939 320346 322079 322810 323273 324429 326582 329522 332889 336117 338668 340773 343448 347340 351974 356550
63718C56550M425M569M390L297J675L98k22n99j196j966k410k114j251m27L3L52
$$ 356550 360975 365544 369934 373231 374906 375304 375082 374483 373287 371321 368911 366797 365546 365119 365152 365504
63702C65504P46J010J007J096J569K057K044J726J673J886J816J262O03J83ml6
$$ 365504 366250 367260 368267 369363 370932 372989 375033 376759 378432 380318 382134 383396 383999 384182 384178 384142
63686C84142K3n1m42r22j072q45n45l75l45m91p30p37l61M6J52K56P89J467J568
$$ 384142 384165 384114 383672 382750 381678 380833 380288 379913 379568 379077 378347 377610 377249 377295 377447 377703 378492 379959 381527
63667C81527R82L13L0Q8K75L00l85k107m229n520n452m604l788l244k837k464
$$ 381527 382509 382822 382852 382940 383215 383515 383130 381023 376794 371274 365822 361218 357430 354186 351349 348885
63651C48885k095j783j707j941k198k086j565q48j2Q94J629K086K629L494M207
$$ 348885 346790 345007 343300 341359 339161 337075 335510 334662 334650 335544 337173 339259 341888 345382 349589
63636C49589M184L740L691M103M221L682L030K940L599M904O591Q037Q687Q823
$$ 349589 353773 357513 361204 365307 369528 373210 376240 379180 382779 387683 394274 402311 410998 419821
63622D19821R282J0298J1303J2044J3117J5044J7401J9311K0371K0872K1386K2336
$$ 419821 429103 439401 450704 462748 475865 490909 508310 527621 547992 568864 590250 612586
63610F12586K3559K4300K4045K3256K2710K2162K0406J6770J1910O907K357j454
$$ 612586 636145 660445 684490 707746 730456 752618 773024 789794 801704 808611 810968 809514
63598H09514m297o317p978r306r789r465r375j0402j2135j3470j3963j4069j4348
$$ 809514 805217 798900 790922 781616 771827 762362 752987 742585 730450 716980 703017 688948 674600
63585F74600j4988j5891j6681j6788j5919j4446j3042j1936j0718q809o115l341
$$ 674600 659612 643721 627040 610252 594333 579887 566845 554909 544191 535382 529267 525926
63573E25926j551j129j183l97J481L424M426M490M224L964L743L701M162N349
$$ 525926 524375 523246 522063 521666 523147 526571 530997 535487 539711 543675 547418 551119 555281 560630
63559E60630P212R359J1202J2478J3628J5321J7609J9961K2059K4012K5822K7220
$$ 560630 567842 577201 588403 600881 614509 629830 647439 667400 689459 713471 739293 766513
63547G66513K8174K8915K9216K8287K5591K1189J5239P957M04n664r313j1200
$$ 766513 794687 823602 852818 881105 906696 927885 943124 951081 951485 945821 936508 925308
63535I25308j2292j2593j1871j0858j0604j1088j1586j2271j4225j7669k1184
$$ 925308 913016 900423 888552 877694 867090 856002 844416 832145 817920 800251 779067
63524G79067k3228k3773k3890k4202k4322k3698k2442k1128k0051j8929j7388
$$ 779067 755839 732066 708176 683974 659652 635954 613512 592384 572333 553404 536016
63513E36016j5565j3960j2747j1515r926q318p350p120o923o032m501l117k572
$$ 536016 520451 506491 493744 482229 472303 463985 456635 449515 442592 436560 432059 428942 426370
63500D26370k769k947k511j657j099j275j902k340k165j460o51j47j8K7K80P23
$$ 426370 423601 420654 418143 416486 415387 414112 412210 409870 407705 406245 405594 405447 405429 405456 405736 406459
63484D06459J148J488J837K220K531K686K666K453K133J980K214K652K716J906
$$ 406459 407607 409095 410932 413152 415683 418369 421035 423488 425621 427601 429815 432467 435183 437089
63470D37089K43j617k756k724k001j494j558j833k048k303k389j617N8J442J481
$$ 437089 437332 435715 432959 430235 428234 426740 425182 423349 421301 418998 416609 414992 415050 416492 417973
63455D17973P99R03K189L669M535M985N427N880O360P086P992Q677R067R578J0468
$$ 417973 418772 419675 421864 425533 430068 435053 440480 446360 452720 459806 467798 476475 485542 495120 505588
63440E05588J1540J2642J3872J5259J6751J8562K0901K3269K4616K4251K2144
$$ 505588 517128 529770 543642 558901 575652 594214 615115 638384 663000 687251 709395
63429G09395J8624J4503J1248R908R871R701R267R888J2231J5373J8255K0855
$$ 709395 728019 742522 753770 763678 773549 783250 792517 802405 814636 830009 848264 869119
63417H69119K3294K4980K5370K4581K2583J8776J3197P172J941k487o356r062
$$ 869119 892413 917393 942763 967344 989927 1008703 1021900 1029072 1031013 1028526 1022170 1013108
63405A013108j0177j0687j1921j3720j4979j5541j6335j7805j9453k0902k2393
$$ 1013108 1002931 992244 980323 966603 951624 936083 919748 901943 882490 861588 839195
63394H39195k4057k5512k6371k6510k5834k4363k2487k0629j8762j6689j4606
$$ 839195 815138 789626 763255 736745 710911 686548 664061 643432 624670 607981 593375
63383E93375j2833j1188r212o827m349k063j92J049J943L343N608P851Q983R148
$$ 593375 580542 569354 560142 553315 548966 546903 546711 547760 549703 553046 558654 566505 575488 584636
63369E84636R372J0146J1222J2521J4255J6208J7838J9164K0750K2767K4767K6402
$$ 584636 594008 604154 615376 627897 642152 658360 676198 695362 716112 738879 763646 790048
63357G90048K7637K8275K7978K6784K4965K2336J8437J3404P984K666k468p000
$$ 790048 817685 845960 873938 900722 925687 948023 966460 979864 987848 990514 988046 981046
63345I81046j0110j1506j1769j1654j1591j1944j2981j4479j5962j7447j9316
$$ 981046 970936 959430 947661 936007 924416 912472 899491 885012 869050 851603 832287
63334H32287k1386k2908k3550k3554k2801k0851j8138j6082j5242j4356j2032
$$ 832287 810901 787993 764443 740889 718088 697237 679099 663017 647775 633419 621387
63323F21387q650n742m088l388l358m081n442p109r106j1553j3803j4703j3990
$$ 621387 612737 606995 602907 599519 596161 592080 586638 579529 570423 558870 545067 530364 516374
63310E16374j2704j1895j1396j0303q301o067m457l662l155k326j164k81j98o97
$$ 516374 503670 491775 480379 470076 461775 455708 451251 447589 444434 442108 440944 440663 440465 439768
63296D39768j142j372j896k959l900l890l093k515k703l159l272l207l404l540
$$ 439768 438626 437254 435358 432399 428499 424609 421516 419001 416298 413139 409867 406660 403256 399716
63282C99716k799j139L25N24l39j143j149o53l85n97q76p06m8O99J225J584J855
$$ 399716 396917 395778 396103 396627 396288 395145 393996 393343 392958 392361 391485 390779 390731 391430 392655 394239 396094
63265C96094J873J538J233J513K350L071L115K609K177K384L392M777N705N688
$$ 396094 397967 399505 400738 402251 404601 407672 410787 413396 415573 417957 421349 426126 431831 437519
63251D37519N186N124N792O680P362P971Q601Q935Q854Q925R782J1393J3266J5078
$$ 437519 442705 447829 453621 460301 467663 475634 484235 493170 502024 510949 520731 532124 545390 560468
63237E60468J6664J7818J8598J9571K1265K3507K5634K7229K8244K8683K8554
$$ 560468 577132 594950 613548 633119 654384 677891 703525 730754 758998 787681 816235
63226H16235K8132K7851K7889K8056K7985K7410K6362K5266K4598K4327K4022
$$ 816235 844367 872218 900107 928163 956148 983558 1009920 1035186 1059784 1084111 1108133
63215A108133K3503K2994K2527K1719K0452J9069J7550J5071J0946N556k89o337
$$ 1108133 1131636 1154630 1177157 1198876 1219328 1238397 1255947 1271018 1281964 1287520 1287231 1280894
63203A280894j2575j8399k3051k6636k9849l2677l4271l4169l2843l0876k8260
$$ 1280894 1268319 1249920 1226869 1200233 1170384 1137707 1103436 1069267 1036424 1005548 977288
63192I77288k4866k1036j7285j3740j0226o643l045M87L844O861R483J1857J4160
$$ 977288 952422 931386 914101 900361 890135 883492 880447 880934 884778 891639 901122 912979 927139
63179I27139J6358J8179J9320J9730J9633J9315J8966J8784J8964J9349J9247
$$ 927139 943497 961676 980996 1000726 1020359 1039674 1058640 1077424 1096388 1115737 1134984
63168A134984J8081J6121J4099J2222J0069P422M478J129l085q072j2907j6956
$$ 1134984 1153065 1169186 1183285 1195507 1205576 1212998 1217476 1218605 1215520 1207448 1194541 1177585
63156A177585k0597k4385k8131l1235l3359l4258l3645l1788k9670k8003k6540
$$ 1177585 1156988 1132603 1104472 1073237 1039878 1005620 971975 940187 910517 882514 855974
63145H55974k4859k3100k1376j9228j6417j3612j1459r633p633n830m733l892
$$ 855974 831115 808015 786639 767411 750994 737382 725923 716290 708657 702827 698094 694202
63133F94202k612j178k00O76K127L656M189L923M119N118O023O417O816P190O465
$$ 694202 691590 690412 690212 690888 693015 696671 700860 704783 708902 714020 720043 726460 733276 740466 746931
63118G46931M255J780L74p8m52r81j282j268j272j505j856k105k142k126k393
$$ 746931 751186 752966 753340 753262 752810 751829 750547 749279 748007 746502 744646 742541 740399 738273 735880
63103G35880k981l407l311l050l070l074k477j483q60p68p00m03j3O08J677K698
$$ 735880 732899 729492 726181 723131 720061 716987 714510 713027 712167 711399 710699 710296 710283 710891 712568 715266
63087G15266K913K542K510K856K667J759J265K020L413M409M812N031N350N937
$$ 715266 718179 720721 723231 726087 728754 730513 731778 733798 737211 741620 746432 751463 756813 762750
63073G62750O903P952Q568Q819R358J0409J1496J2363J3328J4592J6001J7677
$$ 762750 769653 777605 786173 794992 804350 814759 826255 838618 851946 866538 882539 900216
63061I00216J9940K2470K4602K6644K9649L3574L6950L9075M1163M4505M8632
$$ 900216 920156 942626 967228 993872 1023521 1057095 1094045 1133120 1174283 1218788 1267420
63050A267420N2332N5415N8408O1214O3374O5023O6512O7396O6842O4910O2614
$$ 1267420 1319752 1375167 1433575 1494789 1558163 1623186 1689698 1757094 1823936 1888846 1951460
63039A951460O0838N9650N8536N6907N4654N2406N0765M9187M6452M2407L8241
$$ 1951460 2012298 2071948 2130484 2187391 2242045 2294451 2345216 2394403 2440855 2483262 2521503
63028B521503L4487K9924K3226J4715N503m237j4948k6365l7652m8433n8545o7117
$$ 2521503 2555990 2585914 2609140 2623855 2629358 2625121 2610173 2583808 2546156 2497723 2439178 2372061
63016B372061p3029p6127p7204p6940p5514p2904o8763o2476n4218m5520l7862
$$ 2372061 2299032 2222905 2145701 2068761 1993247 1920343 1851580 1789104 1734886 1689366 1651504
63005A651504l1056k3909j6103q423j461M853J0586J5730K0645K5589K9890L2618
$$ 1651504 1620448 1596539 1580436 1572013 1570552 1575405 1585991 1601721 1622366 1647955 1677845 1710463
62993A710463L4037L5298L6622L6928L5589L3530L2030L1212L0212K8407K5908
$$ 1710463 1744500 1779798 1816420 1853348 1888937 1922467 1954497 1985709 2015921 2044328 2070236
62982B070236K3089J9874J5595R558J973o018j3529k0824k8558l6549m3965n0386
$$ 2070236 2093325 2113199 2128794 2138352 2140325 2134307 2120778 2099954 2071396 2034847 1990882 1940496
62970A940496n5901o0360o3403o5179o6105o5981o4262o1322n8434n6164n3696
$$ 1940496 1884595 1824235 1760832 1695653 1629548 1563567 1499305 1437983 1379549 1323385 1269689
62959A269689n0264m6392m3116m0570l8097l5351l2588l0065k7797k5885k4540
$$ 1269689 1219425 1173033 1129917 1089347 1051250 1015899 983311 953246 925449 899564 875024
62948H75024k3583k2348k0321j7741j5406j3927j3292j3086j2824j2152j0899
$$ 875024 851441 829093 808772 791031 775625 761698 748406 735320 722496 710344 699445
62937F99445r253p632o217m815l485k898l489m473m550l547k532k150j880j277
$$ 699445 690192 682560 676343 671528 668043 665145 661656 657183 652633 649086 646554 644404 642524 641247
62923F41247r10j376k257k868l359m164m939n045m698m608m745m474l798l468
$$ 641247 640337 638961 636704 633836 630477 626313 621374 616329 611631 607023 602278 597804 594006 590538
62909E90538l761m093l992l680l463l171k498j522o38j55m7P3M90P92K15j119
$$ 590538 586777 582684 578692 575012 571549 568378 565880 564358 563720 563565 563518 563591 564081 564873 565088 563969
62893E63969j923j330j94L9p13j300j114o58l67J2P03J393J726J606R53k00j276
$$ 563969 562046 560716 560522 560561 559848 558548 557434 556776 556409 556421 557124 558517 560243 561849 562802 562602 561326
62876E61326j521r44l26j99m45q65j425j846j704j121p29q19j097j284j293q62
$$ 561326 559805 558861 558535 558336 557891 557026 555601 553755 552051 550930 550201 549382 548285 547001 545708 544846
62860E44846J79J217J320N83J87Q88K221L373L962L710K421O91k85j82L4l45p33
$$ 544846 545025 546242 547562 548145 548332 549220 551441 554814 558776 562486 564907 565598 565313 565131 565165 564820 564087
62843E64087m58l0k44p56p10k76m35j340k001j689q13j90j00k40j79K97R95J417
$$ 564087 563629 563599 563355 562599 561889 561613 561178 559838 557837 556148 555335 555145 555045 554805 554626 554923 555918 557335
62825E57335J360J300J839K876L706L912L737L638L822M279M829N084M708L874
$$ 557335 558695 559995 561834 564710 568416 572328 576065 579703 583525 587804 592633 597717 602425 606299
62811F06299L185L014L197L443L762M291M972N585O016O300O517O843P553Q737
$$ 606299 609484 612498 615695 619138 622900 627191 632163 637748 643764 650064 656581 663424 670977 679714
62797F79714R985J0691J0838J1247J2846J5699J9082K2340K5406K8413L1344L4301
$$ 679714 689699 700390 711228 722475 735321 751020 770102 792442 817848 846261 877605 911906
62785I11906L7784M2223M7336N2315N6720O0867O5356P0429P5816Q0997Q5445
$$ 911906 949690 991913 1039249 1091564 1148284 1209151 1274507 1344936 1420752 1501749 1587194
62774A587194Q8829R1071R2258R2448R1538Q9210Q4947P8289O9110N7650M4309
$$ 1587194 1676023 1767094 1859352 1951800 2043338 2132548 2217495 2295784 2364894 2422544 2466853
62763B466853K9592J4167j416j7105l2959m8314o1820p2669q1281q8372r3749
$$ 2466853 2496445 2510612 2509196 2492091 2459132 2410818 2348998 2276329 2195048 2106676 2012927
62752B012927r6618r6845r5284r2902r0032q6472q1939p6505p0732o5253o0074
$$ 2012927 1916309 1819464 1724180 1631278 1541246 1454774 1372835 1296330 1225598 1160345 1100271
62741A100271n4657m8903m3502l8939l4766l0507k6672k4002k2141k0057j7509
$$ 1100271 1045614 996711 953209 914270 879504 848997 822325 798323 776182 756125 738616
62730G38616j5075j2897j0529q079o326n458m756l803l043k703k130p71R53K414
$$ 738616 723541 710644 700115 692036 685710 680252 675496 671693 668650 665947 663817 663046 663999 666413
62716F66413L744N374P239R069J1014J3288J5592J7530J9335K1570K4320K7287
$$ 666413 670157 675531 682770 691839 702853 716141 731733 749263 768598 790168 814488 841775
62704H41775L0411L3854L7478M0887M4023M7175N0486N3790N7038O0443O4086
$$ 841775 872186 906040 943518 984405 1028428 1075603 1126089 1179879 1236917 1297360 1361446
62693A361446O7699P0937P3589P5271P5113P2164O6324N8594N0138M1049L0374
$$ 1361446 1429145 1500082 1573671 1648942 1724055 1796219 1862543 1921137 1971275 2012324 2042698
62682B042698J7521L251j0905k3976l5883m6773n6485o4624p0846p5037p7430
$$ 2042698 2060219 2063470 2052565 2028589 1992706 1945933 1889448 1824824 1753978 1678941 1601511
62671A601511p8339p7617p4835p0317o5489o1534n8171n4485n0508m6884m3386
$$ 1601511 1523172 1445555 1370720 1300403 1234914 1173380 1115209 1060724 1010216 963332 919946
62660I19946l9127l4308l0355k7932k6036k3656k1140j9154j7374j5231j3185
$$ 919946 880819 846511 816156 788224 762188 738532 717392 698238 680864 665633 652448
62649F52448j2097j1820j1462j0742j0049r341q039o103m342l352k871k397j945
$$ 652448 640351 628531 617069 606327 596278 586937 578898 572795 568453 565101 562230 559833 557888
62636E57888j803j946k096k163k296k559k753k673k389k144k010j791j347q02
$$ 557888 556085 554139 552043 549880 547584 545025 542272 539599 537210 535066 533056 531265 529918 529116
62622E29116l04K30Q73J443J816K237K972L798M336M698N270N946O264O191O156
$$ 529116 528812 529042 529915 531358 533174 535411 538383 542181 546517 551215 556485 562431 568695 574886 581042
62607E81042O362O749P590R283J1442J3107J4180J5687J8277K1305K3908K6193
$$ 581042 587404 594153 601743 611026 622468 635575 649755 665442 683719 705024 728932 755125
62595G55125K8702L1456L4187L6964L9878M2547M4596M6131M7162M7063M5246
$$ 755125 783827 815283 849470 886434 926312 968859 1013455 1059586 1106748 1153811 1199057
62584A199057M1916L7566L2234K5841J8767J1301L143n803j4518k1786k7589l2702
$$ 1199057 1240973 1278539 1310773 1336614 1355381 1366682 1369825 1364022 1349504 1327718 1300129 1267427
62572A267427l7192m0465m2555m4170m5331m5141m3252m0649l8407l6393l3761
$$ 1267427 1230235 1189770 1147215 1103045 1057714 1012573 969321 928672 890265 853872 820111
62561H20111l0309k6755k3885k1774j9830j7457j4740j2435j1130j0575j0107
$$ 820111 789802 763047 739162 717388 697558 680101 665361 652926 641796 631221 621114
62550F21114r465q798q023o769m983l154j784r75n72l48p6K49K95k27j027j464
$$ 621114 611649 602851 594828 588059 583076 579922 578138 577163 576591 576243 576167 576416 576711 576484 575457 573993
62534E73993j247n99J57Q55J461K116L161M714O420P963R574J1518J3431J4863
$$ 573993 572746 572147 572304 573159 574620 576736 579897 584611 591031 598994 608568 620086 633517 648380
62520F48380J6284J8584K1592K4049K5394K6638K8957L2204L5468L8399M1267
$$ 648380 664664 683248 704840 728889 754283 780921 809878 842082 877550 915949 957216
62509I57216M3988M6080M7449M8473M9164M8871M7019M3798L9879L5709L1327
$$ 957216 1001204 1047284 1094733 1143206 1192370 1241241 1288260 1332058 1371937 1407646 1438973
62498A438973K6600K1538J6426J1905Q722P196O945P265P898R151J1242J3734
$$ 1438973 1465573 1487111 1503537 1515442 1524164 1531360 1538305 1545570 1553468 1562619 1573861 1587595
62486A587595J5906J7539J9028K0615K1727K1140J7699J1064K156p102j4990k1430
$$ 1587595 1603501 1621040 1640068 1660683 1682410 1703550 1721249 1732313 1734469 1727367 1712377 1690947
62474A690947k7978l6107m5546n4480o1114o4833o6210o6334o6047o5321o3417
$$ 1690947 1662969 1626862 1581316 1526836 1465722 1400889 1334679 1268345 1202298 1136977 1073560
62463A073560n9833n5010m9786m4441l8742l2851k7540k3338j9910j6564j3048
$$ 1073560 1013727 958717 908931 864490 825748 792897 765357 742019 722109 705545 692497
62452F92497r651o750m528k945j716m46J066K668M069N156N964O528O913P263
$$ 692497 682846 676096 671568 668623 666907 666461 667527 670195 674264 679420 685384 691912 698825 706088
62438G06088P610P666P019N581L665J566p12l115n206o516p220p978r018r816
$$ 706088 713698 721364 728383 733964 737629 739195 738483 735368 730162 723646 716426 708448 699430 689614
62424F89614r929r701r656r704r485r223r413r797r547q473p264o281n090l523
$$ 689614 679685 669984 660328 650624 641139 631916 622503 612706 603159 594686 587422 581141 576051 572528
62410E72528k306j996k097j945j804k129k362j508K67J731K173K007J803J683
$$ 572528 570222 568226 566129 564184 562380 560251 557889 556381 556648 558379 560552 562559 564362 566045
62396E66045J846K688M061N113N337N149N044M859M371M056M520N553O385O762
$$ 566045 567891 570579 574640 579753 585090 590239 595283 600142 604513 608569 613089 618642 625027 631789
62382F31789P054P394P374O779O071N820N981O153O320O835P702Q371Q512Q617
$$ 631789 638843 646237 653611 660390 666461 672281 678262 684415 690735 697570 705272 713643 722155 730772
62368G30772R426J0979J2715J4428J6562J9367K2410K5307K8452L2412L6799M0480
$$ 730772 740198 751177 763892 778320 794882 814249 836659 861966 890418 922830 959629 1000109
62356A000109M2893M4539M5974M6796M6017M3196L8795L3579K7967K1970J5557
$$ 1000109 1043002 1087541 1133515 1180311 1226328 1269524 1308319 1341898 1369865 1391835 1407392
62345A407392Q906K439l305p891j1263j3912j6626j9805k2986k5230k6054k5848
$$ 1407392 1416298 1418737 1415432 1407541 1396278 1382366 1365740 1345935 1322949 1297719 1271665 1245817
62333A245817k5362k4933k4342k3183k1244j8700j6148j4317j3495j3321j3257
$$ 1245817 1220455 1195522 1171180 1147997 1126753 1108053 1091905 1077588 1064093 1050772 1037515
62322A037515j3229j3603j4557j5688j6303j6063j5292j4701j4719j5099j5229
$$ 1037515 1024286 1010683 996126 980438 964135 948072 932780 918079 903360 888261 873032
62311H73032j4836j4205j3759j3568j3349j2826j1977j1037j0287r709q964p756
$$ 873032 858196 843991 830232 816664 803315 790489 778512 767475 757188 747479 738515 730759
62299G30759o254m869l738k650j463l34M81Q28P30M38L56N97P59N38M21J134K492
$$ 730759 724505 719636 715898 713248 711785 711451 711932 712760 713490 713928 714284 714881 715640 716178 716599 717733 720225
62282G20225L452L468L119L148L519L827M072M548N236N835O248O722P594R002
$$ 720225 723677 727145 730264 733412 736931 740758 744830 749378 754614 760449 766697 773419 781013 790015
62268G90015J0696J2129J3119J4307J6565J9948K3708K7350L0919L4374L7487
$$ 790015 800711 812840 825959 840266 856831 876779 900487 927837 958756 993130 1030617
62257A030617M0479M3757M6836M8576M8821M8604M8156M6015M1107L4515K7987
$$ 1030617 1071096 1114853 1161689 1210265 1259086 1307690 1355846 1401861 1442968 1477483 1505470
62246A505470K1645J4557O822n32p307j4184k1126k7222l2174l6586m0626m3626
$$ 1505470 1527115 1541672 1548494 1547962 1540655 1526471 1505345 1478123 1445949 1409363 1368737 1325111
62234A325111m5316m6241m6542m5423m2449l8492l4799l1709k8841k5944k3059
$$ 1325111 1279795 1233554 1187012 1141589 1099140 1060648 1025849 994140 965299 939355 916296
62223I16296k0239j7599j5319j3367j1478r621q128p207o609n990n235m420l679
$$ 916296 896057 878458 863139 849772 838294 828673 820545 813338 806729 800739 795504 791084 787405
62210G87405l169k830k289j321k48N90J508K978M562N217M726M136M447N538O627
$$ 787405 784236 781406 779117 777796 777548 778138 779646 782624 787186 792403 797129 801265 805712 811250 817877
62195H17877P175P007O162N104M721N563P175Q538R079R020Q928R080R324R364
$$ 817877 825052 832059 838221 843325 848046 853609 860784 869322 878401 887421 896349 905429 914753 924117
62181I24117R088Q499P465N925M359L657M120N040N576N807O536Q390J1422J5167
$$ 924117 933205 941704 949169 955094 959453 963110 967230 972270 977846 983653 990189 998579 1010001 1025168
62167A025168J8721K1261K2989K5037K7750K9743K9483K7306K4706K2068J8325
$$ 1025168 1043889 1065150 1088139 1113176 1140926 1170669 1200152 1227458 1252164 1274232 1292557
62156A292557J2814O274j05n584r738j2546j4896j8021k2038k5736k8110k9317
$$ 1292557 1305371 1311645 1311540 1305956 1296218 1283672 1268776 1250755 1228717 1202981 1174871 1145554
62144A145554k9931l0085k9681k8689k6935k4215k0922j7903j5525j3515j1775
$$ 1145554 1115623 1085538 1055857 1027168 1000233 976018 955096 937193 921668 908153 896378
62133H96378j0567r777q929q151q173q971r430q864p981p742p957p704o506m543
$$ 896378 885811 876034 867105 858954 850781 841810 832380 823516 815535 807793 799836 792132 785626 781083
62119G81083k192L3J562K330K860L476L931M155M657N712O772P224P194O990O309
$$ 781083 778891 778924 780486 782816 785676 789152 793083 797238 801895 807607 814379 821603 828797 835787 842096
62104H42096M666K289m0j771k722k749j862n35N82J215J456J298N22r91k952m619
$$ 842096 846762 849051 849011 847240 844518 841769 839907 839372 839954 841169 842625 843923 844445 843454 840502 835883
62088H35883n196m487l111j777n47Q57K303L453M457N747P314Q923J0817J3275
$$ 835883 830687 826200 823089 821312 820765 821622 823925 827378 831835 837582 844896 853819 864636 877911
62074H77911J5610J6792J7033J7543J8561J9007J8393J7744J7940J8476J8642
$$ 877911 893521 910313 927346 944889 963450 982457 1000850 1018594 1036534 1055010 1073652
62063A073652J8759J9281J9642J9064J7703J6001J3622R995N359M23m458q963
$$ 1073652 1092411 1111692 1131334 1150398 1168101 1184102 1197724 1207719 1213078 1213501 1209043 1200080
62051A200080j2367j4344j5668j7305j9320k1394k3645k6020k7663k7992k7823
$$ 1200080 1187713 1173369 1157701 1140396 1121076 1099682 1076037 1050017 1022354 994362 966539
62040I66539k8254k8896k8496k6926k5252k4051k2936k1710k0691j9747j8235
$$ 966539 938285 909389 880893 853967 828715 804664 781728 760018 739327 719580 701345
62029G01345j6187j4569j3939j3605j2639j1027r451q362p706p225o767o343o052
$$ 701345 685158 670589 656650 643045 630406 619379 609928 601566 593860 586635 579868 573525 567473
62016E67473n886n703n504n512n806o071n889n043l489j497J61P95Q32J454K853
$$ 567473 561587 555884 550380 544868 539062 532991 527102 522059 518570 517073 517234 518029 518861 520315 523168
62001E23168L716L080J795J324J818K364K534K543K302J434P7j275k553l902m950
$$ 523168 526884 529964 531759 533083 534901 537265 539799 542342 544644 546078 546155 544880 542327 538425 533475
61986E33475n280n378o109p334q059p895p389o884o099m975l995l402k889k268
$$ 533475 528195 522817 516708 509374 501315 493420 486031 479147 473048 468073 464078 460676 457787 455519
61972D55519j759j403r22k61K97P26J257J759J787J407J267J658K087K042J645
$$ 455519 453760 452357 451435 451174 451471 452197 453454 455213 457000 458407 459674 461332 463419 465461 467106
61957D67106J332J339J666K132K414K430K655L569M864N734N940O032O469P145
$$ 467106 468438 469777 471443 473575 475989 478419 481074 484643 489507 495241 501181 507213 513682 520827
61943E20827P779Q317Q792R300J0059J1068J1796J1747J1211J0842J0628J0004
$$ 520827 528606 536923 545715 555015 565074 576142 587938 599685 610896 621738 632366 642370
61931F42370Q872P748O802N577L881K236J197P28M29j04j162k575l534l343k404
$$ 642370 651242 658990 665792 671369 675250 677486 678683 679411 679840 679736 678574 675999 672465 669122 666718
61916F66718j714j407n92J165L141M596N773P217Q751R726R899R526Q850P885
$$ 666718 665004 663597 663005 664170 667311 671907 677680 684897 693648 703374 713273 722799 731649 739534
61902G39534O585M955L207J820J083N33o51k536m187m792m561m283m352m596m713
$$ 739534 746119 751074 754281 756101 757184 757717 757066 754530 750343 745551 740990 736707 732355 727759 723046
61887G23046m561m195l847l773m058m694n776p274q667r300r161q908q997r119
$$ 723046 718485 714290 710443 706670 702612 697918 692142 684868 676201 666901 657740 648832 639835 630716
61873F30716q660p422n762m242l148k221r81M96J497J806K397M224O652Q089Q180
$$ 630716 622056 614634 608872 604630 601482 599261 598280 598776 600273 602079 604476 608700 615352 623441 631621
61858F31621Q261R443J1312J3009J4560J6315J7807J8250J7869J7792J8583J9602
$$ 631621 639882 649325 660637 673646 688206 704521 722328 740578 758447 776239 794822 814424
61846H14424J9922J9350J8277J6928J5170J2878J0181P222M003O98k057l675m314
$$ 814424 834346 853696 871973 888901 904071 916949 927130 934352 938355 939053 936996 933321 929007
61833I29007m622m726m057k470p04P03K313M721P195Q334P842O641N325L620J377
$$ 929007 924385 919659 915602 913132 912428 913131 915444 920165 927360 935694 943536 950177 955502 959122 960499
61818I60499q89k873m963p494j0160j2510j4488j6104j7067j7119j6405j5344
$$ 960499 959610 956737 951774 944280 934120 921610 907122 891018 873951 856832 840427 825083
61806H25083j4446j4222j4691j4982j4129j2381j1054j0830j0947j0377r083p732
$$ 825083 810637 796415 781724 766742 752613 740232 729178 718348 707401 697024 687941 680209
61794F80209o703o001n666n701n821n646n037m096l025k137j682j608j671j850
$$ 680209 673506 667505 661839 656138 650317 644671 639634 635538 632513 630376 628694 627086 625415 623565
61780F23565k205k474k307j900j777j903j627p37J91O71R40J441K228L232M470
$$ 623565 621360 618886 616579 614679 612902 610999 609372 608635 608826 609497 610437 611878 614106 617338 621808
61765F21808N673O240N983N530N527N879O075N887N360M484L253J822L08j359
$$ 621808 627481 633721 639704 645234 650761 656640 662715 668602 673962 678446 681699 683521 683829 682470
61751F82470l212m997o363p128p396p599q210r045r149p939o232n362n405n238
$$ 682470 679258 674261 667898 660770 653374 645775 637565 628520 619371 611432 605200 599838 594433 589195
61737E89195m384l691l871m361m236l446k585j994j702j715j827j617j045o02
$$ 589195 584811 581120 577249 572888 568652 565206 562621 560627 558925 557210 555383 553766 552721 552119
61723E52119n23m11J2L53K26q6j08J65M58O56O50K54l79q10j028j522k334k789
$$ 552119 551596 551185 551197 551550 551776 551690 551582 551747 552205 552861 553511 553765 553386 552576 551548 550026 547692 544903
61705E44903k642k633l286l916l641k743k213k366k744k988l031k743k112j598
$$ 544903 542261 539628 536342 532426 528785 526042 523829 521463 518719 515731 512700 509957 507845 506247
61691E06247j660k168k777l507m386m911m604l820l284l084k740k091j494j263
$$ 506247 504587 502419 499642 496135 491749 486838 482234 478414 475130 472046 469306 467215 465721 464458
61677D64458j439j927k349k150j323o65p59j082q62l22k14m13l4J116K190K513
$$ 464458 463019 461092 458743 456593 455270 454605 453846 452764 451902 451580 451366 450953 450919 452035 454225 456738
61661D56738K306K022J759J584J740K203K499K298J760J148M96j25l58N4Q38J389
$$ 456738 459044 461066 462825 464409 466149 468352 470851 473149 474909 476057 476553 476428 476070 476124 476962 478351
61645D78351J415J294J776L156M649M943L582J572L17K26P10J175J450J404Q46
$$ 478351 479766 481060 482836 485992 490641 495584 499166 500738 501055 501281 501991 503166 504616 506020 506866
61630E06866j22j152k110l118m043m398l901k830j762j175j291j964k648k752
$$ 506866 506744 505592 503482 500364 496321 491923 488022 485192 483430 482255 480964 479000 476352 473600
61616D73600k168j376r50j100j617k104k287k242k295k645l097l287l098k793
$$ 473600 471432 470056 469106 468006 466389 464285 461998 459756 457461 454816 451719 448432 445334 442541
61602D42541k774l212l805l955l453k829k735l014k870j979r00k37k8j64p83j795
$$ 442541 439767 436555 432750 428795 425342 422513 419778 416764 413894 411915 411015 410778 410750 410586 409803 408008
61586D08008k566k611k247k026j888j463q88o64q88j165j254j266j266j082n96
$$ 408008 405442 402831 400584 398558 396670 395207 394319 393655 392767 391602 390348 389082 387816 386734 386138
61571C86138R5Q33J464J851J946J787J343O24J9J21R32J678J742J450J466J791
$$ 386138 386233 387066 388530 390381 392327 394114 395457 396081 396100 396221 397153 398831 400573 402023 403489 405280
61555D05280J921J779J821K218K494K182J515J186J493J916J713Q91L24O02J183
$$ 405280 407201 408980 410801 413019 415513 417695 419210 420396 421889 423805 425518 426409 426733 427335 428518
61540D28518J115L72k23k56j3M79J610L061L592K606J034N4l50p60j099r96p98
$$ 428518 429633 430005 429782 429526 429513 429992 431602 434663 438255 440861 441895 441949 441599 440839 439740 438744 437946
61523D37946j198k076k624k432j734q89k26k09r10j585j430n97J29L77K78j50
$$ 437946 436748 434672 432048 429616 427882 426993 426767 426558 425648 424063 422633 422036 422165 422542 422820 422670
61507D22670q98j481j308m42O15J678K752L474L423K845K397K308K382K572K874
$$ 422670 421772 420291 418983 418541 419156 420834 423586 427060 430483 433328 435725 438033 440415 442987 445861
61492D45861K903K378J757J681J982K033J811J768J876J710J386J447J865K065
$$ 445861 448764 451142 452899 454580 456562 458595 460406 462174 464050 465760 467146 468593 470458 472523
61478D72523J873J608J282O49l6k73l36r67k002k384j736q62m43l22l62r19j834
$$ 472523 474396 476004 477286 477935 477899 477626 477290 476323 474321 471937 470201 469339 468896 468574 468212 467293 465459
61461D65459k124j385o29r17j842k218j774j224j035r72p64n26l60n0O59J671
$$ 465459 463335 461950 461321 460404 458562 456344 454570 453346 452311 451339 450575 450049 449689 449639 450298 451969
61445D51969K522K813K618K428K534K688K586K391K349K202J635J047J118J676
$$ 451969 454491 457304 459922 462350 464884 467572 470158 472549 474898 477100 478735 479782 480900 482576
61431D82576J871J519J357J728J966J530R02P84J122J504J951K626L220L304K992
$$ 482576 484447 485966 487323 489051 491017 492547 493449 494233 495355 496859 498810 501436 504656 507960 510952
61416E10952K671K344J818J238Q53M63l08j238j667j409j012r58j047q31l34m6
$$ 510952 513623 515967 517785 519023 519876 520339 520031 518793 517126 515717 514705 513747 512700 511869 511535 511489
61400E11489k84p61q80l84L86Q80R00O97O16P94J150J491J627J591J721K326L235
$$ 511489 511205 510444 509564 509180 509566 510446 511346 512043 512659 513453 514603 516094 517721 519312 521033 523359 526594
61383E26594L871L882L531L418L754M069L649K401J197J061J931K589K010M60
$$ 526594 530465 534347 537878 541296 545050 549119 552768 555169 556366 557427 559358 561947 563957 564417
61369E64417j047j974k488k745k575j991j423j262j360j215n16N40J439J915K294
$$ 564417 563370 561396 558908 556163 553588 551597 550174 548912 547552 546337 545821 546361 547800 549715 552009
61354E52009L150M536N883O661O911O921O784O464N960N139L801K147Q07J06k18
$$ 552009 555159 559695 565578 572239 579150 586071 592855 599319 605279 610418 614219 616366 617173 617279 617061
61339F17061l93k67O5J5n92j038p68l70o70j439j850j677j199l93P49J527J366
$$ 617061 616668 616401 616466 616481 615889 614851 614083 613713 613043 611604 609754 608077 606878 606485 607234 608761 610127
61322F10127J065J974L983N581O055O349P403Q774R537R640R700J0079J0776J1760
$$ 610127 611192 613166 617149 622730 628785 635134 642537 651311 660848 670488 680188 690267 701043 712803
61308G12803J2950J4084J4927J5455J5634J5284J4136J1930Q572M506O93k245
$$ 712803 725753 739837 754764 770219 785853 801137 815273 827203 835775 840281 840974 838729
61296H38729m621o992r202j0670j1334j1618j1700j1509j1218j1003j0530r440
$$ 838729 834108 827116 817914 807244 795910 784292 772592 761083 749865 738862 728332 718892
61284G18892q094p103o336n281m077l244k663j853j038p98p92o5J374K549L071
$$ 718892 710798 703695 697359 692078 688001 684757 682094 680241 679203 678405 677613 677548 678922 681471 684542
61269F84542L481L952L991L660L766M460M914M830M952N639O148N939N508N218
$$ 684542 688023 691975 695966 699626 703392 707852 712766 717596 722548 728187 734335 740274 745782 751000
61255G51000M463K768P58p86j936k955l524l468l428l923m390m010k909j773q38
$$ 751000 755463 758231 758989 758203 756267 753312 749788 746320 742892 738969 734579 730569 727660 725887 725049
61240G25049K1O56Q44P99Q68J029J137J313J719K336L222M513N937O938P435P878
$$ 725049 725070 725726 726570 727369 728237 729266 730403 731716 733435 735771 738993 743506 749443 756381 763816 771694
61224G71694Q341Q438Q273Q572R442R952R499Q672Q237Q056P700P292P101O958
$$ 771694 780035 788473 796746 805318 814760 824712 834211 842883 851120 859176 866876 874168 881269 888227
61210H88227O637O260N831N101M303M265N255O550P621Q881J0643J2292J3219
$$ 888227 894864 901124 906955 912056 916359 920624 925879 932429 940050 948931 959574 971866 985085
61197I85085J3791J4650J5678J6417J6706J6315J4704J1887Q811O145L486M45
$$ 985085 998876 1013526 1029204 1045621 1062327 1078642 1093346 1105233 1114044 1120189 1123675 1124120
61185A124120k328m112n333o922q960j0811j2107j2874j3201j3461j4284j5718
$$ 1124120 1121792 1117680 1112347 1105425 1096465 1085654 1073547 1060673 1047472 1034011 1019727 1004009
61173A004009j7029j7753j8271j8773j8688j7827j6969j6530j5714j3985j2320
$$ 1004009 986980 969227 950956 932183 913495 895668 878699 862169 846455 832470 820150
61162H20150j1790j1808j1055r364p436n449l281j429l94L69J591K880L485L838
$$ 820150 808360 796552 785497 776133 768697 763248 759967 758538 758144 758513 760104 762984 766469 770307
61148G70307M866O161O314M856K589K13k093l800m085k912j064Q56K697M248N457
$$ 770307 775173 781334 787648 792504 795093 795306 793213 789413 785328 782416 781352 782208 784905 789153 794610
61133G94610O951R325J2102J4292J5797J7320J9137K0920K2593K4371K6128K7536
$$ 794610 801561 810886 822988 837280 853077 870397 889534 910454 933047 957418 983546 1011082
61121A011082K8705K9906L1042L2029L3213L4589L5284L4738L3749L3242L2726
$$ 1011082 1039787 1069693 1100735 1132764 1165977 1200566 1235850 1270588 1304337 1337579 1370305
61110A370305L1202K8929K6903K5205K3347K1668K0688J9473J6465J1807P208
$$ 1370305 1401507 1430436 1457339 1482544 1505891 1527559 1548247 1567720 1584185 1595992 1603200
61099A603200L543K87k719m752n715o466p206p094n943m843m520m334l523k362
$$ 1603200 1606743 1607030 1604311 1599559 1593844 1587378 1580172 1573078 1567135 1562292 1557772 1553438 1549915 1547553
61085A547553j527j174j162j334j314q32l86q84k469m493o544q598j0385j1625
$$ 1547553 1546026 1544852 1543690 1542356 1541042 1540210 1539824 1538940 1536471 1531978 1525434 1516836 1506451 1494826
61071A494826j2808j4565j6454j7564j8054j8768j9496j9240j8100j7299j7195
$$ 1494826 1482018 1467453 1450999 1433435 1415381 1396613 1377117 1357877 1339777 1322478 1305283
61060A305283j6905j6049j5184j4224j2227r204o506m804l280j316N14J795L083
$$ 1305283 1288378 1272329 1257145 1242921 1230694 1221490 1214984 1210180 1206900 1205584 1206098 1207893 1210976
61047A210976M687O141P439R215J1127J1690J0618R704J0358J1802J2629J2719
$$ 1210976 1215663 1221804 1229243 1238458 1249585 1261275 1271893 1281597 1291955 1303757 1316386 1329105
61035A329105J2535J1989J1199J1075J1945J2842J3138J3644J5030J6521J7431
$$ 1329105 1341640 1353629 1364828 1375903 1387848 1400690 1413828 1427472 1442502 1459023 1476454
61024A476454J8620K1129K4551K8029L1643L5582L9227M2473M6531N2025N7620
$$ 1476454 1495074 1516203 1540754 1568783 1600426 1636008 1675235 1717708 1764239 1816264 1873884
61013A873884O2302O7668P6097Q7863J01936J18380J37740J59344J82747K10109
$$ 1873884 1936186 2003854 2079951 2167814 2269750 2388130 2525870 2685214 2867961 3078070
61003C078070K44673K87497L38002L96675M64431N40119O22209P12473Q14688
$$ 3078070 3322743 3610240 3948242 4344917 4809348 5349467 5971676 6684149 7498837
60994G498837R30514J061376J213515J393292J594178J794558J971324K104701
$$ 7498837 8429351 9490727 10704242 12097534 13691712 15486270 17457594 19562295
60986A9562295K158345K065431J764545J269755O97825K06209j05241k33464k30174
$$ 19562295 21720640 23786071 25550616 26820371 27518196 27724405 27619164 27385700 27155526
60977B7155526j50443n4653l4141j89042n55366j059785j560012j933613k132394
$$ 27155526 27005083 26950430 26916289 26727247 26171881 25112096 23552084 21618471 19486077
60968A9486077k171244k089654j928869j726890j514190j308330j116137r41369
$$ 19486077 17314833 15225179 13296310 11569420 10055230 8746900 7630763 6689394
60960F689394p87812o56668n45803m52884l77034l16989k69870k32663k03352
$$ 6689394 5901582 5244914 4699111 4246227 3869193 3552204 3282334 3049671 2846319
60951B846319j80060j60587j43581j29101j17239j07004r7167q7473p8434p0464
$$ 2846319 2666259 2505672 2362091 2232990 2115751 2008747 1911580 1824107 1745673 1675209
60941A675209o3832n8948n5931n4160n2717n1134m9344m7135m4194m0677l7227
$$ 1675209 1611377 1552429 1496498 1442338 1389621 1338487 1289143 1242008 1197814 1157137 1119910
60930A119910l4241l1426k8263k4802k1726j9592j8227j6988j5554j4186j3207
$$ 1119910 1085669 1054243 1025980 1001178 979452 959860 941633 924645 909091 894905 881698
60919H81698j2501j1760j0921j0095r211q204p422p341p769p829p019n874n288
$$ 881698 869197 857437 846516 836421 827210 819006 811584 804243 796474 788645 781626 775752 770464
60906G70464n500o105o723p206p441p454p600q154q837r190r286r458r446q646
$$ 770464 764964 758859 752136 744930 737489 730035 722435 714281 705444 696254 686968 677510 668064 659418
60892F59418p289o495o754p208o951o282n952n709m624k630q10r4l21o78o04j48
$$ 659418 652129 645634 638880 631672 624721 618439 612487 606778 602154 599524 598714 598620 598299 597621 597017 596869
60876E96869J12m61j730k571k033o12K48p2p07n56M68J669K493K875L069L423
$$ 596869 596981 596520 594790 592219 590186 589574 589822 589750 589043 588487 588955 590624 593117 595992 599061 602484
60860F02484M095M757M802M072L115K629K825L419L970M088L548K385Q54p06j916
$$ 602484 606579 611336 616138 620210 623325 625954 628779 632198 636168 640256 643804 646189 647043 646337 644421
60845F44421k474k448k253k176k182k415l461n540p817r147r407r361r420r304
$$ 644421 641947 639499 637246 635070 632888 630473 627012 621472 613655 604508 595101 585740 576320 567016
60831E67016q926q694q712q461p579o380n281m330l539l144l150l113k726k219
$$ 567016 558090 549396 540684 532223 524644 518264 512983 508653 505114 501970 498820 495707 492981 490762
60817D90762j890j645j363j281j671k350k759k446j429l16N6n08j112p16M94J280
$$ 490762 488872 487227 485864 484583 482912 480562 477803 475357 473928 473612 473668 473160 472048 471332 471826 473106
60801D73106R44J28j71L05J126J776J905J524J197J519K248K428J637M40n25j212
$$ 473106 474050 474178 474007 474312 475438 477214 479119 480643 481840 483359 485607 488035 489672 490112 489587 488375
60785D88375j656j531p72p6k12j120k123k671k681k447k470k964l420l166k449
$$ 488375 486719 485188 484416 484340 484128 483008 480885 478214 475533 473086 470616 467652 464232 461066 458617
60770D58617k204k604k697j880q78n83p09m28K33N41K89J7J34M36O04O47P85J088
$$ 458617 456413 453809 451112 449232 448354 447771 447062 446634 446867 447408 447697 447714 447848 448284 448888 449535 450320 451408
60752D51408J301J030L07j54K86J204J550J100P32R80J163M69q45j910k365k438
$$ 451408 452709 453739 454046 453892 454178 455382 456932 458032 458764 459744 460907 461376 460531 458621 456256 453818
60736D53818k360k223k045j581n66N83R05J77n91m46M04J325K238L175L576L046
$$ 453818 451458 449235 447190 445609 445043 445626 446531 446708 446117 445671 446075 447400 449638 452813 456389 459435
60720D59435K279K215K582K324J245L23L73J182J991K242J809J037M81K41k07
$$ 459435 461714 463929 466511 468835 470080 470403 470776 471958 473949 476191 478000 479037 479518 479759 479552
60705D79552j193k228k740k986l532m163m149l426k742k529k419j920j091l56
$$ 479552 478359 476131 473391 470405 466873 462710 458561 455135 452393 449864 447445 445525 444434 444078
60691D44078o3k71p22r79q07l36K59R58J634J946J819J646J707J800J795J969
$$ 444078 444015 443744 443022 442043 441236 440900 441159 442117 443751 445697 447516 449162 450869 452669 454464 456433
60675D56433K434K719K530K384K815L340L012J725K63p89j567k437l440m173m001
$$ 456433 458867 461586 464116 466500 469315 472655 475667 477392 477655 476866 475299 472862 469422 465249 461248
60660D61248k638q01K47J54j14L04J019J221Q95M33k11r99j116N8J691K370J963
$$ 461248 458610 457809 458056 458210 458096 458400 459419 460640 461535 461968 461757 460758 459642 459700 461391 463761 465724
60643D65724J455J151L85r95k082k248j949j799j690j316r19r37j270j325p21
$$ 465724 467179 468330 468715 467720 465638 463390 461441 459642 457952 456636 455717 454780 453510 452185 451464
60628D51464K70R21P98L37L70R47J179N21l70o13l15p4J43O84J244J241Q78Q48
$$ 451464 451734 452655 453453 453790 454160 455107 456286 456807 456437 455824 455509 455435 455578 456262 457506 458747 459625 460473
60610D60473J114R77K91l24n09n12n50n69o24p22m10N96J561J494O60L22R36J711
$$ 460473 461587 462564 462855 462531 462022 461510 460960 460391 459767 459045 458635 459231 460792 462286 462946 463268 464204 465915
60592D65915K092K470L123L544L379L149L456M121M570M505L925K964K029J479
$$ 465915 468007 470477 473600 477144 480523 483672 487128 491249 495819 500324 504249 507213 509242 510721
60578E10721J037J87p45o63P67K520L501L767L976M320M559M695N044N978P735
$$ 510721 511758 511945 511200 510537 511304 513824 517325 521092 525068 529388 533947 538642 543686 549664 557399
60563E57399J0102J2113J2680J1794J0603J0034R911R647R018P811N502K047j495
$$ 557399 567501 579614 592294 604088 614691 624725 634636 644283 653301 661112 666614 668661 667166
60550F67166l896n043n616n810n141l517j718n55K3P19K040L926O026Q072R931
$$ 667166 663270 658227 652611 646801 641660 638143 636425 635870 635893 636612 638652 642578 648604 656676 666607
60535F66607J1525J2864J4139J5605J7353J9291K1288K3152K4514K4999K4599
$$ 666607 678132 690996 705135 720740 738093 757384 778672 801824 826338 851337 875936
60524H75936K3496K1479J8001J2958P019R99m597r286j2577j4607j6134j7351
$$ 875936 899432 920911 938912 951870 958889 959888 955291 946005 933428 918821 902687 885336
60512H85336j7399j5737j3275j1294r838q169o225m452k505M58M224P554R996
$$ 885336 867937 852200 838925 827631 817793 809624 803399 798947 796442 796900 801124 808678 818674
60499H18674J2470J5699J9178K2231K5202K8918L3531L8432M2848M6110M7804
$$ 818674 831144 846843 866021 888252 913454 942372 975903 1014335 1057183 1103293 1151097
60488A151097M8028M7174M5219M1650L6344L0098K3987J8490J3502Q918M885J625
$$ 1151097 1199125 1246299 1291518 1333168 1369512 1399610 1423597 1442087 1455589 1464507 1469392 1471017
60476A471017r16l394o996j2747k0685k9790l8670m6289n2198n6358n8726n9045
$$ 1471017 1470101 1466707 1459711 1446964 1426279 1396489 1357819 1311530 1259332 1202974 1144248 1085203
60464A085203n7314n4281n0899m7192m2473l6931l2018k8685k6163k3269k0048
$$ 1085203 1027889 973608 922709 875517 833044 796113 764095 735410 709247 685978 665930
60453F65930j7179j4658j2237j0450r796r471q274o466n316n072m821m143l473
$$ 665930 648751 634093 621856 611406 601610 592139 583865 577399 572083 567011 562190 558047 554574
60440E54574k840j755m57J27j69o07q55j232j624j561j408j953k718k337q61j
$$ 554574 551734 549979 549522 549649 549480 548873 548018 546786 545162 543601 542193 540240 537522 535185 534324 534323
60424E34323n52j265r26Q2J018J964K871K907J886J037J275J808J556Q60O47R09
$$ 534323 533771 532506 531580 531662 532680 534644 537515 540422 542308 543345 544620 546428 547984 548844 549491 550400
60408E50400J123J349J770J958J617J324J527J670J292J123J884K837K835K161
$$ 550400 551523 552872 554642 556600 558217 559541 561068 562738 564030 565153 567037 569874 572709 574870
60394E74870J958K316K344J861J650K110K783L220L343L040K287J688J910K646
$$ 574870 576828 579144 581488 583349 584999 587109 589892 593112 596455 599495 601782 603470 605380 608026
60380F08026K940K605K463L029L743L807L202K555K278K192J899J372J064J345
$$ 608026 610966 613571 616034 619063 622806 626613 629815 632370 634648 636840 638739 640111 641175 642520
60366F42520J969K394K516K593K603K272J842J995K831L670M087M378M717M764
$$ 642520 644489 646883 649399 651992 654595 656867 658709 660704 663535 667205 671292 675670 680387 685151
60352F85151M588N028O500Q147Q932Q850Q415P681O490N095L705J931n45l185
$$ 685151 689739 694767 701267 709414 718346 727196 735611 743292 749782 754877 758582 760513 759968 756783
60338G56783n202o539p536q134q079p539o840o034n278n121n667n996n253l882
$$ 756783 751581 745042 737506 729372 721293 713754 706914 700880 695602 690481 684814 678818 673565 669683
60324F69683k950k659k357j736j101o47k82KK35Q19K134L886N483O807Q134R442
$$ 669683 666733 664074 661717 659981 658880 658233 657951 657953 658188 659007 661141 665027 670510 677317 685451 694893
60308F94893J0447J1135J1751J2357J2835J3082J2938J2259J1327J0749J0555
$$ 694893 705340 716475 728226 740583 753418 766500 779438 791697 803024 813773 824328
60297H24328R951Q427O451M509K198r71m589p913j0930j3884j6270j7298j7040
$$ 824328 834279 842706 849157 853666 855864 854893 850304 842391 831461 817577 801307 784009 766969
60284G66969j6182j5011j3524j2199j1566j1191j0146q484p270p055p242p107
$$ 766969 750787 735776 722252 710053 698487 687296 677150 668666 661396 654341 647099 639992
60272F39992o654o208n880n627n345m707l473k081j383j616k033j762p62L04R20
$$ 639992 633338 627130 621250 615623 610278 605571 602098 600017 598634 597018 594985 593223 592461 592765 593685
60257E93685J251J841K800L418K904J403o3p10o04j67K92M02q0o91n65K03L88
$$ 593685 594936 596777 599577 602995 605899 607302 607239 606529 605925 605758 606050 606452 606372 605681 605116 605319 605707
60240F05707o51j917k119j332m86J71J091K327L442M259M924N365N386N209N300
$$ 605707 605056 603139 601020 599688 599202 599373 600464 602791 606233 610492 615416 620781 626167 631376 636676
60225F36676N817O623P610Q614R316R627R752R683R229Q817R392J0996J2312J2320
$$ 636676 642493 649116 656726 665340 674656 684283 694035 703718 712947 721764 731156 742152 754464 766784
60211G66784J1508J0732R933Q926Q406Q828R104P908N716M123L527K971J921P80
$$ 766784 778292 789024 798957 807883 816289 825117 834221 842129 847845 851968 855495 858466 860387 861167
60197H61167k66j508k820l798m746o262p877q431p908p564q017q469q205p574
$$ 861167 860901 859393 856573 852775 848029 841767 833890 825459 817551 809987 801970 793501 785296 777722
60183G77722p048o400n416m528m130l935l546l016k453j678p30j70m15j080j411
$$ 777722 770674 764274 758858 754330 750200 746265 742719 739703 737250 735572 734842 734672 734257 733177 731766
60168G31766j080m20Kj13n06o87o40q42j351j374m05P59R42K81O0R28K178K836
$$ 731766 730686 730266 730268 730155 729649 728962 728322 727480 726129 724755 724350 725109 726051 726332 726392 727320 729498 732334
60150G32334K727K334K236K852M154N468O022N745N198M898N028N536O053N959
$$ 732334 735061 737395 739631 742483 746637 752105 758127 763872 769070 773968 778996 784532 790585 796544
60136G96544N130M383M614N725O887P520P523O915N937N089M495L591K125R28
$$ 796544 801674 806057 810671 816396 823283 830803 838326 845241 851178 856267 860762 864353 866478 867406
60122H67406R07J795K653L123L242K656J180l06p62m91o25j428k292l130m370
$$ 867406 868313 870108 872761 875884 879126 881782 882962 882656 881894 881403 880778 879350 877058 873928 869558
60107H69558n693o148n582m751m016l174k558k912l875l990k623p47N08J041J114
$$ 869558 863865 857717 852135 847384 843368 840194 837636 834724 830849 826859 824236 823489 823997 825038 826152
60092H26152O23m02j400j950k233k520k754k897l060l189l166l180l421l546l258
$$ 826152 826775 826373 824973 823023 820790 818270 815516 812619 809559 806370 803204 800024 796603 793057 789799
60077G89799l125l904n219n994o117o530p593q571q817q401p375n648l842l155
$$ 789799 786674 782770 777551 771557 765440 758910 751317 742746 733929 725528 718153 712505 708663 705508
60063G05508l892m987n296m626l369k034j171r16n44O05J889K191J821K202L685
$$ 705508 701616 696629 691333 686707 683338 681304 680133 679217 678673 679278 681167 683358 685179 687381 691066
60048F91066N099N705O076O562O496N548M564M270M182L561K416J021o12k227
$$ 691066 696165 701870 707946 714508 721004 726552 731116 735386 739568 743129 745545 746566 745954 743727
60034G43727l273l849m650n581n657m820m529n671p133p457o886o718p426q531
$$ 743727 740454 736605 731955 726374 720717 715897 711368 705697 698564 691107 684221 677503 670077 661546
60020F61546r635j0551j0851j0219q977p647o401n347m766m525l887k513j077
$$ 661546 651911 641360 630509 620290 611313 603666 597265 591918 587152 582627 578740 576227 575150
60007E75150l67l17m76p21r47o30N35J967K786K822K617K738L359M182M635M451
$$ 575150 574783 574466 573990 573269 572322 571692 572227 574194 576980 579802 582419 585157 588516 592698 597333 601784
59991F01784M067M026M100L747L165K958K870K014M12r13j591k424l818m992n245
$$ 601784 605851 609877 613977 617724 620889 623847 626717 628731 629143 628230 626639 624215 620397 615405 610160
59976F10160m868m293l457k581k425l140l808l781l408l017k209q83K65R46J887
$$ 610160 605292 600999 597542 594961 592536 589396 585588 581807 578399 575382 573173 572290 572555 573501 575388
59961E75388L453M751M964M551M304M139L700L200K832K301J663J663K408K763
$$ 575388 578841 583592 588556 593107 597411 601550 605250 608450 611282 613583 615246 616909 619317 622080
59947F22080J937O13m12j471k837l525k714j386j066j620j792j260p14l34L61
$$ 622080 624017 624630 624218 622747 619910 616385 613671 612285 611219 609599 607807 606547 605833 605499 605860
59932F05860J402K358L249M399N580O284O584O831O765N850M246K563R96n63j880
$$ 605860 607262 609620 612869 617268 622848 629132 635716 642547 649312 655162 659408 661971 662967 662404 660524
59917F60524k648k988k949k056j90J641K354K176K085K344K555K726L160L565
$$ 660524 657876 654888 651939 649883 649693 651334 653688 655864 657949 660293 662848 665574 668734 672299
59903F72299L275K248J049R2n02n80j64L83J036K276M030N126M795L935L885M584
$$ 672299 675574 677822 678871 678963 678461 677881 677717 678100 679136 681412 685442 690568 695363 699298 703183 707767
59887G07767N103N363N955O699O800O287O025O370O876P313P809Q054P468O266
$$ 707767 712870 718233 724188 730887 737687 743974 749999 756369 763245 770558 778367 786421 793889 800155
59873H00155N360N011M535L395J842L12j108k427l555m421m911m836m357m128
$$ 800155 805515 810526 815061 818456 820298 820610 819502 817075 813520 809099 804188 799352 794995 790867
59859G90867m482m863m661m217m224m600m694m264l443k129l70J087J553J536
$$ 790867 786385 781522 776861 772644 768420 763820 759126 754862 751419 749290 748920 750007 751560 753096
59845G53096K106L311M282M706N228O341P853R505J1198J2495J2651J1419R332
$$ 753096 755202 758513 762795 767501 772729 779070 786923 796428 807626 820121 832772 844191 853523
59832H53523P191N708N384O068O808O845O473O185N292K457k284p126j0297j1619
$$ 853523 860714 866422 871806 877874 884682 891527 898000 904185 909477 911934 909650 902524 892227 880608
59818H80608j2051j2391j2704j2496j1233r054p001o144o386o594n954m813m095
$$ 880608 868557 856166 843462 830966 819733 810679 803678 797534 791148 784554 778600 773787 769692
59805G69692m223m756m952m571m116m185m721n163n223n033m653m099l861m516
$$ 769692 765469 760713 755761 751190 747074 742889 738168 733005 727782 722749 718096 713997 710136 705620
59791G05620n649o084n447m569m070l572k800k265k204j954j179n94o07l55Q44
$$ 705620 699971 693887 688440 683871 679801 676229 673429 671164 668960 667006 665827 665233 664626 664271 665115
59776F65115K147K505K416K980M033M605M582M583M688M641M820N669O626O897
$$ 665115 667262 669767 672183 675163 679196 683801 688383 692966 697654 702295 707115 712784 719410 726307
59762G26307O920P666Q874R391Q997Q554Q460Q309P975P786P643P109O329N834
$$ 726307 733227 740893 749767 759158 768155 776709 785169 793478 801453 809239 816882 823991 830320 836154
59748H36154N474M629L318K157J342O57J84Q0q1o99j279j181p86p66o69L55J850
$$ 836154 841628 846257 849575 851732 853074 853731 853915 853995 853914 853215 851936 850755 849969 849203 848534 848889 850739
59731H50739K542K252J884J754J424J048J343K182K689K800L240L922L863K908
$$ 850739 853281 855533 857417 859171 860595 861643 862986 865168 867857 870657 873897 877819 881682 884590
59717H84590K089K019K221K274K390K625K729K959L821M945N396N188N131N263
$$ 884590 886679 888698 890919 893193 895583 898208 900937 903896 907717 912662 918058 923246 928377 933640
59703I33640M893M281M522N520N761M627L295K727K464K073K226L206L761K647
$$ 933640 938533 942814 947336 952856 958617 963244 966539 969266 971730 973803 976029 979235 982996 985643
59689I85643L53j753l129m001m468m678n204o307p295p436p019o846p089p352
$$ 985643 985996 984243 981114 977113 972645 967967 962763 956456 949161 941725 934706 927860 920771 913419
59675I13419p506p813q394q951q910p829n935m201l398l106k312q56M96J373K210
$$ 913419 905913 898100 889706 880755 871845 864016 858081 853880 850482 847376 845064 844208 844704 846077 848287
59660H48287L172L714L594L452L891M607M878M425L518K589J941J432M56j330
$$ 848287 851459 855173 858767 862219 866110 870717 875595 880020 883538 886127 888068 889500 889956 888626
59646H88626l379m940o100p504r232j0775j1876j2492j2208j0706q711p352o661
$$ 888626 885247 880307 874207 866703 857471 846696 834820 822328 810120 799414 790703 783351 776690
59633G76690n766m518l732l739l956m082m594n811p402q928r936r608p481m601
$$ 776690 770924 766406 762674 758935 754979 750897 746303 740492 733090 724162 714226 704618 697137 692536
59619F92536k761k451k650k668k815l151l062k446j979j752r41O52K041K519K534
$$ 692536 689775 687324 684674 682006 679191 676040 672978 670532 668553 666801 665860 666512 668553 671072 673606
59604F73606K571K383J850J487J445J116L36p6M08J156J408J271J125R22N80L21
$$ 673606 676177 678560 680410 681897 683342 684458 684794 684718 685126 686282 687690 688961 690086 691008 691588 691909
59588F91909J13l98j119j533j686k179k968l249k814k415k452k483k342k481k803
$$ 691909 692022 691624 690505 688972 687286 685107 682139 678890 676076 673661 671209 668726 666384 663903 661100
59573F61100k483j410n65m15k80J93L09k24n43q1M65M44L21M88L23o16j518j474
$$ 661100 658617 657207 656642 656227 655947 656140 656449 656225 655682 655601 656066 656510 656831 657319 657642 657026 655508 654034
59555F54034p96j98L13Q91J137Q99R27J744K744L237L579M379N437O403P632R396
$$ 654034 653238 653040 653353 654244 655381 656280 657207 658951 661695 664932 668511 672890 678327 684730 692362 701758
59539G01758J1024J1857J2426J3660J5449J6718J6448J4062R534L971o43l047
$$ 701758 712782 724639 737065 750725 766174 782892 799340 813402 822936 826907 826264 823217
59527H23217l638l340k410r80J21Q2r19k207l536m850n761o016o076o554p495
$$ 823217 819579 816239 813829 812849 812970 813052 812133 809926 806390 801540 795779 789763 783687 777133 769638
59512G69638q536r283r267q200o615n518n229n284n437n752n618m149j801j76
$$ 769638 761102 751819 742552 734352 727737 722219 716990 711706 706269 700517 694899 690750 688949 688773
59498F88773K00M36J167J625J523J946L251L844K563P95O06J873K970L356L737
$$ 688773 688973 689409 690576 692201 693724 695670 698921 702765 705328 706123 706729 708602 711572 714928 718665
59483G18665M348M613M258L512K613K014K468L974N278N387M821M488M177L330
$$ 718665 723013 727626 731884 735396 738009 740023 742491 746465 751743 757130 761951 766439 770616 773946
59469G73946K399K172K394K272J807J512J394J299J702L059M853O269P236P919
$$ 773946 776345 778517 780911 783183 784990 786502 787896 789195 790897 793956 798809 805078 812314 820233
59455H20233P971P316O863P293P854P595O981O994P217O331M101J501q50l068
$$ 820233 828204 835520 842383 849676 857530 865125 872106 879100 886317 892648 896749 898250 897400 894332
59441H94332m982n997o008n455m578l380k169j301n75M32J630K688L691M926O343
$$ 894332 889350 883353 877345 871890 867312 863932 861763 860462 859887 860319 861949 864637 868328 873254 879597
59426H79597P812R457J1277J2948J4468J6335J8535K0178K0710K0736K1000K1396
$$ 879597 887409 896866 908143 921091 935559 951894 970429 990607 1011317 1032053 1053053 1074449
59414A074449K1518K1333K0698J9148J6712J3815R858L342n581j4090j9301k0819
$$ 1074449 1095967 1117300 1137998 1157146 1173858 1187673 1197531 1200873 1195292 1181202 1161901 1141082
59402A141082j9755j6809j2596q451n223k504m80j212o112j3224j8970k1843k2641
$$ 1141082 1121327 1104518 1091922 1083471 1078248 1075744 1075264 1074052 1067940 1054716 1035746 1013903 991262
59389I91262k2041k0079j7426j5020j2616r480o185l993k763j303M15J190P24
$$ 991262 969221 949142 931716 916696 904080 894600 888415 884422 881659 880356 880771 881961 882685
59376H82685J73M36J305K354L368L947L855L710M254N176N742O122O873P603P538
$$ 882685 882858 883294 884599 886953 890321 894268 898123 901833 906087 911263 917005 923127 930000 937603 945141
59361I45141P002O946P339P452P370P822Q820R789J0727J1859J2581J2235J1576
$$ 945141 952143 959089 966428 973880 981250 989072 997892 1007681 1018408 1030267 1042848 1055083 1066659
59348A066659J1881J2911J3281J2589J1535J0168P746M354J041j765m622p757
$$ 1066659 1078540 1091451 1104732 1117321 1128856 1139024 1146770 1151124 1152165 1150400 1145778 1138021
59336A138021j0714j3232j5378j6921j7723j8485j9779k0766k0305j8884j7914
$$ 1138021 1127307 1114075 1098697 1081776 1064053 1045568 1025789 1005023 984718 965834 947920
59325I47920j7440j6361j4638j3471j3163j2658j1350r818q588p618p101p285
$$ 947920 930480 914119 899481 886010 872847 860189 848839 839021 830433 822815 815714 808429
59313H08429p478o729n555n375o167o376n380m315m029l819k791j130N78K197
$$ 808429 800951 794222 788667 783292 777125 770749 765369 761054 757025 753206 750415 749285 749863 752060
59299G52060L667M850N921P092P981Q359R278J2007J5781J8344J8952J9238K0526
$$ 752060 755727 760577 766498 773590 781571 789930 799208 811215 826996 845340 864292 883530 904056
59286I04056K1756K0876J7247J1923O460K042q00k138k099n14K463N791Q469J0565
$$ 904056 925812 946688 963935 975858 982318 984360 983560 981422 979323 978809 981272 987063 995532 1006097
59272A006097J2465J3681J3584J2812J2459J2282J1150Q985O743M667K167o64
$$ 1006097 1018562 1032243 1045827 1058639 1071098 1083380 1094530 1103515 1110258 1114925 1117092 1116428
59260A116428l037m980p286r874j1761j2765j3659j4552j4669j3969j3407j3250
$$ 1116428 1113391 1108411 1101125 1091251 1079490 1066725 1053066 1038514 1023845 1009876 996469 983219
59248I83219j2613j0964q806o597m362k518j729j675j306n34k94q40j313j317
$$ 983219 970606 959642 950836 944239 939877 937359 935630 933955 932649 932115 931821 930981 929668 928351
59234I28351j441j969k442k786l533m647n362n507n774o478p194p723q195q240
$$ 928351 926910 924941 922499 919713 916180 911533 906171 900664 894890 888412 881218 873495 865300 857060
59220H57060p330n995n352n402n126m268l528l089k441j704j569j874j809j553
$$ 857060 849730 843735 838383 832981 827855 823587 820059 816970 814529 812825 811256 809382 807573 806020
59206H06020k085l237l718l212k827l212l821m234m598m643l907l051l194l801
$$ 806020 803935 800698 796980 793768 790941 787729 783908 779674 775076 770433 766526 763475 760281 756480
59192G56480l143j059O38Q94O02O72P80O82Q86J409J456R44P45R84P17k18p21
$$ 756480 753337 752278 752916 753810 754412 755084 755864 756546 757432 758841 760297 761241 761986 762970 763687 763469 762748
59175G62748k63M34R60J813K955L520L426L581M128M198L691L465L398K331L13
$$ 762748 762485 762919 763879 765692 768647 772167 775593 779174 783302 787500 791191 794656 798054 800385 800698
59160H00698j177j771k856m964o737p276p518q239q735q435p989p819p296o249
$$ 800698 799521 797750 794894 789930 783193 775917 768399 760160 751425 742990 735001 727182 719886 713637
59146G13637n565n537n323m745m656m956m361k902k348l253l810k781j320o63
$$ 713637 708072 702535 697212 692467 687811 682855 678494 675592 673244 669991 666181 663400 662080 661417
59132F61417k11P54J613K030L001M807N994N800N676O791Q123Q612R271J1255
$$ 661417 661206 661960 663573 665603 668604 673411 679405 685205 690881 697672 705795 714407 723678 734933
59118G34933J3576J4648J4665J4749J5017J5051J4955J4629J3373J1350R875R188
$$ 734933 748509 763157 777822 792571 807588 822639 837594 852223 865596 876946 886821 896009
59106H96009P783N095K789J967J263n84k456l120l623n300p163p551o777n962
$$ 896009 903792 908887 911676 913643 914906 914322 911866 908746 905123 899823 892660 885109 878332 872370
59092H72370m816k838j225j263k090k234k157l044m338m758m683n287o279o636
$$ 872370 867554 864716 863491 862228 860138 857904 855747 852703 848365 843607 838924 833637 827358 820722
59078H20722o628p016p214o390n437n605o155n569m277l881m349m329l652l283
$$ 820722 814094 807078 799864 793474 788037 782432 776277 770708 766431 762550 758201 753872 750220 746937
59064G46937l223k616j658j331j497j195n50n44j086j140o45n40j019j331j237
$$ 746937 743714 741098 739440 738109 736612 735417 734867 734323 733237 732097 731452 730912 729893 728562 727325
59049G27325j225j348j170o96k34L05R60J089L27m84l73L43Q28J141J725K348
$$ 727325 726100 724752 723582 722886 722652 722957 723917 725006 725333 724849 724476 724819 725647 726788 728513 730861
59033G30861K741L449M802N994O434P021Q638J0441J1145J1078J1360J1934J1984
$$ 730861 733602 737051 741853 747847 754281 761302 769940 780381 791526 802604 813964 825898 837882
59020H37882J1485J0857R826Q091O268M778K863J60j865j809n57O5k7K81J145
$$ 837882 849367 860224 870050 878141 884409 889187 892050 892210 890345 888536 887979 888044 888017 888298 889443
59005H89443K034L311N522P769Q698Q550Q556Q881Q948Q956R370R501Q448O908
$$ 889443 891477 894788 900310 908079 916777 925327 933883 942764 951712 960668 970038 979539 987987 994895
58991I94895O294O581O613O025N292M575L979M178N315O145N893N884P703J0705
$$ 994895 1001189 1007770 1014383 1020408 1025700 1030275 1034254 1038432 1043747 1049892 1055785 1061669 1069372 1080077
58977A080077J3159J4790J6368J7809J8739J9888K1881K3565K3671K3189K3859
$$ 1080077 1093236 1108026 1124394 1142203 1160942 1180830 1202711 1226276 1249947 1273136 1296995
58966A296995K5203K5407K4376K3511K3068K2103K0578J9214J7674J5153J2327
$$ 1296995 1322198 1347605 1371981 1395492 1418560 1440663 1461241 1480455 1498129 1513282 1525609
58955A525609J0570R691Q600P687Q233R951J1468J2925J5725J9954K4281K8312
$$ 1525609 1536179 1545870 1554470 1562157 1570390 1580341 1591809 1604734 1620459 1640413 1664694 1693006
58943A693006L2752L7429M1265M4158M6853M9058M9618M8251M5359M0529L3231
$$ 1693006 1725758 1763187 1804452 1848610 1895463 1944521 1994139 2042390 2087749 2128278 2161509
58932B161509K4463J5657O472m151j5414k5378l3748m1550m8567n3578n6719n8989
$$ 2161509 2185972 2201629 2208101 2203950 2188536 2163158 2129410 2087860 2039293 1985715 1928996 1870007
58920A870007n9896n8219n4868n2120n0056m6566m1065l5494l1276k7831k4531
$$ 1870007 1810111 1751892 1697024 1644904 1594848 1548282 1507217 1471723 1440447 1412616 1388085
58909A388085k1708j9233j6319j3129j0608q551n860k770n60R38L201O280Q576
$$ 1388085 1366377 1347144 1330825 1317696 1307088 1298537 1292677 1289907 1289347 1290285 1293486 1299766 1308342
58896A308342R540J0227J0953J0821J0007J0093J1629J3450J4858J6225J7081
$$ 1308342 1317882 1328109 1339062 1349883 1359890 1369983 1381612 1395062 1409920 1426145 1443226
58885A443226J5834J2186P852M337J644n62k434m720q198j2158j5149j7189j9268
$$ 1443226 1459060 1471246 1479098 1483435 1485079 1484517 1482083 1477363 1469165 1457007 1441858 1424669 1405401
58872A405401k1010k1091j9882j9155j9171j8526j7069j6323j6665j6707j5899
$$ 1405401 1384391 1363300 1343418 1324263 1305092 1286566 1269497 1253174 1236509 1219802 1203903
58861A203903j5361j5564j5543j5003j4877j5286j5173j4458j4298j4711j4315
$$ 1203903 1188542 1172978 1157435 1142432 1127555 1112269 1097096 1082638 1068340 1053629 1039314
58850A039314j2996j2438j3296j4072j3678j2982j2991j3363j3483j3348j2855
$$ 1039314 1026318 1013880 1000584 986512 972834 959852 946861 933498 920015 906667 893812
58839H93812j1740j0526r922r361p885o125n326m854l124o20P48J031K009L656
$$ 893812 882072 871546 861624 852263 844378 838253 832927 828073 824949 824329 825077 826108 828117 831773
58825H31773M095L232L072L954L862K284J414K404L558L479L077L152K749J341
$$ 831773 835868 839100 842172 846126 849988 852272 853686 856090 859648 863127 866204 869356 872105 873446
58811H73446M1o25j695l375m177l680l579m788n984o191o343p047p278o533n899
$$ 873446 873487 872862 871167 867792 863615 859935 856356 851568 845584 839393 833050 826003 818725 812192 806293
58796H06293n810n198l972l754m876n258l683j674o90P7J630L305M495N867P479
$$ 806293 800483 795285 791313 787559 782683 777425 773742 772068 771378 771455 773085 776390 780885 786752 794231
58781G94231P959O978O234O615O737N590M245L447K086m86l035m827o894r416
$$ 794231 802190 809168 815402 822017 828754 834344 838589 842036 844122 843636 840601 835774 828880 819464
58767H19464j0568r690q945r818j0589r363p164n767m774l217j980k023k131q33
$$ 819464 808896 799206 790261 780443 769854 760491 753327 747560 742786 739569 737589 735566 733435 732602
58753G32602Q77J202N10N83J837L287M292M838N007N376O735Q550R144Q233P505
$$ 732602 733479 734681 735191 735774 737611 740898 745190 750028 755035 760411 767146 775696 784840 793073 800578
58738H00578P871Q202P730P419P733P441O014N005N508O367O394O129O011N056
$$ 800578 808449 816651 824381 831800 839533 846974 852988 857993 863501 869868 876262 882391 888402 893458
58724H93458L004J550J759K384K290K282L007L357K625J958J966J245r17k830
$$ 893458 896462 898012 899771 902155 904445 906727 909734 913091 915716 917674 919640 920885 919968 917138
58710I17138l278l732n682q115r645j0922j2817j4485j5252j6233j8024j8986
$$ 917138 913860 910128 904446 896331 886686 875764 862947 848462 833210 816977 798953 779967
58698G79967j7937j6305j5539j4691j2725j0857j0282r867q456p225p318p407
$$ 779967 762030 745725 730186 715495 702770 691913 681631 671764 663308 656083 648765 641358
58686F41358o087m553m333m497l648k664k767k933j829m71k88m60L39J379J632
$$ 641358 635271 630718 626385 621888 618240 615576 612809 609876 608047 607576 607288 606828 607167 608546 610178
58671F10178K140M043O144P073P952J0213J2625J3264J2632J2133J1164Q565N164
$$ 610178 612318 616361 622505 629578 637530 647743 660368 673632 686264 698397 709561 718126 723290
58658G23290K128j400o278j0727j2593j2631j2734j2637j1244r392q320p077m485
$$ 723290 725418 724018 717740 707013 694420 681789 669055 656418 645174 635782 627462 620385 615900
58645F15900k059j764k425j599L51J270J059J300K000J882J022M85J25o64j103
$$ 615900 613841 612077 609652 608053 608404 609674 610733 612033 614033 615915 616937 617422 617547 616883 615780
58630F15780m26J22p86j985j800j035j237j495o7K147K895K303K360L579M928
$$ 615780 615354 615476 614690 612705 610905 609870 608633 607138 607071 609218 612113 614416 616776 620355 625283
58615F25283O133P430P991P094N817N324M758L198J928K269K924K188J004R16
$$ 625283 631416 638846 646837 653931 659748 665072 669830 673028 674956 677225 680149 682337 683341 684257
58601F84257Q95o15k237j672L24J325J222J596K388K560K880M713P187Q594R461
$$ 684257 685152 684537 682300 680628 680952 682277 683499 685095 687483 690043 692923 697636 704823 713417 722878
58586G22878J1178J2969J3324J3013J3508J3843J2408J0385R923J0331R519P944
$$ 722878 734056 747025 760349 773362 786870 800713 813121 823506 833429 843760 853279 861223
58574H61223P649Q569R302J0273J2663J5433J6968J8358K1563K5539K7809K8535
$$ 861223 868872 877441 886743 897016 909679 925112 942080 960438 982001 1007540 1035349 1063884
58562A063884K9391K9819K8094K4840K1664J7699J1400M403m63l691p507j1103
$$ 1063884 1093275 1123094 1151188 1176028 1197692 1215391 1226791 1231194 1230731 1227040 1219533 1208430
58550A208430j1882j0369r461r577q952p861q296j0116j1782j4062j8614k3774
$$ 1208430 1196548 1186179 1176718 1167141 1158189 1150328 1142032 1131916 1120134 1106072 1087458 1063684
58538A063684k6204k6079k6170k6548k4949k1785j9824j9132j7165j3925j2172
$$ 1063684 1037480 1011401 985231 958683 933734 911949 892125 872993 855828 841903 829731
58527H29731j2282j1557r134p164o577n778m167l102k908k451j844k163k695j970
$$ 829731 817449 805892 796758 789594 783017 777239 773072 769970 767062 764611 762767 760604 757909 755939
58513G55939j003j759l121k468n18k34j545j702m66j52q13k26J351J252n56j199
$$ 755939 754936 753177 750056 747588 747070 746836 745291 743589 743123 742971 742158 741932 743283 744535 743979 742780
58497G42780O7J026J007J737L424M390M822O598R217J0261R947J0819J2976J4138
$$ 742780 742847 743873 744880 746617 750041 754431 759253 765851 775068 785329 795276 806095 819071 833209
58483H33209J4351J5873J8422J9378J8761J9008J9711J7698J2738Q023M596L11
$$ 833209 847560 863433 881855 901233 919994 939002 958713 976411 989149 997172 1001768 1002079
58471A002079n095r073j1035j2993j4821j3937j0401p365n714l212L94K636L404
$$ 1002079 996984 987911 976876 963883 949062 935125 924724 917359 911645 908433 908827 911463 914867
58458I14867N573R558J2391J3132J4106J5749J5334J1921P704L463k285q805j2933
$$ 914867 920440 929998 942389 955521 969627 985376 1000710 1012631 1020335 1023798 1021513 1012708 999775
58445I99775j4339j5927j8211j8429j6079j3908j2556r711n506l150l060k018
$$ 999775 985436 969509 951298 932869 916790 902882 890326 880615 875109 871959 868899 866881
58433H66881P54K337K104L072N953P699P452Q036R947R865O854M209L311J470
$$ 866881 867635 869972 872076 875148 881101 888800 896252 904288 914235 924100 930954 935163 938474 939944
58419I39944k315n312o556q503j1442j2230j0478r857j1291j1131q249o583q038
$$ 939944 937629 932317 925761 917258 905816 893586 883108 873251 861960 850829 842580 835997 827959
58406H27959r107p336n170m621l905k062j277j996j339J229K384J269J328L635
$$ 827959 818852 811516 806346 801725 797820 795758 794481 792485 791146 792375 794759 796028 797356 800991
58392H00991M666L142K539M225M627K125K58J030J535L27O04L787O352O369O860
$$ 800991 805657 808799 811338 815563 820190 822315 822573 823603 825138 825465 826069 829856 836208 842577 849437
58377H49437R389J0762R391Q494R689J0002Q435Q662J1796J3488J1907J1416J4462
$$ 849437 858826 869588 878979 887473 897162 907164 915599 924261 936057 949545 961452 972868 987330
58364I87330J6958J5974J4846J6189J6797J4140J1157J0007P744K776j103j672
$$ 987330 1004288 1020262 1035108 1051297 1068094 1082234 1093391 1103398 1111142 1113918 1112815 1111143
58352A111143k417n267o230l029J7k76m24K525N339N436O225J0195J3569J3365
$$ 1111143 1108726 1103459 1097229 1094200 1094217 1093941 1093517 1096042 1101381 1106817 1113042 1123237 1136806 1150171
58338A150171J2987J5345J7238J6026J5003J6604J7221J4223J1202J0809R569
$$ 1150171 1163158 1178503 1195741 1211767 1226770 1243374 1260595 1274818 1286020 1296829 1306398
58327A306398N268K018K401K204j224l325j031R67r14k225R13M349M137M078P785
$$ 1306398 1311666 1313684 1316085 1318289 1317065 1313740 1312709 1313676 1312762 1310537 1311450 1315799 1319936 1324014 1331799
58312A331799J1209J0544R736J2517J4776J2645J0365J2281J4749J3787J2925
$$ 1331799 1343008 1353552 1363288 1375805 1390581 1403226 1413591 1425872 1440621 1454408 1467333
58301A467333J5502J7200J4405J1986J4450J7396J6119J4562J7111J9755J8130
$$ 1467333 1482835 1500035 1514440 1526426 1540876 1558272 1574391 1588953 1606064 1625819 1643949
58290A643949J6183J8130K0108J8458J7694K1458K4518K2647K1148K4473K7196
$$ 1643949 1660132 1678262 1698370 1716828 1734522 1755980 1780498 1803145 1824293 1848766 1875962
58279A875962K4796K3136K7171L0889K9064K8048L3602L9074L7708L5617L9835
$$ 1875962 1900758 1923894 1951065 1981954 2011018 2039066 2072668 2111742 2149450 2185067 2224902
58268B224902M4625M3014M0919M5887N2460N2891N1917N6346O0681N7959N4149
$$ 2224902 2269527 2312541 2353460 2399347 2451807 2504698 2556615 2612961 2673642 2731601 2785750
58257B785750N6706N9688N5795N1895N6418O2681O1628N9562O5768P4177P5512
$$ 2785750 2842456 2902144 2957939 3009834 3066252 3128933 3190561 3250123 3315891 3390068 3465580
58246C465580P5932Q4709R5159R7365R8040J07550J19189J22260J23564J34258
$$ 3465580 3541512 3626221 3721380 3818745 3916785 4024335 4143524 4265784 4389348 4523606
58236D523606J47592J52217J55117J68104J84248J91801J98435K16597K38208
$$ 4523606 4671198 4823415 4978532 5146636 5330884 5522685 5721120 5937717 6175925
58227F175925K50055K60390K83150L10252L28173L46690L81034M21335M51765
$$ 6175925 6425980 6686370 6969520 7279772 7607945 7954635 8335669 8757004 9208769
58218I208769M83325N33644N91896O40393O92819P71746Q66995R58617J061759
$$ 9208769 9692094 10225738 10817634 11458027 12150846 12922592 13789587 14748204 15809963
58209A5809963J203382J375136J559068J779450K076159K449305K888538L432122
$$ 15809963 17013345 18388481 19947549 21726999 23803158 26252463 29141001 32573123
58201C2573123M129882M970110N912284O962936Q139394R395779J0688783J2090346
$$ 32573123 36703005 41673115 47585399 54548335 62687729 72083508 82772291 94862637
58193I4862637J3726507J5640756J7842710K0416650K3353042K6276353K8591994
$$ 94862637 108589144 124229900 142072610 162489260 185842302 212118655 240710649
58186B40710649K9916058K9994661K8054414K2735330J3295359R12884j1609551
$$ 240710649 270626707 300621368 328675782 351411112 364706471 365619355 354009804
58179C54009804k1604142k7916711l0773893l0890739k9004605k5903013k2347604
$$ 354009804 332405662 304488951 273715058 242824319 213819714 187916701 165569097
58172A65569097j8821593j5508318j2550330j0200462q681827p988454p862103
$$ 165569097 146747504 131239186 118688856 108488394 99806567 91818113 83956010
58165H3956010p928709p873231p560457p031978o389645n695969m985035m307469
$$ 83956010 76027301 68154070 60593613 53561635 47171990 41476021 36490986 32183517
58157C2183517l708138l184646k714340k303489j970371j701416j466885j264066
$$ 32183517 28475379 25290733 22576393 20272904 18302533 16601117 15134232 13870166
58149A3870166j105705r80852q65895p61950o84615o27430n70269n14112m73990
$$ 13870166 12764461 11783609 10917714 10155764 9471149 8843719 8273450 7759338 7285348
58140G285348m45835m12349l74304l45605l23949k95482k62680k39538k24385
$$ 7285348 6839513 6427164 6052860 5707255 5383306 5087824 4825144 4585606 4361221
58131D361221k03925j79464j63672j55871j45076j33017j30187j33070j28671
$$ 4361221 4157296 3977832 3814160 3658289 3513213 3380196 3250009 3116939 2988268
58122B988268j18117j13235j13199j06775r4726q8176q6964q0739o9757o4186
$$ 2988268 2870151 2756916 2643717 2536942 2442216 2354040 2267076 2186337 2116580 2052394
58112B052394o4143o0051n1826m8759n1075m9795m4400m3009m5535m3717l7654
$$ 2052394 1988251 1928200 1876374 1827615 1776540 1726745 1682345 1639336 1593801 1550084 1512430
58101A512430l5868l8990l9191l5619l5084l7735l6960l3208l3260l6129l4141
$$ 1512430 1476562 1437572 1398381 1362762 1327678 1289943 1252983 1219775 1186515 1150386 1116245
58090A116245k7637k4419k4927k2110j5846j3402j5507j5532j2799j3321j7022
$$ 1116245 1088608 1064189 1039262 1017152 1001306 987904 972397 956865 944066 930745 913723
58079I13723j7460j4654j5258j9434k0240j6762j5365j7176j6607j3139j2465
$$ 913723 896263 881609 866351 846917 826677 809915 794550 777374 760767 747628 735163
58068G35163j4863j4376j0590r614j2134j2029q177o276p565o896l563l016o056
$$ 735163 720300 705924 695334 685720 673586 661557 653380 647104 639539 632643 629080 626064 620008
58055F20008p087m933m884q042q984o165m619o100o284l990l618o144o908m663
$$ 620008 612921 607988 603104 595062 586078 579913 575294 569194 562910 558920 555302 549158 542250 537587
58041E37587l857n807o420m753n014p911q649n851m033n065n373l770l826o275
$$ 537587 533730 527923 521503 516750 511736 503825 495176 489325 485292 480227 474854 471084 467258 460983
58027D60983p151n543n352p307p252m348k970m353m402k046j575m231n435l235
$$ 460983 453832 448289 442937 435630 428378 424030 421060 416707 412305 410259 408684 404453 399018 395783
58013C95783j744l219m133k280p06j413j842n67j01j270j067J344K644J646J315
$$ 395783 394039 390820 386687 384407 383701 382288 380446 379879 379778 378508 377441 378785 381429 383075 384390
57998C84390K523K246Q9p1K693M205K663J637L051L798K189J206K353K539J98
$$ 384390 386913 389159 389248 389177 391870 396075 398738 400375 403426 407224 409413 410619 412972 415511 415709
57983D15709j576j064j135l279m316k327k48l63n23Q86J565P1j076j68N71m79
$$ 415709 414133 413069 411934 408655 404339 402012 401764 401401 400878 401764 403329 403400 402324 402156 402727 402248
57967D02248j402j079j586l713m834l785l044l667l099n11Q56o84k323k106k139
$$ 402248 400846 399767 398181 394468 389634 385849 382805 379138 376039 375528 376384 375700 373377 371271 369132
57952C69132l718m352k595r44r91n74J412K394J290J283M122O609O229N480O941
$$ 369132 365414 361062 358467 357523 356532 355958 357370 359764 361054 362337 366459 373068 379297 384777 391718
57937C91718Q637Q141P068P605Q393P578O432O337N636K799n03k599m722p858
$$ 391718 400355 408496 415564 423169 431562 439140 445572 451909 457545 460344 459841 457242 452520 444662
57923D44662j0068r922r237r643r800q708q222r421r969q003n358m184l662k620
$$ 444662 434594 424672 415435 405792 395992 387284 379062 369641 359672 351669 346311 342127 338465 335845
57909C35845k029k316j664N19J857J113L59P44J35k392l925k540p61r98j542l37
$$ 335845 333816 331500 329836 330355 332212 333325 333684 334428 334563 332171 328246 325706 324945 323947 322405 322068
57893C22068J088R66Q56K337L639L151K820M435N861M774K949L003L834L210K047
$$ 322068 323156 324122 324978 327315 330954 334105 336925 341360 347221 351995 354944 357947 361781 364991 367038
57878C67038K292L003K380J404J815K668K272J449J716K360K276K369L317L487
$$ 367038 369330 372333 374713 376117 377932 380600 382872 384321 386037 388397 390673 393042 396359 399846
57864C99846J959R09J975L106K198R68J654K735J795K5l2R80Q63L7K58Q95K39
$$ 399846 401805 402714 404689 407795 409993 410961 412615 415350 417145 417170 417138 418118 418981 419018 419276 420171 420410
57847D20410j049j269r80j712k887l138l079l745l952k307k04K46l12oR46J409
$$ 420410 419361 418092 417112 415400 412513 409375 406296 402551 398599 396292 396088 396334 396022 396016 396962 398371
57831C98371J979L503M652M058L130L745M867M457L017K194J626K49j008r83r93
$$ 398371 400350 403853 408505 412563 415693 419438 424305 428762 431779 433973 435599 435848 434840 433857 432864
57816D32864k642m663n117m971o136p649p319n719m996n039m252l079l276m665
$$ 432864 430222 425559 420442 415471 409335 401686 394367 388648 383652 378613 374361 371282 368006 363341
57802C63341n722o468p731q600p641n693m578m132l169k152k037j918p06L42k33
$$ 363341 357619 351151 343420 334820 327179 321486 316908 312776 309607 307455 305418 303500 302794 303136 302903
57787C02903j018LJ716J885J325K358M409N048M428M758O017O152N033M498M642
$$ 302903 301885 301888 303604 305489 306814 309172 313581 318629 323057 327815 333832 339984 345017 349515 354157
57772C54157L705J546j19r25k102l530l717k774k476l254l779l539l212k746j610
$$ 354157 357862 359408 359289 358364 356262 352732 349015 346241 343765 340511 336732 333193 329981 327235 325625
57757C25625o32r63j673r73O21J164P99J432L238M455M563M779N431N518M891
$$ 325625 324993 324030 322357 321384 322005 323169 323968 325400 328638 333093 337656 342435 347866 353384 358275
57742C58275M364L801K497J200J172J665Q86q47j637j260j160j524j279p19j216
$$ 358275 362639 366440 368937 370137 371309 372974 373860 373013 371376 370116 368956 367432 366153 365434 364218
57727C64218k351k292j012l87r40j320j083j224j795j655q86p70j209p78M57Q21
$$ 364218 361867 359575 358563 358176 357236 355916 354833 353609 351814 350159 349273 348503 347294 346516 346973 347794
57711C47794M4k71M79J032Q19Q47J580K181K373K910L734L811L099K719K876K647
$$ 347794 347838 347567 348046 349078 349897 350744 352324 354505 356878 359788 363522 367333 370432 373151 376027 378674
57695C78674K000J901K254J813L44j143k322l708m878m729l539k653k103p04J557
$$ 378674 380674 382575 384829 386642 386986 385843 383521 379813 374935 370206 366667 364014 361911 361207 362764
57680C62764L540N269P900J1333J4260J6713K0152K4847K9561L4022L9336M5694
$$ 362764 366304 371573 379473 390806 405066 421779 441931 466778 496339 530361 569697 615391
57668F15391N2006N8001O4158O9090O9323O2200M7257K5048k580l0806n3411o7201
$$ 615391 667397 725398 789556 858646 927969 990169 1037426 1062474 1059894 1029088 975677 908476
57656I08476p3238p3668o9719o2986n5675m8595m1008l3173k6805k2542j9166
$$ 908476 835238 761570 691851 628865 573190 524595 483587 450414 423609 401067 381901
57645C81901j6005j3827j2734j1461r503p904p194o551n591m935m519l425j876
$$ 381901 365896 352069 339335 327874 318371 310467 303273 296722 291131 286196 281677 278252 276376
57632B76376j244j601j485n65k09q83j331r57p13r22p05j59o72k270l102k467
$$ 276376 275132 273531 272046 271481 271272 270389 269058 268101 267388 266466 265761 265602 264930 262660 259558 257091
57616B57091j856k044j814o76k02j200k028j360l28k99n53L4R03J168J300J798
$$ 257091 255235 253191 251377 250701 250499 249299 247271 245911 245583 245284 244731 244765 245668 246836 248136 249934
57600B49934J777N35r10j438j603k255k756k156j000m47n54p07q67j234j543j653
$$ 249934 251711 252246 251336 249898 248295 246040 243284 241128 240128 239681 239127 238420 237553 236319 234776 233123
57584B33123j975k518k533j801j208j377j845k229k860l636l626k651j874k099
$$ 233123 231148 228630 226097 224296 223088 221711 219866 217637 214777 211141 207515 204864 202990 200891
57570B00891k668k844k901l099k894k004j085o36l23J14L85N16Q99J212O49m70
$$ 200891 198223 195379 192478 189379 186485 184481 183396 182760 182437 182551 182936 183452 184351 185563 186212 185742
57554A85742q32j54N39Q20J271J820J657J138J591K837L180K438K400L520L795
$$ 185742 184910 184756 185295 186115 187386 189206 190863 192001 193592 196429 199609 202047 204447 207967 211762
57539B11762K173M95M87J120P27l26r62j409k056j934l62J288J335K09n20m66
$$ 211762 213935 214430 214917 216037 216764 216438 215476 214067 212011 210077 209715 211003 212338 212547 212027 211561
57523B11561k68j06K19N64R08J647K540K593J740J314J939K578K493K461K902
$$ 211561 211293 211187 211406 211970 212878 214525 217065 219658 221398 222712 224651 227229 229722 232183 235085
57508B35085K727J353J82M64J314J371R50R90J182P86J15k52o35j361j880j871
$$ 235085 237812 239165 239347 239811 241125 242496 243446 244436 245618 246404 246519 246267 245632 244271 242391 240520
57492B40520k003k464k275j133l38o63j042o12k77p38q92J21J049N93k86q1Q37
$$ 240520 238517 236053 233778 232645 232307 231644 230602 229990 229713 228975 228083 228204 229253 229846 229560 229479 230316
57475B30316J366J687K189J913K69j253j155m27p45j588j455o95n98p92m1J155
$$ 230316 231682 233369 235558 237471 237740 236487 235332 234905 234160 232572 231117 230422 229824 229032 228991 230146
57459B30146J401J037J473K437K389J333P81J091J120N39L79J142K130K750L005
$$ 230146 231547 232584 234057 236494 238883 240216 240997 242088 243208 243747 244126 245268 247398 250148 253153
57444B53153K799K112J624J807J900J083P1K2O42R35J147K135L482L982L587L107
$$ 253153 255952 258064 259688 261495 263395 264478 264549 264571 265213 266148 267295 269430 272912 276894 280481 283588
57428B83588K556J531N88M72O03J39j11J096K975L587K827K312K540K401J492
$$ 283588 286144 287675 288263 288735 289338 289477 289366 290462 293437 297024 299851 302163 304703 307104 308596
57413C08596P78Q15J173J797L122M710N405N000M223L218J618L4l04O02J589K195
$$ 308596 309374 310189 311362 313159 316281 320991 326396 331396 335619 338837 340455 340489 340185 340787 342376 344571
57397C44571K817L297L099K817L621N186N963N526M872M456L859L464M372O167
$$ 344571 347388 350685 353784 356601 360222 365408 371371 376897 381769 386225 390084 393548 397920 404087
57383D04087O853N655M168L987M796N467N681N621N227M486L663K817J922J481
$$ 404087 410940 416595 420763 424750 429546 435013 440694 446315 451542 456028 459691 462508 464430 465911
57369D65911J994K855K953K329K038K364K547K326K319K726L060L299L961M801
$$ 465911 467905 470760 473713 476042 478080 480444 482991 485317 487636 490362 493422 496721 500682 505483
57355E05483M875M137L685M102M868N609O554P439P421O512N846O003O259N918
$$ 505483 510358 514495 518180 522282 527150 532759 539313 546752 554173 560685 566531 572534 578793 584711
57341E84711N278M842M608M576M912N300N068M270L811M192M979N608N880N742
$$ 584711 589989 594831 599439 604015 608927 614227 619295 623565 627376 631568 636547 642155 648035 653777
57327F53777N460N841P262Q652Q680P741P379P967Q476Q452Q506Q674Q094O777
$$ 653777 659237 665078 672340 680992 689672 697413 704792 712759 721235 729687 738193 746867 754961 761738
57313G61738O085O777P986Q724R171R795J0414J0827J1259J1632J1336J0302R378
$$ 761738 767823 774600 782586 791310 800481 810276 820690 831517 842776 854408 865744 876046 885424
57300H85424R145R257R392R867J0919J2153J3146J3802J3943J3344J2397J1884
$$ 885424 894569 903826 913218 923085 934004 946157 959303 973105 987048 1000392 1012789 1024673
57288A024673J1940J2099J2309J2918J3686J3914J3601J3343J3171J2675J2248
$$ 1024673 1036613 1048712 1061021 1073939 1087625 1101539 1115140 1128483 1141654 1154329 1166577
57277A166577J2802J4164J5148J5361J5539J5957J6042J5815J6145J7122J7735
$$ 1166577 1179379 1193543 1208691 1224052 1239591 1255548 1271590 1287405 1303550 1320672 1338407
57266A338407J7632J7692J8261J8454J7873J7560J8246J9038J8894J8260J8218
$$ 1338407 1356039 1373731 1391992 1410446 1428319 1445879 1464125 1483163 1502057 1520317 1538535
57255A538535J8887J9606J9957J9883J9480J9236J9734K0652K0939K0341J9797
$$ 1538535 1557422 1577028 1596985 1616868 1636348 1655584 1675318 1695970 1716909 1737250 1757047
57244A757047J9902K0104J9956J9947K0489K1145K1613K2350K3505K4254K4095
$$ 1757047 1776949 1797053 1817009 1836956 1857445 1878590 1900203 1922553 1946058 1970312 1994407
57233A994407K3815K4240K4932K5033K4678K4583K4794K4785K4402K3975K3747
$$ 1994407 2018222 2042462 2067394 2092427 2117105 2141688 2166482 2191267 2215669 2239644 2263391
57222B263391K3762K4022K4392K4649K4817K5136K5559K5870K6249K7061K8146
$$ 2263391 2287153 2311175 2335567 2360216 2385033 2410169 2435728 2461598 2487847 2514908 2543054
57211B543054K9072K9944L1023L1721L1249L0232L0232L1490L2589L2735L2761
$$ 2543054 2572126 2602070 2633093 2664814 2696063 2726295 2756527 2788017 2820606 2853341 2886102
57200B886102L3303L3488L2434L0702K9317K8332K7307K6249K5200K3849K2236
$$ 2886102 2919405 2952893 2985327 3016029 3045346 3073678 3100985 3127234 3152434 3176283 3198519
57189C198519K1023K0357J9521J8367J7989J8984K0259K0691K0900K2104K4083
$$ 3198519 3219542 3239899 3259420 3277787 3295776 3314760 3335019 3355710 3376610 3398714 3422797
57178C422797K5667K6621K7579K8508K8702K8188K7896K8277K8746K8682K8131
$$ 3422797 3448464 3475085 3502664 3531172 3559874 3588062 3615958 3644235 3672981 3701663 3729794
57167C729794K7355K6408K5445K4991K5532K7062K9063L0867L2017L2485L2543
$$ 3729794 3757149 3783557 3809002 3833993 3859525 3886587 3915650 3946517 3978534 4011019 4043562
57156D043562L2448L2324L2244L2122L1646L0586K9111K7488K5667K3642K2031
$$ 4043562 4076010 4108334 4140578 4172700 4204346 4234932 4264043 4291531 4317198 4340840 4362871
57145D362871K1702K2785K4525K6150K7381K8156K8463K8556K8809K9160K8973
$$ 4362871 4384573 4407358 4431883 4458033 4485414 4513570 4542033 4570589 4599398 4628558 4657531
57134D657531K7569K4771K1103J7559J4946J3167J1487R719Q717R501J2513J7937
$$ 4657531 4685100 4709871 4730974 4748533 4763479 4776646 4788133 4797852 4806569 4816070 4828583 4846520
57122D846520K5916L5878M6434N6684O7003P8017Q9445J00581J11284J22030J33682
$$ 4846520 4872436 4908314 4954748 5011432 5078435 5156452 5245897 5346478 5457762 5579792 5713474
57111E713474J47610J65284J87607K15577K51392K97477L54526M22578N04266
$$ 5713474 5861084 6026368 6213975 6429552 6680944 6978421 7332947 7755525 8259791
57102H259791O05158P31139Q88166J084486J329369J628420J982835K393068K859158
$$ 8259791 8864949 9596088 10484254 11568740 12898109 14526529 16509364 18902432 21761590
57093B1761590L377367L941470M547745N193722N873294O577458P285647P924931
$$ 21761590 25138957 29080427 33628172 38821894 44695188 51272646 58558293 66483224
57085F6483224Q331572Q298652P720048O700235N492656M309463L194124K068820
$$ 66483224 74814796 83113448 90833496 97533731 103026387 107335850 110529974 112598794
57077A12598794Q69412l83253j612053k740508l721679m542403n215426n758630
$$ 112598794 113468206 113084953 111472900 108732392 105010713 100468310 95252884 89494254
57069H9494254o173787o447522o570621o548030o391336o112799n730816n273602
$$ 89494254 83320467 76872945 70302324 63754294 57362958 51250159 45519343 40245741
57061D0245741m772522m255072l744825l261904k819711k424021k076768j777898
$$ 40245741 35473219 31218147 27473322 24211418 21391707 18967686 16890918 15113020
57053A5113020j523602j307280j123934r70876q44073p37701o47966n73724n12788
$$ 15113020 13589418 12282138 11158204 10187328 9343255 8605554 7957588 7383864 6871076
57044F871076m61135m16477l79077l48266l21516k97574k77172k59829k43164
$$ 6871076 6409941 5993464 5614387 5266121 4944605 4647031 4369859 4110030 3866866
57035C866866k26181k10004j94694j78533j61394j45541j31911j18633j04398
$$ 3866866 3640685 3430681 3235987 3057454 2896060 2750519 2618608 2499975 2395577
57026B395577r0336p7232o3814m9385l5666k4128j3520j736J1584K5841M1359
$$ 2395577 2305241 2228009 2164195 2114810 2079144 2055016 2041496 2039760 2051344 2077185 2118544
57015B118544N8443P4519Q2759P4160M3168o190o0107j03462j29371j39997j39998
$$ 2118544 2176987 2251506 2334265 2408425 2451593 2445403 2385296 2281834 2152463 2012466 1872468
57004A872468j32410j20017j06312r3364q0991o9064n8618n0145m2892l6496l1488
$$ 1872468 1740058 1620041 1513729 1420365 1339374 1270310 1211692 1161547 1118655 1082159 1050671
56993A050671k7767k4438k1373j9101j7059j4134j0927r220q968q131n797l275
$$ 1050671 1022904 998466 977093 957992 940933 926799 915872 906652 897684 889553 883756 880481
56981H80481j977k428n406j1430j8737k4292k7191k8815k9510k7922k3999j9786
$$ 880481 878504 876076 870670 859240 840503 816211 789020 760205 730695 702773 678774 658988
56969F58988j6482j3333j0006p419n449k620J079L764N078P222J1419J6017J9377
$$ 658988 642506 629173 619167 611748 606299 603679 604758 608522 613600 620822 632241 648258 667635
56956F67635K1983K3952K2966J6802O323n521j6270k4409k9041l0495l0022k8084
$$ 667635 689618 713570 736536 753338 759661 754140 737870 713461 684420 653925 623903 595819
56944E95819k4291j9370j5129j1909q117l093J696N175Q320J2335J7025K1816
$$ 595819 571528 552158 537029 525120 517003 513910 515606 520781 529101 541436 558461 580277
56932E80277K6431K9926L1044L0054K7977K3587J3986p24j6025k7484l4404l7958
$$ 580277 606708 636634 667678 697732 725709 749296 763282 762558 746533 719049 684645 646687
56920F46687l8491l6382l3237l0348k7496k4456k1822j9381j5939j1807r175q824
$$ 646687 608196 571814 538577 508229 480733 456277 434455 415074 399135 387328 378153 369329
56908C69329q867p894o835o398n402l267j546j181p45P79J986J797J724L309N605
$$ 369329 360462 352568 345733 339335 333933 330666 329120 327939 327194 327973 329959 331756 333480 336789 342394
56893C42394P350R347J2457J5532J7662K0255K4307K7852K8697K7693K6418K3569
$$ 342394 349744 359091 371548 387080 404742 424997 449304 477156 505853 533546 559964 583533
56881E83533J6883P272j973r069j4184j7053j7036j4902j2097q746m434m6L344
$$ 583533 600416 607688 605715 596646 582462 565409 548373 533471 521374 512628 508194 508148 511492
56868E11492O643J1574J7940K4070K9367L4586M0082M5565N1028N6309O0049O0120
$$ 511492 518135 529709 547649 571719 601086 635672 675754 721319 772347 828656 888705 948825
56856I48825N4486M1368K0513m442k6779m1670m9117n1079m8221m1239l2725k4862
$$ 948825 1003311 1044679 1065192 1060750 1033971 992301 943184 892105 843884 802645 769920 745058
56844G45058j6879p286L028J2368K1218L0971M1274N1262O1862P4002Q5911R5075
$$ 745058 728179 720893 723921 736289 757507 788478 829752 881014 942876 1016878 1102789 1197864
56832A197864J01142J03400R6784P5004L8245n214m5381p6198r5553j03583j02290
$$ 1197864 1299006 1402406 1499190 1574194 1612439 1607225 1561844 1485646 1390093 1286510 1184220
56821A184220r4808q3682p0579n7163m4607l2553k0148p831L327J3497K3790L4599
$$ 1184220 1089412 1005730 935151 877988 833381 800828 780680 772849 776176 789673 813463 848062
56809H48062M5607N6486O6151P2238P2652O6506N2523K8970k457l4663o0037p6157
$$ 848062 893669 950155 1016306 1088544 1161196 1227702 1280225 1309195 1306738 1272075 1212038 1135881
56797A135881q4526q5927q0522p0931o0962n1548m1273l0406k1068j3665o570
$$ 1135881 1051355 965428 884906 813975 753013 701465 660192 629786 608718 595053 588483
56786E88483O81P075J2916J9621K6587L1420L3527L4205L2791K6112J2850m168
$$ 588483 589164 596239 609155 628776 655363 686783 720310 754515 787306 813418 826268 822100
56774H22100k0983l5326m5847n1283n1730m8947m4567l9395l4490l0810k7683
$$ 822100 801117 765791 719944 668661 616931 567984 523417 484022 449532 418722 391039
56763C91039k3762j9666j7310j6561j5102j2036r126p752p088o102n148m668m246
$$ 391039 367277 347611 330301 313740 298638 286602 277476 269724 262636 256534 251386 246718 242472
56750B42472l751l676l782l115j883j448k066k497k220k054k227j776n04M10L71
$$ 242472 238721 235045 231263 228148 226265 224817 222751 220254 218034 215980 213753 211977 211473 211883 212254
56735B12254J61L70O64R62J604K088J479L31L33J660K622K260J435J001P99Q02
$$ 212254 212415 212785 213449 214411 216015 218103 219582 219913 220246 221906 224528 226788 228223 229224 230023 230825
56719B30825J415K175K015J147R12J525J807J382J143J344J170N63M60R23R96
$$ 230825 232240 234415 236430 237577 238489 240014 241821 243203 244346 245690 246860 247423 247883 248806 249802
56704B49802O59R02J558J255j31j072q31l49k56q2K09l8n13j12R60J306Q64R35
$$ 249802 250461 251363 252921 254176 254045 252973 252142 251793 251537 251455 251664 251626 251113 251001 251961 253267 254131 255066
56686B55066J528J127l68j026J2J251J499J486J892J977J242M66J73k26r93j523
$$ 255066 256594 257721 257353 256327 256339 257590 259089 260575 262467 264444 265686 266152 266325 266099 265106 263583
56670B63583j803k568l523l378k041q19j54O76J422Q97n53j067k74K72Q2M40J553
$$ 263583 261780 259212 255689 252311 250270 249451 249297 249973 251395 252292 251739 250672 250398 250670 250752 251192 252745
56653B52745J842R08L76Q57Q89j38q06m84m45j040p00R00J691O77l24q3q8j447
$$ 252745 254587 255495 255871 256728 257617 257479 256673 256189 255744 254704 254004 254904 256595 257272 256948 256865 256777 255330
56635B55330k530j906r38j212j775j314p76j474k534k560k062j995j685l92P50
$$ 255330 252800 250894 249956 248744 246969 245655 244879 243405 240871 238311 236249 234254 232569 232177 232927
56620B32927N12k84l48j21m28o33r0J66p33j603j168l79o47j298r89k90n36j240
$$ 232927 233439 233155 232807 232686 232258 231625 231535 231701 230968 229365 228197 227818 227171 225873 224884 224594 224058 222818
56602B22818j004n6K67r4m8N95R75P16K58j8L8N04J033J046P86J129J953K174
$$ 222818 221814 221758 222025 221931 221883 222478 223453 224169 224427 224409 224447 224951 225984 227030 227816 228945 230898 233072
56584B33072J700J633K025J533K7p26M9Q75P84R07J950K569J904J387K190L095
$$ 233072 234772 236405 238430 239963 239990 239264 239313 240188 240972 241879 243829 246398 248302 249689 251879 254974
56568B54974K894K705L813N212N479N345O174P537Q386R055J0080J0556R611Q033
$$ 254974 257868 260573 264386 269598 275077 280422 286596 294133 302519 311574 321654 332210 341821 349854
56554C49854O641M688J676r42j905k186l036l713l246k635l111l866l661l207
$$ 349854 356495 361183 362859 361917 360012 357826 354790 351077 347831 345196 342085 338219 334558 331351
56540C31351l675m365m075l358l315l539l290l239l909l984k376n03k73j177j543
$$ 331351 327676 323311 319236 315878 312563 309024 305734 302495 298586 294602 292226 291723 291450 290273 288730
56525B88730j338j419j453p79k10p67j729j853j352r81n51o9o50k456l526k631
$$ 288730 287392 285973 284520 283741 283531 282764 281035 279182 277830 276849 276298 276229 275579 273123 269597 266966
56509B66966j422j653k351j957j276j690k314j686n64m12o91k64J28n66j266n34
$$ 266966 265544 263891 261540 259583 258307 256617 254303 252617 252053 251641 250950 250686 250814 250248 248982 248448
56493B48448P33J000P98J226J448M90l15M87J577J074j39l17k33j368k487j606
$$ 248448 249181 250181 250979 252205 253653 254143 253828 254315 255892 256966 256827 256510 256277 254909 252422 250816
56477B50816J81L83o22o50K17K38l24J70J313J330M99M79J008O30o0O51K114K234
$$ 250816 250997 251380 250758 250108 250325 250563 250239 250409 251722 253052 253551 254030 255038 255668 255608 256259 258373 260607
56459B60607J253J194K108K212J335Q71Q09M3q76m92M86K07q04m10J237J923J174
$$ 260607 261860 263054 265162 267374 268709 269580 270389 270432 269556 269064 269550 269757 268953 268543 269780 271703 272877
56442B72877N90O15J63p57j029q20j182j682j190l93o49j185m56P19N95K9R87
$$ 272877 273467 274082 274245 273488 272459 271639 270457 268775 267585 267192 266543 265358 264902 265621 266216 266245 267232
56425B67232K533K095N1q94l15j80p39l40Q70R50o5j70Q45J229P89R34J421P10
$$ 267232 269765 271860 271911 271017 270702 270522 269783 269443 270313 271263 271198 271028 271873 273102 273891 274825 276246 276956
56407B76956n67l13J004R01n87r23L56J047M34J77P20P63M85J439K965K706J003
$$ 276956 276389 276076 277080 277981 277394 276471 276827 277874 278308 278485 279205 279968 280453 281892 284857 287563 288566
56390B88566P22K290L015J890R36J096Q55j90l78M83M99m87l14J339K081J101
$$ 288566 289288 291578 294593 296483 297419 298515 299370 299180 298802 299285 299784 299297 298983 300322 302403 303504
56374C03504N25J382J911J139N31Q84R65L74M32J207J057l2q1J110J349J99l9
$$ 303504 304029 305411 307322 308461 308992 309876 310841 311215 311647 312854 313911 313879 313798 314908 316257 316456 316417
56357C16417J457K422J438R6q2L23P54J738K859K686J501J097J468R38j82K15
$$ 316417 317874 320296 321734 321830 321748 322071 322825 324563 327422 330108 331609 332706 334174 335112 334930 335145
56341C35145J894K231Q52K72J327K062J843K356L687L754K616K965N202O384N319
$$ 335145 337039 339270 340122 340394 341721 343783 345626 347982 351669 355423 358039 361004 366206 372590 377909
56326C77909M299M492M109K566K000K905K753P47l91P32J795J106K25L37K04m16
$$ 377909 382208 386700 390809 393375 395375 398280 401033 401780 401389 402121 403916 405022 405247 405584 405788 405372
56310D05372M63K895L878K397J384K635M053M126M665O728Q039P195O336P092
$$ 405372 405835 408730 412608 415005 416389 419024 423077 427203 431868 438596 446635 453830 460166 467258
56296D67258P748O995O581P660Q313P321O606P426P966P149P022Q742J0097R609
$$ 467258 475006 482001 488582 496242 504555 511876 518482 525908 533874 541023 548045 556787 566884 576493
56282E76493R299J0669J1768J1032J0341J1380J2603J2613J3015J5106J7199J7911
$$ 576493 585792 596461 608229 619261 629602 640982 653585 666198 679213 694319 711518 729429
56270G29429J8830K1303K3944K5806K8508L2912L7208M0521M4758N0654N6039
$$ 729429 748259 769562 793506 819312 847820 880732 917940 958461 1003219 1053873 1109912
56259A109912O0263O6132P4977Q4113R1839J00483J11651J22855J32006J40960
$$ 1109912 1170175 1236307 1311284 1395397 1487236 1587719 1699370 1822225 1954231 2095191
56249B095191J51388J61139J68019J73151J77476J78859J75756J69724J61441
$$ 2095191 2246579 2407718 2575737 2748888 2926364 3105223 3280979 3450703 3612144
56240C612144J48411J29621J08093Q5746O0344L0823Q86k6289n2221p8243j01195
$$ 3612144 3760555 3890176 3998269 4084015 4144359 4175182 4176068 4149779 4097558 4019315 3918120
56229C918120j18166j31159j42861j51942j56578j58509j59433j57527j51627
$$ 3918120 3799954 3668795 3525934 3373992 3217414 3058905 2899472 2741945 2590318
56220B590318j44736j39336j33400j25041j16718j10632j04444r5952q7632q1977
$$ 2590318 2445582 2306246 2172846 2047805 1931087 1820455 1716011 1620059 1532427 1450450
56210A450450p6750o9518o2556n8424n4987m9665m4412m1524l8742l3569k8360
$$ 1450450 1373700 1304182 1241626 1183202 1128215 1078550 1034138 992614 953872 920303 891943
56199H91943k6005k4602k1475j8380j7629j7128j4539j2124j2256j2284r355o096
$$ 891943 865938 841336 819861 801481 783852 766724 752185 740061 727805 715521 706166 700070
56187G00070n900o688n162l150l749n121m216k747l418m021j568J451J314m5J260
$$ 700070 694170 687482 682320 679170 675421 670300 666084 663337 659919 655898 654330 655781 657095 657050 658310
56172F58310L896M288L395M152N348M516L755O198R639J0050Q596Q954J0602J0934
$$ 658310 662206 666494 669889 674041 679389 683905 687660 693858 703497 713547 722143 731097 741699 752633
56158G52633J1075J3408J6235J6873J7131J9857K3266K4572K5746K9780L4865
$$ 752633 763708 777116 793351 810224 827355 847212 870478 895050 920796 950576 985441
56147I85441L8334M2442N0043N8635O5114P2133Q2969R4513J02476J09007J17591
$$ 985441 1023775 1066217 1116260 1174895 1240009 1312142 1395111 1489624 1592100 1701107 1818698
56136A818698J24800J25173J20212J14347J06148R2139P5675O3157N4494M5659
$$ 1818698 1943498 2068671 2188883 2303230 2409378 2501517 2577192 2640349 2694843 2740502
56126B740502L7305L2167K7190J7257M083p019j6307k7128l7699m4261m9519n8959
$$ 2740502 2777807 2809974 2837164 2854421 2858504 2851485 2835178 2808050 2770351 2726090 2676571 2617612
56114B617612p1550q2762r3497j06823j19025j23602j21509j18098j12803j01623
$$ 2617612 2546062 2463300 2369803 2262980 2143955 2020353 1898844 1780746 1667943 1566320
56104A566320q7030p5325o6384n5812m4858l8236l4413k8124k0395j6270j4746
$$ 1566320 1479290 1403965 1337581 1281769 1236911 1198675 1164262 1136138 1115743 1099473 1084727
56093A084727j1012o254n141n939l370J063J954O52K531O158O067L835N285R074
$$ 1084727 1073715 1067461 1062320 1056381 1053011 1054074 1056028 1056680 1059211 1065369 1071436 1075271 1080556 1089630
56079A089630R377P559R610J4128J4686J2159J2914J6561J7340J5772J7058J9824
$$ 1089630 1099007 1106566 1116176 1130304 1144990 1157149 1170063 1186624 1203964 1219736 1236794 1256618
56067A256618J8455J4601J4227J5606J2636P469P004R467P935M412O355J1727
$$ 1256618 1275073 1289674 1303901 1319507 1332143 1339612 1346616 1356083 1364018 1368430 1374785 1386512
56055A386512J2193Q925J0153J4935J4967J1031J1766J7083J8708J6396J7611
$$ 1386512 1398705 1407630 1417783 1432718 1447685 1458716 1470482 1487565 1506273 1522669 1540280
56044A540280K1819K1366J7454J8726K4313K4978K0830K0898K5332K5463K1629
$$ 1540280 1562099 1583465 1600919 1619645 1643958 1668936 1689766 1710664 1735996 1761459 1783088
56033A783088K3151L0109L3001L1014L2817L8663L9992L7215L9461M6158M7738
$$ 1783088 1806239 1836348 1869349 1900363 1933180 1971843 2011835 2049050 2088511 2134669 2182407
56022B182407M4812M7266N4306N5561N2052N5013O3749O6373O3012O5630P4286
$$ 2182407 2227219 2274485 2328791 2384352 2436404 2491417 2555166 2621539 2684551 2750181 2824467
56011B824467P6915P3602P6808Q6311Q9011Q5220Q9115J01034J06262J03929J09152
$$ 2824467 2901382 2974984 3051792 3138103 3227114 3312334 3401449 3502483 3608745 3712674 3821826
56000C821826J23308J30901J29935J35891J51133J60428J61780J70737J88932
$$ 3821826 3945134 4076035 4205970 4341861 4492994 4653422 4815202 4985939 5174871
55991E174871K00183K03276K15546K38349K53419K59541K76678L07216L30951
$$ 5174871 5375054 5578330 5793876 6032225 6285644 6545185 6821863 7129079 7460030
55982G460030L45708L73144M16282M53101M81036N23946N85417O41563O90725
$$ 7460030 7805738 8178882 8595164 9048265 9529301 10053247 10638664 11280227 11970952
55973A1970952P61369Q59056R57750J056438J188879J363570J554123J765249
$$ 11970952 12732321 13591377 14549127 15605565 16794444 18158014 19712137 21477386
55965B1477386K044399K411547K847801L371954M048774M896211N866615O943029
$$ 21477386 23521785 25933332 28781133 32153087 36201861 41098072 46964687 53907716
55957E3907716Q158802R496988J0887159J2343883J3985377J5876277J8006360
$$ 53907716 62066518 71563506 82450665 94794548 108779925 124656202 142662562
55950A42662562K0463715K3385876K6592178K9491376L1530732L2420271L1542614
$$ 142662562 163126277 186512153 213104331 242595707 274126439 306546710 338089324
55943C38089324K7462187J8817166O026372q262039k0752988k9455322l4143334
$$ 338089324 365551511 384368677 390395049 382133010 361380022 331924700 297781366
55936B97781366l5509799l4411382l1731711k8323954k4767597k1297697j8028748
$$ 297781366 262271567 227860185 196128474 167804520 143036923 121739226 103710478
55929A03710478j5104327j2605072j0486635q691352p220264o053334n104119
$$ 103710478 88606151 76001079 65514444 56823092 49602828 43549494 38445375
55922C8445375m304567l653557l144369k721652k346338k033295j790309j581976
$$ 38445375 34140808 30487251 27342882 24621230 22274892 20241597 18451288 16869312
55914A6869312j384562j218252j095251r88707q80211p88419p24576o65891n97722
$$ 16869312 15484750 14266498 13171247 12182540 11302329 10513910 9789334 9123443 8525721
55905H525721n38873n01498m66518m21111l81949l59632l36763l02219k72448
$$ 8525721 7986848 7485350 7018832 6597721 6215772 5856140 5519377 5217158 4944710
55896D944710k58314k43858k17775j94615j85347j76688j58459j43134j39771
$$ 4944710 4686396 4442538 4224763 4030148 3844801 3668113 3509654 3366520 3226749
55887C226749j35508j20851j07827j05717j03251r1508q1047q0038p7984o6912
$$ 3226749 3091241 2970390 2862563 2756846 2653595 2562087 2481040 2401002 2323018 2256106
55877B256106n7061n6190n4293m3791l4610l4723l5390k9968k8164l7166m7007
$$ 2256106 2199045 2142855 2088562 2044771 2010161 1975438 1940048 1910080 1881916 1844750 1797743
55866A797743m8638m9023n4745n7975n2341m6270m7227m8313m3215l9053m1932
$$ 1797743 1749105 1700082 1645337 1587362 1535021 1488751 1441524 1393211 1349996 1310943 1269011
55855A269011m4597m0604l6389l7604l7711l1527k6124k7089k7761k2931j9497
$$ 1269011 1224414 1183810 1147421 1109817 1072106 1040579 1014455 987366 959605 936674 917177
55844I17177k2618k5000k0852j7042j9400k1278j6780j2435j4500j7049j3933
$$ 917177 894559 869559 848707 831665 812265 790987 774207 761772 747272 730223 716290
55833G16290j0485j2327j4181j0753p429r353j1003p209l649n835q321n386k037
$$ 716290 705805 693478 679297 668544 661115 651762 640759 633550 629901 624066 615745 610359 608322
55820F08322l874o266l930j369l436n292k001J420k72k213J041M897L786J888
$$ 608322 604448 598182 594252 592883 589447 584155 582154 583574 583302 581089 582130 587027 590813 592701
55806E92701M528P656N904K859L261L353j149n602m911l506o973j1462j1353r916
$$ 592701 597229 604885 610789 613648 616909 620262 619113 613511 608600 605094 598121 586659 575306 565390
55792E65390j2391j5636j4491j1599j1359j0892o440j995k137k980M64M512L790
$$ 565390 552999 537363 522872 511273 499914 489022 482582 480587 478450 475470 475934 480446 484236
55779D84236J415K696N044L746J750M084Q167R062Q915J1891J5142J3863R979
$$ 484236 485651 488347 493391 497137 498887 502971 511138 520200 529115 541006 556148 570011 579990
55766E79990P005J805r173k0779k5735k5580k6027k6365k2742j7315j4710j3307
$$ 579990 586995 588800 579627 558848 533113 507533 481506 455141 432399 415084 400374 387067
55754C87067r092m284l383m489l183j191k673n568n223l127l626n458m722k864
$$ 387067 377975 373691 370308 365819 362636 361445 358772 353204 347981 344854 341228 335770 331048 328184
55740C28184l562n037l523j016j559l205j752Q27p2k905k910q98j083k837k559
$$ 328184 324622 319585 316062 315046 313487 310282 308530 309357 309285 306380 303470 302572 301489 298652 296093
55725B96093j215k232m291l801k101k798m478l360p04k71r52P56L447L415J999
$$ 296093 294878 292646 288355 284554 282453 279655 275177 271817 271113 270842 269890 270646 274093 277508 279507
55710B79507L011N272M997L176L273M003J832j654k384j503l013n886o060m318
$$ 279507 282518 287790 292787 295963 299236 303239 305071 303417 301033 299530 296517 290631 284571 280253
55696B80253m597o278n721l664l618m527k653P78J385j56O41L733M910L759L804
$$ 280253 275656 269378 263657 259993 256375 251848 249195 249973 251358 251202 251843 255576 260486 264245 268049
55681B68049N334N236L578L502M836M416K425J954K728J578j282k622k294k878
$$ 268049 273383 278619 282197 285699 290535 294951 297376 299330 302058 303636 302354 299732 297438 294560
55667B94560l972k912m75J81m83N29K601K591J110J420K911K090o50j662q56j510
$$ 294560 290588 287676 287201 287382 286899 287428 290029 292620 293730 295150 298061 300151 299501 297839 296983 295473
55651B95473l795m789m554n874q255q469o793o488p388o288l514k703m010l954
$$ 295473 291678 286889 282335 276461 268206 259737 252944 246456 239068 232780 229266 226563 222553 218599
55637B18599k072j530k801k940j587j597l178l290j477o15j336j243j37n13k344
$$ 218599 216527 214997 212196 209256 207669 206072 202894 199604 198127 197512 196176 194933 194796 194283 191939
55622A91939k835j741j677k858k865j743j920k971k114Q2K01j645j839O0O30r03
$$ 191939 189104 187363 185686 182828 179963 178220 176300 173329 171215 171297 171498 169853 168014 168074 168704 167801
55606A67801j512m20l34j735j854l64l16k115k361n3J560Q50J30O61N17r36j445
$$ 167801 166289 165869 165535 163800 161946 161582 161266 159151 156790 156737 158297 159147 159277 159938 160455 159519 158074
55589A58074l52O1q56q59O19J325P58J183K965L621K629K412L437L262J580J240
$$ 158074 157722 157783 156927 156068 156687 158012 158770 159953 162918 166539 169168 171580 175017 178279 179859 181099
55573A81099K994M159L819M332O325P234O362O333P845P988N613L502L218K578
$$ 181099 184093 188252 192071 196403 202728 209962 216324 222657 230502 238490 244103 247605 250823 253401
55559B53401K80j682k301l616o302p670o401n031n441n957n132m368m478l639
$$ 253401 253681 251999 249698 246082 239780 232110 225709 220678 215237 209280 204148 199780 195302 191663
55545A91663j125O62K47m13L10R62J59q44q39p82j319j366p12r56k329k871k102
$$ 191663 190538 191200 191447 191034 191344 192306 192465 191621 190782 190000 188681 187315 186603 185647 183318 180447 178345
55528A78345k064l367l858k734k182l344m221l436k512k686k798k030j496j602
$$ 178345 176281 172914 169056 166322 164140 160796 156575 153139 150627 147941 145143 143113 141617 140015
55514A40015j081l4l80k090k560j079j66j025j594o43R2m06m94N93J023J10q2
$$ 140015 138934 138900 138520 136430 133870 132791 132625 131600 130006 129363 129455 129049 128555 129148 130171 130281 130199
55497A30199J350K267J438O35R38P19p27j387l85J22r68j551l60N80j17n82N23
$$ 130199 131549 133816 135254 135889 136827 137546 136819 135432 135047 135169 134201 132650 132290 132870 132753 132171 132694
55480A32694J275J62j006n13K36k81q11m7P79M50M5M03K85q10j105O5N10r29k073
$$ 132694 133969 134131 133125 132612 132848 132567 131756 131709 132488 132938 132983 133386 133671 132861 131756 131821 132331 131402 129329
55461A29329j219nj38n23n4J3j059j485k97M85m56j169r0J066O99L01J227J790
$$ 129329 128110 128105 127967 127444 127390 127403 126344 124859 124562 125047 124591 123422 123332 124398 125097 125398 126625 128415
55443A28415N66n85J56J180N52m80j54M15l12j115m17O34N54M12J358J819L26
$$ 128415 128981 128396 128552 129732 130284 129804 129650 130065 129753 128638 128221 128855 129409 129821 131179 132998 133324
55426A33324j398j264l39m95r67k39Q72J109J399K606L113J635J12O23J772J354
$$ 133324 131926 130662 130323 129828 128861 128622 129494 130603 132002 134608 137721 139356 139468 140091 141863 143217
55410A43217K71L97Q86M9j104p26L13J54n56k12L72m78j938k135j525j626j917
$$ 143217 143488 143885 144771 144820 143716 142990 143303 143457 142901 142689 143061 142583 140645 138510 136985 135359 133442
55393A33442j090j2l21j342j322m72PM71J596K187J017m90l48P04P40o3m30p21
$$ 133442 132352 132340 132019 130677 129355 128883 128890 129361 130957 133144 134161 133671 133323 134027 134767 134704 134274 133553
55375A33553j725k281j088N54O54j60q0N94M74m1J79N02r9o79j01L89o40j796
$$ 133553 131828 129547 128459 129013 129667 129507 129427 130021 130495 130454 130633 131135 131036 130357 130256 130645 130005 128209
55357A28209j143K04N7q53l92R01Q72k43n01Ml76j336j168j47n1p41n53M22N47
$$ 128209 127066 127270 127327 126474 126082 126983 127855 127612 127111 127115 126739 125403 124235 124088 124037 123296 122743 123165 123712
55338A23712j99l64J16R9j54N09J541J462P67J116K068J657j39j390j460j460
$$ 123712 123513 123149 123265 123364 123210 123719 125260 126722 127489 128605 130673 132330 132191 130801 129341 127881
55322A27881j648j165j90J89J07N51J182R14K16L70R14M14p10p84J18M36j3o1
$$ 127881 126233 125068 124878 125067 125174 125725 126907 127821 128037 128407 129321 129735 129025 128241 128359 128795 128782 128721
55304A28721K32k92j377j471l70N97Q95J107J273R56O21Q62Q37l89j722j530l82
$$ 128721 128953 128661 127284 125813 125443 126040 126935 128042 129315 130271 130892 131754 132591 132202 130480 128950 128568
55287A28568J04K09J156K196J642J68o6Q86R86q6o35k20j29n48j82R58J277M26
$$ 128568 128672 128881 130037 132233 133875 134043 133977 134863 135849 135763 135128 134908 134779 134231 134049 135007 136284 136710
55269A36710k25k30o44j562j636m92N93Q37O86K94n82j138k36J358J667N07l80
$$ 136710 136485 136255 135611 134049 132413 131921 132514 133351 134037 134331 133749 132611 132375 133733 135400 135907 135527
55252A35527k47o8l11k49K59L85J9j91m15j338k400k384j569j219j217m54P07
$$ 135527 135280 135212 134901 134652 134911 135296 135315 135124 134709 133371 130971 128587 127018 125799 124582 124128 124835
55235A24835P84j73p00n47o99r27jJ622J961P32k11K9L38Rj69J99M38M25Q25J328
$$ 124835 125619 125446 124746 124199 123500 122573 122572 124194 126155 126887 126676 126705 127043 127052 126883 127082 127520 127945 128770 130098
55215A30098Q20m28q36j65K10j45j21N61O78j78p90m24Q8K8k54m45o71n74K79
$$ 130098 130918 130490 129654 129489 129699 129554 129433 129994 130672 130494 129704 129280 129368 129396 129142 128697 128026 127452 127731
55196A27731J003K37j549k477j917q56K15J578K598K185R78P29J345J022n18j438
$$ 127731 128734 128971 127422 124945 123028 122172 122387 123965 126563 128748 129726 130455 131800 132822 132304 130866
55180A30866q59%K54N03R22O00m86j021n54j07M3R02K455L052J999P20M39N93
$$ 130866 130007 130007 130261 130764 131686 132286 131800 130779 130225 130118 130161 131063 133518 136570 138569 139289 139728 140321
55162A40321L80R9J07P1k7L45R85R63K49k39l48p79j277p20Q08J856J766J170
$$ 140321 140701 140800 140907 140978 140951 141296 142281 143244 143493 143254 142906 142127 140850 140130 140938 142794 144560 145730
55144A45730K84j229k669k769j876j499j624q48O80J077j30j220j133o53k89N14
$$ 145730 146014 144785 142116 139347 137471 135972 134348 133500 134180 135257 135127 133907 132774 132121 131832 132346
55128A32346J424J121j87o54O6K57n89p45M98J355O32k95k5P32R73J065J232O21
$$ 132346 133770 134891 134704 134050 134116 134373 133784 133039 133537 134892 135524 135229 135204 135936 136909 137974 139206 139827
55110A39827p39j182q9R17P79P77J901K733J787M8p42o24m95k55L88P10K28k08
$$ 139827 139088 137906 137817 138734 139513 140290 142191 144924 146711 146759 146017 145393 144898 144643 145031 145741 145969 145761
55092A45761M4J89k98l23R17K219K161J258P73O80L65J42M60P21L36o4K34O80
$$ 145761 145805 145994 145696 145373 146290 148509 150670 151928 152701 153381 153746 153888 154348 155069 155405 155341 155575 156255
55074A56255O02N30J072J508R34j41o24m65k82j30K07L78l0p83j473k017k158
$$ 156255 156857 157387 158459 159967 160901 160760 160136 159671 159389 159259 159466 159844 159814 159031 157558 155541 153383
55057A53383j428j58M87P1n31o07m77n10m80m46q73j469j269l48J01j81j23N76
$$ 153383 151955 151797 152284 152355 151824 151217 150740 150230 149750 149304 148431 146962 145693 145345 145446 145265 145142 145718
55039A45718Q10J83j84J71J07q52j304l34P28L78p87j322r99l43N30J346J238
$$ 145718 146528 146711 146527 146698 146805 145953 144649 144315 145043 145421 144634 143312 142313 141970 142500 143846 145084
55022A45084J93m18J75Q86O18n7k03j08k89k65M29J156J272J110R24K23q66j104
$$ 145084 145277 144859 145034 145920 146538 146481 146278 146170 145881 145616 146045 147201 148473 149583 150507 150730 149864 148760
55004A48760j05P54N47L37J120J897J364J37m01k74l73p13p36n11k99J96R91J155
$$ 148760 148655 149409 149956 150293 151413 153310 154674 154811 154410 154136 153763 153050 152314 151803 151504 151700 152691 153846
54986A53846J81r32r65o1R06J524J605Q89j92o06k60j88o31m70O92J644J626J476
$$ 153846 154027 153095 152130 152069 152975 154499 156104 156993 156801 156195 155935 155747 155116 154646 155338 156982 158608 160084
54968A60084J771J682Q33L50Q06R68J0r01p05j91j62J47J128J310k12j767j611
$$ 160084 161855 163537 164370 164720 165526 166494 166504 165603 164898 164707 164545 164692 165820 167130 166918 165151 163540
54951A63540o66n12m77P41K088J620j41r96m53J55L30P46J390J577J586K186K937
$$ 163540 162874 162362 161885 162626 164714 166334 166193 165197 164744 164899 165229 165975 167365 168942 170528 172714 175651
54934A75651K729J907J950L294M975O216O973P219P074P228P994Q444P604N849
$$ 175651 178380 180287 182237 185531 190506 196722 203695 210914 217988 225216 233210 241654 249258 255107
54920B55107M039K070l69k618l935m820o096p453q188q402q307p372n536m112
$$ 255107 259146 261216 260847 258229 254294 249474 243378 235925 227737 219335 211028 203656 198120 194008
54906A94008m042m356l788k749k128j484k10P73M34l20L8J267K125K528L097L512
$$ 194008 189966 185610 181822 179073 176945 175461 175251 176024 176458 176138 176176 177443 179568 182096 185193 188705
54890A88705L326L348M387N480N428M956N383O224O386O483P532Q363P073M305
$$ 188705 192031 195379 199766 205246 210674 215630 221013 227237 233623 240106 247638 256001 263074 267379
54876B67379K273J131q64l894o210p185p972q921q936p787o714o287n739m820
$$ 267379 269652 270783 269919 266025 259815 252630 244658 235737 226801 219014 212300 206013 200274 195454
54862A95454m256m060l375k262j734j754j206j22L3j180k377k496k042j653j171
$$ 195454 191198 187138 183763 181501 179767 178013 176807 176685 176718 175538 173161 170665 168623 166970 165799
54847A65799o37o60j128j070l12Q0m94j327j703j812j860j496o02K80P15P34M01
$$ 165799 165162 164502 163374 162304 161992 162072 161578 160251 158548 156736 154876 153380 152778 153058 153773 154507 154908
54830A54908j42k98L11R70P47J6j39K52J92m49p31k99J52J76J07J15k9j94O9O37
$$ 154908 154766 154468 154779 155749 156496 156512 156373 156625 156817 156368 155637 155338 155490 155666 155773 155888 155859 155665 155734 156371
54810A56371J028J301J767K019J453M86Q3K75L45K87P40J667K305K355K118J688
$$ 156371 157399 158700 160467 162486 163939 164425 164508 164783 165128 165415 166155 167822 170127 172482 174600 176288
54794A76288J061O69O99M42n07j069j77J274J601R02O60J212J592J682K466M025
$$ 176288 177349 178018 178717 179159 178652 177583 177406 178680 180281 181183 181843 183055 184647 186329 188795 192820
54778A92820N125N094M620M431M583N079N952O657O689O593P062P392O286L938
$$ 192820 197945 203039 207659 212090 216673 221752 227704 234361 241050 247643 254705 262097 268383 272321
54764B72321J759L25q82j986k674l355m654n964o197n682n583n750n140m072l879
$$ 272321 274080 274405 273523 271537 268863 265508 260854 254890 248693 243011 237428 231678 226538 222466 218587
54749B18587m402m084k735j939k339k670k006r93k73N41J587K143J934J672J775
$$ 218587 214185 210101 207366 205427 203088 200418 198412 197419 197146 197687 199274 201417 203351 205023 206798
54734B06798J924K121K812L748M173M297N048O236O623N914N012M197K814R50
$$ 206798 208722 210843 213655 217403 221576 225873 230921 237157 243780 249694 254706 258903 261717 262667
54720B62667m81j506l112n191o458o714p196q174q292o970n469m774m232l169
$$ 262667 262186 260680 257568 252377 245919 239205 232009 223835 215543 208573 203104 198330 194098 190929
54706A90929k158j727j386q25o13r83j205r22q34j338j800j713j417j191q49n18
$$ 190929 188771 187044 185658 184833 184220 183237 182032 181110 180276 178938 177138 175425 174008 172817 171968 171450
54690A71450n76o77k14K87j26q57m49P49Q83k69q60j63K94l49p46R5R92P48M4
$$ 171450 170874 170197 169983 170270 170144 169287 168838 169587 170470 170201 169341 169178 169472 169123 168377 168472 169464 170212 170256
54671A70256j73l91j154j717j492j278j651j744r25j81l85o80o0Q38J005Q10R33
$$ 170256 170083 169692 168538 166821 165329 164051 162400 160656 159731 159550 159165 158485 158425 159263 160268 161078 162011
54654A62011Q42m7q59m79N47Q85M45J16J42Q0j72m07o59q71o29N1M33K19R3M45
$$ 162011 162853 162806 161947 161468 162015 162900 163345 163461 163603 163683 163511 163104 162445 161574 160945 160996 161429 161648 161741 162186
54634A62186O62M07L85R22J048J40p13k94Q22J244R07P59R97Q68kj135j838j688
$$ 162186 162848 163255 163640 164562 165610 165750 165037 164743 165565 166809 167716 168475 169472 170340 170338 169203 167365 165677
54616A65677o85M99R02L50l13m23k26j19K8L93P65R53R60O69R3j58L26P10J9j029
$$ 165677 164992 165491 166393 166743 166430 166007 165781 165662 165690 166083 166848 167801 168761 169430 169523 169365 169691 170401 170420 169391
54596A69391r31M4K58l60j81R93J232j86j298o76K67j60j142j066j90L47O29J161
$$ 169391 168460 168504 168762 168402 168221 169214 170446 170260 168962 168286 168553 168393 167251 166185 165995 166342 166971 168132
54578A68132J259K42q66p17J54L18k11l76m6R2L2K68N99M71R0%K0k94p00p31m80
$$ 168132 169391 169633 168767 168050 168204 168522 168311 167935 167889 167981 168013 168281 168880 169351 169441 169441 169461 169167 168467 167736 167256
54557A67256j06N99J370J262J62n83j00O83P37O24J180J797J579J074J251J707
$$ 167256 167150 167749 169119 170381 170543 169960 169860 170543 171280 171904 173084 174881 176460 177534 178785 180492
54541A80492J506R10P41P76L70j88l19m27r69j199l95M79Q9j023j325q04p97j630
$$ 180492 181998 182908 183649 184425 184795 184607 184288 183861 182892 181693 181298 181777 181866 180843 179518 178714 177917 176287
54523A76287k189j739p60K4K25k95j064j041j2P34K82l03L47J519J510M12j29
$$ 176287 174098 172359 171599 171623 171848 171553 170489 169448 169436 170170 170452 170149 170496 172015 173525 173937 173808
54506A73808L88Q06M60L4M3O6k37n36o56q91j251j249o18L44J227J720J654J297
$$ 173808 174196 175002 175462 175496 175539 175605 175368 174832 174176 173285 172034 170785 170167 170511 171738 173458 175112 176409
54488A76409J248J579J582R74N02P09R75O25J53L02Q20J113J309J638J693J374
$$ 176409 177657 179236 180818 181792 182294 183003 183978 184603 184756 185058 185878 186991 188300 189938 191631 193005
54472A93005J539K491K887J649r3n88p3Rm01j74O75R01J33o91j048j365j773j806
$$ 193005 194544 197035 199922 201571 201478 200890 200817 200826 200425 200251 200926 201827 201960 201269 200221 198856 197083 195277
54454A95277j406j064q67n13j50k01n39p82r92j158o48O96J591Q63o28j098l70
$$ 195277 193871 192807 191940 191427 191277 191076 190537 189755 188763 187605 186957 187653 189244 190107 189479 188381 188011
54437A88011K29R7j34n1J04L43Q92J334J063L85J7q9k94j84O21J191M81p28p48
$$ 188011 188240 188337 188203 188152 188256 188599 189491 190825 191888 192273 192290 192201 191907 191723 192344 193535 194016 193288 192540
54418A92540M36J290J176Q52O86J81o01q59m88j89j11J91N07K23k22J76J081J171
$$ 192540 192976 194266 195442 196294 196980 197161 196560 195701 195213 195024 194913 195104 195611 195834 195612 195788 196869 198040
54400A98040M28K63J045J396N40m31l56L27N88K80j41m33m79j90J28Ql79m66k95
$$ 198040 198468 198731 199776 201172 201712 201281 200925 201252 201840 202120 201979 201546 201067 200877 201005 201013 200634 200168 199873
54381A99873l30l64K57J254J557R76N16P86J289J577J952K620L183L375L429L410
$$ 199873 199543 199179 199436 200690 202247 203223 203739 204525 205814 207391 209343 211963 215146 218521 221950 225360
54365B25360L030K331J762J388Q49J36l67o77j193j837k026j584r42m71k23k10
$$ 225360 228390 230721 232483 233871 234720 234856 234489 233812 232619 230782 228756 227172 226230 225759 225536 225326
54349B25326l36l15k39o33j375j368k44O16Kj185j376q12p76j161q81k24n42j800
$$ 225326 224990 224675 224436 223803 222428 221060 220816 221432 221434 220249 218873 218061 217285 216124 215243 215019 214477 212677
54331B12677k494k081j444r27M3J201J370N16n8N5j85j132j720j396r66q92n49
$$ 212677 210183 208102 206658 205731 205774 206975 208345 208861 208803 208858 208673 207541 205821 204425 203459 202567 202018
54314B02018J79L10m49j022q20p20j312j793j472r57q30n38M10J344J515J242
$$ 202018 202197 202507 202058 201036 200216 199496 198184 196391 194919 193962 193132 192594 193004 194348 195863 197105
54298A97105J135J120R87R47R93O75j0m08l68n31j060j234p08p1K78N93P79L36
$$ 197105 198240 199360 200347 201294 202287 202962 202952 202544 202176 201645 200585 199351 198643 198572 198850 199443 200222 200558
54280B00558l57j56R09J374O40l1L36Q88N96JJ22P97J289J565J835J773J218Q41
$$ 200558 200201 200045 200954 202328 202968 202937 203273 204161 204757 204758 204880 205677 206966 208531 210366 212139 213357 214198
54262B14198J132J497J265P64O00O10M34L61O85Q87L60o05j190j027k80O33J073
$$ 214198 215330 216827 218092 218856 219456 220066 220500 220861 221546 222433 222793 222188 220998 219971 219691 220324 221397
54245B21397N75m38j005r37r44j278j347r09n03l01K37J153J629J355J003Q49
$$ 221397 221972 221534 220529 219592 218648 217370 216023 215114 214611 214310 214547 215700 217329 218684 219687 220536
54229B20536L11n97p54K26J068P33n5j99L1j24m31l14j40o12j492j996j941j541
$$ 220536 220847 220250 219496 219722 220790 221523 221468 221269 221300 221176 220745 220431 220291 219679 218187 216191 214250 212709
54211B12709q08N5K96l94j122q54K40J162J285O39l17p22J13J620K264J414J11
$$ 212709 211901 211956 212252 211858 210736 209882 210122 211284 212569 213208 212891 212169 212282 213902 216166 217580 217691
54194B17691o25j035j570j713r10K73R35J112J302J421J105N54K20J83L69Q45
$$ 217691 217066 216031 214461 212748 211838 212111 213046 214158 215460 216881 217986 218540 218760 218943 219312 220157
54178B20157J382J381P10n1n71j111j630j575r68n76n64k13N29N90m59j511j697
$$ 220157 221539 222920 223630 223579 223008 221897 220267 218692 217724 217148 216584 216371 216900 217490 217031 215520 213823
54161B13823j603j786j548l64P49O42k36p79q75q92o37n5K2q24j506r86O1M89
$$ 213823 212220 210434 208886 208522 209271 209913 209677 208898 208023 207131 206494 206439 206461 205637 204131 203145 203206 203695
54143B03695N50J004J344O72m37p45m43n88r40k75J311K262J873J101Q63R51R97
$$ 203695 204245 205249 206593 207265 206828 206083 205640 205052 204112 203837 205148 207410 209283 210384 211247 212198 213195
54126B13195J233J774K172K185K211K638L289L819M179M559N100N722O032N720
$$ 213195 214428 216202 218374 220559 222770 225408 228697 232516 236695 241254 246354 252076 258108 263828
54112B63828N124M888M870M157K482P80k53j272l133n383o835p076o528n564m423
$$ 263828 268952 273840 278710 282867 285349 286129 285876 284604 281471 276088 269253 262177 255649 250085 245662
54097B45662l545l190l022k686k341k104j588o14K83O60P53P36L00m34o13oM05
$$ 245662 242117 238927 235905 233219 230878 228774 227186 226572 226855 227515 228268 229004 229304 228870 228257 228251 228656
54080B28656O4q9P53J750J825J462J614J780R09m35o50M85J534J516Q97N00N36
$$ 228656 228720 228631 229384 231134 232959 234421 236035 237815 238724 238289 237639 238124 239658 241174 242071 242571 243107
54063B43107P36N73m41j898k411j263M44J240J220J392J817J775J274J013J053
$$ 243107 243843 244416 243975 242077 239666 238403 238847 240087 241307 242699 244516 246291 247565 248578 249631
54048B49631Q99O98J131K163L002L202K929K407J963K259L527M917N506N432N280
$$ 249631 250530 251228 252359 254522 257524 260726 263655 266062 268025 270284 273811 278728 284234 289666 294946
54033B94946N036M604M608N407O158O098N926O437O702N440L483K862L677M059
$$ 294946 299982 304586 309194 314601 320759 326857 332783 339220 345922 351362 354845 357707 361384 365443
54019C65443L135K018J602J298M82l79q18j194j867k547k982l405l976m470m763
$$ 365443 368578 370596 372198 373496 373978 373599 372781 371587 369720 367173 364191 360786 356810 352340 347577
54004C47577m848m522l745l157l303l660l438k952l039l458l271k537k190k318
$$ 347577 342729 338207 334462 331305 328002 324342 320904 317952 314913 311455 308184 305647 303457 301139
53990C01139k102j459j172j295r44K4O02L15n0J32M83O48J043J917K727K969K905
$$ 301139 299037 297578 296406 295111 294167 294191 294793 295108 295058 295190 295673 296321 297364 299281 302008 304977 307882
53973C07882L024L485M292N316N978N638M317K457J24k637n050o263o567o759
$$ 307882 310906 314391 318683 323999 329977 335615 339932 342389 342513 339876 334826 328563 321996 315237
53959C15237o600n256l124j645j272j104o75n50q32p21L3O76R62J645K898L644
$$ 315237 308637 303381 300257 298612 297340 296236 295561 295011 294179 293458 293491 294167 295129 296774 299672 303316
53943C03316L207K402K215K574L091L836M527M162K422O08K15J224K506L251L310
$$ 303316 306523 308925 311140 313714 316805 320641 325168 329330 331752 332360 332575 333799 336305 339556 342866
53928C42866K874K433K557L150L512L475L602M059M235M042M464O077P909Q721
$$ 342866 345740 348173 350730 353880 357392 360867 364469 368528 372763 376805 381269 387346 395255 403976
53914D03976Q586Q354Q177P645O881O532O794P244P507P502P136O261M944L404
$$ 403976 412562 420916 429093 436738 443619 450151 456945 464189 471696 479198 486334 492595 497539 500943
53900E00943J813L46p94j561k090k455k665k933l527m259m623m519m444m791n475
$$ 500943 502756 503102 502308 500747 498657 496202 493537 490604 487077 482818 478195 473676 469232 464441 458966
53885D58966o308p302q387r263r692r588q876p614o297n448m994m474l857l580
$$ 458966 452658 445356 436969 427706 418014 408426 399550 391936 385639 380191 375197 370723 366866 363286
53871C63286l792m131m290m263m113l954m122m754n273m944l888k935k539k450
$$ 363286 359494 355363 351073 346810 342697 338743 334621 329867 324594 319650 315762 312827 310288 307838
53857C07838k398k413k415k178j752j432j339j437j747k101j971j230o58r64j718
$$ 307838 305440 303027 300612 298434 296682 295250 293911 292474 290727 288626 286655 285425 284767 283803 282085
53842B82085k018j859j840j891j464o70j55J04P09J604K007J622R45L22k88o80
$$ 282085 280067 278208 276368 274477 273013 272343 272188 272292 273001 274605 276612 278234 279179 279501 279213 278533
53826B78533m42L02R90J353J313N44q64j791j298q9N10N14Q76J513J521J044J130
$$ 278533 278091 278393 279383 280736 282049 282593 281729 279938 278640 278551 279061 279575 280451 281964 283485 284529 285659
53809B85659J736J786J306J628L088M370M654M661M989N163N011N308O259O813
$$ 285659 287395 289181 290487 292115 295203 299573 304227 308888 313877 319040 324051 329359 335618 342431
53795C42431O379N843O053O549O552O024N054L526J986J515J989J889N55p41q58
$$ 342431 348810 354653 360706 367255 373807 379831 384885 388411 390397 391912 393901 395790 396345 395604 394746
53780C94746m80p37j508k186k931m004m869n043m942m963m723m059l717m097m342
$$ 394746 394266 393529 392021 389835 386904 382900 378031 372988 368046 363083 358360 354301 350584 346487 342145
53765C42145l674k698k373k577k745k986l578m094m081l856l800l592k974k390
$$ 342145 338471 335773 333400 330823 328078 325092 321514 317420 313339 309483 305683 302091 299117 296727
53751B96727k136j747j043p84j365j932j730j332j478j689j234n65n32q82q13
$$ 296727 294591 292844 291801 291017 289652 287720 285990 284658 283180 281491 280257 279692 279160 278278 277465
53736B77465l91j96j18L47J011J272J134J069J154J080P01M7p38j059k46J263
$$ 277465 277074 276878 276760 277107 278118 279390 280524 281593 282747 283827 284528 284575 283837 282778 282532 283795
53720B83795K013J398M81L61P89J164J665K406K633J862R57R02J352J452J235
$$ 283795 285808 287206 287687 288048 288837 290001 291666 294072 296705 298567 299524 300426 301778 303230 304465
53705C04465J176J249J419K190L623M812N240N590O148N814M005K230K012K443
$$ 304465 305641 306890 308309 310499 314122 318934 324174 329764 335912 341726 345731 347961 349973 352416
53691C52416J697l9j117j163j149j224o09N22J066Q46P46Q71M55l64l64P47J642
$$ 352416 354113 354074 352957 351794 350645 349421 348812 349334 350400 351246 351992 352863 353318 352954 352590 353337 354979
53674C54979J210n8r45q72j00O54O68j32r68j204j125j135q56J9P08L80l95m99
$$ 354979 356189 356131 355186 354314 354214 354868 355536 355404 354436 353232 352107 350972 350116 350135 350843 351223 350828 350329
53656C50329k7K20L76J029J597J062M5K30J669K578K130J522J714J889J082j56
$$ 350329 350302 350522 350898 351927 353524 354586 354631 354861 356530 359108 361238 362760 364474 366363 367445 367289
53640C67289o76l55K15Q08J556K394L107L540L479K818J997J717K044K418K501
$$ 367289 366613 366258 366473 367281 368837 371231 374338 377878 381357 384175 386172 387889 389933 392351 394852
53625C94852K407K156J696J461K039L174L918L821L227K446J537R38J206K009
$$ 394852 397259 399415 401111 402572 404611 407785 411703 415524 418751 421197 422734 423672 424878 426887
53611D26887K342J987J790K246K761K686K272K124K383K824L228L376L188K997
$$ 426887 429229 431216 433006 435252 438013 440699 442971 445095 447478 450302 453530 456906 460094 463091
53597D63091L137L263K730J691R94Q86P25J97j35Q6K23m12j449j981j885j906
$$ 463091 466228 469491 472221 473912 474906 475792 476517 476714 476579 476665 476888 476476 475027 473046 471161 469255
53581D69255k492l087k729j310R5L11o42j640j883j659j553j626j758k098k586
$$ 469255 466763 463676 460947 459637 459732 460043 459401 457761 455878 454219 452666 451040 449282 447184 444598
53566D44598k617j891j052p37o11j15L92K88j10n2L37L70J26K81Q04J011P73N68
$$ 444598 441981 440090 439038 438301 437690 437575 437967 438255 438145 438093 438430 438800 438926 439207 440011 441022 441795 442363
53548D42363M53J01k13J28Q44J007N44L25O62R70J070J572K558L116K765K304
$$ 442363 442816 442917 442704 442832 443676 444683 445227 445552 446214 447184 448254 449826 452384 455500 458265 460569
53532D60569K720L929N178N979O233O105O124O809P968Q914R463J0089J0965J1675
$$ 460569 463289 467218 472396 478375 484608 490713 496837 503646 511614 520528 529991 540080 551045 562720
53518E62720J2067J2522J3155J3581J3798J4416J5616J6639J6862J6775J7319
$$ 562720 574787 587309 600464 614045 627843 642259 657875 674514 691376 708151 725470
53507G25470J8687K0237K1292K1665K1603K1439K1228K0734J9944J9365J9380
$$ 725470 744157 764394 785686 807351 828954 850393 871621 892355 912299 931664 951044
53496I51044J9585J9290J8448J7552J6871J6424J6480J7233J8173J8506J8177
$$ 951044 970629 989919 1008367 1025919 1042790 1059214 1075694 1092927 1111100 1129606 1147783
53485A147783J7767J7570J7489J7592J7931J7960J7138J5983J5559J5988J6383
$$ 1147783 1165550 1183120 1200609 1218201 1236132 1254092 1271230 1287213 1302772 1318760 1335143
53474A335143J6199J5647J4794J3364J1574J0108R042P699N757L646J704k20k200
$$ 1335143 1351342 1366989 1381783 1395147 1406721 1416829 1425871 1433570 1439327 1442973 1444677 1444457 1442257
53461A442257m112o154q586j0914j2292j2765j3106j3433j3107j2191j1773j2526
$$ 1442257 1438145 1431991 1423405 1412491 1400199 1387434 1374328 1360895 1347788 1335597 1323824 1311298
53449A311298j3950j5311j6359j6830j6363j5283j4507j4308j4113j3713j3586
$$ 1311298 1297348 1282037 1265678 1248848 1232485 1217202 1202695 1188387 1174274 1160561 1146975
53438A146975j3673j3069j1445r736q711p890o522m767l179j795m88M93R96J512
$$ 1146975 1133302 1120233 1108788 1099052 1090341 1082451 1075929 1071162 1067983 1066188 1065700 1066193 1067189 1068701
53424A068701K599M126N489O282O548O785P704R434J1082J1793J2144J3399J5487
$$ 1068701 1071300 1075426 1080915 1087197 1093745 1100530 1108234 1117668 1128750 1140543 1152687 1166086 1181573
53411A181573J6939J7083J6975J7681J8905J9893K0702K1789K3252K5091K7441
$$ 1181573 1198512 1215595 1232570 1250251 1269156 1289049 1309751 1331540 1354792 1379883 1407324
53400A407324K9968L1785L2577L3087L4088L5611L7530M0018M2883M5346M6947
$$ 1407324 1437292 1469077 1501654 1534741 1568829 1604440 1641970 1681988 1724871 1770217 1817164
53389A817164M7982M8734M9106M9345N0013N0785N0458M8735M6832M5660M4542
$$ 1817164 1865146 1913880 1962986 2012331 2062344 2113129 2163587 2212322 2259154 2304814 2349356
53378B349356M2600M0216L8132L6032L3226K9957K6919K4008K0651J6912J3339
$$ 2349356 2391956 2432172 2470304 2506336 2539562 2569519 2596438 2620446 2641097 2658009 2671348
53367B671348J0023O540K570k061p472j3284j8602k2991k7014l1243l5325l8512
$$ 2671348 2681371 2687911 2690481 2688420 2680948 2667664 2649062 2626071 2599057 2567814 2532489 2493977
53355B493977m0572m1690m2061m2076m2221m2324m1640m0136l8780l8038l7086
$$ 2493977 2453405 2411715 2369654 2327578 2285357 2243033 2201393 2161257 2122477 2084439 2047353
53344B047353l5254l3282l2184l1818l1585l1658l2409l3201l2986l1694l0056
$$ 2047353 2012099 1978817 1946633 1914815 1883230 1851572 1819163 1785962 1752976 1721282 1691226
53333A691226k8439k6805k5336k4207k2988k1212j9196j7532j6150j4651j3179
$$ 1691226 1662787 1635982 1610646 1586439 1563451 1542239 1523043 1505511 1489361 1474710 1461531
53322A461531j2251j2064j2619j4060j6153j7942j8648j8444j7710j6235j3968
$$ 1461531 1449280 1437216 1424597 1410537 1394384 1376442 1357794 1339350 1321640 1305405 1291437
53311A291437j1850j0824j0511r919q909p934o817n074l138j985j533o17J374
$$ 1291437 1279587 1268763 1258252 1248333 1239424 1231490 1224673 1219599 1216461 1214476 1212943 1212326 1213700
53298A213700L772N659O785P332P612Q092R196J0911J2937J5084J7146J8735J9716
$$ 1213700 1217472 1223131 1229916 1237248 1244860 1252952 1262148 1273059 1285996 1301080 1318226 1336961 1356677
53285A356677K0433K1022K0942J9938J8805J8353J8051J6744J4390J2020J0171
$$ 1356677 1377110 1398132 1419074 1439012 1457817 1476170 1494221 1510965 1525355 1537375 1547546
53274A547546Q434O482M529K589L53j980l623m318m886o285q627j1394j4198j7005
$$ 1547546 1555980 1562462 1566991 1569580 1569933 1567953 1564330 1560012 1555126 1548841 1540214 1528820 1514622 1497617
53260A497617j9787k2162k3478k3402k2526k2008k2365k3001k3185k2953k2687
$$ 1497617 1477830 1455668 1432190 1408788 1386262 1364254 1341889 1318888 1295703 1272750 1250063
53249A250063k2357k1836k1469k1581k1785k1445k0610j9846j9411j9239j9431
$$ 1250063 1227706 1205870 1184401 1162820 1141035 1119590 1098980 1079134 1059723 1040484 1021053
53238A021053k0029k0525k0339j9628j8962j8407j7607j6605j5795j5104j3962
$$ 1021053 1001024 980499 960160 940532 921570 903163 885556 868951 853156 838052 824090
53227H24090j2217j0463r321q833q610q276p798p589q148r360j0494j1116j1603
$$ 824090 811873 801410 792089 783256 774646 766370 758572 750983 742835 733475 722981 711865 700262
53214G00262j2439j3504j4469j5300j5855j5580j4347j3026j2425j2153j1379
$$ 700262 687823 674319 659850 644550 628695 613115 598768 585742 573317 561164 549785
53203E49785j0274r671r616r364q735q436q859r423r403q749p896p296p248p777
$$ 549785 539511 529840 520224 510860 502125 493689 484830 475407 466004 457255 449359 442063 434815 427038
53189D27038q507q934q864q415p740o987o282n530m543l604l315l644l687k912
$$ 427038 418531 409597 400733 392318 384578 377591 371309 365779 361236 357632 354317 350673 346986 344074
53175C44074j961j650j838j960k048k300k300j653r58j077j752j956j439q92p57
$$ 344074 342113 340463 338625 336665 334617 332317 330017 328364 327406 326329 324577 322621 321182 320290 319533
53160C19533p86p40o58m71j26J8l94j028j338j467j858k239j928j025l74l12l28
$$ 319533 318747 318007 317349 316878 316752 316770 316376 315348 314010 312543 310685 308446 306518 305493 305119 304807 304479
53143C04479J0N48R53R70L56p16j348q55J72M91r8o36m19L49J289K255K918K773
$$ 304479 304489 305037 305990 306960 307316 306600 305252 304397 304569 305060 304962 304326 303907 304256 305545 307800 310718 313491
53125C13491J872R21N38Q53J748K805L231K642J788J794K641L218K865K043J475
$$ 313491 315363 316284 316822 317675 319423 322228 325459 328101 329889 331683 334324 337542 340407 342450 343925
53110C43925J292J125M94q18k364l208l060k743k925l012k271j353j420k192k299
$$ 343925 345217 346342 346836 346018 343654 340446 337386 334643 331718 328706 326435 325082 323662 321470 319171
53095C19171j423n92m03l78l04o46j306j351n11J93j17j093j961k422k348j644
$$ 319171 317748 317156 316753 316375 316071 315425 314119 312768 312257 312450 312333 311240 309279 306857 304509 302865
53079C02865q41q57j622j923j118l8L59K51K67L98M20N59R60J029J49j310k318
$$ 302865 302024 301167 299545 297622 296504 296466 296825 297076 297343 297741 298161 298720 299680 300709 300858 299548 297230
53062B97230k279j399k96M29N62M89O71R39Q30N42P75J453J631R13R2n2K27L46
$$ 297230 294951 293552 293256 293685 294247 294736 295407 296346 297176 297718 298493 299946 301577 302490 302582 302530 302757 303103
53044C03103L40M54N06K02l46q65j183j006r4R89J151K91l18K70J318J576J056
$$ 303103 303443 303897 304403 304605 304259 303394 302211 301205 301111 302100 303251 303542 303224 303494 304812 306388 307444
53027C07444O83P13N66O0k53n2K88L70L63O31J152J626J888J970J766R87l39j476
$$ 307444 308127 308840 309406 309466 309213 309161 309449 309819 310182 310813 311965 313591 315479 317449 319215 320202 319863 318387
53009C18387j498l95P61J057P48O36R16J245J561K008K222J668N94r8o7K35N07
$$ 318387 316889 316494 317255 318312 319060 319696 320612 321857 323418 325426 327648 329316 329910 329812 329745 329980 330487
52992C30487R50J519J749J570J451J504J226N21R7M27R98J062O06J23m6J91P49
$$ 330487 331437 332956 334705 336275 337726 339230 340456 340977 341074 341501 342499 343561 344167 344290 344244 344435 345184
52975C45184J215J093M40j91n14o99p29k49P17J572J908J862J641J271R34Q14
$$ 345184 346399 347492 347932 347741 347227 346528 345799 345550 346267 347839 349747 351609 353250 354521 355455 356269
52959C56269N82k02j103j209o36n63j494k541k784k332j580n55M60O83Jo02m58
$$ 356269 356851 356649 355546 354337 353701 353138 351644 349103 346319 343987 342407 341852 342312 342995 342996 342394 341936
52942C41936j76m33p89o21m13r84k038k520k036j052r4N51O55L27R3J94K38O3
$$ 341936 341760 341327 340538 339917 339504 338520 336482 333962 331926 330874 330780 331331 331986 332313 332406 332600 332838 332901
52924C32901J77P79J089N17k99n81p34j446k058j349L90J502J242O10O05Q53M98
$$ 332901 333078 333857 334946 335463 335164 334583 333849 332403 330345 328996 329386 330888 332130 332740 333345 334198 334696
52907C34696m30j141j146o60k17j84m85p17o39m59m49m61j76K94M83K20j07J6
$$ 334696 334266 333125 331979 331319 331102 330918 330433 329716 329077 328618 328169 327708 327532 327826 328309 328529 328422 328438
52889C28438P22J597J957J488O98M41Q57J169Q05J84O8N01R56J211J590K388L438
$$ 328438 329160 330757 332714 334202 334900 335341 336198 337367 338172 338356 338424 338925 339881 341092 342682 345070 348508
52872C48508M179M050L077K062J774J822R89j024k927l409k743k143k092k179
$$ 348508 352687 356737 359814 361876 363650 365472 366461 365437 362510 359101 356358 354215 352123 349944
52858C49944k139k126k059j623r99q26j291j855k084k182k457k718k537j925j371
$$ 349944 347805 345679 343620 341997 340998 340172 338881 337026 334942 332760 330303 327585 325048 323123 321752
52843C21752j250j410j492j517j852k482k738k105j021l55k16N6P18J252J325
$$ 321752 320502 319092 317600 316083 314231 311749 309011 306906 305885 305530 305314 305370 306088 307340 308665
52828C08665J298J406J201L36o48r66o68m74p57j184j255q43k44J42K72O42J722
$$ 308665 309963 311369 312570 312906 312258 311292 310624 310150 309393 308209 306954 306111 305867 306009 306281 306923 308645
52811C08645L208M175M005K842J197l79j354j634j901k759l646l497k486j921
$$ 308645 311853 316028 320033 322875 324072 323693 322339 320705 318804 316045 312399 308902 306416 304495
52797C04495k217k239j225l3K91O1M1M3m85j219j455j293j225j065l50O21J151
$$ 304495 302278 300039 298814 298781 299072 299133 299174 299217 298732 297513 296058 294765 293540 292475 292125 292746 293897
52780B93897J278J516J833J812J575J553J569J130M31J29J79j37r65j550j306
$$ 293897 295175 296691 298524 300336 301911 303464 305033 306163 306594 306723 306902 306765 305800 304250 302944
52765C02944n31J43M05K81l4k15m1L66P47R74R28M70j25j46O82J649J915J512
$$ 302944 302413 302556 302961 303242 303208 302993 302952 303318 304065 305039 305967 306437 306312 306166 306848 308497 310412 311924
52747C11924J063R18J139J745K423K410J441L60N1K45K00Q9O79J873K661K495
$$ 311924 312987 313905 315044 316789 319212 321622 323063 323423 323474 323719 323919 324008 324687 326560 329221 331716
52731C31716J863J411J216J068Q48N85M80P38J024M97j061k623l062k542k034
$$ 331716 333579 334990 336206 337274 338122 338707 339187 339925 340949 341446 340385 337762 334700 332158 330124
52716C30124j846j545r59l04M16J216J486N65j085k197k234j747j283q01k42K08
$$ 330124 328278 326733 325774 325470 325886 327102 328588 329153 328068 325871 323637 321890 320607 319806 319564 319772
52700C19772N81J115J664J735J277P10K40k41n41k74L75O24P7q23j444j507r98
$$ 319772 320353 321468 323132 324867 326144 326854 327094 326853 326312 326038 326413 327037 327114 326291 324847 323340 322342
52683C22342q2Q20J247J101N66j63p52p10q5L21n3o76p96o18p54r86o38J34N44
$$ 322342 322260 323080 324327 325428 325994 325831 325079 324369 324284 324605 324552 323876 323080 322462 321708 320722 320084 320218 320762
52664C20762M96N90R11R73Q42J105J706J944J817K127L015L581L324K848K662
$$ 320762 321258 321848 322759 323732 324574 325679 327385 329329 331146 333273 336288 339869 343193 346041 348703
52649C48703K365J601Q22M14l1q43j439j122k82N6n15j478k153k237j796j116
$$ 348703 351068 352669 353491 353905 353874 353031 351592 350470 350188 350244 349729 348251 346098 343861 342065 340949
52633C40949n08r3J09J4l31n19k60Lm29j383j864j333l23L76N62M91M13N09P55
$$ 340949 340441 340348 340457 340471 340140 339621 339361 339364 338935 337552 335688 334355 334032 334408 334970 335461 335874 336383 337138
52614C37138P89L08l39m78oN59R00J074R64L03o78j338j465j344r86j18J008J674
$$ 337138 337927 338235 337896 337418 337412 337971 338871 339945 340909 341212 340534 339196 337731 336387 335401 335283 336291 337965
52596C37965J724J662J569R39j34o30%R87J331J035O99O47R79J820K870L225K359
$$ 337965 339689 341351 342920 343859 343725 343095 343095 344082 345413 346448 347147 347794 348773 350593 353463 356688 359047
52579C59047Q44l18p17n15L1N44N29k1m34k47J11k9o18j039r79n90q7L96O54M60
$$ 359047 359891 359573 358856 358341 358372 358916 359445 359424 358990 358743 358854 358825 358207 357168 356189 355599 355512 355908 356562 357022
52559C57022k08j116j815j859j259o74p28j173j271r14o80p94p62l18R3L8l02
$$ 357022 356814 355698 353883 352024 350765 350091 349363 348190 346919 346005 345325 344531 343769 343451 343544 343582 343280
52542C43280o15q53q52k37Q32J484J195N16K99O47J109J420J542J281M49p01j495
$$ 343280 342665 341812 340960 340723 341555 343039 344234 344750 345049 345696 346805 348225 349767 351048 351497 350796 349301
52525C49301j310p9J438K107J657J228J955L228L474K590K274L457M821M672L208
$$ 349301 347991 347912 349350 351457 353114 354342 356297 359525 362999 365589 367863 371320 376141 380813 384021
52510C84021J883J403J398J464J375P12p03k185k954l236l795m590m882m491m024
$$ 384021 385904 387307 388705 390169 391544 392256 391553 389368 386414 383178 379383 374793 369911 365420 361396
52495C61396l836l591l028k399j948j529r97n56m33n08m42n9M80P59N04J0l0O40
$$ 361396 357560 353969 350941 348542 346594 345065 344068 343512 343079 342571 342129 342070 342550 343309 343813 343823 343793 344433
52477C44433J413J544J163J149J981L122L674L430L046L187L664L662K901K170
$$ 344433 345846 347390 348553 349702 351683 354805 358479 361909 364955 368142 371806 375468 378369 380539
52463C80539K367L181L306K002n8j605k040j774j692k403l705m739m921m644m563
$$ 380539 382906 386087 389393 391395 391337 389732 387692 385918 384226 381823 378118 373379 368458 363814 359251
52448C59251m502l863k953k801l420l401j862K03J279J266J087J095Q59L24K6
$$ 359251 354749 350886 347933 345132 341712 338311 336449 336652 337931 339197 340284 341379 342238 342562 342588
52433C42588J58J97k27p07n68K79J179J362O40m29j126j178o53M14J785K640K212
$$ 342588 342746 342943 342716 342009 341441 341720 342899 344261 344901 344472 343346 342168 341515 341929 343714 346354 348566
52416C48566R78L12P32J312J293J281K136L434M118M216M709N901O924P108O907
$$ 348566 349544 349856 350588 351900 353193 354474 356610 360044 364162 368378 373087 378988 385912 393020 399927
52401C99927P093P629P706O656M517J813r02l287n089o079o278o115o039n998
$$ 399927 407020 414649 422355 429011 433528 435341 434439 431152 426063 419984 413706 407591 401552 395554
52387C95554n642m956m224l427k288r68o2L40Q00J484J735J246Q99J644L133M243
$$ 395554 389912 384956 380732 377305 375017 374049 373987 374327 375127 376611 378346 379592 380491 382135 385268 389511
52371C89511M548M471M230L631K766K115J797J381N68m36j368k195k783k754j973
$$ 389511 394059 398530 402760 406391 409157 411272 413069 414450 415018 414582 413214 411019 408236 405482 403509
52356D03509q48O2N79Q64J055J204J444J885K286K143J402Q04J154K297L311L730
$$ 403509 402661 402723 403302 404166 405221 406425 407869 409754 412040 414183 415585 416389 417543 419840 423151 426881
52340D26881L946M246M259L787L371L404L425L204L656N450P371P700O869O921
$$ 426881 430827 435073 439332 443119 446490 449894 453319 456523 460179 465629 473000 480700 487569 494490
52326D94490Q370R554R484R371J0332J1372J1021R667Q788Q754Q859Q883R284
$$ 494490 502860 512414 521898 531269 541601 552973 563994 573661 582449 591203 600062 608945 618229
52313F18229J0206J1373J2706J4158J5331J6080J7025J8623K0282K1290K2015
$$ 618229 628435 639808 652514 666672 682003 698083 715108 733731 754013 775303 797318
52302G97318K3172K4410K4832K4464K4043K3553K2287K0329J8691J7856J7166
$$ 797318 820490 844900 869732 894196 918239 941792 964079 984408 1003099 1020955 1038121
52291A038121J5922J4239J2551J1044R852R134Q674P911O581M971L492K391J772
$$ 1038121 1054043 1068282 1080833 1091877 1101729 1110863 1119537 1127448 1134029 1139000 1142492 1144883 1146655
52278A146655J515J181M59l65q35j063j488k043k147j605r42p20r24j147j093
$$ 1146655 1148170 1149351 1149810 1149445 1148610 1147547 1146059 1144016 1141869 1140264 1139322 1138602 1137678 1136531 1135438
52263A135438p41j78O28J825L295M582N520O804R185J2130J4144J4657J4665J5020
$$ 1135438 1134697 1134519 1135147 1136972 1140267 1144849 1150369 1157173 1166358 1178488 1192632 1207289 1221954 1236974
52249A236974J5210J4500J3360J2702J2453J1946J1225J0847J0749J0387R718
$$ 1236974 1252184 1266684 1280044 1292746 1305199 1317145 1328370 1339217 1349966 1360353 1370071
52238A370071R057Q223O807N097L738K661J288k82j358j939k865m548o377p631
$$ 1370071 1379128 1387351 1394158 1399255 1402993 1405654 1406942 1406660 1405302 1403363 1400498 1395950 1389573 1381942
52224A381942q208q378q453q853r825j0944j1423j1068j0413r967r754r639r468
$$ 1381942 1373734 1365356 1356903 1348050 1338225 1327281 1315858 1304790 1294377 1284410 1274656 1265017 1255549
52211A255549q985q031o919o059n338m307k918j608p44l57k37J07J258L191N067
$$ 1255549 1246564 1238533 1231614 1225555 1220217 1215910 1212992 1211384 1210640 1210283 1210046 1210153 1211411 1214602 1219669
52196A219669O237O969P723Q156P647O373M969L551J852O0j400k602l851m867
$$ 1219669 1225906 1232875 1240598 1248754 1256401 1262774 1267743 1271294 1273146 1273206 1271806 1269204 1265353 1260486
52182A260486n225n225n420n584n185m624m741n303n197m217l397l419l779l835
$$ 1260486 1255261 1250036 1244616 1239032 1233847 1229223 1224482 1219179 1213982 1209765 1206368 1202949 1199170 1195335
52168A195335l586l080k099p87K13O17Q18J064J118Q98P38P37N64J42j97l50n88
$$ 1195335 1191749 1188669 1186570 1185783 1185996 1186613 1187431 1188495 1189613 1190511 1191249 1191986 1192550 1192692 1192495 1192145 1191557
52151A191557q90q68m49N7O15J421K172K240J651J076P54L23k14l77j92k13l19
$$ 1191557 1190667 1189799 1189350 1189407 1190022 1191443 1193615 1195855 1197506 1198582 1199336 1199659 1199445 1199068 1198876 1198663 1198344
52134A198344L97K092L651M263M581N537O921P908Q400R052J0294J1951J3497
$$ 1198344 1198741 1200833 1204484 1208747 1213328 1218865 1225786 1233694 1242094 1251146 1261440 1273391 1286888
$$ [...]
##END NTUPLES=NMR SPECTRUM
##END=
