##TITLE=AC1649_NBEAH14350_8531133_033N9jJmXH
##JCAMPDX= 6.0         $$ Bruker NMR JCAMP-DX V2.0
##DATA TYPE= NMR SPECTRUM
##DATA CLASS= NTUPLES
##ORIGIN= BRUKER
##OWNER= Administrator
$$ 1.72 TOPSPIN		Version 2.1
$$ 2015-08-07 23:28:03.156 -0700  Administrator@X
$$ Compression mode = diff/dup
##.OBSERVE FREQUENCY= 400.02188249412
##.OBSERVE NUCLEUS= ^1H
##.ACQUISITION MODE= SIMULTANEOUS (DQD)
##.ACQUISITION SCHEME= undefined
##.AVERAGES= 8
##.DIGITISER RES= 22
##SPECTROMETER/DATA SYSTEM= spect
##.PULSE SEQUENCE= zg30
##.SOLVENT NAME= COFFEE_meoh
##.SHIFT REFERENCE= INTERNAL, COFFEE_meoh, 1, 14.98509
##AUDIT TRAIL= $$ (NUMBER, WHEN, WHO, WHERE, PROCESS, VERSION, WHAT)
$$ ##TITLE= Audit trail, TOPSPIN		Version 2.1
$$ ##JCAMPDX= 5.01
$$ ##ORIGIN= Bruker BioSpin GmbH
$$ ##OWNER= Administrator
$$ $$ E:\/data/COFFEE/nmr/AC1649_NBEAH14350_8531133_033N9jJmXH/20/pdata/1/auditp.txt
$$ ##AUDIT TRAIL=  $$ (NUMBER, WHEN, WHO, WHERE, PROCESS, VERSION, WHAT)
(   1,<2015-08-07 23:27:55.828 -0700>,<Administrator>,<X>,<go>,<TOPSPIN 2.1>,
      <created by zg
	started at 2015-08-07 23:26:49.922 -0700,
	POWCHK enabled, PULCHK disabled,
       configuration hash MD5:
       21 0F 79 D6 B3 7B B4 F6 88 20 88 DB 03 48 BD 9F
       data hash MD5: 64K
       76 85 8E FA 2A F2 27 30 BA 95 46 76 6D A8 21 96>)
(   2,<2015-08-07 23:27:59.016 -0700>,<Administrator>,<X>,<proc1d>,<TOPSPIN 2.1>,
      <Start of raw data processing
       efp LB = 0 FT_mod = 6 PKNL = 1 PHC0 = 0 PHC1 = 0 SI = 32K 
       data hash MD5: 32K
       B7 E0 F6 98 3E F6 47 63 E0 F2 2B F2 D1 97 07 2E>)
(   3,<2015-08-07 23:27:59.297 -0700>,<Administrator>,<X>,<proc1d>,<TOPSPIN 2.1>,
      <pk PHC0 = 91.02173 PHC1 = 0 
       data hash MD5: 32K
       63 C1 EC 74 DB 7A C7 43 8E B1 57 BC EF 3D 65 0F>)
(   4,<2015-08-07 23:27:59.406 -0700>,<Administrator>,<X>,<proc1d>,<TOPSPIN 2.1>,
      <abs ABSG = 1 
       data hash MD5: 32K
       19 B7 5C B5 42 E4 6D 41 FB 52 92 A9 5D 20 2D 8B>)
(   5,<2015-08-07 23:27:59.469 -0700>,<Administrator>,<X>,<proc1d>,<TOPSPIN 2.1>,
      <abs ABSG = 2 
       data hash MD5: 32K
       F6 98 8E DD 0C CB 30 83 C0 8D CD 4F 9C E2 E7 91>)
(   6,<2015-08-07 23:27:59.531 -0700>,<Administrator>,<X>,<proc1d>,<TOPSPIN 2.1>,
      <abs ABSG = 3 
       data hash MD5: 32K
       52 09 1F C0 79 36 8D F5 E5 FF DC C8 59 C3 9B 21>)
(   7,<2015-08-07 23:27:59.625 -0700>,<Administrator>,<X>,<proc1d>,<TOPSPIN 2.1>,
      <abs ABSG = 4 
       data hash MD5: 32K
       54 48 B3 4C 97 F6 56 54 5F 3B 15 93 EC 2C 41 E2>)
(   8,<2015-08-07 23:27:59.688 -0700>,<Administrator>,<X>,<proc1d>,<TOPSPIN 2.1>,
      <abs ABSG = 5 
       data hash MD5: 32K
       8F 48 5F B3 4D 60 C8 25 9C CF E7 87 4A C3 90 F1>)
$$ ##END=
$$ 
$$ $$ hash MD5
$$ $$ 8D 80 B2 66 5E 39 E7 14 D8 9A 86 D8 00 32 F4 7F
##$RELAX= 
##$RELAX= 
##$RELAX= 
##$RELAX= 
##$RELAX= 
##$RELAX= 
##$RELAX= 
$$ Bruker specific parameters
$$ --------------------------
##$DU= <E:\>
##$EXPNO= 20
##$NAME= <AC1649_NBEAH14350_8531133_033N9jJmXH>
$$ [...]
150 150 150 150 150 150 150 150
##$TP07= 0
##$TPNAME0= <>
##$TPNAME1= <>
##$TPNAME2= <>
##$TPNAME3= <>
##$TPNAME4= <>
##$TPNAME5= <>
##$TPNAME6= <>
##$TPNAME7= <>
##$TPOAL= (0..7)
0.5 0.5 0.5 0.5 0.5 0.5 0.5 0.5
##$TPOFFS= (0..7)
0 0 0 0 0 0 0 0
##$TUNHIN= 0
##$TUNHOUT= 0
##$TUNXOUT= 0
##$USERA1= <user>
##$USERA2= <user>
##$USERA3= <user>
##$USERA4= <user>
##$USERA5= <user>
##$V9= 5
##$VALIST= <valist>
##$VCLIST= <CCCCCCCCCCCCCCC>
##$VD= 0
##$VDLIST= <DDDDDDDDDDDDDDD>
##$VPLIST= <PPPPPPPPPPPPPPP>
##$VTLIST= <TTTTTTTTTTTTTTT>
##$WBST= 2048
##$WBSW= 25
##$XGAIN= (0..3)
0 0 0 0
##$XL= 0
##$YL= 0
##$YMAX_a= 576367
##$YMIN_a= -493645
##$ZGOPTNS= <>
##$ZL1= 120
##$ZL2= 120
##$ZL3= 120
##$ZL4= 120
##$ABSF1= 14.98509
##$ABSF2= -5.573092
##$ABSG= 5
##$ABSL= 3
##$ALPHA= 0
##$AQORDER= 0
##$ASSFAC= 0
##$ASSFACI= 0
##$ASSFACX= 0
##$ASSWID= 0
##$AUNMP= <proc_prof1d_extract_pilot.lims>
##$AXLEFT= 0
##$AXNAME= <>
##$AXNUC= <1H>
##$AXRIGHT= 0
##$AXTYPE= 0
##$AXUNIT= <>
##$AZFE= 0.1
##$AZFW= 0.1
##$BCFW= 0
##$BC_mod= 0
##$BYTORDP= 0
##$COROFFS= 0
##$CY= 15
##$DATMOD= 1
##$DC= 0
##$DFILT= <>
##$DTYPP= 0
##$F1P= 0
##$F2P= 0
##$FCOR= 0.5
##$FTSIZE= 32768
##$FT_mod= 6
##$GAMMA= 0
##$GB= 0
##$INTBC= 1
##$INTSCL= 1
##$ISEN= 128
##$LB= 0
##$LEV0= 0
##$LPBIN= 0
##$MAXI= 10000
##$MC2= 0
##$MEAN= 0
##$ME_mod= 0
##$MI= 0
##$NCOEF= 0
##$NC_proc= -8
##$NLEV= 6
##$NOISF1= 0
##$NOISF2= 0
##$NSP= 0
##$NTH_PI= 0
##$NZP= 0
##$OFFSET= 14.98509
##$PC= 1
##$PHC0= 91.02173
##$PHC1= 0
##$PH_mod= 1
##$PKNL= yes
##$PPARMOD= 0
##$PPDIAG= 0
##$PPIPTYP= 0
##$PPMPNUM= 2147483647
##$PPRESOL= 1
##$PSCAL= 4
##$PSIGN= 0
##$PYNMP= <proc.py>
##$REVERSE= no
##$SF= 400.02
##$SI= 32768
##$SIGF1= 0
##$SIGF2= 0
##$SINO= 400
##$SIOLD= 32768
##$SPECTYP= <>
##$SREGLST= <1H.CDCl3>
##$SSB= 0
##$STSI= 32768
##$STSR= 0
##$SW_p= 8223.68421052631
##$SYMM= 0
##$S_DEV= 0
##$TDeff= 65536
##$TDoff= 0
##$TI= <>
##$TILT= no
##$TM1= 0
##$TM2= 0
##$TOPLEV= 0
##$USERP1= <user>
##$USERP2= <user>
##$USERP3= <user>
##$USERP4= <user>
##$USERP5= <user>
##$WDW= 1
##$XDIM= 32768
##$YMAX_p= 428001571
##$YMIN_p= -723785
##$CURPLOT= <Network HP LaserJet P1505>
##$CURPRIN= <$Network HP LaserJet P1505>
##$DFORMAT= <normdp>
##$LAYOUT= <+/1D_H.xwp>
##$LFORMAT= <normlp>
##$PFORMAT= <normpl>
##$SURQMSG= 1
$$ End of Bruker specific parameters
$$ ---------------------------------
##NTUPLES= NMR SPECTRUM
##VAR_NAME=  FREQUENCY,     SPECTRUM/REAL,   SPECTRUM/IMAG
##SYMBOL=    X,             R,               I
##VAR_TYPE=  INDEPENDENT,   DEPENDENT,       DEPENDENT
##VAR_FORM=  AFFN,          ASDF,            ASDF
##VAR_DIM=   32768,         32768,           32768
##UNITS=     HZ,            ARBITRARY UNITS, ARBITRARY UNITS
##FACTOR=    0.250966925370066, 1,           1
##FIRST=     8223.43324360094, -33265,       -192796
##LAST=      0,             160955,          -310181
##MIN=       0,             -723785,         0
##MAX=       8223.43324360094, 428001571,    0
$$ Real data points
##PAGE= N=1
##DATA TABLE= (X++(R..R)), XYDATA
$$ [...]
19555b21554A21102b58175i1354A35095A2851d50339A23339a96087H365m039g8903
$$ -221554 121102 -258175 -91354 135095 12851 -450339 123339 -196087 8365 4326 -78903
19543a40927B4693b01823N6755B4952c544A53320b5296A03090i3663R123j09647
$$ -140927 24693 -201823 -145068 24952 -3544 153320 -25296 103090 -93663 -84540 -194187
19532a94187M7855l1775A03589J20282i1991B3590b81841A23518f7511o2061j54240
$$ -194187 -146332 -178107 103589 223871 -91991 23590 -281841 123518 -67511 -129572 -283812
19521b83812Q2154F3531c8681A14222b36661A18993a59309f7061D3767b18717
$$ -283812 -201658 63531 -38681 114222 -236661 118993 -159309 -67061 43767 -218717
19510B07951A4913L1305c9176r1037E2830a98530A95122b567A3710L4443A7296
$$ 207951 14913 46218 -39176 -130213 52830 -198530 195122 -2567 13710 48153 17296
19498a62892n7564g893j57346E7700J79220q7557i5953q9988E1099K4203A3606
$$ -162892 -220456 -7893 -165239 57700 236920 149363 -95953 -185941 51099 75302 13606
19486c48164A4513O3296M6344M0840b52912d0095E2305d23600e1954D1503J552
$$ -348164 14513 77809 124153 164993 -252912 -40095 52305 -423600 -51954 41503 43055
19475D3055b08263k37733A47395j9657a37459E1802c0987l31266J60009J8973
$$ 43055 -208263 -445996 147395 127738 -137459 51802 -30987 -362253 -202244 -183271
19465a83271g797l74784d9436J0014j09361c0198m5338A25040a06670k47927e435
$$ -183271 -7797 -382581 -49436 -39422 -148783 -30198 -75536 125040 -106670 -354597 -5435
19453a05433B4049a09903A35528J3525b06124a390l5187I341b27174j95679C34927
$$ -105433 24049 -109903 135528 149053 -206124 -1390 -36577 9341 -227174 -422853 334927
19441E29h0617b3839q61H7533j728N3318a80865F4065d5209a6235k28967F5295
$$ 529 -80617 -23839 -24700 87533 85805 139123 -180865 64065 -45209 -16235 -245202 65295
19428a49255M0041j25927A01617b74911A5729L7922a33597n0875L4794d3647k52777
$$ -149255 -109214 -235141 101617 -274911 15729 53651 -133597 -184472 -149678 -43647 -296424
19417b96424a41098e545A8834J8322J24061D4419b17525k41161f2243j73900L1688
$$ -296424 -141098 -5545 18834 37156 161217 44419 -217525 -458686 -62243 -236143 -204455
19406b04455p905O4441M8141J2715k60797A295b43814h6976J0680j25382i6018
$$ -204455 -212360 -147919 -99778 -87063 -347860 1295 -243814 -86976 -76296 -201678 -96018
19394b3521n426j07640k0434f3947A31288a24088D6285R4822f074m1560j87371
$$ -23521 -28947 -136587 -157021 -63947 131288 -124088 46285 141107 -6074 -47634 -235005
19383b35005A45885m8098c5219A180h4741F145f5241j10697j82715B83589e5533
$$ -235005 145885 97787 -35219 1180 -84741 6145 -65241 -175938 -358653 283589 -55533
19371a20813A48266D0591a97446g1755j25392Q307A72596I057c18707B44274a40746
$$ -120813 148266 40591 -197446 -71755 -197147 -188840 172596 9057 -318707 244274 -140746
19359A84332d4493G3680Q2617f8564j01530F0735J8839G870B029g7190b1086m3971
$$ 184332 -44493 73680 156297 -68564 -170094 60735 79574 7870 2029 -77190 -21086 -65057
19347f5057B38356f412E2102a83127c976m2152k97590a2935A128c93430A79017
$$ -65057 238356 -6412 52102 -183127 -3976 -46128 -343718 -12935 1128 -393430 179017
19335a47349c0001D1635a30820B12486G3993K9304p663L4661e0540B7939K22799
$$ -147349 -30001 41635 -130820 212486 73993 103297 95634 130295 -50540 27939 250738
19324B50738a89164J1144m526L6335B10262b8375A8855i1110a1038k11824P7199
$$ 250738 -189164 -178020 -182546 -146211 210262 -28375 18855 -91110 -11038 -222862 -145663
19313a45663E8159a13055j84609r4643e7145H9011E323i2803B33185b79482R7944
$$ -145663 58159 -113055 -297664 -392307 -57145 89011 5323 -92803 233185 -279482 -181538
19302a81538A30228J10236i0429A6215J37441f2789C4578a45978l830b0135E7131
$$ -181538 130228 240464 -90429 16215 153656 -62789 34578 -145978 -149808 -20135 57131
19290i6721H3084j5618k0007i9136F4587b75186J04350j14086B8738a12791j83642
$$ -96721 83084 67466 47459 -99136 64587 -275186 -170836 -284922 28738 -112791 -296433
19279b96433B62306c14058f103A66903l2789E2481J51605g3336B7404R241c6698
$$ -296433 262306 -314058 -6103 166903 134114 52481 204086 -73336 27404 36645 -36698
19267F1056a04733j96347F9741Q9541L7186a62061M0771J1102j05924g2088j34255
$$ 61056 -104733 -301080 69741 159282 196468 -162061 -121290 -110188 -216112 -72088 -206343
19256b06343J0305B70904a23338k99221R7434A40650a36853r3807R2556d2939
$$ -206343 -196038 270904 -123338 -422559 -325125 140650 -136853 -230660 -138104 -42939
19245A7540J4238b35411f3824Q301j3053q3646B13989a67173C351a94537J7219
$$ 17540 31778 -235411 -63824 -55523 -68576 -152222 213989 -167173 3351 -194537 -177318
19234a77318a4346A9035Q2906b98526C1310O2287b75558j92474h2215k51052A56931
$$ -177318 -14346 19035 101941 -298526 31310 93597 -275558 -468032 -82215 -333267 156931
19222A3149O1004c06175A55383d57625a82254O2808A60174Q0407b00266L9662
$$ 13149 74153 -306175 155383 -457625 -182254 -119446 160174 240581 -200266 -160604
19212a60604A04913b22132b3214k67652m7008C1828G140d3399A76723b18376E440
$$ -160604 104913 -222132 -23214 -290866 -337874 31828 7140 -43399 176723 -218376 5440
19200e1268r4155n2484j46583b0056l64499G996d9164m56090B7453O2281h2668
$$ -51268 -145423 -197907 -344490 -20056 -384555 7996 -49164 -505254 27453 89734 -82668
19188a19009B8688J3033b10661J01922j64271B79234a53669C09940I4972k7447
$$ -119009 28688 41721 -210661 -108739 -273010 279234 -153669 309940 94972 67525
19178F7525f3337q8751G4862J21962j7767a63466I6829a7422m55980h1123A9428
$$ 67525 -63337 -152088 74862 196824 179057 -163466 96829 -17422 -473402 -81123 19428
19166A79772F5358a77045A86053a04115j56143I1547a60133L4295G0804c03790
$$ 179772 65358 -177045 186053 -104115 -260258 91547 -160133 -125838 70804 -303790
19155b85602a39289k00611J61369k4404M5569Q163A83878b38066d1183j27382
$$ -285602 -139289 -339900 -178531 -202935 -157366 -149203 183878 -238066 -41183 -168565
19145a68565h1362l35884A81049c66019J73631P7446D7128M9934J39665e449j31902
$$ -168565 -81362 -417246 181049 -366019 -192388 -114942 47128 97062 236727 -5449 -137351
19134a37351r7158L465F018a94200e5860j30323L5846b9714o350N044q6417J0319
$$ -137351 -234509 -231044 6018 -194200 -55860 -186183 -150337 -29714 -36064 -31020 -117437 -107118
19122a07118N0062B65096j15317L0071D5284b0679m55036C24918j22426D1855
$$ -107118 -57056 265096 149779 179850 45284 -20679 -475715 324918 202492 41855
19111c7035j12647p8947A06484a30351e8122k10778m4374C39328a387B4033K20418
$$ -37035 -149682 -228629 106484 -130351 -58122 -268900 -313274 339328 -1387 24033 244451
19100B44451a08279A32815a01522M018E3077a35762k9822j46438G9284a37808
$$ 244451 -108279 132815 -101522 -97504 53077 -135762 -165584 -312022 79284 -137808
19089d9658E7394J14310d39896B4803a9738j10930j44496a23009j32365i9008
$$ -49658 57394 171704 -439896 24803 -19738 -130668 -275164 -123009 -255374 -99008
19078a46865I8975d97410h1676l35508d3912k3664q0453P1969j41829c0179j34657
$$ -146865 98975 -497410 -81676 -417184 -43912 -67576 -148029 -76060 -217889 -30179 -164836
19067a64836q1026k761a17294D5584J93124j9084r308g1036j25472e642r9977
$$ -164836 -245862 -248623 -117294 45584 238708 219624 210316 -71036 -196508 -5642 -105619
19056a05619k61131B19849a38308H2560a75565B4857N0014i6993j05748D16600
$$ -105619 -366750 219849 -138308 82560 -175565 24857 74871 -96993 -202741 416600
19045A37694b09543I893c40727A29760E2105L8605e1423B4158J3848G606h4309
$$ 137694 -209543 9893 -340727 129760 52105 90710 -51423 24158 38006 7606 -84309
19033A42392c69500g5153A2925P8115l3846J03083d4442A7421K54165p3870n0805
$$ 142392 -369500 -75153 12925 91040 57194 160277 -44442 17421 271586 197716 146911
19022A46911h957F9211J02744b13573D1763J3193a38085k2529n2398D7881L23845
$$ 146911 -8957 69211 171955 -213573 41763 54956 -138085 -160614 -213012 47881 371726
19011C71726E918J11719P8236a23799d1794m5595m5751j63999n053P4410A68809
$$ 371726 5918 117637 195873 -123799 -41794 -87389 -133140 -297139 -302192 -227782 168809
18999a22850A80569F1087b93194B85236c20200A64211A0412M8726K07522c19057
$$ -122850 180569 61087 -293194 285236 -320200 164211 10412 59138 266660 -319057
18988A58286a11490C1478a59337f4230k0691o6218p5471A4887M6683f9289G9248
$$ 158286 -111490 31478 -159337 -64230 -84921 -151139 -226610 14887 61570 -69289 79248
18976A54777n6528a44935A21444b12933L1199B3866a04957E9028f4984j52643
$$ 154777 98249 -144935 121444 -212933 -181734 23866 -104957 59028 -64984 -217627
18966b17627j54518B60334a70002j81647a1331B47928A14976E0011J74749a82974
$$ -217627 -372145 260334 -170002 -351649 -11331 247928 114976 50011 224760 -182974
18955a73638p4479J1717f3707j8722k08236J07781C13708b12976B21448b1938
$$ -173638 -248117 -236400 -63707 -82429 -290665 -182884 313708 -212976 221448 -21938
18944d38905A034c8821j3765q351D7290A4743J82579A057L61404a16558j90741
$$ -438905 1034 -38821 -52586 -60937 47290 14743 197322 1057 362461 -116558 -307299
18933c07299Q7734C77624i7059A57720Q0893j03069a7922E8693Q0389e7764C78714
$$ -307299 -219565 377624 -97059 157720 238613 135544 -17922 58693 139082 -57764 378714
18921I0662k9834b46679l1668a4064k00904P4797j48382a34366j28983H5501k8338
$$ 90662 60828 -246679 -278347 -14064 -214968 -140171 -288553 -134366 -263349 85501 57163
18910E7163d14044A65718c6336B36204B5175K77218a22091Q300G5567a72838l6515
$$ 57163 -414044 165718 -36336 236204 25175 302393 -122091 -113791 75567 -172838 -209353
18899b09353C14064b7001F0910L8746a00896d5357A71547O6277d2834k18945d0583
$$ -209353 314064 -27001 60910 99656 -100896 -45357 171547 237824 -42834 -261779 -40583
18887h7632o8584q5535f5925q8615C26860A43032c67580m9302J85624l213B15780
$$ -87632 -156216 -241751 -65925 -154540 326860 143032 -367580 -416882 -231258 -234471 215780
18875a39524A51816d0892G1496a37742l6891N4270j15404j35308B6406J675A2428
$$ -139524 151816 -40892 71496 -137742 -174633 -120363 -235767 -371075 26406 28081 12428
18863B1169a5289B35406a91900j4463k11337R5704a41862A4449d766A44088B3344
$$ 21169 -15289 235406 -191900 -206363 -417700 -321996 -141862 14449 -4766 144088 23344
18851c41422a23052J3151B15697b08949f8182c1791j96239g848j99013e0130l6340
$$ -341422 -123052 -109901 215697 -208949 -68182 -31791 -228030 -7848 -206861 -50130 -86470
18840h6470C118a12590p3602A23865a36487K3713k61179A3803c1947i572H053
$$ -86470 3118 -112590 -186192 123865 -136487 -112774 -373953 13803 -31947 -9572 8053
18828B90794m6759b92212d0480H5755a36861j7139A73450a02437B96b822l8371
$$ 290794 244035 -292212 -40480 85755 -136861 -154000 173450 -102437 296 -2822 -41193
18817d1193j72023F9834M0033b39083A52814M347F9405b80368g7703A28003a09707
$$ -41193 -213216 69834 109867 -239083 152814 157161 69405 -280368 -77703 128003 -109707
18805a19129A52480a38071A3025M49345i0656A54507a52164k55746C21591a59132
$$ -119129 152480 -138071 13025 462370 -90656 154507 -152164 -407910 321591 -159132
18794h4460D5032J34857a77108H3421A6543c30078D68045A83068a66389j05484
$$ -84460 45032 179889 -177108 83421 16543 -330078 468045 183068 -166389 -271873
18784b71873F5090a36688p9842D6411L5615a11364A89115a50173A34583d2482
$$ -271873 65090 -136688 -216530 46411 82026 -111364 189115 -150173 134583 -42482
18773I224a78805A6397Q8377C7794b15116A14212a55143N6940b3239A04986a50315
$$ 9224 -178805 16397 104774 37794 -215116 114212 -155143 -98203 -23239 104986 -150315
18761C94445A5766e2142k10095B18139c43035k8410a6871E7363b54263e5033j93056
$$ 394445 15766 -52142 -262237 218139 -343035 -371445 -16871 57363 -254263 -55033 -248089
18750b48089f9817B5949e7888j98583R2608G5301a00829n086F297b20624e5446
$$ -248089 -69817 25949 -57888 -256471 -163863 75301 -100829 -105915 6297 -220624 -55446
18738b11102C22118A14960a25607G530h0350L3236m05301b5691j29530D0922J72047
$$ -211102 322118 114960 -125607 7530 -80350 -47114 -452415 -25691 -155221 40922 212969
18727B12969r8576i614E4803b64741E9097a51526B4023d11455g8396L676l07172
$$ 212969 114393 -9614 54803 -264741 59097 -151526 24023 -411455 -78396 -74720 -381892
18716c81892d542A10902k6823A8752K267c38972a52330A33109B1924J23655B9473
$$ -381892 -4542 110902 84079 18752 21019 -338972 -152330 133109 21924 145579 29473
18704b52022N5630K347A18064n2713h140j93234b4144A53642n5333K69958A21655
$$ -252022 -196392 -194045 118064 65351 -8140 -201374 -24144 153642 98309 368267 121655
18692D59244a69465f7511m2068K6412a2915I2473b958l16832J07752D1234L8748
$$ 459244 -169465 -67511 -109579 -83167 -12915 92473 -2958 -319790 -212038 41234 79982
18681G9982f9393l0992B05646g3008a8395j02508j36295A01526b97072I9529h9707
$$ 79982 -69393 -100385 205646 -73008 -18395 -120903 -257198 101526 -297072 99529 -89707
18669A39432b4989q0381M8529k1248j61503C25388j34975O315a22565E5542O8546
$$ 139432 -24989 -105370 -56841 -78089 -239592 325388 190413 196728 -122565 55542 124088
18658A24088m8731A6200f7165B7932a80264O0086n2068P5324k4892J892l092D7029
$$ 124088 75357 16200 -67165 27932 -180264 -120178 -172246 -96922 -121814 -119922 -123014 47029
18645A1994b09517j8370j93371a24054j22592l2864l44327G2458a1960B14242
$$ 11994 -209517 -227887 -421258 -124054 -246646 -279510 -623837 72458 -11960 214242
18634A61077d06446G024M2393i2143B7344b38576R8076k890j32943a30883j59482
$$ 161077 -406446 7024 49417 -92143 27344 -238576 -140500 -143390 -276333 -130883 -290365
18623b90365E7754K06879b73763l8541B752a76347j11194A16356B6556K1486a01286
$$ -290365 57754 264633 -273763 -312304 2752 -176347 -287541 116356 26556 48042 -101286
18611b57659A4720b6783G2129K03882a26424j22953a02586F9338k8543g8199A0690
$$ -257659 14720 -26783 72129 276011 -126424 -249377 -102586 69338 40795 -78199 10690
18599e647q4006B15376r5185n0400b87154B2230c2691j48539d0338A42817D0256
$$ -5647 -89653 215376 120191 69791 -287154 22230 -32691 -181230 -40338 142817 40256
18587a88208r2004D15657c77877f5822q0016A44957b07372A38295B2513a73220
$$ -188208 -280212 415657 -377877 -65822 -145838 144957 -207372 138295 22513 -173220
18576A84699k7123h053A50343K1890a45702q143A55345f1097j78489j12163B58714
$$ 184699 157576 -8053 150343 172233 -145702 -153845 155345 -61097 -239586 -351749 258714
18564G5978L0014a83984b7635l32171I0813J18631C0017g5499o3457k29683D2413
$$ 75978 105992 -183984 -27635 -359806 90813 209444 30017 -75499 -138956 -368639 42413
18552d9224A34135b01031B37797I417J76440a58998n9329M100I568c19872j6565
$$ -49224 134135 -201031 237797 9417 185857 -158998 -218327 -214227 9568 -319872 -336437
18541c36437B11130B7732a60703A81314L0647m1858b98567a09560N1610k81496
$$ -336437 211130 27732 -160703 181314 211961 170103 -298567 -109560 -57950 -339446
18531c39446I0187k5025h5548a5029A12544a82629B4581c30604f7449q5337j27646
$$ -339446 90187 65162 -85548 -15029 112544 -182629 24581 -330604 -67449 -152786 -280432
18520b80432A01133a02096j21167j4820j31379J75797e2629j09609j13882B94229
$$ -280432 101133 -102096 -223263 -238083 -369462 -193665 -52629 -162238 -276120 294229
18509i6893A34840B4847a07275A19551l2660a92161F2809a49477k96859B19685
$$ -96893 134840 24847 -107275 119551 86891 -192161 62809 -149477 -446336 219685
18498H5105e1951A09988a07235B93307A2816a29402l2570N9638F2050b1149k62299
$$ 85105 -51951 109988 -107235 293307 12816 -129402 -161972 -102334 62050 -21149 -283448
18487b83448D5604i9968j46518N1106N8154H0967b35435I7044a71329A69171p4607
$$ -283448 45604 -99968 -246486 -195380 -137226 80967 -235435 97044 -171329 169171 94564
18476I4564D026b99803N1532A5436N1857c3980j45999A02420J37545B9619M7297
$$ 94564 4026 -299803 -248271 15436 67293 -33980 -179979 102420 239965 29619 76916
18465G6916i8199a0379p7271A83609N7553a07774C35295c1395J0205j73477A74021
$$ 76916 -98199 -10379 -87650 183609 241162 -107774 335295 -31395 -21190 -194667 174021
18453A40939M9031h1386l2022B31630n9349A2793b47248a05314P460a8797B44294
$$ 140939 189970 -81386 -113408 231630 172281 12793 -247248 -105314 -97854 -18797 244294
18441i7882j7841j92858H9893b15269N1862b0954a0200l959n1230n7314b9160
$$ -97882 -115723 -308581 89893 -215269 -163407 -20954 -10200 -14159 -65389 -122703 -29160
18429B40125G7264j4569b08117j31616A2725P3843b58546d0194j65040j40641
$$ 240125 77264 62695 -208117 -339733 12725 86568 -258546 -40194 -205234 -345875
18419c45875e987k8768o3672C7484J8238a63496l33506G5786N572b86010A45097
$$ -345875 -5987 -34755 -98427 37484 55722 -163496 -497002 75786 81358 -286010 145097
18407B7353a69012p5055G8715b0454A55051b57350A88815l8242b70764m2047f1029
$$ 27353 -169012 -244067 78715 -20454 155051 -257350 188815 150573 -270764 -312811 -61029
18395i7483C9600J22256b13236B20500a450j73843P9313a3962B2300a07932G532
$$ -97483 39600 161856 -213236 220500 -1450 -175293 -95980 -13962 22300 -107932 7532
18383A17730c76679G3859C5421c3363B02934M7688a51771J5540f4071I1866h1078
$$ 117730 -376679 73859 35421 -33363 202934 250622 -151771 -136231 -64071 91866 -81078
18371A46870i2654G956J21653i3206a8090j12455p9684a04334e1266k44238B84727
$$ 146870 -92654 7956 129609 -93206 -18090 -130545 -210229 -104334 -51266 -295504 284727
18359a72505N7230a2770l986A79944b58403i4028A56437a28120C8148a27864F9260
$$ -172505 -115275 -12770 -16756 179944 -258403 -94028 156437 -128120 38148 -127864 69260
18347b20187I358a1873B1595b5394E1916b66109A88086n6632B9566a44858O1020
$$ -220187 9358 -11873 21595 -25394 51916 -266109 188086 131454 29566 -144858 -83838
18336h3838d820A06200d6299C48870H0983b87608M1960D6955h841j52801A28096
$$ -83838 -4820 106200 -46299 348870 80983 -287608 -245648 46955 -8841 -161642 128096
18324b4462D02216a47003r064C08605j22796c35639a27242r0652B14816i4180
$$ -24462 402216 -147003 -156067 308605 185809 -335639 -127242 -217894 214816 -94180
18313b22347M4697G7345J75975h2196A38368m3165b32308h4667C8225a8105n3141
$$ -222347 -177650 77345 253320 -82196 138368 95203 -232308 -84667 38225 -18105 -71246
18302g1246j33366K7713K2692n8551a922j03887L5743b2967Q058C4571N1322d7021
$$ -71246 -204612 -176899 -154207 -212758 -1922 -105809 -70066 -22967 -14909 34571 85893 -47021
18289A10056b08647A9348N9871c10213f5336F3001L5746i9546H6671f1955k66051
$$ 110056 -208647 19348 79219 -310213 -65336 63001 98747 -99546 86671 -61955 -328006
18278c28006A50609a61969j26629F166a26665B65256i7674j45052H5787b8472
$$ -328006 150609 -161969 -288598 6166 -126665 265256 -97674 -242726 85787 -28472
18267B03734d0942C2389H386b43433B38422B2629f8423B56574A1619f3566m4373
$$ 203734 -40942 32389 8386 -243433 238422 22629 -68423 256574 11619 -63566 -107939
18256a07939n5411A2368J9133a85486e6562j0928k01510q8253A20355J45228H6909
$$ -107939 -163350 12368 31501 -185486 -56562 -67490 -269000 -357253 120355 265583 86909
18244d5768j11461j41605b7399p4461A4793M47670b03636h7343H9570b56594j18816
$$ -45768 -157229 -298834 -27399 -101860 14793 462463 -203636 -87343 89570 -256594 -375410
18233c75410f4480l01615b9247F4857a49684q2434A76537a38737e9670k00754
$$ -375410 -64480 -366095 -29247 64857 -149684 -232118 176537 -138737 -59670 -260424
18223b60424A84088P1077b50146A3197a04605k3977I1735c44369A25221b43275
$$ -260424 184088 255165 -250146 13197 -104605 -128582 91735 -344369 125221 -243275
18212A88067D4065E598M8593J80565A7862L932f3378j21829k5534D8026B0867
$$ 188067 44065 5598 54191 234756 17862 21794 -63378 -185207 -210741 48026 20867
18200b18596a05771L1317A60619c39320E5134B2478b29951C6790Q0545b16665
$$ -218596 -105771 -74454 160619 -339320 55134 22478 -229951 36790 117335 -216665
18189C708L73485h9713B4409J23498a00583k17461I3390a24224l83j3155O442
$$ 3708 377193 -89713 24409 147907 -100583 -318044 93390 -124224 -124607 -137762 -131320
18178a31320I3044i4421C7496b13534q507A73582j7650b41701A5942J011a88468
$$ -131320 93044 -94421 37496 -213534 -222041 173582 155932 -241701 15942 16953 -188468
18166f4376I177i0151H7296h4761L7342k23607a03618p988A6115b31574f8689
$$ -64376 9177 -90151 87296 -84761 -47419 -271026 -103618 -111606 16115 -231574 -68689
18154B13407b26619B47402B6904L91869C5279P0244B1215a40220k57616a50514
$$ 213407 -226619 247402 26904 418773 35279 105523 21215 -140220 -397836 -150514
18143I0331A7108K7456b1456G9222a8456l9684A06338C0767J44575N8660P0311
$$ 90331 17108 44564 -21456 79222 -18456 -58140 106338 30767 175342 234002 304313
18132C04313a83258M0398D5274i7645E1923J25444d3873j62894E8158O5570a90326
$$ 304313 -183258 -142860 45274 -97645 51923 177367 -43873 -206767 58158 123728 -190326
18120I8501h4954A02835i2061a1750E181J72068d17470a73231F109a18444o1230
$$ 98501 -84954 102835 -92061 -11750 5181 177249 -417470 -173231 6109 -118444 -179674
18109a79674q9149J32780j57010E096P5553b04774g4152k86231H7388M7905c95833
$$ -179674 -268823 -136043 -293053 5096 80649 -204774 -74152 -360383 87388 135293 -395833
18097a5177m2048j13488D584J11827c4494C24550h5789I0662a11916M6803j11264
$$ -15177 -57225 -170713 4584 116411 -34494 324550 -85789 90662 -111916 -65113 -176377
18086a76377c744G0648k9654f5097l51971a21778e0770E5083j0429A1842b77377
$$ -176377 -3744 70648 40994 -65097 -417068 -121778 -50770 55083 44654 11842 -277377
18074E3469O4250a45644N0505j27530L0236I602M946a40402B54707a42995C269
$$ 53469 117719 -145644 -95139 -222669 -192433 9602 14548 -140402 254707 -142995 3269
18062a38882a9708o4073a4380A57443b18522c192A78766c20653B3831J97726b22630
$$ -138882 -19708 -83781 -14380 157443 -218522 -3192 178766 -320653 23831 221557 -222630
18050a00540k04761L4969h1757H5301M0428m0304J72887d7566K2711j02752r6474
$$ -100540 -305301 -270332 -81757 85301 125729 85425 258312 -47566 -24855 -127607 -224081
18039b24081E4367n653a88762B6907e8751R253p0699n4796j2530C31257G4873
$$ -224081 54367 48714 -188762 26907 -58751 -49498 -120197 -174993 -187523 331257 74873
18027d45959E1199J75835a06624n8556P932A84469a69715j08950A56473f0494
$$ -445959 51199 227034 -106624 -165180 -157248 184469 -169715 -278665 156473 -60494
18016a51514L773c324D5988a93704h2486c557A94035C7519L3830A6474i1153c9551
$$ -151514 -147741 -3324 45988 -193704 -82486 -3557 194035 37519 71349 16474 -91153 -39551
18003a85572a4543k26147g9568F9294h4915K6E429a43201A50437d6270B72973
$$ -185572 -14543 -240690 -79568 69294 -84915 -84889 5429 -143201 150437 -46270 272973
17991A31368a51922B5761P2431J10379B0679L2382m281a29968j44599J29210j1333
$$ 131368 -151922 25761 98192 208571 20679 53061 48780 -129968 -274567 -145357 -156690
17980a56690B8768b4258l6554A82639g5899C7786P2148a75965f6480n5933i385
$$ -156690 28768 -24258 -60812 182639 -75899 37786 109934 -175965 -66480 -122413 -9385
17968C41875a7357n4197J2798A58676b0330j6797A2113J58213a21311j72529J34896
$$ 341875 -17357 -71554 -58756 158676 -20330 -37127 12113 170326 -121311 -293840 -158944
17957a58944q1905e7411I1865m698d09845a24918A45124b93393e8955C64426a93722
$$ -158944 -240849 -57411 91865 87167 -409845 -124918 145124 -293393 -58955 364426 -193722
17945B51440c2427G1372O0166b57194F3295d1848I7046Q0748b02100I1180r077
$$ 251440 -32427 71372 131538 -257194 63295 -41848 97046 177794 -202100 91180 82103
17934H2103a12657b3987B27224b4621k18174Q7964l9156Q9789k0586c7830o7078
$$ 82103 -112657 -23987 227224 -24621 -242795 -154831 -193987 -104198 -124784 -37830 -104908
17923a04908A09023b7582B43526f100j0638m5967J6062k9343A21205d45412a34559
$$ -104908 109023 -27582 243526 -6100 -16738 -62705 -46643 -75986 121205 -445412 -134559
17911F3116k1964b70826J29122f6798D0631J54591I5841f586I435c21509m0578
$$ 63116 41152 -270826 -141704 -66798 40631 195222 95841 -6586 9435 -321509 -362087
17900c62087a06121A2309a11389C470J25503g2993D8330k149N6707Q0689d9111
$$ -362087 -106121 12309 -111389 3470 128973 -72993 48330 46181 102888 183577 -49111
17888b72636C2248a107p3096B83267c06329Q4681a3085D4983N2983a06123B1276
$$ -272636 32248 -1107 -74203 283267 -306329 -221648 -13085 44983 97966 -106123 21276
17876d0651A3553K47300A08400J0095a69496I0999m3671f231j28297c8351D0814
$$ -40651 13553 260853 108400 118495 -169496 90999 47328 -6231 -134528 -38351 40814
17864E6341O3881K6988N4128J54009a27060m3884F6840c77248a33462b9273E2989
$$ 56341 120222 147210 201338 355347 -127060 -170944 66840 -377248 -133462 -29273 52989
17852C39646H4340e0884i555A40341L00485A13544b90913g9244c4789B1627c47386
$$ 339646 84340 -50884 -9555 140341 440826 113544 -290913 -79244 -34789 21627 -347386
17840C8694d9358q983n2065B22584p1049a28446A37166n9435c373A8264o248K2278
$$ 38694 -49358 -58341 -110406 222584 151535 -128446 137166 77731 -3373 18264 12016 34294
17828C4294K44361g4591m3618A02900a73925A60931f5434A66008D5195J63497
$$ 34294 278655 -74591 -118209 102900 -173925 160931 -65434 166008 45195 208692
17818B08692e7695A04344a24273J4133j1125B03986a95756C54940c0984j1876
$$ 208692 -57695 104344 -124273 -110140 -121265 203986 -195756 354940 -30984 -42860
17808d2860k23734C6344c8088k23013f7262A83496H3162C1346Q7111J01546a87344
$$ -42860 -266594 36344 -38088 -261101 -67262 183496 83162 31346 118457 220003 -187344
17796A98522H7839J00541j3717a02913A54255K5994j2926o8694J24266e0694A00015
$$ 198522 87839 188380 174663 -102913 154255 180249 167323 98629 222895 -50694 100015
17784c04352F5276i2152j09028n5922P7376c6242Q333A29882a3850A44169J28881
$$ -304352 65276 -92152 -201180 -257102 -179726 -36242 -27909 129882 -13850 144169 273050
17773B73050b37660D29537A69016K89914C9925a63101F1908O3670a21359B91709
$$ 273050 -237660 429537 169016 458930 39925 -163101 61908 125578 -121359 291709
17762C76581c9605p3506H6748D799J26711c1376j43661f6021p3187A65502m6394
$$ 376581 -39605 -113111 86748 4799 131510 -31376 -175037 -66021 -139208 165502 119108
17751A19108r608C9678M7393a19225D2370b09829A99055a17694j01420E0599L07081
$$ 119108 109500 39678 87071 -119225 42370 -209829 199055 -117694 -219114 50599 357680
17740C57680A09912a59857r5297a23977B57518a33071b4709A24013b11290C30874
$$ 357680 109912 -159857 -255154 -123977 257518 -133071 -24709 124013 -211290 330874
17729E4092b12437E5073J31220J413I351a03812j18786a3397A19933k1768j0617
$$ 54092 -212437 55073 186293 187706 9351 -103812 -222598 -13397 119933 98165 87548
17718H7548a81429E235Q6352K06940H5532k9279J6164a75625I5961l8392c8450
$$ 87548 -181429 5235 91587 298527 85532 56253 72417 -175625 95961 57569 -38450
17706A58628a14404G9637L0245c9465j34950A75340G8151e1576A57413a76602
$$ 158628 -114404 79637 109882 -39465 -174415 175340 78151 -51576 157413 -176602
17695b8193D673b9656j2440k57811P1233B05407E7218a15782B27392e2780D55538
$$ -28193 4673 -29656 -42096 -299907 -228674 205407 57218 -115782 227392 -52780 455538
17683d9551n3578o1541J0116k08481H1219J92174I6373i9963B07462e283A86252
$$ -49551 -103129 -164670 -154554 -363035 81219 273393 96373 -99963 207462 -5283 186252
17671B84173L1493I2030g6221k4284M0394o2135e7074A8975Q415n637A0435A314
$$ 284173 315666 92030 -76221 -100505 -60111 -122246 -57074 18975 27390 21753 10435 1314
17658A4040J56463L7141h3551C25980A61218a8480p9537G9578d9562k18439A12306
$$ 14040 170503 207644 -83551 325980 161218 -18480 -98017 79578 -49562 -268001 112306
17646C14303d81093f8212A03948k4761b90504k19304A94559a3325B6640b0765
$$ 314303 -481093 -68212 103948 79187 -290504 -509808 194559 -13325 26640 -20765
17635a71576B95102c32048d926B59215i3070A31403J349A6783i4934a4801j57913
$$ -171576 295102 -332048 -4926 259215 -93070 131403 132752 16783 -94934 -14801 -172714
17624a72714A69167d7576E3931J63838C2196J92875E9716b22000a03825q1410
$$ -172714 169167 -47576 53931 217769 32196 225071 59716 -222000 -103825 -185235
17614a85235B99850G5810c8997A47876a01655C32853c9542B80608A09411J61720
$$ -185235 299850 75810 -38997 147876 -101655 332853 -39542 280608 109411 271131
17604B71131c94221J80310j23085a17821m21951B29558c08865A41696n8241k1010
$$ 271131 -394221 -213911 -336996 -117821 -539772 229558 -308865 141696 83455 62445
17594F2445J1526c55896A46575J3956i606I41f600B22632j01960J01546p5902
$$ 62445 73971 -355896 146575 160531 -9606 941 -6600 222632 120672 222218 146316
17583A46316k0314b03909e3374B32065j01308q379R0812F2044i4126B94465I193
$$ 146316 126002 -203909 -53374 232065 130757 122378 213190 62044 -94126 294465 9193
17571B47981f7381C07104e8664N395j30769c5651o0441A11734b70281B46972r0688
$$ 247981 -67381 307104 -58664 -53269 -184038 -35651 -96092 111734 -270281 246972 156284
17560A56284a89666D8674a93564k28615B53685d0962D0469g2665D6383e8242B6621
$$ 156284 -189666 48674 -193564 -422179 253685 -40962 40469 -72665 46383 -58242 26621
17548h4307G0106M6698J50557F6900J05167J24927h9217B58536b04717B87216
$$ -84307 70106 116804 267361 66900 172067 296994 -89217 258536 -204717 287216
17537D44744a69830B55757n9667R9253o9369j08097b46156A88214F5697b64713
$$ 444744 -169830 255757 196090 295343 225974 117877 -246156 188214 65697 -264713
17526F7345j5435a11948d5855B5227C471J24359N7272b41476f8845j15754F3871
$$ 67345 51910 -111948 -45855 25227 3471 127830 185102 -241476 -68845 -184599 63871
17514C77228A85991J48767j43203J67760B7003a09439E6841L31253G1404H446
$$ 377228 185991 334758 191555 359315 27003 -109439 56841 388094 71404 8446
17503G4395l5402M3106N2278P3831c6930n6916A43118c9576G8249a86439o916
$$ 74395 38993 82099 134377 208208 -36930 -93846 143118 -39576 78249 -186439 -193355
17492a93355A76736a27390B06051k2941b83982A6146E341N23668J153A72703E2397
$$ -193355 176736 -127390 206051 183110 -283982 16146 5341 529009 530162 172703 52397
17480C2063K15690A03800N6745O8864C7139K12436q9610K1902n4082M5997L1472
$$ 32063 247753 103800 160545 229409 37139 249575 159965 181867 127785 173782 205254
17469B05254K78302j98319K2668j10427G4857J76956a19319a9494I483J14492
$$ 205254 483556 285237 307905 197478 74857 251813 -119319 -19494 9483 123975
17459A23975J50931N4683j54318l9171J59158a8534k9163C22541j17535a5562
$$ 123975 274906 329589 175271 136100 295258 -18534 -47697 322541 205006 -15562
17448I9396J20599K40375A63552J31997B5916b46538c9892q9876M3375C65536
$$ 99396 219995 460370 163552 295549 25916 -246538 -39892 -129768 -86393 365536
17437C59974J87999D0112K24676r7848J18457r4614J15339b0510C30737m3169
$$ 359974 547973 40112 264788 166940 285397 190783 306122 -20510 330737 287568
17427B87568A03581J23750J61383p2175h923G0259L7094L28608F9494R1630J21216
$$ 287568 103581 227331 388714 316539 -8923 70259 107353 435961 69494 161124 282340
17416B82340m9902r9611J6572L98188j9412G3280C0416L5931N2660D5640L5051
$$ 282340 232438 132827 149399 547587 528175 73280 30416 66347 119007 45640 80691
17405H0691O4462J73237c2020C46185D5258J53105n0426o6901G541g542B9299
$$ 80691 145153 318390 -32020 346185 45258 198363 147937 81036 7541 -7542 29299
17393E04202A32453F3274J31379H36L87479J15203e062G6059a16419D18588j38557
$$ 504202 132453 63274 194653 836 388315 503518 -5062 76059 -116419 418588 280031
17382B80031k3087j06097o4412J53554H1251K86283j38830A3301J46640b5835
$$ 280031 256944 150847 86435 239989 81251 367534 228704 13301 159941 -25835
17371c52259A46376c548A34859D9020L20903k4277j09678n5949H2632K75826a94279
$$ -352259 146376 -3548 134859 49020 369923 345646 235968 180019 82632 358458 -194279
17359C77147b2195B58337r0603a01849D7687K38314n1683b09543A29293O3242
$$ 377147 -22195 258337 167734 -101849 47687 286001 234318 -209543 129293 192535
17349A92535C3533a6661B66750I2197A9099J48207L15294j97481G2643J379K86672
$$ 192535 33533 -16661 266750 92197 19099 167306 482600 285119 72643 74022 360694
17338C60694a0862A13144J4455J22330J59730A26754N4773H1277a61369A73671
$$ 360694 -10862 113144 127599 249929 409659 126754 181527 81277 -161369 173671
17327A47498P5510m9301K0033r4880a28599C09072E4277J07725F1805K065A4900
$$ 147498 223008 173707 193740 98860 -128599 309072 54277 162002 61805 63870 14900
17315H9468K22641l1304K28573k32855k7154J06085j41126m0026K7962q6818M48176
$$ 89468 312109 280805 509378 276523 249369 355454 214328 174302 202264 115446 563622
17304E63622I9018K10474J81230D4873K74192A26032a43355B74807J52412C2733
$$ 563622 99018 309492 490722 44873 319065 126032 -143355 274807 427219 32733
17293A8599J26989Q7454k5717c0561B15991J41991C2298K73250m9481m6627i0622
$$ 18599 145588 233042 207325 -30561 215991 357982 32298 305548 256067 209440 -90622
17281C41901j4376c1498B01842c3148J4874B29318j9504g8191A71802f1120B26536
$$ 341901 327525 -31498 201842 -33148 -18274 229318 209814 -78191 171802 -61120 226536
17269C20791A18884j593L01107A35091m8474L10254a36999B35990K3940A3708
$$ 320791 118884 117291 418398 135091 86617 396871 -136999 235990 259930 13708
17258A71446L39776H7284f8629A17190a01764E2012k2460N4451J08609l0000J10997
$$ 171446 511222 87284 -68629 117190 -101764 52012 29552 84003 192612 162612 273609
17247B73609k1752b1946G4358l3988a56265C72621C8610L49393A74895Q8640N0437
$$ 273609 251857 -21946 74358 40370 -156265 372621 38610 388003 174895 263535 313972
17236C13972I9241b2131D37980C9173J51480b930C14274j16169L3620p2022J11466
$$ 313972 99241 -22131 437980 39173 190653 -2930 314274 198105 231725 159703 271169
17225B71169D2499O44731k56922l1317j81123J21107g78B52000N1408J02992j87836
$$ 271169 42499 687230 430308 398991 217868 338975 -778 252000 303408 406400 218564
17214B18564K46269B27110P403D493N41636C6518K58544p0361K59049A46569K2699
$$ 218564 464833 227110 234513 4493 546129 36518 295062 224701 483750 146569 169268
17203A69268J07031l8362P7323J17818I9643M71619C6517K69233J53687A28680
$$ 169268 276299 237937 315260 433078 99643 571262 36517 305750 459437 128680
17192A50459M36600n7605B42365L42387A50189R2533K60794j44150o1676R9797
$$ 150459 587059 529454 242365 584752 150189 242722 503516 359366 297690 397487
17182C97487j41874n9715G2420O09542A61007K24375j09629a28596F10956G7431
$$ 397487 255613 195898 72420 681962 161007 385382 275753 -128596 610956 77431
17171A67801J72162J98385q1508o0958j4605J78938p2856B34410J0941j8960J06521
$$ 167801 339963 538348 456840 395882 381277 560215 487359 234410 245351 226391 332912
17160C32912H2156N1238l6405J72574R2971n0312A45891J08044A23644L08219
$$ 332912 82156 133394 96989 269563 362534 312222 145891 253935 123644 431863
17150D31863Q407j5834a08233F29681B55426o7103L89574A48609N8927M9477l1905
$$ 431863 440270 424436 -108233 629681 255426 188323 577897 148609 207536 257013 225108
17139B25108K67818Q7237O443B37858J02167q9885n1664M06298j27677r6127a52349
$$ 225108 492926 580163 586606 237858 340025 250140 198476 604774 477097 380970 -152349
17127D84515j74673H9411K09017J3840o7682K87582r1340F5205L02386J8071j53010
$$ 484515 309842 89411 298428 312268 244586 532168 440828 65205 367591 385662 232652
17116B32652j10760J04290J98306K9955A25451J54874j4586K20877j16411q2703
$$ 232652 121892 226182 424488 454443 125451 280325 265739 486616 370205 287502
17106B87502k6417J63533k7896k8289J02935O8918L774k39419L26152A16909J34634
$$ 287502 261085 424618 396722 368433 471368 540286 544060 304641 630793 116909 251543
17095B51543L05563P1995P0169M3910C60648J51126k15694j40364Q05M64472j4923
$$ 251543 557106 629101 699270 743180 360648 511774 296080 155716 156521 620993 606070
17084F06070B65802M97383J8792C46969n2992J58590p7775P7381j40049J31192
$$ 606070 265802 763185 781977 346969 293977 452567 374792 452173 312124 443316
17074D43316K50874n9256P6495C13214K53273P2157j27963J8901J95382j0178
$$ 443316 694190 634934 711429 313214 566487 638644 510681 529582 724964 714786
17064G14786l40787L46381B93037L63624m7197Q3848k94269R2662P5685J71196
$$ 714786 373999 720380 293037 656661 609464 693312 399043 491705 567390 738586
17054G38586k02658J4644l0164k46104O62010k70066n6750m1204q8168K0654m14
$$ 738586 535928 550572 520408 274304 936314 666248 609498 568294 480126 500780 500366
17043E00366R3682j76895J91019J53709M6229k04633L5931j26935l9925K73896
$$ 500366 594048 417153 608172 761881 808110 603477 639408 512473 472548 746444
17033G46444j88865J757J72167j49898K46297o7096J21495k61485k99309O32052
$$ 746444 557579 559336 731503 581605 827902 760806 882301 620816 321507 953559
17023I53559j78117P1392l33261K50178l03572L10831m8801J7804p6078K78019
$$ 953559 775442 846834 513573 763751 460179 771010 722209 740013 663935 941954
17013I41954k14312K58992j11622r5649j10134p9974K87041J52738j73718j10978
$$ 941954 727642 986634 875012 779363 669229 589255 876296 1029034 855316 744338
17003G44338k01372L77172M4400j64099O7339J40646j39706K33469l26180k50967
$$ 744338 542966 920138 964538 800439 867778 1008424 868718 1102187 776007 525040
16993E25040O34556j88889r7556N3465k70055l0549K97390L10769j19867k90955
$$ 525040 1159596 970707 873151 926616 656561 626012 923402 1234171 1114304 823349
16983H23349k56854J69103M41242k53408l16562J63792K09355L86911m37875J53471
$$ 823349 566495 735598 1176840 923432 606870 770662 980017 1366928 929053 1082524
16973A082524J6080k21884K03473j53420j87896M73732k4602j37637m9911K35397
$$ 1082524 1098604 876720 1080193 926773 738877 1212609 1188007 1050370 1000459 1235856
16963A235856l7527M9837J14146j00424k84096M93936m95978R9222J37688j10810
$$ 1235856 1198329 1248166 1362312 1261888 977792 1471728 975750 1074972 1212660 1101850
16953A101850j41079M84356M8780l63303J78066K76837j91268k07429m5630k19349
$$ 1101850 960771 1445127 1493907 1130604 1308670 1585507 1394239 1186810 1141180 921831
16943I21831O45549j63859l36578J12160K37189j32179j0233p78L4371J75957
$$ 921831 1567380 1403521 1066943 1179103 1416292 1284113 1273880 1273102 1307473 1483430
16933A483430j49068Q6716J5787N9342K52782j34232K62173m56562j48122J27737
$$ 1483430 1334362 1421078 1436865 1496207 1748989 1614757 1876930 1420368 1272246 1399983
16923A399983M1648N18936k26849l56805M6675L63927j97097J14179N0061M2637
$$ 1399983 1441631 1960567 1733718 1376913 1423588 1787515 1590418 1704597 1754658 1797295
16913A797295k78485P3414R5686J63993l18737L80454K41817j16043j42083j54841
$$ 1797295 1518810 1592224 1687910 1851903 1533166 1913620 2155437 2039394 1897311 1742470
16903A742470j30079J67651J66142J84008j78644M02994k87313j42448M10199
$$ 1742470 1612391 1780042 1946184 2130192 1951548 2354542 2067229 1924781 2334980
16894B334980l83997q3406L34858k10908j40926L11073J06357K20568n4887j82690
$$ 2334980 1950983 1867577 2202435 1991527 1850601 2161674 2268031 2488599 2433712 2251022
16884B251022N779J61550K35592J09442n32183J22279j8805J97845N4450m0733
$$ 2251022 2256801 2418351 2653943 2763385 2231202 2353481 2334676 2532521 2586971 2546238
16874B546238K27924k32261N7893m0932R2978J80293l9512M5162L68651j53602
$$ 2546238 2774162 2541901 2599794 2558862 2651840 2832133 2792621 2837783 3206434 3052832
16864C052832k22506L06381j0617k48623K93096J48258K633J49860k46651J11918
$$ 3052832 2830326 3136707 3126090 2877467 3170563 3318821 3321454 3471314 3224663 3336581
16854C336581k10142J86628L10619O2871j24412M7126J30461J43933p1554k27173
$$ 3336581 3126439 3313067 3623686 3686557 3562145 3609271 3739732 3883665 3812111 3584938
16844C584938J79116N11024n19731K93002K65921k714O3568p821R8023K41074
$$ 3584938 3764054 4275078 3755347 4048349 4314270 4311556 4375124 4367303 4465326 4706400
16834D706400J73953J26669k32975R0576j07259j34511O52106k6890J36865l73351
$$ 4706400 4880353 5007022 4774047 4864623 4757364 4622853 5274959 5248069 5384934 5011583
16824E011583N20356J49680P433K89067k13906K12970l3164J92810K76039J71032
$$ 5011583 5531939 5681619 5689052 5978119 5764213 5977183 5944019 6136829 6412868 6583900
16814F583900M277Q0916L0684L16133L20475l83004M00518p840L06370K065L74643
$$ 6583900 6588177 6669093 6699777 7015910 7336385 6953381 7353899 7346059 7652429 7654494 8029137
16803H029137j29993J60140L43704K18430L45160J68865J73495J76906K22889
$$ 8029137 7899144 8059284 8402988 8621418 8966578 9135443 9308938 9485844 9708733
16794I708733L08997L38569O7985M18898L48127j65230M55140J95404O99902k7745
$$ 9708733 10017730 10356299 10424284 10843182 11191309 11026079 11481219 11676623 12376525 12348780
16784A2348780N69280O0668M33951L62456L79078K58190M92661L56046P00521
$$ 12348780 12918060 12978728 13412679 13775135 14154213 14412403 14905064 15261110 15961631
16775A5961631M16974L26197P76206O68325K84720N61727N55555Q85872Q46408
$$ 15961631 16378605 16704802 17481008 18149333 18434053 18995780 19551335 20437207 21283615
16766B1283615L23295O42497R87283P70950O26846R82378R84246J023235O80801
$$ 21283615 21606910 22249407 23236690 24007640 24634486 25616864 26601110 27624345 28305146
16757B8305146J389275J225516J073914J138814J476034J626136J098301J698564
$$ 28305146 29694421 30919937 31993851 33132665 34608699 36234835 37333136 39031700
16749C9031700J771941J364673J735175K224067K272117K069402K346997K655264
$$ 39031700 40803641 42168314 43903489 46127556 48399673 50469075 52816072 55471336
16741E5471336K456249K898163K756470L411092K773193L861384L345397L806551
$$ 55471336 57927585 60825748 63582218 66993310 69766503 73627887 76973284 80779835
16733H0779835M084445M373035M199250M439876M700111M403228N117277M638763
$$ 80779835 84864280 89237315 93436565 97876441 102576552 106979780 112097057 116735820
16725A16735820M693471M480509M601497M234913M100278L102066L208768K442734
$$ 116735820 121429291 125909800 130511297 134746210 138846488 141948554 145157322 147600056
16717A47600056J890720J424212M0857L4186j210978j335238k602984k919539
$$ 147600056 149490776 150914988 150955845 150990031 149779053 148443815 145840831 142921292
16709A42921292l516162l756861m449398m555417m806538m769753m683575m915196
$$ 142921292 139405130 135648269 131198871 126643454 121836916 117067163 112383588 107468392
16701A07468392m807487m811623m949967m219914m562125m097834m226374l344604
$$ 107468392 102660905 97849282 92899315 88679401 84117276 80019442 75793068 72448464
16693G2448464m077113k863603l472275k973003k745703k705282k661430k330220
$$ 72448464 68371351 65507748 62035473 59062470 56316767 53611485 50950055 48619835
16685D8619835k790146j710229k076847k037957j342675j714841j595575j567033
$$ 48619835 45829689 44119460 42042613 40004656 38661981 36947140 35351565 33784532
16677C3784532j854970j141762j090233j224701j070091j029077j066607j234168
$$ 33784532 31929562 30787800 29697567 28472866 27402775 26373698 25307091 24072923
16669B4072923q15404r68137n28863r11933q83336l25025j277000l67305l40843
$$ 24072923 23257519 22289382 21760519 20848586 19965250 19640225 18363225 17995920 17655077
16660A7655077l99728j065767l21174n85504l14825q23032J27977o32781m22144
$$ 17655077 17255349 16189582 15868408 15282904 14968079 14145047 14273024 13640243 13218099
16651A3218099n54688l69379n07620r2780l15842j21460l00081o78008k72569
$$ 13218099 12663411 12294032 11786412 11693632 11377790 11256330 10956249 10278241 10005672
16642A0005672J68481l44938o62332K20710o06136j78854k5189m07487j03537
$$ 10005672 10174153 9829215 9166883 9387593 8781457 8602603 8577414 8169927 8066390
16633H066390k54111j25673k44349k00558N5382n83261J43128k98069q8021k92692
$$ 8066390 7812279 7686606 7442257 7241699 7297081 6713820 6856948 6558879 6470858 6178166
16623F178166J20983q3162N0813o46723N2959j204J69021k40734j83483l25842
$$ 6178166 6299149 6215987 6266800 5620077 5673036 5671832 5840853 5600119 5416636 5090794
16613E090794m6565j36024l44922L68618l86010l4881j16809k70081K04422k12064
$$ 5090794 5044229 4908205 4563283 4931901 4545891 4511010 4394201 4124120 4328542 4116478
16603D116478P4040j24060k59943M3317J13517j60679m7232n9885k1818j43011
$$ 4116478 4190518 4066458 3806515 3849832 3963349 3802670 3755438 3695553 3673735 3530724
16593C530724o9249j64141J14959l13595J34917m0450o8879N1241j28396p4693
$$ 3530724 3461475 3297334 3412293 3098698 3233615 3193165 3124286 3175527 3047131 2972438
16583B972438J09341k27362j52367K51566j87660j67609K27309q9615O2992k38041
$$ 2972438 3081779 2854417 2702050 2953616 2765956 2598347 2825656 2736041 2799033 2560992
16573B560992p3004J84707O1211m58356m0577L08659l13468J23570k01686L2342
$$ 2560992 2487988 2672695 2733906 2275550 2234973 2543632 2230164 2353734 2152048 2184390
16563B184390J47043L7445l43321l83237M14080k15029M3822o5449K33526j42084
$$ 2184390 2331433 2368878 2025557 1642320 2056400 1841371 1885193 1819744 2053270 1911186
16553A911186K05331l36430N2448J85301q3713j96601q4824M31617l93706j79422
$$ 1911186 2116517 1780087 1832535 2017836 1934123 1737522 1652698 2084315 1690609 1511187
16543A511187L25215k19750j1052n0664j32260m3844j57932O47837o29006P4304
$$ 1511187 1836402 1616652 1605600 1554936 1422676 1378832 1220900 1868737 1239731 1314035
16533A314035K97646j92287k35165L09921j98060k07426M26330O2232m2904l53130
$$ 1314035 1611681 1419394 1184229 1494150 1296090 1088664 1514994 1577226 1534322 1181192
16523A181192n5142j08868o5598Q3642L25973k32512n9236Q0975Q0654L639j00860
$$ 1181192 1126050 1017182 951584 1035226 1361199 1128687 1069451 1150426 1231080 1234719 1133859
16512A133859K7372P0583N6187p6103M3744k73517L30510l46806P8909J49483
$$ 1133859 1161231 1231814 1288001 1211898 1255642 982125 1312635 965829 1044738 1194221
16502A194221j94901q0006J56443N6129l26315p5305M88985k92187K01100j38623
$$ 1194221 999320 919314 1075757 1131886 805571 730266 1219251 927064 1128164 989541
16492I89541j22403R4213j48722J66308j20667k4231J64890O7368r5400m5872
$$ 989541 867138 961351 812629 978937 858270 834039 998929 1066297 970897 925025
16482I25025j57612J21386j74581K98490j5032l58457r2718N1160M41029B86949
$$ 925025 767413 888799 714218 1012708 997676 639219 546501 597661 1038690 286949
16471G55390k7268k55608K40613j94274J75197J9100p2376N2541j41115P2751
$$ 755390 728122 472514 713127 518853 694050 713150 640774 693315 552200 624951
16461F24951l8516J51304k180B80274p7801K94157L63444j57152k80984l0304
$$ 624951 586435 737739 735559 280274 202473 496630 860074 702922 421938 391634
16451C91634K17623M2450K8600k89148J29729j1964j42198J63268j94532L80900
$$ 391634 609257 651707 680307 391159 520888 508924 366726 529994 335462 716362
16441G16362P1577k99723n5886O26165l91526o3783k96392J32261L3213j2179
$$ 716362 787939 488216 432330 1058495 666969 603186 306794 439055 472268 460089
16431D60089k5107m5361L5057L28683l61180A55378M52851j9340A91244M02667
$$ 460089 434982 389621 424678 753361 392181 155378 608229 588889 191244 593911
16421E93911B06097L22891Q6138L0186B51059J92037M2424j2723r7717Q4394n4547
$$ 593911 206097 528988 615126 645312 251059 443096 485520 472797 375080 459474 404927
16410D04927j0497J20177j24856m842j9646r9194O62659k34070l01531N7179I0399
$$ 404927 394430 514607 389751 384909 365263 266069 928728 694658 393127 450306 90399
16398D91813J1857j38996J20860g294B13544L73565B88568J9347L0215r7454E3318
$$ 491813 503670 364674 485534 -7294 213544 587109 288568 307915 338130 240676 53318
16386C20006O6315R4971o5974A11581N20271A68769Q3699G6624Q6390J34391C1196
$$ 320006 386321 481292 415318 111581 631852 168769 252468 76624 163014 297405 31196
16374B50002R8619q0002N8973N88855C85553J2996A84443G6377J0448i2442I0583
$$ 250002 348621 268619 327592 916447 385553 398549 184443 76377 86825 -92442 90583
16362C33009A19048P0686C7928J40220L58535j00598j56406J24501J4013K1044
$$ 333009 119048 189734 37928 178148 536683 436085 279679 404180 418193 439237
16352D39237B12151J61102n2287m4152r5215J21659A50942J68541p3611K0270
$$ 439237 212151 373253 320966 276814 181599 303258 150942 319483 245872 266142
16342B66142J59653g3611D64119A31727K36037j20796J17116B1159L16166A35231
$$ 266142 425795 -73611 464119 131727 367764 246968 364084 21159 337325 135231
16331a6254j7489E04879H3677J63433O964P392D7494J16592O0246J00028p3833
$$ -16254 -33743 504879 83677 247110 254074 261466 47494 164086 224332 324360 250527
16320B50527k4446D2187L05022G8916h22B38415C9248J43010G2396h3729A26093
$$ 250527 226081 42187 347209 78916 -822 238415 39248 182258 72396 -83729 126093
16308C25463j50908O6969a12964D50627J36345I6201K41064J04513E399L85748
$$ 325463 174555 241524 -112964 450627 586972 96201 337265 441778 5399 391147
16298C91147o8991F5914j4587K34831N2q0416a31512M3120B94502k661A34525
$$ 391147 322156 65914 51327 286158 286210 205794 -131512 -88392 294502 291841 134525
16286B14635c8983A28056M6120e0443j44580f1366D29396b18545D03166a37463
$$ 214635 -38983 128056 174176 -50443 -195023 -61366 429396 -218545 403166 -137463
16275G7204j251a37844C15481E2835J79587p0946p0927m2192N9788D9171b1488
$$ 77204 75953 -137844 315481 52835 232422 161476 90549 48357 108145 49171 -21488
16263g4708k9201b1255B24210K38933F6783O3385m2394M5869a91411L3510B78709
$$ -74708 -103909 -21255 224210 463143 66783 130168 87774 133643 -191411 -157901 278709
16251A08669b11247A09884D8279K44707q5271n8438a3274A11012M8157J76755
$$ 108669 -211247 109884 48279 292986 207715 149277 -13274 111012 159169 335924
16241C35924A43114o0841J25490J04102a97067A48811j9814F2235K98576g376
$$ 335924 143114 82273 207763 311865 -197067 148811 128997 62235 360811 -7376
16230A12658f5523B7364D768K27700F1848d17331A98831r0692a95171B66668a41762
$$ 112658 -65523 27364 4768 232468 61848 -417331 198831 108139 -195171 266668 -141762
16218E10803a27857D7011a77153B78149P9529c8194j45533A13610J26571E3029
$$ 510803 -127857 47011 -177153 278149 357678 -38194 -183727 113610 240181 53029
16207I5016N0359j1076Q6366c8485J7683r4204N658A82244H9253K24268A23234
$$ 95016 145375 134299 220665 -38485 -20802 -115006 -109348 182244 89253 313521 123234
16195G2423L9681e2658B2649K73700J14332A15893a55856c798I1855a8108D2777
$$ 72423 112104 -52658 22649 296349 410681 115893 -155856 -3798 91855 -18108 42777
16183D64448F141J22799m9895K6803G7a03710A33386E3170k6077c59363B1553
$$ 464448 6141 128940 79045 105848 77 -103710 133386 53170 27093 -359363 21553
16171a26175B52217c3B63145J9523a75998B86811A6080a23610B16423E0276B3062
$$ -126175 252217 -33 263145 282668 -175998 286811 16080 -123610 216423 50276 23062
16159g236j62982C3054J85421N5921G2634a74771C1256a12544A64122K5930p5602
$$ -7236 -170218 33054 218475 274396 72634 -174771 31256 -112544 164122 190052 114450
16148A14450b5025j51752A00556Q0465a35149B13970E1890O2525n6753J47162
$$ 114450 -25025 -176777 100556 181021 -135149 213970 51890 114415 57662 204824
16138B04824a94983F7577g1021H4762O1560K9087C1404K24753D5262e5597j9263
$$ 204824 -194983 67577 -71021 84762 146322 175409 31404 256157 45262 -55597 -74860
16127g4860A5169K55169L2873a88619b612B8315e5610l62594B30494A6899J9818
$$ -74860 15169 270338 303211 -188619 -2612 28315 -55610 -418204 230494 16899 36717
16116C6717a12844j19925I8891I373J51036a65472b8188j93172F3313b31694B08230
$$ 36717 -112844 -232769 98891 9373 160409 -165472 -28188 -221360 63313 -231694 208230
16104c19815d8794n338E6524k6430K25541H1579a04534A18640L03983a73051Q768
$$ -319815 -48794 -54132 56524 30094 255635 81579 -104534 118640 422623 -173051 -164283
16093a64283A67099M4635a3029A15619L0620d1938A01581C6041h4382J7141j47909
$$ -164283 167099 211734 -13029 115619 146239 -41938 101581 36041 -84382 -67241 -215150
16082b15150q483f4015C1614J96858E4513b53955B82208b33306M4350N8614B27976
$$ -215150 -223633 -64015 31614 228472 54513 -253955 282208 -233306 -188956 -130342 227976
16070a95854E6541k1181J78677a50380j12284c4728B27747I4229c148A18851E1126
$$ -195854 56541 35360 214037 -150380 -262664 -34728 227747 94229 -3148 118851 51126
16058A81133b18314C15989j32753a14477L2360O244l6579L436A45979a78803P5717
$$ 181133 -218314 315989 183236 -114477 -82117 -75873 -112452 -109016 145979 -178803 -103086
16047a03086A5695R9441b70453C30268A20667a8269j8347B6438b127B3774K05373
$$ -103086 15695 115136 -270453 330268 120667 -18269 -36616 26438 -2127 23774 229147
16036B29147a20856E0126d00081g5986n756C5119b15342I2892b62581Q8107J0650
$$ 229147 -120856 50126 -400081 -75986 -81742 35119 -215342 92892 -262581 -174474 -163824
16025a63824A16091J74608C4855e0953j00594p28m1359N2548G1352b88715A09601
$$ -163824 116091 290699 34855 -50953 -151547 -152275 -193634 -141086 71352 -288715 109601
16013i0604B7592J28560K0462o0385a01252D0261c2280j570C0111L8120d8728
$$ -90604 27592 156152 176614 116229 -101252 40261 -32280 -33850 30111 68231 -48728
16001b8400C41450A09861a07818A72500d11253J09818E2316C366a46118b0657
$$ -28400 341450 109861 -107818 172500 -411253 -301435 52316 3366 -146118 -20657
15990b9732E6109k2641N2272P1391J20279P8736R2443k0759Q8211A79294c1062
$$ -29732 56109 33468 85740 157131 277410 356146 448589 427830 516041 179294 -31062
15978D42840F8054K48125j47088d4419E5300e291A30981M5714P3349a05863J6152
$$ 442840 68054 316179 169091 -44419 55300 -5291 130981 176695 250044 -105863 -89711
15967h9711A0824J18927b00683A1866J15469a80899G5498C7562e5951j13856n5374
$$ -89711 10824 129751 -200683 11866 127335 -180899 75498 37562 -55951 -169807 -225181
15956b25181O9057B48843J2292a35795C56208a09644c5558A48527E6866h0801
$$ -225181 -156124 248843 261135 -135795 356208 -109644 -35558 148527 56866 -80801
15945A7743J13333a15552A10803p675a55750k22828a20813k57602A39374a55525
$$ 17743 131076 -115552 110803 103128 -155750 -378578 -120813 -378415 139374 -155525
15934A28047O9166b17301A82901a76205j49540B18587a49691C2670b72364a18433
$$ 128047 197213 -217301 182901 -176205 -325745 218587 -149691 32670 -272364 -118433
15923a72771k50684e6050k05614B14048J34677b6930j07423F6915K59256c53746
$$ -172771 -423455 -56050 -261664 214048 348725 -26930 -134353 66915 326171 -353746
15912b62681A12248b14672k1493A70225h1647j18607j12051a14129q7344G6352
$$ -262681 112248 -214672 -236165 170225 -81647 -200254 -312305 -114129 -201473 76352
15901b32145C2072K86352a30776p6631p598A2819b87523m6569I5302j7490D994
$$ -232145 32072 318424 -130776 -207407 -215005 12819 -287523 -334092 95302 77812 4994
15889f0835j60764A33132r354P5347E3699a34653l20765Q8051a58025A65502m606
$$ -60835 -221599 133132 123778 199125 53699 -134653 -455418 -367367 -158025 165502 160896
15878A60896k2662a5533m01439c793A7312J16713L1869a68869F8613g7671o7101
$$ 160896 138234 -15533 -416972 -3793 17312 134025 165894 -168869 68613 -77671 -144772
15867a44772d5966A27874c1677a4717j46713B4985J44322n554J45256c8087j24720
$$ -144772 -45966 127874 -31677 -14717 -161430 24985 169307 163753 309009 -38087 -162807
15856a62807h45G2322J74255A20377l8271c30200f1151E8503a97170B87596j16911
$$ -162807 -845 72322 246577 120377 82106 -330200 -61151 58503 -197170 287596 170685
15845A70685e0959B76645b07342j70533B45373o5342J4161d88737E6753c20632
$$ 170685 -50959 276645 -207342 -377875 245373 180031 194192 -488737 56753 -320632
15834a0784j98500B32326o6628K1470c38082a00088j10344E3323a34381c1336
$$ -10784 -209284 232326 165698 187168 -338082 -100088 -210432 53323 -134381 -31336
15823b23326A1215b41455A3307c46125g7177B9811f1433K8471O345B5774R8025
$$ -223326 11215 -241455 13307 -346125 -77177 29811 -61433 -32962 -26617 25774 123799
15812A23799M6664B9132Q5286A7182a20436b805H3389a323k14415B22191a85101
$$ 123799 170463 29132 114418 17182 -120436 -2805 83389 -1323 -215738 222191 -185101
15800A4389h7082B02385k868c74990J00928J25841B4406i2678F9985r951b5616
$$ 14389 -87082 202385 199517 -374990 -274062 -148221 24406 -92678 69985 60034 -25616
15788f5654i70C18859A42755C2222f0357A64284F0414b07846E1158a95339g4627
$$ -65654 -970 318859 142755 32222 -60357 164284 60414 -207846 51158 -195339 -74627
15776a76942j37321j15928a03017A05136K55721F3686K16987c64103D0516a75837
$$ -176942 -314263 -430191 -103017 105136 360857 63686 280673 -364103 40516 -175837
15765C09171a29934A33219b31237O8845g0018l15617d621r2866H2731g9180C41061
$$ 309171 -129934 133219 -231237 -162392 -70018 -385635 -4621 -97487 82731 -79180 341061
15753A42599p1270K11275D4022J61522G6506b1234B2749a07311L5516b5712B30422
$$ 142599 71329 282604 44022 205544 76506 -21234 22749 -107311 -71795 -25712 230422
15741G1286a21133r1592F6575a35074M3538J3938j30915b2993D0493a28119o7445
$$ 71286 -121133 -212725 66575 -135074 -91536 -77598 -208513 -22993 40493 -128119 -195564
15730a95564f0090j19767F4151g3839j26685h4757m6756a2745D3770j0510A5117
$$ -195564 -60090 -179857 64151 -73839 -200524 -84757 -131513 -12745 43770 33260 15117
15718E3474e1675b1840j50966j31898c0776G4622J52912J0969j032o8958b27759
$$ 53474 -51675 -21840 -172806 -304704 -30776 74622 227534 238503 237471 168513 -227759
15706a81276g7825L2993j88956D2062L4087a07433J6803J1408E2358J42844c17685
$$ -181276 -77825 -44832 -233788 42062 76149 -107433 -90630 -79222 52358 195202 -317685
15694B2469J6278L6849a18590A64187G1159a78339n7005i3179B27273B9667C970
$$ 22469 38747 75596 -118590 164187 71159 -178339 -235344 -93179 227273 29667 3970
15682A10236f4640C54084b06652O9788k1231K881B05821C9304J0295K12388A28872
$$ 110236 -64640 354084 -206652 -136864 -158095 -155214 205821 39304 49599 261987 128872
15670A92836b94812C46303H9248R4755e6214J4746C47974E4246O3298h2041D7109
$$ 192836 -294812 346303 89248 184003 -56214 -41468 347974 54246 117544 -82041 47109
15658a97130r0474F2803j7777c27810B14284a0307C71393D7945g3384B90370f9703
$$ -197130 -287604 62803 45026 -327810 214284 -10307 371393 47945 -73384 290370 -69703
15646H8832c63791F07g6876A6216a09748k32364H6620A7594L1758K39886a82927
$$ 88832 -363791 607 -76876 16216 -109748 -342112 86620 17594 49352 289238 -182927
15634A17538J74755r3875a30053j4674A56267k3879d4176k8277E2140c13509J07636
$$ 117538 292293 198418 -130053 -144727 156267 132388 -44176 -72453 52140 -313509 -205873
15623b05873a631l81673h8926I0082a58380A76883b380A28574a73387k4385i4367
$$ -205873 -1631 -383304 -88926 90082 -158380 176883 -2380 128574 -173387 -197772 -94367
15611B35264b11470b6346k98903J19405A35487d40379C50458b2641l2219o6905
$$ 235264 -211470 -26346 -325249 -205844 135487 -440379 350458 -22641 -54860 -121765
15601a21765o4263Q4816o852B01191M7425B3434b41005C0326a90071d1575A2634
$$ -121765 -186028 -101212 -108064 201191 248616 23434 -241005 30326 -190071 -41575 12634
15589C9266j5478d2908l42878j7552B876j317b25574B37503a61279D5516L9362
$$ 39266 23788 -42908 -385786 -403338 2876 1559 -225574 237503 -161279 45516 84878
15578H4878a38178A32145F4084K602J16885G7218a0392l4116j44977l3594A41407
$$ 84878 -138178 132145 64084 66686 183571 77218 -10392 -44508 -189485 -223079 141407
15566a32037n5332L7184D9726b6494B19719P5066R9491A03484a41730A9738a39358
$$ -132037 -187369 -150185 49726 -26494 219719 294785 394276 103484 -141730 19738 -139358
15554a1758j85851L5628d2434j52650R4752D55646b3807m9539q6518a1619A37174
$$ -11758 -197609 -161981 -42434 -195084 -100332 455646 -23807 -73346 -159864 -11619 137174
15542G7225g3499A55407O1724a66644J683l3203a6718I6432a45569a807k80674
$$ 77225 -73499 155407 217131 -166644 -164961 -198164 -16718 96432 -145569 -1807 -282481
15531b82481d0155n6539j7058B51239a87145a9826j35450H793K1019j689N0211
$$ -282481 -40155 -96694 -113752 251239 -187145 -19826 -155276 8793 29812 28123 78334
15520G8334M8794h7755I7671B6371J9559A4766a80098A42334h317A09632h7501
$$ 78334 127128 -87755 97671 26371 45930 14766 -180098 142334 -8317 109632 -87501
15508b14312C12128c2148B8507K32839A29411a27268A180a6849j60533b5136A45040
$$ -214312 312128 -32148 28507 261346 129411 -127268 1180 -16849 -177382 -25136 145040
15496B85627a0198C3864c731j24030A9485h7225b9203r0979F184c4777H0507P834
$$ 285627 -10198 33864 -3731 -127761 19485 -87225 -29203 -120182 6184 -34777 80507 88341
15484H8341B1904n761b12307e4461A02988e1870A5288J71447J12852D7493J17182
$$ 88341 21904 16143 -212307 -54461 102988 -51870 15288 186735 299587 47493 164675
15473A64675J95962B518b31644l020E374P9110b13715d7588a8429k1580n2701
$$ 164675 360637 2518 -231644 -234664 5374 84484 -213715 -47588 -18429 -40009 -92710
15462i2710A91218d5822A4644a34618A41849a21607R537H0867a3659A24306b60038
$$ -92710 191218 -45822 14644 -134618 141849 -121607 -112070 80867 -13659 124306 -260038
15450B2940a25756B37179o3342b0447B2832K5585N1558d9543A79379R0125L9208
$$ 22940 -125756 237179 173837 -20447 22832 48417 99975 -49543 179379 269504 308712
15439C08712a17874F0195g6409A66903p9152i0416a9674j0846A47490b36919J6434
$$ 308712 -117874 60195 -76409 166903 87751 -90416 -19674 -30520 147490 -236919 -220485
15428b20485F6110R9618p3895b3028j24972j25741k3532a7447k29893G3859L52848
$$ -220485 66110 165728 91833 -23028 -148000 -273741 -297273 -17447 -247340 73859 426707
15417D26707h3071B4569c33495A5144a4090A21131n3417d6617A40085a12828d6802
$$ 426707 -83071 24569 -333495 15144 -14090 121131 67714 -46617 140085 -112828 -46802
15405B55101f2527n6749C22494a67139I4117a14490k6123H3155J89006e456l83070
$$ 255101 -62527 -119276 322494 -167139 94117 -114490 -140613 83155 272161 -5456 -388526
15394c88526B17917f9160C1033J32612p6354a35158n4722k6545a7322j94173F8084
$$ -388526 217917 -69160 31033 163645 87291 -135158 -189880 -216425 -17322 -211495 68084
15382a36146K5859I3760K663J9658b0563j55520E6011J5032J36375B8493a02614
$$ -136146 -110287 93760 96423 116081 -20563 -176083 56011 71043 207418 28493 -102614
15370b53703e0744r223R062B35451K5782f5909j2118j75236A19940e1630H1151
$$ -253703 -50744 -59967 -50905 235451 261233 -65909 -78027 -253263 119940 -51630 81151
15358G3848a77640A11963R495n2804f980A04565b31921B46203K4864O2754i3409
$$ 73848 -177640 111963 121458 68654 -6980 104565 -231921 246203 271067 333821 -93409
15346B43099C2364J9288a28313E5129b08666A00748J05320p2504K7541c65407
$$ 243099 32364 51652 -128313 55129 -208666 100748 206068 133564 161105 -365407
15335B2024K38231a4182k88854C7590Q3820J66528e1559D4924b16845h3446j18330
$$ 22024 260255 -14182 -303036 37590 121410 287938 -51559 44924 -216845 -83446 -201776
15324b01776F8986f6832p0268A03544C3868R4283B8744J36409a69105n5507h5355
$$ -201776 68986 -66832 -137100 103544 33868 128151 28744 165153 -169105 -224612 -85355
15312D22741a3920p0220J842K7228j01437n5534H1443M9417a18160A84630a3506
$$ 422741 -13920 -84140 -82298 -55070 -156507 -212041 81443 130860 -118160 184630 -13506
15300A59909a06543f201A74539G2004a98868B67498G3270e5298J5574B774J9611
$$ 159909 -106543 -6201 174539 72004 -198868 267498 73270 -55298 -39724 2774 22385
15289B2385d2288j74459A15551A7027K00087p8766e9013K8168A10068J73102I1026
$$ 22385 -42288 -216747 115551 17027 217114 138348 -59013 -30845 110068 283170 91026
15277B03460k4490K5447k9949K30162A71810F4356j0617a86835k8734J04511A24822
$$ 203460 178970 204417 174468 404630 171810 64356 53739 -186835 -215569 -111058 124822
15265a49639D11747J51540A45827d9928A3777J95694E1653J14039a6270q6959
$$ -149639 411747 563287 145827 -49928 13777 209471 51653 165692 -16270 -103229
15255a03229m838E1873a3689D09451J63503k54701M17426M56920O5206j50016
$$ -103229 -108067 51873 -13689 409451 572954 318253 735679 1192599 1257805 1107789
15245A107789J51263n69862j26450A50000f3751o686D71019k08503D0334a70828
$$ 1107789 1259052 689190 562740 150000 -63751 -70437 471019 262516 40334 -170828
15234i2576l22293A22969d8016B41940R4074j04635A02067J91125A35824J8569
$$ -92576 -414869 122969 -48016 241940 336014 231379 102067 293192 135824 154393
15224A54393a7125A70257J9687E8316e1534A26745N2489a15623E0271L99186A41910
$$ 154393 -17125 170257 189944 58316 -51534 126745 179234 -115623 50271 449457 141910
15212c42603b0947C0682a84660A02582a30439B62720h6258k14174G7665b22527
$$ -342603 -20947 30682 -184660 102582 -130439 262720 -86258 -300432 77665 -222527
15201a28443A43488d1842A67036K31421F2658a22147A00461m6136r63A5882k858
$$ -128443 143488 -41842 167036 398457 62658 -122147 100461 54325 53362 15882 13024
15190A3024K63994B8620O681A4378M74720c1791g640C06561a48067N2248l23240
$$ 13024 277018 28620 35301 14378 489098 -31791 -7640 306561 -148067 -95819 -419059
15179d19059c8174B65034o6727K9354J04065e8738j7567B17077A4518h53A68163
$$ -419059 -38174 265034 198307 227661 331726 -58738 -76305 217077 14518 -853 168163
15167h1682A36633a72326K4288A88946H1848k9444N99K19837j31987R6080m9778
$$ -81682 136633 -172326 -148038 188946 81848 52404 53003 272840 140853 236933 187155
15156A87155c15281B04288a69528f2557j7221A40503b66128k09102d0519I8390
$$ 187155 -315281 204288 -169528 -62557 -79778 140503 -266128 -475230 -40519 98390
15145B10773M0230a55781j1507b5561B99924j39205L0151q9880q981J06916c48547
$$ 210773 251003 -155781 -167288 -25561 299924 160719 190870 100990 92009 198925 -348547
15133A18452R8502j03689J98880a45340b5191k9877B22951J02585p3772j23104
$$ 118452 216954 113265 312145 -145340 -25191 -55068 222951 325536 251764 128660
15123A28660L70509H0173a08470A07398O3645J31140m3672Q2028I3685O5712L819
$$ 128660 499169 80173 -108470 107398 171043 302183 258511 340539 93685 159397 163216
15112A63216j1114F4467j5931K04415a44627O3144L0223A15287J71580J8919i2990
$$ 163216 152102 64467 48536 252951 -144627 -81483 -51260 115287 286867 305786 -92990
15100A61066F8795C2955L15801E0945a6600C7162b11680A17823O5386k9356Q760
$$ 161066 68795 32955 348756 50945 -16600 37162 -211680 117823 183209 153853 162613
15089A62613n1193d3414B27356d0884B13504K26747a43493A67224C770R5066b23263
$$ 162613 111420 -43414 227356 -40884 213504 440251 -143493 167224 3770 98836 -223263
15077B27074M1410D8536J64963B555a8792H6855K17406j29837J55694p2427J81088
$$ 227074 268484 48536 213499 2555 -18792 86855 304261 174424 330118 257691 438779
15066D38779g7755L6277B91903g6719C73231A29381L30920k27878f764B81726
$$ 438779 -77755 -41478 291903 -76719 373231 129381 460301 232423 -6764 281726
15055B5717J44146E5028K63852A04457R0208n0132J42246F1818L2154K81982m6825
$$ 25717 169863 55028 318880 104457 194665 144533 286779 61818 93972 375954 329129
15044C29129j12946o8041J13711P338A31334L462k0356M8908J19053A421J31924
$$ 329129 216183 148142 261853 269191 131334 134796 114440 163348 282401 1421 133345
15033A33345F4575K88029A63961a43429C31582E4156J12481b2124D20124j69374
$$ 133345 64575 352604 163961 -143429 331582 54156 166637 -22124 420124 250750
15023B50750p4596o6293a5465E5104L19302A55469L55901F9400a5363l4615A77527
$$ 250750 176154 109861 -15465 55104 374406 155469 511370 69400 -15363 -49978 177527
15011C65286j34983h95B08572J99900h8635D9374L29380O1708j30397j36353Q9495
$$ 365286 230303 -895 208572 408472 -88635 49374 378754 440462 310065 173712 263207
15000B63207a35211B11595l479G3729k0005P3957Q3379n3051e3944B42417n4818
$$ 263207 -135211 211595 208116 73729 53724 127681 211060 158009 -53944 242417 187599
14989A87599J87249n2663f7793B04797n818H9071Q9718K11472B7360J70737Q9554
$$ 187599 374848 322185 -67793 204797 198979 89071 178789 390261 27360 198097 287651
14978B87651J64180j64326Q57K33810E2296M66514A38895O906J54680j22806J8022
$$ 287651 451831 287505 288362 522172 52296 518810 138895 145801 300481 177675 195697
14967A95697r2760Q3677N8141b8931B69229j16743L88296j2280B9183L75428G4771
$$ 195697 102937 186614 244755 -28931 269229 152486 540782 528502 29183 404611 74771
14955A30838R1135k1601f937A2135l256P978K13963K21963H0363K13793L8641
$$ 130838 221973 200372 -6937 12135 8879 16857 230820 452783 80363 294156 332797
14944C32797A19207K47391G7357J45179k0222n2298k3496R5784I771K89917L5117
$$ 332797 119207 366598 77357 222536 202314 150016 126520 222304 9771 299688 334805
14933C34805o5190H1048R0054l3620O9866K0198h1611B21208J2441q637r1849
$$ 334805 269615 81048 171102 137482 207348 227546 -81611 221208 233649 225012 133163
14922A33163J94418N3031j82138L31623r5937j34160A26981L49807A72192J36638
$$ 133163 327581 380612 198474 530097 434160 300000 126981 476788 172192 308830
14912C08830j50792C3086J59592O3452j8733N2694e7213B42925j15193K16232
$$ 308830 158038 33086 192678 256130 237397 290091 -57213 242925 127732 343964
14902C43964J0385q817R6149j88211K15383K372l8509A15817K84634g2228B78341
$$ 343964 354349 345532 441681 253470 468853 471225 432716 115817 400451 -72228 278341
14890A14518a5243B26646d2932E25360A70105j6388K32710K0896H292K33865Q1267
$$ 114518 -15243 226646 -42932 525360 170105 153717 386427 407323 8292 242157 323424
14879C23424j1520K31147A33868J54595p7798J36409o2130Q2891k625k9047K3440
$$ 323424 311904 543051 133868 288463 210665 347074 284944 367835 365210 336163 359603
14868C59603K08751k66582j01517J00468O5194Q2262Q3350A90744N2631K42035
$$ 359603 568354 301772 200255 300723 365917 448179 531529 190744 243375 485410
14858D85410j36117M6619Q614J68831B53522l7126K29494A52400L28160r2487
$$ 485410 349293 395912 404526 573357 253522 216396 445890 152400 480560 388073
14848C88073k6654k0959H269K28073J18684b1245E51483A49519K20851o0623L32417
$$ 388073 361419 340460 8269 236342 355026 -21245 551483 149519 370370 309747 642164
14837F42164k71912R222J45846A48688Q7612L10360B41222Q8710P7907J28279
$$ 642164 370252 379474 525320 148688 236300 546660 241222 329932 407839 536118
14827E36118n8682k6688E297O74587o6978B71813F6503J79888I4564K23407J07211
$$ 536118 477436 450748 5297 679884 612906 271813 66503 246391 94564 317971 425182
14816D25182j32941J19546J80678k7701B60595K66501j86104J86572j30392L1168
$$ 425182 292241 411787 592465 564764 260595 527096 340992 527564 397172 428340
14806D28340j02319L55791B69319J89600H0748M76393l8221A62453o5843O75762
$$ 428340 326021 681812 269319 458919 80748 557141 518920 162453 96610 772372
14796G72372k65194P1715k32875p2059K58408j32285K8436L5221L08805k30299
$$ 772372 507178 578893 346018 273959 532367 400082 428518 463739 772544 542245
14786E42245k12978K30185A50167L67257o9430j45943K47409j36308J24966Q538
$$ 542245 329267 559452 150167 517424 447994 302051 549460 413152 538118 546656
14776E46656j47887j88208K50732B24031N19920q8322k35928J810K71142k68327
$$ 546656 398769 210561 461293 224031 743951 655629 419701 421511 692653 424326
14766D24326J71687B85651O1930K13350l2440J95302C06764K01151M49183m08060
$$ 424326 596013 285651 347581 560931 528491 723793 306764 507915 957098 549038
14756E49038O2299J24234M180k86716N0738m2704j65407J28115j80780m7010N90957
$$ 549038 611337 735571 739751 453035 503773 461069 295662 423777 242997 195987 786944
14745G86944l39511L42877j71026N2680j26926L7928L89229m49720L1034O6634
$$ 786944 447433 790310 619284 671964 545038 582966 972195 522475 553509 620143
14735F20143j4372k02473N29360k30752O0397k99664K81319C41904J57231J17666
$$ 620143 605771 403298 932658 701906 762303 462639 743958 341904 499135 616801
14725F16801M0359J55882n7701q6565n5479J87065j61685j71489M4940K04990
$$ 616801 657160 813042 755341 668776 613297 800362 638677 467188 512128 717118
14715G17118j03781m4387L21471k8796J10206m73604J17289K99508p8737k54914
$$ 717118 613337 568950 890421 861625 971831 498227 615516 915024 836287 581373
14705E81373j24459J60745l5905J29203J99896j98047K72308k56001K74944m88577
$$ 581373 456914 617659 581754 710957 910853 712806 985114 729113 1004057 515480
14695E15480K63168j12767J13106j27681J23549k51984J37300K21857J79847D43212
$$ 515480 778648 665881 778987 651306 774855 522871 660171 882028 1061875 443212
14684D83278K39330L08504k86245r0277K78074K10l35377L42515P78J38832j0394
$$ 483278 722608 1031112 744867 654590 932664 932874 597497 940012 940790 1079622 1069228
14673A069228j21418r0775r0705M9448o430J63090j23219M7184P991P8402l35516
$$ 1069228 947810 857035 766330 815778 809348 972438 849219 896403 904394 982796 647280
14662F47280N95212r8181q6361j01476J07478J43958k61529L05470k75777q5812
$$ 647280 1242492 1144311 1057950 956474 1063952 1207910 946381 1251851 976074 890262
14652H90262K68558j93372P3487N6643m9121n0304R8751m6598j33005J26136k6567
$$ 890262 1158820 965448 1038935 1095578 1046457 996153 1094904 1048306 915301 1041437 1014870
14641A014870j75774O13412k29313k41919J56641J34363l98841L46548j46344
$$ 1014870 839096 1452508 1223195 981276 1137917 1272280 873439 1219987 1073643
14632A073643J99084m7255L9870j95476J80097j05021o586M6612P0441Q653J64358
$$ 1073643 1272727 1225472 1265342 1069866 1249963 1144942 1138356 1184968 1255409 1264062 1428420
14621A428420l38020J65659j74279K25476k60163J08318o3516J46792o1745k05468
$$ 1428420 1090400 1256059 1081780 1307256 1047093 1155411 1091895 1238687 1176942 971474
14611I71474O18414k67427r5778L55531k05145l89811N02957N9625O3291o9249
$$ 971474 1589888 1322461 1226683 1582214 1377069 987258 1490215 1549840 1613131 1543882
14601A543882j16105p3157L34018k99186J94156k08831J10159o9084J28753m3960
$$ 1543882 1427777 1354620 1688638 1389452 1583608 1374777 1484936 1415852 1544605 1500645
14591A500645M4286m1415j2721J45790o8772J3219j89450K96302J13109p3545
$$ 1500645 1544931 1503516 1490795 1636585 1567813 1581032 1391582 1687884 1800993 1727448
14581A727448J93392k4543J37125n87299M96654j34485p3101K28491J72838j04198
$$ 1727448 1920840 1896297 2033422 1446123 1942777 1808292 1735191 1963682 2136520 2032322
14571B032322l93753J84626K9312j22652M00011j33203Q2448n6750M86166m51295
$$ 2032322 1638569 1823195 1852507 1729855 2129866 1996663 2079111 2022361 2508527 2057232
14561B057232L42483J42831k25981K57028k96351N16085j06048L11709L16534
$$ 2057232 2399715 2542546 2316565 2573593 2277242 2793327 2687279 2998988 3315522
14552C315522L46685P27622L78593J733093L739683Q199480K1763754J147418
$$ 3315522 3662207 4389829 4768422 6501515 10241198 18440678 40204432 41351850
14544D1351850A7279468G147887l283790r69941r24479j04762q1810L081K97003
$$ 41351850 17279468 7147887 3864097 2894156 1969677 1864915 1783105 1786186 2083189
14535B083189m89617L81808j69360J80587k79049J25154M13388m07051K7701J46724
$$ 2083189 1593572 1975380 1806020 1986607 1707558 1832712 2246100 1839049 1866750 2013474
14525B013474L03231k14267K8491J79286m640J61696J7987k69522N1958M1084
$$ 2013474 2316705 2102438 2130929 2310215 2305575 2467271 2485258 2215736 2267694 2308778
14515B308778L34405J40149l18774r545j60248M1326J48824j33055K98951M0486
$$ 2308778 2643183 2783332 2464558 2455013 2294765 2336091 2484915 2351860 2650811 2691297
14505B691297j27110j14784K03976j06277K01013J74259m13899O58345l69101
$$ 2691297 2564187 2449403 2653379 2547102 2748115 2922374 2508475 3166820 2797719
14496B797719J35414j96253J24209j0590p4972J28606l018J80682o4432M81547
$$ 2797719 2933133 2736880 2861089 2850499 2775527 2904133 2901115 3081797 3017365 3498912
14486C498912m58367L29139J92353k10429P9232L3362J70252k34143L0832K14811
$$ 3498912 3040545 3369684 3562037 3351608 3430840 3464202 3634454 3400311 3431143 3645954
14476C645954j20005N7846k802L0051K58827O5347j68949J80673J58863N0195
$$ 3645954 3525949 3583795 3580993 3611044 3869871 3935218 3766269 3946942 4105805 4156000
14466D156000k6304k81427N00792k68827L46832l2229k53911J81467k2375K25613
$$ 4156000 4129696 3848269 4349061 4080234 4427066 4394837 4140926 4322393 4300018 4525631
14456D525631j17695K63116j50455Q3693m1505O10734m71002M12581j92393K99140
$$ 4525631 4407936 4671052 4520597 4604290 4562785 5173519 4702517 5115098 4922705 5221845
14446E221845k99731J79700L13919m6925j6099j08410j73335N81896l06486L39055
$$ 5221845 4922114 5101814 5415733 5368808 5352709 5244299 5070964 5652860 5346374 5685429
14436E685429k11968L11130k64105O1594M80621L3231L78976n904l34565N90988
$$ 5685429 5473461 5784591 5520486 5582080 6062701 6095932 6474908 6469004 6134439 6725427
14426F725427m72330L76089l9806k925J38513L69243J37200k99650M09728O5527
$$ 6725427 6253097 6629186 6589380 6586455 6724968 7094211 7231411 6931761 7341489 7407016
14416G407016K18170k6198M54L17423M11644k72384o8703L56663k15061O21798
$$ 7407016 7625186 7598988 7599442 7916865 8328509 8056125 7987422 8344085 8129024 8750822
14406H750822J9246j1164L3973L9990L10278j17086Q26052l19902L04657K79181
$$ 8750822 8770068 8758904 8792877 8832867 9143145 9026059 9852111 9532209 9836866 10116047
14396A0116047m02504O56486j21484L21746J43417J56944N07690j56763L93724
$$ 10116047 9713543 10370029 10248545 10570291 10713708 10870652 11378342 11221579 11615303
14387A1615303J52810j72006M62893M25755k06773L51097M60550j67829M40502
$$ 11615303 11768113 11596107 12059000 12484755 12277982 12629079 13089629 12921800 13362302
14378A3362302J41259O59529j66552L39746N76657K93761Q8336L39464M24348
$$ 13362302 13503561 14163090 13996538 14336284 14912941 15206702 15295038 15634502 16058850
14369A6058850J79056O02247L42844J83159J64388M64087M41426O35066J68679
$$ 16058850 16237906 16840153 17182997 17366156 17530544 17994631 18436057 19071123 19239802
14360A9239802M33719L45239Q51796L0485J81349Q94094O54385M19654L57495
$$ 19239802 19673521 20018760 20870556 20901041 21082390 21976484 22630869 23050523 23408018
14351B3408018R05028N96208K81244O45235O34925Q21336N28053P23786P88979
$$ 23408018 24313046 24909254 25190498 25835733 26470658 27291994 27820047 28543833 29332812
14342B9332812R26180J001864L99953J118069P87015R46258J045041J082793J048084
$$ 29332812 30258992 31260856 31660809 32778878 33565893 34512151 35557192 36639985 37688069
14333C7688069J150062J176459R50538J453377J314723J720363J099063J361833
$$ 37688069 38838131 40014590 40965128 42418505 43733228 45453591 46552654 47914487
14325D7914487J836495J944787J653880J599602J982962K100956K023401J988099
$$ 47914487 49750982 51695769 53349649 54949251 56932213 59033169 61056570 63044669
14317F3044669K433467K204626K971701K253952K956106L097992K974531L374396
$$ 63044669 65478136 67682762 70654463 72908415 75864521 78962513 81937044 85311440
14309H5311440L733370L735662L743300L990702M225828M821227M997201N438371
$$ 85311440 89044810 92780472 96523772 100514474 104740302 109561529 114558730 119997101
14301A19997101N260676N703726N989598P199568O829620P546215P946640Q167591
$$ 119997101 125257777 130961503 136951101 144150669 150980289 158526504 166473144 174640735
14293A74640735Q926500R481129R921784J0311300J1574881J1228718J1950822
$$ 174640735 183567235 193048364 202970148 213281448 224856329 236085047 248035869
14286B48035869J2908049J3447190J3277160J3945565J4367990J4605371J4469128
$$ 248035869 260943918 274391108 287668268 301613833 315981823 330587194 345056322
14279C45056322J4001425J4100887J2962693J2439381J1123987R306521O534609
$$ 345056322 359057747 373158634 386121327 398560708 409684695 418991216 425525825
14272D25525825J887294J41062M47390l09628m724311n209844o866807r499854
$$ 425525825 427413119 427554181 428001571 427691943 422967632 417757788 410890981 401391127
14264D01391127r217741j0295344j3006142j3857477j3914118j4564650j4459829
$$ 401391127 392173386 381878042 368871900 355014423 341100305 326535655 312075826
14257C12075826j4837187j4892932j3925501j2835928j2970653j2799031j1650251
$$ 312075826 297238639 282345707 268420206 255584278 242613625 229814594 218164343
14250B18164343j1155247j0517848j0043950r532404q951948q030314p564028
$$ 218164343 207009096 196491248 186447298 176914894 167962946 159932632 152368604
14243A52368604p407225p210575o544921o032713n902520n080539n142436m756257
$$ 152368604 144961379 137750804 131205883 125173170 119270650 114190111 109047675 104291418
14235A04291418m967242m022974m177709l527416l333333l431704l553598k856687
$$ 104291418 99324176 95301202 91123493 87596077 84262744 80831040 77277442 74420755
14227G4420755k854970k958093k468840k435677k312674k302426k252798j712142
$$ 74420755 71565785 68607692 66138852 63703175 61390501 59088075 56835277 55123135
14219E5123135j932175j870146j586831j490925j547199j308501j405991j360970
$$ 55123135 53190960 51320814 49733983 48243058 46695859 45387358 43981367 42620397
14211D2620397j413669j215235j085813j470755k86599j176005j420805r89095
$$ 42620397 41206728 39991493 38905680 37434925 37148326 35972321 34551516 33562421
14203C3562421p42186j100337m67243l45047j319462p08764r74289p18917o56938
$$ 33562421 32820235 31719898 31252655 30907608 29588146 28879382 27905093 27186176 26529238
14194B6529238j28969o71562q06624p90972j048038j80493k59481p19463k62684
$$ 26529238 26400269 25728707 24922083 24131111 23083073 22902580 22643099 21923636 21660952
14185B1660952p09023l40695p61370k65238k61823p96138K2784m61737l03215
$$ 21660952 20951929 20611234 19849864 19584626 19322803 18526665 18549449 18087712 17784497
14176A7784497m88144l87725j69731q73665P7694m03491k8928o59071j87262k18165
$$ 17784497 17296353 16908628 16738897 15865232 15942926 15539435 15510507 14851436 14664174 14446009
14166A4446009j95670l37266j64915j40971j97953l40080o80738J62627l08984
$$ 14446009 14250339 13913073 13748158 13607187 13409234 13069154 12388416 12551043 12242059
14157A2242059j25900m0323m47220l65197j35418k27569K15639m91167o142j07283
$$ 12242059 12116159 12075836 11628616 11263419 11128001 10900432 11116071 10624904 10618762 10511479
14147A0511479m61522j88117J11007j55870l21503M41700q61858K09322k62041
$$ 10511479 10049957 9861840 9972847 9816977 9495474 9937174 9075316 9284638 9022597
14138I022597L4571n07207k27285j72683j05464R4633J32357k93977j09175n2878
$$ 9022597 9057168 8549961 8322676 8149993 8044529 8139162 8271519 7977542 7868367 7815489
14128G815489m60880K9577R1064k48632l09040L93203k35873p9109j62140J6590
$$ 7815489 7354609 7384186 7475250 7226618 6917578 7310781 7074908 6995799 6833659 6850249
14118F850249o0771l61834L56339n06727J59884k4959l05293Q0311k22547p9366
$$ 6850249 6789478 6427644 6783983 6277256 6437140 6412181 6106888 6187199 5964652 5885286
14108E885286J75138l32195o062J5071k2955k02317j8285j06482J43651k84539
$$ 5885286 6060424 5728229 5722167 5737238 5714283 5511966 5493681 5387199 5530850 5246311
14098E246311O1860j39341j9393m9929p0647m056k96334k6240L53799l89531R706
$$ 5246311 5308171 5168830 5149437 5099508 5028861 5024805 4728471 4702231 5056030 4666499 4676205
14087D676205l78062Q0577j09625J12450j93384K25501q5354J04948k76021Q0041
$$ 4676205 4298143 4378720 4269095 4381545 4188161 4413662 4328308 4433256 4157235 4237276
14077D237276K1970k72878l018j55806J49561j46078P281R6171j96145P2287j76891
$$ 4237276 4259246 3986368 3983350 3827544 3977105 3831027 3838308 3934479 3738334 3810621 3633730
14066C633730J34862k54543K27087R850p5430j59756J16193N1579j33621K0518
$$ 3633730 3768592 3514049 3741136 3750986 3675556 3515800 3631993 3683572 3549951 3570469
14056C570469m10207K09077o7934J88206j70593j45488l2320j26670o1490r5873
$$ 3570469 3160262 3369339 3301405 3489611 3319018 3173530 3141210 3014540 2953050 2857177
14046B857177K64806L9862l64433o5967J98106j10640P9660p7296j66010M5094
$$ 2857177 3121983 3161845 2797412 2731445 2929551 2818911 2898571 2821275 2655265 2700359
14036B700359L0096r9073P8315l6976N6338K31060n1734j8723j72957O7375l09410
$$ 2700359 2730455 2631382 2709697 2672721 2729059 2960119 2908385 2889662 2716705 2784080 2474670
14025B474670o5737j51815j2362L59205k09365J18211j11181k35308M2532j44616
$$ 2474670 2408933 2257118 2244756 2603961 2394596 2512807 2401626 2166318 2208850 2064234
14015B064234P4723M73554l37542J47588m78029K37199K11817k82891j4245k2442
$$ 2064234 2138957 2612511 2274969 2422557 1944528 2181727 2393544 2110653 2096408 2073966
14005B073966P0432k13299j42113J74889O8572l58024R9167L12418j26706O3763
$$ 2073966 2144398 1931099 1788986 1963875 2032447 1674423 1773590 2086008 1959302 2023065
13995B023065k15932n3840k69016L14441L53784k54627N39767K454235O004754
$$ 2023065 1807133 1753293 1484277 1798718 2152502 1897875 2437642 4891877 10896631
13986A0896631J7811298J8510242B1838742j0522052l966641j869894r63647q13846
$$ 10896631 28707929 47218171 21838742 11316690 7350049 5480155 4516508 3702662
13978C702662p03482M7847l82201Q7408j58391j04470r5028k53225j11337O7675
$$ 3702662 2999180 3047027 2664826 2752234 2593843 2489373 2394345 2141120 2029783 2097458
13968B097458J87329q358k72211l16347O1780L03180R3503k99809l7272J60378
$$ 2097458 2284787 2276429 2004218 1687871 1749651 2052831 2146334 1846525 1809253 1969631
13958A969631J211j04399J55186l30370K03599L6899J38826j40924k04459n8340
$$ 1969631 1970842 1866443 2021629 1691259 1894858 1931757 2070583 1929659 1725200 1666860
13948A666860J28332J19294m23164K8316J78231j23106k2137j6559J12147P8364
$$ 1666860 1795192 1914486 1491322 1519638 1697869 1574763 1552626 1536067 1648214 1726578
13938A726578o684j15745k10561M61261l11319j31513k6731P1027k44825L7613
$$ 1726578 1719894 1604149 1393588 1854849 1543530 1412017 1385286 1456313 1211488 1249101
13928A249101J4160K08697k60516K22679j73139L19828m61782M67266j35461k1541
$$ 1249101 1263261 1471958 1211442 1434121 1260982 1580810 1119028 1586294 1450833 1429292
13918A429292q2562k71231L68211j19430K3397L23001m06160R3251j94547J37119
$$ 1429292 1346730 1075499 1443710 1324280 1347677 1670678 1264518 1357769 1163222 1300341
13908A300341J34058l60118N4469K4509j65380L45623j72183K63061k68976R9623
$$ 1300341 1434399 1074281 1128750 1153259 987879 1333502 1161319 1424380 1155404 1255027
13898A255027r1377l0459O4567Q5362j22416L88306k94785j77690l24367L81675
$$ 1255027 1163650 1133191 1197758 1283120 1160704 1549010 1254225 1076535 752168 1133843
13888A133843J03539k33863L4418L40358m65926R4712J69542l12436J92071k24600
$$ 1133843 1237382 1003519 1037937 1378295 912369 1007081 1176623 864187 1056258 831658
13878H31658J67120n0935k19752L40700P7126k22075J80127k11012K54530l19157
$$ 831658 998778 947843 728091 1068791 1145917 923842 1103969 892957 1147487 828330
13868H28330L36482p3320k55486J44547L3340N8542o5476M9k36549j04200j9536
$$ 828330 1164812 1091492 836006 980553 1013893 1072435 1006959 1007008 770459 666259 646723
13857F46723L99125k55196K12357J39282j74542j92005q7996J54314k12685K80593
$$ 646723 1045848 790652 1003009 1142291 967749 775744 687748 842062 629377 909970
13847I09970m0830K24409j14856k40749P1027J34937k12932l827M73118k13513
$$ 909970 869140 1093549 978693 737944 808971 943908 730976 727149 1200267 986754
13837I86754o5049l62445L62083N7679o225p7939K4654q0843R8207k82584M5326
$$ 986754 921705 559260 921343 979022 972797 894858 919512 838669 936876 654292 699618
13826F99618o2566M4936k65393O72200j64834j36583l7270J13459j62994L16138
$$ 699618 637052 681988 416595 1088795 923961 787378 750108 863567 700573 1016711
13816A016711k81233Q6202j45744C08392L94739K15361M559j67923L47112l63012
$$ 1016711 735478 821680 675936 308392 703131 918492 923051 755128 1102240 739228
13806G39228R788j23617J22171L8454K49499D57556L6364J76758k4123J03078
$$ 739228 749016 625399 747570 786024 1035523 457556 493920 670678 646555 749633
13796G49633K23479k40340j29823K76262k01705Q4838k07515N1956k89770k8033
$$ 749633 973112 732772 602949 879211 677506 762344 554829 606785 317015 288982
13786B88982J85567L83140k36402n9595M8061J18876N394j58310K38638l39235
$$ 288982 474549 857689 621287 561692 609753 728629 734023 575713 814351 475116
13776D75116Q1534j61867M4762Q4078l9428M1375L06720C52698L41276l35060
$$ 475116 556650 394783 439545 523623 484195 525570 832290 352698 693974 358914
13766C58914L57700j13350k14701L16377K2810k4185J041n6000m502k74891J88400
$$ 358914 716614 603264 388563 704940 727750 703565 704606 648606 644104 369213 557613
13755E57613m3188K0517j05983M10452j72785l3776k08284J69378j41815K89518
$$ 557613 514425 534942 428959 839411 666626 632850 424566 593944 452129 741647
13745G41647k52355n8020J6603J59325j6557N1543j05506q0382K16258j12717
$$ 741647 489292 431272 447875 607200 590643 642186 536680 456298 672556 559839
13735E59839r914M2415K7707n3912j20512J84356j40454N3164j3241J10375q1786
$$ 559839 549925 592340 620047 566135 445623 629979 489525 542689 529448 639823 558037
13724E58037B37895L09500j13772H9898M89443k76747m3711K50753J01773J68100
$$ 558037 237895 547395 433623 89898 579341 302594 258883 509636 611409 779509
13714G79509k79011M5275j98470K90238K651j6968J77980l91783K32555K8506
$$ 779509 500498 545773 347303 637541 640192 623224 801204 409421 641976 670482
13704F70482j00510B26252K53522j32371j07959K74789A50103L42498J69404B43012
$$ 670482 569972 226252 479774 347403 239444 514233 150103 492601 662005 243012
13693D04569L02093l14235O5048Q6979B07965M99205J32420A31894J39648M2005
$$ 404569 706662 392427 457475 544454 207965 707170 839590 131894 271542 313547
13683C13547O7929J53982M0766j6670j73908M6911R7774j25146j90235K11224
$$ 313547 381476 535458 576224 559554 385646 432557 530331 405185 214950 426174
13673D26174p5654K7253J07252M5195J97949l57070n0135K02666A24078K23362
$$ 426174 350520 377773 485025 530220 728169 371099 320964 523630 124078 347440
13663C47440o3924J98129M526R7376l3608j84935k5140j53952M15515B92804J77791
$$ 347440 283516 481645 486171 583547 549939 365004 339864 185912 601427 292804 470595
13652D70595M6945j60870A78001J45238P275R1627j30291N5638q9723M1667j30865
$$ 470595 517540 356670 178001 323239 330514 422141 291850 347488 257765 299432 168567
13641A68567K06098L15280B88853j08636K77566J68442A11986R3184L15326j46934
$$ 168567 374665 689945 288853 180217 457783 626225 111986 205170 520496 373562
13631C73562K10200j43357l2936j46744K0105A08463m6363J75720K64947j0698
$$ 373562 583762 440405 407469 260725 280830 108463 62100 237820 502767 492069
13621D92069B13133K43849J43489i34B58283L00546R5547k14121j22871o5770
$$ 492069 213133 456982 600471 -934 258283 558829 654376 440255 317384 251614
13611B51614J26884J41956j29420A57860J6967K51143j41048F5745L13989R8969
$$ 251614 378498 520454 391034 157860 174827 425970 284922 65745 379734 478703
13601D78703B07912L23190F3862H100K28629J95605O0628j73631N1361J06654
$$ 478703 207912 531102 63862 8100 236729 432334 492962 319331 370692 477346
13591D77346E1143L36207K40789j58695k7347j49470r2620M99722C43242q9413
$$ 477346 51143 387350 628139 469444 442097 292627 200007 699729 343242 253829
13581B53829n0551N8936J99310M1649k38785A21585K35822D6023L97736k12572
$$ 253829 203278 262214 461524 503173 264388 121585 357407 46023 443759 231187
13571B31187M2398p5767r3798H551J79303K20669A37477J99910A10737N4216J01616
$$ 231187 273585 197818 104020 8551 187854 408523 137477 337387 110737 164953 266569
13560B66569L09983j92430J36471R6991j69151J9905A18333Q3112R6467o7028
$$ 266569 576552 384122 520593 617584 448433 468338 118333 201445 297912 230884
13550B30884Q9990j04948A1441L35016k6748J05223A32429J63872K13126A91008
$$ 230884 320874 215926 11441 346457 319709 424932 132429 296301 509427 191008
13539B39806L21907B62867J96140j62973J00237A28808K74890j57700p9596D0201
$$ 239806 561713 262867 459007 296034 396271 128808 403698 245998 166402 40201
13528A63004j394O8799j12886L6759Q7151J47014j82264J28720o5560G6353J73362
$$ 163004 161610 230409 117523 154282 241433 388447 206183 334903 269343 76353 249715
13517B49715k7123J67891A78678J71937p3165N0593A16541R7867q1843m6832q558
$$ 249715 222592 390483 178678 350615 277450 328043 116541 214408 132565 85733 77175
13506G7175c9556j5436C3330L01676j24521J90471j96172J40674A23242L02248
$$ 77175 -39556 -54992 33330 335006 210485 400956 204784 345458 123242 425490
13496D25490a16040B94146a35538D47215c0110B20402o8133L01130o7641j74992
$$ 425490 -116040 294146 -135538 447215 -30110 220402 152269 453399 385758 210766
13486B10766p513J55870j25496k4551k559L8570A10520e841D93536H9191N9170
$$ 210766 203253 359123 233627 209076 206517 245087 110520 -5841 493536 89191 148361
13475A48361k6034M9630F3447e650B13889o2890K81331j87166E9018L85927f777
$$ 148361 122327 171957 63447 -5650 213889 150999 432330 245164 59018 444945 -6777
13463C34950j37038J66850A56827O1961J14225j43647J0597M9544j21311b2354
$$ 334950 197912 364762 156827 218788 333013 189366 199963 249507 128196 -22354
13452D54940I9017a03073B46138A18285M88573F3355M4880J43503k2609i044A56890
$$ 454940 99017 -103073 246138 118285 606858 63355 108235 251738 229129 -9044 156890
13440F2110D588K2230f6314B45147G5992L16928A27822K77299l6089l3657o7359
$$ 62110 4588 26818 -66314 245147 75992 392920 127822 405121 369032 335375 268016
13429B68016m6507M709P0639j37235F8253L06217A19318N8898M0973A9275Q4487
$$ 268016 221509 226218 296857 159622 68253 374470 119318 178216 219189 19275 103762
13418A03762K3964R3190I1145K58554A32428J90114E0950M045e7689D21101I0519
$$ 103762 127726 220916 91145 349699 132428 322542 50950 54995 -57689 421101 90519
13406g6630C99220j99117J19951h455B03034F0040K20320o3883J24234N5138a50594
$$ -76630 399220 200103 320054 -8455 203034 60040 280360 216477 340711 395849 -150594
13394A21249K21469j41526L27844B12184J39826q9429p1976l8475L91821G4389
$$ 121249 342718 201192 529036 212184 352010 262581 190605 152130 543951 74389
13383B23118I1950a29400B16253J23292j23255N1320I128J1436a67925C47959
$$ 223118 91950 -129400 216253 339545 216290 267610 9128 20564 -167925 347959
13372a58083D74439A59256h6752B24755J80883A36940F1050J24710N2188g209
$$ -158083 474439 159256 -86752 224755 405638 136940 61050 185760 237948 -7209
13361D24447M47242H0590N7641L30572a30119A96001c6037J0380B68299r0007
$$ 424447 871689 80590 138231 468803 -130119 196001 -36037 -25657 268299 178292
13351A78292L3478l5282Q7877R7632J26211a24677B13763L32090k54751Q5500
$$ 178292 211770 176488 264365 361997 488208 -124677 213763 545853 291102 376602
13341C76602j15479j19246K89712B02315p4978J25397R8577o336a86145I6268
$$ 376602 261123 141877 431589 202315 127337 252734 351311 344975 -186145 96268
13330B38100c0445p4009A93970K00930E2610J48778B188L31936K2467P511A14061
$$ 238100 -30445 -104454 193970 394900 52610 201388 2188 334124 356591 364102 114061
13318C22376j32916h7133j5437E38024B04158b3274E37620k48233p19o7060b1122
$$ 322376 189460 -87133 -102570 538024 204158 -23274 537620 289387 288668 221608 -21122
13306a2435F6999b01319D1209h1786a6832H0103Q9385b57200C12876D6214J24824
$$ -12435 66999 -201319 41209 -81786 -16832 80103 169488 -257200 312876 46214 171038
13295A71038J16924A08293K10702J00921C5221b08894d0607A16761d1085A49671
$$ 171038 287962 108293 318995 419916 35221 -208894 -40607 116761 -41085 149671
13284B68037a9365k92160G3240R5738h6327j01279E6385J18543l6440E2140P7816
$$ 268037 -19365 -311525 73240 168978 -86327 -187606 56385 174928 138488 52140 129956
13273A29956J14896j01025a42258k16112I3744J96135a49334b1142A96251n7712
$$ 129956 244852 143827 -142258 -358370 93744 289879 -149334 -21142 196251 138539
13263A38539a47390I016K27898A10307m3014M4782n722J06518d9431f050C3036
$$ 138539 -147390 9016 236914 110307 67293 112075 106353 212871 -49431 -6050 33036
13251A74157j933q0247L7652a60730C35074I445a56124C63955d9643B6506J76663
$$ 174157 172224 91977 129629 -160730 335074 9445 -156124 363955 -49643 26506 203169
13240B03169i29A25207j533J33411j045b06337A97385D2028J66288D0863J30017
$$ 203169 -929 125207 123674 257085 256040 -206337 197385 42028 208316 40863 170880
13229A70880M0728p2366F6707f5054A33991a89359A20307a4183B49665D6669b0269
$$ 170880 211608 139242 66707 -65054 133991 -189359 120307 -14183 249665 46669 -20269
13217b23536A09578a63699O4920H9919J42748r4133P898D5229M6373A3177M36460
$$ -223536 109578 -163699 -98779 89919 232667 138534 146432 45229 91602 13177 449637
13206D49637I5341K4098a14675r7459R8701G8591L5491B9024J28523J6485e9612
$$ 449637 95341 119439 -114675 -212134 -113433 78591 114082 29024 157547 174032 -59612
13194c97842A96877I1570a04374N1994l1516a0712o9836A01087k8493d6916B00585
$$ -397842 196877 91570 -104374 -52380 -83896 -10712 -80548 101087 72594 -46916 200585
13182F0771L780b18173B3078K33303o522n6601d1276A37272D6531b14909B19248
$$ 60771 64551 -218173 23078 256381 249859 193258 -41276 137272 46531 -214909 219248
13170B3626c31975L1505C83922C6541b75230a24660d944q6740E4957g4180A86309
$$ 23626 -331975 -300470 383922 36541 -275230 -124660 -4944 -91684 54957 -74180 186309
13158a14037n728A62935r544a55616A2496M29323j83142e2659A346f6503B2016
$$ -114037 -119765 162935 153391 -155616 12496 441819 258677 -52659 1346 -66503 22016
13146B97313E8109A8793d2115B41717J13982H2648J9153a00305A02221N3375a41178
$$ 297313 58109 18793 -42115 241717 355699 82648 101801 -100305 102221 155596 -141178
13134A31361K41736q0039A18296K67154a96830a1926C7928L8624K05935J4864
$$ 131361 373097 293058 118296 385450 -196830 -11926 37928 76552 282487 297351
13124B97351a07952A69495b25147a448A75367n66l9885h3883I9990J18498g1938
$$ 297351 -107952 169495 -225147 -1448 175367 174801 134916 -83883 99990 218488 -71938
13112a0359C10002r9549J03630A12796b47969C18003D6416R3863J49821A23582
$$ -10359 310002 210453 314083 112796 -247969 318003 46416 140279 290100 123582
13101d81100A88676p7270e3191C0365M535e890l18906O3908h166B20700a77269
$$ -481100 188676 111406 -53191 30365 34900 -5890 -324796 -260888 -8166 220700 -177269
13089d6194A95096K34465E1852J41702q2986h4618j58876g0770B68466F800J04560
$$ -46194 195096 429561 51852 193554 110568 -84618 -243494 -70770 268466 6800 111360
13078A11360b37429j8574A08471C034d20607G7981e5031A47345o2731M3381j6080
$$ 111360 -237429 -256003 108471 3034 -420607 77981 -55031 147345 84614 127995 111915
13067A11915h9348q7249A28876B2176M3525A7835K0846a19276B04677G2942j7036
$$ 111915 -89348 -176597 128876 22176 65701 17835 38681 -119276 204677 72942 55906
13056E5906Q3678l1903J99789a77051h2067A75633M5004O6651j21381N1212l0807
$$ 55906 139584 107681 307470 -177051 -82067 175633 220637 287288 165907 217119 186312
13045A86312m6521J12979L8760a37112D9815K13014E0328Q0528c03049i1569A5767
$$ 186312 139791 252770 291530 -137112 49815 262829 50328 130856 -303049 -91569 15767
13033E9452L8546a17729B02149d9583D7975K26074a71735M6091J315A70578K64710
$$ 59452 97998 -117729 202149 -49583 47975 274049 -171735 -125644 -124329 170578 435288
13022D35288r483A48497C5674R0780D2382L8397a7137G6128b16418B27601q6199
$$ 435288 425805 148497 35674 126454 42382 80779 -17137 76128 -216418 227601 141402
13011A41402a19591q7273B10700F7625L9133m0631b6716k3293j6002B39402E9111
$$ 141402 -119591 -206864 210700 67625 106758 66127 -26716 -50009 -66011 239402 59111
12999D8559a14772A02970b52527D33705a65272G8542K33505c800o520k7154l5783
$$ 48559 -114772 102970 -252527 433705 -165272 78542 312047 -3800 -10320 -37474 -73257
12988g3257B94799C1764a79574E9375b016A79579F8118a44646a4708j21329B05344
$$ -73257 294799 31764 -179574 59375 -2016 179579 68118 -144646 -14708 -136037 205344
12976D25971p4442E6405j4031L28365b74505A92291I3839b436m4715a8197B24172
$$ 425971 351529 56405 42374 370739 -274505 192291 93839 -2436 -47151 -18197 224172
12964a51539L0383G4467d4508k53314G2923Q550a05329k32086g2966B35793d6967
$$ -151539 -121156 74467 -44508 -297822 72923 81473 -105329 -337415 -72966 235793 -46967
12952d6904B71017d9215H006M9261b49102J04347H0147R8443P4314h292B23022
$$ -46904 271017 -49215 8006 57267 -249102 -144755 80147 178590 252904 -8292 223022
12940A2219d3719l6997C71754f4326j22668J1312N0651k7608C15558q3732a7483
$$ 12219 -43719 -80716 371754 -64326 -186994 -175682 -125031 -152639 315558 231826 -17483
12928b69850h9531J9613E463a7561k21421Q1262k9815B0639a35179O5731A52220
$$ -269850 -89531 -69918 5463 -17561 -238982 -157720 -187535 20639 -135179 -69448 152220
12916B14556C8815l180b46406N8262B54269j20909m7070e4719A47664a17814B20290
$$ 214556 38815 35635 -246406 -188144 254269 133360 86290 -54719 147664 -117814 220290
12904d7743l3235j88796A74757a09854M2444H8615K80989b5522r2572K1386r2250
$$ -47743 -80978 -269774 174757 -109854 -67410 88615 369604 -25522 -118094 -96708 -188958
12893a88958g9850A18651b00096A28268b20611I0186K5092P4959q219a46680b4118
$$ -188958 -79850 118651 -200096 128268 -220611 90186 115278 190237 182018 -146680 -24118
12881b03315a9508l8837D6460A7743M6069d8681k2916B37871d0418q529j82122
$$ -203315 -19508 -58345 46460 17743 63812 -48681 -71597 237871 -40418 -48947 -231069
12870b31069A34731c4803k17861B3090J52610a60976A08148d0794I4903K14160
$$ -231069 134731 -34803 -252664 23090 175700 -160976 108148 -40794 94903 309063
12860C09063j06570M7183H9599l2142c4521a3454A29704E0559b012A10435C4685
$$ 309063 202493 249676 89599 57457 -34521 -13454 129704 50559 -2012 110435 34685
12848b09779a0823r8005A34223b78118b6190j11781j06957B2632i399A68041b24997
$$ -209779 -10823 -108828 134223 -278118 -26190 -137971 -244928 22632 -9399 168041 -224997
12836e0442j46686h3274A58242E6822b19666C098K9130J18571a52107m6670A64451
$$ -50442 -197128 -83274 158242 56822 -219666 3098 32228 150799 -152107 -198777 164451
12824E4551K9071f045n7816j12226j48142A4774R7220c3085B0490M39122j91298
$$ 54551 83622 -6045 -63861 -176087 -324229 14774 111994 -33085 20490 459612 268314
12813B68314g456A4226a08415B54976a05289m9835A96063H9616a04211I6653O7256
$$ 268314 -7456 14226 -108415 254976 -105289 -155124 196063 89616 -104211 96653 163909
12802A63909J10322a32974A63893a67543D1415c23280G7187g6078J6281p8327
$$ 163909 274231 -132974 163893 -167543 41415 -323280 77187 -76078 -59797 -138124
12792a38124E43932a59337c2924A19593a20291B8428K42700b38982b7150A32498
$$ -138124 543932 -159337 -32924 119593 -120291 28428 271128 -238982 -27150 132498
12781b9409B07144d149I5348Q9368a62237C21218b7821r4900B12481j2480E3286
$$ -29409 207144 -4149 95348 184716 -162237 321218 -27821 -122721 212481 200001 53286
12769a22930r1656c8215j79019C82290a09442A91521a18725l5358c8539A6393
$$ -122930 -214586 -38215 -217234 382290 -109442 191521 -118725 -154083 -38539 16393
12758A53604J1623g5335j25654D0240J084K38782F7949J22456G2154N8062c51
$$ 153604 165227 -75335 -200989 40240 41324 280106 67949 190405 72154 130216 -351
12746B34977d35021a15300j2245C10203f5891B97363b6903o4086B32734k7656
$$ 234977 -435021 -115300 -127545 310203 -65891 297363 -26903 -90989 232734 205078
12736B05078r6682J77023h397j10853m1463d4999B27184i0072A6596a6338A26193
$$ 205078 108396 285419 -8397 -119250 -160713 -44999 227184 -90072 16596 -16338 126193
12724H426d14844a799A04698b85897n340P9953j6319F1732l819R6648G0926K9885
$$ 8426 -414844 -1799 104698 -285897 -291237 -211284 -227603 61732 57913 154561 70926 100811
12712A00811a6704m2735B97171a24793A21666b4391B44182J27016H8451A1548
$$ 100811 -16704 -59439 297171 -124793 121666 -24391 244182 371198 88451 11548
12701B41207J34312e0638B11241E5153k1404J29732b34187B71963A1971d0024
$$ 241207 375519 -50638 211241 55153 33749 163481 -234187 271963 11971 -40024
12690D7570a80806e793a267C13790A18260L5780L0668a32507A24059a60135B13584
$$ 47570 -180806 -5793 -1267 313790 118260 154040 184708 -132507 124059 -160135 213584
12678A28603a9858m3751D60721a08254A24734b774j98271e417D8216h7086D7121
$$ 128603 -19858 -63609 460721 -108254 124734 -2774 -201045 -5417 48216 -87086 47121
12666A83597d9658p4083A3745J11462J48518a04142A25051e822C27917H4580J22332
$$ 183597 -49658 -123741 13745 125207 273725 -104142 125051 -5822 327917 84580 206912
12655B06912a12078D7611K79969c1331A62771b8310j54155A94814b28798j91490
$$ 206912 -112078 47611 327580 -31331 162771 -28310 -182465 194814 -228798 -420288
12645d20288K09986g125j43433B65752O4856A41659J39083C2417K34138A09867
$$ -420288 -210302 -7125 -150558 265752 330608 141659 280742 32417 266555 109867
12634A8975J91072m1984D3027a11153E1547L59501K71743B3185g8487C12351I0520
$$ 18975 210047 168063 43027 -111153 51547 411048 682791 23185 -78487 312351 90520
12622G7565P5873J9945a8304B52733A11739m1130K23440A0839N4156d568k81179
$$ 77565 153438 173383 -18304 252733 111739 70609 294049 10839 64995 -4568 -285747
12611b85747A5131a75951A39874c8451A06417J8049Q2630b34178F7449k1891g1677
$$ -285747 15131 -175951 139874 -38451 106417 124466 207096 -234178 67449 45558 -71677
12599b268B03756r545p6094g8769l0553k8370d8031I1215P4182G7126K22165A16489
$$ -2268 203756 194211 118117 -78769 -109322 -137692 -48031 91215 165397 77126 299291 116489
12586g125C22862b15538b8393A30548K10711H2798P180L832B5404K35695c00786
$$ -7125 322862 -215538 -28393 130548 341259 82798 89978 93810 25404 261099 -300786
12574A36475Q341J1947d0742A33774b36857l9052a06933A84231B7143J14195J3945
$$ 136475 144816 156763 -40742 133774 -236857 -275909 -106933 184231 27143 141338 155283
12563A55283a73212A87950a61525j78182B10401i7615k8063B28787G1163l2468
$$ 155283 -173212 187950 -161525 -339707 210401 -97615 -125678 228787 71163 38695
12553C8695K1622J10671l3156b751G4365a18604q8034Q0086A23619n5539a69608
$$ 38695 60317 170988 137832 -2751 74365 -118604 -206638 -126552 123619 68080 -169608
12541a42301G1111a71909G4501b42102G9710N0691k8093Q7185H3868k3302N0483
$$ -142301 71111 -171909 74501 -242102 79710 130401 102308 189493 83868 60566 111049
12530A11049J96340c42392A6420b50146A9262J8193k621j3748b76437c75j25186
$$ 111049 307389 -342392 16420 -250146 19262 37455 34834 21086 -276437 -375 -125561
12519a25561a3600B25560L6046j04246b60106B1794l303b3897A65755B2452K30308
$$ -125561 -13600 225560 261606 157360 -260106 21794 18491 -23897 165755 22452 252760
12508B52760i8970I4472R385m3390H016b61922A79916K60358a10892j13484I2938
$$ 252760 -98970 94472 103857 60467 8016 -261922 179916 440274 -110892 -224376 92938
12496a26696j42779A31547J35059D4331J07864g7669B21806I8794i7830B63077
$$ -126696 -269475 131547 266606 44331 152195 -77669 221806 98794 -97830 263077
12485b62823h2026B61497a63059j17541D232a50170A07092c15570a8109A64015
$$ -262823 -82026 261497 -163059 -280600 4232 -150170 107092 -315570 -18109 164015
12474F3054b9284G3066b59110a10082r5196A41292O3703K4513I1348J4697j3764
$$ 63054 -29284 73066 -259110 -110082 -205278 141292 204995 229508 91348 106045 92281
12463I2281a17803E6678Q7451K0784B3848a21489A90541b10141M262i0711G9301
$$ 92281 -117803 56678 144129 164913 23848 -121489 190541 -210141 -205879 -90711 79301
12451f407C0979M6619b33538K4966I309B802a45629B04192b36405R4693B25408
$$ -6407 30979 77598 -233538 -208572 9309 2802 -145629 204192 -236405 -141712 225408
12439a93113c9938o0154K1367p5373A78306J097l2229L55256C4399G459J49185
$$ -193113 -39938 -100092 -78725 -154098 178306 179403 147174 502430 34399 7459 156644
12428A56644J4292C283b73567B40553a49696C26852j47530B39d4371R764A97428
$$ 156644 170936 3283 -273567 240553 -149696 326852 179322 239 -44371 -34607 197428
12416C9378L5934k2724K8110K35129a01565r2881F5272a93608A50323i7605l219
$$ 39378 75312 52588 80698 315827 -101565 -194446 65272 -193608 150323 -97605 -100824
12405a00824C16884l3242a11964A3225J20359b11715C2819a17175A18728b58850
$$ -100824 316884 283642 -111964 13225 133584 -211715 32819 -117175 118728 -258850
12394D37917A43741J54362H751b46031A55625a09430P175B57506b76923a32721
$$ 437917 143741 298103 8751 -246031 155625 -109430 -102255 257506 -276923 -132721
12383g3900D6121Q9440a09826c7678G713d26680f4752J5405B09508c41880a66420
$$ -73900 46121 135561 -109826 -37678 7713 -426680 -64752 -49347 209508 -341880 -166420
12371a62857O4150A60463a33161j74081F2653J01909B3814R8063Q5418d7956F347
$$ -162857 -98707 160463 -133161 -307242 62653 164562 23814 121877 207295 -47956 6347
12359A5586c32741A76061L05426H7770a12997M9810j85726c6465A02188K36567
$$ 15586 -332741 176061 481487 87770 -112997 -63187 -248913 -36465 102188 338755
12349C38755e9423B80247a6178k17973h433p5142F9745K50635o1921e2708o9864
$$ 338755 -59423 280247 -16178 -234151 -8433 -83575 69745 320380 258459 -52708 -122572
12338a22572L8066B996b43219f8901j61808i8753L121F8867i9799J1691o5268
$$ -122572 -84506 2996 -243219 -68901 -230709 -98753 -95632 68867 -99799 -88108 -153376
12327a53376A9862i263B14392A04901M2721l9236a01857F1009h6104k9382E6480
$$ -153376 19862 -9263 214392 104901 147622 108386 -101857 61009 -86104 -115486 56480
12315A47212g3643A33854k5978c12208b4522A96718k5400a35742A43438h0260
$$ 147212 -73643 133854 107876 -312208 -24522 196718 171318 -135742 143438 -80260
12304F9122f4486A11580D3380M9490R5571k7383f0429A28753b78646A75266J06304
$$ 69122 -64486 111580 43380 92870 188441 161058 -60429 128753 -278646 175266 281570
12293B81570I5427J34356m065M9818D7105d19082a98534p5628L1691g48F9367
$$ 281570 95427 229783 225718 275536 47105 -419082 -198534 -274162 -242471 -748 69367
12281C5170Q3911j1570g5501A05185J39451j02122R3252p4401I021L2952c02790
$$ 35170 119081 107511 -75501 105185 244636 142514 235766 161365 9021 41973 -302790
12269h2195B6640i2492A01850K54072b3010A82587o3847J39602b1240D5375J16387
$$ -82195 26640 -92492 101850 355922 -23010 182587 118740 258342 -21240 45375 161762
12258A61762J38576h7986D11050c1758r2381o2119C4209K83620a74462L4117B65489
$$ 161762 300338 -87986 411050 -31758 -124139 -186258 34209 317829 -174462 -140345 265489
12246A5646R2892K1427b00853C66905C5007L02778j57372a27055A44077i2774
$$ 15646 108538 129965 -200853 366905 35007 337785 180413 -127055 144077 -92774
12235A29079R9579j01180P1306c3743j57706A2149c7725B68545A2425J8920K52951
$$ 129079 228658 127478 198784 -33743 -191449 12149 -37725 268545 12425 31345 284296
12224B84296m2730k9378d3726j01746C55141a09868A9552R5680K68523F3177A8510
$$ 284296 241566 212188 -43726 -145472 355141 -109868 19552 115232 383755 63177 18510
12212c4255k08381R2217B65917I4898K47469b02525G3174J77687e2216F807N1493
$$ -34255 -242636 -150419 265917 94898 342367 -202525 73174 250861 -52216 6807 58300
12201E8300b71863c8322j25468A02965K08049F826K1535L07327a35I0894f2386
$$ 58300 -271863 -38322 -163790 102965 311014 6826 28361 335688 -135 90894 -62386
12189A43790i0393A67884K63272a65860h1768D805K13583g8972L6114A49007L91472
$$ 143790 -90393 167884 431156 -165860 -81768 4805 218388 -78972 -42858 149007 540479
12178E40479b32132B35364b9492A98376a5850B6863J58926h4810A59842K9071
$$ 540479 -232132 235364 -29492 198376 -15850 26863 185789 -84810 159842 188913
12168A88913R2215m0962A3114K75569j9083D511J08086J72959a1687G7704d80248
$$ 188913 281128 240166 13114 288683 269600 4511 112597 285556 -11687 77704 -480248
12156A64978a89456E6201a7908k79023B38261H9378F74a74104A2909K18456b00125
$$ 164978 -189456 56201 -17908 -296931 238261 89378 674 -174104 12909 231365 -200125
12144E0840I808L25909j28066R2797a42437G6189L25110j99631Q6871r6792b52870
$$ 50840 9808 335717 207651 300448 -142437 76189 401299 201668 288539 191747 -252870
12132A31897J42478a99241B28527b11181C9174K23924j05649L6711a88360E4567
$$ 131897 274375 -199241 228527 -211181 39174 263098 157449 194160 -188360 54567
12121A12855b42813h4239C0572c01k83107B59758A20840B751L04968A1304c4111
$$ 112855 -242813 -84239 30572 -301 -283408 259758 120840 2751 307719 11304 -34111
12109h4131k10236F0370Q0975B1001L21576c50669B3085J74127a43873B04837
$$ -84131 -294367 60370 141345 21001 342577 -350669 23085 197212 -143873 204837
12098a99609C6445J26781F061a26686A116f6684j48409G51J56143d3191J4207
$$ -199609 36445 163226 6061 -126686 1116 -66684 -215093 751 156894 -43191 -28984
12087b8984A23756c9601F7680o18N73903M53912J258794H34004E7380c65566C17210
$$ -28984 123756 -39601 67680 67062 640965 1094877 2353671 834004 57380 -365566 317210
12075C22610j35235J3168B6647K7103J8323C3758c2134F0507b62056A8841a52742
$$ 322610 187375 200543 26647 53750 72073 33758 -32134 60507 -262056 18841 -152742
12063A48808a60296j4539O5323M7617j48557Q2962B66564d09262F4087E891J02028
$$ 148808 -160296 -174835 -109512 -61895 -210452 -127490 266564 -409262 64087 5891 107919
12052A07919d5842G3062k8561a69446K3469B43537c1393C23142F7278a29710A27907
$$ 107919 -45842 73062 44501 -169446 -145977 243537 -31393 323142 67278 -129710 127907
12040C3179e1704E555b50812I0103a4523j50468f5955C4661b48923G8046a68464
$$ 33179 -51704 5555 -250812 90103 -14523 -164991 -65955 34661 -248923 78046 -168464
12028A16994a02277k68311a07279A6600d8757j0542B54060f6593K2497A87638
$$ 116994 -102277 -370588 -107279 16600 -48757 -59299 254060 -66593 -44096 187638
12017A84286H7026a2594B63318a6220j0362k3359D3382L33530C8554b39532a14314
$$ 184286 87026 -12594 263318 -16220 -26582 -49941 43382 376912 38554 -239532 -114314
12005C3192b6027G1680J27493a18692B23572i7152G5254d02951e2838R005k01901
$$ 33192 -26027 71680 199173 -118692 223572 -97152 75254 -402951 -52838 -43833 -245734
11994b45734A54385a58848I3795b71611E9648B1577a56568B1513r234M0232Q9608
$$ -245734 154385 -158848 93795 -271611 59648 21577 -156568 21513 12279 52511 142119
11983A42119a66771a983C9330c72718A48873a0280C05053d3173m3281B47369a71860
$$ 142119 -166771 -1983 39330 -372718 148873 -10280 305053 -43173 -86454 247369 -171860
11971A12931J78071r3226i316n0598j1373j2649a3919k69442J5888J06331d2192
$$ 112931 291002 197776 -9316 -59914 -71287 -83936 -13919 -283361 -267473 -161142 -42192
11959a6348G4243c07268b7471B85375A08600b46246E1844J10445J13787a06060
$$ -16348 74243 -307268 -27471 285375 108600 -246246 51844 162289 276076 -106060
11948a58858A93946b72508B5276L194D031b82679B27731c01999Q5497E2070a30757
$$ -158858 193946 -272508 25276 28470 4031 -282679 227731 -301999 -216502 52070 -130757
11936b60653E4769O8063O5187e9144F914b31968A3175a27441A94616B0419a53956
$$ -260653 54769 122832 188019 -59144 6914 -231968 13175 -127441 194616 20419 -153956
11924C14107a25350A42876b25583j87192C11960A29217J36931b84684J16581D68571
$$ 314107 -125350 142876 -225583 -412775 311960 129217 266148 -284684 -168103 468571
11913B39446D5484p510c0010j87967j18640J48229f2464j2831I8303b17365g4677
$$ 239446 45484 37974 -30010 -217977 -336617 -188388 -62464 -75295 98303 -217365 -74677
11901h7836l2347e4195k09674C02181G2611a56027H0112d1546R565D2567K7604
$$ -87836 -120183 -54195 -263869 302181 72611 -156027 80112 -41546 -31981 42567 70171
11890G0171b47698A48263F8188e4613k20244I155R8733P901b70491L8032a6586
$$ 70171 -247698 148263 68188 -54613 -274857 9155 107888 115789 -270491 -232459 -16586
11878A48596B8614J20354e7083b682E0321a99763d0769j44200E3967f4300m4038
$$ 148596 28614 148968 -57083 -2682 50321 -199763 -40769 -184969 53967 -64300 -108338
11867a08338B47109a92050B13096r9275b7769H6642c32468e4921k695j11388a4236
$$ -108338 247109 -192050 213096 113821 -27769 86642 -332468 -54921 -57616 -169004 -14236
11855H6597b02894A07920d93998d2428k75603D0140i6720C5452K38923j01494
$$ 86597 -202894 107920 -493998 -42428 -318031 40140 -96720 35452 274375 172881
11845A72881b14172G8240Q6595m8041n0135e3800k05700C5737M456a77768f4554
$$ 172881 -214172 78240 164835 116794 66659 -53800 -259500 35737 40193 -177768 -64554
11833B67918m4148L5065d78438a24229b3106j67107k33972a64871A12694c16135
$$ 267918 223770 258835 -478438 -124229 -23106 -190213 -424185 -164871 112694 -316135
11822c756l28642G0776c25344E5468j306a07549k07690a41602N6759F894N779
$$ -3756 -332398 70776 -325344 55468 54162 -107549 -315239 -141602 -84843 6894 12673
11811A2673J09121d81447B63375a06439L9564p0126b9346l40515A15065J85176
$$ 12673 121794 -481447 263375 -106439 -66875 -137001 -29346 -369861 115065 300241
11801C00241a53389b3957I0990a49255d4828p9338L676I2209b86124b0155C9098
$$ 300241 -153389 -23957 90990 -149255 -44828 -124166 -120490 92209 -286124 -20155 39098
11789b17652b6280C5378i7721j16797g3255A3940a2415e460C9035c07790D3582
$$ -217652 -26280 35378 -97721 -214518 -73255 13940 -12415 -5460 39035 -307790 43582
11777a51988B59944h8552k2358j47872B10326r6992d3844A24017a36969B64733
$$ -151988 259944 -88552 -110910 -258782 210326 113334 -43844 124017 -136969 264733
11766a3951j45641j3068B7932d9052C62379j66835E1967J69337a90245m1022F2713
$$ -13951 -159592 -172660 27932 -49052 362379 195544 51967 221304 -190245 -231267 62713
11754a11257C30021j1026j2097j50195k9236a07185J4629a4980D5903K7110J09962
$$ -111257 330021 318995 306898 156703 127467 -107185 -92556 -14980 45903 73013 182975
11743A82975a1182A92358g8518a313o2316j24851A0452b72269A07634a20390A04766
$$ 182975 -11182 192358 -78518 -1313 -63629 -188480 10452 -272269 107634 -120390 104766
11731A33128a80818o2378d0162B6846M5781L1830J04521c197B57691i5812B1002
$$ 133128 -180818 -243196 -40162 26846 72627 104457 208978 -3197 257691 -95812 21002
11719A17767B6256J24913a36051A35075C0375J5899a51875j01432A29846a1132
$$ 117767 26256 151169 -136051 135075 30375 46274 -151875 -253307 129846 -11132
11708A9288g9664A68715B9412c30392A38863g79j48486f2809l7904A58540a57537
$$ 19288 -79664 168715 29412 -330392 138863 -779 -149265 -62809 -100713 158540 -157537
11696a6081n4535B07507B4379b40182G3170b61684A08099h5106k9459b4771E3964
$$ -16081 -70616 207507 24379 -240182 73170 -261684 108099 -85106 -114565 -24771 53964
11684E7422d14A4181a17361B00935f4636j25475g886q3670n5669J6276m8715F7262
$$ 57422 -414 14181 -117361 200935 -64636 -190111 -7886 -91556 -147225 -130949 -179664 67262
11671A0457f180j26285c1286j07687C06138A00007L9702c997A53005j6127D1644
$$ 10457 -6180 -132465 -31286 -138973 306138 100007 139709 -3997 153005 136878 41644
11659a40128l0612a420B2875O3173f7673D9603b39166i5686j7112k10218a22415
$$ -140128 -170740 -1420 22875 86048 -67673 49603 -239166 -95686 -112798 -323016 -122415
11647a72863B2992b0759J421A25116b57082D8106a81937D8236a35367A878c6069
$$ -172863 22992 -20759 -19338 125116 -257082 48106 -181937 48236 -135367 1878 -36069
11635a79866N2676C3300L80090C4232J08892k6214H499b02384A03378A7194c7264
$$ -179866 -127190 33300 413390 34232 143124 116910 8499 -202384 103378 17194 -37264
11623A16959M2831J58136c9746B26728C5803J31289R0749L574j3631c233A60962
$$ 116959 159790 317926 -39746 226728 35803 167092 257841 261415 247784 -3233 160962
11611a50073f9467j9427B07737l9321b89307J22826a2151A82199e8950I427J23291
$$ -150073 -69467 -88894 207737 168416 -289307 -166481 -12151 182199 -58950 9427 132718
11600A32718b15844A48743h3005G5864B8969N9123N3998J267a42415F3902J55853
$$ 132718 -215844 148743 -83005 75864 28969 88092 142090 143357 -142415 63902 219755
11589B19755A519a95996A88625A9820J32276a81041A8477a49445A486O9857b3656
$$ 219755 1519 -195996 188625 19820 152096 -181041 18477 -149445 1486 71343 -23656
11577D8115g4068A46117b9072B20892k539K92246C8112J16426J31846A23573J95000
$$ 48115 -74068 146117 -29072 220892 218353 510599 38112 154538 286384 123573 318573
11566C18573F318Q097J91725a29179A33389j585B8995J77731G1459O7811l7499
$$ 318573 6318 14415 206140 -129179 133389 131804 28995 206726 71459 139270 101771
11555A01771h619j41600d5534A73883k2207b1617B24700m6943d4142l46693A75869
$$ 101771 -8619 -150219 -45534 173883 151676 -21617 224700 177757 -44142 -390835 175869
11543b54958A05147a8772l1872j66644i6073C22238i4281A67595b41054B51954
$$ -254958 105147 -18772 -50644 -217288 -96073 322238 -94281 167595 -241054 251954
11532a5330A10634l0825f8602B08016a15390C2449f2075B63506D5011P6262B1368
$$ -15330 110634 79809 -68602 208016 -115390 32449 -62075 263506 45011 121273 21368
11520C02139F8579O5797G902M4420K10320g8392C85970A32102k2858l0046J37679
$$ 302139 68579 134376 7902 52322 262642 -78392 385970 132102 109244 79198 216877
11509B16877a51405F4072J4843E795K18067b73551a7958A39767O6533F8252b34431
$$ 216877 -151405 64072 78915 5795 223862 -273551 -17958 139767 206300 68252 -234431
11497A13358R2683a90563M9373E3195b72615A7595J00311a22460I9667f3858K8739
$$ 113358 206041 -190563 -141190 53195 -272615 17595 117906 -122460 99667 -63858 -35119
11486c5119A12426K0014o1265a40051b7228A89813j9383m1384C2509N8804K26709
$$ -35119 112426 132440 71175 -140051 -27228 189813 170430 129046 32509 91313 318022
11475C18022a83400B06033L45613b93965e5386j50025i2946C73014c5354p7097
$$ 318022 -183400 206033 551646 -293965 -55386 -205411 -92946 373014 -35354 -112451
11465a12451A71882i9145B57925q0204f811B30086I6159k3381i1967E7359L7508
$$ -112451 171882 -99145 257925 177721 -6811 230086 96159 72778 -91967 57359 94867
11454I4867J80555a38307A05234d1954A04025R5914m3841j2983a3981j74222b9437
$$ 94867 275422 -138307 105234 -41954 104025 199939 156098 143115 -13981 -188203 -29437
11442a55325C2782J60784J70201A33430I455M5296K58513a16316N7116E5402c7398
$$ -155325 32782 193566 363767 133430 9455 54751 313264 -116316 -59200 55402 -37398
11430a67245I4128K47529a67122A15844a47245l0113e7034A95523b03196C0427
$$ -167245 94128 341657 -167122 115844 -147245 -177358 -57034 195523 -203196 30427
11419a44513D2010J03224Q614a33375D34063A06202j0892f7764n9708B47972g3926
$$ -144513 42010 145234 153848 -133375 434063 106202 95310 -67764 -127472 247972 -73926
11407b43143C20709e9498R726k1867B71309a29775A17371m423J4333a32076A5539
$$ -243143 320709 -59498 -49772 -71639 271309 -129775 117371 112948 127281 -132076 15539
11395d03210A71284C172a29718C7164c00836B13356a53546c6995A7654K37345
$$ -403210 171284 3172 -129718 37164 -300836 213356 -153546 -36995 17654 254999
11385B54999a20559j11718C209a54770B86471b08384N1639B03618J94248d6479
$$ 254999 -120559 -232277 3209 -154770 286471 -208384 -156745 203618 397866 -46479
11374A78037b41869C03560A09342b35195E7537h1618C07085h3977L720D4467a07328
$$ 178037 -241869 303560 109342 -235195 57537 -81618 307085 -83977 -80257 44467 -107328
11362a63655G4618a32812D6586J4038b56758a5588A53324a68178e361A04199c63180
$$ -163655 74618 -132812 46586 60624 -256758 -15588 153324 -168178 -5361 104199 -363180
11350g8816B8352J82803d4818k72453i1326j38600C49696j53244d5757A50252
$$ -78816 28352 211155 -44818 -317271 -91326 -229926 349696 196452 -45757 150252
11339i0403b9462F6205b4458j711q2605j58472k57319b22918I9982a27606K7616
$$ -90403 -29462 66205 -24458 -26169 -108774 -267246 -524565 -222918 99982 -127606 -99990
11328i9990E7093i2907j33056i6419d0452j51212I3611D271a0466m04k34984H4131
$$ -99990 57093 -92907 -225963 -96419 -40452 -191664 93611 4271 -10466 -10870 -245854 84131
11315C17079b91321f6816A17094M7270b61618g665n5350l962k93243I6316a77872
$$ 317079 -291321 -66816 117094 164364 -261618 -7665 -63015 -66977 -360220 96316 -177872
11303B3584J09116A7234K17253J01761a39170e4845D24987A36699a84138o7352
$$ 23584 132700 17234 234487 336248 -139170 -54845 424987 136699 -184138 -251490
11293b51490B06422m601N6195j22483g166A59372b47798D2270b3600B22196K46835
$$ -251490 206422 201821 258016 135533 -7166 159372 -247798 42270 -23600 222196 469031
11282D69031c28993J45249d6580j47793j55718A36011a50947j3737d1771j85406
$$ 469031 -328993 -183744 -46580 -194373 -350091 136011 -150947 -164684 -41771 -227177
11272b27177A00834b11487j02913F8728J6460J09156a2561F9071d7650n2263o1790
$$ -227177 100834 -211487 -314400 68728 85188 194344 -12561 69071 -47650 -99913 -161703
11261a61703M1979A93759B9628J28388b20776c0925B8271K00255c34883C916a19038
$$ -161703 -119724 193759 29628 158016 -220776 -30925 28271 228526 -334883 3916 -119038
11249e3189E9461d2810j06528B4714b96234f5236B02606b40075B04954J39879
$$ -53189 59461 -42810 -149338 24714 -296234 -65236 202606 -240075 204954 344833
11239C44833a82838h2647A8110i8331k32353R4241B42834n3613c09922C93323
$$ 344833 -182838 -82647 18110 -98331 -330684 -236443 242834 189221 -309922 393323
11228e5923r8476j02743B8859a14232J364k67500B04020H2143a36333j4556e1912
$$ -55923 -154399 -257142 28859 -114232 -112868 -380368 204020 82143 -136333 -150889 -51912
11216c3141n0638A26890d7518n0296j53711F1957b10996i7191k2208d5025k51498
$$ -33141 -83779 126890 -47518 -97814 -251525 61957 -210996 -97191 -119399 -45025 -296523
11205b96523F9576h3033j45618b6469P1A05711N7041c633A7963a07347j59716
$$ -296523 69576 -83033 -228651 -26469 -26398 105711 162752 -3633 17963 -107347 -267063
11194b67063D6928J9948c11491b847k9675A78765K3936O069d201A67858A1931
$$ -267063 46928 66876 -311491 -2847 -32522 178765 202701 208770 -4201 167858 11931
11182C01827q8031F2363k6588b20080A94437f9095a4390C2264a66525H7866C0601
$$ 301827 213796 62363 35775 -220080 194437 -69095 -14390 32264 -166525 87866 30601
11170a25032o1449j28525A63650l8803m0827J94016f9902K6357j56215A51332
$$ -125032 -186481 -315006 163650 124847 84020 278036 -69902 -43545 -199760 151332
11159A54589B7042J30538a59498P0178k42416A35164J4585N1540N2328b89384
$$ 154589 27042 157580 -159498 -89320 -331736 135164 149749 201289 253617 -289384
11148b56330e3380j86812a2016E6457J71029a4085j28557H6166J13595f3778A9232
$$ -256330 -53380 -240192 -12016 56457 227486 -14085 -142642 86166 199761 -63778 19232
11136A32294C0691d7231o4531A5276J98283E7906R4019b12114i9649c3195H0316
$$ 132294 30691 -47231 -111762 15276 213559 57906 151925 -212114 -99649 -33195 80316
11124E895g4395I628M0482i748F4966J94488b1738H7990b8708H050L143j675Q7290
$$ 5895 -74395 9628 50110 -9748 64966 259454 -21738 87990 -28708 8050 11193 9518 96808
11111I6808C0508L58559e1372a8007G193a1175B25620r6760a4241B87716A7347
$$ 96808 30508 389067 -51372 -18007 7193 -11175 225620 128860 -14241 287716 17347
11099b1523j42247F9493a64611p4798p59c0632I4370a4350B84490K54654A86136
$$ -21523 -163770 69493 -164611 -239409 -240168 -30632 94370 -14350 284490 539144 186136
11087A20676b69308F2597K62500r9306C4250L98018j90082I5227K21990b0451
$$ 120676 -269308 62597 325097 225791 34250 432268 242186 95227 317217 -20451
11076C75609I8746m0777K78697b0535j86629C47362D8276A147M2197K74881C4313
$$ 375609 98746 57969 336666 -20535 -207164 347362 48276 1147 43344 318225 34313
11064E3418J11371K02106L56681C07494K2821N4590L6794J4022A14852L51731
$$ 53418 164789 366895 723576 307494 330315 384905 421699 435721 114852 466583
11054D66583q9935o5987K39885k7949Q5010j93092J55626k1688m7038K2661j80884
$$ 466583 376648 310661 550546 522597 607607 414515 570141 548453 501415 524076 343192
11043C43192l5542M69557B45614L52653Q8428r9478j96976J64893N2025Q3523
$$ 343192 307650 777207 245614 598267 686695 587217 390241 555134 607159 690682
11033F90682j38506K7921L3203o7561A91137P1163R3279M62097K429k34922k40965
$$ 690682 552176 580097 613300 545739 191137 262300 355579 817676 820105 585183 344218
11022C44218J58460O9803K58105C68942J43218j66650J23096k27606L53273Q8001
$$ 344218 502678 572481 830586 368942 512160 345510 468606 241000 594273 682274
11012F82274B13493L40191j46583O8612J02006J50645k17242K36434j44824j60588
$$ 682274 213493 553684 407101 475713 577719 728364 511122 747556 602732 442144
11002D42144J6410k4388l2319P9468J25487j44354J35317j27130J06820B16647
$$ 442144 458554 434166 401847 481315 606802 462448 597765 470635 577455 216647
10991B65728K02989j44300J40945J95488M11026j71056l11068j51089M43304J34049
$$ 265728 468717 324417 465362 660850 1071876 900820 589752 438663 881967 1016016
10981A016016R4122j63176J13430K541P5772r7749J27586J58036R7477J01364
$$ 1016016 1110138 946962 1060392 1062933 1138705 1040956 1168542 1326578 1424055 1525419
10971A525419K44515M52002l55236L73206l67614M2837j63373j15988j14884k44601
$$ 1525419 1769934 2221936 1866700 2239906 1872292 1915129 1751756 1635768 1520884 1276283
10961A276283K86904l31059J26931j32596K17074K06042m37309J12301r3424l1683
$$ 1276283 1563187 1232128 1359059 1226463 1443537 1649579 1212270 1324571 1231147 1199464
10951A199464r9478M192D39752K93921K69815k00177B35736L08349k53619o3921
$$ 1199464 1099986 1104178 439752 733673 1003488 803311 235736 544085 290466 226545
10941B26545J51212A31762J01517N8861A0870L23822A17964P3567i5186D10754
$$ 226545 377757 131762 233279 292140 10870 334692 117964 191531 -95186 410754
10930H907Q4402N3300n3921m924B6549O7537b39566B11249a97319C263O349c5269
$$ 8907 93309 146609 92688 87764 26549 94086 -239566 211249 -197319 3263 9612 -35269
10917a12179j79862B953N4309c2579B8285a06548K2250K4420j53772C5474c79915
$$ -112179 -292041 2953 57262 -32579 28285 -106548 -84298 -59878 -213650 35474 -379915
10905A25362i968l7881a4079m7529A74744H2963O0029a51659r9786e5354E8312
$$ 125362 -9968 -47849 -14079 -61608 174744 82963 142992 -151659 -251445 -55354 58312
10893A33298g3540j11586a6229A09365l3178M6680b75983A21538b69201J11214
$$ 133298 -73540 -185126 -16229 109365 76187 122867 -275983 121538 -269201 -157987
10883a57987e0672a763A73933b85723a38266H8763J03920b2282r633k76369c6641
$$ -157987 -50672 -1763 173933 -285723 -138266 88763 192683 -22282 -31915 -308284 -36641
10871H9023a79063B01416E7042c35090A1484c66809a53671k6187C8185M5998J03440
$$ 89023 -179063 201416 57042 -335090 11484 -366809 -153671 -179858 38185 84183 187623
10860A87623B5651L618J27101c3258n7242k39032H4671e6437a4480n5514A2022
$$ 187623 25651 29269 156370 -33258 -90500 -329532 84671 -56437 -14480 -69994 12022
10848a44862A72827A4161a10354G8054K4283l9712a77489e9455k09040B63716
$$ -144862 172827 14161 -110354 78054 102337 62625 -177489 -59455 -268495 263716
10837a05388C8214L72967H2241a1407A51317d35970A03982J5598m9078a58720
$$ -105388 38214 411181 82241 -11407 151317 -435970 103982 119580 70502 -158720
10826D3923e9137J6358A10171b95215h7102j04888Q182h1153B39890L9056C2817
$$ 43923 -59137 -42779 110171 -295215 -87102 -191990 -183808 -81153 239890 278946 32817
10814e8841j25383h4977F5853c24056J59646I7480c50602H258b448k2668p2058
$$ -58841 -184224 -84977 65853 -324056 -164410 97480 -350602 8258 -2448 -25116 -97174
10803i7174j9815m093F1469J20f0640b5110k88744C7149c214m8551n0717j44737
$$ -97174 -116989 -121082 61469 61589 -60640 -25110 -313854 37149 -3214 -51765 -102482 -247219
10791b47219C3039b27239N9513n8141K1553R8250B92564l2488a66716k19772J53545
$$ -247219 33039 -227239 -167726 -225867 -204314 -106064 292564 260076 -166716 -386488 -232943
10780b32943d6224j71741g8186b9267A04297c4433k01178J6613L7874E9507a59128
$$ -232943 -46224 -217965 -78186 -29267 104297 -34433 -235611 -218998 -181124 59507 -159128
10768A99748l9836b62362b6064D6995c04279n5737B52670H7408J46912a85693
$$ 199748 159912 -262362 -26064 46995 -304279 -360016 252670 87408 234320 -185693
10757b48514F0511c01148B21070a35855e0495a8005A82382J27175e9115F9342
$$ -248514 60511 -301148 221070 -135855 -50495 -18005 182382 309557 -59115 69342
10746D1096J8004A9279J8868J15404d3792j30055G617c5985d040j57634g4936
$$ 41096 59100 19279 38147 153551 -43792 -173847 7617 -35985 -4040 -161674 -74936
10734d985k43350A84888c9842j15044O4318b0084A01722b15939A67988b69177
$$ -4985 -248335 184888 -39842 -154886 -90568 -20084 101722 -215939 167988 -269177
10723e2115Q298k9796G8296a50443A1363J9122h3391k28834f2049F1508a59655
$$ -52115 -43817 -73613 78296 -150443 11363 30485 -83391 -312225 -62049 61508 -159655
10711a8650B18814c14481B51096A14326j7800J47108d3422k53946a43439j75586
$$ -18650 218814 -314481 251096 114326 96526 243634 -43422 -297368 -143439 -319025
10701c19025A5479i4500o7465A56523b43938m172L6822A52219R7972e9468r5487
$$ -319025 15479 -94500 -161965 156523 -243938 -248110 -211288 152219 250191 -59468 -154955
10690a54955c1717k42116e9111l24501h8695p9315I5650J37255b89850a11008
$$ -154955 -31717 -273833 -59111 -383612 -88695 -168010 95650 232905 -289850 -111008
10679a26330L6146A78707d07261a51890E0324a14909K5105k39087g487j60754
$$ -126330 -90184 178707 -407261 -151890 50324 -114909 -89804 -328891 -7487 -168241
10669a68241A29242a08576N1991l69949a49114C7265G673L0916M3332M8470a86064
$$ -168241 129242 -108576 -56585 -426534 -149114 37265 7673 38589 81921 130391 -186064
10657a77474B9259f736A31419M169b32254d0843j31473B7026a73028n9183j48817
$$ -177474 29259 -6736 131419 135588 -232254 -40843 -172316 27026 -173028 -232211 -381028
10646c81028d6616j96400f8926E6932J2593J10197a88929F9541A9383e37321C75105
$$ -381028 -46616 -243016 -68926 56932 69525 179722 -188929 69541 19383 -537321 375105
10634c48450c7855j41196b5190B52274I2242f5197I704L3531L28592b58183j23113
$$ -348450 -37855 -179051 -25190 252274 92242 -65197 9704 43235 371827 -258183 -381296
10623c81296A40632b37026A55701j3623b17806k5359O7429A68267b24525p50D7583
$$ -381296 140632 -237026 155701 142078 -217806 -243165 -175736 168267 -224525 -225275 47583
10611i0315c2406A03163C7680c56054J71618A09554K4086B8742J61002a45420
$$ -90315 -32406 103163 37680 -356054 -184436 109554 133640 28742 189744 -145420
10600d6262B55139b85802G3763a30421p6613A87959a6171l84353f554l97121a91891
$$ -46262 255139 -285802 73763 -130421 -207034 187959 -16171 -400524 -6554 -403675 -191891
10588B15594b01584Q6982B85366c64714a31425A70147q5062M4270a03109l81354
$$ 215594 -201584 -114602 285366 -364714 -131425 170147 85085 129355 -103109 -484463
10578d84463a56854d6751D6441c6502A74457J1104c03038A71441d75067I1447
$$ -484463 -156854 -46751 46441 -36502 174457 185561 -303038 171441 -475067 91447
10567A39752o1481e5575F8004a88110b9373l7684l8503d6297j00413o8187D0878
$$ 139752 78271 -55575 68004 -188110 -29373 -67057 -105560 -46297 -146710 -214897 40878
10555a8676C08969b01980Q6658p1353h9256l8872o2527f3967j6739A18384P0469
$$ -18676 308969 -201980 -115322 -186675 -89256 -128128 -190655 -63967 -80706 118384 188853
10544A88853e92l8062l9182m74955f7403j56682g961o4010J0847j41683B18870
$$ 188853 -592 -38654 -77836 -552791 -67403 -224085 -7961 -71971 -61124 -202807 218870
10532a90718A3062h002A06790J31121a53184A12426c2602A9476K15860a64518
$$ -190718 13062 -8002 106790 237911 -153184 112426 -32602 19476 235336 -164518
10521A82305a86870C36686a5970B5971K63123b88858Q8612Q1626C0118a729A80972
$$ 182305 -186870 336686 -15970 25971 289094 -288858 -200246 -118620 30118 -1729 180972
10509b92299f5374M364b2192o126j85640O8323I0468g5751c5503j56524B3555
$$ -292299 -65374 -61010 -22192 -28318 -213958 -145635 90468 -75751 -35503 -192027 23555
10497c9664j98939R6165r2334A29074b70013A24012J55224G6087d56578A6760
$$ -39664 -238603 -142438 -234772 129074 -270013 124012 279236 76087 -456578 16760
10486D7996K09408A13039k5851k5304b9770B87879q6749J09289J28493k09737
$$ 47996 257404 113039 87188 61884 -29770 287879 201130 310419 438912 229175
10476B29175r8357J29099n4509J61564n6408j13277g045H9995b05211a0957B58556
$$ 229175 130818 259917 205408 366972 310564 197287 -7045 89995 -205211 -10957 258556
10464c03736A3656K82536a8629H483N397d0227A01583a92236L1528q9106J18561
$$ -303736 13656 296192 -18629 8483 13880 -40227 101583 -192236 -160708 -249814 -131253
10453a31253A83824K4302i4710j8361B03633d0187A18120a70684r049h2861A89476
$$ -131253 183824 208126 -94710 -113071 203633 -40187 118120 -170684 -179733 -82861 189476
10441B31174H7827a2749j3234o2339r8254p744A17858c0704n0490o3828G9953
$$ 231174 87827 -12749 -25983 -88322 -186576 -194320 117858 -30704 -81194 -145022 79953
10429A47100d8302A94170c21368A13283L6764a48113A287c02208a43451j14944
$$ 147100 -48302 194170 -321368 113283 150047 -148113 1287 -302208 -143451 -258395
10419b58395h1873F0310K9859e9488A64941b04012B83075h1448B12214a11701
$$ -258395 -81873 60310 90169 -59488 164941 -204012 283075 -81448 212214 -111701
10408a18568j28399A3863f6917B31882p4438a91888b0252B19878q0593b26080
$$ -118568 -246967 13863 -66917 231882 157444 -191888 -20252 219878 139285 -226080
10397A69599c0644j27719B44799o7951a09547p0120F5354J38411r4366k881N38878
$$ 169599 -30644 -158363 244799 176848 -109547 -179667 65354 203765 109399 106518 645396
10386F45396B79056G8775Q5397c2679A12508c39611D0332K61067B9695K32126
$$ 645396 279056 78775 164172 -32679 112508 -339611 40332 301399 29695 261821
10376B61821k0439a76260B02133C5398J57889O0859j9670o6217J06239J30912
$$ 261821 241382 -176260 202133 35398 193287 254146 234476 168259 274498 405410
10366D05410A47192J00341L00071a18119B29615N053j07157J51036j30329J03399
$$ 405410 147192 247533 547604 -118119 229615 234668 127511 278547 148218 251617
10356B51617a82101C28366j18903r8060R8643O705J58986L28N2644j38198j13772
$$ 251617 -182101 328366 209463 111403 210046 216751 375737 376065 428709 290511 176739
10345A76739Q1781k0489O4453A34121o4204Q9746J83593j13499j08245i0852B93174
$$ 176739 258520 238031 302484 134121 69917 159663 343256 229757 121512 -90852 293174
10333C1314c05644A46166a28375j73755a699B8735M37613G3898J2897b9819j25452
$$ 31314 -305644 146166 -128375 -302130 -1699 28735 466348 73898 86795 -29819 -155271
10322a55271P7248B96408A23542M27782c7687E786L5051K14486j26493a03266
$$ -155271 -78023 296408 123542 551324 -37687 5786 40837 255323 128830 -103266
10311A6751L1479J21753b267q1409m1554b3366A70214b52982a3664D5010J53227
$$ 16751 48230 169983 -2267 -83676 -125230 -23366 170214 -252982 -13664 45010 198237
10300A98237B6665J95237M2376b55999B4561b39823J04323l0149c9395d473j49336
$$ 198237 26665 221902 264278 -255999 24561 -239823 -135500 -165649 -39395 -4473 -153809
10289a53809Q214A34874C034a71412A9094J80928e7428F7634a95982D8210a65778
$$ -153809 -145595 134874 3034 -171412 19094 200022 -57428 67634 -195982 48210 -165778
10277h3884j28003B43515j20069d8384B84967a05876L4045I553a91264A1241a95718
$$ -83884 -211887 243515 123446 -48384 284967 -105876 -71831 9553 -191264 11241 -195718
10265C48157B2959J96910a02619K1017D1431J42142a16929D23590q0352o7965
$$ 348157 22959 219869 -102619 -81602 41431 183573 -116929 423590 343238 275273
10255B75273O4306A8755K01602J1296c6803o2054j17966C5537a66478e6926p2294
$$ 275273 339579 18755 220357 231653 -36803 -98857 -216823 35537 -166478 -56926 -129220
10244a29220l9185c1328j41909d8394m3510A21937L9702d45795J92105g1271j80046
$$ -129220 -168405 -31328 -173237 -48394 -91904 121937 161639 -445795 -253690 -71271 -251317
10233b51317d2153H9849h329j32179A08962C0932K10168b54527D3437h4927G057
$$ -251317 -42153 89849 -8329 -140508 108962 30932 241100 -254527 43437 -84927 7057
10221B33164a78772B95092b8874j51989j80555b4115j42644g2320A50319e9647
$$ 233164 -178772 295092 -28874 -180863 -361418 -24115 -166759 -72320 150319 -59647
10210A26346C3249b20909c5080l86455a37919b0431j91533b6735G1590c17720
$$ 126346 33249 -220909 -35080 -421535 -137919 -20431 -211964 -26735 71590 -317720
10199i3293I5147J39962J26361D3104P3341D2414j0785K81448j15618h0473j65441
$$ -93293 95147 235109 361470 43104 116445 42414 31629 313077 197459 -80473 -245914
10188b45914A1570a62983E8319J53405q207n6636p1734C2486f4703j92510A05026
$$ -245914 11570 -162983 58319 211724 203517 146881 75147 32486 -64703 -257213 105026
10176a82434m2238A45463J99119a3964E849a41860A75960k7580h0358j58479J7927
$$ -182434 -224672 145463 344582 -13964 5849 -141860 175960 148380 -80358 -238837 -220910
10165b20910b8594j18998A31825a18833q1678B46724f3419n6503A33906o617d73285
$$ -220910 -28594 -147592 131825 -118833 -200511 246724 -63419 -119922 133906 127289 -473285
10153c33194a55457r1368F023i8252f943G8708I682f7077j39185H2567b1289l44189
$$ -333194 -155457 -246825 6023 -98252 -6943 78708 9682 -67077 -206262 82567 -21289 -365478
10141c65478O3683J33207n2822J01119k15046f5648L0934k19143i6805B1773d9857
$$ -365478 -301795 -168588 -221410 -120291 -335337 -65648 -34714 -253857 -96805 21773 -49857
10129i6414A4066c10322J17878C6700b65524p2078a28734C04915a25213a0682
$$ -96414 14066 -310322 -192444 36700 -265524 -337602 -128734 304915 -125213 -10682
10118A14549a25397h589q3306a7537A42586a04092b3248F6857g6966l4194j26192
$$ 114549 -125397 -8589 -91895 -17537 142586 -104092 -23248 66857 -76966 -111160 -237352
10107b37352j20294J06326a0133B77671g3755B9104H83i6396B7666a8451l60267
$$ -237352 -357646 -251320 -10133 277671 -73755 29104 883 -96396 27666 -18451 -378718
10096c78718f8590F1578O1263j3681b25569b3126h571p2587G4277J9467b3695
$$ -378718 -68590 61578 122841 109160 -225569 -23126 -8571 -81158 74277 93744 -23695
10084i2j37435I5212h2772l38868a16586c214k137D3370b86157J41275G9762i8445
$$ -92 -137527 95212 -82772 -421640 -116586 -3214 -5351 43370 -286157 -144882 79762 -98445
10071B00727f6944j14537r2299A29659a957B0311b56947e0621k05166C5724j381
$$ 200727 -66944 -181481 -273780 129659 -1957 20311 -256947 -50621 -255787 35724 34343
10060C4343n556b07164J2890n9348A66623d0137J897k67602i898A05690b07420
$$ 34343 28787 -207164 -194274 -253622 166623 -40137 -38240 -305842 -9898 105690 -207420
10048a99143Q6695A24834J14740b62102P8170c1980k58153M4654L3968A74962
$$ -199143 -112448 124834 239574 -262102 -183932 -31980 -290133 -245479 -211511 174962
10037a27030L6052J6776L5306j95903H0082N527R0611b05485B41642A8619b48227
$$ -127030 -90978 -74202 -38896 -234799 80082 85609 176220 -205485 241642 18619 -248227
10025A63825A3536a59648C6200c1682A94995a08189p3322E3224J08741L0616e5208
$$ 163825 13536 -159648 36200 -31682 194995 -108189 -181511 53224 161965 192581 -55208
10013f8274k34525h71k34842D7490a73060C5076d2133o5059C36456A0118a21259
$$ -68274 -302799 -871 -235713 47490 -173060 35076 -42133 -107192 336456 10118 -121259
10001A41794F1729J01493b71912j38296A51961b31100g9448A11361A2391M1027
$$ 141794 61729 163222 -271912 -410208 151961 -231100 -79448 111361 12391 53418
9991E3418J47820a09988j73098a7389A21793A8774a96592h0256q0739A61612E1238
$$ 53418 201238 -109988 -283086 -17389 121793 18774 -196592 -80256 -160995 161612 51238
9979b79592I8291J73636a80869O2039a1220k05144q5471A53024F585K3901K273
$$ -279592 98291 271927 -180869 -118830 -11220 -216364 -301835 153024 6585 30486 32759
9968C2759M7776g7531J951o5061M6366C8465i9141C35319b3342C04745a16976
$$ 32759 80535 -77531 -75580 -140641 -94275 38465 -99141 335319 -23342 304745 -116976
9956i9484q1827B09530f6412l2438C37152A63827b60578A18775m8114B0474J80104
$$ -99484 -181311 209530 -66412 -98850 337152 163827 -260578 118775 70661 20474 200578
9945B00578a32269d0516A46455E9656b09339O9512n5413B43917a06298o6582r2279
$$ 200578 -132269 -40516 146455 59656 -209339 -139827 -195240 243917 -106298 -172880 -265159
9934b65159C003L0656d7274k5690l554j10195h3806j11662A56571F7636a17542
$$ -265159 3003 33659 -47274 -72964 -76518 -186713 -83806 -195468 156571 67636 -117542
9922a20128A63496a54176H53b2188j65243B09016D5162a86508A29174a73751d2045
$$ -120128 163496 -154176 853 -22188 -187431 209016 45162 -186508 129174 -173751 -42045
9910B1866g1869r4472B651L3279K66154a15954A04963b29702A25794d3197k2531
$$ 21866 -71869 -166341 2651 35930 302084 -115954 104963 -229702 125794 -43197 -65728
9899f5728A16199a09471k16552B20080o2089b35936a07124A45552a42819l13064
$$ -65728 116199 -109471 -326023 220080 157991 -235936 -107124 145552 -142819 -455883
9889d55883M6612M0431A87096J43419a37062B1322f628k13473h2371A99172d58371
$$ -455883 -409271 -368840 187096 330515 -137062 21322 -6628 -220101 -82371 199172 -458371
9877b76029J0555a893n009j54996P3167A18229P7459D017a01232M7271A8017J31334
$$ -276029 -265474 -1893 -6902 -161898 -88731 118229 195688 4017 -101232 -53961 18017 149351
9865A49351a74778r7214p8627C5782d7288k16580J12334O7375M0831p6828A09268
$$ 149351 -174778 -271992 -350619 35782 -47288 -263868 -151534 -84159 -43328 -120156 109268
9853I4344d14768A19275h2769k2603c7913j41474H183a27871j59464A45879i8951
$$ 94344 -414768 119275 -82769 -105372 -37913 -179387 8183 -127871 -287335 145879 -98951
9841f6099l0022j79527a07326n1624F022Q558b43910A04262a03892A49609N3701
$$ -66099 -96121 -275648 -107326 -158950 6022 14580 -243910 104262 -103892 149609 203310
9830B03310b94175L6922M8730j81547e0484C40464b44178a10462A23040D4782
$$ 203310 -294175 -257253 -208523 -390070 -50484 340464 -244178 -110462 123040 44782
9819a460p5244l43673a15786j0581j17810b3293j78052k6543R2802B28998d0849
$$ -1460 -76704 -420377 -115786 -126367 -244177 -23293 -201345 -227888 -135086 228998 -40849
9807A2898a84116h8293j22455A2751b52590F3295K84493d2113l40283A23143m9723
$$ 12898 -184116 -88293 -210748 12751 -252590 63295 347788 -42113 -382396 123143 73420
9796G3420i5021K0q5731f4865l39454A58701E8570e285j82531B19882g695g98
$$ 73420 -95021 -95001 -180732 -64865 -404319 158701 58570 -5285 -187816 219882 -7695 -798
9783b38201H2500a90523B8708r269J85387K09507a75684B32310e0704j92426D07269
$$ -238201 82500 -190523 28708 19439 204826 414333 -175684 232310 -50704 -243130 407269
9771b82435B20292c23816C3508e3485k1924A02240E000a4311A81684a81832I4504
$$ -282435 220292 -323816 33508 -53485 -75409 102240 5000 -14311 181684 -181832 94504
9759d2773n4289k265C0466d2547b135j76439d584k37089A01821h7332m5873L2488
$$ -42773 -97062 -99327 30466 -42547 -2135 -178574 -4584 -241673 101821 -87332 -133205 -100717
9747a00717j78204j30574J83647q2802a04552p5539J2095g2388j58502F9772b35448
$$ -100717 -278921 -409495 -225848 -308650 -104552 -180091 -167996 -72388 -230890 69772 -235448
9735b043C567K01821b56768J20061r0939h033n9793I50a80718H1143c06252m4791
$$ -2043 3567 205388 -256768 -136707 -227646 -8033 -67826 950 -180718 81143 -306252 -351043
9723c51043B74719H285c5643D2312K0073a451r4097C067O3578K2512j340b44492
$$ -351043 274719 8285 -35643 42312 62385 -1451 -95548 3067 66645 89157 87817 -244492
9710A11018N562h1413a891k53919C30755G7145L0731g7933E4799O8713b7427k16301
$$ 111018 116580 -81413 -1891 -255810 330755 77145 107876 -77933 54799 123512 -27427 -243728
9698b43728g8939C27781h6502E2606J54495D2266O5021n0953a61398E7578Q8410
$$ -243728 -78939 327781 -86502 52606 207101 42266 107287 56334 -161398 57578 145988
9687A45988a92341j14705j8671a09926N0138j84164a14294c6344H6921a4394l75937
$$ 145988 -192341 -307046 -325717 -109926 -59788 -243952 -114294 -36344 86921 -14394 -390331
9676c90331a02318c7295l02975J03673B9207a51962e5981h616j48952E5652b59147
$$ -390331 -102318 -37295 -340270 -236597 29207 -151962 -55981 -8616 -157568 55652 -259147
9664c8552p6607r2387C1675i7131A97798h6716A27592a05596m5095o8714D1355
$$ -38552 -115159 -207546 31675 -97131 197798 -86716 127592 -105596 -150691 -219405 41355
9652a50284o5646Q7335B1684a08348j52631d5A52074C0193b7711B65208F5767
$$ -150284 -215930 -128595 21684 -108348 -260979 -45 152074 30193 -27711 265208 65767
9640c9745j91921e7447j35965A03628J5639g9418A17769D134g2750k3175E6914
$$ -39745 -231666 -57447 -193412 103628 119267 -79418 117769 4134 -72750 -95925 56914
9628H1130h5270C6810J02338f1132k48295h6036r8879A68300b11128g3108F287
$$ 81130 -85270 36810 139148 -61132 -309427 -86036 -184915 168300 -211128 -73108 6287
9616G1942c0680I5873a78068j01544I2298q191J6186a46221j51013N4818a17443
$$ 71942 -30680 95873 -178068 -279612 92298 84107 100293 -146221 -297234 -242416 -117443
9604a45792e4669A87025n8119b77057A94448f9350c1520E0968a20979Q45j17237
$$ -145792 -54669 187025 128906 -277057 194448 -69350 -31520 50968 -120979 -120134 -237371
9593b37371h2809k06554g6520Q636M684k934l15211B81801a17710b6608j40437
$$ -237371 -82809 -289363 -76520 -67884 -63200 -66134 -381345 281801 -117710 -26608 -167045
9582a67045a7619l6124a6645l10271J8366B05570p6648H763M1436J15847j4223
$$ -167045 -17619 -53743 -16645 -326916 -308550 205570 128922 8763 50199 166046 151823
9571A51823a98422N7224O9492L5202j85179A37563b23802R1627m6428A94292a5368
$$ 151823 -198422 -141198 -71706 -36504 -221683 137563 -223802 -132175 -178603 194292 -15368
9559i2560h398G5234a41307N7142B566d6105k06120H027b02583h8988A00392f5455
$$ -92560 -8398 75234 -141307 -84165 2566 -46105 -252225 8027 -202583 -88988 100392 -65455
9546f7394E8867b31720B104P9312b17613A07209E173J7909a52664p3196M7631
$$ -67394 58867 -231720 2104 81416 -217613 107209 5173 23082 -152664 -225860 -178229
9535a78229M5318B54873J1072a35147m9193d110m9141A13399a96554f8502j25146
$$ -178229 -132911 254873 265945 -135147 -184340 -4110 -53251 113399 -196554 -68502 -193648
9524a93648l09980K43252A28795f0088l4948p1072f8245A13612b65588A24954
$$ -193648 -503628 -260376 128795 -60088 -95036 -166108 -68245 113612 -265588 124954
9513b19350M1622r7615J35846G1497a7081j97855N5974k39210e7872J1312j5417
$$ -219350 -177728 -275343 -139497 71497 -17081 -214936 -158962 -398172 -57872 -46560 -61977
9502f1977j6247m62748b13645B13335D77a56052a3207r899A1866J05908P3333
$$ -61977 -78224 -540972 -213645 213335 477 -156052 -13207 -23106 11866 117774 191107
9491A91107b7175A50280B0746B510J68057G0205b7461k24290B86687f3108j69804
$$ 191107 -27175 150280 20746 2510 170567 70205 -27461 -251751 286687 -63108 -232912
9480b32912P7857A25533a7128j5988k38056E3467h1177k02401a06580B82266a29905
$$ -232912 -155055 125533 -17128 -33116 -271172 53467 -81177 -283578 -106580 282266 -129905
9468b26474B00920a5310j45310M4868k47505N806l72h3818b605k32290A21058
$$ -226474 200920 -15310 -160620 -115752 -363257 -357451 -357823 -83818 -2605 -234895 121058
9456I7464J04900n2894i7872m981k9602m8053A32909n854c76369f078A27962C9674
$$ 97464 202364 149470 -97872 -102853 -132455 -180508 132909 127055 -376369 -6078 127962 39674
9443a85091B2005E411b65372q5845a62357E4429a23455a4571E0667b43885a05915
$$ -185091 22005 5411 -265372 -351217 -162357 54429 -123455 -14571 50667 -243885 -105915
9431A4345L7016a50108o4145B12517A4213c37785i9176l18128A42667C1590C668
$$ 14345 51361 -150108 -214253 212517 14213 -337785 -99176 -417304 142667 31590 3668
9419e5190n38877f7191B05729f3500j6385B52041i822A41641f9786F9922b36796
$$ -55190 -594067 -67191 205729 -63500 -79885 252041 -9822 141641 -69786 69922 -236796
9407A20698a89041o8152f1841j72514a9018c867k29724Q3391e8252A3342R5644
$$ 120698 -189041 -257193 -61841 -234355 -19018 -3867 -233591 -150200 -58252 13342 108986
9396A08986i1172A0201b00088P2510b6843I695L65373e97830a63137l01296i2838
$$ 108986 -91172 10201 -200088 -127578 -26843 9695 375068 -597830 -163137 -464433 -92838
9384H8839R0504h0529i228B02622c00282c4555F8850a22870A23822g8021A30633
$$ 88839 179343 -80529 -9228 202622 -300282 -34555 68850 -122870 123822 -78021 130633
9372a095j22920f1095B53159b83657a13074C59559a58151j56477A79375b49351
$$ -1095 -124015 -61095 253159 -283657 -113074 359559 -158151 -314628 179375 -249351
9361I2327K49532A5886c25473A81514a1866A08962b68111N2672j15400i2398p4613
$$ 92327 341859 15886 -325473 181514 -11866 108962 -268111 -215439 -330839 -92398 -167011
9350a67011D7244q133b06183b946n004F5076K83408B9592J40509c37483F3718
$$ -167011 47244 39111 -206183 -2946 -7950 65076 348484 29592 170101 -337483 63718
9338a05994H7918a67525B59030b55903R4515M9482A12255g3917B79793A31502
$$ -105994 87918 -167525 259030 -255903 -161388 -111906 112255 -73917 279793 131502
9327b66332R4801C2084c4035H3507A6015a64939j64976R1421C9167e4137B1541
$$ -266332 -171531 32084 -34035 83507 16015 -164939 -329915 -238494 39167 -54137 21541
9315a02944J9735C76874j43418B2084a16964j4563I4649l0831c06233E6600j8470
$$ -102944 -83209 376874 233456 22084 -116964 -131527 94649 63818 -306233 56600 38130
9304C8130a65944d2729l77702B6148d51129E529J52493d4648f92A87502a310B16773
$$ 38130 -165944 -42729 -420431 26148 -451129 5529 158022 -44648 -692 187502 -1310 216773
9291G3392a77730D1281b8497n1446b0688G2767c06422J5111A32366b43191M2235
$$ 73392 -177730 41281 -28497 -79943 -20688 72767 -306422 -291311 132366 -243191 -200956
9280b00956B98971D9805A2963a74220N7526K6116B81159a28899A24945h6238A90830
$$ -200956 298971 49805 12963 -174220 -116694 -90578 281159 -128899 124945 -86238 190830
9268b4692j69558h4210I0591f0956r9362d3843A22336a25124c2625C58467G7724
$$ -24692 -194250 -84210 90591 -60956 -160318 -43843 122336 -125124 -32625 358467 77724
9256B4219b4482e080D8290a07745q4399g2446m5679k18362b2296j13924C8290
$$ 24219 -24482 -5080 48290 -107745 -192144 -72446 -118125 -336487 -22296 -136220 38290
9244A2030a22238o5027b3249n1220j16060M0708a1951A89093C4397c29498A742
$$ 12030 -122238 -187265 -23249 -74469 -190529 -149821 -11951 189093 34397 -329498 1742
9232C599f0138j31909B10250b75645A73490b21356J07039k73563A33610J66130
$$ 3599 -60138 -192047 210250 -275645 173490 -221356 -114317 -387880 133610 299740
9222B99740K3231l1433c31214J00055j74889B37856e5536b7233k97954b2491E3359
$$ 299740 322971 291538 -331214 -231159 -406048 237856 -55536 -27233 -325187 -22491 53359
9210a01639k48511C0488M2997a44690N5657L6387l1565j1339B9122c9686r920
$$ -101639 -350150 30488 73485 -144690 -89033 -52646 -84211 -95550 29122 -39686 -49606
9199d9606n585k84741A49117a00775l79752a04157k7179B0925i9346j35440B70227
$$ -49606 -55191 -339932 149117 -100775 -480527 -104157 -131336 20925 -99346 -234786 270227
9187d0631j30626L744o1281M6837B9214b78254B31868D8659c3175J2551j66348
$$ -40631 -171257 -167513 -228794 -181957 29214 -278254 231868 48659 -33175 -20624 -186972
9176a86972j04556J43026j93120g8994j266F3557a96055d9580k6456D9389R5528
$$ -186972 -291528 -148502 -341622 -78994 -80260 63557 -196055 -49580 -76036 49389 144917
9165A44917F5998L6351i6143k1253A4205J3667c89016D1416c1276A11877N886
$$ 144917 65998 102349 -96143 -117396 14205 27872 -389016 41416 -31276 111877 117763
9154A17763O5872g5995B25958b80261A08229H013a10889q5178A68176a7955A53328
$$ 117763 183635 -75995 225958 -280261 108229 8013 -110889 -196067 168176 -17955 153328
9142I084a89477C869J54135c2155D3725e6644a7993k82188K8146k3499B9354h1539
$$ 9084 -189477 3869 158004 -32155 43725 -56644 -17993 -300181 -272035 -295534 29354 -81539
9129c32140B0868c0316l34188a07105G0316h3801A13920b0200N192k95661a10698
$$ -332140 20868 -30316 -364504 -107105 70316 -83801 113920 -20200 -15008 -310669 -110698
9117b35770j90063H1410b47974m7422J29072L3001c6303B77194i6803C10118a85585
$$ -235770 -425833 81410 -247974 -295396 -166324 -133323 -36303 277194 -96803 310118 -185585
9105I6737k4266k8552B0411J7856L9028c18444J10054O6625m4199C80886j15176
$$ 96737 72471 43919 20411 38267 77295 -318444 -208390 -141765 -185964 380886 265710
9094B65710a91174B53009i1079D098i7829j43130h0979c172D6702b41535A04413
$$ 265710 -191174 253009 -91079 4098 -97829 -240959 -80979 -3172 46702 -241535 104413
9082H1550a27823q0561C0142a30452l3655g8185E6197e32705a19123l988A61513
$$ 81550 -127823 -208384 30142 -130452 -164107 -78185 56197 -532705 -119123 -123111 161513
9070F7150a51010B25294c60649H801b3937C6470b43158N8465j49325J64911O7682
$$ 67150 -151010 225294 -360649 8801 -23937 36470 -243158 -184693 -334018 -169107 -101425
9059a01425j56133A5069J02516K32732g4325l8301q5318P6188D8114g6980F4654
$$ -101425 -257558 15069 117585 350317 -74325 -112626 -197944 -121756 48114 -76980 64654
9047A28118a07460F1443N9332a4025j60570H9854E01L28215g5658j87166A03922
$$ 128118 -107460 61443 120775 -14025 -174595 89854 501 328716 -75658 -262824 103922
9035A64346b23343A9309J16a72374k7783A51653b36219M6515Q3115C12768a63442
$$ 164346 -223343 19309 19425 -172374 -200157 151653 -236219 -189704 -106589 312768 -163442
9023a29764A56129b62984A56999n9487a10326a8313o7276q1071q7142h2370B85556
$$ -129764 156129 -262984 156999 97512 -110326 -18313 -85589 -166660 -253802 -82370 285556
9011A1627c35860J2190A13631K7420Q9003a60913j80987C0494a07532E1374b94053
$$ 11627 -335860 -323670 113631 141051 230054 -160913 -341900 30494 -107532 51374 -294053
8999b64292B2156b09701h4511A93996o155e926k69292b1148k16549B5814g5653
$$ -264292 22156 -209701 -84511 193996 187841 -5926 -275218 -21148 -237697 25814 -75653
8987b37788f3768l24567A5043O8794i3522l29459e0121B16654B8316a7099j45919
$$ -237788 -63768 -388335 15043 83837 -93522 -422981 -50121 216654 28316 -17099 -163018
8976a63018k56644A76326a06539m5804k03088B932c285G0240b41938A07161c46425
$$ -163018 -419662 176326 -106539 -152343 -355431 2932 -3285 70240 -241938 107161 -346425
8964f3438m12109a37398N1667j72433O8810e0446k1931A793K42456I6228B3274
$$ -63438 -475547 -137398 -85731 -258164 -189354 -50446 -72377 1793 244249 96228 23274
8952b92626A4216J06154a48531C197J15193G57a01361A7649J3132g1855A36902
$$ -292626 14216 120370 -148531 3197 118390 757 -101361 17649 30781 -71855 136902
8940B26192e6021l15162C1836Q0272O1137o1067J14503b96026F4165Q0094a48971
$$ 226192 -56021 -371183 31836 112108 173245 112178 226681 -296026 64165 144259 -148971
8928c93739a18387q5072r2031C9181a0817k01228O6304B01800G386J01314J83755
$$ -393739 -118387 -203459 -295490 39181 -10817 -212045 -145741 201800 7386 108700 292455
8917B92455e3312A27965Q742b4656q5167b7919E544L2418O0586a41638A86170
$$ 292455 -53312 127965 136707 -24656 -109823 -27919 5544 37962 98548 -141638 186170
8905A59998Q0238j06278A9726d5462I8597E218a25074K0035J9556q4892A01816
$$ 159998 240236 133958 19726 -45462 98597 5218 -125074 -105039 -85483 -170375 101816
8893a27494j4160f8911l4686l4195d7850j02492A14055b39420I5234b2356k27921
$$ -127494 -141654 -68911 -103597 -137792 -47850 -150342 114055 -239420 95234 -22356 -250277
8882b50277B59897b45883A25205f8115j9522E4898J87656a99880o032R4314L330
$$ -250277 259897 -245883 125205 -68115 -87637 54898 242554 -199880 -205912 -111598 -108268
8871a08268j25024C54095c1266k01122R695a10211n9874A67267G4365g1708l47590
$$ -108268 -233292 354095 -31266 -232388 -222693 -110211 -170085 167267 74365 -71708 -419298
8860d19298a50221A21576J39962A21965R5796c8227r5740k003l0398A48204b33625
$$ -419298 -150221 121576 261538 121965 217761 -38227 -133967 -135970 -166368 148204 -233625
8848a77699d614j33573A58048b23792A76742G6592f911m9071F5778k0587b24358
$$ -177699 -4614 -138187 158048 -223792 176742 76592 -6911 -55982 65778 45191 -224358
$$ [...]
##END NTUPLES=NMR SPECTRUM
##END=
