##TITLE=AC1649_NBEAH14350_8531133_033N9jJmXH
##JCAMPDX= 6.0         $$ Bruker NMR JCAMP-DX V2.0
##DATA TYPE= NMR SPECTRUM
##DATA CLASS= NTUPLES
##ORIGIN= BRUKER
##OWNER= Administrator
$$ 1.72 TOPSPIN		Version 2.1
$$ 2015-08-11 17:28:20.867 -0700  Administrator@X
$$ Compression mode = diff/dup
##.OBSERVE FREQUENCY= 400.02188249412
##.OBSERVE NUCLEUS= ^1H
##.ACQUISITION MODE= SIMULTANEOUS (DQD)
##.ACQUISITION SCHEME= undefined
##.AVERAGES= 8
##.DIGITISER RES= 22
##SPECTROMETER/DATA SYSTEM= spect
##.PULSE SEQUENCE= zg30
##.SOLVENT NAME= COFFEE_meoh
##.SHIFT REFERENCE= INTERNAL, COFFEE_meoh, 1, 14.98509
##AUDIT TRAIL= $$ (NUMBER, WHEN, WHO, WHERE, PROCESS, VERSION, WHAT)
$$ ##TITLE= Audit trail, TOPSPIN		Version 2.1
$$ ##JCAMPDX= 5.01
$$ ##ORIGIN= Bruker BioSpin GmbH
$$ ##OWNER= Administrator
$$ $$ E:\/data/COFFEE/nmr/AC1649_NBEAH14350_8531133_033N9jJmXH/30/pdata/1/auditp.txt
$$ ##AUDIT TRAIL=  $$ (NUMBER, WHEN, WHO, WHERE, PROCESS, VERSION, WHAT)
(   1,<2015-08-11 17:28:13.710 -0700>,<Administrator>,<X>,<go>,<TOPSPIN 2.1>,
      <created by zg
	started at 2015-08-11 17:27:07.851 -0700,
	POWCHK enabled, PULCHK disabled,
       configuration hash MD5:
       21 0F 79 D6 B3 7B B4 F6 88 20 88 DB 03 48 BD 9F
       data hash MD5: 64K
       7B 29 24 D6 F3 18 4F CD 01 94 73 1E 98 FC 7A 4E>)
(   2,<2015-08-11 17:28:16.851 -0700>,<Administrator>,<X>,<proc1d>,<TOPSPIN 2.1>,
      <Start of raw data processing
       efp LB = 0 FT_mod = 6 PKNL = 1 PHC0 = 0 PHC1 = 0 SI = 32K 
       data hash MD5: 32K
       BD B5 3D 52 E3 BE 5E DC 09 D9 EB 9C F4 4C 8F 00>)
(   3,<2015-08-11 17:28:17.164 -0700>,<Administrator>,<X>,<proc1d>,<TOPSPIN 2.1>,
      <pk PHC0 = 86.19324 PHC1 = 0 
       data hash MD5: 32K
       7B D4 9F BB 53 A3 56 37 B5 BA D3 AB 59 A3 9A 72>)
(   4,<2015-08-11 17:28:17.273 -0700>,<Administrator>,<X>,<proc1d>,<TOPSPIN 2.1>,
      <abs ABSG = 1 
       data hash MD5: 32K
       01 17 95 C7 92 68 D0 15 5A C5 FA 79 56 2A 4E CA>)
(   5,<2015-08-11 17:28:17.335 -0700>,<Administrator>,<X>,<proc1d>,<TOPSPIN 2.1>,
      <abs ABSG = 2 
       data hash MD5: 32K
       AA 70 B4 E3 89 3D DC BF 81 00 60 02 BB 0C FD 91>)
(   6,<2015-08-11 17:28:17.398 -0700>,<Administrator>,<X>,<proc1d>,<TOPSPIN 2.1>,
      <abs ABSG = 3 
       data hash MD5: 32K
       5F 7F 99 76 9E 42 2D 15 39 5F 59 ED F8 07 A0 F2>)
(   7,<2015-08-11 17:28:17.460 -0700>,<Administrator>,<X>,<proc1d>,<TOPSPIN 2.1>,
      <abs ABSG = 4 
       data hash MD5: 32K
       28 99 F2 A8 96 20 4C 01 53 E4 B5 74 15 8E 53 9A>)
(   8,<2015-08-11 17:28:17.523 -0700>,<Administrator>,<X>,<proc1d>,<TOPSPIN 2.1>,
      <abs ABSG = 5 
       data hash MD5: 32K
       A4 89 57 4C 27 5E EB 0C 39 FF A5 A0 9E 39 59 9A>)
$$ ##END=
$$ 
$$ $$ hash MD5
$$ $$ 78 63 A4 A2 AC 0B D4 FB A3 78 89 1F C6 AD 09 10
##$RELAX= 
##$RELAX= 
##$RELAX= 
##$RELAX= 
##$RELAX= 
##$RELAX= 
##$RELAX= 
$$ Bruker specific parameters
$$ --------------------------
##$DU= <E:\>
##$EXPNO= 30
##$NAME= <AC1649_NBEAH14350_8531133_033N9jJmXH>
$$ [...]
150 150 150 150 150 150 150 150
##$TP07= 0
##$TPNAME0= <>
##$TPNAME1= <>
##$TPNAME2= <>
##$TPNAME3= <>
##$TPNAME4= <>
##$TPNAME5= <>
##$TPNAME6= <>
##$TPNAME7= <>
##$TPOAL= (0..7)
0.5 0.5 0.5 0.5 0.5 0.5 0.5 0.5
##$TPOFFS= (0..7)
0 0 0 0 0 0 0 0
##$TUNHIN= 0
##$TUNHOUT= 0
##$TUNXOUT= 0
##$USERA1= <user>
##$USERA2= <user>
##$USERA3= <user>
##$USERA4= <user>
##$USERA5= <user>
##$V9= 5
##$VALIST= <valist>
##$VCLIST= <CCCCCCCCCCCCCCC>
##$VD= 0
##$VDLIST= <DDDDDDDDDDDDDDD>
##$VPLIST= <PPPPPPPPPPPPPPP>
##$VTLIST= <TTTTTTTTTTTTTTT>
##$WBST= 2048
##$WBSW= 25
##$XGAIN= (0..3)
0 0 0 0
##$XL= 0
##$YL= 0
##$YMAX_a= 590954
##$YMIN_a= -520867
##$ZGOPTNS= <>
##$ZL1= 120
##$ZL2= 120
##$ZL3= 120
##$ZL4= 120
##$ABSF1= 14.98509
##$ABSF2= -5.573092
##$ABSG= 5
##$ABSL= 3
##$ALPHA= 0
##$AQORDER= 0
##$ASSFAC= 0
##$ASSFACI= 0
##$ASSFACX= 0
##$ASSWID= 0
##$AUNMP= <proc_prof1d_extract_pilot.lims>
##$AXLEFT= 0
##$AXNAME= <>
##$AXNUC= <1H>
##$AXRIGHT= 0
##$AXTYPE= 0
##$AXUNIT= <>
##$AZFE= 0.1
##$AZFW= 0.1
##$BCFW= 0
##$BC_mod= 0
##$BYTORDP= 0
##$COROFFS= 0
##$CY= 15
##$DATMOD= 1
##$DC= 0
##$DFILT= <>
##$DTYPP= 0
##$F1P= 0
##$F2P= 0
##$FCOR= 0.5
##$FTSIZE= 32768
##$FT_mod= 6
##$GAMMA= 0
##$GB= 0
##$INTBC= 1
##$INTSCL= 1
##$ISEN= 128
##$LB= 0
##$LEV0= 0
##$LPBIN= 0
##$MAXI= 10000
##$MC2= 0
##$MEAN= 0
##$ME_mod= 0
##$MI= 0
##$NCOEF= 0
##$NC_proc= -8
##$NLEV= 6
##$NOISF1= 0
##$NOISF2= 0
##$NSP= 0
##$NTH_PI= 0
##$NZP= 0
##$OFFSET= 14.98509
##$PC= 1
##$PHC0= 86.19324
##$PHC1= 0
##$PH_mod= 1
##$PKNL= yes
##$PPARMOD= 0
##$PPDIAG= 0
##$PPIPTYP= 0
##$PPMPNUM= 2147483647
##$PPRESOL= 1
##$PSCAL= 4
##$PSIGN= 0
##$PYNMP= <proc.py>
##$REVERSE= no
##$SF= 400.02
##$SI= 32768
##$SIGF1= 0
##$SIGF2= 0
##$SINO= 400
##$SIOLD= 32768
##$SPECTYP= <>
##$SREGLST= <1H.CDCl3>
##$SSB= 0
##$STSI= 32768
##$STSR= 0
##$SW_p= 8223.68421052631
##$SYMM= 0
##$S_DEV= 0
##$TDeff= 65536
##$TDoff= 0
##$TI= <>
##$TILT= no
##$TM1= 0
##$TM2= 0
##$TOPLEV= 0
##$USERP1= <user>
##$USERP2= <user>
##$USERP3= <user>
##$USERP4= <user>
##$USERP5= <user>
##$WDW= 1
##$XDIM= 32768
##$YMAX_p= 453272232
##$YMIN_p= -654370
##$CURPLOT= <Network HP LaserJet P1505>
##$CURPRIN= <$Network HP LaserJet P1505>
##$DFORMAT= <normdp>
##$LAYOUT= <+/1D_H.xwp>
##$LFORMAT= <normlp>
##$PFORMAT= <normpl>
##$SURQMSG= 1
$$ End of Bruker specific parameters
$$ ---------------------------------
##NTUPLES= NMR SPECTRUM
##VAR_NAME=  FREQUENCY,     SPECTRUM/REAL,   SPECTRUM/IMAG
##SYMBOL=    X,             R,               I
##VAR_TYPE=  INDEPENDENT,   DEPENDENT,       DEPENDENT
##VAR_FORM=  AFFN,          ASDF,            ASDF
##VAR_DIM=   32768,         32768,           32768
##UNITS=     HZ,            ARBITRARY UNITS, ARBITRARY UNITS
##FACTOR=    0.250966925370066, 1,           1
##FIRST=     8223.43324360094, -43718,       130784
##LAST=      0,             -119197,         -93202
##MIN=       0,             -654370,         0
##MAX=       8223.43324360094, 453272232,    0
$$ Real data points
##PAGE= N=1
##DATA TABLE= (X++(R..R)), XYDATA
$$ [...]
19557E8265a3263A26558i2058k8907A28610L0143F1225c57925Q2925E566a86303
19545A92992a57109a5115A15186a28122A27670f1903i405B3660c2692l5526G0629
19533D00J33580g4065n3453C72392d6686B1717f2327A12885f728A37795C1358
19521a69733A91687b00034l2562j1995L9737a198A08747j5729K56641b76143B82214
19509f7962A65155o6848c8117j41874j37279i2499B28596A02998J74576E2080
19498c81503d3400F0007b03120q4465M6810B5163J35164C2421e82036b38890J07650
19487a31240d0028l8287j07714a4761A28725b29991j11380c1920a2542j351q7907
19476a01800H0692f6287p4836A05899c3505q8701G804a67116g7602K2464C7959
$$ y = [58265, -13263, 126558, -92058, -120965, 128610, 158753, 61225, -357925, -275000, 5566, -186303, 192992, -157109, -15115, 115186, -128122, 127670, -61903, -9405, 23660, -32692, -68218, 70629, 400, 133980, -74065, -127518, 372392, -46686, 21717, -62327, 112885, -6728, 137795, 31358, -169733, 191687, -200034, -232596, -244591, -204854, -1198, 108747, 93018, 349659, -276143, 282214, -67962, 165155, 98307, -38117, -179991, -317270, -92499, 228596, 102998, 277574, 52080, -381503, -43400, 60007, -203120, -287585, -240775, 25163, 160327, 32421, -582036, -238890, -131240, -40028, -78315, -186029, -14761, 128725, -229991, -341371, -31920, -12542, -13893, -101800, 80692, -66287, -141123, 105899, -33505, -122206, 7804, -167116, -77602, -55138, 37959]
19464h4702F8057K3108a21619e3852a1128B44804b27553I3502J41087F2148h4326
19452b43994c953A65815a85442e7440j2011E119a52022I86b17917E4910c04559
19440f6538A37170K14944b46573c2269j45887n3476N3191c1494j16010M5853j66329
19429b67980G8689r904d73589J9311a64873A57400d29341i1709d5197J4409E4628
19417c14747Q4827l3174G0770b99935A0148a37452B36281b87121d8875H0477L6446
19406A16923J16658a86808C1058K93356j59919a6873f906j49309l4419O2621O0098
19395f7915I8122J24486b49260H2839e6799j7818j80799A28469b6850j50536m7143
19384b24529I2113h6762A23757e16502I2058j2635l4639R0210g628j88604O4500
$$ y = [-84702, 68057, 91165, -121619, -53852, -11128, 244804, -227553, 93502, 234589, 62148, -84326, -243994, -3953, 165815, -185442, -57440, -69451, 5119, -152022, 986, -217917, 54910, -304559, -66538, 137170, 352114, -246573, -32269, -178156, -231632, -178441, -31494, -147504, -101651, -267980, 78689, 68785, -473589, -454278, -164873, 157400, -429341, -91709, -45197, -30788, 54628, -314747, -229920, -263094, 70770, -299935, 10148, -137452, 236281, -287121, -48875, 80477, 116923, 233581, -186808, 31058, 324414, 164495, -16873, -6906, -156215, -190634, -128013, -67915, 98122, 222608, -249260, 82839, -56799, -74617, -255416, 128469, -26850, -177386, -224529, 92113, -86762, 123757, -516502, 92058, 79423, 44784, 134994, -7628, -196232, -131732]
19373a31732n651A65873K11722a14142A00615K63470A23609J2880l7073B9208
19362H1860I22P6006A1098a65973j20128C9426b03194a5373B8549K16560b02163
19350a04775m2441j55208J1654g1409l37364h8196A22593b39667I1883a4773E5490
19338A93100I0453C9607a93842A62759b67280d1725r669n6120F3122j3343g5101
19326E8175L40026a60828D71b53866a16137j1868k28513B96214I1295a77029j82355
19315c59384O6365a03043c4793H7285d6523l95093A78737C9736i9407A68117c46213
19303d92449D0255c81884J33711D2203M2437H892J05952D9247f1329K3433C2743
19291a82259k4091i9456j72828I6407a10535A87592E2476f0190l6466j43290a18541
$$ y = [-131732, -137383, 165873, 377595, -114142, 100615, 364085, 123609, 136489, 99416, 29208, 81860, 922, 76928, 11098, -165973, -286101, 39426, -203194, -15373, 28549, 245109, -202163, -104775, -147216, -302424, -290770, -71409, -408773, -88196, 122593, -239667, 91883, -14773, 55490, 193100, 90453, 39607, -193842, 162759, -267280, -41725, -51394, -107514, 63122, 49779, -75101, 58175, 398201, -160828, 471, -253866, -116137, -128005, -356518, 296214, 91295, -177029, -359384, -293019, -103043, -34793, 87285, -46523, -441616, 178737, 39736, -99407, 168117, -346213, -492449, 40255, -381884, -248173, 42203, 84640, 8892, 114844, 49247, -61329, -37896, 32743, -182259, -206350, -99456, -272284, 96407, -110535, 187592, 52476, -60190, -96656, -239946, -118541]
19279c81493a50946O8603r7326F4939h6246C0956J66400a27594e7398j18997d3564
19267A00699K10684b15572a06804h430j704p9551K1288j03635M5235A9710c7468
19255a23508B54023h9482L5654k766k4641A06424b45836B1018N5955J52362A4158
19243a99585e7653A15629a35288l6845j37640F8361g8028C62080A9313c3984h417
19231a73976A80247G9876b03557N6958M347L3711A09854e2842k18443q8095f2943
19219b7400j41356n0576B36501b98790C0372M4550O2822L2017E4806b1806j48561
19208a70367K8903j31023A117a2774n3487a7710j25231j25294I8579a76025g2519
19196c7630o6343j09565r1759a12385C02570b08422h4629j20191J7194B16682
$$ y = [-381493, -150946, -82343, -179669, 64939, -86246, 30956, 197356, -127594, -57398, -176395, -43564, 100699, 311383, -215572, -106804, -8430, -10134, -89685, -68397, -172032, -126797, 19710, -37468, -123508, 254023, -89482, -53828, -56594, -81235, 106424, -245836, 21018, 76973, 229335, 14158, -199585, -57653, 115629, -135288, -172133, -309773, 68361, -78028, 362080, 19313, -33984, -8417, -173976, 180247, 79876, -203557, -146599, -142252, -108541, 109854, -52842, -271285, -359380, -62943, -27400, -168756, -219332, 236501, -298790, 30372, 74922, 137744, 169761, 54806, -21806, -170367, -141464, -272487, 1117, -12774, -66261, -17710, -142941, -268235, 98579, -176025, -72519, -37630, -103973, -213538, -305297, -112385, 302570, -208422, -84629, -204820, -187626, 216682]
19185b04117a6682A7056b8783j48984i236m7186K439A05556d33942b14818G7008
19173a54748m639C0344J84462A9636a82574e3849A19956a74966E7360c91541a03359
19161A44427b40881a2619A36735f1623J5050j57094a01093c5840n8996m1176o5506
19150b01518f0536j43523k47966J92561C0960b17507o2104A80364b65389i4057
19139b05266A70882a1014r4438M414I1316k4202c54791A82036a88847c7738A78335
19127B18259h8453g645j49947A59702A6712b44137O3704f4588J8077B79706a28220
19115c23412C62188j04455H08b95217a04014C6090a48411k48087a23945B1770
19104C12454J99173e9183B87045A05364a73116E4619P6430A5002a30749q8904
$$ y = [-204117, -16682, 17056, -28783, -177767, -9236, -56422, -53983, 105556, -433942, -214818, 77008, -154748, -159387, 30344, 214806, 19636, -182574, -53849, 119956, -174966, 57360, -391541, -103359, 144427, -240881, -12619, 136735, -61623, -46573, -203667, -101093, -35840, -94836, -136012, -201518, -60536, -204059, -452025, -259464, 30960, -217507, -279611, 180364, -265389, -94057, -205266, 170882, -11014, -105452, -101038, 91316, 67114, -354791, 182036, -188847, -37738, 178335, 218259, -88453, -7645, -157592, 159702, 16712, -244137, -180433, -64588, -46511, 279706, -128220, -323412, 362188, 257733, 808, -295217, -104014, 36090, -148411, -396498, -123945, 21770, 312454, 511627, -59183, 287045, 105364, -173116, 54619, 131049, 15002, -130749, -219653]
19094b19653i1165A63346j4470a55532I8173d48036J98883F681l133b47916j35771
19083c83687i446r9192A02986a82050A14788O9264J03384h1892D2074J65133H7666
19071e389k17668F6955b33129K4377a01105k69613A96416n3771a4395j46726m7111
19060b08232Q9429j01378A08537a43005H540Q2368J32403b14177A20857E3296
19049A47182a18486B01558p9599J06762j00387K7543m6514a31726A97854E321
19038C45673j52913a22711L3590A2811b21626h0329m5616j54706c0020A70836
19027A67557P360e90119D07479A72537n1470N9996b087j62892j03628A08127d602
19015B49737g4373A49392k082F1281j139b50406Q4784P200d5172q1817m0824A20738
$$ y = [-219653, -91165, 163346, 148876, -155532, 98173, -448036, -249153, 6681, 3548, -247916, -383687, -9446, -108638, 102986, -182050, 114788, 184052, 287436, -81892, 42074, 207207, 87666, -5389, -223057, 66955, -233129, -208752, -101105, -370718, 196416, 142645, -14395, -161121, -208232, -118803, -220181, 108537, -143005, 8540, 90908, 223311, -214177, 120857, 53296, 147182, -118486, 201558, 121959, 228721, 128334, 155877, 109363, -131726, 197854, 5321, 345673, 192760, -122711, -89121, 12811, -221626, -80329, -125945, -280651, -30020, 170836, 167557, 174917, -590119, 407479, 172537, 121067, 181063, -2087, -164979, -268607, 108127, -4602, 249737, -74373, 149392, 147310, 61281, 60142, -250406, -165622, -158422, -45172, -126989, -167813, 120738]
19002a28589A51106a91278C56617a54959j7057P8226j39377B74754C5013M9423
18992H4436k6650b8852j13085j77009A40773g0362j24303p5001B2603b32875l2117
18981b64992A95158b44645N0366q1050L9587L0372e9166C4695F977M0381O99j8305
18969B9752N2799A3465d1785m35230G7518R6470d656k12189A41473a24441D0262
18957B8700a34283M0096G1883b14318a00896F506g1742H8854b94528d3812j63381
18946b07193q8679f3916I9766a2411A32566i7616q3179N5488l8120k2855A7524
18934B65042a00424I0871P739j6162J70409e1829j88462P023I899K03599b8264
18922c29131J60716k97951A999a35723j90271a46110I2305c6317p0136a8255A65277
$$ y = [-128589, 151106, -191278, 356617, -154959, -172016, -93790, -233167, 274754, 35013, 84436, 57786, -28852, -141937, -318946, 140773, -70362, -194665, -269666, 22603, -232875, -264992, 195158, -244645, -194279, -275329, -235742, -205370, -59166, 34695, 6977, 47358, 48057, 29752, 82551, 13465, -41785, -477015, 77518, 173988, -4656, -216845, 141473, -124441, 40262, 28700, -134283, -94187, 71883, -214318, -100896, 6506, -71742, 88854, -294528, -43812, -207193, -295872, -63916, 99766, -12411, 132566, -97616, -180795, -125307, -163427, -186282, 17524, 265042, -100424, 90871, 98610, 82448, 252857, -51829, -240291, -233268, 9899, 213498, -28264, -329131, -168415, -466366, 1999, -135723, -325994, -146110, 92305, -36317, -106453, -18255, 165277]
18910D0058b64368d1752k66999J34697I9529i1916d2849C83225H9076c9714q5062
18899a24776C29186a53180P6542b3256n4535J2287j65385l99689I5007Q0704B246
18887a59513J8304l7425K6243B23163q7876E2119P7717k8750a73915c1388A77146
18875f7124j39410Q8144B20463c87459a73082B9148j772J67829a04833H4220D135
18863a92401B42251k2041r4090c4640l5911b7216m5660J5269b3644k57643g8375
18851c74476A03874D3532M0990O4221b72132c9994J1278j78294f9920k51432Q1130
18840b40222M2705C37493j47091A1306b16221R6711P935j35545d1880k09111H6444
18828b21074B39141f4310F5370a25156C0809c9977h844j07524a128o8304A77982
$$ y = [40058, -264368, -41752, -308751, -174054, 99529, -91916, -42849, 383225, 89076, -39714, -124776, 329186, -153180, -76638, -23256, -77791, -65504, -230889, -630578, 95007, 175711, 2246, -159513, -141209, -178634, -152391, 223163, 135287, 52119, 129836, 101086, -173915, -31388, 177146, -67124, -206534, -118390, 220463, -387459, -173082, 29148, 27376, 195205, -104833, 84220, 4135, -192401, 242251, 220210, 126120, -34640, -70551, -27216, -72876, -57607, -23644, -281287, -78375, -374476, 103874, 43532, 84522, 148743, -272132, -39994, -28716, -207010, -69920, -321352, -240222, -197517, 337493, 190402, 11306, -216221, -119510, -111575, -247120, -41880, -250991, 86444, -221074, 239141, -64310, 65370, -125156, 30809, -39977, -8844, -116368, -1128, -69432, 177982]
18816h3825q0529D37433a77271A16588K95300q9859A52053F6758a48372A12507
18805A98646a07256c170j37639K2420F5208O4258n5946b85744I2665a32253A23590
18793i4288k23207B35104i5116d939k76313a08213j14874N5932j27632J24042
18783a70745m7218a08942L6297p7723m5878l70452c1616B83752H4621l7805j591
18772D5225a73805g5159j38293A74923c004m7707A31955a02712J9223j2209k31463
18761c27161P2403b3626j91380O890b4199A76656H1145a29339D7190b07705i5992
18749H7767Q2216a62638j28147d1027A18808i7803j69530G8070b24334D6528b38900
18737b8509A57956a5491j21571o4021G1852P8132a56388k7922A42381N7410K8777
$$ y = [-83825, -164354, 437433, -177271, 116588, 411888, 322029, 152053, 66758, -148372, 112507, 198646, -107256, -3170, -140809, -118389, 65208, 129466, 73520, -285744, 92665, -132253, 123590, -94288, -317495, 235104, -95116, -4939, -281252, -108213, -223087, -167155, -294787, -170745, -217963, -108942, -72645, -150368, -196246, -566698, -31616, 283752, 84621, 46816, 45225, -173805, -75159, -213452, 174923, -3004, -50711, 131955, -102712, -83489, -95698, -327161, -254758, -23626, -215006, -208116, -24199, 176656, 81145, -129339, 47190, -207705, -95992, 87767, 169983, -162638, -290785, -41027, 118808, -97803, -267333, 78070, -224334, 46528, -238900, -28509, 157956, -15491, -137062, -201083, 71852, 149984, -156388, -184310, 142381, 199791, 228568]
18726B28568a52026A43864h0773j97803E0475b84362b3304B32511F9110K1539
18716I0649R7011a87017A08860f3804k76504a23773E1693b60673L9549A03069
18705a14652K7313k4744j02811L1703B94078a9333j59832A82656K3310A00119
18694e2757k10077A36350d3381C5514c53656A40022J5601k5782A42K69791J5136
18683B85069a6948l53088J53370O3423J9526N2077A65597a46830G3636a17957
18672D4370N2348L5706c77664E9928c8778r4288M8324k27383K8040A80486a16327
18660B52202c84675g8909k12021J7110A19047n7527c51359B44875q5802a45123
18649a45045k45588m2189a6100O56j15746o2556H0474a87693r413f4097B7781
$$ y = [228568, -152026, 143864, -80773, -278576, 50475, -284362, -23304, 232511, 69110, 90649, 187660, -187017, 108860, -63804, -340308, -123773, 51693, -260673, -221124, 103069, -114652, -87339, -112083, -214894, -183191, 294078, -19333, -179165, 182656, 205966, 100119, -52757, -262834, 136350, -43381, 35514, -353656, 140022, 155623, 129841, 142, 269933, 285069, -16948, -370036, -216666, -153243, -133717, -81640, 165597, -146830, 73636, -117957, 44370, 96718, 132424, -377664, 59928, -38778, -133066, -84742, -312125, -284085, 180486, -116327, 252202, -384675, -78909, -290930, -273820, 119047, 61520, -351359, 244875, 159073, -145123, -145045, -390633, -432822, -16100, -15444, -131190, -193746, 80474, -187693, -197106, -64097, 27781]
18637a49427I0118B1829c32733B19811a9629k34329b1436B44199b71768a08413
18626b80031A57211a52018q1180l9870l0616B25678e5186j207A46213l1448c70033
18614d2059j22228J0850A81237a571B65947e252r0633C33581C6058e630j76829
18603a82459j23982a3964r3457b443k73840J00176g6540G9349J2371J50886a3835
18591b56022b2962o2542A12416a76777H3068a88333A02556f7601l5525k3321E445
18579a38518d6511A63917A7747b39410A64704d40326a29570q0010A8659J05154
18569A23813J9208d14729f98q2908d860j90800b8499G1386a36072j43719B95674
18557a53464F3174a73333L2200B1342O5295c37391f4544q0746B06001a89360A50375
$$ y = [-149427, 90118, 21829, -332733, 219811, -19629, -253958, -21436, 244199, -271768, -108413, -280031, 157211, -152018, -233198, -273068, -303684, 225678, -55186, -56393, 146213, 114765, -370033, -42059, -164287, -153437, 181237, -1571, 265947, -5252, -95885, 333581, 36058, -5630, -182459, -306441, -13964, -107421, -2443, -276283, -176107, -76540, 79349, 91720, 242606, -13835, -256022, -22962, -85504, 112416, -176777, 83068, -188333, 102556, -67601, -103126, -126447, 5445, -138518, -46511, 163917, 17747, -239410, 164704, -440326, -129570, -209580, 18659, 123813, 143021, -414729, -698, -83606, -4860, -195660, -28499, 71386, -136072, -279791, 295674, -153464, 63174, -173333, -141133, 21342, 86637, -337391, -64544, -145290, 206001, -189360, 150375]
18545H2831a65996f6313k48593I4570g0937J8477A0315M4109a63851F4996k4844
18534D0152g3986A0941b58845E001J22662L1275o6551H666a81542c2126A27203
18522G1774f2375j07707p5785f8467j7212o4836k0479g5070H0453q3b46140d8908
18509a47896k50463g8906l10889B40765a43459j26057a07273j73458A86705a15490
18498A48755I453c80457G4367B9291b87953a41434k3450C80399H436J21890b53825
18486H3859b1399B3476L9349J25663h8906c4187J0840A08984b4435o3889c4284
18474a89022M8767f200A91779h534k13314h7786B06623E0083q083b3542j99661
18463b23203K6877B9057L6693c5178b545G5170K24051a24015j51897P5775j91159
$$ y = [82831, -165996, -66313, -314906, 94570, -70937, -52460, 10315, 54424, -163851, 64996, 40152, -73986, 10941, -258845, 5001, 127663, 158938, 92387, 8666, -181542, -32126, 127203, 71774, -62375, -170082, -245867, -68467, -85679, -150515, -170994, -75070, 80453, 80370, -246140, -48908, -147896, -398359, -78906, -389795, 240765, -143459, -269516, -107273, -280731, 186705, -115490, 148755, 9453, -380457, 74367, 29291, -287953, -141434, -164884, 380399, 8436, 130326, -253825, 83859, -21399, 23476, 62825, 188488, -88906, -34187, -23347, 108984, -24435, -88324, -34284, -189022, -140255, -6200, 191779, -8534, -221848, -87786, 206623, 50083, 42000, -23542, -223203, -196326, 29057, 65750, -35178, -2545, 75170, 299221, -124015, -275912, -200137, -391296]
18452c91296N5089D720O4510c33726B29175c32160B94883j28565g0916K8005m0984
18441h3895c2691l6758A50176b00724e5226J1444j07599j91338a0727q8057K765
18430i6019k9771j9054a2957B14971c49494B43127a39546G7140c39699a4275E0195
18418h8823L925H2826J418b7018B1816b50495a6532m13087P7643A43014a74998
18406c09054f8674M987C3455K33243h5855j45661n3320E1767L3986J6247C7098
18394b58048a032E0604J40136f035A9744a57324A23049C8890l226G100a7598C1929
18381a26504B81042a2560j12350F3759O3377F0387f2429A11165i2232a7085C07419
18369a69437N2014I0851N8204J0194D0261i6808l31087D8875b11985l5946D5693
$$ y = [-391296, -336207, 4720, 69230, -333726, 229175, -332160, 294883, 166318, -70916, -42911, -83895, -32691, -69449, 150176, -200724, -55226, -43782, -151381, -342719, -10727, -98784, -96019, -125790, -144844, -12957, 214971, -349494, 243127, -139546, 77140, -339699, -14275, 50195, -88823, -84898, 82826, 84244, -27018, 21816, -250495, -16532, -429619, -351976, 143014, -174998, -309054, -68674, -63687, 33455, 266698, -85855, -231516, -284836, 51767, 85753, 102000, 37098, -258048, -1032, 50604, 190740, -6035, 19744, -157324, 123049, 38890, 35664, 7100, -17598, 31929, -126504, 281042, -12560, -124910, 63759, 127136, 60387, -62429, 111165, -92232, -17085, 307419, -169437, -117423, 90851, 149055, 159249, 40261, -96808, -427895, 48875, -211985, -247931, 45693]
18357B40176g390j95525b625l8100A69005a81221j31475a19374H4774c3308j46686
18346a79994A85011l8613c35253h1758F9852J23338g0682A71598b58015a7289
18335A03412e87933b25315A00775g1454A60649a38853C5189b55842I6304m7074
18325D9230b6901k0471A04598h6736A93934H3696a71391C31897a01558m0408k1797
18314a63763m0706A14482I396J63006C8030o974a09674A105K27210b55923e0467
18302B43241a22157B73371d98025M3806a60685j06379g008A04168c20562J03400
18292b17162O0338c3589j03926d8048A33716k3231a6347l75948J85923A59569
18281a85330f8242j29497C81663A35856a89956D0132c9566l4886o0294B8039O1261
$$ y = [240176, -7390, -202915, -2625, -40725, 169005, -181221, -312696, -119374, 84774, -33308, -179994, 185011, 146398, -335253, -81758, 69852, 193190, -70682, 171598, -258015, -17289, 103412, -587933, -225315, 100775, -71454, 160649, -138853, 35189, -255842, 96304, 49230, -26901, -47372, 104598, -86736, 193934, 83696, -171391, 331897, -101558, -141966, -163763, -204469, 114482, 9396, 172402, 38030, 31056, -109674, 1105, 228315, -255923, -50467, 243241, -122157, 273371, -498025, -454219, -160685, -267064, -7008, 104168, -320562, -217162, -156824, -33589, -137515, -48048, 133716, 110485, -16347, -392295, -206372, 159569, -185330, -68242, -197739, 381663, 135856, -189956, 40132, -39566, -74452, -134746, 28039, 89300]
18270H9300K0161L392a87290R1099H7764J07695b4932q6300l6205A62114a061
18258b7234j48697e0885B05378a50627f2258a1532A80380n7439b30460j809B35413
18246e9424l327D05372E5397j923b72681A59024B5683K27189a14586I3122h2980
18234D1724i8256M3615k63512E5528h0858j74323a06253Q773J6543L7130k472
18223d6279B13689r0677B4599g2537j15767A82109b51650M5282B36869b56055
18212F8081J46050c17967i9472A04308B8102M3784R4568a3577A92098m4853d83110
18200a24309k01698J48948c1950B1065k459J83624b12166J9801b5195l05801h3511
18188B6754c84896J3989J37199B4591c69942B07400c7684l32462h4264A95853
$$ y = [89300, 109461, 112853, -187290, -96191, 87764, 195459, -24932, -111232, -147437, 162114, -1061, -27234, -175931, -50885, 205378, -150627, -62258, -11532, 180380, 122941, -230460, -232269, 235413, -59424, -62751, 405372, 55397, 53474, -272681, 159024, 25683, 252872, -114586, 93122, -82980, 41724, -98256, -54641, -318153, 55528, -80858, -255181, -106253, -97480, -80937, -43807, -46279, 213689, 123012, 24599, -72537, -188304, 182109, -251650, -206368, 236869, -256055, 68081, 214131, -317967, -99472, 104308, 28102, 71886, 166454, -13577, 192098, 147245, -483110, -124309, -326007, -177059, -31950, 21065, 18606, 202230, -212166, -192365, -25195, -330996, -83511, 26754, -384896, -370907, -233708, 24591, -369942, 207400, -37684, -370146, -84264, 195853]
18177A64199D3463K57283B370J12210k8388e05326f6999j01487Q3482d09B50816
18165b84915e9241C47428H7692f1819c597A09977E3676a43498A81630a48233B87666
18153a74389o0571g8854L3021j05855b551A7049J3542c42170H3304b49416a12429
18141A14386c3558l6871A16579d924A55690h4526A31385e945l66675A37412R3306
18130B30718o5348a96414P0734j40884E6399c0427A72998Q6438r5260c43785J24347
18119b19438F5547e3260K5197l0405k03354i1442p5311M7407c9542j34836B77398
18107b1716H1532a45010P824L9124A59557l0240c19039M6743e5333n680K2251
18096c8762n9179m1606C81751A24980a03343D65f8671k950E8497M2916d35757
$$ y = [164199, 43463, 300746, 2370, 114580, 86192, -505326, -66999, -168486, -85004, -409, 250816, -284915, -59241, 347428, 87692, -61819, -3597, 109977, 53676, -143498, 181630, -148233, 287666, -174389, -234960, -78854, -45833, -151688, -2551, 17049, 30591, -342170, 83304, -249416, -112429, 114386, -33558, -70429, 116579, -4924, 155690, -84526, 131385, -5945, -372620, 137412, 230718, 165370, -196414, -125680, -266564, 56399, -30427, 172998, 259436, 164176, -343785, -219438, 65547, -53260, -28063, -58468, -261822, -91442, -166753, -119346, -39542, -174378, 277398, -21716, 81532, -145010, -137186, -98062, 159557, 129317, -319039, -272296, -55333, -61013, -38762, -97941, -139547, 381751, 124980, -103343, 465, -68671, -71621, 58497, 101413, -435757]
18084a54027B03786a96694i5523p4564H6414a59844B47316d2959R746j61728f3113
18072A69466b18437b5187j03723A77491J3971a58799k48548A40068b51006A12178
18061b86271B93627k6222a0748j09010d3474C11491b8578q4465k6524a4667j01461
18050a16128E9831J0599J17174h1222a0709m8633j45221b8767j80920G3727A2306
18038b66980I6025g8503j36541R16E3996A3782K40844e2442A27000b94790A64531
18026C28858d2622b0814O944l25581F6154N6088C0034a9790A26607C1759J45091
18015A76850O348f3706F8873h2975p9259f6507r487G8799n137K934d25927c130
18002D1141b3743j29864C06906a79758C987d0021H3500J11429b08613F2113b28124
$$ y = [-154027, 203786, -196694, -95523, -170087, 86414, -159844, 247316, -42959, -33213, -194941, -63113, 169466, -218437, -25187, -128910, 177491, 191462, -158799, -407347, 140068, -251006, 112178, -286271, 293627, 267405, -10748, -119758, -43474, 311491, -28578, -113043, -139567, -14667, -116128, 59831, 70430, 187604, -81222, -10709, -59342, -204563, -28767, -209687, 73727, 12306, -266980, 96025, -78503, -215044, -214128, 53996, 13782, 254626, -52442, 127000, -294790, 164531, 328858, -42622, -20814, -13870, -339451, 66154, 122242, 30034, -19790, 126607, 31759, 176850, 183198, -63706, 68873, -82975, -162234, -66507, -75994, 78799, 73662, 76596, -425927, -3130, 41141, -23743, -153607, 306906, -179758, 3987, -40021, 83500, 194929, -208613, 62113, -228124]
17990A63273L4413a66137j00595B53660A24636b86154a1638B26057f8308k59856
17980c28164A6931R0171p53K9966K9211C1275h2423A77081a75291H0706R9615
17969A80321e1522m7149m9837l09483A45051n2210l2960J6817B0516K1740N3236
17958I5492d6255I4578a46174p1845P1155c259B38852b34498F4722i6895D8037
17946A23860J65498H6285A7925J34757a49487j42765H7801b79059c4197C122a01553
17934f86j76431I3721N6534n6726L4163a7542m3656k41076j32530B7662Q7549
17923A15211g581o5823A18377J63057A39017L50188B25859a42701A89533l0263
17913A59270C6120h9924D1265a71425A91815c9461J2266j61692A42047l7073J86149
$$ y = [163273, 197686, -166137, -266732, 253660, 124636, -286154, -11638, 226057, -68308, -328164, 16931, 107102, 106349, 136315, 165526, 31275, -82423, 177081, -175291, 80706, 180321, -51522, -98671, -148508, -457991, 145051, 92841, 59881, 76698, 20516, 42256, 95492, -46255, 94578, -146174, -218019, -146864, -3259, 238852, -234498, 64722, -96895, 48037, 123860, 289358, 86285, 17925, 152682, -149487, -292252, 87801, -279059, -34197, 3122, -101553, -686, -177117, 93721, 150255, 93529, 127692, -17542, -61198, -302274, -434804, 27662, 115211, -7581, -73404, 118377, 281434, 139017, 489205, 225859, -142701, 189533, 159270, 36120, -89924, 41265, -171425, 191815, -39461, -27195, -188887, 142047, 104974, 291123]
17902B91123C0752a29705d0376E15Q9175a10250M8251m5199A11159d4590A06992
17890D824a16973l9351j5081A4676c7195C8477J17483b638B16106B2976f4072
17878a5124B04433a71734B50578A04108g6781B78300j24696p6352B7595c0519
17867A31102i3593H7164h5387A58882J28262m2494j07491A8623K40812e1315K5412
17856b5903k88484D5078K32343e029k30084J11478B23811b39858A29098J4g6476
17844a8424j3162k574j86981J07187F1470N0607a86750k0084E8583a06758r2831
17833a99589B09627a10347A35432a0264o9080A30787l2355a88778B57727a63127
17822A14423C8969O8973f3128A64262F9894J26080M7178A03746h5138A24937l4910
$$ y = [291123, 30752, -129705, -40376, 515, 89690, -110250, -61999, -107198, 111159, -44590, 106992, 4824, -116973, -156324, -171405, 14676, -37195, 38477, 155960, -2638, 216106, 22976, -64072, -15124, 204433, -171734, 250578, 104108, -76781, 278300, 153604, 77252, 27595, -30519, 131102, -93593, 87164, -85387, 158882, 287144, 244650, 137159, 18623, 259435, -51315, -25903, -314387, 45078, 277421, -5029, -235113, -123635, 223811, -239858, 129098, 129112, -76476, -18424, -31586, -34160, -221141, -113954, 61470, 112077, -186750, -206834, 58583, -106758, -199589, 209627, -110347, 135432, -10264, -79344, 130787, 98432, -188778, 257727, -163127, 114423, 38969, 107942, -63128, 164262, 69894, 195974, 243152, 103746, -85138, 124937, 90027]
17811I0027f6452A25446d4683A4480a08292A3001K46822d2168G7675B2133b13646
17799h5700A81610a35921D4527f5215E8208J0475K49036b86407O3963o5935J27289
17788a61090C441b43588P7112j88137A39423c36411Q7030G3425K15790j4309a23210
17776a91576O5443B23841O03a02312K1776D4292b51353a03698j39663a2011A74305
17764B02522A4362P8753a25905L9091H5929c03375h7839J7156G1493g8786m7619
17753a26405F7042c6907k1838p2380a4991k77886F2524b1965A59144D3912c932
17741b55867a6190j4615l16273b2322A04452a98109a0906l84j60266g0374p4831
17730a45205E6836a56377A15668K34136F5723C2621a77959G4238g6007k28005
$$ y = [90027, -66452, 125446, -44683, 14480, -108292, 13001, 259823, -42168, 77675, 22133, -213646, -85700, 181610, -135921, 44527, -65215, 58208, 68683, 317719, -286407, -222444, -288379, -161090, 3441, -243588, -166476, -354613, 139423, -336411, -249381, 73425, 289215, 274906, -123210, -191576, -126133, 223841, 224444, -102312, -80536, 44292, -251353, -103698, -243361, -12011, 174305, 202522, 14362, 93115, -125905, -86814, 85929, -303375, -87839, -70683, 71493, -78786, -126405, 67042, -36907, -58745, -131125, -14991, -292877, 62524, -21965, 159144, 43912, -3932, -255867, -16190, -30805, -347078, -22322, 104452, -198109, -10906, -11290, -171556, -70374, -145205, 56836, -156377, 115668, 349804, 65723, 32621, -177959, 74238, -76007, -304012]
17720c04012a46671F3878a41245A62089h2956j78833D0477a94184D7980b13791
17709i9760F4504c35434J58329A37112C4838o846K34595d6628A89478a3240r1492
17698a04732j06655H7959a6229k36410B12235M205M0912r6011q0321K7046d7657
17686i0739M4984A28629l4935a27156B88919l3690a15722r5969A99578k5928D02
17674b974j16796A89565k745k7702F0536a2900A69614f4517B45057j5390b754
17662C21799G395M6751N6495J40417E18d0727A320a50374L3023B1220b05512O1503
17650a44009C31390g2969B93131d3792A7783d62986J99373o7268B41481j0893
17640B30588A6759J15674j192c3262F4863a39275b9603H8377j520c7552I3816
$$ y = [-304012, -146671, 63878, -141245, 162089, -82956, -261789, 40477, -194184, 47980, -213791, -99760, 64504, -335434, -177105, 137112, 34838, 27992, 262587, -46628, 189478, -13240, -104732, -211387, 87959, -16229, -252639, 212235, 216440, 257352, 161341, 81020, 108066, -47657, -90739, -45755, 128629, 93694, -127156, 288919, 255229, -115722, -211691, 199578, 173650, 402, -2974, -119770, 189565, 186820, 159118, 60536, -12900, 169614, -64517, 245057, 229667, -2754, 321799, 7395, 54146, 110641, 251058, 518, -40727, 1320, -150374, -117351, 21220, -205512, -144009, 331390, -72969, 293131, -43792, 17783, -462986, -263613, -330881, 241481, 230588, 16759, 132433, 131241, -33262, 64863, -139275, -29603, 88377, 86857, -37552, 93816]
17628D6021M9354A1763O5298K00402a7138j16938H1224a37792m092I2675K64914
17617C57589b3133C53530o7929g8421A23017F1306N904Q0369O5096J81546f4142
17605F3064i4482k38518J03122f2716I5808J0803Q3021H975K5968K23304j17942
17594A40305D3057K5033k1638K35572j09515h2231k2932B18056b7574r2198D7431
17582a02889D9057k0089a00832B76089c2618j5214k4690A02431d8334B32588Q457
17571B41045A06593R0071R0905d9760k6366A77159d5868A18582c3567E2807K37879
17560B90686d9947F4881P7064m3208J2831a65114A18505B5357J32881J45579q0688
17549B23129G7267J66511a07862M2496m4251a0045A84555i3328A61234a58016
$$ y = [46021, 95375, 11763, 77061, 277463, -17138, -134076, 81224, -137792, -141884, 92675, 357589, -23133, 353530, 285601, -78421, 123017, 61306, 67210, 147579, 212675, 394221, -64142, 63064, -94482, -333000, -229878, -62716, 95808, 106611, 189632, 8975, 34943, 258247, 140305, 43057, 68090, 46452, 282024, 172509, -82231, -105163, 218056, -27574, -119772, 47431, -102889, 49057, 28968, -100832, 276089, -32618, -47832, -72522, 102431, -48334, 232588, 241045, 106593, 196664, 287569, -49760, -76126, 177159, -45868, 118582, -33567, 52807, 290686, -49947, 64881, 141945, 98737, 111568, -165114, 118505, 25357, 158238, 303817, 223129, 77267, 243778, -107862, -65366, -109617, -10045, 184555, -93328, 161234, -158016]
17538B03084K10346D772c5359j0905B4981r52P9206a2109B13992n8267L9114I5139
17525A40451m4682K63464A15344f8422F0537J9922B9556J2431B0445f3934j9200
17514h3134B04643n3165a75650B09274E6988K49802d7165B91789N8203a38522
17503c3804l7800A92924F451L19311D4909a5603m34011B90570A6031a69152B04346
17491C33713j48847k7418F4609K42983k9843j09668B7853K62302A30891J51300
17481B82191a31770c5544D0392f0276j37530B65797A06016a97657A86058Q4538
17471B70596A3805K688L018J66330J12597A41346K05848B5554J89641R1268A13682
17459A70364q644b12440A09836g5528D15080A91158f7512A86711Q1317M4046r1935
$$ y = [203084, 413430, 4772, -35359, -46264, 24981, 24029, 103235, -12109, 213992, 155725, 194839, 95139, 140451, 95769, 359233, 115344, -68422, 60537, 80459, 29556, 41987, 20445, -63934, -83134, 204643, 151478, -175650, 209274, 56988, 306790, -47165, 291789, 349992, -138522, -33804, -71604, 192924, 6451, 325762, 44909, -15603, -449614, 290570, 16031, -169152, 204346, 333713, 184866, 157448, 64609, 307592, 277749, 168081, 27853, 290155, 130891, 282191, -131770, -35544, 40392, -60276, -197806, 265797, 106016, -197657, 186058, 270596, 13805, 16493, 19511, 185841, 298438, 141346, 347194, 25554, 215195, 306463, 113682, 170364, 161720, -212440, 109836, -75528, 415080, 191158, -67512, 186711, 268028, 312074, 220139]
17448B20139L8060O640M3589g858B17232K45539j35085J43607A37469K69811r2409
17437C14871n3203K3495n1083E2300J9750a4964m043b34B307K31908j02255J21689
17425B53649p4077n5146K11351j29123P0879O0104j7676L0666A06104n1166L3148
17414H8086K00784L5494m4050J46843g2110C49877n7662j1631N8609D6018N5497
17403A01515f1938D38960a9971E2100J50774I6368K53445r5997b79293E6105l189
17392E2916i9484B21554o8216R4240r406J3409j08218J52710a9201F1618J26853
17381A88471K37530R7481J4750I5448P910M3562C5762Q7813b46042A76561A3646
17369F3105K77164A06718m6777J66374E9980j8397M46827C590a10342a8113C78436
$$ y = [220139, 258199, 264839, 308428, -7858, 217232, 462771, 327686, 471293, 137469, 407280, 314871, 261668, 285163, 234080, 52300, 72050, -14964, -19007, -234, 2307, 234215, 131960, 253649, 179572, 124426, 335777, 206654, 277533, 337637, 319961, 350627, 106104, 54938, 88086, 288870, 324364, 280314, 427157, -72110, 349877, 292215, 280584, 339193, 46018, 101515, -61938, 438960, -19971, 52100, 202874, 96368, 349813, 253816, -279293, 56105, 52916, -99484, 221554, 153338, 247578, 238172, 251581, 143363, 296073, -19201, 61618, 188471, 426001, 523482, 538232, 95448, 103358, 146920, 35762, 123575, -246042, 176561, 13646, 63105, 340269, 106718, 59941, 226315, 59980, 41583, 488410, 3590, -110342, -18113, 378436]
17357A77081p5626J36928k3689Q5392f6567c822B2671L22855G4470J39952F4470
17345F17300k32135j51522E6769K05457G7677A8627N4024l18g5442A86165h4063
17333f8727A15060k6849N31348l09479A18756J8322o373g0782H6551N4941P1682
17322B13174F8856R997a75490D49178I4198K88189j41445o4626L4212K9064a84978
17310C43608q7235a58987c5054A41232K6756J5899p5723M5638E8788J91835g4587
17298B86078c46991B9175K93081o7373a2554C05923p2079p0691f9711D39190J1219
17287D50409j91124j21915P1393Q0140f7383D24781j46261k3336K01836H1328
17276B17916K32774B20135O8101G9391l4088K07935R1242A22956J71131d9965
$$ y = [177081, 101455, 238383, 214694, 300086, -66567, -3822, 22671, 345526, 74470, 214422, 64470, 617300, 385165, 233643, 56769, 262226, 77677, 18627, 72651, 72333, -75442, 186165, -84063, -68727, 115060, 88211, 619559, 310080, 118756, 137078, 130705, -70782, 86551, 141492, 213174, 68856, 78853, -175490, 449178, 94198, 382387, 240942, 176316, 210528, 239592, -184978, 343608, 256373, -158987, -35054, 141232, 167988, 183887, 108164, 153802, 58788, 250623, -74587, 286078, -346991, 29175, 322256, 254883, -12554, 305923, 233844, 163153, -69711, 439190, 450409, 259285, 137370, 208763, 288903, -67383, 424781, 278520, 255184, 457020, 81328, 217916, 450690, 220135, 288236, 79391, 45303, 253238, 344480, 122956, 294087, -49965]
17265D83964E1895L3692r162l0300K78643P4441K72453I2877K18340j19827n9481
17254A31909J1033a34937B72129A08552L47991j68345p6976A4582M38193B21456
17243D28350K5652A65510P0208J0163r5719N3195q7061m3877K71850j44761Q9056
17232B88564l5496m6580A02707O2458m3120J96800G5400R3385H3199J3748K70064
17221C67011o1488C2694K75233j14889K56322j2407J52212G5562e2969E59134
17210a2417A94599B8201Q0554J06041L43189k16989A5601J44807J96389l926A04636
17198B41771J02115E7227L64400J49691j94173A45649J50462G8070L52607j65579
17188B65098J81590q7078G5859M43657k22077J60660j73668A38219f9998C29578
$$ y = [483964, 51895, 85587, 76425, 46125, 324768, 399209, 671662, 92877, 311217, 191390, 131909, 142942, -134937, 272129, 108552, 456543, 288198, 211222, 14582, 452775, 221456, 428350, 454002, 165510, 235718, 245881, 150162, 203357, 116296, 72419, 344269, 199508, 288564, 253068, 206488, 102707, 165165, 122045, 318845, 75400, 168785, 83199, 96947, 367011, 305523, 32694, 307927, 193038, 449360, 436953, 589165, 75562, -52969, 559134, -12417, 194599, 28201, 108755, 214796, 557985, 340996, 15601, 160408, 356797, 352871, 104636, 241771, 343886, 57227, 421627, 571318, 377145, 145649, 296111, 78070, 430677, 265098, 446688, 359610, 75859, 519516, 297439, 458099, 284431, 138219, -69998, 329578]
17177B56264n0126p7436K13182j25539L88940A95366J17918l7318M6502K75129
17167E97597k48160K27885p0008J22699k50581M6073L95253C30022K59652B52158
17156F14228j60158j67351j6299l8794P4857j4201J55318O5410K6960k04548J78131
17145E13553j73574A49454K35143A41013J95191J31722K51699l6097A82992Q5249
17135B68241L20642A79327K60612F3650K80423J77108j5256o4962J96591B13658
17124C77908J74830B28278K41470k02914J21268M4339J25596k48293N3285L86630
17114G49659l24804R7282k19194J48467A83494L01665L53357B20390K28895J38831
17104E88116j66614P5635l7534m7679Q6159j38370K1073L25853J72375k20125
$$ y = [256264, 206138, 128702, 341884, 216345, 605285, 195366, 313284, 275966, 322468, 597597, 349437, 577322, 507314, 630013, 379432, 425505, 820758, 330022, 589674, 252158, 614228, 454070, 286719, 270420, 231626, 306483, 292282, 447600, 513010, 539970, 335422, 513553, 339979, 149454, 384597, 141013, 336204, 467926, 719625, 683528, 182992, 268241, 588883, 179327, 439939, 63650, 344073, 521181, 505925, 440963, 637554, 213658, 377908, 552738, 228278, 469748, 266834, 388102, 432441, 558037, 309744, 363029, 749659, 424855, 522137, 302943, 451410, 183494, 485159, 838516, 220390, 449285, 588116, 421502, 497137, 459603, 411924, 498083, 359713, 380786, 706639, 879014, 658889]
17094F58889C20979M180j33197M5805l6906J99014Q821L2354L4926N7438B16974
17082D32398R26J50907K68128q3756j40623k2487K31056k84487L00728C54307
17071D92628k2833k2679K3936p5283P3013l2917J14235k14169J07624K16011J43879
17060H03445j50992K25268l53806j110k1993R7377K82135J51059D73806J88139
17050F61945m7062j79628K26468A63096N56711L24409k51564l84504K63902M31023
17040A103073m96228K13508k17194Q6299r6331L15006j13200J27864o5775k65450
17030E91572o9119K23137m7931P6081L57256j86816R9798l09365K50285k36528
17020G48370M1140j69380Q4740r6197N08406j18829l35917k43597K94640j05818
$$ y = [658889, 320979, 325159, 191962, 237767, 200861, 399875, 408696, 441050, 475976, 533414, 216974, 432398, 433324, 584231, 852359, 768603, 627980, 605493, 836549, 552062, 852790, 354307, 492628, 469795, 447116, 471052, 395769, 468782, 435865, 550100, 335931, 443555, 659566, 803445, 652453, 877721, 523915, 522805, 500812, 598189, 880324, 1031383, 473806, 661945, 614883, 435255, 661723, 163096, 719807, 1044216, 792652, 408148, 672050, 1103073, 606845, 820353, 603159, 689458, 593127, 908133, 794933, 922797, 857022, 591572, 522453, 745590, 697659, 773740, 1130996, 944180, 1043978, 734613, 984898, 748370, 789510, 620130, 704870, 608673, 1117079, 998250, 662333, 418736, 713376, 607558]
17010F07558M99770l61799K51885K42767j44899k5238j23427j68002M54703l98866
17000H34452j57827N95776n68755K31490J29118j02187Q4763j48088P1102j26429
16990H43415N7000j52287K14496j88529M97330j71798J32462j77054k15871J38204
16980I77368L1784N7153M477p6053R167m0409J89033M6093J8040j74176j44233
16969H98244J94190r1596J48802Q3514L7175L18495l34047n7735K61796m50444
16959A008394L00948n157J15604q4712k8326M47674l69278k19817n3387N65811
16949A677754l37017N8786o3702K35953K31960k1462n20860J48813P0690j21792
16939A359123j19350J24425K79553j33948J18524j40090j93507L51875j94067
$$ y = [607558, 1107328, 745529, 997414, 1240181, 1095282, 1070044, 946617, 778615, 1233318, 834452, 676625, 1272401, 703646, 935136, 1064254, 962067, 1046830, 898742, 969844, 843415, 900415, 748128, 962624, 774095, 1271425, 1099627, 1232089, 1055035, 839164, 977368, 1009152, 1066305, 1070782, 994729, 1003896, 963487, 1152520, 1198613, 1216653, 1042477, 898244, 1092434, 1000838, 1149640, 1233154, 1270329, 1588824, 1254777, 1197042, 1458838, 1008394, 1309342, 1304185, 1419789, 1335077, 1306751, 1754425, 1385147, 1165330, 1111943, 1677754, 1340737, 1399523, 1335821, 1571774, 1803734, 1782272, 1261412, 1410225, 1480915, 1359123, 1239773, 1364198, 1643751, 1509803, 1628327, 1488237, 1294730, 1646605, 1452538]
16930A452538J95073r4603M03486k18185l56348J21928Q7949L93365k96654j59577
16920A528972J48238K70363N0217j08344k8091n9983J8001M94204m92064O8538
16910A890051r3471K81049o4204R0484J81047l23025k2181m5029Q6309L55768
16900B336798k47469M43573l19398j73789J56991l15569O66179l98221L41694
16891B490789m08104K97264R358L74256k65936j05428J64735k33748K37597J16332
16881B677115j48980L83985m8403m53371O43692k04413r4502J22274l802L17333
16871C190928n49764N30523j23557J60714k59757N3550K62219O3703j72326R2816
16861C249049J78459j58471J57544j03958K32674J24218m39463N74933L6862P6277
$$ y = [1452538, 1647611, 1553008, 1956494, 1738309, 1381961, 1503889, 1591838, 1985203, 1688549, 1528972, 1677210, 1947573, 1997790, 1889446, 1861355, 1801372, 1819373, 2313577, 1821513, 1890051, 1796580, 2077629, 2013425, 2103909, 2284956, 1961931, 1939750, 1894721, 1981030, 2336798, 2089329, 2532902, 2213504, 2039715, 2196706, 1881137, 2547316, 2149095, 2490789, 2082685, 2379949, 2389307, 2763563, 2497627, 2392199, 2556934, 2323186, 2560783, 2677115, 2528135, 2912120, 2863717, 2410346, 3054038, 2849625, 2755123, 2877397, 2873595, 3190928, 2641164, 3171687, 3048130, 3208844, 2949087, 3002637, 3264856, 3328559, 3156233, 3249049, 3427508, 3269037, 3426581, 3322623, 3555297, 3679515, 3240052, 3814985, 3851847, 3928124]
16851C928124J30728K1910p8370q6926K45633K25535r4842N11996j06323k17788
16841D479677k69298N85776k73296N12973j39065K16232j88680K68673K16201
16832E409193j95194M59168j82026L45811J7737k47757O22202k96620K52271K45000
16822F429785O6009q1609J36840K30118L96937k65780M21459K9722K26741k8942
16812G561280K45121J04108L19547j53406K68138K42883R725K41897N15594j79458
16802I175429K98558L74169J33849J42494L38335J69108L61308K79340J67847
16793A1440437K65284K96394N50388J14980M33452M52330J58670N03828M45993
16784A4661756k6143R07599R6241P62202M53626M56429M39977N19195N55710N86637
$$ y = [3928124, 4058852, 4080762, 4002392, 3915466, 4161099, 4386634, 4291792, 4803788, 4697465, 4479677, 4210379, 4796155, 4522859, 5035832, 4896767, 5112999, 4924319, 5192992, 5409193, 5213999, 5673167, 5491141, 5836952, 5854689, 5606932, 6229134, 5932514, 6184785, 6429785, 6495794, 6414185, 6551025, 6781143, 7178080, 6912300, 7333759, 7363481, 7590222, 7561280, 7806401, 7910509, 8230056, 8076650, 8344788, 8587671, 8597396, 8839293, 9354887, 9175429, 9473987, 9848156, 9982005, 10124499, 10462834, 10631942, 10993250, 11272590, 11440437, 11705721, 12002115, 12552503, 12667483, 13100935, 13553265, 13711935, 14215763, 14661756, 14635613, 15543212, 15639453, 16401655, 16855281, 17311710, 17751687, 18270882, 18826592, 19413229]
16774A9413229N20931Q39215K89359J000044P61365O13276P01466J107106N04834
16765B5750825J184121Q22540J092579J186019J063148J504089R21784J692224
16757C5217329R22444J532812J840030J482023J611393J996058K067475J616685
16749D8286249K305311K619413K316508K724263K475889K858062L257592K993755
16741F9837042L212494L999550L502438L741287M136400M156230M614879M100626
16733A01300946M714026M701763M683638M724128N005832M324104M357564M642274
16725A38454275L556155L610315L026527K720353J629103J216645Q27795k50224
16717A54790944p82621j449263k242731k750758l180740l614284l964235m594193
$$ y = [19413229, 19934160, 20773375, 21062734, 22062778, 22824143, 23437419, 24138885, 25245991, 25750825, 26934946, 27757486, 28850065, 30036084, 31099232, 32603321, 33525105, 35217329, 36139773, 37672585, 39512615, 40994638, 42606031, 44602089, 46669564, 48286249, 50591560, 53210973, 55527481, 58251744, 60727633, 63585695, 66843287, 69837042, 73049536, 77049086, 80551524, 84292811, 88429211, 92585441, 97200320, 101300946, 106014972, 110716735, 115400373, 120124501, 125130333, 129454437, 133812001, 138454275, 142010430, 145620745, 148647272, 151367625, 152996728, 154213373, 155041168, 154790944, 154008323, 152559060, 150316329, 147565571, 144384831, 140770547, 136806312, 132212119]
16709A32212119m162978n263796m842752m407597n108077m884123m759935m431447
16701I4351414m779780m135045m079835l773029l892173l932356l112502l026958
16693F3619736l207280k997175k703306k378497k320943k367155k229680j672897
16685D3742803k038633j731927j490353j813979j623246j704758j119023j165247
16677C1055637j309960j186761j129188q85119j395108p13797r50541o05699q38885
16668B2040579n61555p52429p36259r31630n05335n57681p31057n94545l96427
16659A6273661m96505m98123n64555l75876o99678L9031k22966n98332o09795
16650A2246862j55609k39569l42975j063r10135q6139l12102k86621m59925j11473
$$ y = [132212119, 128049141, 122785345, 117942593, 113534996, 108426919, 103542796, 98782861, 94351414, 89571634, 85436589, 81356754, 77583725, 73691552, 69759196, 66646694, 63619736, 60412456, 57415281, 54711975, 52333478, 50012535, 47645380, 45415700, 43742803, 41704170, 39972243, 38481890, 36667911, 35044665, 33339907, 32220884, 31055637, 29745677, 28558916, 27429728, 26544609, 25149501, 24435704, 23485163, 22879464, 22040579, 21479024, 20726595, 19990336, 19058706, 18553371, 17995690, 17264633, 16670088, 16273661, 15777156, 15279033, 14714478, 14338602, 13638924, 13677955, 13454989, 12856657, 12246862, 12091253, 11851684, 11508709, 11507646, 10597511, 10511372, 10199270, 9912649, 9452724, 9341251]
16640I341251m6161l25328j6783n1112n92243j82167r7568k43704O8204n49836
16630G304553p2875k00152p6780n2263L8316m10001j44273k74437J37992j29538
16620F120542n5696n23557J42642l09146J33160m24389K47816k28944J27957k46076
16610D984309P8588n47134J86952j83089R7027k98670K49688m88435J03863m53508
16600C729591K98962l40901o1076L40103r1326m61704m6319M07686l34330J31954
16590C572640L4330j08362O8202j49365l57640K96211k09667p0094k2694j23702
16580B929859n2271K6424j95453k29328J8749J10797k8274J75103j05672k83469
16570B366465Q8028k46449N9434M7310l665K47345m24015Q7386P5554J15930j10925
$$ y = [9341251, 9295090, 8969762, 8952979, 8901867, 8309624, 8127457, 8029889, 7786185, 7854389, 7304553, 7231678, 7031526, 6954746, 6902483, 6940799, 6530798, 6386525, 6112088, 6250080, 6120542, 6064846, 5541289, 5683931, 5374785, 5507945, 5083556, 5331372, 5102428, 5230385, 4984309, 5062897, 4515763, 4702715, 4519626, 4616653, 4317983, 4567671, 4079236, 4183099, 3729591, 4028553, 3687652, 3626576, 3966679, 3875353, 3413649, 3367330, 3775016, 3440686, 3572640, 3606970, 3498608, 3566810, 3417445, 3059805, 3356016, 3146349, 3076255, 3053561, 2929859, 2877588, 2904012, 2708559, 2479231, 2497980, 2608777, 2580503, 2755606, 2649934, 2366465, 2454493, 2208044, 2267478, 2314788, 2311123, 2558468, 2134453, 2221839, 2297393, 2413323, 2302398]
16559B302398j79141M6563j36215L77956j86668J24056k83831P5393m40695J17831
16549A817647J05518k68689J63208j25510j49106J72547k6396j60201L76676m61330
16539A444364K0636K15972j45218L70857o88473L71152j95916j6127j46485m8548
16529A182214K09471j23007J69459r3482j56820M51948k37020K11077l56091J88212
16519A445961j85322j77754L99778m86873O13706n43748N92654j87880l55812
16510A114710M91334k50259j76864k4373l9708o6474J77287R9014o3333k07448
16500A053886j58422j21531N58386j76284k66610K48845k28294L12017j84245
16491A037748Q9389l61146L46284k91510N2476J14096p7179P0325j70799K02263
$$ y = [2302398, 2123257, 2169820, 2033605, 2411561, 2224893, 2348949, 2065118, 2140511, 1699816, 1817647, 1923165, 1654476, 1817684, 1692174, 1543068, 1715615, 1689219, 1529018, 1905694, 1444364, 1465000, 1680972, 1535754, 1906611, 1218138, 1589290, 1393374, 1377247, 1230762, 1182214, 1391685, 1268678, 1438137, 1344655, 1187835, 1639783, 1402763, 1613840, 1257749, 1445961, 1260639, 1082885, 1482663, 995790, 1609496, 1065748, 1658402, 1470522, 1114710, 1606044, 1355785, 1178921, 1154548, 1114840, 1048366, 1225653, 1324667, 1261334, 1053886, 895464, 773933, 1332319, 1156035, 889425, 1138270, 909976, 1221993, 1037748, 1127137, 765991, 1112275, 820765, 873241, 987337, 910158, 980483, 809684, 1011947]
16481A011947k4579j28329j23225J67613n0729l81635K87469n3814K25228k97006
16471F32940L48286k02365j01095j9968J10492r2962J54383J89723m47436j97
16461E71801K76825k26822k61738L80061J47648k12233J67028l97723K11904k51281
16451D05470R515K14961K92825q4571j33760j46982q9663K76591j13181R1999
16441G23204j59472K57898l47507J29171j3095l3772J15850j41558M023B46951
16430C57463J20486L8174j2097j0440j22265L10766q9516k56092m3412M1361q2202
16419B52226L18885r6790j34871A60293P08531m00684K20056B47050J87271m7857
16409C86464K81411k26948M916L67218j86710B54493j2196L68604j88343L8245
$$ y = [1011947, 987368, 859039, 735814, 903427, 852698, 471063, 758532, 704718, 929946, 632940, 981226, 778861, 677766, 657798, 768290, 675328, 829711, 1019434, 571998, 571801, 848626, 621804, 360066, 740127, 887775, 675542, 842570, 444847, 656751, 405470, 414985, 629946, 922771, 838200, 704440, 557458, 467795, 744386, 631205, 723204, 563732, 821630, 474123, 603294, 590199, 556427, 672277, 530719, 534742, 246951, 357463, 477949, 516123, 504026, 493586, 371321, 682087, 592571, 336479, 293067, 334428, 252226, 571111, 474321, 339450, 160293, 868824, 468140, 688196, 247050, 434321, 386464, 667875, 440927, 445843, 813061, 626351, 254493, 242297, 610901, 422558, 460803]
16399D60803O0021j48684l503K1678L92311B16132K81210N1856k8464A34631L10476
16388D45107j37687M8523A00703J40534h3924B79126M00617B79505K01981l6585
16378D44901J13306j90098j35381J77331j93682K914N7989I6510I52K13360l1102
16367A83210L15904k40107K62641K060m6197m6837j64516N459P7514J56358j84301
16356C21188m5284b7895B47675E7469c6643A24135a11408B04107n8824L00492
16346D45775j91931j10231J63524M79992A48022M1907p1995d9841C85459G8354
16335A9421K68038I9751D6267J04160L04372m7176a27654B70010Q0663A63873
16324C79328J88221k12255j55826k7147L42646k52313j04149M093l682J7234c3796
$$ y = [460803, 520824, 372140, 368637, 390315, 782626, 216132, 497342, 549198, 520734, 134631, 445107, 307420, 355943, 100703, 241237, -83924, 279126, 679743, 279505, 481486, 444901, 558207, 368109, 232728, 410059, 216377, 219291, 277280, 96510, 952, 214312, 183210, 499114, 259007, 521648, 523708, 477511, 430674, 266158, 271617, 349131, 505489, 321188, 275904, -27895, 247675, 57469, -36643, 124135, -111408, 204107, 145283, 445775, 253844, 143613, 307137, 787129, 148022, 189929, 117934, -49841, 385459, 78354, 19421, 287459, 99751, 46267, 150427, 454799, 407623, -127654, 270010, 350673, 163873, 379328, 567549, 355294, 199468, 172321, 514967, 262654, 158505, 162598, 158916, 176150, -33796]
16312A00914K43386J5537J43152j42124p2107A02342J48466a24039B26956q710
16302B18246a2403A96069Q9445B4318N8191R5810J66313L05771k29870B03781
16291E78633B26794q8177Q0042J58998E051J48547E8896R1609J41822J11684b7495
16279g791r0116C43874J51562j21648c50284k3327A93500F357L52415A56994J73298
16268C30292q8145m8695m2853b6621J0819A45267d0746I1036R4850a1045C08808
16256C69524a77145A06343J78531B6085K8181b6791B12281a58680e6578B02718
16245a21217D13485a13274d2152B0842K26169C1884K15362J6093e2214A23629
16234A21252Q1002n5468n900K02776a28027A07884J61680J38945A73251P392J15938
$$ y = [100914, 344300, 359837, 502989, 360865, 288758, 102342, 250808, -124039, 226956, 218246, -12403, 196069, 285514, 24318, 82509, 178319, 344632, 650403, 420533, 203781, 578633, 226794, 138617, 218659, 377657, 5051, 153598, 58896, 150505, 292327, 404011, -27495, -7791, -97907, 343874, 495436, 373788, -350284, -373611, 193500, 6357, 358772, 156994, 330292, 242147, 193452, 150599, -26621, -15802, 145267, -40746, 91036, 185886, -11045, 308808, 369524, -177145, 106343, 284874, 26085, 54266, -26791, 212281, -158680, -56578, 202718, -121217, 413485, -113274, -42152, 20842, 247011, 31884, 247246, 263339, -52214, 123629, 121252, 202254, 146786, 140886, 343662, -128027, 107884, 269564, 408509, 173251, 180643, 296581]
16223B96581H1149N3344j2569D4946K18606P8864o5589a22965A00167Q8410c0423
16211D4781R4464A5541a49971B60958E6124R9680C548K0800e9923G1416J33763
16200B05179m2408B4381c2438F1354e6640a4284A4550c02821P5474A3825a23208
16188H7157J03105r535C4632J12664C0766b55876h7985b471r9733M1108F8421
16176a24852B89255h3100J9215B86679j31115m9277J62283i239B08434C8548a02519
16164I586P250J53057Q0619a89823C07496H6438b0163j6750o2636E1027J37187
16153A88214J2743d5950A86136c00294G1280P4207J14947C1006J96623a60926
16142A11115j2646j239b32118h4262K5183k3072I711K57134J41702a83379N3513
$$ y = [296581, 81149, 134493, 121924, 44946, 263552, 342416, 276827, -122965, 100167, 188577, -30423, 44781, 139245, 15541, -149971, 260958, 56124, 155804, 3548, 24348, -59923, 71416, 205179, 162771, 24381, -32438, 61354, -56640, -14284, 14550, -302821, -227347, 13825, -123208, 87157, 190262, 180727, 34632, 147296, 30766, -255876, -87985, -2471, -102204, -61096, 68421, -124852, 289255, -83100, -63885, 286679, 155564, 106287, 268570, -9239, 208434, 38548, -102519, 9586, 16836, 169893, 250512, -189823, 307496, 86438, -20163, -36913, -99549, 51027, 188214, 200957, -45950, 186136, -300294, 71280, 145487, 260434, 31006, 227629, -160926, 111115, 98469, 97230, -232118, -84262, -59079, -82151, 9711, 266845, 408547, -183379, -129866]
16131a29866B65039c49249K1474J59170E7347g0934A23595h0604A77081a62339
16120A36348M445g9459A2917L39927q6577b01183B72820q6192a22703B96317a40698
16108A82566c55831d3400C9206a18997l5041B0637K13094K5908I6279l6329b01489
16096A69460P943G2970a25915b5950D9879J00325J7277M8770b60349a4709j34125
16085a48834H8298b45795B33811n6271M9418J5618C9363M227a9567A08731B8792
16073B31136M4529D1892r855i8840A26161o1308P7491K89772i0131k0449N0597
16062e9983A56600g1674A3874K51423a29658G0874R4708A9522J36630m4800g4071
16050D4657c4230m04335D3450a4791j60502F8614i5910j34448F4814c04079A71726
$$ y = [-129866, 265039, -349249, -327775, -168605, 57347, -70934, 123595, -80604, 177081, -162339, 136348, 140793, -79459, 12917, 352844, 266267, -201183, 272820, 186628, -122703, 296317, -140698, 182566, -355831, -43400, 39206, -118997, -154038, 20637, 233731, 259639, 96279, 59950, -201489, 169460, 177403, 72970, -125915, -25950, 49879, 150204, 167481, 216251, -260349, -14709, -148834, 88298, -245795, 233811, 177540, 226958, 242576, 39363, 43590, -19567, 108731, 28792, 231136, 275665, 41892, 32037, -98840, 126161, 64853, 142344, 432116, -90131, -110580, -59983, 156600, -71674, 13874, 265297, -129658, 70874, 165582, 19522, 156152, 111352, -74071, 44657, -34230, -438565, 43450, -14791, -175293, 68614, -95910, -230358, 64814, -304079, 171726]
16038f1241j84481D9427J50086b3293f050H036a92535H1834d1263o8007j95237
16027c04507Q3208M7290b7977B45049b22033j2986G3101h4769b1453j69686q0298
16016b71437C61031e6788k74729F0676a54608B5920K42413g4931E53172k15301
16006C37871j61521a53317N8729j38287C0810O6243A657O9417a92935l6108D0943
15994A55954B7545K20687g1556r0983A67794J1562A6386L68135i1708B70541L88500
15983F59041l19642o0557E8697a6120A31801l8781f1934b3818B97190G2032H548
15971b58531a8645l076A87270B6513L81145a03638m1363H0478J55236B2638b27129
15959c30153O6803g8604E2957J11751b28069M5110e7775A57159c8696A74119c6358
$$ y = [-61241, -245722, 49427, 199513, -23293, -6050, 8036, -192535, 81834, -41263, -109270, -304507, -221299, -174009, -27977, 245049, -222033, -235019, 73101, -84769, -21453, -191139, -271437, 361031, -56788, -331517, 60676, -154608, 25920, 268333, -74931, 553172, 337871, 176350, -153317, -94588, -232875, 30810, 97053, 1657, 71074, -192935, -229043, 40943, 155954, 27545, 248232, -71556, -162539, 167794, 179356, 16386, 384521, -91708, 270541, 659041, 339399, 278842, 58697, -16120, 131801, 93020, -61934, -23818, 297190, 72032, 8548, -258531, -18645, -21721, 187270, 26513, 407658, -103638, -145001, 80478, 235714, 22638, -227129, -330153, -263350, -78604, 52957, 164708, -228069, -182959, -57775, 157159, -38696, 174119, -36358]
15947H9397N7215b92413A88764E2341a05113c0293G1674R4979g7531k23721I6052
15935e977B9586K4633O9113e1711I1607g5102A92431b04380A11195k8993J24710
15924B06912e5798D3214b22617A27916b83330a38006D6292k21J93053F9869K1835
15913I1704d363B599b022B83874c9950j53805d5161q9116G2867C2177J29880Q6913
15901B48970F9455i06A16477i4723j60481f0513b7026A59419I441J22966b69123
15889C252f8388B78487a10221p1661B1764J70602g9433l02893G767b0176d752
15877g1486j4557G5106b79654a4797C01742d0773B41554j15432O9728A3946a32973
15865a25707o0511I1534c89554A98912E5865D16b98508f8029A01457j1538l687
$$ y = [89397, 146612, -292413, 188764, 52341, -105113, -30293, 71674, 166653, -77531, -301252, 96052, -5977, 29586, 54219, 123332, -51711, 91607, -75102, 192431, -204380, 111195, 82202, 206912, -55798, 43214, -222617, 127916, -283330, -138006, 46292, 46071, 239124, 69869, 91704, -4363, 2599, -2022, 283874, -39950, -193755, -45161, -134277, 72867, 32177, 162057, 248970, 69455, -906, 116477, -94723, -255204, -60513, -27026, 159419, 9441, 132407, -269123, 3252, -68388, 278487, -110221, -181882, 21764, 192366, -79433, -382326, 7767, -20176, -4752, -71486, -86043, 75106, -279654, -14797, 301742, -40773, 241554, 126122, 195850, 13946, -132973, -125707, -186218, 91534, -389554, 198912, 55865, 416, -298508, -68029, 101457, 89919, 86232]
15854H6232a76994A23741L7063F0927a72816j0407Q8345B73512g9695o2036B94338
15842e4217B56689I1255J496i7492B06552F4134K2509N96m1908J3909f7656j9741
15830h7397j84410A38225D4268a52841B50624F7695a38200A39300f6076C033L5339
15819C8372a84637K0645o224A54154A3979a27612A21410b53428R6080N9486k95664
15808c93526B38375D6530b87087R1179A64543m3097k9676c7481A42125a52112
15797h8143k30397F8440J58055a17567k790c1146C0941a62945a8729C0971F602
15785f8912D6569J48683a886k85177G3140K5031N0982L2794J43665i297A50594
15773D1196b07199a5464A08683a26252d6113F522L0810K2377b51465c5366o4245
$$ y = [86232, -176994, 123741, 160804, 60927, -172816, -183223, -94878, 273512, -79695, -141731, 294338, -54217, 256689, 91255, 92751, -97492, 206552, 64134, 86643, 87239, 45331, 59240, -67656, -87397, -271807, 138225, 44268, -152841, 250624, 67695, -138200, 139300, -66076, 3033, 38372, -184637, -163992, -170216, 154154, 13979, -127612, 121410, -253428, -157348, -97862, -393526, 238375, 46530, -287087, -195908, 164543, 121446, 91770, -37481, 142125, -152112, -88143, -318540, 68440, 226495, -117567, -120357, -31146, 30941, -162945, -18729, 30971, 6602, -68912, 46569, 195252, -1886, -287063, 73140, 98171, 149153, 181947, 325612, -9297, 150594, 41196, -207199, -15464, 108683, -126252, -46113, 6522, 37332, 59709, -251465, -35366, -99611]
15762i9611q6410A44769J81644A6667c10917A2701K8884J31342b14986i0675j28970
15751b19645A07766Q2361A1048K04298A5767J37257a33407D1636b32160J01411
15741a30749d3063B97309d8851n681m2223D3534J4441b18816Q5838L7006B00214
15729c9748m41526b13013N3046B47792D5676c34908J09512B30917h2628J3921
15719f8707J0173K8275j23181K4305j45323I4530H516c45870a59068k5019R770
15708a74317A16867M8904o9806e0243r9145A0703Q1673C4401q792c84033A05519
15696c449A54916O7993i6202A08910C9956c7563j53953R5571A48001J93107C7980
15684c1428k49825e9655J9177A84951j6011a22270O0931m1999j21016J10526l53599
$$ y = [-99611, -186021, 144769, 326413, 16667, -310917, 12701, 41585, 172927, -214986, -90675, -219645, 107766, 190127, 11048, 215346, 15767, 153024, -133407, 41636, -232160, -130749, -43063, 297309, -48851, -54532, -96755, 43534, 57975, -218816, -132978, -95972, 200214, -39748, -481274, -213013, -159967, 247792, 45676, -334908, -225396, 230917, -82628, -68707, -58534, -30259, -153440, -129135, -274458, 94530, 8516, -345870, -159068, -184087, -174317, 116867, 165771, 95965, -50243, -149388, 10703, 92376, 34401, 25609, -384033, 105519, -3449, 154916, 222909, -96202, 108910, 39956, -37563, -191516, -95945, 148001, 341108, 37980, -31428, -281253, -59655, -40478, 184951, 168940, -122270, -61339, -103338, -224354, -113828, -467427]
15673d67427A76925o3399b3392I2395L3259O6723E9955c77632a3581A2335b23042
15661b35189g985k36943K4259P1152k7078a7534n360k05976m7409C60469c07846
15649a74924A54735G0703K9268J80209D615a21178H8424i702H7344J58295a01100
15637D2569d31098B52486a16843B5562a2039D8908a23816f341j50852e5825A44704
15625D14884B2558b34905G8555l4545J06339m4541A4200L2476a02218O90A72128
15613A47273a71460g1529F0811L2696a83545A04684a30204H3822G641a1361F7903
15601b22784d4964n7623l3955C3776h9353j34319A4674J10537a56057B19478b4970
15589e3534C62548b90215I9244e4501B33539c2700o6373L7872A04463c62157J06898
$$ y = [-467427, 176925, 113526, -23392, 92395, 125654, 192377, 59955, -377632, -13581, 12335, -223042, -235189, -7985, -244928, -220669, -149517, -176595, -17534, -22894, -228870, -276279, 360469, -307846, -174924, 154735, 70703, 99971, 280180, 4615, -121178, 88424, -9702, 87344, 245639, -101100, 42569, -431098, 252486, -116843, 25562, -12039, 48908, -123816, -6341, -157193, -55825, 144704, 414884, 22558, -234905, 78555, 44010, 150349, 105808, 14200, 46676, -102218, -101528, 172128, 147273, -171460, -71529, 60811, 93507, -183545, 104684, -130204, 83822, 7641, -11361, 67903, -222784, -44964, -102587, -136542, 33776, -89353, -223672, 14674, 125211, -156057, 219478, -24970, -53534, 362548, -290215, 99244, -54501, 233539, -32700, -99073, -61201, 104463, -362157, -255259]
15578b55259l8537C8370b25574B42635B9473h1026A21105L5784A6321a25671C00236
15566g0354h076H2090a84011P4313E6562J97832B3002J9804K95944C5125J73686
15555B08811F2517a15271b6602A67957n9314P8079H2819r339j682h5605m2922
15544a28527b0774j87328L0671D9567M3230J28473f4949l40517a07791A50977
15533D13935b722B41317E4517A5822c40388f8568I7092e8546B1313a16802I0458
15521D4781O0264B3455b23164C020a07371B48987E4398B5401g572A73372d4184
15509B36236j10391a83459f7350l4147F4457a57038F2006Q1578j785b0750B52761
15497b25086B196b28778R0963q90I1035O3875g9147E257b52353i5731b4826k70945
$$ y = [-255259, -293796, 38370, -225574, 242635, 29473, -81026, 121105, 156889, 16321, -125671, 300236, -70354, -8076, 82090, -184011, -109698, 56562, 254394, 23002, 42806, 338750, 35125, 208811, 62517, -115271, -26602, 167957, 108643, 186722, 82819, 73480, 71798, -85605, -128527, -20774, -208102, -177431, 49567, 92797, 221270, -64949, -405466, -107791, 150977, 413935, -2722, 241317, 54517, 15822, -340388, -68568, 97092, -58546, 21313, -116802, 90458, 44781, 105045, 23455, -223164, 3020, -107371, 248987, 54398, 25401, -7572, 173372, -44184, 236236, 125845, -183459, -67350, -101497, 64457, -157038, 62006, 143584, 141799, -20750, 252761, -225086, 2196, -228778, -137815, -138705, 91035, 154910, -79147, 5257, -252353, -95731, -24826, -295771]
15485b95771J9316A24179c67948J47057a2187j2387o013a0279F9506c076m9272
15474e2348A78716a69566A41161C1960q694b5280A87451O8307J00780B0652P2694
15463I3346K62623a12465j63798a16377I7228K25635H7127i0279A26751M2288
15453A69039l3991l9328g0299k80246i2087B18312E0779B1888N4516J9022A2706
15441H4780M2779b74952N1551N0711N1667j09280H972J23636c2372E7401a14869
15429a32596j05903f6782j20803j0553J4978A43627B5957N4397a75842A27317
15418B05418a37329E3451a40950j40766k5085a12801a0467C033N0752c24407G6586
15406h6070j90347j6934G3811Q7083C2184d9255b1323D125b59936H1231J95548
$$ y = [-295771, -276455, 124179, -367948, -220891, -12187, -24574, -30587, -10279, 69506, -3076, -52348, 178716, -169566, 141161, 31960, 23266, -25280, 187451, 255758, 356538, 20652, 93346, 355969, -112465, -276263, -116377, 97228, 322863, 87127, -90279, 126751, 169039, 135048, 95720, -70299, -350545, -92087, 218312, 50779, 21888, 76404, 95426, 12706, 84780, 127559, -274952, -223401, -172690, -121023, -230303, 8972, 132608, -32372, 57401, -114869, -132596, -238499, -66782, -187585, -198138, -183160, 143627, 25957, 80354, -175842, 127317, 205418, -137329, 53451, -140950, -281716, -306801, -112801, -10467, 3033, 53785, -324407, 76586, -86070, -276417, -293351, 73811, 160894, 32184, -49255, -21323, 4125, -259936, 81231, 276779]
15395B76779i978F5242f5004E7710L73042D0389a51240b5721j22066a9664I7696
15383c97766H4630b97405e5703j10480A07830D50a91265h2627A90423l1905i9015
15371B5796a8290A15589b47597E6212O0780P6516k8390e4380B90354a14940b4911
15359I9613D3822J33610a8643B66872a12206j47345f2288A39817J7276a31833
15348a41892b685j74377N9865A27380f277k2888B44490K339H6968a3664A33964
15336B69678g1142r7303H5059K4949C4137a93338F692b22131A10801J17622J29223
15325C57646a12636B1025e987n2479E6012J47028J88099A15120a63381D6148j5262
15314C0886a81384C49935a7504P392n2214F1964J44536b82116a7398k15822A70044
$$ y = [276779, -9978, 65242, -65004, 57710, 430752, 40389, -151240, -25721, -147787, -19664, 97696, -397766, 84630, -297405, -55703, -166183, 107830, 450, -191265, -82627, 190423, 158518, -99015, 25796, -18290, 115589, -247597, 56212, 116992, 193508, 165118, -54380, 290354, -114940, -24911, 99613, 43822, 177432, -18643, 266872, -112206, -259551, -62288, 139817, 157093, -131833, -141892, -2685, -177062, -117197, 127380, -6277, -29165, 244490, 246829, 86968, -13664, 133964, 269678, -71142, -168445, 85059, 110008, 34137, -193338, 6692, -222131, 110801, 228423, 357646, -112636, 21025, -5987, -58466, 56012, 203040, 391139, 115120, -163381, 46148, 30886, -181384, 349935, -17504, -10112, -62326, 61964, 206500, -282116, -17398, -233220, 170044]
15302G552J16475P2709E7163a45955M8426C67831G3953J2430K00901a05828C02783
15290A30030l3493a98307B99449A01503j9448a6750D2205L22366E7429h2202A64898
15278A59461j4332i725B46579n0636G3687J33933c391l0264G9549J28500E1833
15266a13580A39355J3848m792F2983a41360j64322B29534n1582L17233A94618
15255A94147b6272D8780c7501A91837N0521J05959N14763Q79631p44408M93624
15245A491927k89535B36349L19573B01344o3135e5063a1500A14186o560J5959
15235A23585a63901d9091l0310B5532J96427J0247A10385c08729b8013A24658
15224A5451M70915A14340a00747C21399e405F2286f1201A27158F892K09077H1484
$$ y = [7552, 124027, 196736, 57163, -145955, -97529, 367831, 73953, 86383, 287284, -105828, 302783, 130030, 96537, -198307, 299449, 101503, 82055, -16750, 42205, 364571, 57429, -82202, 164898, 159461, 145129, -9725, 246579, 195943, 73687, 207620, -3391, -33655, 79549, 208049, 51833, -113580, 139355, 153203, 148411, 62983, -141360, -305682, 229534, 177952, 495185, 194618, 194147, -26272, 48780, -37501, 191837, 242358, 348317, 863080, 1742711, 998303, 1491927, 1202392, 236349, 555922, 201344, 138209, -55063, -11500, 114186, 107626, 123585, -163901, -49091, -79401, 25532, 221959, 232206, 110385, -308729, -28013, 124658, 15451, 486366, 114340, -100747, 321399, -5405, 62286, -61201, 127158, 6892, 215969, 81484]
15212D04231H5148J31781I8129k9498J66695A10951R8560I0491A4665a87409A03856
15200a4075H410a06916I5734K98640a80557P3685C38811a58372A82731q5447d6126
15188B53727n7417A4944b06908G2719R9627J41959H1739M8435J67193a32928j07379
15177b40307e8841j48710A8323c2455B46718c4302A35332M1308l127J57180A28532
15165b9447j9620C03823A2100a08373I7486a15220D85202E0117b01649A22772
15154B1988J6922b12441A42241N696b16656J07001B16035c530B88315L06057k56266
15143C38106i8178l9976A01225m4967K28671a76835A86017b35386C9287L18838
15133C58125e4877B02102I4336L33801A48326G0632E63L39481j04873a88020C33974
$$ y = [404231, 85148, 216929, 98129, 68631, 235326, 110951, 209511, 90491, 14665, -187409, 103856, -14075, 8410, -106916, 95734, 394374, -180557, -106872, 338811, -158372, 182731, 97284, -46126, 253727, 196310, 14944, -206908, 72719, 172346, 314305, 81739, 130174, 297367, -132928, -240307, -58841, -207551, 18323, -32455, 246718, -34302, 135332, 176640, 173513, 330693, 128532, -29447, -49067, 303823, 12100, -108373, 97486, -115220, 485202, 50117, -201649, 122772, 21988, 38910, -212441, 142241, 147937, -216656, -109655, 216035, -3530, 288315, 594372, 338106, -98178, -138154, 101225, 56258, 284929, -176835, 186017, -235386, 39287, 358125, -54877, 202102, 94336, 428137, 148326, 70632, 563, 340044, 235171, -188020, 333974]
15121d9095A89711J52651f849A14472C0621J10353k2176F301K33039r7501N3412
15110A95251E0076e0904B33021o7311L5162p7802m3336J84578q7531a54780F4386
15098C03445j38667H0700a32022a1455G3811L20932d0807C32054j11508G691J0882
15087A8573J02747J28801b94601a38987I9287L5843n2553N7251j6761K62903n178
15076C80792p6832f118D4333R5848A9549J55178F9546L4491Q5839F7242K36851
15065C04093C7693J31389J7558J8477L5494A13079O2741A195a3264B93556O7371
15054C60927E1635b6403E59582A90425E9954j4786J73303a77960E2860J06856
15044A59716P6917K50196n7681j59640j02771j6785p261P6715o0437K99369c9546
$$ y = [-49095, 189711, 342362, -6849, 114472, 30621, 140974, 118798, 6301, 239340, 141839, 195251, 50076, -50904, 233021, 165710, 200872, 123070, 79734, 264312, 176781, -154780, 64386, 303445, 164778, 80700, -132022, -11455, 73811, 394743, -40807, 332054, 220546, 7691, 18573, 121320, 250121, -294601, -138987, 99287, 135130, 82577, 139828, 123067, 385970, 380792, 303960, -6118, 44333, 140181, 19549, 174727, 69546, 104037, 189876, 67242, 304093, 37693, 169082, 186640, 205117, 240611, 113079, 175820, 1195, -13264, 293556, 360927, 51635, -26403, 559582, 190425, 59954, 45168, 218471, -177960, 52860, 159716, 236633, 486829, 429148, 269508, 166737, 149952, 142691, 219406, 158969, 458338, -39546]
15032E54724A57913L38811A45230J77410e9712E68685b30529B92272B1734J52632
15022A74366A4437L01741j41721b6511A00732d800j88512A96785q2363J67993
15012B82415q8920C1494a36546H3472b56480A34786A6907m074b3204B07474n8502
15001A48972J94833p4902a53737D49660j76694G1079K7267J4332N6766N7278j6661
14990B10061J29741j18608k5i9266F7657J25915J13450a27677C43495k4489a4032
14978C76993j88418N8620G7323L2030L24625A9291E620J16814a70431B31199l0390
14967B00809H6856j3964M66949A13898J27818k4425C8993L65685j31266J71089
14957D44501R0742B19155J13587r4217J84615C1242J86559J82248G9313K44190
$$ y = [554724, 157913, 496724, 145230, 322640, -59712, 568685, -230529, 292272, 21734, 174366, 14437, 316178, 174457, -26511, 100732, -4800, -193312, 196785, 114422, 282415, 193495, 31494, -136546, 83472, -256480, 134786, 16907, 12833, -23204, 207474, 148972, 343805, 268903, -153737, 449660, 272966, 71079, 98346, 112678, 169444, 226722, 210061, 339802, 221194, 221169, -99266, 67657, 193572, 307022, -127677, 343495, 319006, -14032, 376993, 188575, 247195, 77323, 109353, 433978, 19291, 5620, 122434, -170431, 231199, 200809, 86856, 72892, 539841, 113898, 241716, 217291, 38993, 404678, 273412, 444501, 535243, 219155, 332742, 238525, 423140, 31242, 217801, 400049, 79313, 323503]
14947C23503a01235A62053p4071F153L54014j6440K52204A67729C5753J72644
14937B08397K29479q3882j29578L00220B60255q753J59289r9084j42674N4590
14927B23623J2604p0060l3965K23543A33193E8680M94120d003B35863K44750K28788
14916G09401B38231B1971R6247L4772L73224j13926j12383j11213K94472q3849
14906C99315M4214k0100D9825b92108B31990G6373K22406P8031A79104L20577
14896D99681M7461B72346p7263L72923j53478A90940m2043J16341J28461A26267
14885B13866J35862K11082A83232P4945l084j06941L85882j44446j50508k6361
14875B12719l338L35693j84520K28013A64090M43682A20148K60956J40356K4220
$$ y = [323503, -101235, 162053, 87982, 6153, 360167, 343727, 595931, 167729, 35753, 208397, 437876, 353994, 224416, 524636, 260255, 251502, 410791, 311707, 169033, 223623, 236227, 166167, 132202, 355745, 133193, 58680, 552800, -4003, 235863, 480613, 709401, 238231, 21971, 118218, 152990, 526214, 412288, 299905, 188692, 483164, 399315, 443529, 423429, 49825, -292108, 231990, 76373, 298779, 376810, 179104, 499681, 547142, 272346, 195083, 568006, 414528, 190940, 148897, 265238, 393699, 126267, 213866, 349728, 560810, 183232, 258177, 255093, 148152, 534034, 389588, 239080, 212719, 209381, 545074, 360554, 588567, 164090, 607772, 120148, 381104, 521460, 545680]
14865E45680A88778J05407L05569B58968J44286K56853A72049J66604F2602N43590
14855F06192A55432J97812K53082K43661A67507J79910J96187A49691J61766L42661
14845F54118F6267L39987K4305K47073A67590J25854K39420m7401Q4459j91824
14835C78098K37560F4065O46415k66878A79513K49176J03747K25714j69196j90946
14825C98008j3823K69250k75206o2656j56648J70273J36223A11271L48967K3169
14815D83407L0114P9614j77157B07779K78167J24015O9729k82000c9875E37950
14804E68208k36260P9612A62237R8411L85470k75344K24527j27048B22132A3740
14793E99113n4906r8126J87454K3438j36430j00206m6906o9832K79589k88605
$$ y = [545680, 188778, 294185, 599754, 258968, 403254, 660107, 172049, 338653, 62602, 606192, 155432, 353244, 606326, 849987, 167507, 347417, 543604, 149691, 311457, 654118, 66267, 406254, 430559, 677632, 167590, 293444, 532864, 485463, 569922, 378098, 615658, 64065, 710480, 443602, 179513, 428689, 532436, 758150, 588954, 398008, 384185, 653435, 378229, 315573, 158925, 329198, 465421, 111271, 460238, 483407, 513521, 593135, 415978, 207779, 485946, 609961, 679690, 397690, -39875, 537950, 568208, 331948, 411560, 162237, 260648, 646118, 370774, 595301, 468253, 222132, 13740, 599113, 544207, 446081, 633535, 656973, 520543, 420337, 373431, 303599, 583188, 294583]
14783B94583M94958C90912L23783J13127k80214j5884K38714k90398L17451k87908
14773E09583p8658L27054k31755K04037l63851j809J17212J93325K18736C06314
14762G48307p8574C19300L97825n0515j10569B62575L73839J3670J8676j76115
14752D92645J11549L4351m5177k91652N23518j37650n8001K0354M8901q0019N5371
14741F74190k55211J69614K43950k85299J43990J48954l12917J71794M7886k86440
14731D60511K94640l18400L24714n9147j7239r9071J69846k0030j74078j10221
14721D51525P9744L25913p1412M5192o9693r5781k92306L57156r1725M082J45585
14710G88280O7659m3587J06864k34796L75287j28248D60061l2975K71900K33531
$$ y = [294583, 789541, 390912, 714695, 827822, 547608, 531724, 770438, 480040, 797491, 509583, 430925, 757979, 526224, 730261, 366410, 364601, 481813, 675138, 893874, 306314, 748307, 669733, 319300, 717125, 666610, 556041, 262575, 636414, 650084, 668760, 492645, 604194, 638545, 593368, 301716, 825234, 687584, 629583, 649937, 698838, 618819, 674190, 418979, 588593, 832543, 547244, 691234, 840188, 527271, 699065, 746951, 460511, 755151, 436751, 761465, 702318, 685079, 586008, 755854, 735824, 561746, 451525, 531269, 857182, 785770, 830962, 761269, 665488, 373182, 730338, 638613, 642695, 788280, 855939, 812352, 919216, 684420, 1059707, 931459, 460061, 427086, 698986, 932517]
14700I32517m7013k29156N0216J83650l3077k22480L82553k86236j65109k5079
14690E40786M01524k30405J953N15912m17187O2901j44429L73928k96553L09864
14680A118294k79271L69312m70914J57720K9167j45453L12211r1693k52126J43619
14670H90866L54420l44554J26458j9781k16187k65164L57270L33709l46801K4589
14660H94825q6497M05897k07077J15537k25030K13740k50794R0518l6967L48990
14650A263142m84371M19678k2520n263R9924k16759P0942m7431J23806K54494
14640A455642m04969J24435l0762M1802J18313n6401k26864M50908m78092M0621
14630A034633j73292L97836P6926K85592l84808j18785K23924k24854p8088K89160
$$ y = [932517, 885504, 656348, 706564, 890214, 857137, 634657, 1017210, 730974, 565865, 540786, 942310, 711905, 713858, 1229770, 812583, 875484, 731055, 1104983, 808430, 1118294, 839023, 1208335, 737421, 895141, 924308, 778855, 1091066, 999373, 747247, 890866, 1245286, 900732, 1027190, 1007409, 791222, 526058, 883328, 1217037, 870236, 894825, 808328, 1214225, 1007148, 1122685, 897655, 1111395, 860601, 951119, 914152, 1263142, 778771, 1198449, 1175929, 1170666, 1270590, 1053831, 1124773, 1077342, 1201148, 1455642, 1050673, 1175108, 1144346, 1186148, 1304461, 1248060, 1021196, 1472104, 994012, 1034633, 861341, 1259177, 1336103, 1621695, 1236887, 1118102, 1342026, 1117172, 1039084, 1328244]
14620A328244k5446j35768M76727k81672j02765N3325K48541j46889R1981k56795
14610A249483j91161M52696J8221j4795k58705K38730j15898P0453L630J03300
14600A555954R8208j52570j08848J87165j81067L85196j44690L60341n16878O29918
14590B112729o43527K57995J67763l95190L89201n88694O32165j755l08792q906
14580A612989J95053l01408M29354K03837l56046Q0153J38887j50346L54707l89248
14570A817932M28681j36908J2852K14845L7321j35931R2616P7548J9201K05109
14560B633266j5139l7166L60230j61851J12715O8296K83711p3518O16181L25033
14550D111758J220176K234483M113901R196377K1913825K751983A8155886G275974
$$ y = [1328244, 1302798, 1167030, 1643757, 1362085, 1259320, 1312645, 1561186, 1414297, 1506278, 1249483, 1058322, 1511018, 1529239, 1514444, 1255739, 1494469, 1378571, 1449024, 1452654, 1555954, 1654162, 1501592, 1392744, 1579909, 1398842, 1784038, 1639348, 1999689, 1482811, 2112729, 1469202, 1727197, 1894960, 1499770, 1888971, 1300277, 1932442, 1930687, 1621895, 1612989, 1808042, 1506634, 1935988, 2139825, 1783779, 1863932, 2002819, 1852473, 2207180, 1817932, 2246613, 2109705, 2122557, 2337402, 2374723, 2238792, 2331408, 2408956, 2428157, 2633266, 2618127, 2580961, 2941191, 2779340, 2892055, 2960351, 3244062, 3170544, 3786725, 4111758, 5331934, 7566417, 11680318, 20876695, 42790520, 45542503, 18155886, 7275974]
14541C399900j248347k05346k06794j7015L58263m64315N03687k23676J71659
14532B068016k08052J44841L94363m39546J05828P5562K39071l31842J38349j04421
14522B082169L40652j59643j4170k26880L84783J53153k26043J85071k7898m9836
14512B441358L375K46761r3502J08459k38762O9156K59237k27820K20933k12960
14502B576235j90199M19952n7538M16047l50046J77464Q1751k57053P9511P1868
14492B967992l9157K04053K44528j32492J54455l06580K23566N4793J2900R0276
14482C474334M8447K11676l45612L26004j46778O1896J51233j68755J67973k24763
14472C555655J48847K08106O3036m5589K9616K46314k44210O24982k67197j57114
$$ y = [3399900, 2151553, 1946207, 1739413, 1722398, 2080661, 1616346, 2120033, 1896357, 2068016, 1859964, 2004805, 2399168, 1959622, 2065450, 2141012, 2380083, 2048241, 2186590, 2082169, 2422821, 2263178, 2249008, 2022128, 2406911, 2560064, 2334021, 2519092, 2491194, 2441358, 2444733, 2691494, 2597992, 2706451, 2467689, 2536845, 2796082, 2568262, 2789195, 2576235, 2386036, 2805988, 2748450, 3164497, 2814451, 2991915, 3073666, 2816613, 2896124, 2967992, 2928835, 3132888, 3377416, 3244924, 3399379, 3092799, 3316365, 3371158, 3384058, 3474334, 3522781, 3734457, 3388845, 3714849, 3568071, 3629967, 3781200, 3612445, 3780418, 3555655, 3704502, 3912608, 3975644, 3930055, 3959671, 4205985, 3961775, 4586757, 4319560, 4162446]
14462D162446J40582K32128p364J91372M8424j50771K8077K31806L7764J76236
14452E090700J12064M0541l33709M7617n410K1982L88827j01760L53723k71515
14442E343060L02999k54064L18086j66413N36853k97346M866J05187j8692K76358
14432F150894K41898r7183j53708L26644O0784K68796j17050J1764K38360K5488
14422F956687L72391m39573K59809K34542l7620K45296n0710M95822L3153m3925
14412H025872L33582q174Q4070J91654J73258K42601j61990L90080K50931j36508
14402I385376j57718M76805J26634L30104j34888N37183p6271L8125K72129j21694
14392A0675785N62192N1310N57592j80059N0331K27667L63213L46050p9203O10749
$$ y = [4162446, 4303028, 4535156, 4527792, 4719164, 4767588, 4616817, 4644894, 4876700, 4914464, 5090700, 5202764, 5243305, 4909596, 4957213, 4951803, 4973785, 5362612, 5260852, 5614575, 5343060, 5646059, 5391995, 5710081, 5543668, 6080521, 5783175, 5788041, 5893228, 5874536, 6150894, 6392792, 6295609, 6141901, 6468545, 6529329, 6798125, 6681075, 6692839, 6931199, 6956687, 7329078, 6889505, 7149314, 7383856, 7346236, 7591532, 7540822, 8036644, 8069797, 8025872, 8359454, 8351280, 8435350, 8627004, 8800262, 9042863, 8880873, 9270953, 9521884, 9385376, 9227658, 9704463, 9831097, 10161201, 10026313, 10563496, 10487225, 10525350, 10797479, 10675785, 11237977, 11289287, 11846879, 11666820, 11717151, 11944818, 12308031, 12654081, 12574878, 13185627]
14382A3185627k97794N44581L11511J48844N22355O1431N61067l9276L46522N90788
14372A5935656N424M73447J13714M37029L42056O60248M46256K86489K18539P40110
14362A9658968P0776M41847N64824M94333M89717N06538J23758Q89283Q40347
14353B4080391K23693K58858J073777M08302R07505L86037Q82893O74405J027979
14344B9923840N90105P57027Q65030J196148M63085N81482J380189J238085Q60325
14335C7855316J482112N47783J358713J366455J093700J363884J646336J641815
14327D8356114J555802J456051J814929J718443K240883J960854K063541K346753
14319F3513370K459915K288348K356998K722738K670991L223570L291479L418326
$$ y = [13185627, 12887833, 13432414, 13743925, 13892769, 14415124, 14476555, 15037622, 14998346, 15344868, 15935656, 15941080, 16414527, 16528241, 16965270, 17307326, 17967574, 18413830, 18700319, 18918858, 19658968, 19729744, 20171591, 20736415, 21230748, 21720465, 22227003, 22350761, 23240044, 24080391, 24304084, 24562942, 25636719, 26045021, 26952526, 27338563, 28221456, 28895861, 29923840, 30513945, 31270972, 32136002, 33332150, 33795235, 34376717, 35756906, 36994991, 37855316, 39337428, 39885211, 41243924, 42610379, 43704079, 45067963, 46714299, 48356114, 49911916, 51367967, 53182896, 54901339, 57142222, 59103076, 61166617, 63513370, 65973285, 68261633, 70618631, 73341369, 76012360, 79235930, 82527409, 85945735]
14311H5945735L350636L842309M045645M182636M872229M806139M926389M859724
14303A20831442N991387N934448O413827O800709P584420P778580P960094Q722834
14295A78017741R070973R826124J0258620J0725869J1676429J2081715J2540967
14288B54198438J3368644J3323125J4401384J4623554J4724927J5061371J4809689
14281C54511132J5072132J4674398J4065426J3693110J2459216J1093895R297149
14274D44866458P322506J083268k622629j063132j890936k787472o495743n600543
14266D32811777o880697j1362298j2815455j4302466j5465079j5789203j6090492
14259C40106087j6025627j5984038j5230582j4970871j3423048j3439853j3138861
$$ y = [85945735, 89296371, 93138680, 97184325, 101366961, 106239190, 111045329, 115971718, 120831442, 126822829, 132757277, 139171104, 145971813, 153556233, 161334813, 169294907, 178017741, 187088714, 196914838, 207173458, 217899327, 229575756, 241657471, 254198438, 267567082, 280890207, 295291591, 309915145, 324640072, 339701443, 354511132, 369583264, 384257662, 398323088, 412016198, 424475414, 435569309, 444866458, 452188964, 453272232, 450649603, 449586471, 447695535, 444908063, 438412320, 432811777, 425931080, 414568782, 401753327, 387450861, 371985782, 356196579, 340106087, 324080460, 308096422, 292865840, 277894969, 264471921, 251032068, 237893207]
14252B37893207j2340695j1507232j0902428j0458663r803714r373458q584052
14245A64922965q032704p252322p212115o875745o218510o174368n458300m792621
14237A12906280n097935m556020m751722m055220l798061l740082k935860l608646
14229H0362734l371783k996086k678267k775037k391241k442188k117625k475416
14221E9115091k025228j881241j754869j891287j664267j457865j976975j108543
14213D5354816r13089j632400j315050j641042j070794r52553l81780j250944
14205C6197164j178223q77697j428721o32147o28862n67639q61995r03859o94692
14196B8423329p22277q95776o49102k95954j056262j88829r96325l48692o86081
$$ y = [237893207, 225552512, 214045280, 203142852, 192684189, 182880475, 173507017, 164922965, 156890261, 149637939, 142425824, 135550079, 129331569, 123157201, 117698901, 112906280, 107808345, 103252325, 98500603, 94445383, 90647322, 86907240, 83971380, 80362734, 76990951, 73994865, 71316598, 68541561, 66150320, 63708132, 61590507, 59115091, 57089863, 55208622, 53453753, 51562466, 49898199, 48440334, 46463359, 45354816, 44441727, 42809327, 41494277, 39853235, 38782441, 37829888, 37448108, 36197164, 35018941, 34141244, 32712523, 32080376, 31451514, 30883875, 30021880, 29118021, 28423329, 27701052, 26805276, 26156174, 25860220, 24803958, 24615129, 23618804, 23270112, 22584031]
14187B2584031n12923l96420o27222j51823n19302o01900m00317j57323p23376
14178A8493425j93361n79937o41975J10639k71284n18145N176p32489j89523J15788
14168A5598314q01940K9097j74920o0053n49822q6109l89653k38788r3026l42368
14158A2890732l40121k53517m2950n11559J21899l60965j40050r6077k02328l93791
14148A0671273N6355l52955J60507k19268k08345k45494q3790n40256K90904m64280
14138I064651J9972j36315K1311j6809l02269m49452L7071j17153p4242l32000
14128G714765j27899o0650L62700m38668J0580J38443m43986L7887k3724k79544
14118F889904J03885P383l05228j7572l25697K43253k51362J57105l21442M7369
$$ y = [22584031, 22071108, 21674688, 21047466, 20895643, 20376341, 19774441, 19374124, 19216801, 18493425, 18300064, 17720127, 17078152, 17188791, 16917507, 16399362, 16404538, 15672049, 15482526, 15598314, 14796374, 14825471, 14650551, 14590498, 14040676, 13954567, 13564914, 13326126, 13233100, 12890732, 12550611, 12297094, 12254144, 11742585, 11864484, 11503519, 11363469, 11267392, 11065064, 10671273, 10727628, 10374673, 10535180, 10315912, 10107567, 9862073, 9778283, 9238027, 9528931, 9064651, 9084623, 8948308, 8969619, 8952810, 8650541, 8201089, 8238160, 8121007, 8046765, 7714765, 7586866, 7526216, 7888916, 7450248, 7460828, 7599271, 7155285, 7193172, 7169448, 6889904, 6993789, 7001172, 6695944, 6678372, 6352675, 6595928, 6344566, 6501671, 6180229, 6227598]
14108F227598o9432l7365k50636o4607r5117m5583r1582J00269k89238K25881
14098E610188j87675o9882k0172J6966j23162k10189J9972j53145K53141k75461
14088D860581l79845j03031J38018J76736k59052M45422m29223r5385L13253l07649
14078D359825l25384Q0901J21827j00589P2098m41921N68764k40137O798k74879
14068C827303K24646m64749M24551j53227j95911m381L31893j29437j24863N0244
14058C786069o5846J77990k33333m8272O3614j19760k8557j49455k4002M8790
14048C407238k84804J3987j24202L50643m40695K92379n28917K17569n5350M559
14038B852407K40963n40137K77179J59756q9798J63268l43668L15589l09620j3969
$$ y = [6227598, 6158166, 6120801, 5870165, 5805558, 5710441, 5664858, 5573276, 5673545, 5384307, 5610188, 5422513, 5352631, 5332459, 5349425, 5226263, 5016074, 5036046, 4882901, 5136042, 4860581, 4480736, 4377705, 4515723, 4692459, 4433407, 4878829, 4449606, 4354221, 4667474, 4359825, 4034441, 4115342, 4237169, 4136580, 4208678, 3766757, 4335521, 4095384, 4102182, 3827303, 4051949, 3587200, 4011751, 3858524, 3662613, 3658232, 3990125, 3860688, 3735825, 3786069, 3720223, 3898213, 3664880, 3616608, 3680222, 3560462, 3531905, 3382450, 3358448, 3407238, 3122434, 3136421, 3012219, 3362862, 2922167, 3214546, 2685629, 2903198, 2847848, 2852407, 3093370, 2553233, 2830412, 2990168, 2900370, 3063638, 2719970, 3035559, 2725939, 2711970]
14028B711970j259j67014K04671k36006j74862k67193O88120J51876o09901J70160
14018B470562m1652j54013J11653J87828l24050J16285q1522j61097q4880K60096
14008B299210j94938j94368M27815l22363j01383q0772N2897Q2104r7606J39131
13998B009727k09324o0361J38893J90954l72958K74115j44816J25676L1937R82763
13988B966606L151050O260138J9355700J7750579B3490604j1639703m855443k330666
13980D664792p54251m90583l75540j70335k33177J94450l88394q7522N8459m43599
13970A974300N63596o85851N68184l54718n4434j49448J2467L06034j16722K67
13960B063675Q3411j42272R4525l92729K03Q1264m500O3878Q3024k46656l5742
$$ y = [2711970, 2710711, 2543697, 2748368, 2512362, 2337500, 2070307, 2758427, 2910303, 2300402, 2470562, 2428910, 2274897, 2386550, 2574378, 2250328, 2366613, 2285091, 2123994, 2039114, 2299210, 2104272, 1909904, 2337719, 2015356, 1913973, 1833201, 1886098, 1968202, 1870596, 2009727, 1800403, 1740042, 1878935, 2069889, 1696931, 1971046, 1826230, 1951906, 1983843, 2966606, 6117656, 12377794, 31733494, 49484073, 23490604, 11850901, 6995458, 4664792, 3910541, 3419958, 3044418, 2874083, 2640906, 2835356, 2446962, 2359440, 2417899, 1974300, 2537896, 1852045, 2420229, 2065511, 2011077, 1861629, 1874096, 2180130, 2063408, 2063675, 2147086, 2004814, 2099339, 1706610, 1706813, 1788077, 1783577, 1847455, 1930479, 1683823, 1648081]
13949A648081O2332L4113j98596K69863j39617p1615K09072j85936k58991M08564
13939A777270n89299M01859K2697j79322j7990K06909j25549J77979k43594K09561
13929A640521j57982o7852L3636m4201j4313j3158l0079K78965l02908p0251J17240
13918A369618j0789K0227r0305J3193K57802k71973M289j81267K44280k44369
13908A110706P2697N0561K23789k67252K16473l33497K42625K73495m49896R4890
13898A234591j84835r5971L27864j36907K67138l05018M45883m07647q4570P5926
13888A136454J8673k4380k6912o7021J741K08292o15298N24253J17767l81568
13878H92001K19632K01739k79862J80884q8811n9138j46323k36021O22963n57111
$$ y = [1648081, 1710413, 1744526, 1545930, 1815793, 1676176, 1604561, 1813633, 1627697, 1368706, 1777270, 1187971, 1589830, 1612527, 1433205, 1415215, 1622124, 1496575, 1674554, 1430960, 1640521, 1482539, 1414687, 1448323, 1404122, 1389809, 1376651, 1346572, 1625537, 1322629, 1252378, 1369618, 1358829, 1379056, 1288751, 1301944, 1559746, 1287773, 1292062, 1110795, 1355075, 1110706, 1183403, 1233964, 1457753, 1190501, 1406974, 1073477, 1316102, 1589597, 1139701, 1234591, 1049756, 953785, 1281649, 1144742, 1411880, 1106862, 1552745, 1145098, 1060528, 1136454, 1155127, 1130747, 1103835, 1036814, 1038555, 1246847, 631549, 1155802, 1273569, 892001, 1111633, 1313372, 1033510, 1214394, 1125583, 1066445, 920122, 684101, 1307064, 749953]
13868G49953M84027l11438M9939J12077L4823m0672j22615M4840k536J03842j44495
13857I57745j66740N13726j40259l73537q800M23814E87091L33109n2558M3603
13847I11245K09395j83942J7690o9036K95871O7441l74856P5453o207j04450j6856
13836H21748l52915K07235j83904J21703J26858L96074m77837K25922P04J27488
13826A013076P7055j84935k12899L84843k18966k98619R3645J71476J21296k16971
13816G29001O5140M6111j62109K46501m41606K78190K0584L59908l34617r9947
13806G07156k518l7140J42096j1313N8999l13918O1597J11757r8506L91211k42492
13795G66929J25442j80677j14029j41042J8652K87750P344L27954E23485l3343
$$ y = [749953, 1233980, 922542, 972481, 1084558, 1119381, 1078709, 956094, 1000934, 998398, 1102240, 957745, 791005, 1304731, 1164472, 790935, 782135, 1205949, 587091, 920200, 867642, 911245, 1120640, 936698, 954388, 885352, 1181223, 1248664, 873808, 949261, 943054, 838604, 821748, 468833, 676068, 492164, 613867, 740725, 1136799, 658962, 884884, 885588, 1013076, 1090131, 905196, 692297, 1077140, 858174, 559555, 653200, 824676, 945972, 729001, 794141, 840252, 678143, 924644, 483038, 761228, 781812, 1141720, 807103, 707156, 704638, 667498, 809594, 798281, 857280, 543362, 604959, 716716, 618210, 1009421, 766929, 892371, 711694, 597665, 456623, 475275, 763025, 770369, 1098323, 523485, 490142]
13785D90142L10989j051o1577p332J7396r2958q9975K55092p2685r8814N2446
13774G01673P0798j09120j65026L39977l45946J38210r0413K77177k50761j04712
13764D61857J90405l2401p968n1592N9531o8835j2600N720J03941J18514j53771
13753F12801j23694K53818k43355K3631K4757J04243K8042N114j64351N2100p8022
13742D95084K73472l71734k8402l7824J41113j9211J07659k37423L21631m8047
13732E96318l6246k12863P9889K07463L3264A08282N44741K8589j92818J52630
13722F41424j09638O6762K29779k89930O6620o9581P1501O7880k55349P9679N2293
13711E51440N9406j37363K44901l26953k5068L63030C09266K31394B37720L15369
$$ y = [490142, 801131, 800080, 738503, 731171, 748567, 655609, 565634, 820726, 748041, 649227, 701673, 772471, 663351, 498325, 838302, 492356, 630566, 540153, 817330, 566569, 461857, 652262, 619861, 611893, 560301, 619832, 550997, 538397, 544117, 648058, 766572, 612801, 489107, 742925, 499570, 523201, 547958, 652201, 680243, 685357, 521006, 573106, 495084, 768556, 396822, 368420, 330596, 471709, 452498, 560157, 322734, 644365, 596318, 560072, 347209, 427098, 634561, 667825, 108282, 653023, 681612, 488794, 641424, 531786, 598548, 828327, 538397, 605017, 535436, 606937, 674817, 419468, 499147, 551440, 610846, 473483, 718384, 391431, 366363, 729393, 309266, 540660, 237720, 553089]
13701E53089A49600M44295k33173O649O6064K01284j63014q403J42819m4536n5029
13690E06556R2220A41289L34737P7326A87849J73275N75980B50332J32566K10018
13680E92916k19040L23819l15538M44166C51440L44700j99673j04924J6768j81047
13670B27264K96326k59340J17980j21499d1971B81142K56593J62260C14120J7234
13660C31354A58245N45145C08707A41012M64616j84191j85232j17626L04751A96643
13649C98773r8223k8218M9566J20592j94858r203L34924B33048l750j00527j6613
13638A12158J06439K55171j08659N0013B04191N6714K8777m0500M10799j02622
13628E57359j57328A20350L92956j11822K3632A8850L10716p356j32208K04671
$$ y = [553089, 149600, 593895, 360722, 367371, 433435, 634719, 471705, 463302, 606121, 561585, 506556, 598776, 141289, 476026, 553352, 187849, 361124, 937104, 250332, 382898, 592916, 373876, 697695, 382157, 826323, 351440, 696140, 496467, 391543, 408311, 227264, 523590, 264250, 382230, 260731, -41971, 281142, 537735, 699995, 314120, 331354, 158245, 703390, 308707, 141012, 605628, 421437, 236205, 118579, 423330, 196643, 398773, 300550, 272332, 321898, 442490, 247632, 238429, 573353, 233048, 229298, 128771, 112158, 218597, 473768, 365109, 415122, 204191, 260905, 289682, 249182, 659981, 557359, 400031, 120350, 513306, 401484, 425116, 18850, 329566, 322210, 190002, 394673]
13618C94673J44015A25832K07615J07052A56954L25984B36628R1568l1537P5392
13608C72051A84964o8530N70298A32773K72439A90148K38000j00027K53420k44016
13598C37525l3568J0117j40181K89636L9548m5617A60638l1693O12746l43894
13588C97797d9400C63183A29767J16349J23711P1434f106E08085B03748B8831
13577A12844N6697K56402j30673J31542j74722H5455M34837n4756m2407K14824
13567F37953j92977H9933L03268r4953j06134m8626K10494j24529K21874n4512
13557C96815l3324P2372F2445J10847J09508j16863J2138M12728D6005L0639L67546
13546D44190r902B03649m0844J76093P9553k7879j06805M4359R6564j63203A00431
$$ y = [394673, 538688, 125832, 333447, 440499, 156954, 482938, 236628, 328196, 296659, 372051, 184964, 116434, 686732, 132773, 405212, 190148, 428148, 328121, 581541, 337525, 303957, 314074, 173893, 463529, 503077, 457460, 160638, 128945, 741691, 397797, -49400, 363183, 129767, 246116, 369827, 441261, -6106, 508085, 203748, 28831, 112844, 169541, 425943, 295270, 426812, 252090, 85455, 520292, 465536, 423129, 637953, 444976, 89933, 393201, 298248, 192114, 143488, 353982, 229453, 451327, 396815, 363491, 435863, 62445, 173292, 282800, 165937, 178075, 590803, 46005, 76644, 444190, 434288, 203649, 162805, 338898, 418451, 390572, 283767, 328126, 424690, 261487, 100431]
13534A88423K05165A60335L5299l7360c9446B90975n9244J34l2089I3517g8265
13522D95626A76553n1334M4341J83493K69490B48068j055A07898Q2880P1269j05524
13511A56523K23250k1366j5176A67592F6616J08109J86310j61399B6612K46999
13501B73611K18947m1405H5795J92210n875Q2222j21213K27109J45912D6187K34123
13490B80310k7593p2902a8198C15894A45644P0505o3096K225j9799R2785j4719
13479B13545L4058N9602j23075K85231A28061K20776A49300R3442J25809C8731
13468A95512K30916j39561C1563L7185Q1508m0389p43D2584J83849h4765B0423
13456C25240j23201l270F9179J114M55044e3831B04301L76771j77513L862r5160
$$ y = [188423, 393588, 160335, 195634, 158274, -39446, 290975, 231731, 231865, 199776, 93517, -78265, 495626, 176553, 125219, 169560, 353053, 622543, 248068, 247013, 107898, 190778, 262047, 156523, 379773, 358407, 343231, 167592, 66616, 174725, 361035, 199636, 26612, 273611, 492558, 451153, 85795, 278005, 272130, 354352, 233139, 460248, 606160, 46187, 280310, 252717, 179815, -18198, 315894, 145644, 216149, 153053, 155278, 135479, 228264, 213545, 247603, 307205, 184130, 469361, 128061, 348837, 149300, 242742, 368551, 38731, 195512, 426428, 286867, 31563, 68748, 150256, 109867, 109124, 42584, 226433, -84765, 20423, 325240, 202039, 198769, 69179, 70293, 525337, -53831, 204301, 581072, 403559, 407421, 312261]
13445C12261L6217m7994r5541q0005m3068K55583n2051B2400J0024L43762A42451
13433A33861h7373E14327A04562R563L12416r1798a11399B58420G7144J15324
13423A92468A2875O1012K81322r2228j15734e7748I2492J52491B9908K60254D1358
13411C97017M858I3153J2685M78789j68501G8309J9753d920F5283L40622A65732
13399C50483n8674P9289f0968I6694j4831J91444a0582F2200J34944J82956c267
13387c5819A49266k5080J00247I0352B5148i6910A0881J98992O8598N308j833
13376B81946f24D8528L15681j29858I6089a61204A48072b5114A09330M06846B4866
13364A39061e2847B83287a72081A27186J18587m6854n7127J45524O5457i9601
$$ y = [312261, 348478, 300484, 204943, 124938, 81870, 337453, 285402, 22400, 32424, 376186, 142451, 133861, -87373, 514327, 104562, 114125, 426541, 334743, -111399, 258420, 77144, 192468, 12875, 73887, 355209, 262981, 147247, -57748, 92492, 244983, 29908, 290162, 41358, 397017, 401875, 93153, 105838, 584627, 416126, 78309, 98062, -4920, 65283, 405905, 165732, 350483, 291809, 371098, -60968, 96694, 81863, 273307, -10582, 62200, 197144, 380100, -3267, -35819, 149266, 124186, 224433, 90352, 25148, -96910, 10881, 209873, 278471, 283779, 281946, -624, 48528, 364209, 234351, 96089, -161204, 148072, -25114, 109330, 516176, 24866, 139061, -52847, 283287, -172081, 127186, 245773, 198919, 141792, 287316, 352773, -99601]
13353A2944i6065A16718J84781L34279A07219M7540J75062O9440A38425L9298
13343A77723M3980J5143K28381o5850A66977J73919Q7037r1355j34924K31962
13333D33616o7437J5559A54983r293p1420a92458g754D47674j4534B6575K2844
13322D9419J70160a24355B43215p4893K43779j62487o3713d2098C9762J42382
13312A82144c20578a9782A44420a15605A25595P0486r5976b17798a5093j1784
13302b6877B15918o0866H372K1380a61318A37935m6157a85140e2054D6301L40043
13291C86344l2178j66050L9500H3590K05660M4208f174l07635B75420H4790L2541
13280A17331L1767R3199j3904E2975a8132A42195E2852c1666A94666J18013h1052
$$ y = [12944, -96065, 116718, 301499, 635778, 107219, 154759, 329821, 399261, 138425, 177723, 221703, 236846, 465227, 399377, 166977, 340896, 427933, 336578, 201654, 433616, 366179, 381738, 154983, 145690, 74270, -192458, -7754, 447674, 433140, 26575, 49419, 219579, -124355, 243215, 168322, 412101, 249614, 185901, -42098, 39762, 182144, -320578, -19782, 144420, -115605, 125595, 196081, 100105, -217798, -15093, -26877, 215918, 155052, 8372, 29752, -161318, 137935, 91778, -185140, -52054, 46301, 386344, 354166, 188116, 227616, 83590, 289250, 333458, -6174, -313809, 275420, 84790, 117331, 149098, 242297, 228393, 52975, -18132, 142195, 52852, -31666, 194666, 312679, -81052]
13268F2053f3153B00453r4620k180M75601B1638J64566H393N9514Q933O3708a2492
13255a27792M3504o6345F555J71768J43222A18114c56687A66652Q4672q4293K05093
13244C72124a7792G7130J09816e807I3050Q6485a23478A00538j3089a40327G3621
13232B0375c10958a25979B49574k4637j05619J8517k2481e0212B73241B2851K537
13221B5388a6993B25490j6163g2084A33993n3931B5079b46518C89530A09683c09228
13209A24756b3002B81206a67257j23718B61306a8588A92343n4986J83499C4111
13198e315l38838A47970J75102c48363a09593k02018a29967B11305R8912B1701
13187B12279k9263a43394g354j56244B00868p4949B8676a64953A81781e4778A51566
$$ y = [62053, -63153, 200453, 105833, 103653, 579254, 21638, 186204, 8393, 67907, 76840, 140548, -12492, -127792, -84288, -150633, 6555, 178323, 321545, 118114, -356687, 166652, 251324, 167031, 372124, -17792, 77130, 186946, -5807, 93050, 179535, -123478, 100538, 87449, -140327, 73621, 20375, -310958, -125979, 249574, 224937, 119318, 137835, 115354, -50212, 273241, 22851, 25388, -16993, 225490, 209327, -72084, 133993, 80062, 25079, -246518, 389530, 109683, -309228, 124756, -23002, 281206, -167257, -290975, 261306, -18588, 192343, 137357, 320856, 34111, -5315, -344153, 147970, 323072, -348363, -109593, -311611, -129967, 211305, 310217, 21701, 212279, 183016, -143394, -7354, -163598, 200868, 125919, 28676, -164953, 181781, -54778, 151566]
13175G358b7042A56380k0722J00536p4818l3289J16528K9611A08977a9828D01205
13163A43164P0453a4896C58756I3406d07926a22584G2442M7302m1928C5190J7166
13152E2356k4937b49818f2684B76871a9608B15577a28425l5351B54961H1948h7170
13140a05478j3138G6721K7949b6330r5873A0789J2125L6888A818Q5824B4609J7965
13128D2574K67826j49134J79629E8065d1914A53884K3858a19011B02892a61826
13117I3559b2864k97304C8955F635a09639E7991a62769B64888A2600R9119i934
13105c1703A4957a1093j93752B94376a07069B36840H8942J19043F9248a42551
13094g4745G5060J10926F8338L48764c9387A7399K33976a03066B9895c6020I2816
$$ y = [7358, -27042, 156380, 135658, 236194, 161376, 128087, 244615, 274226, 108977, -19828, 401205, 143164, 213617, -14896, 358756, 93406, -407926, -122584, 72442, 119744, 77816, 35190, 52356, 27419, -249818, -62684, 276871, -19608, 215577, -128425, -163776, 254961, 81948, -87170, -105478, -118616, 76721, 104670, -26330, -122203, 10789, 22914, 59802, 1818, 87642, 24609, 42574, 310400, 161266, 340895, 58065, -41914, 153884, 177742, -119011, 202892, -161826, 93559, -22864, -320168, 38955, 6635, -109639, 57991, -162769, 264888, 12600, 111719, -9934, -31703, 14957, -11093, -204845, 294376, -107069, 236840, 88942, 207985, 69248, -142551, -74745, 75060, 185986, 68338, 417102, -39387, 17399, 251375, -103066, 29895, -36020, 92816]
13082C97928A04515N8679H1413c5978B9363K51681d6697A94405O91E2669a68965
13070A05208h6549A68886J02787g7029A26961a50842A58555C2684L12738L6799
13060C82221j7269E0802a43990A66338a77602B94811b37840A45185J8500a38260
13049a20953E4367L00736a78598C5884G539K83264K9367j09084l1379A0759L23626
13038C34385f4293j28905C1837C961J90407D7444A1123R7718a52559B16816r2303
13027A24513c4245B38505I9182L5709h3629b0133G1323J48290e1652B35926D5155
13015b59091B1558h3813F5924J50609K08162j25818g8241B53956R2267B1705b26802
13003A87894e3609E48972B56689J4217C3246J31261p1193k9506N7158M1063b33363
$$ y = [397928, 104515, 163194, 81413, -35978, 29363, 281044, -46697, 194405, 195096, 52669, -168965, 105208, -86549, 168886, 271673, -77029, 126961, -150842, 158555, 32684, 345422, 382221, 364952, 50802, -143990, 166338, -177602, 294811, -237840, 145185, 163685, -138260, -120953, 54367, 355103, -178598, 35884, 7539, 290803, 320170, 211086, 179707, 10759, 334385, -64293, -193198, 31837, 3961, 194368, 47444, 11123, 108841, -152559, 216816, 124513, -34245, 238505, 99182, 134891, -83629, -20133, 71323, 219613, -51652, 235926, 45155, -259091, 21558, -83813, 65924, 216533, 424695, 298877, -78241, 253956, 346223, 21705, -226802, 187894, -53609, 548972, 256689, 270906, 33246, 164507, 93314, 63808, 120966, 162029, -233363]
12991i7713k11276A39406B2064f379A59618d4690F9236A6585N5036O9419c0378
12979h9900K7411b614m4672B99919a40898q023C13036B8148J62703a70526L1672
12968a38854B81139o7272A3456K252J82048a89243E6390c576k58629h4510b1807
12956B03167e1828B03977a09900a4050m8652A18144C9621j813A5559K39177B8549
12944A6564L0037k1957K23490E8589K36033C4430K28619j24121L8281D3036O3491
12933A06527D3284O9875a67974B2039J47323C0238R3842J61502I5178M10441g4365
12921A04347f8506C63714c33317J36718O8077A83192D7747c28747f0080l56619
12911d16699a34057a1589A16423c3798q9387B89363H6545J8852O4065N8836H93
$$ y = [-97713, -308989, 139406, 22064, -6379, 159618, -44690, 69236, 16585, 71621, 141040, -30378, -89900, -62489, -2614, -47286, 299919, -140898, -148921, 313036, 28148, 190851, -170526, -138854, 281139, 213867, 13456, 15708, 197756, -189243, 56390, -3576, -262205, -84510, -21807, 203167, -51828, 203977, -109900, -14050, -62702, 118144, 39621, 37808, 15559, 254736, 28549, 16564, 46601, 24644, 248134, 58589, 294622, 34430, 263049, 138928, 177209, 43036, 106527, 43284, 113159, -167974, 22039, 169362, 30238, 124080, 285582, 95178, 505619, -74365, 104347, -68506, 363714, -333317, -196599, -128522, 183192, 47747, -328747, -60080, -416699, -134057, -11589, 116423, -33798, -123185, 289363, 86545, 105397, 169462, 228298, 893]
12899B68789b75984E28a70684A73077G7710J42448f5348k3401A70087o4471L76192
12888D81808B36478a75483F8283a67909A54620f7433A48851c39394a15525A83363
12877h5007E4742O6783C9927R1962b19880A83385l4998b16513o808B24499m2326
12866A82173D2616b12941E5686N3022b74662C12783f7734B63035m0001b85219
12855a10671a3124l06685A19354E645a55326a6372n1907A05211i3181A37722L4250
12844A71972p4898K66000A15595d1958n7443A69203F7294a55155E6730b5881j20643
12833a46524q1064a6828E2322g6446m3013B19843J37086a44045A01573J3235c8356
12821B29640r5615E4646d7643A27785m9298J985O7988f6658b1310j7297l8548
$$ y = [268789, -275984, 528, -170684, 173077, 77710, 220158, -65348, -88749, 170087, 105616, 481808, 236478, -175483, 68283, -167909, 154620, -67433, 148851, -339394, -115525, 183363, -85007, 54742, 121525, 39927, 131889, -219880, 183385, 148387, -216513, -223321, 224499, 182173, 42616, -212941, 55686, 108708, -274662, 312783, -67734, 263035, 223034, -285219, -110671, -13124, -319809, 119354, 5645, -155326, -16372, -68279, 105211, -93181, 137722, 171972, 97074, 363074, 115595, -41958, -99401, 169203, 67294, -155155, 56730, -25881, -146524, -227588, -16828, 52322, -76446, -119459, 219843, 356929, -144045, 101573, 114808, -38356, 229640, 134025, 54646, -47643, 127785, 78487, 80472, 148460, -66658, -21310, -38607, -77155]
12810g7155E3471a12352D4885a28388D2848P6903a38268G1921a32271A54712b10478
12798B38992f2140q766L1453J2906A56738B2487i7601B07691f6528K0711H488
12786H1208J14860d9349A06968a2287j63365B03702c10020L2369B6228a27626
12775A79835a0018q0226c4199q3234a8273D6036g3586j04248Q2023C88345b35766
12763A02444d8196C9795a04138o1285A12423k495A842J128J44850o5803e544l25741
12751c31285B23160P7485f0268F8900Q3157D7501i6372M620J8222j97740a10843
12739A33448J54206R23A30591L4654C0261a44857B39277b29514B68628b06487
12728A61457B626J7340K58968p6667B0423M5045i4744B37524c4686B8051N0880
$$ y = [-77155, 53471, -112352, 44885, -128388, 42848, 119751, -138268, 71921, -132271, 154712, -210478, 238992, -62140, -70906, -39453, -26547, 156738, 22487, -97601, 207691, -66528, -45817, 8488, 81208, 196068, -49349, 106968, -12287, -175652, 203702, -310020, -277651, 26228, -127626, 179835, -10018, -90244, -34199, -117433, -18273, 46036, -73586, -177834, -95811, 388345, -235766, 102444, -48196, 39795, -104138, -165423, 112423, 109928, 1842, 2970, 147820, 82017, -5544, -331285, 223160, 300645, -60268, 68900, 152057, 47501, -96372, -91752, -73530, -271270, -110843, 133448, 287654, 288577, 130591, 165245, 30261, -144857, 239277, -229514, 268628, -206487, 161457, 2626, 19966, 278934, 202267, 20423, 65468, -94744, 237524, -34686, 28051, 78931]
12717G8931h8188D22343j85281Q6814j59606c4343A5767J86675J07634r6091R8956
12706C12941H7131i0474D19460A29461q721J12926I1283j1938K57860b27844n8896
12695b86740a20690B85094g2673b3590n4449A69036e8243k8147k26324B07434
12684E9030J93456b40651A97221Q9218j18093o8024J11664N0931N1936A7936b04939
12672b22400n0889A08029n410e2121n7711L7992A52726L7106f1863K069I6830
12660f77j64119A57334J89748R612j19221K3674j16632M4212F1384g1943B29702
12648b05427A56507d30393a00798M1826k72114B11081p5824a773B72419c2096
12637b74097R4090C6739L88492j95552j0206K9135F8924L54859A18536j7595J58994
$$ y = [78931, -88188, 422343, 237062, 323876, 164270, -34343, 15767, 202442, 310076, 213985, 312941, 87131, -90474, 419460, 129461, 120740, 233666, 91283, 79345, 337205, -227844, -286740, -120690, 285094, -72673, -23590, -78039, 169036, -58243, -86390, -312714, 207434, 59030, 252486, -240651, 197221, 286439, 168346, 100322, 211986, 262917, 314853, 17936, -204939, -222400, -273289, 108029, 102619, -52121, -109832, -71840, 152726, 189832, -61863, -59794, 96830, -677, -164796, 157334, 347082, 356694, 237473, 261147, 144515, 188727, 61384, -71943, 229702, -205427, 156507, -430393, -100798, -58972, -331086, 211081, 135257, -1773, 272419, -32096, -274097, -180007, 36739, 425231, 229679, 219473, 248608, 68924, 423783, 118536, 100941, 259935]
12626B59935b22108a5931j05698B03936h2176A62483c2277B58060a18691D0712
12615A10687b10459Q5785I611c81062a43117B3859c29086A84072A5805i956q8788
12604i8744F1756J23066B5869a09558A96857E6898J46768N9667E6537b28177A97862
12592h3733J048l3980M5050a0826A50048k5938a84618H7298k286L29034E2666
12580a04098c7493A1903K5921a18632B50612a52539C2243B543b7673k50793a7277
12568a10049q6873A44988n4213d4319k24312A59633J78463b14846C72718b35980
12557b67564B03308a2288B58894d5299Q762j55167C01904A31789b82022j0758
12547b92780J2872B16086d7924n0155D27050A65408k5056f8548j08693H6361a26646
$$ y = [259935, -222108, -15931, -121629, 203936, -82176, 162483, -32277, 258060, -118691, 40712, 110687, -210459, -124674, 9611, -381062, -143117, 23859, -329086, 184072, 15805, -9956, -98744, 61756, 184822, 25869, -109558, 196857, 56898, 203666, 263333, 56537, -228177, 197862, -83733, -82685, -116665, -71615, -10826, 150048, 124110, -184618, 87298, 85012, 414046, 52666, -104098, -37493, 11903, 37824, -118632, 250612, -152539, 32243, 2543, -27673, -278466, -17277, -110049, -196922, 144988, 90775, -44319, -268631, 159633, 338096, -214846, 372718, -235980, -267564, 203308, -12288, 258894, -45299, -36537, -191704, 301904, 131789, -282022, -292780, -279908, 216086, -47924, -98079, 427050, 165408, 140352, -68548, -177241, 86361, -126646]
12535B38605J91408A39165e584k30592F5682A1234b26508E7666P296a32293E1187
12523f6655K1366B34711b09364H0517J62271a4041B58804A19325b78741a28434
12512G7214c13144d6123o4503r6016A52708H074J3154i6025a2490B98267B6382
12500A98270i1713j12630l1322A02446B4556J70884e6784A18532B230a53412P5823
12489g7589j7175J9863A29779c03674B59083a89348A52088f8190j15184E8060
12478c31608j07069d5898B04129I7095R7578O4647i0404A52911a47174N0895j76042
12467b72321b5304B51336b21832A07624e7042j34211R4770L4028E3853B6324J98795
12456B25119l9129K14378E3321a3709F5588a56077A27775g2222E0375C740a68749
$$ y = [238605, 430013, 139165, -5584, -236176, 65682, 11234, -226508, 57666, 64962, -132293, 51187, -66655, -45289, 234711, -209364, 80517, 242788, -14041, 258804, 119325, -278741, -128434, 77214, -313144, -46123, -110626, -206642, 152708, 8074, 21228, -96025, -12490, 298267, 26382, 198270, -91713, -204343, -235665, 102446, 24556, 195440, -56784, 118532, 2230, -153412, -77589, -94764, -74901, 129779, -303674, 259083, -189348, 152088, -68190, -183374, 58060, -331608, -438677, -45898, 204129, 97095, 194673, 259320, -90404, 152911, -147174, -96279, -272321, -25304, 251336, -221832, 107624, -57042, -191253, -96483, -62455, 53853, 26324, 225119, 185990, 400368, 53321, -13709, 65588, -156077, 127775, -72222, 50375, 3740, -168749]
12444b83433A1352f1978j00640j2372A48971i61j5043A78736f5757j55873B9368
12432A8715b5566l8119k66909C9141N7885m7111a19099C36356B1657M4725Q0556
12421A46938D723K48920a63600P461l17258A71379a75472A05041N1448F0798a28772
12409a633G9572C1504J65153c10851M1067o865F0769c01921e5926j52127R4935
12398a13118H1213J7069f6788k4174F4400o32O8633L2299a55993l688C50398A8745
12385b0071k8446C02963n3164h2575F9326a1310k37486J17274r674l5575f3979
12373D30347a91097A05076A5071a90925o9258J27107n8154B01354b09027A28977
12362B19625j02931d28187a25339C10022b6500B13067b07026L458d7274G2425
$$ y = [-283433, 11352, -61978, -162618, -174990, 148971, -961, -16004, 178736, -65757, -221630, 29368, 18715, -25566, -63685, -330594, 39141, 97026, 49915, -119099, 336356, 21657, 66382, 146938, 4723, 253643, -163600, -156139, -473397, 171379, -175472, 105041, 156489, 60798, -128772, -1633, 79572, 31504, 196657, -310851, -269784, -276649, 60769, -301921, -55926, -208053, -113118, 81213, 98282, -66788, -90962, 64400, 63768, 132401, 164700, -155993, -159681, 350398, 18745, -20071, -48517, 302963, 249799, -82575, 69326, -11310, -248796, -131522, -141196, -176771, -63979, 430347, -191097, 105076, 15071, -190925, -260183, -133076, -191230, 201354, -209027, 128977, 219625, 116694, -428187, -125339, 310022, -26500, 213067, -207026, -203568, -47274, 72425]
12351B33211d1849A62226m7804b48262Q6055K9954B4333f3738B18359k4259a66692
12339F2837a15798b2340A6508L66125H9015b31881G7355K61991a15454B84277
12328c7691B96468q5939E732e8516A5870a56175A20366e3408N162A8873L4307
12317E3180a57726A37656J45741l4439C4256K81133c4394n7477A62552i4129A1964
12305e0702j28252I6934m2741a2438k17791F6974c5271j57248A07354a93388B563
12293b2616A07181K44890c42664J56042E845J91433p2770Q8158H8889d5723A47070
12281A24129a29578D4156K15940g8238R44A81352J27322A5703K6025K12988o0167
12270A94549m489l8010l8444a67829c3514C7831N199b2951B27120i4765A70614
$$ y = [233211, -41849, 162226, 114422, -248262, -162207, -132253, 24333, -63738, 218359, 194100, -166692, 62837, -115798, -22340, 16508, 382633, 89015, -231881, 77355, 339346, -115454, 284277, -37691, 296468, 210529, 5732, -58516, 15870, -156175, 120366, -53408, -48246, 18873, 53180, -157726, 137656, 283397, 248958, 34256, 315389, -34394, -91871, 162552, -94129, 11964, -50702, -178954, 96934, 54193, -12438, -230229, 66974, -35271, -192519, 107354, -193388, 2563, -22616, 107181, 352071, -342664, -186622, 5845, 197278, 124508, 212666, 88889, -45723, 147070, 124129, -129578, 44156, 260096, -78238, -77294, 181352, 308674, 15703, 41728, 254716, 194549, 190060, 152050, 113606, -167829, -33514, 37831, 43030, -22951, 227120, -94765, 170614]
12258e8467A37888C2416N0108N6047a06616j12923A33566b40227c1366j37583
12248a68949d327B34731A16580H059N8435A4637a21932j14308e5751B38387a7517
12236A41425a19327k2734I5056K48508g0670B37489A09052b14182H8341N1376
12226A39717K88210b18442D22236A81024M7268C5997L54251b35119E8828B2723
12215I8334O5061g4594I8864c6667j64433f5914A57606C602M7743a665n9991C22059
12202D16555c6910A16161J54958K0150A03853P0404a10260B03367D7982g4048
12191d6553A80458A6772L62888j40233m565N026E5387L37613i7114G7254J13634
12180A90888a11982A8128J62761f664G3229J66152l3822a51157d7933B32061F400
$$ y = [-58467, 137888, 32416, 82524, 138571, -106616, -219539, 133566, -240227, -31366, -168949, -4327, 234731, 116580, 8059, 66494, 14637, -121932, -236240, -55751, 238387, -17517, 141425, -119327, -142061, 95056, 343564, -70670, 237489, 109052, -214182, 88341, 139717, 427927, -218442, 422236, 181024, 228292, 35997, 390248, -235119, 58828, 22723, 98334, 163395, -74594, 98864, -36667, -201100, -65914, 157606, 3602, 51345, -1665, -61656, 322059, 416555, -36910, 116161, 271119, 291269, 103853, 174257, -110260, 203367, 47982, -74048, -46553, 180458, 16772, 379660, 239427, 234862, 239888, 55387, 393000, -97114, 77254, 190888, -111982, 18128, 180889, -6664, 73229, 239381, 205559, -151157, -47933, 232061, 6400]
12168A51345f0722B67361n6531E712b9659C34122c4086B57498k3143C2637c9280
12156c00675D4693e3116B44123r6422l3963m0362a95520B92617R1025H9054a281
12144C27646a39368l1101A59604p418N7066d7222A72615p9002C1653a41214B36580
12132A00184J04352i3673A08734j5797O0713N2417l7846C7099K90075B836M32312
12121D35148h8815E8255e50453A24349c4984C7797J13492D910K83535B447b86050
12109a19810i470D8365K14821a30536J7220A40062M7032C8203f81j26676a5919
12097a49764c6259j29188m5079O3040a5043l72967I4618b05641l427A62409F8564
12085a80303P2742E14152J943N07600J216409D51762j1132j65214a14296j4520
$$ y = [151345, -60722, 267361, 210830, 5712, -29659, 334122, -34086, 257498, 234355, 32637, -39280, -300675, 44693, -53116, 244123, 147701, 113738, 73376, -195520, 292617, 383642, 89054, -1281, 327646, -139368, -170469, 159604, 152186, 209252, -47222, 172615, 93613, 31653, -141214, 236580, 100184, 204536, -93673, 108734, 92937, 153650, 206067, 168221, 37099, 327174, 2836, 435148, -88815, 58255, -550453, 124349, -34984, 37797, 151289, 4910, 288445, 2447, -286050, -119810, -9470, 48365, 263186, -130536, -113316, 140062, 187094, 38203, -681, -127357, -15919, -149764, -36259, -165447, -210526, -147486, -15043, -388010, 94618, -205641, -209068, 162409, 68564, -180303, -107561, 514152, 516095, 1023695, 2240104, 451762, 440630, 275416, -114296, -128816]
12075a28816N6012o8725A40386a08815e3857G1017b40740A06300e703B3142J26608
12064A49750c4028B1481R8775f01693F3087O6307n3525c1200j41574B36208G9105
12052C45207a87327g430B03025b75432a6822A43313m0921c17298C9739a08034
12041c31780B18840b12734f142A28303a01793j25062b4451j21169b0165A35824
12030C4028b38121a18858n8277A57180p6324J0463b00267F945P3330P5682g680
12018G3052e1468a7485B6906O2068N0504a02607j88841M9499a12612A48870b3919
12006a49195d3434A7627b11502g9583A46568k4615a31940G496b65229I7651b81315
11994b4022j27441K226D9455a1571j48699C47898e0367B57207a65468e1050E1592
$$ y = [-128816, -72804, -141529, 140386, -108815, -53857, 71017, -240740, 106300, -5703, 23142, 149750, -34028, 21481, 120256, -601693, 63087, 129394, 75869, -31200, -172774, 236208, 79105, 345207, -187327, -7430, 203025, -275432, -16822, 143313, 102392, -317298, 39739, -108034, -331780, 218840, -212734, -6142, 128303, -101793, -226855, -24451, -145620, -20165, 135824, 34028, -238121, -118858, -177135, 157180, 80856, 91319, -200267, 6945, 80275, 155957, -7680, 73052, -51468, -17485, 26906, 88974, 139478, -102607, -291448, -241949, -112612, 148870, -23919, -149195, -43434, 17627, -211502, -79583, 146568, 121953, -131940, 7496, -265229, 97651, -281315, -24022, -151463, -149237, 49455, -11571, -160270, 347898, -50367, 257207, -165468, -51050, 51592]
11982B15519h5183A56140f1425j48583g2059k8590p808l415n4623G3407i4117
11970A97555D8768b49157K9555A20823a46276A58973D7080a55485J3193A77192
11959a26322A50487d0762B99789d5780A05229l1651Q5100b1111B17824d8216A86474
11947d539l75246C86626A64154h6518o4918C20097q7128i593B20675b4544j47882
11936a72426B7139R9304J50976R699f8364k33460A08727J10275c6442l04453E9702
11924d6957j31898f0257A3144c32717b3296m3183E4727R1959a76550P7117r8400
11913a97833l4741A31009J59406j7685g4754j550j52595h0070j98258C1952b79225
11901G9366b07866D7074a33260B71887c5637I1026a25163k5950C06132o5805A1367
$$ y = [215519, -85183, 156140, -61425, -210008, -72059, -100649, -108457, -111872, -166495, 73407, -94117, 197555, 48768, -249157, -219602, 120823, -146276, 158973, 47080, -155485, -142292, 177192, -126322, 150487, -40762, 299789, -45780, 105229, 73578, 158678, -21111, 217824, -48216, 186474, -4539, -379785, 386626, 164154, -86518, -151436, 320097, 232969, -9593, 220675, -24544, -172426, 27139, 126443, 277419, 287118, -68364, -301824, 108727, 219002, -36442, -340895, 59702, -46957, -178855, -60257, 13144, -332717, -23296, -66479, 54727, 146686, -176550, -99433, -197833, -232574, 131009, 290415, 272730, -74754, -76304, -228899, -80070, -278328, 31952, -279225, 79366, -207866, 47074, -133260, 271887, -35637, 91026, -125163, -151113, 306132, 240327, 11367]
11889a19497j69675g4293q0037B2020b07572A34248B1233O8433c769n2375a409
11877a29821A10232b41318M1032d932k22869C30624b71893r9610D6846J21958
11867A68804i3133j59315e8609C01699A06619a3659j1243m33540d2399j14179
11857a56578j17097a24442M1015j0973j06240B04851F1203a62968j47214J17624
11847a92558E5132b28129A4806i0825b7159B32314a96332d7126A08735a97520
11836f302j07193A41569J70264f2227j3630k3474o4247j02666F5138K13366C8999
11824i2394B635c5982B25034c48799A12843h1814I6597a04069d8592j50792E541
11812C8674J52486k2531a40819R410q5531a4811A22043a11205B72465f490H2400
$$ y = [-119497, -289172, -74293, -154330, 22020, -207572, 134248, 21233, 89666, -3769, -56144, -1409, -129821, 110232, -241318, -200286, -4932, -227801, 330624, -271893, -371503, 46846, 168804, -93133, -252448, -58609, 301699, 106619, -13659, -24902, -458442, -42399, -156578, -273675, -124442, -83427, -94400, -200640, 204851, 61203, -162968, -310182, -192558, 55132, -228129, 14806, -90825, -27159, 232314, -196332, -47126, 108735, -197520, -6302, -113495, 141569, 311833, -62227, -75857, -99331, -163578, -266244, 65138, 278504, 38999, -92394, 2635, -35982, 225034, -348799, 112843, -81814, 96597, -104069, -48592, -199384, 5541, 38674, 191160, 168629, -140819, -131409, -216940, -14811, 122043, -111205, 272465, -6490, 82400]
11800B0176P8590h3787j75734g9266n4651J6293k01044A29196E3739R6637c2478
11788B83637a5651F0995b23178G4844i255o1884A76004a0145A62581D0048K2252
11777F2300J30036l0483a78157N5568D38078A9917a42811j12331a01530B55802
11766A08401b19456C05616I543a16488B24192b03220n0678R3525k343J8097K1726
11755a22893C00592j18508a13856a4562k6881k03915C03784A5674c1421B1191
11744H2479J03047a26365j96026A26114b16491H5231f9553D0743J25297h1383
11733D3361M2002b03328A30642f3136k15008h3706l641B6920B040K25099b10151
11721b95807f9203C3607c6838D5031J35627e4035F9929R2242a62383B9702c55949
$$ y = [20176, 98766, -83787, -259521, -79266, -133917, -117624, -318668, 129196, 53739, 150376, -32478, 283637, -15651, 60995, -223178, 74844, -9255, -71139, 176004, -10145, 162581, 40048, 62300, 192336, 161853, -178157, -122589, 438078, 19917, -142811, -255142, -101530, 255802, 108401, -219456, 305616, 9543, -116488, 224192, -203220, -253898, -160373, -162716, -144619, -122893, 300592, 182084, -113856, -14562, -41443, -245358, 303784, 15674, -31421, 21191, 82479, 185526, -126365, -322391, 126114, -216491, 85231, -69553, 40743, 166040, -81383, 43361, 85363, -203328, 130642, -63136, -278144, -83706, -87347, 26920, 2040, 227139, -210151, -295807, -69203, 33607, -36838, 45031, 180658, -54035, 69929, 162171, -162383, 29702, -355949]
11709d0289a4001r6885a0649j73425G7890B7954M14961b86210D00558I3679k3071
11698G0608a7145K905o7497B55252B1393J37417c69061G022M5877a65346m9977
11687b15323C57493c3590A69286J31607H9268O981c35620a0711r8031d3070C37718
11675A09254a57543G3634b36178R1183C3604J53537b63039H6358D0729N4679a56692
11663e8984K6940C4266a98639A34622A8062K66346G8433c8667B02149c7799E62511
11651B80951j39775D0174P6164J35386f2624B61655a32403A96694J10114A31734
11640a36602k32456a57572b2143p5374L5244k32658A67781F7913J89029A7855
11629a04481B20817K44208G7870L5103l6807J5830K80438h0925o0295A19038J66148
$$ y = [-40289, -14001, -110886, -10649, -184074, 77890, 27954, 442915, -286210, 400558, 93679, 70608, -17145, -14240, -81737, 255252, 21393, 158810, -369061, 7022, 52899, -165346, -215323, 357493, -33590, 169286, 300893, 89268, 96249, -335620, -10711, -108742, -43070, 337718, 109254, -157543, 73634, -236178, -144995, 33604, 187141, -263039, 86358, 40729, 95408, -156692, -58984, -32044, 34266, -198639, 134622, 18062, 284408, 78433, -38667, 202149, -37799, 562511, 280951, 141176, 40174, 116338, 251724, -62624, 261655, -132403, 196694, 306808, 131734, -136602, -369058, -157572, -22143, -97517, -62273, -294931, 167781, 67913, 256942, 17855, -104481, 220817, 465025, 77870, 112973, 76166, 91996, 372434, -80925, -141220, 119038, 285186]
11618B85186k6032b02873B85585c029F7149a82053C4694I523N2158E611L6820
11607D2431J29850p6253Q1132e6269C19241b40051A61788e8793I1750E253Q297
11596A3550O7554h0029L2060C5839b7603j44149H5008l7289f9071A41510a50165
11584C32224I5740K55075q5202I220J53530a37553d1523A32024L2292O1536A09025
11572B13543J9900A9717J75310B7318b4072B81106b01445f1521B335J15409m8272
11561F9472M1394c3885a5204j05646A50081E8914N0247N3706b78591B80215a12670
11549b39419B30487a95451A29714O2220G5353J49850R8519I8012l0485k5071c3051
11537B85584F9487a55693N2493g291D68477r0015E9484f0193K791j74517R4448
$$ y = [285186, 259154, -202873, 285585, -3029, 67149, -182053, 34694, 9523, 61681, 5611, 42431, 172281, 96028, 177160, -56269, 319241, -240051, 161788, -58793, 91750, 5253, 13550, 81104, -80029, -47969, 35839, -27603, -171752, 85008, 47719, -69071, 141510, -150165, 332224, 95740, 350815, 265613, 9220, 162750, -137553, -41523, 132024, 164316, 225852, 109025, 213543, 233443, 19717, 195027, 27318, -24072, 281106, -201445, -61521, 2335, 117744, 69472, 110866, -33885, -15204, -120850, 150081, 58914, 109161, 162867, -278591, 280215, -112670, -239419, 230487, -195451, 129714, 191934, 75353, 225203, 323722, 98012, 67527, 42456, -33051, 285584, 69487, -155693, -103200, -7291, 468477, 378462, 59484, -60193, -57402, -231919, -137471]
11526a37471j22216f0130j49343D2445J95528L9186B3916K48814h1631k67123
11516c48754a09742H320K22859j7920i4693o3359E1148g80j73190A0567a9945
11504a14602K6722a9085D00896c38837B67471I6138A1537a38519n6066D1006K23023
11493B64029O3911b7411j11729k4926A76906B4906d3679C96768n9935l891a21658
11481b00085A12885P2329A9134M42971b01625D08900j82123O9307I3944R3505
11471A87449a37325C9227K84359j00456g253D58762a11913I2550K81771a0370
11460B40843a32273n5652B53143c7366l3112A71561g1892g698k38472a17989F1555
11448b05291f6379B77035j31304J60115a01576H7469B8058h035B43170l4352a24903
$$ y = [-137471, -259687, -60130, -209473, 42445, 237973, 277159, 23916, 272730, -81631, -348754, -109742, 8320, 231179, 213259, -94693, -158052, 51148, -780, -173970, 10567, -19945, -114602, -87880, -19085, 400896, -338837, 267471, 96138, 11537, -138519, -194585, 41006, 264029, 327940, -27411, -139140, -164066, 176906, 24906, -43679, 396768, 336833, 332942, -121658, -200085, 112885, 185214, 19134, 462105, -201625, 408900, 226777, 296084, 93944, 187449, -137325, 39227, 323586, 223130, -7253, 458762, -111913, 92550, 374321, -10370, 240843, -132273, -187925, 253143, -37366, -70478, 171561, -71892, -7698, -246170, -117989, 61555, -205291, -66379, 277035, 145731, 305846, -101576, 87469, 28058, -8035, 243170, 208818, -124903]
11436C41035D4054L00811b02713A42267b61813a28947c1867I5890C9723J55330
11426A95053m5713p3414c5211d936j44489B5538c522l89897B65292f7228A3137
11414b00664H7950c38080A77174C6123O0291d9266B04061A00747J92148c3407
11403G1651B9589J16452Q551O7044J28179A07274J21785G9917J04714Q4208a23112
11391F8477K15462a45473B1342O3289a7856H0691J06406I280n27a92952B3911
11379B44932b71120C5142K9382c6729A48322D4830L4558j0838B6525K29813d45172
11367B13701a02905K9985l31300f3417E9426i2364e014l0114B91192b3477A77120
11355d802H2707d26697J36987J03427D0206K77794A41455c06205A56011R0582
$$ y = [341035, 44054, 344865, -202713, 142267, -261813, -128947, -31867, 95890, 39723, 195053, 149340, 75926, -35211, -4936, -149425, 25538, -3522, -393419, 265292, -67228, 13137, -200664, 87950, -338080, 177174, 36123, 96414, -49266, 204061, 100747, 292895, -33407, 71651, 29589, 146041, 154592, 221636, 349815, 107274, 229059, 79917, 184631, 268839, -123112, 68477, 283939, -145473, 21342, 84631, -17856, 80691, 187097, 9280, 8753, -192952, 23911, 244932, -271120, 35142, 64524, -36729, 148322, 44830, 79388, 68550, 26525, 256338, -445172, 213701, -102905, -72920, -404220, -63417, 59426, -92364, -5014, -35128, 291192, -23477, 177120, -4802, 82707, -426697, -289710, -186283, 40206, 318000, 141455, -306205, 156011, 246593]
11345B46593C4205b11443P9948b143I462R928K11531G840L65744a44781G0068
11333B06118D536a48925l6147A48001J06049a06511C1175a17863l5367D9927K21018
11322B70945j30002b51205K701B93078b40373A01715D9297c39943a13473C81823
11311a44486q57B7576P2632i8150J490k41804c4559o4641k48291b304D7009a68487
11298c38869b6822H4021a92836F6595J75395a61881d9487E34144a55933c5429
11287A8061a52845B1504L2779b409F480g044A2499R8833e4693C02412i0581A57499
11274a01752A27091a47905A24945b5538A00831a28267H4052P5195d67792A50089
11263g9755B3126c14629A5970a26490I2075A9396J72210c9567k08558A36195K652
$$ y = [246593, 34205, -211443, -131495, -2143, 9462, 19390, 230921, 7840, 373584, -144781, 70068, 206118, 4536, -148925, -185072, 148001, 254050, -106511, 31175, -117863, -153230, 49927, 270945, 140943, -251205, -248504, 293078, -240373, 101715, 49297, -339943, -113473, 381823, -144486, -145343, 27576, 100208, -98150, -96660, -338464, -34559, -99200, -347491, -2304, 47009, -168487, -338869, -26822, 84021, -192836, 66595, 241990, -161881, -49487, 534144, -155933, -35429, 18061, -152845, 21504, 54283, -2409, 6480, -7044, 12499, 111332, -54693, 302412, -90581, 157499, -101752, 127091, -147905, 124945, -25538, 100831, -128267, 84052, 159247, -467792, 150089, -79755, 23126, -314629, 15970, -126490, 92075, 19396, 191606, -39567, -248125, 136195, 138847]
11252A38847M5896b5113B54427A19633A9473i2958j10343c6596l13801E8719b03539
11240B65019A14289i570A5734K37943c04012c6674p7925j2578j53448B50078j02306
11229A47772J21105E8147a78550p4619C4429E996a54259A25515O5279D0222A3044
11217e5838k40741C8851a04401c9436p8591A8355O8451a78559P4127A6517K8765
11206D5282J42823c1659j66328A18398c40577a02648k2079A37001b4549n3215
11196g7764k84140d3740A1903h7896C05286H4659K7442a62397b1720D47646j35980
11185C11666i6103C4650J02180f7251E9960a78550O1271B15912c84911a29544
11174B27078E2029b80867O8882e2109G5113a91210j2794p5025e1145M593H8977
$$ y = [138847, 184743, -25113, 254427, 119633, 19473, -92958, -203301, -36596, -350397, 58719, -203539, 265019, 114289, -9570, 15734, 253677, -304012, -36674, -114599, -127177, -280625, 250078, 147772, 268877, 58147, -178550, -253169, 34429, 5996, -154259, 125515, 190794, 40222, 13044, -55838, -296579, 38851, -104401, -39436, -118027, 18355, 86806, -178559, -104432, 16517, 45282, 188105, -31659, -197987, 118398, -340577, -102648, -124727, 137001, -24549, -77764, -361904, -43740, 11903, -87896, 305286, 84659, 112101, -162397, -21720, 447646, 311666, -96103, 34650, 136830, -67251, 59960, -178550, -117279, 215912, -384911, -129544, 227078, 52029, -280867, -211985, -52109, 75113, -191210, -204004, -279029, -51145, -46552, 88977]
11162H2545K532A25a14023e2223E6542E923J42702b02527m9912D4692P598a25937
11149d4975r8379j02465M611B83220d7208D8322O2611A7942J69373H6984J49050
11138B36034f3358l4444L42B19110p7204E6951J00220F6523L6649e3800M25B2004
11125B57727l4508k7664b26657g8084A98848B856h9075D05952j06916b7938j16941
11114a44879B4704g5484l27714B26987p0856i4697H8540R2639J12442i1707I8858
11102B07334J01144i9483D4725b76543C0048K66655r8647O4015a37154A38967
11091A0556N55648F9561K35486c4015A55920J03831k2310a7544C43596A60283
11080B94741K03108G8467L42323r8623e4061A90573N3006P1728j01211K11000
$$ y = [82545, 85077, 125, -114023, -52223, 56542, 5923, 148625, -202527, -252439, 44692, 52290, -125937, -44975, -143354, -245819, -241208, 283220, -47208, 48322, 110933, 17942, 187315, 86984, 236034, -63358, -97802, -97460, 219110, 141906, 56951, 157171, 66523, 103172, -53800, -53375, 22004, 257727, 223219, 195555, -226657, -78084, 198848, 2856, -89075, 405952, 299036, -27938, -144879, 24704, -75484, -403198, 226987, 156131, -94697, 88540, 181179, 293621, -91707, 98858, 207334, 308478, -99483, 44725, -276543, 30048, 296703, 198056, 262071, -137154, 138967, 10556, 566204, 69561, 305047, -34015, 155920, 259751, 237441, -17544, 343596, 160283, 294741, 497849, 78467, 420790, 322167, -54061, 190573, 243579, 315307, 214096, 425096]
11070D25096j80670b4718D65758B9493K98942o5699M73289k63490L332l0839J01041
11059E46069k6214N1835B60747K18219Q7765l6295N7308k86889J07259J96235
11049F04349r4926N9250j28088L29556r9546j53746o2764L86570k51194J58948
11039G48409K51953l02835q4936K69976C43491L15527N4081N9306k53659j23364
11029C95382N5297j58359N30430j42521J09390m744q6625k60574J86822j45013
11019D79485j98987J95439j23598K30606K8651j09425j32838J41029J80489k2657
11009F68194k07453P9471j1004J29504k66682k5212l4042Q7682J93861k18831
10999C95488j8348R4196J34915r0448J47872j853B82717K38180q1182J58133o2137
$$ y = [425096, 244426, -24718, 465758, 29493, 328435, 262736, 736025, 472535, 475867, 445028, 546069, 519855, 571690, 260747, 478966, 566731, 530436, 587744, 300855, 408114, 604349, 509423, 568673, 440585, 770141, 670595, 516849, 454085, 840655, 589461, 748409, 1000362, 697527, 612591, 882567, 343491, 659018, 713099, 772405, 518746, 395382, 450679, 292320, 822750, 680229, 789619, 784875, 698250, 437676, 624498, 479485, 280498, 475937, 352339, 582945, 611596, 502171, 369333, 510362, 690851, 668194, 460741, 540212, 529208, 658712, 392030, 366818, 332776, 420458, 614319, 395488, 377140, 471336, 606251, 515803, 663675, 661822, 282717, 520897, 439715, 597848, 535711]
10988E35711R4864j89830J35495J96098j30146J66141l0286L17458k62038O60919
10978A494386n19424N1081J60877N30226J88275O7848J20875Q4844P32943m23838
10968B488093j81213q2605k00982k33k54266k24199n23347L86110O0997N0139
10958A518494p5629N8458j9525K21762K4540n18071J29001J16415m47004j55196
10948H53245l14746L14715m00588J11432k02386j36086N3316j17173K88463o3080
10938C87112A40246K31127M020B0401L93367j00464a75853G7591J58424d3884
10927B11538D257L56496B3500Q1343r718D6272a75877P2715B17137C6326c4340
10915A0389a12464j56714G9647K21758j03681C0208K27890e0919F0216h916j45432
$$ y = [535711, 630575, 440745, 576240, 772338, 642192, 808333, 778047, 1095505, 833467, 1494386, 974962, 1026043, 1186920, 1717146, 1905421, 1973269, 2094144, 2178988, 2911931, 2488093, 2306880, 2224275, 2023293, 2023060, 1768794, 1544595, 1021248, 1407358, 1468355, 1518494, 1442865, 1501323, 1481798, 1703560, 1728100, 1210029, 1339030, 1455445, 1008441, 853245, 538499, 853214, 452626, 564058, 361672, 225586, 278902, 161729, 450192, 387112, 140246, 371373, 375393, 20401, 413768, 313304, -175853, 77591, 236015, -43884, 211538, 4257, 360753, 23500, 104843, 95125, 46272, -175877, -103162, 217137, 36326, -34340, 10389, -112464, -269178, 79647, 301405, 197724, 30208, 258098, -50919, 60216, -8916, -154348]
10904a54348f3527l30796d1630F4169b48506A55041h2697C52012h188C7213b49643
10892B5683a88196c7310C17708f6657j31944C49743B3385M9904b48370c3200j60410
10881a93610B1904I294b4562F0982K44239I961c073j19012A19139P771b9756j44122
10869a73878d0161A10172b53358G9988a86571f0745A30612a151m1178C4474e636
10857I8909b74460J34308D9856a72694A84847i9880B3101J1060a70645A67264
10846a44996f2558r4583q8194l1171a1890q8864G2864J45534b43791A92572f4732
10834c46468a35246B06187b03134C76023g4554B80141e3800F6370b34961k8892
10824b63853C64203F3310H050i0524J1176O870A31019b15644B16637a20430A98461
$$ y = [-154348, -63527, -394323, -41630, 64169, -248506, 155041, -82697, 352012, -8188, 37213, -249643, 25683, -188196, -37310, 317708, -66657, -198601, 349743, 23385, 73289, -248370, -33200, -193610, 21904, 9294, -24562, 60982, 305221, 9961, -3073, -122085, 119139, 126910, -29756, -173878, -40161, 110172, -253358, 79988, -186571, -60745, 130612, -1151, -42329, 34474, -5636, 98909, -274460, -140152, 49856, -172694, 184847, -99880, 23101, 34161, -170645, 167264, -144996, -62558, -157141, -245335, -276506, -11890, -100754, 72864, 218398, -243791, 192572, -64732, -346468, -135246, 206187, -203134, 376023, -74554, 280141, -53800, 66370, -234961, -263853, 364203, 63310, 8050, -90524, -79348, -72478, 131019, -215644, 216637, -120430, 198461]
10812D9563e5030K3828C2306b46208M6283i8032J1627l21770g5150E9671h8352
10800g4300C5141j769j1035P1275L7265a58506N0330d789B712a81928A06082a9125
10787b49373a10532k50543e5463j63707A07264c3206j52704d5365R201B51186
10776b10256L6841k1149L6917B25883D4944N3918k195b55254J00704j1396O7922
10765i8024d4074A23232J20038E5426J90751A8272a60307a101n6412k48273a03089
10753f6491b8983A81465a98465f2856a386A92437e1283A59254a67585B34916C722
10741C21607C056b96486D1728b71835F754e8222B34814b86827a9330l36588A05326
10729a3377H7582O2298a90853j4315g2370B5590N1327a1997j21738n872a8636
$$ y = [49563, -55030, -31202, 32306, -246208, -199925, -98032, -86405, -408175, -75150, 59671, -88352, -74300, 35141, 33372, 22337, 93612, 130877, -158506, -108176, -4789, 2712, -181928, 106082, -19125, -249373, -110532, -361075, -55463, -219170, 107264, -33206, -185910, -45365, -36164, 251186, -210256, -173415, -194564, -157647, 225883, 44944, 98862, 96667, -255254, -154550, -165946, -98024, -44074, 123232, 243270, 55426, 246177, 18272, -160307, -1101, -57513, -305786, -103089, -66491, -28983, 181465, -198465, -62856, -1386, 192437, -51283, 159254, -167585, 234916, 3722, 321607, 3056, -296486, 41728, -271835, 6754, -58222, 234814, -286827, -19330, -355918, 105326, -13377, 87582, 149880, -190853, -205168, -72370, 25590, 76917, -11997, -133735, -139607, -18636]
10717c14379b2991a409l60627B23896e3747A22821b44617j77886C7726L15153
10707C52879e5463k29782f0534j3208A51490a51168M6584p0973H5197c5347k349
10696c7696j0905j41463h6853o2035b9458j69343H0312B4666G803d73147A81024
10684a70247A78350a82175D9694b31650A34690i7849B91522b76863f4541A94709
10673G2327c95394f7755D9939c1615B24461q8111A6790c63083I8498k8950J50663
10662B20211K113a78943G1456i0126H6526a13861j45658j1543A00271a66258Q1137
10651h5121B7620r344e9326B1582b55739g4115B62677n8423b25600I1694k5939
10640F5755b9539F5053d2551I0621C0406a56927A36055a03148c9626B8757b1236
$$ y = [-314379, -22991, -1409, -362036, 223896, -53747, 122821, -244617, -422503, 37726, 352879, -55463, -285245, -60534, -73742, 151490, -151168, -104584, -175557, 85197, -35347, -37696, -48601, -190064, -86853, -148888, -29458, -198801, 80312, 24666, 7803, -473147, 181024, -170247, 178350, -182175, 49694, -231650, 134690, -97849, 291522, -276863, -64541, 194709, 72327, -395394, -67755, 49939, -31615, 224461, 136350, 16790, -363083, 98498, 69548, 220211, 222324, -178943, 71456, -90126, 86526, -113861, -259519, -271062, 100271, -166258, -85121, 27620, 18276, -59326, 21582, -255739, -74115, 262677, 204254, -225600, 91694, 65755, -29539, 65053, -42551, 90621, 30406, -156927, 136055, -103148, -39626, 28757, -21236]
10628B22517d1611H8535c49857c4582p0111G7716k5780Q2711C1398c259A39507
10616A44825b33951B5235b23225A62440C8786K04303d2179A1338f9715b6520l8782
10605f5302A01478b20932e4448k8503A59748M7610B7117J53206c51141J66640
10595a84501k211M2592N6871J8703C295J40835q694b52145B5787Q0917b96313
10583H7455a54825D11910A90262c1368m1862p7546k09109J49903A52040a89629
10572b72466A98821b20971p3840i3482q0573B17598b47203K8478k25327h3037
10561B46931c30383a03775F4778N5378b65592G6193b22341A33267F480a42124
10550b9456E5461a9364A59691I995a465j60558D3100P8727j3604i9128f13E5226
$$ y = [222517, -41611, 88535, -349857, -34582, -104693, 77716, 51936, 134647, 31398, -3259, 139507, 144825, -233951, 25235, -223225, 162440, 38786, 243089, -42179, 11338, -69715, -26520, -65302, 101478, -220932, -54448, -82951, 159748, 207358, 27117, 180323, -351141, -184501, -186712, -144120, -87249, -68546, 3295, 144130, 135436, -252145, 25787, 106704, -296313, 87455, -154825, 411910, 190262, -31368, -73230, -150776, -359885, -209982, 152040, -189629, -272466, 198821, -220971, -294811, -93482, -174055, 217598, -247203, -218725, -444052, -83037, 246931, -330383, -103775, 64778, 120156, -265592, 76193, -222341, 133267, 6480, -142124, -29456, 55461, -19364, 159691, 9995, -1465, -162023, 43100, 121827, 108223, -99128, -613, 55226]
10537I928a82698b3262A72403g2586C6118L397J06915A2229f8130j0408H8711
10525I0737k7033P2111k8722j7370a00246B36192b62654A36888P7941b28214e3446
10513B39933J43193A68982K3590P3115a30226N323F9922a29542o6473q2157c4665
10501A07886Q4675J14030a36068p9609d2961o763F9688Q3270A9186k512a09469
10489C49301a17665a865D096a40339p600C41399A08299h327C40313q6314l9723
10478B14276N1594E0283J53691K72946k01058J43002c2200k29907J09702M6632
10468a05773j3418A59983B3939a69529A2120b52478A29986O2864b39820g7741
10457d4975A69096b8871F777g2697C0179L05480a03872j16319F4255k0841b21712
$$ y = [9928, -182698, -23262, 172403, -72586, 36118, 39515, 146430, 12229, -68130, -78538, 88711, 90737, 63704, 135815, 107093, 89723, -100246, 236192, -262654, 136888, 214829, -228214, -53446, 239933, 383126, 168982, 192572, 265687, -130226, -124903, 69922, -129542, -196015, -278172, -34665, 107886, 192561, 306591, -136068, -215677, -42961, -49724, 69688, 152958, 19186, 16674, -109469, 349301, -117665, -1865, 4096, -140339, -147939, 341399, 108299, -8327, 340313, 253999, 214276, 265870, 50283, 203974, 476920, 275862, 418864, -32200, -262107, -152405, -105773, -119191, 159983, 23939, -169529, 12120, -252478, 129986, 192850, -239820, -77741, -44975, 169096, -28871, 6777, -72697, 30179, 335659, -103872, -220191, 64255, 43414, -221712]
10445c73770a74226l3024c2792a4042A17772L7898a44402A32079k8198a43229
10434D3510a18787I8067a69749A74074q1130j7425b4453C35166c367j42529j24773
10423b70669M2941A9040L3368K34670H373J69417H4835b65187a31167A02575I350
10411C93377D2154j2697a36184j16882F1789d1529A72268H033b20846C1477d64577
10399A98436i1240p4220A295P2003a6049A05622j8787J74538A22309D1504c09602
10387a13081A74946Q7241G3895Q0039P317A982J68351H0558i510C22683A35746
10375D61101A99009Q2499D9851M99107b8914B92611A00580h751A96314D1227J33394
10364A74621N5876L49751A72666j057J22701M4540A18993K26865j39050k7109
$$ y = [-373770, -174226, -207250, -32792, -14042, 117772, 155670, -144402, 132079, 103881, -143229, 43510, -118787, 98067, -169749, 174074, 92944, 75519, -24453, 335166, -3367, -145896, -270669, -227728, 19040, 52408, 287078, 8373, 177790, 84835, -265187, -131167, 102575, 9350, 393377, 42154, 29457, -136184, -253066, 61789, -41529, 172268, 8033, -220846, 31477, -464577, 198436, -91240, -165460, 1295, 73298, -16049, 105622, 86835, 261373, 122309, 41504, -309602, -113081, 174946, 262187, 73895, 153934, 161251, 1982, 170333, 80558, -9510, 322683, 135746, 461101, 199009, 281508, 49851, 548958, -28914, 292611, 100580, -8751, 196314, 41227, 174621, 230497, 580248, 172666, 171609, 294310, 338850, 118993, 345858, 206808, 179699]
10354A79699a10405C3764K46996H500K72553J20915J57574k76617q7261m0759
10344A54905J57243J22612a14720C66356K41493B00558e4316j4130E04756G4852
10333A37829a55968D06996a28648A48369b06425c7327H7746N8702a08119A96041
10322H9045a00504B47522o7822C07K79465j23241Q5458L61050C4295a80067N1244
10311a28823A01444g4369A11824B1239h3168c4669j14258A20607i526j57209c2431
10299C47904c0462m7467j11564n8610a23853o7737Q6812L3760H3827R7530c2542
10287a01333b7720k86369h2348A3415N2226c5886E1103a19648o178B08614C9915
10275g4908j224B01658a52074g0700m3291E7422c0216k11173H6348m1221d0450
$$ y = [179699, -110405, 33764, 280760, 8500, 281053, 401968, 559542, 282925, 195664, 154905, 312148, 434760, -114720, 366356, 607849, 200558, -54316, -68446, 504756, 74852, 137829, -155968, 406996, -128648, 148369, -206425, -37327, 87746, 146448, -108119, 196041, 89045, -100504, 247522, 179700, 307, 279772, 156531, 241989, 603039, 34295, -180067, -128823, 101444, -74369, 111824, 21239, -83168, -34669, -148927, 120607, -9526, -166735, -32431, 347904, -30462, -77929, -189493, -248103, -123853, -191590, -104778, -71018, 83827, 181357, -32542, -101333, -27720, -314089, -82348, 13415, 65641, -35886, 51103, -119648, -125826, 208614, 39915, -74908, -76132, 201658, -152074, -70700, -113991, 57422, -30216, -241389, 86348, 45127, -40450]
10263B5107K9232i7004C086K11640M3861P8744A60404R8316k0246r6352P7590
10252B19712b1768F3000B0366a12047E0157J53563a63616O4174k7469k24960A20416
10240c0767F7851D391a41129a1557j5657F433R9699J99794C7011G983Q2166O5555
10228A55704f9668D84090E7788a87004I2684e4766D0588j3416a91271l78m1533
10217b33182M077G4565L7069b5130k59420a01199J3621L8891j8033j89706O4063
10206a92363B67277e0679m7855J8809J7072C491a78749F0746a17058D06443M7146
10195D53589a43710M9110B75462c12430A16396K5266e29021a19393I4361C8936
10184A80656G3965P6800h0990m1519D8984f9959j2822B33232M452M1889a16601
$$ y = [25107, 54339, -97004, 3086, 214726, 258587, 337331, 160404, 258720, 238474, 142122, 219712, -21768, 63000, 20366, -112047, 50157, 203720, -163616, -99442, -126911, -351871, 120416, -30767, 67851, 4391, -141129, -11557, -27214, 6433, 106132, 305926, 37011, 7983, 90149, 155704, -69668, 484090, 57788, -187004, 92684, -54766, 40588, 27172, -191271, -191649, -233182, -229105, 74565, 111634, -25130, -284550, -101199, -87578, -48687, -66720, -256426, -192363, 267277, -50679, -98534, -79725, -62653, 3491, -178749, 60746, -117058, 406443, 453589, -143710, -94600, 275462, -312430, 116396, 141662, -529021, -119393, 94361, 38936, 180656, 73965, 150765, -80990, -122509, 48984, -69959, -82781, 233232, 237684, 279573, -116601]
10172a57977A68443E9885c32263L8822A14101g9992B6238L2488b25491d7523a2848
10160F8216a59942n4895i2427L9442p7801F1918B4833b19756i2958I3999b70168
10148e9772B80966a0817K877k4004k32201R9362m4089E3157Q4174Q5792c7687
10136a75909K9505A18676c9888F2678J96255c26364A1468p78c16709a01515m540
10125a06055B8413o576J34688o3757g9793l22362h6533n3687O223k02788d1443
10113E25a20508K8322j42336j53188J78235j6329L5819h6902p0307O3001j8381
10102a12589e5658a5867j51348k5145l9208C67228g7074j20095I1436D4311A3930
10090I5130c48466B9482b16345A61954C1349R0241h659A2459K2788a60664j62982
$$ y = [-157977, 168443, 59885, -332263, -293441, 114101, -79992, 26238, 58726, -225491, -47523, -12848, 68216, -159942, -214837, -92427, -52985, -130786, 61918, 24833, -219756, -92958, 93999, -270168, -59772, 280966, -10817, -7940, -31944, -264145, -164783, -208872, 53157, 137331, 223123, -37687, -175909, -146404, 118676, -39888, 62678, 258933, -326364, 11468, 10690, -316709, -101515, -106055, 28413, 21837, 156525, 92768, -79793, -402155, -86533, -140220, -133997, -336785, -41443, 525, -120508, -92186, -234522, -387710, -209475, -225804, -189985, -86902, -157209, -94208, -112589, -55658, -15867, -167215, -192360, -231568, 367228, -77074, -197169, 91436, 44311, 13930, 95130, -348466, 29482, -216345, 161954, 31349, 121590, -8659, 12459, 35247, -160664, -323646]
10079c23646F5614k1443b10143R5957A36589a41346M5145M5075q9379h206H2256
10067B03887c561q0182b9991j61707c3852k55769J15501B7340f6042a6830k00892
10056b17722f4732j9807A04796a51115A20104K2168a04902a8203A48098i390j10519
10045a19909I936a52866J9294K0677J647g139E1303b82073N2491L7410m4740k2153
10033b59065g4180F9617a29299G8915k0748d19139B1235b31646a2570C91b6596
10021c42654A88838c3012j16968e7283I002b36322k17329h5133k49726H1633a59795
10009a25445B53299b00354k08064O686c5665j94130B5432M07396c57017a66007
9998b33240m9194a785D8K88410G6120b113l93817J75568n1038f3349l9178j98804
$$ y = [-323646, 65614, 44171, -210143, -114186, 136589, -141346, -96201, -51126, -140505, -8206, 82256, 203887, -3561, -83743, -29991, -191698, -33852, -289621, -174120, 27340, -66042, -16830, -217722, -64732, -84539, 104796, -151115, 120104, 142272, -104902, -18203, 148098, -9390, -119909, 9936, -152866, -133572, -112895, -111248, -7139, 51303, -282073, -229582, -192172, -236912, -259065, -74180, 69617, -129299, 78915, 58167, -419139, 21235, -231646, -12570, 391, -26596, -342654, 188838, -33012, -149980, -57283, 9002, -236322, -453651, -85133, -334859, 81633, -159795, -125445, 253299, -200354, -408418, -401732, -35665, -229795, 25432, 432828, -357017, -166007, -233240, -282434, -1785, 48, 288458, 76120, -2113, -395930, -220362, -271400, -63349, -102527, -301331]
9986c01331A27911C6957j4496c8272A29187M640b62877j35810a33839j0210A22338
9974a27800G6265K44901J1320h5650j96185B5725i6799F6974C2513h6801A43297
9962a23557A63953g7321j44335A09181l6934J49902i7913B8055J94528C3584c67674
9950i8081c6612l21079J09709L6212J4976E9673b22456H7424g9893B02909F3388
9938c90956f6958j42093B96704c08517B72812A7979J8526M3416d02221a85884
9927b73198A70977c55032h9091r0995b6766k27950R3948E784g070D4598a22959
9915A6276K07688C4270a76258h6320j32841p6764N1899b6075n6457a9955p5140
9904i5095n7097d8308j74139f7541b4019j24247B20954a48483a2291p1351A55995
$$ y = [-301331, 127911, 36957, 22461, -38272, 129187, 133827, -262877, -398687, -133839, -144049, 122338, -127800, 76265, 321166, 332486, -85650, -281835, 25725, -96799, 66974, 32513, -86801, 143297, -123557, 163953, -77321, -221656, 109181, 72247, 222149, -97913, 28055, 222583, 33584, -367674, -98081, -36612, -357691, -247982, -211770, -196794, 59673, -222456, 87424, -79893, 202909, 63388, -390956, -66958, -209051, 296704, -308517, 272812, 17979, 36505, 79921, -402221, -185884, -273198, 170977, -355032, -89091, -180086, -26766, -254716, -160768, 5784, -7070, 44598, -122959, 16276, 223964, 34270, -176258, -86320, -219161, -295925, -244026, -26075, -82532, -19955, -95095, -152192, -48308, -222447, -67541, -24019, -148266, 220954, -148483, -12291, -83642, 155995]
9892a17386A7413P5893c11896A27642I226g458j85298A40935b01775Q9623D1621
9880i7138j78337M9223i8058l1929j0704o8028e0177j33508e8598k49960E9876
9868c56778J60593g441m88996h3626k16515J21067b9859D1030o553P153e0222
9856f2490C4199i4339a3416l49748g7297A305a46319e6052a6567j8838j92579
9845b27984o2454j57912J63552D59933B7356a24817B402a02794A52493C3015d1708
9833F8185J94920c16039e2889j17461j45755M8105C8796a85578B700Q8894J44760
9822B36354b15256A67826a65096k13472h8040j09188k18758a56747d7259J8426
9812b8833k5783f698j29037J0484A19340b4308j73928F5766K8563J35252c332
$$ y = [-117386, 17413, 93306, -311896, 127642, 9226, -7458, -192756, 140935, -201775, -112152, 41621, -97138, -275475, -226252, -98058, -129987, -140691, -208719, -50177, -183685, -58598, -308558, 59876, -356778, -196185, -7441, -496437, -83626, -300141, -179074, -29859, 41030, 34477, 41630, -50222, -62490, 34199, -94339, -13416, -363164, -77297, 1305, -146319, -56052, -16567, -35405, -227984, -290438, -448350, -284798, 459933, 27356, -124817, 2402, -102794, 152493, 33015, -41708, 68185, 263105, -316039, -52889, -170350, -316105, -268000, 38796, -185578, 2700, 91594, 236354, -215256, 167826, -165096, -378568, -88040, -197228, -415986, -156747, -47259, -28833, -54616, -6698, -135735, -125251, 119340, -24308, -198236, 65766, 94329, 229581, -3332]
9800g357k09326e9963j58806R6618e5817K7014B5746P4082f1142k28191m9848
9789c39181B79245c08393a0220q3902m6091k22021a45097j97721B0766a16396
9778I3994K3610b81503d5201g925l48160A5921f8656j60550A10876g2933a3929
9766a2907j03938F26Q5095b51788a08025j94322C1677b35050a4474A43499D2009
9754b4538k3271D3697e3779A54926M3675o4911f9447G8716j7051h4986D05911
9742c73910g3963B72550h8734C47867d3991B12787d97649a26345j5058J4253G1183
9730C9156a81250A25463a07659B20308c03012a00037j68794A20546a55367n4740
9720b10107C1982F060c028l81087J50738B8374a44286A63311o8000a33515B13668
$$ y = [-7357, -216683, -59963, -218769, -122151, -55817, -28803, 25746, 99828, -61142, -289333, -339181, 279245, -308393, -10220, -94122, -140213, -362234, -145097, -342818, 20766, -116396, 93994, 117604, -281503, -45201, -7925, -356085, 15921, -68656, -229206, 110876, -72933, -13929, -12907, -116845, 626, 85721, -251788, -108025, -302347, 31677, -235050, -14474, 143499, 42009, -24538, -47809, 43697, -53779, 154926, 198601, 133690, -69447, 78716, 61665, -84986, 405911, -373910, -73963, 272550, -88734, 347867, -43991, 212787, -497649, -126345, -141403, -127150, 71183, 39156, -181250, 125463, -107659, 220308, -303012, -100037, -268831, 120546, -155367, -210107, 31982, 6060, -3028, -384115, -233377, 28374, -144286, 163311, 95311, -133515, 213668]
9708a00405o1672I2748a98486J4420c4316j26741I7208J74804I9525a86012k2702
9697b08714h9195A01296l6656d12839H503a73438r6488J20528r0347H7894d1201
9685a89206i1890j16751m0679M0447R363H06a52392j58021p9418a2035m0316E8379
9672B6496a37218B21377g2266l65310J10037A01926c87507b778r2381o8387N2466
9661a11080j69798A19401h361m1327k65356j52379h4669E8725b06564C432J56821
9650A60253c5162A46389b12582d5455J148j1042j22996E4603L5923b14390Q8974
9639a25416N9881p0424e7711J0521C40942D7502b31497b2731j09891B58151A24659
9627a54976A45287a0246m81053c7707k99475a0770j73916k66436A84752c41636
$$ y = [-100405, -162077, 92748, -198486, -184066, -34316, -161057, 97208, 272012, 99525, -186012, -208714, -89195, 101296, 64640, -412839, 8503, -173438, -269926, -149398, -239745, 87894, -41201, -189206, -91890, -208641, -249320, -208873, -199510, 806, -152392, -310413, -389831, -12035, -52351, 58379, 26496, -137218, 221377, -72266, -437576, -327539, 101926, -387507, -2778, -95159, -163546, -111080, -280878, 119401, -8361, -49688, -315044, -467423, -84669, 58725, -206564, 3432, 160253, -35162, 146389, -212582, -45455, -44307, -55349, -178345, 54603, 90526, -214390, -125416, -65535, -135959, -57711, -47190, 340942, 47502, -231497, -22731, -132622, 258151, 124659, -154976, 145287, -10246, -491299, -37707, -337182, -10770, -184686, -451122, 184752, -341636]
9616c57645b3910j51840n0931H7497c0123k53686J39185f1412r4658p0506H9080
9604a0872l36802F8611b79581e2032q0742k9318L5578l3885L4910G3182a60195
9592e4159j99997G9478h5439d1750C12506A1519J25560b08029B23943C339g0949
9580C14998c41285e198o2786a6110k2447B14319o1468A8358a80458j38006j90502
9569e08966d7151A74197c1835k15368C6336a97351A6063a89357l8546f0379f876
9557a5303m5676A31296c25328d704D4190j6026f3106b6298k11047p6928A41693
9545a93364A06102a07921L7542C52683d9970B53992G9355r112a6153j84268p93
9534b01214k01714h8385A39404a38654B74347D1838c80760a01436j57455Q2405
$$ y = [-357645, -23910, -175750, -226681, 87497, -30123, -283809, -144624, -61412, -156070, -226576, 89080, -10872, -347674, 68611, -279581, -52032, -132774, -162092, -126514, -160399, -125489, 73182, -160195, -54159, -254156, 79478, -85439, -41750, 312506, 11519, 137079, -208029, 223943, 3339, -70949, 314998, -341285, -5198, -67984, -16110, -38557, 214319, 152851, 18358, -180458, -318464, -508966, -47151, 174197, -31835, -247203, 36336, -197351, 16063, -189357, -227903, -60379, -6876, -15303, -60979, 131296, -325328, -4704, 44190, 28164, -63106, -26298, -237345, -314273, 141693, -193364, 106102, -107921, -70379, 352683, -49970, 253992, 79355, 70243, -16153, -200421, -201214, -402928, -88385, 139404, -138654, 274347, 41838, -380760, -101436, -258891, -176486]
9524a76486A08160c34583G6902b90000D544a83477h4303o9002g419A08431a6589
9512E8135k8702P161e616B56629h8415l97761d1543j4480o5208d3707B26796j03752
9500A23044c29150j16133a35494A134g9716A88987b92182B90618j30925c9951
9489A53271E1452M2003c7946l1938n6692A06095a30646d4573f966A98969f3792
9477i6208A14486K9685b62693A56354F6177k3435c97579H3668a31845A15172j6919
9466I8253P9798p2419a14234A01442a72161G7050a59828l20687K33609h6966o6375
9455a53341K9193D7017i5577m7483j35682N666a8681E470K02453d6298A8323a70926
9442a66578g2987a7229q6999C6886N735b2787p4332j28268B14539a37853b6306
$$ y = [-176486, 108160, -334583, 76902, -290000, 4544, -183477, -84303, -153305, -7419, 108431, -16589, 58135, 29433, 36594, -5616, 256629, -88415, -486176, -41543, -56023, -121231, -43707, 226796, 123044, -329150, -445283, -135494, 1134, -79716, 188987, -292182, 290618, 159693, -39951, 153271, 51452, 93455, -37946, -69884, -126576, 106095, -130646, -44573, -6966, 198969, -63792, -96208, 114486, 144171, -262693, 156354, 66177, 42742, -397579, 83668, -131845, 115172, 98253, 178051, 105632, -114234, 101442, -172161, 77050, -159828, -480515, -246906, -86966, -153341, -124148, 47017, -95577, -143060, -278742, -273076, -18681, 5470, 207923, -46298, 18323, -170926, -166578, -72987, -17229, -104228, 36886, 42621, -22787, -97119, -225387, 214539, -137853, -26306]
9430a66282B48288c4190k46268d4651m4723B88130A2495d8871F7718a71150A47495
9418a92620q5259b101H1511M045g5747n6183f2456g70k64952J08414f7996j83338
9406b51334B72900e2058A30965J35202g3743m3443A37363a09514A41252f7673
9395A91455b15131M2870M7878o5578Q0942o7185A289b36514j37066k9729C7236
9383B24622a43942L6289A02900C8860e09957B33991d3690j1087D5651a80118N8354
9372a21764j13457A06370d22411E8961f5208B02092a96339A9284e743j22675j90184
9361c18602e3556I0889A5791J31059B1465P8359L2870a77021g3016m182B6776
9349G1952J10236q3920h4077k8868N1099j18319J8560P5588D2376a49753D6676
$$ y = [-166282, 248288, -34190, -280458, -44651, -89374, 288130, 12495, -48871, 67718, -171150, 147495, -192620, -277879, -2101, 81511, 85556, -75747, -131930, -62456, -770, -265722, -157308, -67996, -251334, 272900, -52058, 130965, 266167, -73743, -117186, 137363, -109514, 141252, -67673, 191455, -215131, -172261, -124383, -189961, -109019, -176204, 1289, -236514, -373580, -403309, 37236, 224622, -143942, -107653, 102900, 38860, -509957, 233991, -43690, -54777, 45651, -180118, -121764, -235221, 106370, -422411, 58961, -65208, 202092, -196339, 19284, -5743, -128418, -318602, -53556, 90889, 15791, 146850, 21465, 99824, 132694, -177021, -73016, -77198, 26776, 71952, 182188, 98268, -84077, -112945, -61846, -180165, -161605, -86017, 42376, -149753, 46676]
9337h6417B5848b13407M5469c5815j244H088b89301F3182g3253a4I3901c70611
9324a65966l6400B3705J51710G507d7143D6846M15773a39839c9036K926h029A24766
9311G2018B4923J11514R9256r1540a84981L8056M4263r1490L4858j03258d4267
9299b9164q0104a2599A50011K20971A18756e9086I3444b92265a6083F9054a39901
9287a68875N7646A88576b27527a02026j14031b0983G5678e695j66959j52942A89376
9275c16717J6736J01541B42321a88757n2616i3931m0105p5133A64717a6396A03713
9263D703Q0359i5375A99182b14066j87242a01636c8001m8051B76599c87781L1890
9252c55891A16273c27442b7256B08819H7583K2483L8492d73616d8096k22682a3831
$$ y = [-86417, 25848, -213407, -167938, -35815, -37059, 8088, -289301, 63182, -73253, -14, 93901, -370611, -165966, -202366, 23705, 175415, 7507, -47143, 46846, 462619, -139839, -39036, -36110, -8029, 124766, 72018, 24923, 136437, 235693, 144153, -184981, -146925, -102662, -194152, -159294, -262552, -44267, -29164, -109268, -12599, 150011, 370982, 118756, -59086, 93444, -292265, -16083, 69054, -139901, -168875, -111229, 188576, -227527, -102026, -216057, -20983, 75678, -5695, -172654, -325596, 189376, -316717, -299981, -198440, 242321, -188757, -241373, -93931, -134036, -209169, 164717, -16396, 103713, 4703, 85062, -95375, 199182, -214066, -401308, -101636, -38001, -86052, 276599, -387781, -355891, 116273, -327442, -27256, 208819, 87583, 110066, 148558, -473616, -48096, -270778, -13831]
9240A43444a11434A84233o6648b48346c9094j33580O0056B1433e4690B17109f9624
9228c43353f3191C25499b14194R667k05648h6346C61729c95010a00785B11977
9217d2695B5560b72085a23911j16911i0418j41558A97474k8359a50860F0383L08224
9206C68607h4124B30259i4131A20407k8938b38750A9702a35120B01425b21787
9195A39075a30746j54038A03254c81321C05070D2712j3760c7908a0454j76572
9185a87026M9629h664C7730J64884d4150J8701k6300m1528L1541B08098a25670
9173a19941q8413Q2253j81761o913a32354J1281h219C06487a42257o6531i47j19466
9161a20413j11776J05176j41289f376j06137c2718n0870j33780R1186K6696k5295
$$ y = [143444, -111434, 184233, 117585, -248346, -39094, -172674, -112618, 21433, -54690, 217109, -69624, -343353, -63191, 325499, -214194, -204527, -410175, -86346, 361729, -395010, -100785, 211977, -42695, 25560, -272085, -123911, -240822, -90418, -231976, 197474, 169115, -150860, 60383, 368607, -84124, 230259, -94131, 120407, 91469, -238750, 19702, -135120, 201425, -221787, 139075, -130746, -284784, 103254, -381321, 305070, 42712, 28952, -37908, -10454, -187026, -137397, -8664, 37730, 202614, -44150, -25449, -51749, -93277, -61736, 208098, -125670, -119941, -208354, -126101, -307862, -314775, -132354, -121073, -8219, 306487, -142257, -208788, -947, -120413, -232189, -127013, -268302, -6376, -112513, -32718, -83588, -217368, -126182, -99486, -124781]
9150a24781r5150p2058O9594E6760L6175P5128f7065j77629A174b12592O7568
9139a45024B2253A80f4463C1453P511f0508k20367q984C81876A07080M3300b1247
9126f7675D2277c72913J08765i7825j35045G9853m382Q4775e0884A2551e88613
9114b6705p8849K1149o4522n5065j20302B9991a72463P4139B54246h4815p0073
9103a54888r4258o7972a8817I9049b83674D21034c6371A03014K15650A47510B3803
9091F4798b92115H8242B0398i0174A81295b33708l0383A71118C1221L1338i2560
9079A07843a47602k4718g6416k75065A35057J2128a76915A05700a3576A8700q064
9068A0636h1146A7308g9228q5806A01590a4l52475h4649m4989k26905A07709g9521
$$ y = [-124781, -219931, -291989, -222395, 56760, 92935, 168063, -67065, -244694, 1174, -212592, -145024, 22253, 180, -64463, 31453, 38964, -60508, -280875, -289859, 381876, 107080, 150380, -21247, -67675, 42277, -372913, -264148, -97825, -232870, 79853, 75471, 160246, -50884, 12551, -588613, -26705, -105554, -84405, -148927, -203992, -324294, 29991, -172463, -98324, 254246, -84815, -154888, -249146, -317118, -18817, 99049, -283674, 421034, -36371, 103014, 318664, 147510, 23803, 64798, -292115, 88242, 20398, -90174, 181295, -233708, -264091, 171118, 31221, 62559, -92560, 107843, -147602, -172320, -76416, -351481, 135057, 147185, -176915, 105700, -13576, 18700, 10636, -81146, 17308, -79228, -165034, 101590, -14, -352489, -84649, -129638, -356543, 107709, -79521]
9055a42057B55780m624r9772C5713f1754H7761c48518a10189j97128J28025g3106
9043c14457J158g6790m2648N7037F1070b5055B11920F2461b40068M1595B36839
9031d32399K10521A20880b10914A11736N6657a9863j69513C7475a07571c473D5734
9019b95354A46312i1085P796G4139R1953p5241c33634a1941k4840j5609j57595
9008b09985H1397J37039D2712a92505B57328a61190L3057f3475m3994B41160D2852
8996C54966a10037b5257k61631h5903A91230h9990p0087B32137a73734j60874
8986c34608J07378J07829N4155k07137c0693G5461h5403B09374a06707q609B5565
8974A3778a44057a6079A24932K7656D1886c01997a08091D1818R6680E6426k0128
$$ y = [-142057, 255780, 251156, 151384, 35713, -61754, 87761, -348518, -110189, -307317, -179292, -73106, -314457, -313299, -76790, -119438, -62401, 61070, -25055, 211920, 62461, -240068, -198473, 236839, -432399, -221878, 120880, -210914, 111736, 168393, -19863, -189376, 37475, -107571, -3473, 45734, -295354, 146312, -91085, -83289, 74139, 166092, 90851, -333634, -11941, -36781, -52390, -209985, 81397, 218436, 42712, -192505, 257328, -161190, -128133, -63475, -107469, 241160, 42852, 354966, -110037, -25257, -286888, -85903, 191230, -89990, -160077, 232137, -173734, -334608, -227230, -119401, -65246, -272383, -30693, 75461, -85403, 209374, -106707, -115316, 25565, 13778, -144057, -16079, 124932, 152588, 41886, -301997, -108091, 41818, 138498, 56426, 36298]
8963C6298b45679a9261o3082m9191Q168B15304h6561j10238p0901P6957A6792
8951A64952a74405H8328K52563a26242j14572F0269a70340B54854a00058A50561
8940e14878A47333L59060C5293b3240j43759A53623a24808c3364H1002B7465a50724
8928C330h2343o3089B2118b07145A54991K09585K98552J875639P65183G26525
8917E07382j89732d0875j0374o5039G1949a94871b2132A1302M091a72650H5994
8905B58190a75838d4941J0970q4128c6692l31343C9610g8958C7376c80297d4645
8893b23124n6455E766b92750D5556c36638E2715L5699b76232Q6262b5677k79149
8882c04826F8310a32702J5283j18513r8395J18378a4475C7843b22476m356B7222
$$ y = [36298, -245679, -19261, -82343, -131534, -123366, 215304, -86561, -196799, -267700, -190743, 16792, 164952, -174405, 88328, 340891, -126242, -240814, 60269, -170340, 254854, -100058, 150561, -514878, 147333, 506393, 35293, -23240, -166999, 153623, -124808, -33364, 81002, 27465, -150724, 3330, -82343, -145432, 22118, -207145, 154991, 364576, 663128, 2538767, 3303950, 726525, 507382, 317650, -40875, -51249, -116288, 71949, -194871, -22132, 11302, 15393, -172650, 85994, 258190, -175838, -44941, -33971, -118099, -36692, -368035, 39610, -78958, 37376, -380297, -44645, -223124, -279579, 5766, -292750, 45556, -336638, 52715, 88414, -276232, -189970, -25677, -304826, 68310, -132702, -117419, -235932, -334327, -215949, -14475, 37843, -222476, -226832, 27222]
8870A35292a11097d2398C2117i5521a9514j19915A70426q3615d8749I0541c9761
8858B0295c07184J49452N8684D33044i3090A0882L5522K41373c12377a49971A11318
8846a64963q4267r1065h9853A36139f6072M684q5194C0772b08790g3074b8117
8834G3469M8380l8163a36968E3515b6569J2589B44781D3176c65161B19954G8055
$$ y = [135292, -111097, -42398, 32117, -95521, -19514, -139429, 170426, 86811, -48749, 90541, -39761, 20295, -307184, -157732, -99048, 433044, -93090, 10882, 46404, 287777, -312377, -149971, 111318, -164963, -249230, -340295, -89853, 136139, -66072, -61388, -146582, 30772, -208790, -73074, -28117, 73469, 121849, 83686, -136968, 53515, -26569, -13980, 244781, 43176, -365161, 219954, 78055]
$$ [...]
##END NTUPLES=NMR SPECTRUM
##END=
