##TITLE=AC1650_NSJAH14351_8531644_rksqJE5PUv
##JCAMPDX= 6.0         $$ Bruker NMR JCAMP-DX V2.0
##DATA TYPE= NMR SPECTRUM
##DATA CLASS= NTUPLES
##ORIGIN= BRUKER
##OWNER= Administrator
$$ 1.72 TOPSPIN		Version 2.1
$$ 2014-03-14 18:00:49.150 -0800  Administrator@X
$$ Compression mode = diff/dup
##.OBSERVE FREQUENCY= 400.02188249412
##.OBSERVE NUCLEUS= ^1H
##.ACQUISITION MODE= SIMULTANEOUS (DQD)
##.ACQUISITION SCHEME= undefined
##.AVERAGES= 8
##.DIGITISER RES= 22
##SPECTROMETER/DATA SYSTEM= spect
##.PULSE SEQUENCE= zg30
##.SOLVENT NAME= COFFEE_meoh
##.SHIFT REFERENCE= INTERNAL, COFFEE_meoh, 1, 14.98509
##AUDIT TRAIL= $$ (NUMBER, WHEN, WHO, WHERE, PROCESS, VERSION, WHAT)
$$ ##TITLE= Audit trail, TOPSPIN		Version 2.1
$$ ##JCAMPDX= 5.01
$$ ##ORIGIN= Bruker BioSpin GmbH
$$ ##OWNER= Administrator
$$ $$ E:\/data/COFFEE/nmr/AC1650_NSJAH14351_8531644_rksqJE5PUv/10/pdata/1/auditp.txt
$$ ##AUDIT TRAIL=  $$ (NUMBER, WHEN, WHO, WHERE, PROCESS, VERSION, WHAT)
(   1,<2014-03-14 18:00:41.916 -0800>,<Administrator>,<X>,<go>,<TOPSPIN 2.1>,
      <created by zg
	started at 2014-03-14 17:59:36.913 -0800,
	POWCHK enabled, PULCHK disabled,
       configuration hash MD5:
       C8 4E 4E 5D D3 5C D8 9E 9F 52 82 E0 59 8A DE 15
       data hash MD5: 64K
       61 C8 4A C9 8B 2D CF 8D 2C 14 FB 71 FC 6C 29 FF>)
(   2,<2014-03-14 18:00:44.990 -0800>,<Administrator>,<X>,<proc1d>,<TOPSPIN 2.1>,
      <Start of raw data processing
       efp LB = 0 FT_mod = 6 PKNL = 1 PHC0 = 0 PHC1 = 0 SI = 32K 
       data hash MD5: 32K
       E5 7C E3 21 A3 24 D4 43 2F 3F 1D FD 5C B4 8E 36>)
(   3,<2014-03-14 18:00:45.326 -0800>,<Administrator>,<X>,<proc1d>,<TOPSPIN 2.1>,
      <pk PHC0 = 93.67493 PHC1 = 0 
       data hash MD5: 32K
       D6 F7 54 A4 FA DA 87 CF 1C 6A DE 7B C4 6C AB A0>)
(   4,<2014-03-14 18:00:45.461 -0800>,<Administrator>,<X>,<proc1d>,<TOPSPIN 2.1>,
      <abs ABSG = 1 
       data hash MD5: 32K
       91 6C 59 49 BC E3 0B 84 01 8F 8F FC BF 7A BB 4B>)
(   5,<2014-03-14 18:00:45.529 -0800>,<Administrator>,<X>,<proc1d>,<TOPSPIN 2.1>,
      <abs ABSG = 2 
       data hash MD5: 32K
       F3 A4 07 0A 27 5A 73 29 BD BD E1 17 C6 94 DD 41>)
(   6,<2014-03-14 18:00:45.596 -0800>,<Administrator>,<X>,<proc1d>,<TOPSPIN 2.1>,
      <abs ABSG = 3 
       data hash MD5: 32K
       FC 3B 0E 24 D5 7F DA 65 75 5B 69 A1 AA 52 57 9B>)
(   7,<2014-03-14 18:00:45.680 -0800>,<Administrator>,<X>,<proc1d>,<TOPSPIN 2.1>,
      <abs ABSG = 4 
       data hash MD5: 32K
       11 D6 55 37 4B B6 C6 E4 5B 69 97 B6 9F 0D 05 B6>)
(   8,<2014-03-14 18:00:45.764 -0800>,<Administrator>,<X>,<proc1d>,<TOPSPIN 2.1>,
      <abs ABSG = 5 
       data hash MD5: 32K
       D5 26 E4 25 65 39 A8 7D 85 71 3E 22 55 79 DF 8E>)
$$ ##END=
$$ 
$$ $$ hash MD5
$$ $$ 8B 85 7C E9 ED 11 97 9C 03 D2 5F 1A 57 6A AD B4
##$RELAX= 
##$RELAX= 
##$RELAX= 
##$RELAX= 
##$RELAX= 
##$RELAX= 
##$RELAX= 
$$ Bruker specific parameters
$$ --------------------------
##$DU= <E:\>
##$EXPNO= 10
##$NAME= <AC1650_NSJAH14351_8531644_rksqJE5PUv>
$$ [...]
150 150 150 150 150 150 150 150
##$TP07= 0
##$TPNAME0= <>
##$TPNAME1= <>
##$TPNAME2= <>
##$TPNAME3= <>
##$TPNAME4= <>
##$TPNAME5= <>
##$TPNAME6= <>
##$TPNAME7= <>
##$TPOAL= (0..7)
0.5 0.5 0.5 0.5 0.5 0.5 0.5 0.5
##$TPOFFS= (0..7)
0 0 0 0 0 0 0 0
##$TUNHIN= 0
##$TUNHOUT= 0
##$TUNXOUT= 0
##$USERA1= <user>
##$USERA2= <user>
##$USERA3= <user>
##$USERA4= <user>
##$USERA5= <user>
##$V9= 5
##$VALIST= <valist>
##$VCLIST= <CCCCCCCCCCCCCCC>
##$VD= 0
##$VDLIST= <DDDDDDDDDDDDDDD>
##$VPLIST= <PPPPPPPPPPPPPPP>
##$VTLIST= <TTTTTTTTTTTTTTT>
##$WBST= 1024
##$WBSW= 4
##$XGAIN= (0..3)
0 0 0 0
##$XL= 0
##$YL= 0
##$YMAX_a= 609001
##$YMIN_a= -516645
##$ZGOPTNS= <>
##$ZL1= 120
##$ZL2= 120
##$ZL3= 120
##$ZL4= 120
##$ABSF1= 14.98509
##$ABSF2= -5.573092
##$ABSG= 5
##$ABSL= 3
##$ALPHA= 0
##$AQORDER= 0
##$ASSFAC= 0
##$ASSFACI= 0
##$ASSFACX= 0
##$ASSWID= 0
##$AUNMP= <proc_prof1d_extract_pilot.lims>
##$AXLEFT= 0
##$AXNAME= <>
##$AXNUC= <1H>
##$AXRIGHT= 0
##$AXTYPE= 0
##$AXUNIT= <>
##$AZFE= 0.1
##$AZFW= 0.1
##$BCFW= 0
##$BC_mod= 0
##$BYTORDP= 0
##$COROFFS= 0
##$CY= 15
##$DATMOD= 1
##$DC= 0
##$DFILT= <>
##$DTYPP= 0
##$F1P= 0
##$F2P= 0
##$FCOR= 0.5
##$FTSIZE= 32768
##$FT_mod= 6
##$GAMMA= 0
##$GB= 0
##$INTBC= 1
##$INTSCL= 1
##$ISEN= 128
##$LB= 0
##$LEV0= 0
##$LPBIN= 0
##$MAXI= 10000
##$MC2= 0
##$MEAN= 0
##$ME_mod= 0
##$MI= 0
##$NCOEF= 0
##$NC_proc= -8
##$NLEV= 6
##$NOISF1= 0
##$NOISF2= 0
##$NSP= 0
##$NTH_PI= 0
##$NZP= 0
##$OFFSET= 14.98509
##$PC= 1
##$PHC0= 93.67493
##$PHC1= 0
##$PH_mod= 1
##$PKNL= yes
##$PPARMOD= 0
##$PPDIAG= 0
##$PPIPTYP= 0
##$PPMPNUM= 2147483647
##$PPRESOL= 1
##$PSCAL= 4
##$PSIGN= 0
##$PYNMP= <proc.py>
##$REVERSE= no
##$SF= 400.02
##$SI= 32768
##$SIGF1= 0
##$SIGF2= 0
##$SINO= 400
##$SIOLD= 32768
##$SPECTYP= <>
##$SREGLST= <1H.CDCl3>
##$SSB= 0
##$STSI= 32768
##$STSR= 0
##$SW_p= 8223.68421052631
##$SYMM= 0
##$S_DEV= 0
##$TDeff= 65536
##$TDoff= 0
##$TI= <>
##$TILT= no
##$TM1= 0
##$TM2= 0
##$TOPLEV= 0
##$USERP1= <user>
##$USERP2= <user>
##$USERP3= <user>
##$USERP4= <user>
##$USERP5= <user>
##$WDW= 1
##$XDIM= 32768
##$YMAX_p= 444430415
##$YMIN_p= -674224
##$CURPLOT= <Network HP LaserJet P1505>
##$CURPRIN= <$Network HP LaserJet P1505>
##$DFORMAT= <normdp>
##$LAYOUT= <+/1D_H.xwp>
##$LFORMAT= <normlp>
##$PFORMAT= <normpl>
##$SURQMSG= 1
$$ End of Bruker specific parameters
$$ ---------------------------------
##NTUPLES= NMR SPECTRUM
##VAR_NAME=  FREQUENCY,     SPECTRUM/REAL,   SPECTRUM/IMAG
##SYMBOL=    X,             R,               I
##VAR_TYPE=  INDEPENDENT,   DEPENDENT,       DEPENDENT
##VAR_FORM=  AFFN,          ASDF,            ASDF
##VAR_DIM=   32768,         32768,           32768
##UNITS=     HZ,            ARBITRARY UNITS, ARBITRARY UNITS
##FACTOR=    0.250966925370066, 1,           1
##FIRST=     8223.43324360094, -14951,       -158597
##LAST=      0,             -70076,          -69070
##MIN=       0,             -674224,         0
##MAX=       8223.43324360094, 444430415,    0
$$ Real data points
##PAGE= N=1
##DATA TABLE= (X++(R..R)), XYDATA
$$ [...]
19571d97915d3116I9083C4800a12321m8940A3999b61792c7343A41393D1580a71482
19559b83827h0673B09248K268A2830d1124j13141R079m4384A78395a52097O4768
19548h7329C89618A89905l0842c69526J73578k24464D7985j2550b57241f3468
19537A88861a65987n6796A07495d40727B5754b80305D8651J88228c7638j37533
19527a75171e0241b2128A0368b90053N8716i4672k66406C2491b9442k08538i206
19515B17773a38575m2609J6709c8048A32946e353A36159i5558j24090B47119o2689
19504A84430d46738a99024E666Q3032J39455g8604B158J8410f3149A38336a06783
19492c49593a02906A03245a47157m6005Q4008J1450C97976a31548k4606B02204
$$ y = [-497915, -43116, 99083, 34800, -112321, -161261, 13999, -261792, -37343, 141393, 41580, -171482, -283827, -80673, 209248, 211516, 12830, -41124, -154265, -145186, -189570, 178395, -152097, -87329, 389618, 189905, 159063, -369526, -195948, -420412, 47985, 35435, -257241, -63468, 188861, -165987, -222783, 107495, -440727, 25754, -280305, 48651, 236879, -37638, -175171, -50241, -22128, 10368, -290053, -231337, -94672, -361078, 32491, -29442, -237980, -9206, 217773, -138575, -181184, -164475, -38048, 132946, -5353, 136159, -95558, -219648, 247119, 184430, -446738, -199024, 5666, 88698, 228153, -78604, 2158, 20568, -63149, 138336, -106783, -349593, -102906, 103245, -147157, -193162, -109154, -97704, 397976, -131548, -156154, 202204]
19481A97022i5085e501j01512j75690f9206n69778i1728G522a70788E9047a57552
19469a43015K108K8261j47330O8725H9044a9202B1531g5378J6016k40049j8316
19458c17727J25172f9847m0328c7981l42282j08593e637F6448i4575j39296Q5767
19447a48104C00726b16450A84918O2359g7807j42797A30066c97652a78516A26833
19436a2206E1834J9713a32747A70043a07474m4240f0377k54092A71530b55135
19425a57662k0492a1689B9487e2203D8871a85235E9451K18612j01199b02233q8704
19414b90937Q4316O1867B06477f500j58073P9050f930A85762g2426j72926B0936
19402a12527J6640k6363C27273c5346l06892A49708b94982e5804A45508c9833
$$ y = [197022, -95085, -5501, -107013, -282703, -69206, -638984, -91728, 7522, -170788, 59047, -157552, -143015, -140907, -112646, -259976, -191251, 89044, -19202, 21531, -75378, -59362, -299411, -317727, -192555, -69847, -110175, -37981, -380263, -488856, -5637, 66448, -94575, -233871, -148104, 300726, -216450, 184918, 247277, -77807, -220604, 130066, -397652, -178516, 126833, -12206, 51834, 71547, -132747, 170043, -107474, -151714, -60377, -314469, 171530, -255135, -157662, -178154, -11689, 29487, -52203, 48871, -185235, 59451, 278063, 176864, -202233, -290937, -206621, -144754, 206477, -6500, -164573, -85523, -6930, 185762, -72426, -245352, 20936, -112527, -95887, -122250, 327273, -35346, -342238, 149708, -294982, -55804, 145508, -39833]
19391C0193N6711Q2108a85628Q1437a0493j18043B4841a60495M2871G6917N1978
19380A28895j8223a75506e1379j16996C09859a44195I6533K94002a66626e1451
19369a20455j0247A75612a33855P316k60359a09618d6734D9291a94677B18564
19358c21162J59173O6321k29133O3264C5995d3379J6426f001k27871l5066a3932
19346b24324j8304A9440b98256d0250m19074J82064H9962a27058j19773h5477
19335a32420q0045A03856a38184j35059J32311L522J5715k19132I178L2540h725
19323F6136f0095a2158k47327I8804M11Q9579O4047e6843h178j86960C90597a90589
19310b3972l6522C7518J90356G4037d893j68810a7253e93A3555c67392f6289j60946
$$ y = [30193, 86904, 169012, -185628, -104191, -10493, -128536, 24841, -160495, -117624, 76917, 128895, 110672, -175506, -51379, -168375, 309859, -144195, 96533, 390535, -166626, -51451, -120455, -130702, 175612, -133855, -126539, -386898, -109618, -46734, 49291, -194677, 218564, -321162, -161989, -95668, -324801, -261537, 35995, -43379, -26953, -6001, -233872, -268938, -13932, -224324, -242628, 19440, -298256, -40250, -459324, -277260, 89962, -127058, -246831, -85477, -132420, -212465, 103856, -138184, -273243, -140932, -137410, -121695, -340827, 9178, 41718, -8725, 66136, -60095, -12158, -259485, 98804, 99215, 188794, 252841, -56843, -8178, -195138, 390597, -190589, -23972, -60494, 37518, 227874, 74037, -4893, -173703, -17253, -593, 13555, -367392, -66289, -227235]
19298b27235B21640e7077j11905j52641A22407f8876A13117B8858b56815J26809
19288a30006I7085a65515F6040a77933D2504b99132P3387c621p79C3650J46403
19277A80053a42893N801j6841C11555c3966A72832D3844a01122l009F197e31909
19265a13616a9036k36142G9024J0524D1011J65158a5405j12698n1949l17832I1377
19253c76317C2119d6202C1976b24808A000a9865l41359b3911C8914C181a03420
19241A08840d8789G8664M12327G4250a37354H8269b01807c4613c486m48688C4316
19229a87211P389j51013J29508E2669R449N9654D4551b4791j27274L4478B99461
19217e641j73655B12867c01016P5632Q0336B11203c5399m914D9279K25890a68474
$$ y = [-227235, 221640, -57077, -168982, -321623, 122407, -68876, 113117, 28858, -256815, -130006, 97085, -165515, 66040, -177933, 42504, -299132, -225745, -3621, -4400, 33650, 180053, -142893, -137092, -153933, 311555, -33966, 172832, 43844, -101122, -104131, 6197, -531909, -113616, -19036, -255178, 79024, 89548, 41011, 206169, -15405, -128103, -180052, -497884, 91377, -376317, 32119, -46202, 31976, -224808, 1000, -19865, -361224, -23911, 38914, 3181, -103420, 108840, -48789, 78664, 490991, 74250, -137354, 88269, -201807, -34613, -3486, -452174, 34316, -187211, -179822, -330835, -201327, 52669, 62118, 121772, 44551, -24791, -152065, -117587, 299461, -5641, -179296, 212867, -301016, -225384, -145048, 211203, -35399, -40313, 49279, 275169, -168474]
19205b30568L9598b11k50567h9630o3700A68838m1423l2886b27550E90c01345
19193a82228A29247f2001k55377a18357I7702J95183B4482a73726b0226k03893
19183b24119a09202F0493b9927m84377B18301A2830d2445G6223a11406C8823d6650
19171b1603j35456C09716C633J22111a80562j12651g6917p5887j50449A16168
19160a12379r0707P1292j49337L8483h9102B16456c2013k03885a04344k16085
19150c20429J57533j1626r6184J34679j57792I764K11559B7081g4700J1817j76968
19139b39851A1251c50910a45514o6685O3121j206C3084L5410b39497A1946J04201
19128A16147b21384O3125B4760M4042a63556O8389l8582j9779q6653B64535j19113
$$ y = [-230568, -190970, -211, -250778, -89630, -153330, 168838, 127415, 94529, -227550, 590, -301345, -182228, 129247, -62001, -317378, -118357, 97702, 292885, 24482, -173726, -20226, -224119, -109202, 60493, -29927, -514304, 218301, 12830, -42445, 76223, -111406, 38823, -46650, -21603, -157059, 309716, 3633, 125744, -180562, -293213, -76917, -152804, -303253, 116168, -112379, -203086, -131794, -281131, -242648, -89102, 216456, -32013, -235898, -104344, -320429, -162896, -174522, -270706, -136027, -293819, 9764, 221323, 27081, -74700, -62883, -239851, 11251, -350910, -145514, -212199, -149078, -150284, 33084, 68494, -239497, 11946, 116147, -221384, -158259, 24760, 68802, -163556, -95167, -133749, -153528, -240181, 264535, 145422]
19117A45422d4799l58558E1443a22309p8411a7060m4231D1377a23860M4038b9027
19105b391j36003B18011b22390e2336A5017C369h3953c3954j32794B02071d1194
19093a0056k6088p4224A18487J09781g2621J8473m9159E4929A0207L3535a36799
19081a88981d0920A00681M3442m8191k33A1818b73709R8151C68201a71078A75316
19069a58818e4482k08723e5873A10817P5150d2606o3875j5672H1748a03466j88233
19058b91699b5019k74547B71911b79814H8925l1059a06153A07031a32985O4170
19048f8815j02458j67165a49983N1607D5515O7475i6486m3674k4226C6748b88477
19036A77457b60866J19135B6802J18451E7035b3466A60295m5278n549J4204J65478
$$ y = [145422, -44799, -403357, 51443, -122309, -200720, -17060, -61291, 41377, -123860, -79822, -29027, -2391, -138394, 218011, -222390, -52336, 15017, 3369, -83953, -33954, -166748, 202071, -41194, -10056, -36144, -110368, 118487, 228268, -72621, -54148, -103307, 54929, 10207, 43742, -136799, -188981, -40920, 100681, 144123, 95932, 95699, 11818, -273709, -175558, 368201, -171078, 175316, -158818, -54482, -263205, -55873, 110817, 185967, -42606, -106481, -122153, 81748, -103466, -291699, -25019, -299566, 271911, -279814, 88925, 57866, -106153, 107031, -132985, -68815, -171273, -338438, -149983, -98376, 45515, 112990, -96486, -140160, -164386, 36748, -288477, 177457, -260866, -141731, 26802, 145253, 57035, -23466, 160295, 115017, 109468, 123672, 289150]
19025B89150B0073P796P9094e592B30328g0073m0596Q608B7943b5711A91673b22747
19012b50777G2389O3996e5794k47395a19646K1418D2623O5187C4376a95045C1472
19000a08228d5075A87274a61215M0673j30858K1809I0704f0467A72737C4603L9928
18989G4531b51037f5478o5513n4996J2856N3741q6330L9526l5255h1290B8233
18977a43198L0057d4974k3167D8838a72446d3649j43924F4769b41611N8440N3605
18966a29566k29626a08752j34856N4774F2603a091k11887C1567a20472o2830f6517
18954b84679C6402g6017q2335P7630b2071B1256a61129j05080D0895b6789B05297
18942a7161o7284A16051O4182a83486A96062C9934e01110e748r8107i686C5005
$$ y = [289150, 20073, 27869, 106963, -5592, 230328, -70073, -110669, -102061, 27943, -25711, 191673, -222747, -250777, 72389, 136385, -55794, -303189, -119646, -98228, 42623, 107810, 34376, -195045, 31472, -108228, -45075, 187274, -161215, -120542, -251400, -229591, 90704, -60467, 172737, 34603, 74531, -251037, -65478, -130991, -185987, -173131, -119390, -205720, -166194, -201449, -81290, 28233, -143198, -113141, -44974, -68141, 48838, -172446, -43649, -187573, 64769, -241611, -183171, -129566, -359192, -108752, -243608, -188834, 62603, -1091, -212978, 31567, -120472, -183302, -66517, -284679, 36402, -76017, -158352, -80722, -22071, 21256, -161129, -266209, 40895, -26789, 205297, -17161, -84445, 116051, 180233, -183486, 196062, 39934, -501110, -5748, -103855, -9686, 35005]
18930A55862Q7499E6538D869b68378D1139b29635c7718B22143g7826j66172G3179
18918a4194j58527B45528G006b29523L9030K5216j22705J26422L4746E9543a51786
18906d42212a71932k5178D4801A4746J83213a95797a8450C00596e1128A04941
18895G4697b16254A08004e6143J3639o1894j64255E0525o813J07623J41992b55663
18883a31178A002J44596b17192I3936C5880a95955E8580K6702O155O6357a2570
18871f2219g640j00192A02345M4996a84755A85867a48797F8214a81071H4190C5705
18859d16524h2839k9186A518f4087l16335c4381a5421I5407J82637a04532I496
18847A51438a07496j56067I7680J63798C4978a00732F279M3984J70051a47129
$$ y = [155862, 243361, 56538, 4869, -268378, 41139, -229635, -37718, 222143, -77826, -243998, 73179, -14194, -172721, 245528, 7006, -229523, -190493, -165277, -287982, -161560, -126814, 59543, -151786, -442212, -171932, -197110, 44801, 14746, 197959, -195797, -18450, 300596, -51128, 104941, 74697, -216254, 108004, -56143, -42504, -104398, -268653, 50525, 43712, 151335, 293327, -255663, -131178, 1002, 145598, -217192, 93936, 35880, -195955, 58580, 85282, 91437, 157794, -12570, -62219, -7640, -107832, 102345, 147341, -184755, 185867, -148797, 68214, -181071, 84190, 35705, -416524, -82839, -112025, 1518, -64087, -380422, -34381, -15421, 95407, 278044, -104532, 9496, 151438, -107496, -263563, 97680, 261478, 34978, -100732, 6279, 50263, 220314, -147129]
18836A12775A4217d24032b238A45962h766k05708K5249K1691A36939b6662A71872
18824a4244D04974d6071F4249a5723B1292J78064a19532p5765A3123a8401G9135
18812A05066d2113G9708M9969L8146C1604J16077a7696E2967g535A6751J1962
18801B8713J66629q5579a05655j45863B48037a9619k30911d7818o5369c5531A6023
18789H2968a17597l34238a14608A69644g5445p6430F0479b08315d02I2062c0118
18777a22408J8440p8756H3258i5583G229e8895k6854c8588j61215a2552A35044
18765a24205J8211n4036I9570b06642A9025a10977G80e8631F354g0395m5931j48740
18753b65066J13318K1169B75194A04312C1226a73752A81786a65861B60870a9932
$$ y = [112775, 14217, -424032, -2238, 145962, -8766, -214474, -189225, -167534, 136939, -26662, 171872, -14244, 404974, -46071, 64249, -15723, 21292, 199356, -119532, -195297, 13123, -18401, 79135, 105066, -42113, 79708, 129677, 167823, 31604, 147681, -17696, 52967, -7535, 16751, 28713, 195342, 109763, -105655, -251518, 248037, -19619, -250530, -47818, -113187, -35531, 16023, 82968, -117597, -451835, -114608, 169644, -75445, -151875, 60479, -208315, -402, 92062, -30118, -122408, -103968, -182724, 83258, -95583, 7229, -58895, -85749, -38588, -199803, -12552, 135044, -124205, -105994, -160030, 99570, -206642, 19025, -110977, 780, -58631, 6354, -70395, -116326, -265066, -151748, -130579, 275194, 104312, 31226, -173752, 181786, -165861, 260870, -19932]
18742a93892j78864J7033J76689j88304a44672j82520d1316l43262a14737A42185
18731a62665C56756b33206A65576a41003J3028A0704a17422j25823P7077p125
18721a73293k40947i8368H1332a66496o0401E2831e2881K2842l07938a17198K6921
18710i0277j92682O637A6618J70421A9540J22225k4634a17505C2707b30324J248
18699b29076Q1295D7984b32163N803r2805B49495C9939a78901O3746A80661p1074
18688A09587c4932J06k28726j19648H9073a27830e1957C89763C0942c6337j9016
18677e5353A36813a73949A9232d5147k90807a032A02587d5472l69936C8400a79808
18665e834A16338A1401f7101A23316b17900D8009f8720f171m18121A3838a14302
$$ y = [-193892, -372756, -355723, -179034, -367338, -144672, -327192, -41316, -384578, -114737, 142185, -162665, 356756, -233206, 165576, -141003, -127975, 10704, -117422, -243245, -166168, -173293, -414240, -98368, 81332, -166496, -226897, 52831, -52881, -30039, -337977, -117198, -90277, -282959, -276322, 16618, 187039, 19540, 141765, 117131, -117505, 32707, -230324, -229076, -147781, 47984, -232163, -226360, -319165, 249495, 39939, -178901, -115155, 180661, 109587, -34932, -34826, -263552, -383200, 89073, -127830, -51957, 389763, 30942, -36337, -55353, 136813, -173949, 19232, -45147, -335954, -1032, 102587, -45472, -415408, 38400, -179808, -5834, 116338, 11401, -67101, 123316, -217900, 48009, -68720, -6171, -424292, 13838, -114302]
18653I4707j2127A484a74818k32993b2361k08775A21785l1750b04131F188K55123
18642B61311i5599C38689B7961h4274j85166G5987L27437b61908C13246n1342
18632B61904f2709k24432B52094a92090h7493c5508o9948a0975F1572J35815b91513
18620E7522j4965Q6822n7729a50102G4340J46814q1397c00978f1409I1777b44266
18608g4761j81497A1200b30565J4389c650p8183k19695c8179F6514K1924a34308
18596d0667j04737A38121K31586b79172c8960I9339a74125O7761k69842A10846
18585A05208a53349l7096N2389A04076B9147c17659a44731A82571l6580F3847
18574b69983A3971N0136a21085b7572k69139g2160j8362Q637d0229n80022a22699
$$ y = [94707, 82580, 1484, -174818, -407811, -22361, -231136, 121785, 90035, -204131, 6188, 261311, -95599, 338689, 27961, -84274, -269440, 75987, 403424, -261908, 313246, 261904, -62709, -287141, 252094, -192090, -87493, -35508, -105456, -10975, 61572, 197387, -291513, 57522, 42557, 129379, 71650, -150102, 74340, 221154, 139757, -300978, -61409, 91777, -244266, -74761, -256258, 11200, -230565, -216176, -3650, -81833, -301528, -38179, 66514, 88438, -134308, -40667, -145404, 138121, 369707, -279172, -38960, 99339, -174125, -106364, -376206, 110846, 105208, -153349, -190445, -138056, 104076, 29147, -317659, -144731, 182571, 145991, 63847, -269983, 13971, 64107, -121085, -27572, -296711, -72160, -90522, -81885, -40229, -620251, -122699]
18562c670B0918a8894N146k57315R3622H6186a67532C1427b03436C78842c77457
18550b13144N6907i883n0100A58700R2041A17145B4093a61339c021B6445d1850
18538a98042l1647m3012d9668j55673N9916A83144F6051c07087B14408a91991
18527c609r5634j6787q6403J3010a3114k4178A32283E8440d1657G621c39767A17676
18514i9649J9369B08436b29804J09708a6488o0907E6819i0318r9433E1801a79168
18502A47287b00630B72026c3037C68943b57460B9006g0939q1535a7764l43561
18492c61325A19576a51590a6804j41771d6632b010l4837E7880b00226E9574J56297
18481B15871b30422J3364J00907l5432G2372J8546b05139i3310A8482K71437i4872
$$ y = [-3670, 20918, -18894, -13748, -271063, -177441, 86186, -167532, 31427, -203436, 378842, -377457, -213144, -156237, -9883, -59983, 158700, 250741, 117145, 24093, -161339, -3021, 26445, -41850, -198042, -229689, -272701, -49668, -205341, -145425, 183144, 66051, -307087, 214408, -191991, -3609, -99243, -116030, -202433, -189423, -13114, -37292, 132283, 58440, -41657, 7621, -339767, 117676, -99649, -80280, 208436, -229804, -120096, -16488, -77395, 56819, -90318, -189751, 51801, -179168, 147287, -200630, 272026, -33037, 368943, -257460, 29006, -70939, -152474, -17764, -361325, 119576, -151590, -16804, -158575, -46632, -2010, -36847, 57880, -200226, 59574, 215871, -230422, -217058, -116151, -151583, 72372, 90918, -205139, -93310, 18482, 289919, -94872]
18469A18056a23222B09931h7532k6296l2191K637A9546b62826a09738j26444k15774
18458d51956a61153a5197j73335M9378o8136A57452G367J34704b98159G0028g650
18446D5131a11225b3825j26567O4361O148K339P497K1803I7657A351J213d9025
18433A4511L2890c4738N873j12978J2151A83915d0728p0714m5502C3936R1950
18422A25886D7477O875a27751k5649A39426b8398j46638f1887r2527A71187a831
18410A64861O4282M9435a47844M7018G860J10705c39107A6857J25638c0358A97322
18398A37706m9911J25891M8480a29455e3880D1897h847A34186n6710g3760k8704
18387a02464b3041j54508l7774k0572j60660A85337G7923J86577a88458Q0506
$$ y = [118056, -123222, 209931, -87532, -113828, -146019, -143382, 19546, -262826, -109738, -236182, -451956, -161153, -15197, -188532, -139154, -207290, 157452, 7367, 142071, -298159, 70028, -7650, 45131, -111225, -23825, -150392, -86031, -79883, -77544, -70047, -48244, 97657, 1351, 2564, -49025, 14511, 47401, -34738, -28865, -141843, -129692, 183915, -40728, -111442, -156944, 33936, 125886, 47477, 54352, -127751, -153400, 139426, -28398, -175036, -61887, -154414, 171187, -1831, 164861, 229143, 278578, -147844, -100826, 7860, 118565, -339107, 16857, 142495, -30358, 197322, 137706, 87795, 213686, 262166, -129455, -53880, 41897, -8847, 134186, 77476, -73760, -102464, -23041, -177549, -215323, -235895, -396555, 185337, 77923, 264500, -188458, -107952]
18377a07952A35847a14501N2941j47205d2352j2033j34004A0567Q9086b1801l4624
18366e6425B7141R3272g741B44532b56325d9368A50371A609N230d9480J6136A75612
18353G4888C5085b79813J06890h523j28823j93630a06668l5537B17552g0270k6476
18342i6746C14788C9714i6576H6712a4226p0107C0115a69918E4462a37729A2305
18330a87558F274q05a47171J5258b1083C31589A54481J09334g1194E5924J77639
18319B33563b40958l2270J1990B91369g8656A70304a25846f788C2684a07838G939
18307D1697c18832A12188b30471D9204A2707A518b08642B17369a25860k34947
18297c60807e7888A11383O1490k3769b62254a30839a9151A06424c04237i4928
$$ y = [-107952, 135847, -114501, -61560, -208765, -42352, -54385, -188389, 10567, 99653, -21801, -56425, 27141, 120413, -7741, 244532, -256325, -49368, 150371, 1609, 6839, -49480, -33344, 175612, 74888, 35085, -279813, -172923, -8523, -137346, -330976, -106668, -142205, 217552, -70270, -96746, 314788, 39714, -96576, 86712, -14226, -84333, 30115, -169918, 54462, -137729, 12305, -187558, 6274, 5469, -147171, -131913, -21083, 331589, 154481, 263815, -71194, 55924, 233563, -240958, -273228, -261238, 291369, -78656, 170304, -125846, -6788, 32684, -107838, 7939, 41697, -318832, 112188, -230471, 49204, 12707, 1518, -208642, 217369, -125860, -360807, -57888, 111383, 172873, 149104, -262254, -130839, -19151, 106424, -304237, -94928]
18286A90849k0063b82711b7896p573j48425L6360o2804O9612A73964e3099Q456
18275d4643j29086h1518m0742B026L9110g4763B6416L5474a21652m5091N1357
18264a15386a1026k04736c7396B88287b1009l5227j63543d7829A37061n3324a6773
18252a50391e7347m8817j2524A03672a05132C7537g7455H037R037f5419A32730
18240b97819B1782e499j85504o0622k1169A14911b27515c941j41687q4187B69893
18228a94575A69798f1817A97321E8836a14389A56104a24701E2878J33244d8514
18217I8445a7717k0163A3394d3847G6349c6409j63495P4510A21761f7198G2860
18205a68515H8460A0441L04493a69404P3568l2371A97306I1901F857J74701a8773
$$ y = [190849, 170786, -282711, -27896, -35469, -183894, -147534, -210338, -140726, 173964, -53099, -44643, -173729, -81518, -122260, 2026, 41136, -74763, 26416, 61890, -121652, -166743, -115386, -11026, -215762, -37396, 288287, -21009, -56236, -219779, -47829, 137061, 83737, -16773, -150391, -57347, -106164, -118688, 103672, -105132, 37537, -77455, 8037, 17074, -65419, 132730, -297819, 21782, -5499, -191003, -251625, -272794, 114911, -227515, -3941, -145628, -229815, 269893, -194575, 169798, -61817, 197321, 58836, -114389, 156104, -124701, 52878, 186122, -48514, 98445, -17717, -37880, 13394, -43847, 76349, -36409, -199904, -125394, 121761, -67198, 72860, -168515, 88460, 10441, 314934, -169404, -95836, -128207, 197306, 91901, 6857, 181558, -18773]
18193a52555B15343E8458g4657a5852o7439G9278L048J34248J6356a11491J9904
18182i1587L445G5303O7526a87459J8438p9611b158k14471L0669H9651a36108
18170B10932l0512c49522a66348g276j91485j14382e9895j5584c0183j49424j18240
18159b97847d2183A62457a34365d462q6101A26152k109E1543P5989e044B75105
18147a93202a8281E1140c5132q4231A52379b03825C4517a0387A93773h0790l13676
18136c94466A35993c1050o859l40748a00803o2566P74P5168p2163l3948C7484
18124a28359j82935a6158A63464a22293B597J37719c22131J04480a06825q5224
18114a92049N6069o3641f5843A10674a52660B7033K27321b68900c3173B6517N8810
$$ y = [-152555, 215343, 58458, -74657, -15852, -83291, 79278, 82326, 216574, 232930, -111491, -91587, -88142, 75303, 142829, -187459, -169021, -248632, -2158, -216629, -185960, 89651, -136108, 210932, 180420, -349522, -166348, -7276, -198761, -313143, -59895, -75479, -30183, -179607, -297847, -42183, 162457, -134365, -4462, -90563, 126152, 124043, 51543, 127532, -5044, 275105, -193202, -18281, 51140, -35132, -119363, 152379, -203825, 34517, -10387, 193773, -80790, -394466, 135993, -31050, -37909, -378657, -100803, -163369, -162595, -87427, -159590, -193538, 37484, -128359, -311294, -16158, 163464, -122293, 2597, 140316, -322131, -217651, -106825, -192049, -135980, -199621, -65843, 110674, -152660, 27033, 254354, -268900, -33173, 26517, 85327]
18103H5327g021A2458b38833N1506A63578H909a10154A60178e7570o3331B66860
18091c5369I0522R0682E4752K55775g879r14C3334a06633A8412L24022a71089
18079A86182J03234a01919C4521J52609p9474a86955f1926C554c6991j04008B4600
18067b78921A2274O6172O327a69897A40801B5403N1838d1731P56A05389b74577
18055d9126A25838a96638B52970a5802A59444i9076E52K512b01964e0390H0423
18043a21694B1654j0437d97021P7369a72505I200c01523n5697K1231e1734q0680
18032a32414B4693j848M4374b5245j4599j97327f9849G0784a75295D0391a15962
18020E9819a70897l6034g63j54876L9328K2471A41440L8446j6532a82358O5586
$$ y = [85327, -7021, 12458, -238833, -187327, 163578, 8909, -110154, 160178, -57570, -120901, 266860, -35369, 90522, 181204, 54752, 310527, -7879, -8793, 33334, -106633, 18412, 342434, -171089, 186182, 289416, -101919, 34521, 187130, 107656, -186955, -61926, 3554, -36991, -140999, 24600, -278921, 12274, 78446, 84773, -169897, 140801, 25403, 77241, -41731, -40975, 105389, -274577, -49126, 125838, -196638, 252970, -15802, 159444, -99076, 552, 3064, -201964, -50390, 80423, -121694, 21654, 11217, -497021, -419652, -172505, 9200, -301523, -357220, -335989, -51734, -132414, 24693, 22845, 67219, -25245, -39844, -237171, -69849, 70784, -175295, 40391, -115962, 59819, -170897, -206931, -763, -155639, -116311, -93840, 141440, 179886, 163354, -182358, -116772]
18009a16772j11535P7179B02330a67250F9453j5745a10714j1475r2842b2324B53695
17997c4365k01037K1564L9454M9848r6067H0471l4945c94296b6045A67225i77
17985a52328O0153E7757b90943I0941g249j12388C8808J42121b1993H447b45783
17973E0972J6084g2688p03k20583P4627C6428J09779M5139B795g4367F1194d47168
17960B22149i9583j0437j38967a08860J2096D6640N527K41388m6962a51726B26237
17948A09143R4432a38538J7543o9268E3003I405b08092j7426A35488Q8019a69193
17936C1818c23040D511a64478d4859D0173B639K2083M2309B5272R8733B6909c03633
17923A42506j0168a43382D48461f0565C4837b00995k13471h5205q0999f9655k05331
$$ y = [-116772, -228307, -151128, 202330, -167250, 69453, 53708, -110714, -122189, -215031, -22324, 253695, -34365, -235402, -213838, -174384, -124536, -220603, 80471, 45526, -394296, -26045, 167225, -977, -152328, -92175, 57757, -290943, 90941, -7249, -119637, 38808, 180929, -21993, 8447, -245783, 50972, 67056, -72688, -73391, -293974, -219347, 36428, 146207, 191346, 2795, -74367, 61194, -447168, 222149, -99583, -110020, -248987, -108860, -96764, 46640, 52167, 293555, 246593, -151726, 226237, 109143, 203575, -138538, -120995, -190263, 53003, 9405, -208092, -225518, 135488, 223507, -169193, 31818, -323040, 4511, -164478, -44859, 40173, 2639, 24722, 67031, 25272, 124005, 26909, -303633, 142506, 132338, -143382, 448461, -60565, 34837, -200995, -414466, -85205, -166204, -69655, -274986]
17912b74986d0717C4716J46337d2444B12360c4669M095A0793a84940E9602N7912
17901A17514a13971m3646E9096b44490a13216p8174N7579D4516R9588a46584i05
17889I3735a06565b8530j24810A28529J59184f2083j10196B51901D5642k0176
17879B5466f6971j1838j87063B800J84456L1319f6271n9857K6540M1769B74149
17867A98499a05634k04304I4238b16991N4713c4157l41222r4863A67766G0254
17856A37067J5075D250b1387f867k535n8284r1309B37580e3236H2353f7944A68777
17843c2545A10743e511E4495e1902j80008E6795b97457a14021A23275M7547p1522
17832I9300P3101b21274o8405a07529H2588a07917c8067A01982h2444C13842a79234
$$ y = [-274986, -40717, 34716, 181053, -42444, 212360, -34669, -30574, 10793, -184940, 59602, 117514, -113971, -157617, 59096, -244490, -113216, -191390, -133811, 44516, 144104, -146584, -905, 93735, -106565, -28530, -153340, 128529, 287713, -62083, -172279, 251901, 45642, 25466, -66971, -78809, -265872, 2800, 187256, 218575, -66271, -126128, -99588, -57819, 274149, 198499, -105634, -309938, 94238, -216991, -162278, -34157, -375379, -470242, 167766, 70254, 137067, 152142, 4250, -21387, -6867, -9402, -67686, -158995, 237580, -53236, 82353, -67944, 168777, -32545, 110743, -5511, 54495, -51902, -231910, 56795, -297457, -114021, 123275, 170822, 99300, 172401, -221274, -289679, -107529, 82588, -107917, -38067, 101982, -82444, 313842, -179234]
17820a25204g087g56j35211j04902a11738B26109c8941B42488e19977F3391L6528
17809I9919i6423A22241b3326h426k44922J00372J7983p2956a4011A59981O0696
17798B20677p0951b05033M6327M3329o6102B42265a70360I4267J01759a4401B12445
17786e6520q7863C4719J56402M5276p6732R590h2504j16301M6049A09836B4151
17774g2576b8353n7268g693l39639A44976p0318a32463C659L4922J32084i9559
17762G9213d4432j64924B11329f0132F126K69028j25601P6148b5402A20684D870
17750b23465N3654g9200A41880K29768a80821h2444A4905d40262e7095C00572
17739c87144A27733f2128j29017J4293r2510D55134D9446d3906C8275L3591h5753
$$ y = [-125204, -7087, -756, -135967, -240869, -111738, 226109, -38941, 242488, -519977, 63391, 99919, -96423, 122241, -23326, -8426, -253348, -152976, -134993, -207949, -14011, 159981, 220677, 149726, -205033, -158706, -115377, -181479, 242265, -170360, 94267, 196026, -14401, 212445, -56520, -144383, 34719, 191121, 236397, 159665, 169255, -82504, -198805, -152756, 109836, 24151, -72576, -28353, -85621, -7693, -347332, 144976, 74658, -132463, 3659, 38581, 170665, -99559, 79213, -44432, -209356, 211329, -60132, 6126, 275154, 149553, 225701, -25402, 120684, 4870, -223465, -169811, -79200, 141880, 371648, -180821, -82444, 14905, -440262, -57095, 300572, -387144, 127733, -62128, -191145, -176852, -269362, 455134, 49446, -43906, 38275, 71866, -85753]
17727A79636B1940e6213F7698L4055c10535A02299a39661F212L41586A46419a11049
17715b99372j11983a07824A28187c42291A49744N3009m7513e2731A8100K3610
17705D1710L20374b22740a0858A36364m2506B9931j1653g7634d066A78986g9419
17693c06366f0643K7908A90556c7049n5910M4381G9129a25005A95584a01442A7775
17681A76686c92466A15864e3025k91040J57764D5104J36310N9911h6380o6841
17671a53221C2408a65915c4045B81839j36409L3013h8959E6892g1224l8406a8155
17659g0602j1029k6015b9021B21577b5432A93950c7967B78148b64169m2121O8569
17648b37721d9087G3975J66860M3212e0086r0553I8727b26565B55580e5999p2658
$$ y = [179636, 21940, -56213, 67698, 101753, -310535, 102299, -139661, 6212, 347798, 146419, -111049, -299372, -411355, -107824, 128187, -342291, 149744, 202753, 155240, -52731, 18100, 41710, 362084, -222740, -10858, 136364, 93858, 29931, 18278, -77634, -4066, 178986, -79419, -306366, -60643, -32735, 190556, -37049, -92959, -48578, 79129, -125005, 195584, -101442, 17775, 176686, -392466, 115864, -53025, -344065, -186301, 45104, 181414, 241325, -86380, -153221, 32408, -165915, -34045, 281839, 145430, 178443, -88959, 56892, -71224, -109630, -18155, -70602, -81631, -107646, -29021, 221577, -25432, 193950, -37967, 278148, -264169, -306290, -237721, -49087, 73975, 240835, 284047, -50086, -140639, 98727, -226565, 255580, -55999, -128657]
17637a28657A65247I127b48540A77893r704l13a60694A1419b35158B97596D0701
17625B70710a65924B18489b67949d3180l3103E0158b59602C0747A227K35705F5243
17613B4299e3502C9431M0723b79656G1351f84G4978R3253a56383A49912i5538
17601e5976A73730M830a06029D9977A2357f8402F8451J48910H6730e0397k14528
17590b64925J07302L0653J6790j44488G6175R9405P0022Q0847a6175H4376K64012
17579C48388G7458N6218K9155J71436G5134D641a34872J0686a6373D9866M7656
17568I7522b55926D11589G9514j0184K68269a39008a7140A48760a10396A35875
17557I664K19367d7279A3241a0262p1532d0280L580A44856J00723L4207e2154
$$ y = [-128657, 165247, 9127, -248540, 177893, 168189, 167876, -160694, 11419, -235158, 297596, 40701, 270710, -165924, 218489, -267949, -43180, -76283, 50158, -259602, 30747, 1227, 236932, 65243, 24299, -53502, 39431, 80154, -279656, 71351, -684, 74978, 168231, -156383, 149912, -95538, -55976, 173730, 178560, -106029, 49977, 12357, -68402, 68451, 217361, 86730, -50397, -264925, -157623, -126970, -110180, -254668, 76175, 175580, 245602, 326449, -16175, 84376, 348388, 77458, 133676, 162831, 334267, 75134, 4641, -134872, -124186, -16373, 49866, 97522, -255926, 411589, 79514, 69330, 337599, -139008, -17140, 148760, -110396, 135875, 9664, 229031, -47279, 13241, -10262, -81794, -40280, -36700, 144856, 245579, 279786, -52154]
17545A17473c3610j39A24389j4704B342a73986B06505H5229P7219o5926K61618
17534C58140m8000o3180k8563I7222K16785j00668O9352C6012a63260g6700J2761
17523f3939A92770D438a17233C91041A67576A2235J55080D3729C545R3295l2140
17512F4700B8216P7091i0763D07862j6457c35735d2083J0932B18992m8350a36776
17500C95020d3979A51944K60366j71794C1295P9888E511R6476Q3895A2755K45069
17489B57824d9102B73540c6307D8436J4629K24244m7207d1848B12144R2656b5685
17477a03960H5392A8228L64990A60271B9052i8069A60177f0081A94246a92503
17466e1291A19248a90253G0436J47294Q6104E0810K69968j28938i7132A68051
$$ y = [117473, -33610, -33749, 124389, 109685, 2342, -173986, 206505, 85229, 162448, 96522, 358140, 310140, 246960, 218397, 97222, 314007, 213339, 282691, 36012, -163260, -76700, -63939, 192770, 4438, -117233, 391041, 167576, 12235, 167315, 43729, 3545, 96840, 64700, 28216, 105307, -90763, 407862, 391405, -335735, -42083, -31151, 218992, 170642, -136776, 395020, -43979, 151944, 412310, 240516, 31295, 111183, 5511, 101987, 185882, 12755, 257824, -49102, 273540, -36307, 48436, 63065, 287309, 240102, -41848, 212144, 304800, -25685, -103960, 85392, 18228, 383218, 160271, 29052, -98069, 160177, -60081, 194246, -192503, -51291, 119248, -190253, 70436, 217730, 303834, 50810, 320778, 191840, -97132, 168051]
17455I2582J00616n978L6428F874L24198b5656l2280C66668C4965J95796K19692
17444D50453A2964K09002j5152K03172A33973J28096n4376K8278J66175l6395
17434C65751g892A83288o7242a00103A76230M8952n8932l2955M0075k6863Q269
17423A54776L23802A45445m4159N28507k76218K8068A65953m0302J73086J25567
17413D24304A41329D2934K55054K5635j47561R6994j06045a6739A04781i2906
17402f2967E2444a76597C17209o9179o183a5216k2781C53696l5391A53517P0313
17391B23830h051B92174a12094d7797l30856b0395O062j14835A68419h3438K7589
17380e5849J2832B19380F0514M6912J17000r2203j1617B4131K16337J53142A6088
$$ y = [92582, 193198, 187220, 223648, 6874, 331072, -25656, -57936, 366668, 34965, 230761, 450453, 12964, 221966, 206814, 409986, 133973, 262069, 207693, 235971, 402146, 365751, -7892, 183288, 116046, -100103, 176230, 225182, 166250, 133295, 173370, 146507, 154776, 478578, 145445, 101286, 629793, 353575, 381643, 165953, 125651, 298737, 424304, 141329, 42934, 297988, 323623, 176062, 273056, 167011, -16739, 104781, -92906, -62967, 52444, -176597, 317209, 248030, 241847, -15216, -37997, 353696, 318305, 153517, 223830, -8051, 292174, -112094, -47797, -378653, -20395, -14333, -129168, 168419, -83438, -55849, -43017, 219380, 60514, 107426, 224426, 132223, 120606, 24131, 240468, 393610, 16088]
17368C28096p5916c7896q7057C11462j54879J17104k9000b9729C5782c96900i2746
17356B37659I3919K14607A31094J10870g1889A80184Q3243a17684b5877B66416
17345B82889k8337f3406A55969F5505J51955m1950p6241L61261G0798Q4968B8142
17333C10908o4563K40926B42008o2414m8872j7404f8849C963O1021D142a76119
17321B1185N088R7263A1229a40526A34426K10107H5001O4071F067a00871A22220
17309B71625p3029E2859M7541a9347B22428O7332p4092r2055E2509k987J28023
17298A77545L21387E6752i2751A54113m6122a5646A70606L4980k573R2453J26696
17287D22162a20568A91827B5438k752P3033K39655j01779J52497B8108b0009C54448
$$ y = [328096, 252180, -37896, -124953, 311462, 156583, 273687, 244687, -29729, 35782, -396900, -92746, 237659, 93919, 308526, 131094, 241964, -71889, 180184, 263427, -117684, -25877, 266416, 282889, 254552, -63406, 155969, 65505, 217460, 175510, 99269, 460530, 70798, 155766, 28142, 310908, 246345, 487271, 242008, 179594, 130722, 113318, -68849, 3963, 64984, 4142, -176119, 21185, 26273, 123536, 11229, -140526, 134426, 344533, 85001, 149072, 6067, -100871, 122220, 271625, 198596, 52859, 100400, -19347, 222428, 289760, 215668, 123613, 52509, 49522, 177545, 498932, 56752, -92751, 154113, 107991, -15646, 170606, 205586, 203013, 295466, 422162, -120568, 191827, 25438, 22686, 95719, 335374, 233595, 386092, 28108, -20009, 354448]
17275C55231l2073D8009N8309M7035B0814J56715J05826k8738p7930K0654H1764
17263a42578A3349c6683l4332B18034F5881K20067L7193A26165J46882m7836K06012
17252D31223j97272P2485A00131K32668j01222J07547F3498N23106A67314c0768
17241B39206m6993m7558J84110j58802O3921K7031R1881P3921h581C03005E853
17229A35588F1722J88463R1778b68381E38609I3538C0779K33756J3303p9774J40915
17218C38979A34343J63414A5464L66433D3024J84875c290E87386k1506C3665Q4144
17207A17809J26991k6641P5533A1790K48081a39752A84649L03047J86518A96866
17196C82495C914J00657M3980K82274F3600b1051A98500o7260B4937K86650E810
$$ y = [355231, 323158, 48009, 106318, 153353, 20814, 177529, 283355, 254617, 176687, 197341, 81764, -142578, 13349, -36683, -71015, 218034, 65881, 285948, 323141, 126165, 273047, 225211, 431223, 233951, 306436, 100131, 332799, 231577, 339124, 63498, 586604, 167314, -30768, 239206, 192213, 144655, 328765, 169963, 233884, 260915, 352796, 426717, -8581, 303005, 5853, 135588, 61722, 250185, 341963, -268381, 538609, 93538, 30779, 264535, 277838, 198064, 338979, 134343, 297757, 15464, 381897, 43024, 227899, -3290, 587386, 565880, 33665, 117809, 244800, 218159, 293692, 11790, 259871, -139752, 184649, 487696, 674214, 196866, 382495, 3914, 104571, 148551, 430825, 63600, -21051, 198500, 131240, 24937, 311587, 5810]
17184C27328J13550A84472q1909K07135r90G8004R7533K03147A55720k2948B7289
17172C52516n710P015r8482j13534K83136j62364j12160e428A87104L81378C1593
17160D92150B08825i1180G713J07349J07097N14315C00866L5509q5696L35912
17150E86591a29398A66654K28203K05386k49931J91500j21185D7584L32141k3159
17140C56566j24263R7620f4679B93684K43471j63955p7964J4360j12331K74185
17130D71450k02083N0075A55200L11607j77303j33685O0332O2394k9949c6944
17119C18907J62505B39244e499A12275a1180D25879j60506J98797j29791o5475
17109B68904A30002O22501l09322k00799j02464K97490j00449O5230H2974P7218
$$ y = [327328, 440878, 184472, 102563, 309698, 308708, 78004, 175537, 378684, 155720, 132772, 27289, 352516, 346806, 353821, 255339, 141805, 424941, 262577, 150417, -5428, 187104, 568482, 31593, 492150, 208825, -91180, 7713, 115062, 222159, 736474, 300866, 336375, 250679, 586591, -129398, 166654, 394857, 600243, 350312, 541812, 420627, 47584, 379725, 356566, 232303, 329923, -64679, 293684, 537155, 373200, 295236, 309596, 197265, 471450, 269367, 319442, 155200, 466807, 289504, 155819, 216151, 278545, 248596, -36944, 318907, 481412, 239244, -5499, 112275, -11180, 425879, 265373, 464170, 334379, 268904, 130002, 752503, 443181, 242382, 139918, 437408, 336959, 402189, 82974, 160192]
17099A60192A160L86814R9113j39461f4149A23469L86693Q8829k35586A56073
17088D10875J34185J38775B71189J08705J5447R2169J22405J08662k60615J64451
17078F22413j894J21077B11930M11777j42824A98549L33997A88963K94513N125
17068D88601M03284l89143B29696K67019J12127Q3706J55870l64865k6550q7904
17058C69099r699l5617K2753L79834k74841K25311C04242L24903j04976K85886
17048H10055k68241j85650L69887A12101K30539K57131k85664K92062R1699l4338
17038F63530k70817K08962j24033O7445j4682l1993J12680l679J04788k68089
17028D44112K93729j41992L2062k10152K58468B73305J21474J27866J78695k32225
$$ y = [160192, 1160, 387974, 487087, 347626, -64149, 123469, 510162, 598991, 363405, 156073, 410875, 545060, 683835, 271189, 379894, 395341, 487510, 609915, 718577, 457962, 622413, 620519, 741596, 211930, 623707, 480883, 198549, 532546, 188963, 483476, 488601, 891885, 502742, 229696, 496715, 608842, 692548, 848418, 483553, 457003, 369099, 359400, 323783, 346536, 726370, 451529, 676840, 304242, 629145, 524169, 810055, 541814, 356164, 726051, 112101, 342640, 599771, 314107, 606169, 697868, 663530, 392713, 601675, 477642, 545087, 530405, 498412, 611092, 607413, 712201, 444112, 737841, 595849, 627911, 417759, 676227, 273305, 394779, 522645, 701340, 469115]
17018D69115j852J42126H8095O39447r5076P4137N713N2951A95453M20003k27274
17007C88182L57798l13343K57933O5573k0306K88747D67544J40196j53403M64855
16997I19192p5615j03196J46269r8994p9743M03565l96333j39878L01623j58494
16987G18396j73540m2140M49620p5293j2346k21927J60223L57208k08326j33666
16977H18209j83144K27860J210j72285K21116j29253J99851D48783N50386q5342
16967I13827m47152K57221l5783j453K00363J05513j27161j01723M26866k73759
16957I16759M9952K01640l85805K4136L86896j51999P1159q7956r4332J45949
16947A076399J3468M8360J14868n3961j15578J81644o9591Q8476M0996l45974
$$ y = [469115, 467263, 609389, 88095, 727542, 632466, 706603, 712316, 765267, 195453, 615456, 388182, 745980, 432637, 690570, 756143, 735837, 1024584, 467544, 607740, 454337, 919192, 843577, 740381, 886650, 787656, 707913, 1111478, 715145, 575267, 876890, 718396, 544856, 502716, 952336, 877043, 864697, 642770, 802993, 1160201, 951875, 818209, 635065, 862925, 864135, 691850, 912966, 783713, 983564, 448783, 999169, 913827, 466675, 723896, 688113, 686660, 887023, 992536, 865375, 763652, 1190518, 916759, 966711, 1168351, 782546, 806682, 1193578, 1041579, 1112738, 1024782, 930450, 1076399, 1089867, 1138227, 1253095, 1199134, 1083556, 1265200, 1195609, 1284085, 1325081, 979107]
16937I79107J75005j56327n6310L76146J24316k86681K42951o65066N13543n7856
16927A188828j30497J20155J22987K11418r4091O1972k50871L8458K61230j41261
16917A388328L4355o5677J30423j46107R3679Q4930k05918M21180l19709o3521
16907A351963J27551K58035k68442j00448L99873j90111M9701J24303M8061q4193
16897A716293K94112m84299J90816L4196j03562L58855k07959j4710J9319O2547
16887A865608K62234j86974K96828k50047M861o5356J54826r8474K51554j87240
16877B047820j16720M36037R2125l86895J49028k88538K16106L04041l19347J84850
16867B318507K189J09162K12426j45577n1042N6284O5825J67329j94974J87223
$$ y = [979107, 1154112, 997785, 941475, 1317621, 1441937, 1155256, 1398207, 733141, 1246684, 1188828, 1058331, 1178486, 1301473, 1512891, 1418800, 1480772, 1229901, 1268359, 1529589, 1388328, 1422683, 1357006, 1487429, 1341322, 1435001, 1519931, 1314013, 1735193, 1415484, 1351963, 1479514, 1737549, 1469107, 1368659, 1768532, 1578421, 1628122, 1752425, 1800486, 1716293, 2010405, 1526106, 1716922, 1751118, 1647556, 2006411, 1798452, 1783742, 1803061, 1865608, 2127842, 1940868, 2237696, 1987649, 1992510, 1927154, 2081980, 1983506, 2235060, 2047820, 1931100, 2367137, 2459262, 2072367, 2221395, 1932857, 2148963, 2453004, 2133657, 2318507, 2320696, 2429858, 2642284, 2496707, 2445665, 2501949, 2567774, 2735103, 2540129, 2727352]
16857B727352J82010O2682k34512j56215L68430J65317l26304K12316j44637M81115
16847C337554j17145N5284p4822P5391L27863K8728p6301J76042N26980j41968
16837D117606m59610Q9771K84295N7954m4852J24292j6931L7766N38254k66837
16827D461708Q4364j07523L52422k62749N6701K90460O4844J82608J62176k21291
16817E063720J31255K21701j0294J78281J67747R2412K44612k73489K70555j27627
16807E958873Q62665j96583K14247R6230o8948L27674P0300L35363j82237J43667
16797G561251M22046M86818L61658k10708J33332M58380L35431J35772P9695L98984
16787A0162659O53634l26128L23546L33566N53864J34256M60720K28706N87086
$$ y = [2727352, 2909362, 2972044, 2737532, 2581317, 2949747, 3115064, 2788760, 3001076, 2856439, 3337554, 3220409, 3275693, 3200871, 3276262, 3604125, 3632853, 3556552, 3732594, 4259574, 4117606, 3657996, 3747767, 4032062, 4090016, 4045164, 4169456, 4152525, 4190291, 4728545, 4461708, 4546072, 4438549, 4790971, 4528222, 4584923, 4875383, 4940227, 5122835, 5285011, 5063720, 5194975, 5416676, 5406382, 5584663, 5752410, 5844822, 6089434, 5815945, 6086500, 5958873, 6821538, 6624955, 6839202, 6935432, 6866484, 7194158, 7264458, 7599821, 7417584, 7561251, 7983297, 8470115, 8831773, 8621065, 8754397, 9212777, 9548208, 9683980, 9763675, 10162659, 10816293, 10490165, 10813711, 11147277, 11701141, 11835397, 12296117, 12524823, 13111909]
16778A3111909Q0337R51186J13256K41545N75198N32270M96819L68392N87149
16769A7058061Q45962N96983K57825O56106Q99552O84650R79838P05168Q39639
16760B3523784Q46099J242170R91413Q98433J406947J327896J261293J226067
16752C2724102J767681J450439J883511J472792K207215J973236K417499K269722
16744D8166197K469727K650903L192653K443817L778941L651074L742947M025871
16736G4122130M040712N078331M833311N763836N390246N938776O448973O680163
16728A18296478O875679P030433P265830P319338P193414P010034O215801O351957
16720A73558964N005667M345800L179792K073827P56410m87491j858707l658483
$$ y = [13111909, 13192246, 14143432, 14256688, 14498233, 15073431, 15605701, 16102520, 16470912, 17058061, 17904023, 18501006, 18758831, 19414937, 20314489, 20999139, 21978977, 22684145, 23523784, 24369883, 25612053, 26603466, 27501899, 28908846, 30236742, 31498035, 32724102, 34491783, 35942222, 37825733, 39298525, 41505740, 43478976, 45896475, 48166197, 50635924, 53286827, 56479480, 58923297, 62702238, 66353312, 70096259, 74122130, 78162842, 83241173, 88074484, 93838320, 99228566, 105167342, 111616315, 118296478, 125172157, 132202590, 139468420, 146787758, 153981172, 160991206, 167207007, 173558964, 178564631, 182910431, 186090223, 188164050, 188920460, 188432969, 186574262, 182915779]
16712A82915779m175069n303429n914397o884653p430010p505406p763152p409095
16704A30530568p718961p058238p211410o236231o885140n545334n443080n069558
16696G9362616m796330m546155m109285l894644l721658l443557k559814l213973
16688D9077200k562437k634083k060850k198860k307277j479796j533085j963311
16680C2337501j630558j375093j198065j428705n15050j352383j561341q30296
16672B2446010r02805q57228o21824j197455n04316o45771p62661o69657o20156
16663A5664137n50231l48910m28988p71304j83455o32702o32860o4984l38858
16654A1711845k07562r14745j45685l86059L44001q62617k57934k82513J8688
$$ y = [182915779, 178740710, 173437281, 167522884, 160638231, 153208221, 145702815, 137939663, 130530568, 122811607, 115753369, 108541959, 102305728, 95420588, 89875254, 84432174, 79362616, 74566286, 70020131, 65910846, 62016202, 58294544, 54850987, 52291173, 49077200, 46514763, 43880680, 41819830, 39620970, 37313693, 35833897, 34300812, 32337501, 30706943, 29331850, 28133785, 26705080, 26190030, 24837647, 23276306, 22446010, 21543205, 20685977, 20064153, 18866698, 18362382, 17716611, 16953950, 16284293, 15664137, 15113906, 14764996, 14336008, 13564704, 13381249, 12748547, 12115687, 12050703, 11711845, 11504283, 10589538, 10443853, 10057794, 10401795, 9539178, 9281244, 8998731, 9017419]
16645I017419m02989O6297p83145j4665j19153j38537k79358m00248l44034O59638
16635G261225k35812o91817J24654m59614k9123j46396k21431J9938l1269k64969
16625E325386m103k86228p3665k55247n9978j13141k45415K70736J5127k55967
16615D317505J44223l14758j8816n24347M02898k58226l15676J35492p1760m2618
16605C453917j98115k88579L67842L3020k59128k60478J22147k15000Q2529k1819
16595B816336P1449k41096L9309K49670j64959j71315k18791M41599m52365n2396
16585B317441J15559j78150K32286j57984j9411j68151p6045o5563J50361N4330
16575B204673k46946j77790M79942k40981k55135J77654k06781K72904k35984
$$ y = [9017419, 8614430, 8680727, 7897582, 7882917, 7763764, 7625227, 7345869, 6945621, 6601587, 7261225, 7025413, 6333596, 6458250, 5998636, 5969513, 5823117, 5601686, 5621624, 5590355, 5325386, 5321283, 5035055, 4961390, 4706143, 4646165, 4533024, 4287609, 4558345, 4573472, 4317505, 4461728, 4146970, 4128154, 3603807, 4006705, 3748479, 3432803, 3568295, 3496535, 3453917, 3255802, 2967223, 3335065, 3368085, 3108957, 2848479, 2970626, 2755626, 2838155, 2816336, 2887785, 2646689, 2685998, 2935668, 2770709, 2599394, 2380603, 2822202, 2369837, 2317441, 2433000, 2254850, 2487136, 2329152, 2309741, 2141590, 2065545, 1999982, 2150343, 2204673, 1957727, 1779937, 2259879, 2018898, 1763763, 1941417, 1734636, 2007540, 1771556]
16566A771556K47948j1557k83921K3703j74128j94736N6572L91750l68392p282
16556A451513J89721J05628k71790k89097L50302l44866K15204k04216K55231
16547A457630J58216l39528O4452l29559L78273j26010k30022J52691L2683j65259
16537A053567L0814K37979j84871l9873J0022k71594K77217j11584j06844K05679
16527A100512k49534K02306k9922R9582R0716j72622j49079r5959j73778K62320
16517H84542J53371J01609l99468J57443K3598J65418m2615k92278K33715m18308
16507E67027K90760r1757j9228C29502M21552K0035N7155K06696l3719l90180
16497F11041L05164l84607J73357j23475r4182J94943j11668M32089l15155j70488
$$ y = [1771556, 2019504, 2007947, 1724026, 1747729, 1573601, 1378865, 1435437, 1827187, 1458795, 1451513, 1641234, 1746862, 1475072, 1185975, 1536277, 1191411, 1406615, 1202399, 1457630, 1615846, 1276318, 1340770, 1011211, 1389484, 1263474, 1033452, 1186143, 1218826, 1053567, 1084381, 1322360, 1137489, 1097616, 1107638, 836044, 1113261, 1001677, 894833, 1100512, 850978, 1053284, 1023362, 1122944, 1213660, 1041038, 891959, 796000, 622222, 884542, 1037913, 1139522, 740054, 897497, 921095, 1086513, 1043898, 751620, 985335, 567027, 857787, 766030, 746802, 329502, 751054, 771089, 828244, 1034940, 1001221, 611041, 916205, 531598, 704955, 581480, 487298, 682241, 570573, 1002662, 687507, 517019]
16487E17019j82100L17005K0508j73745M8556J76709n9011j21820k05656L44601
16477F82066k90678N7974L3607K74185k56302O3557K83839l53681Q9732N1245
16467F35544K5171L1932m3691B60057J48521L32543j38390j86211Q9058j65835
16457C39743K4217M02117l62651K31834j67874J3356A4510K52539N4114M7419
16447C68582K05863k76651K14307J24972j12737N8508j78591O4932B03194q5431
16437A17763J50038K3033J23547m7188J24017j78930O372l6567g248D06869M8724
16426D55593r3661j0974L02968L6963j94140J00521j08953j49859K04770k17978
16416C25250D8102N02414A69809K85159B05104r698J0074K18054j89037N1920
$$ y = [517019, 334919, 651924, 672432, 498687, 547243, 723952, 664941, 543121, 337465, 682066, 391388, 449362, 482969, 757154, 500852, 564409, 848248, 494567, 584299, 635544, 660715, 692647, 648956, 260057, 408578, 741121, 602731, 416520, 505578, 339743, 363960, 766077, 403426, 635260, 467386, 480742, 14510, 267049, 321163, 368582, 574445, 297794, 512101, 637073, 524336, 582844, 404253, 469185, 203194, 117763, 267801, 290834, 414381, 367193, 491210, 312280, 318652, 282085, -7248, 406869, 455593, 361932, 350958, 653926, 690889, 496749, 597270, 488317, 338458, 543228, 325250, 48102, 550516, 169809, 454968, 205104, 195406, 205480, 423534, 234497, 286417]
16406B86417L8693b2078B66652J50446P2794m7375A78546J99590o9512M0084O4200
16395D12908P520j68297j17932K02920O9041J74372k32597j03182J0841l920j00404
16384A51270J5327B764L18520L16006B99184m9290J81383A77288a82068f7074
16373C71201J17434A43547b05132D18168K3492i2801C64003A55774K04160a5693
16362C3212J34223J42679N5858o2860A34929J10099G6862P5876P3774L18369B09783
16350a29337B20641F8124J82124C4834L14118j58702a46089O3640C71748j33674
16340B38074B3395K41631a8140r8455A86423Q6830C563L13665J46653A52120L27227
16329D79347e2788B42665k8710E3548J13020M3264f1227E3209L40198B1928P2648
$$ y = [286417, 325110, -22078, 266652, 417098, 489892, 442517, 178546, 378136, 308624, 348708, 412908, 420428, 252131, 134199, 337119, 406160, 580532, 347935, 244753, 255594, 251674, 151270, 166597, 2764, 321284, 637290, 299184, 249894, 431277, 177288, -182068, -67074, 371201, 488635, 143547, -205132, 418168, 441660, -92801, 364003, 155774, 359934, -15693, 33212, 167435, 310114, 365972, 303112, 134929, 245028, 76862, 152738, 226512, 544881, 209783, -129337, 220641, 68124, 250248, 34834, 348952, 190250, -146089, -82449, 371748, 238074, 23395, 265026, -18140, -116595, 186423, 273253, 3563, 317228, 463881, 152120, 479347, -52788, 242665, 213955, 53548, 166568, 209832, -61227, 53209, 393407, 21928, 94576]
16318I4576M8445J78462j01540o7703e2153A51411J49127N9495a9206A14602E7267
16306b03389f4902F1508d91j51449B74643B9942L20488A68365R225l0139L6775
16295A84226J13419K3029j12510K6258A10767J82649a62265F6777L39843a02941
16284a38535I9816K59897A50406A6503J21521m1741J24168D6388K13417A06421
16273B40178r9387i7163m3216B4480b5649B96593H5389O8787c462C6618K510F297
16260a06387G9473K4566g1457A77356E3852N5062a11277L5249A80140i7561A08663
16248a37659A63507h5003A21584J54199C7226E797J54627l58E610a2101G2886
16236C58978A61908m7488n945D2412g4158B6889b15036A64035a33168c7377C54032
$$ y = [94576, 143021, 321483, 219943, 152240, -52153, 151411, 300538, 360033, -19206, 114602, 57267, -203389, -64902, 61508, -491, -151940, 274643, 29942, 350430, 168365, 177590, 147451, 184226, 297645, 320674, 208164, 234422, 110767, 293416, -162265, 66777, 406620, -102941, -138535, 99816, 359713, 150406, 16503, 138024, 96283, 220451, 46388, 259805, 106421, 240178, 140791, -97163, -140379, 24480, -25649, 296593, 85389, 154176, -3462, 36618, 39128, 6297, -106387, 79473, 104039, -71457, 177356, 53852, 108914, -111277, -76028, 180140, -97561, 108663, -137659, 163507, -85003, 121584, 275783, 37226, 5797, 160424, 160066, 5610, -12101, 72886, 358978, 161908, 114420, 108475, 42412, -74158, 26889, -215036, 164035, -133168, -37377, 354032]
16224G9385K5854B575K53373a49844B7741H581J00830k2762m3035J71528a32400
16212G577b10178D5034J9403j666a11714a5662k25388H1059a7076B50693G5240
16200B65565N6312a31873A34472j369N4000a59250A77365H4493K08594h8370f798
16188F8400b877j1259I612d9196n6107M7969k02319m1457H8675d8825A00045f6571
16175B45253c90614B81760a30984C40601d7596J6739G7870K5006J38388C2598
16164b49662H4713c88026a16154B09580e397I0159c3716D4595N6688a78889L3141
16153a45748B7690g9258A51877a70776n1720P0339B00705G2189J47113d9579a4008
16141a8748j39392o5032B18618A9681N8995e6406n4317G3874g5989q6820j21208
$$ y = [79385, 105239, 2575, 255948, -149844, 27741, 8581, 109411, 86649, 43614, 215142, -132400, 7577, -210178, 45034, 64437, 62771, -111714, -15662, -241050, 81059, -17076, 250693, 75240, 265565, 321877, -131873, 134472, 133103, 187103, -159250, 177365, 84493, 293087, -88370, -6798, 68400, -2877, -14136, 9612, -49196, -105303, -57334, -259653, -301110, 88675, -48825, 100045, -66571, 245253, -390614, 281760, -130984, 340601, -47596, -30857, 77870, 102876, 241264, 32598, -249662, 84713, -388026, -116154, 209580, -5397, 90159, -33716, 44595, 101283, -178889, -145748, 27690, -79258, 151877, -170776, -222496, -152157, 200705, 72189, 219302, -49579, -14008, -18748, -158140, -223172, 218618, 19681, 78676, -56406, -110723, 73874, -75989, -162809, -284017]
16130b84017B19622C6539b05512A54077Q1644j04235P6384h6146l014D1756i2094
16118A62235c05349G1989b74358a36857e6795j6584A92283P5852F7443J6875c3783
16106f360k32489I9261p039m3360Q1794b70932A17513c92055H6280P8137c38528
16094D2774K6280J15364G0316e8611n8872e976I1881l6123j0417g9660I2820C8258
16081G8629a93610h0420j79382B31822a39171c046B9738K1728a29851H3097b03537
16069G602L2633h1421A90753g2370E2688M5505A3077d02430a78843h2167j95762
16058b77929I4040g069r7669I5939h720k7521A3397b23420d2719l9940A22327
16046c41958J61917h7762C7980i9899C90809b88395a10654B77154C5809L7182
$$ y = [-284017, 219622, 36539, -205512, 154077, 235721, 131486, 207870, -86146, -89160, 41756, -92094, 162235, -305349, 71989, -274358, -136857, -56795, -73379, 192283, 268135, 67443, 84318, -33783, -6360, -238849, 99261, 92222, 48862, 130656, -270932, 117513, -392055, 86280, 164417, -338528, 42774, 69054, 184418, 70316, -58611, -117483, -5976, 91881, 55758, 45341, -79660, 92820, 38258, 78629, -193610, -80420, -259802, 231822, -139171, -3046, 29738, 51466, -129851, 83097, -203537, 7602, 40235, -81421, 190753, -72370, 52688, 98193, 13077, -402430, -178843, -82167, -277929, 94040, -7069, -104738, 95939, -8720, -36241, 13397, -223420, -42719, -82659, 122327, -341958, -180041, -87762, 37980, -99899, 390809, -288395, -110654, 277154, 35809, 72991]
16036G2991e7950j19119K4206B85888I4360c0678G0387b34943d9598H49d9370
16024b33605a16167e1697H7871b27060C7465e5764D9150a18746k1162d8315k55532
16013c03847a20596k7817a4609j49219N9463K7754r0455J5458N0355j6668A8414
16001b5815A8141a26855J0308A25416P232b61237f0067B2618f8075D3121K06466
15990B49587A14699J00100a17344L7987j28045B46061c176D89668m7002B17293
15979D29186K6966e2318B29288I4263J0807a78352D4563J3943L035a24675n6211
15968a80886A00842L5833a34382A39862a48392c467k46824G6862b7882B8681O6238
15957I4919c80709C2347a33570G2050B4630c91689d7982j36128j78755B77885
$$ y = [72991, -57950, -177069, -152863, 285888, 94360, -30678, 70387, -234943, -49598, 849, -49370, -233605, -116167, -51697, 87871, -227060, 37465, -55764, 49150, -118746, -139908, -48315, -303847, -120596, -148413, -14609, -163828, -104365, -76611, -167066, -151608, -101253, -117921, 18414, -25815, 18141, -126855, -116547, 125416, 132648, -261237, -60067, 22618, -68075, 43121, 249587, 114699, 214799, -117344, -79357, -207402, 246061, -3176, 489668, 442666, 217293, 429186, 456152, -52318, 229288, 94263, 105070, -178352, 44563, 58506, 61541, -124675, -180886, 100842, 136675, -134382, 139862, -148392, -3467, -250291, 76862, -27882, 28681, 94919, -380709, 32347, -133570, 72050, 24630, -391689, -47982, -184110, -362865, 277885]
15946a43890g1779A00825J78984m1970b25073e6315E8679R9906E4627P0920E1568
15934b97771P1498I9769a91270M7826B67504A3034a04832l997B01249g2240j61310
15923b33550B55199g8623G2098M3195R2858i0898m2467n6239c3801D10702a9141
15911f9719A63529c59317i345A12012b55102N0288R1183A22541a00798k40180
15901c40978B31048e28886b14295O1002b1231A97479D1826J1134J00109b86707
15890H9538d09696B05311c0560k75066a10310E5209L2366b99131J23158j15220
15880b91193Q2362N0792A66408h3701j94646J32660m8007j67826J67415f1750
15869D1665J00681d61980A48792O9788b19126B03725C3179K29546a27757b2838
$$ y = [-143890, -71779, 100825, 279809, 237839, -225073, -56315, 58679, 158585, 54627, 125547, 51568, -297771, -226273, 99769, -191270, -143444, 267504, 13034, -104832, -108829, 201249, -72240, -233550, 255199, -78623, 72098, 115293, 208151, -90898, -133365, -189604, -33801, 410702, -19141, -69719, 163529, -359317, -9345, 112012, -255102, -204814, -113631, 122541, -100798, -340978, 231048, -528886, -214295, -153293, -21231, 197479, 41826, 52960, 153069, -286707, 89538, -409696, 205311, -30560, -305626, -110310, 55209, 87575, -299131, -175973, -291193, -208831, -158039, 166408, -83701, -278347, -145687, -193694, -361520, -194105, -61750, 41665, 142346, -461980, 148792, 218580, -219126, 203725, 33179, 262725, -127757, -22838]
15858H0927J18615G3586b23251E8778d634k24968R1955M7979G1130B2095N082
15847B7177J66120E5248K0207a12098K4938F1437M285b76457p7185C9325a39457
15835b10037L9276H8265J11190a10546G9467g8321o2787I835b12872A16321c62452
15823A23694a4885j3621F3493J7759h9983j60652B13644a50250N2665l80k59907
15812c57872F7805h681j30222A10320a84453b5768l0447J7433A38948b9125n0452
15801g9577H0561b12872G304J03157a23487f1486j14082A86572K9090C6355j5690
15790B0665g5853A64521d27598i2362b6415B01298e238k1498j50466A82842c9711
15778A05233a31935J2478k12702E9961a69310e3959C007K52017b41244J7580A67356
$$ y = [80927, 199542, 73586, -223251, 58778, -4634, -229602, -137647, -89668, 71130, 22095, 27177, 193297, 55248, 75455, -112098, -87160, 61437, 65722, -276457, -353642, 39325, -139457, -210037, -170761, 88265, 199455, -110546, 79467, -78321, -141108, 9835, -212872, 116321, -362452, 123694, -14885, -28506, 63493, 81252, -89983, -250635, 213644, -150250, -97585, -97965, -357872, 67805, -8681, -138903, 110320, -184453, -25768, -56215, -38782, 138948, -29125, -79577, 80561, -212872, 7304, 110461, -123487, -61486, -175568, 186572, 215662, 36355, 20665, -75853, 164521, -427598, -92362, -26415, 201298, -5238, -26736, -177202, 182842, -39711, 105233, -131935, -119457, -332159, 59961, -169310, -53959, 3007, 255024, -241244, -223664, 167356]
15766i7142A40147c04883a37192k2949k1724c2264A61800J21890I4522J26032
15756B20554C5835J8955O7451a27832B80010p6096G2562O0417f8191C08239e8248
15744a79602D19852a54501A1398J38652m5281e2957j4571n0017B54932J04974
15734C59906o2603g7108k03246J30378A45831E1050b24579O2145c1211l7830j61505
15723b30546a04976a5332j22032B6299a2323k0478k39008b2503B1971J40499a87473
15711a2439l0127m17263a03428n7116o3199A8702N9576l3587j1724K93982a65476
15699b57395D6285b2380C3459b87984J01062e867A09559e5829B65551n4716B2407
15687e0747B05450E3866K09110b17627J07599B5164g2639a8118r4966B12110i9343
$$ y = [-97142, 140147, -304883, -137192, -160141, -181865, -32264, 161800, 283690, 94522, 220554, 35835, 54790, 122241, -127832, 280010, 203914, 72562, 132979, -68191, 308239, -58248, -179602, 419852, -154501, 11398, 150050, 104769, -52957, -67528, -117545, 254932, 359906, 297303, -77108, -280354, -149976, 145831, 51050, -224579, -162434, -31211, -69041, -230546, -104976, -15332, -137364, 26299, -12323, -32801, -271809, -22503, 21971, 162470, -187473, -12439, -42566, -459829, -103428, -160544, -223743, 18702, 78278, 44691, 32967, 326949, -165476, -257395, 46285, -22380, 33459, -287984, -186922, -5867, 109559, -55829, 265551, 210835, 22407, -50747, 205450, 53866, 262976, -217627, -110028, 25164, -72639, -18118, -113084, 212110, -99343]
15675c042F0433a49790K2802a3943A89836J04721i0357b2796k2468a8603j93990
15664b12593C6344a75369B2046K42350I4904J33686I1683C2515p287a47457f0531
15652B9523K09793r0240e5615E9661d02751J36896a02618B33871r4512c1194A16005
15640C1729b82295a30963C3166b98779A27022a75448K647c672D9856d72640A22328
15628a71607A99834i515C1943c2923G5549g6088A01544a61458B2681J28990Q4908
15617B36579n807j8849h8823m851B10264F4317B4886M4156a98711l3470l4652
15606b66833c8019A47749b50601D32507F3840k6226a4000G7278a76653p6062G6098
15594b1406A15406D6268J1060J78241b64062A28974a06461b9071m9234B0686L9497
$$ y = [-3042, 60433, -149790, -126988, -13943, 189836, 294557, -90357, -22796, -45264, -18603, -212593, 36344, -175369, 22046, 264396, 94904, 228590, 91683, 32515, 25228, -147457, -60531, 29523, 239316, 149076, -55615, 59661, -402751, -265855, -102618, 233871, 139359, -31194, 116005, 31729, -282295, -130963, 33166, -298779, 127022, -175448, -172801, -3672, 49856, -472640, 122328, -171607, 199834, -9515, 31943, -32923, 75549, -76088, 101544, -161458, 22681, 151671, 236579, 230772, 211923, -88823, -93674, 210264, 64317, 24886, 69042, -198711, -232181, -266833, -38019, 147749, -250601, 432507, 63840, 37614, -14000, 77278, -176653, -252715, 76098, -21406, 115406, 46268, 57328, 235569, -264062, 128974, -106461, -29071, -78305, 20686, 60183]
15583F0183R1397a66011A12517L0986g6919g685q0578k57696a32995D6369a25081
15571a2610k39458A39140j4097L8089E1468K32627F7690M33742A413a76668B39530
15559a65906A65920G6825Q8376d4377j86837J12912d4011A2808b12243k12052
15549d24295A00912i5209r7634q7913f6439j9383A82636e08523B1276J95922F2043
15537G9416e8857A208M7847b13485j25317Q7087A55879j5784a46217R424j7390
15526a54183E3810L31859A70671d9281q1405A04131j5611c54684B31470B9524
15515H1697a76201P0211c2203D7295A6559c2869B68684a08426j50011A8464J03773
15504A22237a31977B3370a25795e4019l5309A814g6014C26609g3570A01910b29501
$$ y = [60183, 151580, -166011, 112517, 143503, -76919, -7685, -88263, -345959, -132995, 46369, -125081, -12610, -252068, 139140, 125043, 163132, 51468, 284095, 67690, 501432, 1413, -176668, 239530, -165906, 165920, 76825, 165201, -44377, -231214, -118302, -44011, 12808, -212243, -424295, 100912, -95209, -192843, -280756, -66439, -85822, 182636, -508523, 21276, 217198, 62043, 79416, -58857, 1208, 49055, -213485, -338802, -251715, 155879, 140095, -146217, -136793, -154183, 53810, 385669, 170671, -49281, -130686, 104131, 88520, -354684, 231470, 29524, 81697, -176201, -105990, -32203, 47295, 16559, -32869, 268684, -108426, -258437, 18464, 122237, -131977, 23370, -125795, -54019, -89328, 1814, -76014, 326609, -73570, 101910, -229501]
15492A3593g4804G643A752a35634c5621j67655a2662D1279N8265a64384j32075
15481b96459a28699M9487A97187a75033q9164K9345d6922H9139b24999r2541A30814
15469g1187j24898j68280c6820j16020A78807j4503E6398b24002b5239k30714
15459b55953C24878c75105i1711j05745I8415L4057a63671e1320k74795H5324
15448B79096f202A5114a93826k01266a84660P983f35G0769k9841J23313j3839
15437A50402c43400d9054r2205B36150b1478I7379e3717k07616J6671B9291e6131
15425B04771q8251b22430d6967j60273A46132a71703f1438G3425L6743g7424j02635
15414a80059D8287a35509A79280Q3729O805A01465J4524a17243C4317K99133I8067
$$ y = [13593, -74804, 7643, 1752, -135634, -35621, -203276, -12662, 41279, 99544, -164384, -296459, -128699, -79212, 197187, -175033, -264197, -234852, -46922, 89139, -224999, -317540, 130814, -71187, -196085, -364365, -36820, -152840, 178807, 164304, 56398, -224002, -25239, -255953, 324878, -375105, -91711, -197456, 98415, 132472, -163671, -51320, -326115, 85324, 279096, -6202, 15114, -193826, -395092, -184660, -176677, -635, 70769, 40928, 164241, 150402, -343400, -49054, -141259, 236150, -21478, 97379, -53717, -261333, -244662, 29291, -56131, 204771, 116520, -222430, -46967, -207240, 146132, -171703, -61438, 73425, 110168, -77424, -180059, 48287, -135509, 179280, 263009, 269814, 101465, 115989, -117243, 34317, 333450, 98067]
15402D5888K84179j56234b9134n1681B04336a53030l1360j227K0109b2028j10483
15391a32511g372j9573A19106E3916a68231A5358e7852E7757P9509J96516D9980
15379e3023k24864a13005a460j04987o9512C2581a01242J3882A30922a54440B05026
15367I3288J33175q6014a66594B04130j0562i6252A02547a35322j34146C5017
15356A64144c971G064g8676b1667A632a08426G2526e9280B66063c99760J57765
15345b41995c6284A2597P6135b36k24739b4204j92133g526q1654m3394D78777
15333B7357b7320B48020h367o4432L5927q1969F4993J94155a803B53638A25551
15321B342N6652L3224a95681L7617B98069B2837M308Q9210B3500J15967L2204
$$ y = [45888, 330067, 173833, -29134, -80815, 204336, -153030, -184390, -185617, -165508, -22028, -132511, -7372, -26945, 119106, 53916, -168231, 15358, -57852, 57757, 137266, 333782, 49980, -53023, -277887, -113005, -1460, -106447, -175959, 32581, -101242, -87360, 130922, -154440, 205026, 93288, 226463, 140449, -166594, 204130, 193568, -96252, 102547, -135322, -269468, 35017, 164144, -3971, 7064, -78676, -21667, 1632, -108426, 72526, -59280, 266063, -399760, -241995, -36284, 12597, 88732, -236, -224975, -24204, -216337, -7526, -89180, -132574, 478777, 27357, -27320, 248020, -8367, -72799, -36872, -118841, 64993, 259148, -1803, 253638, 125551, 2342, 58994, 92218, -195681, -158064, 298069, 22837, 27145, 116355, 23500, 139467, 171671]
15310A71671f6612j28558B8937K23470D7839a38802A09949P4724l6610p3365f6418
15298B0490b30430B81137e7824q0650C23991h7283E5969p359a04164B8190f8389
15286B86664r0184m6926a22804A04383b33678A04851o790D5752J70341p5683c050
15274a11206L95I8688J69787O3674A57670J45414b3923B5708a84672a6871H2119
15262A91463o5117R2519K91269a92795A70961H0220B9077N5389J6624l841J5755
15251A13004J20738I6909J41297K78538O54682L24428n8356l07313j50309B45272
15240h8951A29191l8296J58318D842K48844K7145i6817C5277g5538B56514G7587
15228C9591c1179I5914b01055F9754d2162G3828d8508A37396A995d0970B02697
$$ y = [171671, -66612, -195170, 28937, 252407, 47839, -138802, 109949, 184673, 148063, 74698, -66418, 20490, -230430, 281137, -57824, -138474, 323991, -87283, 55969, 48610, -104164, 28190, -68389, 286664, 196480, 149554, -122804, 104383, -233678, 104851, 98061, 45752, 216093, 140410, -3050, -111206, -110811, 98688, 268475, 332149, 157670, 303084, -23923, 25708, -184672, -16871, 82119, 191463, 126346, 218865, 510134, -192795, 170961, 80220, 29077, 84466, 101090, 97249, 113004, 233742, 96909, 238206, 516744, 1171426, 1495854, 1437498, 1130185, 979876, 245272, -88951, 129191, 90895, 249213, 4842, 253686, 280831, -96817, 35277, -75538, 256514, 77587, 39591, -31179, 95914, -201055, 69754, -42162, 73828, -48508, 137396, 1995, -40970, 202697]
15216A17709D5119K7921L5433E661J39127l6908k2881k6951b78613B43686a92042
15204A39644D4228g9552A83454a27202C5590J69588J21578e2221A70211l8721
15194A31490J1643a02270d7588l4965A4205e7816j86725f5930D9877K06518f7483
15182I2947k4782b2932C17713c21355o1889a9279C21300A08163C4900L08283H8593
15170b88136B88805c0128I7080J09694a73544j02395c0082G6397B5559A0964b7875
15158d705A8429J30187h5770p823B87235j17058k2852J98387j27297i1053A16530
15146A27081K9623J827g329A92258b5929j92690b9011j63089I6074b25140B56779
15134A78098g6831C19717b41283A80547a24532A45897C5119b67439A2935J56965
$$ y = [117709, 45119, 73040, 108473, 5661, 144788, 107880, 84999, 58048, -278613, 243686, -192042, 139644, 44228, -79552, 183454, -127202, 35590, 205178, 326756, -52221, 170211, 131490, 143133, -102270, -47588, -82553, 14205, -57816, -244541, -65930, 49877, 256395, -67483, 92947, 68165, -22932, 317713, -321355, -383244, -19279, 321300, 108163, 34900, 343183, 88593, -288136, 288805, -30128, 97080, 206774, -173544, -275939, -30082, 76397, 25559, 10964, -27875, -4705, 18429, 148616, -85770, -93593, 287235, 170177, 147325, 345712, 218415, -91053, 116530, 127081, 156704, 158531, -7329, 192258, -25929, -218619, -29011, -192100, 96074, -225140, 256779, 178098, -76831, 319717, -241283, 180547, -124532, 145897, 35119, -267439, 12935, 169900]
15124A69900M7246l2305P0532j19185E1553J20774J4572K3326f8465E4571h9258
15112A56796B8013O5990J28493L5816A409K28338c0337A17245O349J52323M5341
15101C21258A45712D9034Q9655H028K99918J72448C4258J8488a33897B8527g3132
15089B09201L594o3163L6224J50881A46542j4496M43340b90122a31151B62623
15078i8936A54411J16604q446b21320B34873B8947J18707b0016B68212J17572
15068C85784A44663l9341e3824B21494N5974A16131m1855L3245J17064d1560A19292
15056I4537b08791E5695M08918A70060J06667H1267K96488E2354K22328b7081
15045c5705E1758K3354L20583j90050B1373M71067B19685m6748K44496A80324
$$ y = [169900, 217146, 184841, 255373, 136188, 51553, 172327, 186899, 210225, -68465, 54571, -89258, 156796, 28013, 94003, 222496, 258312, 1409, 229747, -30337, 117245, 123594, 275917, 321258, 145712, 49034, 138689, 8028, 307946, 480394, 34258, 52746, -133897, 28527, -73132, 209201, 212795, 149632, 185856, 336737, 146542, 132046, 575386, -290122, -131151, 262623, -98936, 154411, 271015, 262569, -221320, 234873, 28947, 147654, -20016, 268212, 385784, 144663, 105322, -53824, 221494, 277468, 116131, 74276, 107521, 224585, -41560, 119292, 94537, -208791, 55695, 464613, 170060, 276727, 81267, 377755, 52354, 274682, -27081, -35705, 51758, 75112, 395695, 205645, 21373, 492440, 219685, 172937, 417433, 180324]
15034H7838F315M94369g4855B11781k8126K71203H3600J57269M9223m7941j4228
15023B27923K59427c4842B02218J21531J1164A23155g4478D58013a54576C84795
15012B44512F224P4785l5129K28406A30989a38632F8937N2667K56677A26814K30348
15001C57162q5229D4646L0902K77516E7937J60866p8534J63975o9747R529J4278
14990B58304J0697K02583I3875E105J44611D9790N37478k54428m4033h640A84481
14978A15056L35048b0828D34839B1827J61959K33983G2627K57595f7669D32319
14967A29780J24766J53939j61377P4797n6116A08112J09674A980b30561D31927
14956D97038j99076D4026N3394j1393J63923q5191f5137C17278K32241j75496
$$ y = [87838, 6315, 500684, -74855, 211781, 183655, 454858, 83600, 240869, 290092, 242151, 227923, 487350, -34842, 202218, 323749, 334913, 123155, -74478, 458013, -154576, 384795, 244512, 6224, 81009, 45880, 274286, 130989, -138632, 68937, 121604, 378281, 126814, 357162, 271933, 44646, 75548, 353064, 57937, 218803, 140269, 304244, 234497, 244026, 258304, 269001, 471584, 93875, 5105, 149716, 49790, 587268, 332840, 288807, -8640, 184481, 115056, 450104, -20828, 434839, 21827, 183786, 417769, 72627, 330222, -67669, 432319, 129780, 254546, 408485, 247108, 321905, 265789, 108112, 217786, 1980, -230561, 431927, 497038, 297962, 44026, 97420, 86027, 249950, 164759, -65137, 317278, 549519, 374023]
14946C74023G4252L16609a07155A70058K18964j73334l4309D8949e7709C42021
14935C53944D3676L14089K60194A10068a03349I6013M68208A84477J76606j54181
14925B06902J12737k8002m5234N9393l8129J62282I0161O16532k06899k13227
14915B86567R0788q5965J09329A72332l7824J9433K53545B5772K80565j24785
14905A81552k1688m4451K63930A43598a45112D11387G9466K3691J84414L49296
14895F36867k77971J75261j24900j22041J20443a06416D5786N21823A75177J63812
14885C38989A14509K28835J55803k18934L53901B95692p8299K75181B41520P7210
14875C18730P4163j16814N38J02571J33126j85633J56727j00409j46502k8214
$$ y = [374023, 74252, 390861, -107155, 170058, 389022, 215688, 181379, 48949, -57709, 342021, 353944, 43676, 357765, 617959, 110068, -103349, 96013, 564221, 184477, 361083, 206902, 319639, 291637, 246403, 305796, 267667, 429949, 90161, 706693, 499794, 286567, 377355, 291390, 400719, 172332, 134508, 153941, 407486, 25772, 306337, 181552, 159864, 115413, 379343, 143598, -145112, 411387, 79466, 103157, 287571, 636867, 358896, 534157, 409257, 287216, 407659, -106416, 45786, 567609, 175177, 338989, 114509, 343344, 499147, 280213, 634114, 295692, 217393, 492574, 241520, 318730, 392893, 276079, 276617, 379188, 512314, 326681, 483408, 382999, 236497, 208283]
14865B08283K68701j86004j5023k4409J25588j18809J02808J5165j34929N6148
14855B97519O8310j75899L90956A39263L31325L6583n9869M5171J47499B78772
14844D26270p5562L68459l27111j58127K21838k20593J32174L27871k50304j67100
14834B77815J33288J68738j10854j02184q1610L43618j70957D6351O67063k68409
14824D45005P6732M0011j26876K14266M3173k36034P6275A06536L24017n3948
14814C76605J31247j73501R7252L09171O7341m02543J0263j02824o1136J52448
14804D04323K16680j17087J02817j38529A35883Q1773M1134L77764k69814L12905
14794F79645k65480k9371j65347M58735l35432K19368J67592l26847K27527n6584
$$ y = [208283, 476984, 290980, 275957, 251548, 377136, 258327, 361135, 376300, 241371, 297519, 365829, 189930, 580886, 139263, 470588, 507171, 447302, 492473, 639972, 278772, 426270, 350708, 719167, 392056, 233929, 455767, 235174, 367348, 695219, 444915, 277815, 411103, 579841, 468987, 366803, 285193, 628811, 457854, 46351, 713414, 445005, 521737, 561748, 434872, 649138, 692311, 456277, 532552, 106536, 430553, 376605, 507852, 334351, 431603, 740774, 808115, 405572, 415835, 313011, 251875, 404323, 621003, 503916, 606733, 468204, 135883, 217656, 258790, 636554, 366740, 679645, 414165, 384794, 219447, 678182, 342750, 562118, 729710, 402863, 630390, 573806]
14784E73806m2898Q5828j76481p0099J08629n7770p7072J52360k9935Q9767A64751
14772E19022J75050j95387J2055m9966K89645k68004A13627M09479J70559K90651
14762I84316C74114J06925m5939o31K82711l40543L87550k33696N5047O7970k93389
14751C60119M52531j88337n6844J31250k66191K03819J7867k14074L81707l40318
14741D81529p6568L69661k36354M7599L65673l61576j33915L58571j70928q2511
14731E61181Q3503o911J22840B23761N09142j36763M95167l19670j02607J27912
14721G96942j08968j57496J88635O999K5700j36524L15062l62043M01962l29257
14711F41012K33602p7786J18997j68458k25779K12286L96803m27005J68611J31026
$$ y = [573806, 530908, 616736, 440255, 370156, 478785, 421015, 343943, 496303, 466368, 556135, 164751, 519022, 694072, 498685, 510740, 460774, 750419, 482415, 113627, 523106, 693665, 984316, 374114, 481039, 435100, 434469, 717180, 376637, 764187, 530491, 585538, 653508, 360119, 812650, 624313, 567469, 698719, 432528, 636347, 654214, 440140, 821847, 481529, 404961, 774622, 538268, 585867, 951540, 589964, 456049, 814620, 643692, 561181, 644684, 637773, 760613, 223761, 732903, 596140, 1091307, 771637, 669030, 796942, 687974, 530478, 719113, 726112, 751812, 615288, 930350, 568307, 970269, 641012, 874614, 796828, 915825, 747367, 521588, 733874, 1130677, 703672, 872283, 1003309]
14701A003309j39649k87184J08274L11873q8702J61365j40482k22643K57879k95390
14691F68650N7769J18829l9175K16752o3884j2276k86465O1893R3539L03173l02075
14680H16730K95918n41585L59881O9832j91520M28162m14924J70651j01631k40448
14670F51066O07316F22715L42827j25844j25498J90796J27996r6186J94663j47598
14660I83871Q8159j85047K1065M27642l77358R2233j30010J71825k9415K9452
14650A092417J37442k71913r2006L46164o0723L08809l85128O2925j24524M32789
14640A446252j61765j52005J01846j30379K21843j44547K41688l81420Q1637m8680
14630A074470L37263q7330k00524L43694n4405j85900L30067l94081K68803n37880
$$ y = [1003309, 863660, 576476, 684750, 996623, 907921, 1069286, 928804, 706161, 964040, 668650, 726419, 845248, 806073, 1022825, 958941, 946665, 660200, 722093, 815632, 1118805, 816730, 1112648, 571063, 930944, 1000776, 809256, 1237418, 822494, 993145, 891514, 651066, 1258382, 622715, 965542, 839698, 714200, 904996, 1032992, 936806, 1131469, 983871, 1072030, 886983, 908048, 1335690, 958332, 1050565, 920555, 1092380, 1062965, 1092417, 1229859, 957946, 865940, 1212104, 1151381, 1460190, 1075062, 1137987, 1013463, 1446252, 1284487, 1132482, 1234328, 1103949, 1325792, 1181245, 1422933, 1041513, 1123150, 1074470, 1411733, 1324403, 1123879, 1467573, 1413168, 1227268, 1557335, 1163254, 1432057, 894177]
14620H94177O08371J58538m50175N325K13403j2125J79379k21770k01659M9879
14610A223343L11203o887l31856K65598r7429K83011O0970k89427J63735j1814
14600A570447l26446P4928K56050o902k19674K12377l60860P00155j79994j04235
14590A615846j92683L68499o3217J5453j18870Q4608J9622J48009j03338j9151
14580A754778n8825L90974K03826l07180l36857J01510M43509k02507R3248J35350
14570B217826j07928L5125j46729M44941j45187q2239J0966K01392j54268M17565
14560B691464j50121J56930j42129K74578N37867j13485j20700M91490R37283
14551D563177K86451J608560K366001M579593Q892587J3636156J324637A7343381
$$ y = [894177, 1502548, 1661086, 1210911, 1216236, 1429639, 1417514, 1596893, 1375123, 1173464, 1223343, 1534546, 1527659, 1195803, 1461401, 1363972, 1646983, 1707953, 1418526, 1582261, 1570447, 1244001, 1318929, 1574979, 1568077, 1348403, 1560780, 1199920, 1900075, 1720081, 1615846, 1423163, 1791662, 1728445, 1743898, 1625028, 1709636, 1729258, 1877267, 1773929, 1754778, 1695953, 2086927, 2290753, 1983573, 1646716, 1748226, 2191735, 1989228, 2082476, 2217826, 2109898, 2145023, 1998294, 2443235, 2298048, 2215809, 2226775, 2428167, 2273899, 2691464, 2541343, 2698273, 2556144, 2830722, 3368589, 3255104, 3134404, 3625894, 4563177, 4849628, 6458188, 8824189, 13403782, 22296369, 35932525, 37257162, 17343381]
14542H812699l014621k604631p72575k63089l58494M1757J3456R5290k30421N1306
14532A770677K21694n8579j77197K49410J52902P7919j80407M21581j57726O0864
14522B381138l62157N49678k48135Q4752K74607l04815J66951J177j57672J90724
14512B576248L6692j07849K92329l8027J20548k60839L12846M7217l52891L98700
14502C024974m02983K59286k8144K69891K23820m32338Q7857L22337l21203M03071
14492C406568j75999j21865J92640k25796L23777P4873l02606M86070j15084p2306
14482C470272L02460k73535j4468K4828J30565M5133Q1831R5082M8103p0774K24581
14471D064078k73345L94449j39472K83112m32018M80313j96510J07585M02936
$$ y = [8812699, 5798078, 3193447, 2420872, 2157783, 1799289, 1841046, 1854502, 1949792, 1719371, 1770677, 1992371, 1933792, 1756595, 2006005, 2158907, 2236826, 2056419, 2478000, 2320274, 2381138, 2018981, 2568659, 2320524, 2405276, 2679883, 2375068, 2542019, 2543196, 2385524, 2576248, 2612940, 2505091, 2797420, 2759393, 2879941, 2619102, 2931948, 2979165, 2626274, 3024974, 2621991, 2881277, 2853133, 3123024, 3346844, 2914506, 3002363, 3324700, 3003497, 3406568, 3230569, 3108704, 3301344, 3075548, 3399325, 3474198, 3171592, 3657662, 3542578, 3470272, 3772732, 3499197, 3484729, 3509557, 3640122, 3685255, 3767086, 3862168, 3910271, 3839497, 4064078, 3790733, 4185182, 4045710, 4328822, 3896804, 4377117, 4180607, 4288192, 4691128]
14462D691128k43360J44412n8085P9373k8734j47171K01613K33816J42103Q8034
14452E103129p7060j1081J59052K33557j52606J21306l0410R6003J99942p1098
14442E570734K01641M8603l46554N13773J00705k50749K71486k80575O29968O4663
14432F523695l45239L78221n9718M29320P5925k11342K7867J04743M88605k46974
14422G165103n9149K21146L38305J04784j31493M67623j27630L77521q8826J46782
14412H414166N5907J5259M96648o0085m6613L3455K84802J29247K24500P9089
14402I626375o3208L09798P1898K62313L81808l16753N39131k7359K29925L80553
14392A1394481L59925m20003N54216J22805O29630j95624J72716N66719j24943
$$ y = [4691128, 4447768, 4592180, 4534095, 4613468, 4584734, 4437563, 4639176, 4872992, 5015095, 5103129, 5026069, 5014988, 5174040, 5407597, 5254991, 5376297, 5345887, 5441890, 5641832, 5570734, 5772375, 5820978, 5474424, 5988197, 6088902, 5838153, 6109639, 5829064, 6459032, 6523695, 6178456, 6556677, 6496959, 6926279, 7002204, 6790862, 6818729, 6923472, 7412077, 7165103, 7105954, 7327100, 7665405, 7770189, 7638696, 8106319, 7978689, 8356210, 8267384, 8414166, 8470073, 8485332, 8981980, 8921895, 8875282, 8908737, 9193539, 9322786, 9547286, 9626375, 9563167, 9872965, 9944863, 10207176, 10588984, 10272231, 10811362, 10784003, 11013928, 11394481, 11754406, 11334403, 11888619, 12011424, 12641054, 12445430, 12618146, 13184865, 13059922]
14383A3059922N31771L01459J67408K22805R5495M33473P1405K89984L06979l9736
14373A5440965P39751M03002L08750J62795L15877K41530N66090K81693L94631
14364A8855084O39321K02669M99261L04237K89083N17215O73567M85941N73244
14355B3039622M47684N45607N69676L79954Q54933P29394M80793R51128J018796
14346B9017587K92885P02095R18054Q41404Q74851O25306R29787R23036J102822
14337C6227827J079282J116427Q77745J216495J239994J678580R66140J081562
14329D5484052J830035J337508J745246J527951K092174J434356J613617K270423
14321E9335362J766529K394827K294786K524854K474187K654478K851586L087054
$$ y = [13059922, 13591693, 13893152, 14060560, 14283365, 14378860, 14812333, 14883738, 15173722, 15480701, 15440965, 16180716, 16583718, 16892468, 17055263, 17371140, 17612670, 18178760, 18460453, 18855084, 19494405, 19697074, 20196335, 20500572, 20789655, 21306870, 21980437, 22466378, 23039622, 23487306, 24032913, 24602589, 24982543, 25837476, 26566870, 27047663, 27998791, 29017587, 29310472, 30012567, 30930621, 31772025, 32646876, 33272182, 34201969, 35125005, 36227827, 37307109, 38423536, 39301281, 40517776, 41757770, 43436350, 44402490, 45484052, 47314087, 48651595, 50396841, 51924792, 54016966, 55451322, 57064939, 59335362, 61101891, 63496718, 65791504, 68316358, 70790545, 73445023, 76296609, 79383663]
14313G9383663K994510L416809L327346L935055L669250M203489M451933M334494
14305A09716549N007971N314878N433981N699266O313260O890276O725365P272985
14297A58374531P892477Q169697Q880489Q784784R937854J0010262J0453363J1474559
14289B33978016J2114550J2343642J2741236J3763166J3678049J4054271J4849143
14282C27522073J4296495J5078857J4418698J4080138J3625087J2832632J1281353
14275D23135333R366685O038667K518661J740251N94918j144665K180565k628705
14267D41801710l759627o472319r728329j1989677j3189366j4602837j5375443
14260C66684112j5737841j5676342j5852147j5631271j4997978j4499291j3970816
$$ y = [79383663, 82378173, 85794982, 89122328, 93057383, 96726633, 100930122, 105382055, 109716549, 114724520, 120039398, 125473379, 131172645, 137485905, 144376181, 151101546, 158374531, 166267008, 174436705, 183317194, 192101978, 202039832, 212050094, 222503457, 233978016, 246092566, 258436208, 271177444, 284940610, 298618659, 312672930, 327522073, 341818568, 356897425, 371316123, 385396261, 399021348, 411853980, 423135333, 432502018, 438540685, 441059346, 442799597, 443394515, 442249850, 444430415, 441801710, 438042083, 431569764, 421841435, 409851758, 396662392, 382059555, 366684112, 350946271, 335269929, 319417782, 303786511, 288788533, 274289242, 260318426]
14253B60318426j2656009j2309563j2302141j1888262j0904701j0151603r520719
14246A80585428r020201q313714p674095p537880p149109o501218o678278n711273
14238A21999660n423929m793300n219701m483048m328049l971617m006688k712938
14230H7060390l836472l330327l116375k933568l153650k128473k770188k608704
14222F3182633j749202k104068k216555j907401j976075j849473j572612j470058
14214D8337189j496684q14216j764440j513946j301341q29932j332282n27843
14206C8756505r72568j559208j175591r07147j038666p47910m62997r85054r07541
14197B9999823r04226n54133o63870n34785r02992m49351q83424m38496o09654
$$ y = [260318426, 247662417, 235352854, 223050713, 211162451, 200257750, 190106147, 180585428, 171565227, 163251513, 155577418, 148039538, 140890429, 134389211, 127710933, 121999660, 116575731, 111782431, 106562730, 102079682, 97751633, 93780016, 89773328, 87060390, 83223918, 79893591, 76777216, 73843648, 70689998, 68561525, 65791337, 63182633, 61433431, 59329363, 57112808, 55205407, 53229332, 51379859, 49807247, 48337189, 46840505, 46026289, 44261849, 42747903, 41446562, 40616630, 39284348, 38756505, 37783937, 36224729, 35049138, 34141991, 33103325, 32355415, 31892418, 30907364, 29999823, 29095597, 28541464, 27877594, 27342809, 26439817, 25990466, 25107042, 24668546, 24058892]
14188B4058892r16843l51788n78656o44952j1831o19735l74237m38452n49433
14179A9572965k96560n26148n59933k66003k60357k39379o36874k73219k91008
14170A6223484j45150l20991k71925l72799k63740l53181l02938l92798k60397
14161A3539565n4347k40024j12871j2920n56594j87652k7548m47850k07811L0603
14151A1722551j57327l91759j71944k61671j19678l63636J19010l60505J29408
14142A0144449k79482l12244J95818p2821k87248l58361j75063J82308l00184
14133H737172j48280J53188n08020m8735k15364R7789j6777m13053l5774J61506
14123G763652j81969m8151k56300J64147l42170K0315J34151m41444k14136j75046
$$ y = [24058892, 23142049, 22790261, 22211605, 21566653, 21554822, 20935087, 20560850, 20122398, 19572965, 19276405, 18750257, 18190324, 17924321, 17663964, 17424585, 16787711, 16514492, 16223484, 16078334, 15757343, 15485418, 15112619, 14848879, 14495698, 14192760, 13799962, 13539565, 13485218, 13245194, 13132323, 13119403, 12562809, 12375157, 12347609, 11899759, 11691948, 11722551, 11565224, 11173465, 11001521, 10739850, 10620172, 10256536, 10375546, 10015041, 10144449, 9864967, 9552723, 9748541, 9675720, 9388472, 9030111, 8855048, 9037356, 8737172, 8588892, 8742080, 8234060, 8185325, 7969961, 8067750, 8050973, 7637920, 7602146, 7763652, 7581683, 7533532, 7277232, 7441379, 7099209, 7119524, 7253675, 6812231, 6598095, 6423049]
14113F423049M73659m00391k54304K73991l90318j52169K95733l17717K1511J0810
14103E983854j67109j17714K6454r8734l97368k55964N06070R8340l42597j93507
14093E041725j95957K90984k44801M31784k58786p5158j70610j19836j16939J23073
14083D705479j06273L4721J16049j67055k93777K27425n2614j18506j06249P7845
14073D317045j15143l18139M15778o52141J19557R1845p5424J85559k02759l378
14063C762800L49940j08241l94582j8162J90426M22170l5450n50967q2660L17167
14053C852441j42040j64660J18840r5131l60351k0553J70537m7231M2163l65231
14043B988784k9221L29451k75560q4743L5902j43077K91683k81976K13318j09868
$$ y = [6423049, 6896708, 6496317, 6242013, 6516004, 6125686, 5973517, 6269250, 5951533, 5973044, 5983854, 5816745, 5699031, 5725485, 5626751, 5229383, 4973419, 5479489, 5577829, 5235232, 5041725, 4845768, 5136752, 4891951, 5323735, 5064949, 4989791, 4819181, 4699345, 4582406, 4705479, 4599206, 4633927, 4749976, 4582921, 4289144, 4516569, 4463955, 4345449, 4239200, 4317045, 4201902, 3883763, 4299541, 3647400, 3766957, 3858802, 3783378, 3968937, 3766178, 3762800, 4112740, 4004499, 3609917, 3591755, 3782181, 4204351, 4168901, 3617934, 3535274, 3852441, 3710401, 3545741, 3664581, 3569450, 3209099, 3188546, 3359083, 3311852, 3354015, 2988784, 2959563, 3289014, 3013454, 2928711, 2964613, 2821536, 3113219, 2831243, 3044561, 2934693]
14033B934693j13105L88777j05538l67119r2273J80714k11358k78674L75615m6710
14023B665022n5200n2967r600j45275j74830L48787k67035q9493l4315Q0275K9190
14012B294559J46030K0441l62923N22790k47870m08268K37871l4504r1181K1995
14002B098940R4839L8943j30469K34506l6664m38943K19351k85055O91081n68044
13992A918485P4309M87908R19524J818518L027832Q399073J4519548Q314137j7086068
13983B2393266j1046778m187527j865505r09987o03290o20451k95967N0489k92606
13974B621644Q0085j42080k27168j08930k19007K25854J79036j88483K46990l81101
13964B086840O867j69641K6599P6721l01468Q4804M2772L83575k48784o0063k75757
$$ y = [2934693, 2821588, 3210365, 3104827, 2737708, 2645435, 2826149, 2614791, 2336117, 2711732, 2665022, 2609822, 2556855, 2547255, 2401980, 2227150, 2575937, 2308902, 2219409, 2185094, 2265369, 2294559, 2440589, 2461030, 2098107, 2620897, 2373027, 1964759, 2202630, 2168126, 2076945, 2098940, 2193779, 2232722, 2102253, 2336759, 2300095, 1861152, 2080503, 1795448, 2486529, 1918485, 1992794, 2480702, 3400226, 5218744, 8246576, 16645649, 31165197, 39479334, 22393266, 11346488, 7158961, 5293456, 4383469, 3780179, 3159728, 2863761, 2914250, 2621644, 2701729, 2559649, 2332481, 2223551, 2004544, 2230398, 2409434, 2220951, 2467941, 2086840, 2093707, 1924066, 1950665, 2027386, 1725918, 1810722, 1853494, 2237069, 1988285, 1928222, 1652465]
13953A652465K62589K798l95744K38811L6015j73244L53914o8668l26150N25830
13943B108616m58227J59426n1896j30751k22615K99728K2946R0248Q7029m47486
13933A457018R5561M648n5947M5274M51835o36706K40730k22648K05623m904j83631
13922A396853M9272J17493o3398Q4946m3305Q0380j92342O7395q6861K29939k61454
13911A378918k45124L3513K35821q4845j2015M2939K4221n6525j8676j29696R0319
13900A258850J51064P087K0249j69014j82220J98008k1578k28065K8865J94848
13890A258094P1125l39382Q3874J57314Q9424k72235K79082n7420j90033l12721
13880G67122L39752j63075J24893P9160k4414L88972n56714J42711j23918l878
$$ y = [1652465, 1915054, 1917852, 1522108, 1760919, 1796934, 1623690, 1977604, 1908936, 1582786, 2108616, 1650389, 1809815, 1757919, 1627168, 1404553, 1704281, 1727227, 1817475, 1904504, 1457018, 1552579, 1557227, 1501280, 1546554, 1998389, 1361683, 1602413, 1379765, 1585388, 1580484, 1396853, 1446125, 1563618, 1500220, 1585166, 1541861, 1622241, 1429899, 1497294, 1410433, 1640372, 1378918, 1133794, 1167307, 1403128, 1318283, 1306268, 1349207, 1373428, 1316903, 1298227, 1168531, 1258850, 1409914, 1417001, 1437250, 1268236, 1086016, 1284024, 1262446, 1034381, 1063246, 1258094, 1329219, 989837, 1073711, 1231025, 1320449, 1048214, 1327296, 1269876, 1079843, 767122, 1106874, 943799, 1068692, 1147852, 1123438, 1512410, 955696, 1098407, 974489, 970611]
13870I70611J73428J77886o29376M35067m7824j40041R4675J50398E55901L70538
13860I26439L55550j08136k43733K32321q107p2545J15743m10540J08184J48795
13850A043971j78524J15086K34277l67526O9594P147N3165o4692k69033K9400
13840F72865J47073q9511K34993J35490J56975k62349j55656j87214q3833M89673
13830A058506j95741k17425J21348P7726K65940q9765l50645J14849L15737k28650
13820H71880k86799M30060p6295o6571Q7148l6150k72150Q8810o6208o6708p8694
13809E28323L78713J65465j68278k53398K66962o2309q0842k1379N623l46001
13799D12879M49218j98240Q2596K16237k89697J0207q5502Q5483N88306o01329
$$ y = [970611, 1144039, 1321925, 692549, 1127616, 1079792, 939751, 1034426, 1184824, 555901, 926439, 1281989, 1173853, 930120, 1162441, 1154334, 1081789, 1197532, 786992, 895176, 1043971, 865447, 980533, 1214810, 847284, 916878, 924025, 977190, 912498, 643465, 672865, 819938, 730427, 965420, 1100910, 1257885, 995536, 839880, 652666, 568833, 1058506, 862765, 645340, 766688, 844414, 1110354, 1020589, 669944, 784793, 1100530, 871880, 585081, 1015141, 938846, 872275, 959423, 923273, 651123, 739933, 673725, 607017, 528323, 907036, 1072501, 904223, 650825, 917787, 855478, 774636, 753257, 758880, 412879, 862097, 663857, 746453, 962690, 672993, 683200, 597698, 683181, 1271487, 670158]
13789F70158m1986N59349E60915K85651J7149k22400j03219M195L40963J08877
13779I92131l54349M2312J71609Q4249m10707j08773J47978J64752j87979K35855
13769G77078l21566L85770q4980m5844j57337K14670P8830l405k57687M09279
13759I94808m00054Q7770j10280k349K76162k18441J7283j73254q8753M48231
13749H31123j34506n4966n0693j1460j23301K91399M4921l57468L53502C01279
13738G64013n1028k90552K90566M3702N3606j81920J70463C66180K88388k14451
13728D40117k3214K8946l767M35346B54157J46510L7358J87012J57569k83944
13718D98662J31834K4036K11075k59637j06835L2677R6950r3611k0J80056C22387
$$ y = [670158, 628172, 1187521, 560915, 846566, 863715, 641315, 538096, 542291, 883254, 992131, 637782, 680094, 851703, 935952, 525245, 416472, 564450, 729202, 541223, 777078, 455512, 841282, 756302, 710458, 553121, 767791, 846621, 843216, 585529, 994808, 594754, 682524, 572244, 569895, 846057, 627616, 644899, 471645, 382892, 831123, 696617, 641651, 590958, 579498, 456197, 747596, 792517, 435049, 788551, 301279, 764013, 712985, 422433, 712999, 756701, 810307, 628387, 798850, 366180, 654568, 440117, 416903, 445849, 442082, 877428, 254157, 400667, 438025, 625037, 782606, 498662, 630496, 654532, 865607, 605970, 499135, 531812, 628762, 535151, 535131, 715187, 322387]
13706B44179N97781B77234J53444j11893K49164B42314J07034L3368j16546K31463
13696D97633r9994j36229N04430j53475k33886K2532J41754n2383j10051n689
13686C74642P0926q4448K75639K94462m36691j51111K36712k21247J4037j19809
13676B53112L21375p8560j57526J45875k26740K35049j95346M20590j18425j18214
13666D81190J06591p0158J62294l30152l4682K31857K03517k08503j96821p2924
13656B72209j2452q6021K60715J09654k22840J29004B10636L01739m501k08831
13646B99043J36761J11817j84415Q076J35237P048R7361I8250K27733J80002j70541
13635C35444A27511J54127J18964J23690r2767K5929j07547O0852K51640k08754
$$ y = [244179, 841960, 277234, 430678, 318785, 567949, 242314, 349348, 382716, 266170, 497633, 397639, 261410, 765840, 612365, 378479, 401011, 542765, 490382, 380331, 374642, 445568, 361120, 636759, 931221, 494530, 343419, 580131, 358884, 372921, 253112, 574487, 495927, 338401, 484276, 257536, 492585, 297239, 717829, 599404, 481190, 587781, 517623, 679917, 349765, 315083, 546940, 750457, 541954, 345133, 272209, 259757, 173736, 434451, 544105, 321265, 450269, 210636, 512375, 507874, 299043, 435804, 547621, 363206, 371282, 506519, 513567, 610928, 98250, 325983, 505985, 335444, 127511, 281638, 400602, 524292, 431525, 457454, 349907, 410759, 662399, 453645]
13625D53645J290J58636k89473K70233E7858K52680J57m127A51267L33513p2881
13614D11899j47604J36533j15440P3217m6597r2996j7005N3054j26060K42247
13604C71248K00102r8921j87503L63813m7933K7518H3437J39682N3335P2540J42015
13593D91009j54873j34870K15341J14779B62006L4310E3082R7460b25018C39062
13582A15126f0529D67149A85781R4217K4591o8927J31328N8412R4962B06845E5276
13570D45811j01571j40006L50691m7892j7119j00441j84279n3905m9442K57969
13560C59816j44855J31548F3914K1480K46032r1477M14610B55378J59481J53575
13550E68434k42937J05367j35148q1686L04575k19323A47507L05039d5115C25390
$$ y = [453645, 454935, 613571, 324098, 594331, 57858, 310538, 310695, 306568, 151267, 484780, 411899, 264295, 400828, 285388, 358605, 312008, 219012, 202007, 255061, 129001, 371248, 571350, 472429, 284926, 648739, 600806, 628324, 83437, 223119, 276454, 348994, 491009, 336136, 201266, 416607, 531386, 262006, 296316, 53082, 150542, -225018, 339062, 115126, -60529, 467149, 185781, 279998, 304589, 235662, 366990, 425402, 520364, 206845, 55276, 445811, 344240, 204234, 554925, 507033, 489914, 389473, 205194, 151289, 101847, 359816, 214961, 346509, 63914, 85394, 331426, 239949, 654559, 255378, 414859, 568434, 325497, 430864, 295716, 214030, 518605, 299282, 147507, 452546, -45115, 325390]
13539D65923A03037k8616L27315m4000j12172c53369A96513J30160F1513J34870
13529A96383K31549A69833K58921r8971N5831o8341f040C96900j57909I7914J18887
13518B16801F1397L14458r5813m0142J61772l5226m0442I6571K77191j84215k0177
13507A69370n0086K03028j6908C1893N53536B60058J2472l1583N2979J00035j32466
13496B61495J49846A43245a10151A55925L27524H0203p647M30476b9036C53685
13485C36501h5898F23087A00990J65745r3647Q7291n8450M3665K4566o4212J56207
13474C62155A55273J05792R6q515A01386J82598P9370D8338J30734K48434k07830
13463B19676M6444I0831J26270J75272j70990p9910J50716a3227A53083J14889
$$ y = [465923, 103037, 74421, 401736, 357736, 245564, -353369, 196513, 326673, 61513, 196383, 427932, 169833, 428754, 329783, 385614, 317273, -6040, 396900, 238991, 97914, 216801, 61397, 375855, 280042, 239900, 401672, 366446, 326004, 96571, 373762, 189547, 169370, 119284, 322312, 305404, 31893, 585429, 260058, 272530, 240947, 293926, 393961, 261495, 411341, 143245, -110151, 155925, 483449, 80203, 72556, 503032, -29036, 353685, 336501, -85898, 623087, 100990, 266735, 173088, 260379, 201929, 245594, 270160, 205948, 362155, 155273, 261065, 261161, 252646, 101386, 283984, 363354, 48338, 179072, 427506, 219676, 266120, 90831, 217101, 392373, 221383, 141473, 292189, -13227, 153083, 267972]
13453B67972J86491I6498J70093J25833F0186L33564A72310O4805A10005d8860
13442F4645J27222q1521n2787K28062B451L22470A06791B4699K52627c4621F00307
13430H5797J38478n4077C0869M62517A26986a54176A81323c2974D21574j73106
13420B48468A23895R5675A00140K09015J85j7446J8137H1305N6755D9715K30720
13409B80435A18248B6190R3961J22863Q1177e367B52332J754J34214A81820R8324
13398B80144i1512B02971F0426L11847j65697o9977R503D7034B3416P8495N0950
13387A52861p313g5363D46733I7381e8033A88460J29784n9474J52808I6274l8331
13376E7943K9645a8129B39096Q0159H689K04591H5000J50502L67326B99238J40228
$$ y = [267972, 454463, 96498, 266591, 392424, 60186, 393750, 172310, 237115, 110005, -48860, 64645, 191867, 110346, 57559, 285621, 2451, 324921, 106791, 24699, 277326, -34621, 600307, 85797, 224275, 170198, 30869, 493386, 126986, -154176, 181323, -32974, 421574, 248468, 123895, 219570, 100140, 309155, 309340, 291894, 310031, 81305, 138060, 49715, 280435, 118248, 26190, 120151, 243014, 324191, -5367, 252332, 254086, 388300, 181820, 280144, -91512, 202971, 60426, 372273, 206576, 136599, 146102, 47034, 23416, 101911, 152861, 145548, -75363, 446733, 97381, -58033, 188460, 318244, 258770, 411578, 96274, 57943, 87588, -18129, 239096, 319255, 8689, 213280, 85000, 235502, 602828, 299238, 439466]
13365D39466F5629M86119B50831K4138A14844K09246b6687A18509k0720D538J15974
13354A20512K67109A47990K7129l3801K70778o8877H4282M54128N6951j95888
13344C99473k7472f9513C08872q8356K9179J14452e750B12448I6130K44558A54435
13332B57361J37372k6795J04344j85073r686A13381J04771q0231N02144A84792
13321E6993M24744C3579M55679G2928J92181A19153M2803o7703P6633f686B2793
13309A80230b6496H0667P1874a56660A70726J00694D4826N4363j178K50743H5097
13297a32049A73079n158b76036B02509H9963a65820L6122I2241B2699K54151K2646
13286B99496H4272J76494r8170J06435j15968R5666k7358d0127E5723K92612G0818
$$ y = [439466, 65629, 551748, 250831, 274969, 114844, 324090, -26687, 118509, 97789, 4538, 120512, 387621, 147990, 175119, 141318, 412096, 343219, 84282, 538410, 595361, 399473, 372001, -69513, 308872, 220516, 249695, 364147, -5750, 212448, 96130, 340688, 154435, 257361, 394733, 367938, 472282, 287209, 277523, 113381, 218152, 137921, 640065, 184792, 56993, 481737, 33579, 489258, 72928, 265109, 119153, 161956, 94253, 170886, -6686, 22793, 180230, -26496, 80667, 152541, -156660, 170726, 271420, 44826, 99189, 98011, 348754, 85097, -132049, 173079, 167921, -276036, 202509, 89963, -165820, -129698, 92241, 22699, 276850, 299496, 84272, 260766, 162596, 269031, 153063, 248729, 221371, -40127, 55723, 348335, 70818]
13274E8765g4553B45432M0696d609C04336B5830K52530N5407G3598a66793b0680
13262E1571A9030K52287a7017B64443b00652B3192K4042j10P9148k6486f8664
13250F5030K37671b02000E885J93568J60637j7216q5534G5692L17752j60499n9575
13239A73370R9886K3101B9993d7438q5897b7475B51701o6660J01982D8855J29360
13228A78215E4855c4170B44318o4611K66041A05087J97505a05648k3530i975B38052
13216a78576M659A20885n656a31685A50960M44956A49776B8020I221J08353L5037
13205A52611j3638E7285L1108K1808a21679A42459K46164P7679f8178q6175I808
13193d655B4297G173Q4946A3150K71766h8880I1305d8016B09538d5481g938m8486
$$ y = [58765, -74553, 245432, 286128, -4609, 304336, 25830, 278360, 333767, 73598, -166793, -20680, 51571, 19030, 271317, -17017, 264443, -200652, 23192, 47234, 47124, 126272, 99786, -68664, 65030, 302701, -202000, 5885, 199453, 360090, 342874, 257340, 75692, 393444, 232945, 173370, 273256, 296357, 29993, -47438, -133335, -27475, 251701, 185041, 287023, 48855, 178215, 54855, -34170, 244318, 179707, 445748, 105087, 302592, -105648, -129178, -9975, 238052, -178576, -173917, 120885, 115229, -131685, 150960, 595916, 149776, 28020, 9221, 117574, 152611, 138973, 57285, 88393, 110201, -121679, 142459, 388623, 466302, -68178, -154353, 9808, -4655, 24297, 7173, 92119, 13150, 284916, -88880, 91305, -48016, 209538, -45481, -7938, -56424]
13181e6424J7843A76152R9828A08027k3119a75993B57761e9241q2479A15036P0112
13170A85148O6028A191a9484C76015a57298D33909A06192J50046a14443A57041
13159a38444B56780B1821R9460c2737A16839R8140a14460C41233B7936J35935
13149A63871b35664C11711G3289K206K81752a15819A59999K3228G1114e0443f922
13137i085C21114c3726l4847A26130n1190e26C04084A11239Q0349K639q4227R533
13125A19533K52278I7640C9011J95219j14221D9224b04891K0669I3333n802E399
13113E04921A04986L49020c7497A20322i6559B34403a48178B09260d72608C31275
13102a23754B26470a51385b5784n5771B93622G2962f5513q7042q0762G3016J13452
$$ y = [-56424, -38581, 176152, 275980, 108027, 84908, -175993, 257761, -59241, -141720, 115036, 185148, 251176, 1191, -19484, 376015, -157298, 433909, 106192, 256238, -114443, 157041, -138444, 256780, 21821, 121281, -32737, 116839, 214979, -114460, 341233, 27936, 163871, -235664, 311711, 73289, 75495, 357247, -115819, 159999, 183227, 71114, -50443, -6922, -9085, 321114, -33726, -68573, 126130, 74940, -526, 304084, 111239, 191588, 194227, 110000, 119533, 371811, 97640, 39011, 234230, 120009, 49224, -204891, -184222, 93333, 87531, 5399, 504921, 104986, 454006, -37497, 120322, -96559, 234403, -148178, 209260, -472608, 331275, -123754, 226470, -151385, -25784, -81555, 293622, 72962, -65513, -152555, -233317, 73016, 186468]
13091A86468R914D1266N4093r299J74143J47408D4101O4825m6427M07273D6651
13079H5692A3345M84616B08296k3441p815P5723b05023B2194K34915a2577B99263
13067b08811F433J2346J00073L9253P395q0408J8937N3551G7165r182M4408a08296
13054B48025r9946A8192f7570B78822J18232M9767F9068C3251Q210f9334J2736
13043e6598k44206A31558O6036e712j82917A3885K7056Q8356J14301a5405A10052
13031B08155n3777P5478F9212J0782C952L46282c28887L5912A59749O701a03674
13019b24151A27670J54260J4044g1765m6564F74a66153D6748K84707A53982o2251
13008I1731Q8004H5834b9867C69309j78254m2285A103a72270B27128a28337j72959
$$ y = [186468, 196382, 41266, 95359, 86060, 260203, 407611, 44101, 108926, 62499, 469772, 46651, 85692, 13345, 497961, 208296, 184855, 177040, 252763, -205023, 22194, 257109, -12577, 299263, -208811, 6433, 18779, 118852, 158105, 165500, 85092, 104029, 157580, 77165, 67983, 112391, -108296, 248025, 148079, 18192, -67570, 278822, 397054, 446821, 69068, 33251, 41461, -69334, -56598, -300804, 131558, 197594, -5712, -188629, 13885, 40941, 129297, 243598, -15405, 110052, 208155, 154378, 229856, 69212, 79994, 3952, 350234, -328887, -292975, 159749, 166450, -103674, -224151, 127670, 281930, 295974, -71765, -118329, 674, -166153, 46748, 331455, 153982, 91731, 179735, 85834, -29867, 369309, 191055, 148770, 1103, -172270, 227128, -128337, -301296]
12997c01296B07995Q6805a07824C23652e8054A05620K4160h0853B46264C2650
12986B61493p3782a84250A72974L1715J23783G0066b21618D83752a3358M3A53062
12974B39941h1284a1332p5119F0148a20030A39963E0282J31347C2371N2552J09433
12963A94356p6789A0282J77091a17669j6553h176A45783K34139b69026n0129e2868
12951a73337j08710A05041q463f1543F7713a6431m1597A65770a60531P2982C9264
12939B62763H1357i2774C19218A29467a7185I2559k6564K10470c1095G4094c21343
12927c6309A13974B101e1314B15110F5771B5340A857K61312D7894N4067J36227
12916B38188G832M2819M6559m2924K21977B8751K3470K08873B4494K0329h7110
$$ y = [-301296, 207995, 294800, -107824, 323652, -58054, 105620, 129780, -80853, 246264, 32650, 261493, 187711, -184250, 172974, 204689, 328472, 70066, -221618, 483752, -13358, -13315, 153062, 239941, -81284, -11332, -86451, 60148, -120030, 139963, 50282, 181629, 32371, 84923, 194356, 117567, 10282, 187373, -117669, -134222, -8176, 145783, 379922, -269026, -319155, -52868, -173337, -282047, 105041, 96578, -61543, 67713, -16431, -58028, 165770, -160531, -87549, 39264, 262763, 81357, -92774, 319218, 129467, -17185, 92559, 65995, 276465, -31095, 74094, -321343, -36309, 113974, 2101, -51314, 215110, 65771, 25340, 1857, 263169, 47894, 101961, 238188, 7832, 50651, 97210, 54286, 276263, 28751, 52221, 261094, 24494, 44823, -87110]
12904B42877h4826A0125J57999c01953c1552k39759J20906K0680l5809A4166N7589
12893G1755a38684F6308K41892g0551B26157N4260f3322B90090E9958j8475a29586
12881b99507B85376a77325e7452D4157O9317M24647D367K2345h5564F6798J28299
12870A95097a47588A73749L00324a88605g1325B77574G7044K2906C1474c69803
12859h0002j81361A05023O2523c90742C4580K1244h1274l57009c6455A70167a48500
12847B18233a4927H0925c7851l25830A19731a20866B12365J1097D7090K68775
12837C15865E4080J49682g5116n4385B69705D3982K42a29210G3966P5701J37120
12826B86787g0272D6572i735A87393a22356a7413B26136a15052a0096E3071a07892
$$ y = [242877, -84826, 10125, 168124, -301953, -31552, -271311, -150405, -129725, -165534, 14166, 71755, -138684, 66308, 308200, -70551, 226157, 280417, -63322, 290090, 59958, 41483, -129586, -299507, 285376, -177325, -57452, 44157, 113474, 538121, 4367, 26712, -85564, 66798, 195097, -147588, 173749, 474073, -188605, -71325, 277574, 77044, 99950, 31474, -369803, -80002, -261363, 105023, 167546, -390742, 34580, 55824, -81274, -438283, -36455, 170167, -148500, 218233, -14927, 80925, -37851, -363681, 119731, -120866, 212365, 223462, 47090, 315865, 54080, 203762, -75116, -129501, 269705, 43982, 44224, -129210, 73966, 149667, 286787, -70272, 46572, -9735, 187393, -122356, -17413, 226136, -115052, -10096, 53071, -107892]
12814H2012a47585C78360j65497B0519K4105i7628B85381A20097B8765i1317I1003
12802I7748a05714B09501A01304g6389l7341A59579b17075F9400a55798C77102
12791b36620k9951F8782e8676m32921H8230a59150A6421R8008L5145K60384I4692
12779I301h4307B26461B0635K6878A6124A506M5268f4501A2461a65876B4529c84545
12766E6765a55801B19469b88837a37366n4641B50d8962j6700D8321b10200J02278
12755a07922c202H3933M3587q967k6836a15692i164F4140J66866a60673b6184
12743I333J29002P2898E9032R624K24972b6804G2857J17051C1949P0445M8550
12732A50944K74038j98775b6357q7416A67718q854m2532N164K31242j22578a53233
$$ y = [82012, -147585, 378360, 212863, 20519, 44624, -97628, 285381, 120097, 28765, -91317, 91003, 97748, -105714, 209501, 101304, -76389, -113730, 159579, -217075, 69400, -155798, 377102, -236620, -266571, 68782, -58676, -491597, 88230, -159150, 16421, 114429, 149574, 409958, 94692, 9301, -84307, 226461, 20635, 47513, 16124, 1506, 46774, -64501, 12461, -165876, 24529, -384545, 56765, -155801, 219469, -288837, -137366, -192007, 250, -48962, -65662, 48321, -210200, -107922, -3202, 83933, 127520, 118553, 91717, -115692, -9164, 64140, 231006, -160673, -26184, 9333, 138335, 211233, 59032, 68656, 293628, -26804, 72857, 189908, 31949, 102394, 150944, 424982, 226207, -26357, -113773, 167718, 158864, 116332, 121496, 352738, 230160, -153233]
12720A78255F7531O2209f1383A39212a40362j44008I908e5995B50504J06676A39818
12708A94712K00965J85191d3863A60378K83305B05116N0304a5225A56931C9188
12697b11577B8978J53917f7698A04820b11158A56800o092o6699g0573A20084J27055
12686B47139H841a86736e4289C22291b03539A42421F0948L3935J04061C4467O5797
12675A00264K49134a72077e9963B99292F5951N9074J40177E5887c26295e9263
12664a79748A19246J05753F3186O9925j7276l3131K4121D6330a95765A61094E6394
12652c0209A97934o2742n2846P4603J33942d5387d084j95072A31090a30189A42199
12640B04964c51581G8001r783D669L8030J68774E3524M7513K02513A27864J47725
$$ y = [178255, 67531, 129740, -61383, 139212, -140362, -284370, 9908, -55995, 250504, 357180, 139818, 194712, 395677, 580868, -43863, 160378, 443683, 205116, 255420, -15225, 156931, 39188, -211577, 28978, 182895, -67698, 104820, -211158, 156800, 150708, 84009, -70573, 120084, 247139, 8841, -186736, -54289, 322291, -203539, 142421, 60948, 94883, 198944, 34467, 100264, 349398, -172077, -59963, 299292, 65951, 125025, 265202, 55887, -326295, -59263, -179748, 119246, 224999, 63186, 133111, 115835, 82704, 106825, 46330, -195765, 161094, 56394, -30209, 197934, 135192, 82346, 156949, 290891, -45387, -4084, -199156, 131090, -130189, 142199, 204964, -351581, 78001, 68218, 4669, 42699, 211473, 53524, 101037, 303550, 127864, 275589]
12629B75589C7619K38644n5307i5290D00653A05263a45780C36629M4038c724B34114
12617A15444C9163J94772d1233R633J1246j29098D69309h8119L2060B70095n4130
12606B15965r4233K42612b42737a13667B8105e0269l8976C35068O165j50425c2877
12594C4266J9897h6583a1758A6698P8435j3088M3951a34643E2415A9099b16147
12582i7748B8148L5595k6592d3447A84947E3454h437q0435B10481E317h502B5356
12569I5189J38310E2642J98130b08950C30519A28377K8023n3521a42866B6711
12558a87515o8052a7659A43873a18899A61632i6829A24039b87390G194b32936
12547A84045h9577A22977h9735E1250J7777b2783k62243Q9391C57516A3329a09198
$$ y = [275589, 37619, 276263, 220956, -95290, 400653, 105263, -145780, 336629, 380667, -3724, 234114, 115444, 39163, 233935, -41233, -31600, -20354, -149452, 469309, -88119, -56059, 270095, 215965, 121732, 364344, -242737, -113667, 28105, -50269, -89245, 335068, 341233, 190808, -32877, 34266, 54163, -86583, -11758, 16698, 95133, 82045, 125996, -134643, 52415, 19099, -216147, -97748, 28148, 63743, 37151, -43447, 184947, 53454, -8437, -88872, 210481, 5317, -8502, 25356, 95189, 233499, 52642, 250772, -208950, 330519, 128377, 156400, 102879, -142866, 26711, -187515, -255567, -17659, 143873, -118899, 161632, -96829, 124039, -287390, 7194, -232936, 184045, -89577, 122977, -89735, 51250, 69027, -22783, -285026, -195635, 357516, 13329, -109198]
12535A3531Q9669K26563q0319a83125D3481O9313K6819Q2226a90732j02285i7985
12523a18051b8548B11005h6339A10178a80714e0858j80729B50733b56643R4852
12513a61791A63877j5672C7343J59830B3888a30890B23494r6573a59275D29469
12502g7193k0575O466n8504p0791j10438a06559d4761j5457J2262j00338B068
12490f7178k31117a37797k1916j63665a21227A41295j6177J71524A07961C3861
12479F8131M5889a22529o699d9302D7144c67790a38582G908R457J17905J67572
12468C02842a22903H2997A595b64434C2524g0126J0595C7480a38930H044a54369
12456I7491k348b15156J0972C51643f9376C159K00450h9320F1736J39738D1645
$$ y = [13531, 103200, 329763, 249444, -183125, 43481, 112794, 139613, 221839, -190732, -293017, -97985, -118051, -28548, 211005, -86339, 110178, -180714, -50858, -231587, 250733, -256643, -161791, 163877, 148205, 37343, 197173, 23888, -130890, 223494, 126921, -159275, 429469, -77193, -97768, -91302, -149806, -220597, -331035, -106559, -44761, -60218, -47956, -148294, 2068, -67178, -298295, -137797, -159713, -323378, -121227, 141295, 125118, 296642, 107961, 33861, 68131, 114020, -122529, -129228, -49302, 47144, -367790, -138582, 7908, 17365, 135270, 302842, -122903, 82997, 1595, -264434, 32524, -70126, -59531, 37480, -138930, 8044, -154369, 97491, 95143, -215156, -204184, 351643, -69376, 3159, 203609, -89320, 61736, 201474, 41645]
12444D5375h4459I5305b21791F1906K6683e3750A87504k9350A5791P5001D136
12432h3507k11075b8700l1156Q530K1221B73645a668A3879g1253B18969B1101
12420H3478A0433a67357B04818B1788J12391A1894J55526b30042q4774G5615Q3762
12409A59377c2437j58234m897i092K138A30367m9842h7157j35076b4080F8519
12397i7471d2058k31363B54549a27339a3372G5251J1609g1428r084B32247G6816
12385C6677K17844a06508L1087I7088a07870j63973d6359A44835a0760A39062
12374i3439B04491a46145O3130B06065H979K85792e9090A59082b58086B42279
12363a51881j25441B154d7191k25428R6283B79332E2327K82956a37106A28505
$$ y = [45375, -84459, 95305, -221791, 61906, 88589, -53750, 187504, 158154, 15791, 90792, 4136, -83507, -294582, -28700, -59856, -51326, -30105, 273645, -1668, 13879, -71253, 218969, 21101, 83478, 10433, -167357, 204818, 21788, 134179, 11894, 167420, -230042, -314816, 75615, 159377, -32437, -190671, -195568, -9092, -6954, 130367, 80525, -87157, -222233, -24080, 68519, -97471, -42058, -273421, 254549, -127339, -13372, 75251, 86860, -71428, -80512, 232247, 76816, 36677, 254521, -106508, -75421, 97088, -107870, -271843, -46359, 144835, -10760, 139062, -93439, 204491, -146145, -83015, 206065, 8979, 294771, -59090, 159082, -258086, 242279, -151881, -277322, 2154, -47191, -272619, -176336, 279332, 52327, 335283, -137106, 128505]
12352e0965A7460b57930A69890C2858N9581p227a25462B51204a46580F8797L539
12341G2336J78215a50169A45980o0645d6256k41048a37056A66862o360J39618
12331C00120h8455A43674b71916J27780B46522D7676P1275b26991i6597A3217
12320b77669C71610a46729A42767c7553j45832B64750I8373a90184O5712A41256
12309D3476O8918g1966A56573C6367b2697n2231a365A38176b75319i8472G0759
12297A1998K1131c8448k4109A86733J65889j27957B6044J12561a51280H0104j0057
12286G0047N5937j0989f1241A27235n7408k7150b8623A6446b0227F7545h0276
12274F5056C1210L15949N9394I3093g4858G5119l671K30845o0312o2679J45101
$$ y = [-50965, 17460, -257930, 169890, 32858, 92439, 85212, -125462, 251204, -146580, 68797, 72336, 250551, -150169, 145980, 85335, -46256, -287304, -137056, 166862, 160502, 300120, -88455, 143674, -271916, -144136, 246522, 47676, 118951, -226991, -96597, 13217, -277669, 371610, -146729, 142767, -37553, -183385, 264750, 98373, -190184, -124472, 141256, 43476, 112394, -71966, 156573, 36367, -22697, -74928, -1365, 138176, -275319, -98472, 70759, 11998, 33129, -38448, -62557, 186733, 352622, 224665, 26044, 138605, -151280, 80104, 70047, 125984, 114995, -61241, 127235, 69827, 42677, -28623, 16446, -20227, 67545, -80276, 65056, 31210, 347159, 406553, 93093, -74858, 75119, 71448, 302293, 241981, 179302, 324403]
12263C24403A60271g3236H612b18870K3775A73524A5459Q5594L52089A06691J95244
12252C01935R0814h8714B78903F2642J52162A04624J36068H2056j057a0368p1934
12241h2302A77847o5540a82207A32209a53360m6932A60673D6867j9425J40858
12231A68300C9111K81590C5618P4207R6558I677K51648l3205M0294A11518J62553
12220B74071j14477m4801J21888o6756L9899m5799q1739J79367M8210B1195L42518
12209C63713j06177A00120l6806K35337G7696K0685b73745B95788n8892H1128
12198a10327B04019M5289j04167J55733M211k1185D6476M9428K48588k4757c96199
12186B18744r0470J19032n6383h2203A44201e3199C36255J24122A67264E6260
$$ y = [324403, 160271, -73236, 8612, -218870, -195095, 173524, 15459, 101053, 453142, 106691, 301935, 392749, -88714, 278903, 62642, 214804, 104624, 240692, 82056, 80999, -10368, -82302, 177847, 112307, -182207, 132209, -153360, -200292, 160673, 46867, 27442, 168300, 39111, 320701, 35618, 109825, 206383, 9677, 261325, 228120, 268414, 111518, 274071, 159594, 114793, 236681, 169925, 209824, 164025, 82286, 261653, 309863, 21195, 363713, 257536, 100120, 63314, 298651, 77696, 98381, -273745, 295788, 236896, 81128, -110327, 204019, 249308, 145141, 300874, 305085, 283900, 46476, 95904, 344492, 319735, -396199, 218744, 128274, 247306, 190923, -82203, 144201, -53199, 336255, 460377, 167264, 56260]
12175C27283c36625C19773j34066B5752P5799k764J13926G7657l0122a10278M3264
12164f7014A98145L0523A4633J38571Q8716g09k61550I418g335C8302b05538A14940
12151B4427J8112J07660a41743c6456o2395j05008D88105A42863a38430o0201
12141a98631B07141b05519C09317d3214a6630j87177g2558L972F075a0593B2684
12129H0857C0939M10294B17746F8158q363L60159h2118F0565b17149M0878a0038
12117B02726m562f5075j13838b1663A40486A8791P1542B239b79770A29660m4766
12106H4894J8534a38438C07445q4230h9945c5482k96941G9806K97250a86279o1307
12095b47586J09963d6294C7938J20849p7870K9692f1729j97363A8228J13213A3367
$$ y = [327283, -336625, 319773, 185707, 25752, 101551, 98787, 212713, 77657, 47535, -110278, -67014, 198145, 228668, 14633, 153204, 241920, -709, -262259, 9418, -7335, 38302, -205538, 114940, 24427, 42539, 150199, -141743, -36456, -98851, -203859, 488105, 142863, -138430, -198631, 207141, -205519, 309317, -43214, -16630, -203807, -72558, -68586, 6075, -10593, 22684, 80857, 30939, 441233, 217746, 68158, 59795, 419954, -82118, 60565, -217149, -176271, -10038, 202726, 198164, -65075, -178913, -21663, 140486, 18791, 90333, 2239, -279770, 129660, 84894, 103428, -138438, 307445, 223215, -89945, -35482, -332423, 79806, 377056, -186279, -247586, -137623, -46294, 37938, 158787, 80917, 110609, -61729, -259092, 18228, 131441, 13367]
12083A06473E192K4439e6082p6535B99800A34558L96975Q25530L74542F77640
12072f7499G6202K68703L3824j34683D8127h3654A86259J55255C6383i3711A09558
12060f1668l2465A17542a38385B82904e0806B76850a61434C8676J58367c6554
12049a39875k7872F7465h5331B07024m9553m4107c5800j77086O5016j9640N0954
12038a16556A03702d61758g7534B50397j21695F2679d68541a00255j29355e269
12027F9028a92743n7264a10754A61377K1384a95290B00487i0522m4589m6738E30327
12015B54339j14849A9311a50614d8087D56233a29433B1286L83220D7688c51547
12004A76047h1883C8857J40856B8320b2197D3913K50950b80846a4357k3887A52358
$$ y = [106473, 5192, 29631, -56082, -132617, 299800, 134558, 531533, 1357063, 1731605, 677640, -67499, 76202, 344905, 378729, 244046, 48127, -83654, 186259, 341514, 36383, -93711, 109558, -61668, -94133, 117542, -138385, 282904, -50806, 276850, -161434, 38676, 197043, -36554, -139875, -167747, 67465, -85331, 207024, 157471, 113364, -35800, -212886, -147870, -167510, -116556, 103702, -461758, -77534, 250397, 128702, 62679, -468541, -100255, -229610, -5269, 69028, -192743, -250007, -110754, 161377, 182761, -195290, 200487, -90522, -135111, -181849, 530327, 254339, 139490, 19311, -150614, -48087, 456233, -129433, 21286, 404506, 47688, -351547, 176047, -81883, 38857, 179713, 28320, -22197, 43913, 294863, -280846, -14357, -38244, 152358]
11992b9908m155k4221B95330H5342i9182M5794c113A77888N1104P1097h5951i773
11979C8696a54715F0673K55588G8159R5919d64062B86226q6761a02294B38586
11968g0000k5660F9987a50881J4011g217B92278g8625A91497h9443p3338k9104
11957a91885i5012B59245a60987o8570d4631A37307a75955p884B41720G6311a28174
11945i1780j676j22558A7966L7614b35188q8731a7153p6186a246F9850F626J82
11933F808a06918j27015a15537e1153B80123d35190E7163L26902g5605A93497
11922b36783a13771A92499a75475J5260e0890a7903I2055a67711C57021a94723
11911B40543m2064a04944L3844k11746J39244N4035F4754P9643e1234p0780b1802
$$ y = [-29908, -34063, -58284, 295330, 85342, -99182, -53388, -3113, 177888, 228992, 300089, -85951, -9773, 38696, -154715, 60673, 316261, 78159, 174078, -464062, 286226, 199465, -102294, 238586, -70000, -95660, 69987, -150881, -136870, -7217, 292278, -78625, 191497, -89443, -162781, -191885, -95012, 259245, -160987, -229557, -44631, 137307, -175955, -183839, 241720, 76311, -128174, -91780, -93456, -216014, 17966, 55580, -235188, -323919, -17153, -93339, -1246, 69850, 6626, 6808, -106918, -233933, -115537, -51153, 280123, -435190, 57163, 384065, -75605, 193497, -236783, -113771, 192499, -175475, -160215, -50890, -17903, 92055, -167711, 357021, -194723, 240543, 198479, -104944, -71100, -282846, -143602, -89567, 64754, 144397, -51234, -122014, -21802]
11899B0314J06779J51040f4164H8562K8315e0393q4321O0414o0392e0060a1027
11887B50934J38191A91202B5639c16477f0755b2714k60067R5312B00336b36667
11876b82370c6050A06233a96414Q9054A70594a44515A06143a96789b4198j87706
11866b11904b5836j88368f4884C1685b83326O7360I4228c13710C87839I5652g8360
11854A21925A2519a37523A05360m5572a21599C4775h8156j36036k8526f3117I8637
11842d4160j85230K5828b1579m9017l1994h7k1169A73104g8641j06222a1925I0203
11829B71260I4020a95325i4969A06707a87288E4911K2286C0505J45743c460A79462
11817h0009B49133E3502R1391Q460d4309q5861k49494A87456F6310J8935g1956
$$ y = [20314, 127093, 278133, -64164, 88562, 116877, -50393, -134714, -74300, -134692, -50060, -11027, 250934, 389125, 191202, 25639, -316477, -60755, -22714, -282781, -187469, 200336, -236667, -282370, -36050, 106233, -196414, -107360, 170594, -144515, 106143, -196789, -24198, -211904, -25836, -214204, -64884, 31685, -283326, -215966, 94228, -313710, 387839, 95652, -78360, 121925, 12519, -137523, 105360, 59788, -121599, 34775, -88156, -224192, -252718, -63117, 98637, -44160, -229390, -203562, -21579, -70596, -102590, -87, -21256, 173104, -78641, -184863, -11925, 90203, 271260, 94020, -195325, -94969, 106707, -187288, 54911, 77197, 30505, 176248, -3460, 179462, -80009, 249133, 53502, 144893, 153353, -44309, -130170, -379664, 187456, 66310, 85245, -71956]
11805a15680A03802a89673k13348d6269A5305b03331J2779I4853b8363p1203j47259
11794b46825e221A76476a2619k53693B35654a2751A46602o0822K10321h6866A11559
11782A57632j8587a00980C10751b2254j42385j06393B5432R350L95269a35617
11771c89135B9749K08071c1004P185E038a06488a2408b626A20932b60241b8256
11759i7055b334F2409M3054a43301F4033K36851c551k27956O2044A65349c23081
11747A20309J14602G1584O3502j0104b63869A85963G3038a85987g9578c2492o05
11736c3097A58985m3475a87539B77171R413F5974k1658j0786a4118E0775J99058
11725B49833K02227A37616a84948o3820i7624E7680l567J34601N66a32302C4511
$$ y = [-115680, 103802, -189673, -403021, -46269, 15305, -203331, -190552, 94853, -28363, -99566, -246825, -5221, 176476, -12619, -266312, 235654, -12751, 146602, 85780, 296101, -86866, 111559, 157632, 139045, -100980, 310751, -22254, -164639, -271032, 25432, 34782, 430051, -135617, -389135, 29749, 237820, -31004, -23819, 5038, -106488, -12408, -2626, 120932, -260241, -28256, -97055, -2334, 62409, 105463, -143301, 64033, 300884, -3551, -231507, -169463, 165349, -323081, 120309, 234911, 71584, 135086, 124982, -263869, 185963, 73038, -185987, -79578, -32492, -33097, 158985, 115510, -187539, 277171, 286584, 65974, 44316, 33530, -14118, 50775, 249833, 452060, 137616, -184948, -248768, -97624, 57680, 54113, 188714, 189280, -132302, 34511]
11713B04315b93903Q942J35406i620o0802A50134a01370B34593m7979F8525K42010
11702C10535A32829g0495A20507E2624N8075K00236q5239a41310F2287b986m79
11691c465I035O0412M363J06855q7260d5790C97217j32181a15569m0497E5103
11679A79459e3114G3451J06540O0198m7360b8657A47053o3616i7828D9349a19960
11667a51536A61799r414D0249c0148j34893A99641a37984E34947F7067b05221
11656A41016h5274B2598a16949e7691A96148m4476d27097A5738Q2125K02141G6040
11644I3996K04186a29340o999B66297n5581D0761a51655A46182K88758A80586
11633F2267e4848D798a17818A55363c16860J14485a2144H2836c4458k9374B29052
$$ y = [204315, -293903, -284961, -149555, -9620, -70422, 150134, -101370, 234593, 186614, 68525, 310535, 132829, -70495, 120507, 52624, 110699, 310935, 225696, -141310, 62287, -2986, -3465, 9035, 69447, 73810, 180665, 93405, -45790, 397217, 265036, -115569, -156066, 55103, 179459, -53114, 73451, 179991, 240189, 192829, -28657, 147053, 83437, -97828, 49349, -119960, -151536, 161799, 152385, 40249, -30148, -165041, 199641, -137984, 534947, 67067, -205221, 141016, -85274, 22598, -116949, -57691, 196148, 151672, -427097, 15738, 97863, 300004, 76040, 93996, 298182, -129340, -136339, 266297, 210716, 40761, -151655, 146182, 434940, 180586, 62267, -54848, 4798, -117818, 155363, -316860, -202375, -12144, 82836, -34458, -63832, 229052]
11621B33800H8709O626f9012A24766k1104L905O9861H6843a06432j33401a19901
11609a38302E239M43946d9567B15280A0951c13693A62621a26767e5927A76201
11598D5924K27793L0018B8488G634M10963j85314c9870a5346B7827L4209b36426
11586A58028J5012E5409K0865R3784J73415l3146A13939A706J4114J05943r804
11575A11959K5662J29590c17400h2364I5214J26374l5679f0845C19963j10246
11565B09717i6537l7394B60401j26161g0934E8102J70691a39j12723A32815d7897
11553a60109B8642P252b54360J01515E7344K37936f51E4527R4612J39049f8817
11541A8973K6651a91687A26659J86972A52727K92876e5464C77710H5469j2844
$$ y = [233800, 88709, 95335, -69012, 124766, 103662, 107567, 177428, 86843, -106432, -239833, -119901, -138302, 5239, 449185, -49567, 215280, 10951, -313693, 162621, -126767, -55927, 176201, 45924, 273717, 303735, 28488, 7634, 418597, 233283, -39870, -15346, 27827, 62036, -236426, 158028, 173040, 55409, 76274, 170058, 343473, 310327, 113939, 1706, 15820, 121763, 111959, 137621, 267211, -317400, -82364, 95214, 221588, 185909, -60845, 319963, 209717, -96537, -133931, 260401, 134240, -70934, 58102, 228793, -139, -112862, 132815, -47897, -160109, 28642, 35894, -254360, -152845, 57344, 295280, -651, 54527, 149139, 288188, -68817, 18973, 45624, -191687, 126659, 313631, 152727, 445603, -55464, 377710, 85469, 72625]
11531G2625N0674E8780J58093a56688B62527D3746A2704a15693A27850a4071B60199
11519B68828D3702O8973M06390A39865a6349C39276e6398A18380a35151D7682
11508C08932b8797I6000J52116J58841j20344L2028c5633p9296C04826j40270
11498A64556N1729R077F5890J53263b42038D26935j85427K80496A54246J94291
11488C48537j6851A20016B2752M62617a05798d0125C13361r2961c4647F4311Q6408
11477A50719a4326A13904K05753a57760C94015b8370j2923C52110j57818K12419
11467D06711j91113M55905C9290K5985B7453b54208A22259R4075E6437K26537
11457B82974f9034A51369M1018E0363L9008J34049A3820d9571q0561A7154J32854
$$ y = [72625, 123299, 58780, 216873, -156688, 262527, 43746, 12704, -115693, 127850, -14071, 260199, 268828, 43702, 112675, 519065, 139865, -16349, 339276, -56398, 118380, -135151, 47682, 308932, -28797, 96000, 248116, 406957, 286613, 318641, -35633, -114929, 304826, 164556, 216285, 225362, 65890, 219153, -242038, 426935, 241508, 522004, 154246, 348537, 331686, 120016, 22752, 485369, -105798, -40125, 313361, 220400, -34647, 64311, 150719, -14326, 113904, 319657, -157760, 394015, -28370, -41293, 352110, 194292, 406711, 215598, 671503, 39290, 65275, 27453, -254208, 122259, 216334, 56437, 282974, -69034, 151369, 192387, 50363, 89371, 223420, 13820, -49571, -130132, 17154, 150008]
11446A50008R6592r4333b34382g2049A27458Q5417D680M01624b4237B77507C9504
11434A68969J58708o8706g597n4514o5528j05988B4587P4276a18640B58384a34720
11422a84491B05397b39123g285m7693K5997C46839a54783m1440q2997L8312J4830
11411b26078A8321b53396K9562i0578j59732d2652B96540A06708M2951a54142
11400A82975d0372A41386j9946O8662K27719F0628Q233k868K8037a2965m0653
11389e3618A60755b34366K2245b4895A13673b88249A47005J22007e0551j59318
11379b09869E6508j6208J35619K1709D1681J69717a13623C52205b8149D95501
11368B17539a81012E5488f0550I8455l5019a33533B11259m8698b55475d9180E8969
$$ y = [150008, 246600, 152267, -234382, -72049, 127458, 212875, 4680, 406304, -24237, 277507, 39504, 168969, 327677, 258971, -7597, -62111, -127639, -233627, 24587, 98863, -118640, 258384, -134720, -184491, 205397, -239123, -7285, -54978, -28981, 346839, -154783, -196223, -279220, -240908, -226078, 18321, -253396, -223834, -90578, -250310, -42652, 296540, 106708, 149659, -154142, 182975, -40372, 141386, 121440, 190102, 417821, 60628, 68861, 65993, 94030, -12965, -53618, 160755, -234366, -212121, -24895, 113673, -288249, 147005, 269012, -50551, -209869, 56508, 40300, 175919, 197628, 41681, 211398, -113623, 352205, -28149, 495501, 217539, -181012, 55488, -60550, 98455, 63436, -133533, 211259, 162561, -255475, -49180, 58969]
11356D1751g1220B72343a9472k98528A33605J08443d2992j1943A54922D9343d0455
11344b43891b1001B557a80331E8739A5898J62855a38579e0169j23009j04395B71904
11332i5511C383Q1459b67849E4068p987r500P0568A6818N4072e91923c7999G8469
11319A78965a89412H6856e4386C9333Q986b25583A34717e5077k9189B6559a1739
11307b89696Q4750B81476G4525b21070B07578n4599b36536D91285b56432C07531
11296e1696B06079c9603r3461B91854c9765C020a00983F8420c4514l3530G1439
11284A9821a23948j27136p8977A62817a5136k55965a24891a4722q8139l2450H8996
11272E9614a70022G0059J46156a08714l5144A57511b6764j26078p2580D3356A1499
$$ y = [41751, -71220, 272343, -19472, -318000, 133605, 242048, -42992, -54935, 154922, 49343, -40455, -243891, -21001, 2557, -180331, 58739, 15898, 178753, -138579, -50169, -173178, -277573, 271904, -95511, 3383, 84842, -267849, 54068, 46081, 36581, 107149, 16818, 70890, -591923, -37999, 78469, 178965, -189412, 86856, -54386, 39333, 48319, -225583, 134717, -55077, -84266, 26559, -11739, -289696, -204946, 281476, 74525, -221070, 207578, 152979, -236536, 491285, -256432, 307531, -51696, 206079, -39603, -133064, 291854, -39765, 3020, -100983, 68420, -34514, -68044, 71439, 19821, -123948, -251084, -330061, 162817, -15136, -271101, -124891, -14722, -102861, -135311, 88996, 59614, -170022, 70059, 216215, -108714, -143858, 157511, -26764, -152842, -225422, 43356, 11499]
11260B88059n1989a32198j5425e7932e305m8486F971K35195d0692k718J2455l5386
11248f6341q7351B4642b0470F6102p707c174F4108d49816H627c14713a01929L6080
11236f5849d922C848j164e9237j20946A92397B991J87971a08768C7707J04911
11225A42618f3731F2834J19640a3778A08419d28744B4995K42887A13532a66476
11214a93479P3934F7164A4543b62428J24636A72916h5261p9756G1473J42594h038
11202C70577A43372b50288I5798g0093O577D5897i9929o0387F7751J59692I1990
11190e2964k00327K5155J01200A11105D231N8700B9346a20465I1076a1537B08003
11178G2776b7933j25735j26773A94271G9165J0573e2627A13111b08738A43971
$$ y = [288059, 236070, -132198, -147623, -57932, -5305, -53791, 6971, 242166, -40692, -43410, -30955, -66341, -153692, 24642, -20470, 66102, 58395, -3174, 64108, -449816, 8627, -314713, -101929, -65849, -4922, 3848, 2684, -59237, -180183, 192397, 2991, 190962, -108768, 37707, 142618, -63731, 62834, 182474, -13778, 108419, -428744, 24995, 267882, 113532, -166476, -193479, -119545, 67164, 14543, -262428, -137792, 172916, -85261, -165017, 71473, 214067, -8038, 370577, 143372, -250288, 95798, -70093, -63516, 45897, -99929, -160316, 67751, 227443, 91990, -52964, -253291, -228136, -126936, 111105, 4231, 62931, 29346, -120465, 91076, -11537, 208003, 72776, -27933, -153668, -280441, 194271, 79165, 89738, -52627, 113111, -208738, 143971]
11167E2591a35155A37673c10026g4131l0504A02501l0864j3756Q0784C4703O4975
11156I9678c1092j53060b0178B73777p1839r3250a19996B5473a20341N3258h866
11144H5191c14148J34323B72957a39263b7202A9583N2458f3650k8321C19600b59737
11132B84937a23954A30648c84330h351r8417b2056j81004B59549r7160C0792l625
11121B7167c3789B520L7850c60730I3111n6a67665A95431E8255P0661e3685G9371
11108a00910D25304j20512l4989b94244A8162f9938B88436A18523L11912A87985
11097D79741B31556p8216p2932M357I09J69223d6029C75265I9130K8588L59777
11086D87495j2873A97851A8101J6606Q4294K94872Q8542j28044A67869K26906
$$ y = [52591, -135155, 137673, -310026, -74131, -104635, 102501, 71637, 57881, 138665, 34703, 99678, -31092, -184152, -20178, 273777, 201938, 108688, -119996, 25473, -120341, -67083, -8866, 85191, -314148, -179825, 272957, -139263, -27202, 19583, 72041, -63650, -91971, 319600, -259737, 284937, -123954, 130648, -384330, -8351, -106768, -22056, -203060, 259549, 162389, 30792, 27167, -33789, 2520, 40370, -360730, 93111, 93055, -167665, 195431, 58255, 128916, -53685, 79371, -100910, 425304, 304792, 269803, -294244, 18162, -69938, 288436, 118523, 430435, 187985, 479741, 231556, 153340, 80408, 84765, 909, 170132, -46029, 375265, 99130, 127718, 487495, 474622, 197851, 18101, 34707, 119001, 413873, 502415, 374371, 167869, 394775]
11076C94775J22417l8466r9784j46579J76715K2908j93886b3076C44261P1200
11066D15461j08779K59513j09139j36500M49209B79935K50778J24382C01205k60
11056C00945L19369K09931A77839P15036k71765J40517L18799j19262k11350l00521
11046D49293N56122l53733J60655k709J2241B3100P41966j74589K9984L54584
11036I75045j72931J25021j89746j58062Q5886m7492o7883j25706J22671L21933
11026H68736n0594j75964m0329K50693j86319R2171n4464j71911J45559l9060
11016F38518N7798j59495J43267r985J02627j82375B42505M31764P6511l1722
11006G19058k15711R5321K73111l79639J37009J29940j28387K0615K93393j45893
$$ y = [394775, 517192, 478726, 378942, 232363, 409078, 431986, 238100, -23076, 344261, 415461, 306682, 566195, 457056, 320556, 769765, 279935, 530713, 655095, 301205, 300945, 620314, 830245, 177839, 892875, 621110, 761627, 1080426, 961164, 749814, 449293, 1005415, 651682, 812337, 809628, 821869, 23100, 765066, 590477, 620461, 975045, 802114, 927135, 737389, 579327, 665213, 617721, 549838, 424132, 546803, 868736, 818142, 642178, 601849, 852542, 666223, 758394, 703930, 532019, 677578, 638518, 696316, 536821, 680088, 670103, 772730, 590355, 242505, 674269, 750780, 719058, 503347, 598668, 871779, 492140, 629149, 759089, 630702, 651317, 944710, 798817]
10996G98817j88147j87787P67L93224k63087Q7772Q1285L03995l44267J03682
10986G86254K88514N851r0943n0674j3421J4006J13809M84326k13453K77515O58105
10975B259889m23382L28127L93002O5200J80253j43903k59566R1314l10734k75840
10965A904360M5102j8880k07397L35195m5687l01137L76115l08397M16294k20226
10955A975342Q8073k06533M4394l34307q9906l85689j5147m01872n4076L3223
10945F53502j19350j89790K01289j24101n5029J71883k6741j33418d1165D12693
10934B6080J66457K3243j6269q6772L5131B6901K39216i646k67311a02611F9652
10922H6941D0274a66598I8845b16690Q6243B48049a91786B5330c878j18595j42953
$$ y = [798817, 610670, 422883, 423650, 816874, 553787, 641559, 722844, 1026839, 682572, 786254, 1074768, 1080619, 989676, 939002, 925581, 939587, 1053396, 1537722, 1324269, 1601784, 2259889, 1836507, 2164634, 2557636, 2622836, 2803089, 2659186, 2399620, 2490934, 2180200, 1904360, 1949462, 1930582, 1723185, 2058380, 2012693, 1711556, 2087671, 1779274, 2195568, 1975342, 2063415, 1856882, 1901276, 1566969, 1477063, 1091374, 1076227, 674355, 620279, 653502, 534152, 344362, 545651, 421550, 366521, 538404, 511663, 378245, -41165, 412693, 26080, 192537, 215780, 199511, 112739, 147870, 26901, 266117, -9646, -276957, -102611, 69652, 86941, 40274, -166598, 98845, -216690, -130447, 248049, -191786, 25330, -3878, -122473, -265426]
10911b65426H5862J09053E4296M2601c04689j27526a11915g757B24779F1353d8888
10899a00471I6938K21290a36592H1671J90174c12889A92803c51604e6520a1071
10888a22341H2431a75100k03152C97111A06092O3327f0005B7171a74050A29568
10877e0303q834B53559c5615E8557L959a23444g752A87863e5905B3752d387k34939
10865b39326f5913D422a8158k22167J04088B95294A5064J55320m692o2728d9884
10853g691l89495E834b53941R7134j5218f4080C02115i3545d2563D6855b17086
10841A1930L7435M7045c54264A04868b90421G0249K14982a7250m8111J6552r8928
10830a47737A23460b01001E6315L3647a17036B9467b60692G1072J0980b09617
$$ y = [-265426, 85862, 194915, 54296, 96897, -304689, -432215, -111915, -7757, 224779, 61353, -48888, -100471, 96938, 318228, -136592, 81671, 271845, -312889, 192803, -351604, -56520, -11071, -122341, 82431, -175100, -378252, 397111, 106092, 169419, -60005, 27171, -174050, 129568, -50303, -59137, 253559, -35615, 58557, 62516, -123444, -7752, 187863, -55905, 23752, -4387, -239326, -65913, 4422, -18158, -240325, -136237, 295294, 15064, 170384, 165692, 102964, -49884, -7691, -397186, 5834, -253941, -156807, -172025, -64080, 302115, -93545, -42563, 46855, -217086, 11930, 49365, 96410, -354264, 104868, -290421, 70249, 285231, -17250, -65361, -48809, -147737, 123460, -201001, 56315, 89962, -117036, 29467, -260692, 71072, 82052, -209617]
10819A56830C8418j0129a46747i518k51173Q5630H5634b526k7439j44024g6601
10807b47513A01098a39745c007j88325K6756g634l3275j80725R4894L5662A20806
10795e0494A1728a14586N4243n3157k66035E2215a00305A02937j7827a6142H0460
10783B1319J9662M5919i7644A18899J14563D6967k0826J45434a36586C0294j1967
10772A8327f8957m1715r0308j6264A60354c13403A42083E5763J11221C9339a09895
10760A94992j8828A1918a52277m729q1304N0414r9508C9160K59598A588a54108
10748A07160a1421l5963k11930B88435b33221n1914R6305i979A1700a50539L9599
10737a10940r481N5351p5087j15646k4566J28622C6612a39104c7474A70486o1889
$$ y = [156830, 38418, 28289, -146747, -9518, -260691, -175061, 85634, -2526, -29965, -173989, -76601, -247513, 101098, -139745, -3007, -191332, -164576, -7634, -40909, -221634, -126740, -91078, 120806, -50494, 11728, -114586, -60343, -113500, -379535, 52215, -100305, 102937, 85110, -16142, 80460, 21319, 40981, 86900, -97644, 118899, 233462, 46967, 26141, 171575, -136586, 30294, 18327, -68957, -110672, -200980, -217244, 160354, -313403, 142083, 55763, 166984, 39339, -109895, 194992, 176164, 11918, -152277, -157006, -238310, -187896, -287404, 39160, 298758, 1588, -154108, 107160, -11421, -47384, -259314, 288435, -233221, -285135, -188830, -9979, 11700, -150539, -110940, -120421, -65070, -140157, -255803, -280369, -151747, 36612, -139104, -37474, 170486, 108597]
10726A08597a02642A63088b05662A7272a89497f3206k05320g8796k00759A73380
10715B1866c7906m51898K14006a3586j71926E0210k5008a6521E2712b24284J2914
10704b11370A55031m4309i1095j31714Q9585D5422d89879A71762G0059a1023k25812
10693b36835B78870E0983n217M5114k0403a89423E8072i0473j87438A02145j7488
10682H4657b05200A10021a22459N7505q4003G4133l3246K17775o3140n5531K03784
10671C43775c5551k47310A5133c407A33642A0636b02140e9703j83289g1264j32698
10660b03962B24836c6663q3159j1550c7429n1222k29842b7815k87801j05784D9207
10648e97280K00843J94518A05340a71442C13016d9307A01240b52591D1204e01
$$ y = [108597, -102642, 163088, -205662, 17272, -189497, -63206, -268526, -78796, -279555, 173380, 21866, -37906, -489804, -275798, -13586, -185512, 50210, 25202, -16521, 52712, -224284, -211370, 155031, 110722, -91095, -222809, -133224, 45422, -489879, 171762, 70059, -11023, -236835, 278870, 50983, 45766, 90880, 70477, -189423, 58072, -90473, -277911, 102145, 84657, -205200, 110021, -122459, -64954, -148957, 74133, 40887, 258662, 195522, 139991, 343775, -35551, -282861, 15133, -3407, 133642, 10636, -202140, -59703, -242992, -71264, -203962, 224836, -36663, -119822, -131372, -37429, -88651, -318493, -27815, -315616, -421400, 49207, -597280, -396437, -201919, 105340, -171442, 313016, -49307, 101240, -252591, 41204, -501]
10637g6293A03919b72060B1214b86991J27036j06060C56436B5750J9560K6687
10627G1997N2679P3805a13635B07429J59735b78233J9274F25775C1615A818f9886
10615a23582D5354a7159I127a54140A11292a28242L9263j90964D4802J47339a95420
10603A15742K0081a25572c2592j02046R474k41513C2221N1080R635l5014a5009
10591d12003b8699k21365K8324Q1418A29319b05157l5307P5853B57714B3178a35463
10579A87195p579a31061m6520P9647D5865a22687D294K07729I1278a24328j96792
10568c21120A11725l1403h9218K67B04578d0192r6179O890G0851L00878G3810
10556A67333a12586j57558P7471b8440l3245l056j26721m2582e9099j59031e6960
$$ y = [-76293, 103919, -272060, 21214, -286991, -159955, -266015, 356436, 25750, 45310, 71997, 124676, 198481, -113635, 207429, 367164, -278233, -258959, 625775, 31615, 1818, -69886, -123582, 45354, -17159, 9127, -154140, 111292, -128242, -88979, -279943, 44802, 192141, -195420, 115742, 135823, -125572, -32592, -134638, -125164, -366677, 32221, 83301, 92936, 57922, -15009, -412003, -28699, -250064, -221740, -140322, 129319, -205157, -240464, -164611, 257714, 23178, -135463, 187195, 179616, -131061, -177581, -97934, 45865, -122687, 4294, 212023, 91278, -124328, -321120, 111725, 80322, -89218, -88951, 204578, -40192, -136371, -129481, 70851, 371729, 73810, 167333, -112586, -270144, -192673, -28440, -61685, -64741, -191462, -234044, -59099, -218130, -56960]
10544i0660M3689p5472j9761J4295j62758n1290i9524J9997m8058j25919C73866
10532c87504a38164B34181a50710G8623b83731H0117d6363E3678d1554B11419
10521b60629g7174l58726A18467b7880B3726L00839D8336Q119a35954k9642d6528
10509A04793d0268A43999F8749K207g4800m2220B89423C7350a74472a9433j65925
10498a85358B07507a45264C51146j73885l5157o7121b46386B87172g3698l27410
10488d01108A84804a47862B29229Q3909j6711h322A97247L49525m3480m3291L8787
10477D98788B13093R9926F5219J50379b2769o323G8520d8266A51162J8945K31238
10466D01345A80947k8414a1729A83974F0754K9227a13626E8957G922i1871A00042
$$ y = [-90660, -46971, -122443, -142204, -127909, -290667, -341957, -99524, -79527, -127585, -253504, 373866, -387504, -138164, 234181, -150710, 78623, -283731, 80117, -46363, 53678, -41554, 211419, -260629, -77174, -435900, 118467, -27880, 23726, 324565, 48336, 56455, -135954, -165596, -46528, 104793, -40268, 143999, 68749, 70956, -74800, -117020, 289423, 37350, -174472, -19433, -185358, 207507, -145264, 351146, 177261, 142104, 74983, -246386, 287172, -73698, -401108, 184804, -147862, 229229, 313138, 296427, -8322, 197247, 546772, 503292, 460001, 498788, 213093, 313019, 65219, 215598, -22769, -29092, 78520, -48266, 151162, 170107, 401345, 180947, 152533, -11729, 183974, 60754, 89981, -113626, 58957, 7922, -91871, 100042]
10454A98817b01111h8427D9945J73635C4245L6459f0902r121G6139a35682k0588
10443a56270B62867a4219p7835C18611d121l39697J59599j12738F4462d5326j14941
10432a60267L7632o6147l6370J987J1021g2944A20075a85294K208B28997a52722
10420b46274b8498k73302A67098n1921c985C18587c07765A14239b65413d5088
10409A19379j0536h9037n9204g3360C0162J81290a24700b0327r5152H9521f3956
10397a12506a8103r3538a7419H4846C3802j518M0107K31258j33269E4703a5789
10385i7540A77067g7778B07L5153J16844a84417A17658k8736L1296L20714j51021
10374B89911N465j4925E9558J86589O5251m0728c9939k7974F13822k70364R4631
$$ y = [198817, -201111, -88427, 49945, 223580, 34245, 70704, -60902, -70023, 76139, -135682, -156270, 262867, -14219, -92054, 318611, -4121, -343818, -184219, -296957, 64462, -45326, -160267, -122635, -188782, -225152, -223165, -212144, -72944, 120075, -185294, -183086, 228997, -152722, -246274, -28498, -301800, 167098, 115177, -3985, 318587, -307765, 114239, -265413, -45088, 119379, 108843, -89037, -148241, -73360, 30162, 211452, -124700, -20327, -115479, 89521, -63956, -112506, -18103, -111641, -17419, 84846, 33802, 32284, 72391, 303649, 170380, 54703, -15789, -97540, 177067, -77778, 207, 35360, 152204, -184417, 117658, 88922, 120218, 440932, 289911, 295376, 280451, 59558, 246147, 311398, 270670, -39939, -67913, 613822, 343458, 438089]
10363D38089j86801J35693c2859D19337B9195b78218B56077K70567B21351L122
10353B24473p3492L04727A37313M13124k6155j93698j4118A16027J2957J14576
10343B43560K49821j11876j00300o8987i863n10B16667C5183b70119D36381j62617
10332B73764l0256D3975Q3145n3n4718F297q18P058M24549E4515N0301k1943j2324
10319G0549k4693a0521D29892a58164A19842f488B21256B4632d1572j78486A79631
10307a89344f079o8774k16402i6805J1596B370d52543b19965C6519J05597b88207
10295d5727o8929M8707A01482J52871A2038P4806k9073b94123a23146h351j1537
10284a9888A9387b55354K8580C10621A34757c30410B02151C7249a70151m6885
$$ y = [438089, 251288, 386981, -32859, 419337, 29195, -278218, 256077, 526644, 221351, 224473, 150981, 455708, 137313, 550437, 524282, 330584, 316466, 116027, 128984, 243560, 493381, 381505, 281205, 212218, -9863, -10373, 216667, 35183, -270119, 436381, 273764, 243508, 43975, 127120, 127067, 72349, 6297, 5479, 12537, 437086, 54515, 104816, 82873, 70549, 45856, -10521, 429892, -158164, 119842, -6488, 221256, 24632, -41572, -220058, 179631, -189344, -6079, -74853, -291255, -96805, -85209, 2370, -452543, -219965, 36519, 142116, -288207, -45727, -114656, -65949, 101482, 254353, 12038, 86844, 57771, -294123, -123146, -8351, -19888, 19387, -255354, -226774, 310621, 134757, -330410, 202151, 37249, -170151, -217036]
10274b17036D02204j80751c57175g8380B81102e9366B72864q9980f6829B318R9993
10263A02311c25093A22102B5856a2498F21948j71811A40708m2538L29522J28331
10253E56023G7895a56829c0261P91m71147C8432J65751a58979k0883a7757j57592
10242a75349L6416I4017J90636r5948b16149a01527A7654a73132H9850M5593b23949
10230c65155h5668a9732j71483A37705a64356n8164C1710R3753h5908j41189A46661
10218C3351J6742a36801A79836f2993j73281B29861a02939M6797k05660K2165
10208b39637A13211k1448L254a08337D5301f5247j51215a5678j11508a9362O46
10197a8716A31192c59995n3122J69474h0971n826K7597r679B49271a72116k79572
$$ y = [-217036, 402204, 221453, -357175, -78380, 281102, -59366, 272864, 182884, -66829, 2318, 102311, -325093, 122102, 25856, -12498, 621948, 450137, 140708, 98170, 427692, 556023, 77895, -156829, -30261, -29470, -500617, 38432, 204183, -158979, -179862, -17757, -175349, -138933, 94017, 284653, 188705, -216149, -101527, 17654, -173132, 89850, 135443, -223949, -365155, -85668, -19732, -191215, 137705, -164356, -222520, 31710, 125463, -85908, -227097, 146661, 33351, 50093, -136801, 179836, -62993, -236274, 229861, -102939, -56142, -261802, -239637, 113211, 91763, 95017, -108337, 45301, -65247, -216462, -15678, -127186, -19362, -18716, 131192, -359995, -413117, -243643, -80971, -86797, -59200, -68879, 249271, -172116, -451688]
10186d51688J82973C61300b827n4939j91738n7277c151j62746G6398a98258K7946
10175a70312B95399D4542K92167A66377m2641c0604A00339a7058B77163A30800
10164G2342c7218a5110C74041a01828K0033L7337B21852g7677B64064a71217n9942
10153b31159A86620a69471a5680k23473N8426N5773C4470a6629m1091H4039P5038
10142A59077g5797j33885b3509A10579c1805A46416a34053L0525J3875j60522
10132b50175A21713i4779C0003A4013J75367E3317d9345j45380Q6991C7487f7034
10120g9816j09442h2104j14605k1239f8488j7432D2058e6616j11357m9744A67841
10108a08840A0182h6639A15865L7700b43563a15147A6463i333k17819h0231B04398
$$ y = [-451688, -268715, 361300, -2827, -57766, -249504, -306781, -3151, -165897, 76398, -198258, -170312, 295399, 44542, 336709, 166377, 123736, -30604, 100339, -17058, 277163, 130800, 72342, -37218, -15110, 374041, -101828, -81795, -44458, 221852, -77677, 264064, -171217, -231159, 186620, -169471, -15680, -239153, -180727, -124954, 34470, -16629, -57720, 84039, 159077, -75797, -209682, -23509, 110579, -31805, 146416, -134053, -103528, -89653, -250175, 121713, -94779, 30003, 14013, 189380, 53317, -49345, -194725, -107734, 37487, -67034, -79816, -189258, -82104, -196709, -217948, -68488, -85920, 42058, -56616, -167973, -217717, 167841, -108840, 10182, -86639, 115865, 153565, -243563, -115147, 16463, -9333, -227152, -80231, 204398]
10096b721B09828m542b80989I5467D7376A1005J5914b56519J24517F0425a39344
10084a06223j32629P9559A13307b0879j43509E2510c65033a58076D8755a05085
10073G7671a00452m26552a42188P0979n163a0197C7800N446J20309L9549I7090
10061b77271A32414A6716h1241k002C46111a31383D6268b6842j53569B69905A09419
10049B72377j05234p5235d30308K05634r7215B04735I9739d3907j24776A61814
10038A74854K11816A77361c83003d7310J3958A20761j8401G126b25563A02444
10027c11200f4204G3000h2441j77775h0721A5621a96025P5350K8212A68035p6656
10016I1379a02902B70251M1232F7436f3031k8013A24480b81339a32879k44517
$$ y = [-2721, 209828, 205286, -280989, 95467, 47376, 11005, 26919, -256519, -132002, 60425, -139344, -106223, -238852, -159293, 113307, -20879, -164388, 52510, -365033, -158076, 48755, -105085, 77671, -100452, -527004, -142188, -71209, -76372, -10197, 37800, 43246, 163555, 203104, 97090, -277271, 132414, 16716, -81241, -83243, 346111, -131383, 46268, -26842, -180411, 269905, 109419, 272377, 167143, 91908, -430308, -224674, -321889, 204735, 99739, -43907, -168683, 161814, 174854, 386670, 177361, -383003, -47310, -33352, 120761, 102360, 7126, -225563, 102444, -311200, -64204, 73000, -82441, -260216, -80721, 15621, -196025, -120675, -92463, 168035, 91379, -102902, 270251, 311483, 67436, -63031, -91044, 124480, -281339, -132879, -377396]
10006c77396c1994G9187O1287f8434k37232J1554B15678a98844j2901f5521E0227
9994b7942l2123j90969P2951A5226a01219B01816c18419B6118b93271D2023f4199
9982b02580A02017b56182A01200f9881H9251b3291k6051j97189A57980a19974
9971a49430j04129A60949A9046c1254a3585k40724f9617B22671B8503C196M3981
9960D7177b46734a03268j67346B25883e3760A86089l9734a64834e5346A31708
9949A6014a39601j75791a2400m62474b00685D8235d02334g1579j07586A73677
9938d11675R1643a44154E3536b86786G6122a39259r4489k7458p2891J49373P8567
9927a06157j02875c4197j98793C8953M7011d6758B80932b13448E310a37980q880
$$ y = [-377396, -31994, 79187, 140474, -68434, -305666, -294112, 215678, -198844, -211745, -65521, 50227, -27942, -60065, -251034, -178083, 15226, -101219, 201816, -318419, 26118, -293271, 42023, -64199, -202580, 102017, -256182, 101200, -69881, 89251, -23291, -49342, -246531, 157980, -119974, -149430, -253559, 160949, 19046, -31254, -13585, -254309, -69617, 222671, 28503, 3196, 47177, -246734, -103268, -270614, 225883, -53760, 186089, 146355, -164834, -55346, 131708, 16014, -139601, -315392, -12400, -474874, -200685, 48235, -402334, -71579, -179165, 173677, -411675, -320032, -144154, 53536, -286786, 76122, -139259, -233748, -261206, -334097, -184724, -106157, -209032, -34197, -232990, 38953, 85964, -46758, 280932, -213448, 5310, -137980, -146860]
9916a46860j44583A93202a92909o2653B12274m3684b49309J19014A39470a1562
9905C45649i054B2771a78776A20101g4481F4621J72429h3915l2837M4245k42792
9894c15299D6054a53042C368J18148n9464a06966k68111Q8777f5002A79146a52376
9882h9189k5927M2622l3880L431J1596L2786B7795b23802B78886C1417c23337
9870a8093A33706a55470B22555I406d5340H6998a48155D04074C0707O4912K8911
9859A24530i4796j50906B56578A05281a32550B2782q409a58973N4303d2448A02517
9847F7477b47564Q6403b1339p0581C79983b81021M7100l3295c4857I1507a45221
9835e5078m28605C10293A06374e4203j3394B9544a67501C2594p73a63832L8307
$$ y = [-146860, -291443, 193202, -192909, -255562, 212274, 168590, -249309, -130295, 139470, -11562, 345649, -9054, 22771, -178776, 120101, -74481, 64621, 237050, -83915, -116752, -72507, -315299, 46054, -153042, 3368, 121516, 62052, -106966, -375077, -286300, -65002, 179146, -152376, -89189, -115116, -72494, -106374, -102943, -91347, -58561, 27795, -223802, 278886, 31417, -323337, -18093, 133706, -155470, 222555, 9406, -45340, 86998, -148155, 404074, 30707, 95619, 124530, -94796, -245702, 256578, 105281, -132550, 22782, 14373, -158973, -104670, -42448, 102517, 67477, -247564, -161161, -21339, -91920, 379983, -281021, -233921, -267216, -34857, 91507, -145221, -55078, -483683, 310293, 106374, -54203, -67597, 29544, -167501, 32594, 31821, -163832, -125525]
9824a25525E3428J82620C8505J62085k0505L8812F7142a81147k9237B74263d2499
9812c997j96076P2654f0841k56833N0959A90893h695k4078H1173a3008l97125
9801d10133A3146c61894J60412k13142E4712J4257A6549R8725f3415k8784r3204
9790a85403l0400B6669b14384a0332C3673d4875I5294b13024d5487k230A91494
9778a10276b4598b430q7674k10772J34235A5406K54755C3865a03260A2084b05098
9766h1863j97169j55654I8909f908l0444l635A47152o2686c32402a35128l12520
9755d47648A55016f4783j18588a780B50911f6798B77898a82950A8442N9723K66523
9744C44688A35400a09202p0057d0540j95204h5673J5215j43823l00703A25268
$$ y = [-125525, 53428, 236048, 38505, 200590, 180085, 218897, 67142, -181147, -210384, 274263, -42499, -3997, -200073, -127419, -60841, -317674, -266715, 190893, -8695, -32773, 81173, -13008, -410133, 13146, -361894, -201482, -414624, 54712, 68969, 16549, 115274, -63415, -92199, -185403, -215803, 26669, -214384, -10332, 33673, -44875, 95294, -213024, -45487, -47717, 191494, -110276, -24598, -2430, -90104, -300876, -166641, 15406, 270161, 33865, -103260, 12084, -205098, -81863, -279032, -434686, 98909, -6908, -37352, -40987, 147152, 84466, -332402, -135128, -447648, 155016, -64783, -183371, -1780, 250911, -66798, 277898, -182950, 18442, 78165, 344688, 135400, -109202, -179259, -40540, -235744, -85673, -70458, -214281, -514984, 125268]
9733A98526I7203b47184d9435j25019j07151i2166H6725d9765B4943a35553j91872
9722c27425O7926B93195b821p8455k48011B006K87057d67924D162J5435b12985
9710c85662P9881A37372b67991E3446b55636i8922A74488Q3660c81462J48201
9700b33261j20996B38298b95007h3065A33065e86383g7303A51398d4487j03941
9690a48428k96974J96819A32589a59893H6020g1999A30710f8178A86227b3234
9679B40253B5908J14593b34390A8385h2994J6375C40234b2405o5218E3703J52288
9668B05991n4242p3074J2835d79394a59223M8226K7606A5339i499H5482a59360
9656B93932a37814j64318C824e36971a71967B4138a25328J2671R51l5454m2780
$$ y = [198526, 97203, -247184, -49435, -174454, -281605, -92166, 86725, -49765, 24943, -135553, -327425, -259499, 293195, -2821, -81276, -329287, 2006, 289063, -467924, 4162, 19597, -212985, -385662, -305781, 137372, -267991, 53446, -255636, -98922, 174488, 258148, -381462, -233261, -354257, 238298, -295007, -83065, 133065, -586383, -77303, 151398, -44487, -148428, -445402, -248583, 132589, -159893, 86020, -71999, 130710, -68178, 186227, -23234, 240253, 25908, 140501, -234390, 18385, -82994, -66619, 340234, -22405, -87623, 53703, 205991, 151749, 78675, 91510, -479394, -159223, -110997, -83391, 15339, -9499, 85482, -159360, 293932, -137814, -302132, 3824, -536971, -171967, 24138, -125328, -112657, -111706, -147160, -189940]
9645a89940C00178a01177r0102j32182a1022r1664I7347h4827A71851J7029a59313
9633a49035C4962a25942c5288l65621F4677B1895d2217j60430j24232J31581k65825
9622d61123e5981k10996J19303N2261k4088A7600b84278O6511J6464m6242B86449
9610a95687f8819a6230j24754J9395m9746l1121h6800L7273B8225R6309c99346
9598d6119l92561e7557j87631C8835c804n7479k24920J07687O4596K3526A1142
9586A9857b58669R370R0315j34821C206K45671c24119r8582f6394A68891a48552
9574d4004F3605a25134E8003h9413A60900a8579j09555k528a1370H5038a48216
9562b11861O0093A70148b32913P2866A5761L50853e8273K0325D87571D0939a8341
$$ y = [-189940, 300178, -101177, -191279, -323461, -11022, -102686, 97347, -84827, 171851, 188880, -159313, -149035, 34962, -125942, -35288, -400909, 64677, 21895, -42217, -202647, -326879, -195298, -461123, -55981, -266977, -147674, -95413, -119501, 17600, -284278, -217767, -201303, -247545, 286449, -195687, -68819, -16230, -140984, -121589, -171335, -202456, -86800, -49527, 28225, 124534, -399346, -46119, -438680, -57557, -245188, 38835, -3804, -61283, -286203, -178516, -113920, -90394, 11142, 19857, -258669, -249299, -158984, -293805, 3206, 248877, -324119, -422701, -66394, 168891, -148552, -44004, 63605, -125134, 58003, -89413, 160900, -18579, -128134, -130662, -11370, 85038, -148216, -211861, -151768, 170148, -232913, -160047, 15761, 366614, -58273, -37948, 487571, 40939, -18341]
9550A62821b89798Q1626P3389o8180C01228a53648a4775q0317G323a66802m9992
9539b16794k13983Q3991L9955h3879D2832a23825E8109h2622k64744J02424l19185
9528e64127K38497B4758J01277a02469j78867A38560b53706B79814a58177I8436
9517f4856I0037C6367a41459C57500g5242j16333j12799l9725A81821j4184F2454
9505H9186h9121D5403J36966p6372c54682i8343o8788M0996M8068j43361B33401
9493B34375I9949A4122a35638f605j63463b2833l24185P0553N6499P6854B75442
9481c7129n10420b9230A80270E4958L6276b2213B90429a50278c6732B01697C6802
9469I0145M2472j3010e5405p0738m6453I1948k8554N8509b05660r1421B49442
$$ y = [162821, -289798, -208172, -134783, -202963, 301228, -153648, -14775, -95092, 7323, -166802, -216794, -430777, -346786, -306831, -83879, 42832, -123825, 58109, -82622, -347366, -244942, -564127, -325630, 24758, 126035, -102469, -281336, 138560, -253706, 279814, -158177, 98436, -64856, 90037, 36367, -141459, 357500, -75242, -191575, -304374, -344099, 181821, 167637, 62454, 89186, -89121, 45403, 182369, 105997, -354682, -98343, -167131, -126135, -78067, -221428, 233401, 234375, 99949, 14122, -135638, -6605, -170068, -22833, -347018, -276465, -219966, -143112, 275442, -37129, -547549, -29230, 180270, 54958, 91234, -22213, 290429, -150278, -36732, 201697, 36802, 90145, 132617, 119607, -55405, -126143, -172596, 91948, 63394, 121903, -205660, -297081, 249442]
9457b61867c8695D6023R7338b49337A30992b36992k9843B07260a58500J1702A18790
9445A23003e5324r599m7297a0642j03276E9936b13449O2717j26304b9981k72346
9434c02327H0147a26076o7250j02267b7679E2474A2743b25361l6400A73381a26283
9422h7451D9850a13272B95897e9505p1006K0554M974D820a76766E4146K5027B7828
9409b03212o042B664a30088B00555E7951K4851c7836l30434B09819a89160j4572
9398b03732M7681f0327E84c7229J2962H5064d16588J02246a1724k03316M5987
9387a69053C84858A73585m6973C391c34835f3328D8908f7989K0502A85371G3870
9375a760j32590m5846a2230p8265D7993J2832f3896k35176J1245b2408j90307
$$ y = [-261867, -38695, 46023, 143361, -249337, 130992, -236992, -266835, 207260, -158500, -146798, 118790, 123003, -55324, -64923, -112220, -10642, -113918, 59936, -213449, -150732, -277036, -29981, -302327, 80147, -126076, -193326, -295593, -27679, 52474, 12743, -225361, -261761, 173381, -126283, -87451, 49850, -113272, 295897, -59505, -130511, -109957, -104983, 4820, -176766, 54146, 79173, 27828, -203212, -209254, 2664, -130088, 200555, 57951, 82802, -37836, -368270, 209819, -189160, -203732, -156051, -60327, 584, -37229, -24267, 85064, -416588, -314342, -11724, -215040, -169053, 384858, 173585, 126612, 3391, -334835, -63328, 48908, -67989, -47487, 185371, 73870, -1760, -134350, -180196, -12230, -90495, 47993, 60825, -63896, -299072, -287827, -22408, -212715]
9364b12715h9857e435j53988e47k03678D0944f5039L0240k65175H9903a40366
9352b77869C61008c32851i8613B98849o4942I6337e6787j24367q0327P8521P1705
9341a11255F7902a37517j9932r3647J14746k10043b0393A51771b76509A7713K10456
9330B28169c34991B93508o8540i974k14466G8514b11732g4542k35648I8779b57685
9318a59363A10405c91768a45019l4662A60136a1599j13894L9441C2187J99456
9308B31643H0277J15940b62749J24996E2149c1942A54798a06327B02250b11524
9297A2978c9390j17272j8366A53446m9016a70042B74679a74232o4654G8047c21391
9285a74088b2713J625k19907h988n583q674p9596I9270d2435o212j35067E2327
$$ y = [-212715, -89857, -5435, -159423, -547, -204225, 40944, -65039, -34799, -299974, 89903, -140366, -277869, 361008, -332851, -98613, 298849, 233907, 96337, -56787, -181154, -261481, -182960, -111255, 67902, -137517, -157449, -251096, -136350, -346393, -20393, 151771, -276509, 17713, 228169, -334991, 293508, 224968, -9974, -224440, 78514, -211732, -74542, -310190, 98779, -257685, -159363, 110405, -391768, -145019, -179681, 160136, -11599, -125493, -86052, 32187, 231643, 80277, 196217, -262749, -137753, 52149, -31942, 154798, -106327, 202250, -211524, 12978, -39390, -156662, -175028, 153446, 104430, -170042, 274679, -174232, -238886, 78047, -321391, -174088, -22713, -21088, -240995, -8988, -14571, -23245, -102841, 99270, -42435, -48647, -183714, 52327]
9272a81974J5713I4062a74963f9844j75909F2179b5594j00569m0349j11832b5391
9260g8611n1734j48461e7805B2408J6138a28979H5616J98h7818G7694A6326b74997
9247a4743j68586k3827g6967J2309A94018i00C88K2420K94011b55482I6747f2375
9234d9692j1655k4181o6035e431p4864n2797j7397a4625A50192a61111c5208b46
9221a21864j13519R2512r1346a8551j91213G6390a65367L5151p7090E5643d7184
9209b67232A74029b88067g0107A39962b40818K7264j08369J25476A09845c10181
9198b52730A84909b5720j22712A60359b23906o3191a19935A3131J32414b59146
9187i7603C9778c26192A4373b75202G7808J26301h9067L1234b1421N484j27324
$$ y = [-181974, -166261, 94062, -174963, -69844, -245753, 62179, -25594, -126163, -166512, -278344, -25391, -78611, -130345, -278806, -57805, 22408, 38546, -128979, 85616, 85814, -87818, 77694, 16326, -274997, -14743, -183329, -207156, -76967, -64658, 194018, -900, 388, 22808, 316819, -255482, 96747, -62375, -49692, -61347, -85528, -151563, -5431, -80295, -133092, -150489, -14625, 150192, -161111, -35208, -246, -121864, -235383, -142871, -234217, -18551, -209764, 76390, -165367, -130216, -207306, 55643, -47184, -267232, 174029, -288067, -70107, 139962, -240818, -213554, -321923, -196447, 109845, -310181, -252730, 184909, -25720, -148432, 160359, -223906, -287097, -119935, 13131, 145545, -259146, -97603, 39778, -326192, 14373, -275202, 77808, 204109, -89067, -57833, -21421, -15937, -143261]
9176a43261O3284l81655b19065A67634G9473j1653f6775q9292C33900c1145n0754
9165h1899A61845a35979D0193c775j40767A36135a81768j15711J06220A33756
9154b17381E7341f2325m59767A1386d05082H3991c52999h7338j94540J7694C07168
9142c0986C26348f9712j0425C6973i3449r3871f6386A3254m171b86186f962l7810
9130d4772j70154r5551E139O542a75592m65838G9281c2160k30484C23542c15093
9118d8839j41636B66419p7845b16032i0306A6674a04548B82581A6936a43091A24206
9106I9681k5650h9136D1929M7140M6765J09611c45765B28085a06967A6487d09138
9094B07061F9845K78380j3143D836K13879b26206R5585B46172a06735r10d7073
$$ y = [-143261, -79977, -461632, -219065, 167634, 79473, 67820, -66775, -156067, 333900, -31145, -81899, 161845, -135979, 40193, -3775, -144542, 136135, -181768, -297479, -191259, 133756, -217381, 57341, -62325, -522092, 11386, -405082, 83991, -352999, -87338, -281878, -264184, 307168, -30986, 326348, -69712, -80137, 36973, -93449, -187320, -66386, 13254, 9083, -286186, -6962, -44772, -214926, -310477, 5139, 11681, -175592, -641430, 79281, -32160, -262644, 323542, -315093, -48839, -190475, 266419, 188574, -216032, -90306, 16674, -104548, 282581, 16936, -143091, 124206, 99681, 74031, -89136, 41929, 89069, 135834, 245445, -345765, 228085, -106967, 16487, -409138, 207061, 69845, 348225, 335082, 4836, 218715, -226206, -130621, 246172, -106735, -107645, -47073]
9082a14110D7027b94018h0735A94808c24012M8346j60664J00703A47234a94331
9071G40e52137a86360k3711h6485A0269b61071b6898p9792L7317n7474j46920
9060b73767F6228b70330A2407i3389j15769R4622A16894a11915n5674O4766A32187
9048a96154b8191F9024k1616a08768e1652k11942a02145j49582d9906C5312b38474
9036H9244J65831c6725C588O3705g5560F6316A1701K76383l4332i3306C6174a49765
9023c14270f9985j18033C79704b41116B4404J9025b06427A6194c5353k89432b5931
9011b46101A80743b05781D21436C7779f9586k841A93196f6915A97116o9582e5771
8999E2027L36938c7210k54031c9441A184a69883l99843E6318K595p770b27517
$$ y = [-114110, 47027, -294018, -80735, 194808, -324012, -275666, -436330, -335627, 147234, -194331, 740, -552137, -186360, -210071, -86485, 10269, -261071, -26898, -106690, -69373, -126847, -273767, 66228, -270330, 12407, -93389, -209158, -114536, 116894, -111915, -167589, -102823, 132187, -196154, -28191, 69024, 47408, -108768, -51652, -263594, -102145, -251727, -49906, 35312, -238474, 89244, 255075, -36725, 3588, 67293, -75560, 66316, 11701, 288084, 253752, -93306, 36174, -149765, -314270, -69985, -188018, 379704, -241116, 24404, 43429, -206427, 16194, -35353, -324785, -25931, -246101, 180743, -205781, 421436, 37779, -69586, -72427, 193196, -66915, 197116, 127534, -55771, 52027, 388965, -37210, -291241, -39441, 1184, -169883, -569726, 56318, 58913, 51143, -227517]
8987b38622c6552n3399o0178j06618J23430k2006F682a7236B55833A08929b12788
8975a40345B84034H2354b50918a09895A6244f0570C27468a75080B24465d03205
8964c43534A09173L0534a69032j1262C4797c16936D3269b44526B23505a0724E4407
8952f8373k52287f0210p6478A80056b6064j93026B01073E0454O7032b39101b9586
8940B09712n3191J8241b16226B12628f7506B13384h4384r5769B04586B4308d7845
8928b312A20593l8187M65159L60148N41418J899191L180547K42483B063335B01225
8917I6894A6705J62360o4420a68151l34545f307j85006D22561a95698A2259L28
8906A2587J00240d90151a16429J2514d9229j04618E9764b54394P7956F5110a44011
$$ y = [-238622, -36552, -89951, -150129, -256747, -133317, -155323, 6682, -17236, 255833, 108929, -212788, -140345, 284034, 82354, -250918, -109895, 16244, -60570, 327468, -175080, 224465, -403205, -343534, 109173, 139707, -169032, -180294, 34797, -316936, 43269, -244526, 223505, -10724, 54407, -68373, -320660, -60210, -136688, 180056, -26064, -219090, 201073, 50454, 117486, -239101, -29586, 209712, 156521, 174762, -216226, 212628, -67506, 213384, -84384, -180153, 204586, 24308, -47845, -2312, 120593, 82406, 547565, 907713, 1449131, 3348322, 6528869, 6771352, 2063335, 201225, 96894, 16705, 179065, 114645, -168151, -502696, -6307, -191313, 422561, -195698, 12259, 12587, 112827, -490151, -116429, -103915, -49229, -153847, 59764, -254394, -176438, 65110, -144011]
8894C3662a67094K2314r3425B11079a5181k13833A16008b1719j26860N2359j03936
8883b00156A25813a8005B210c82949a8305k54767A12947b32194B9187b37419A30198
8871F4507C0716d32487C45295A22124J27868D8769L4856J23920J17231c35532
8860B93446j19064l3088F2127a49212B85676C7029e5937l1244k2180M7320B11237
8848a65223A32272j8847e2962j4747j90840a28207d5601j95405J18952j75410
8838b97464A25460e3990j38136N9537A47672D8008L3250Q0920a9110E8070R3545
$$ y = [33662, -167094, -144780, -238205, 211079, -15181, -229014, 116008, -21719, -148579, -96220, -200156, 125813, -18005, 2210, -382949, -18305, -273072, 112947, -232194, 29187, -237419, 130198, 64507, 30716, -432487, 345295, 122124, 249992, 48769, 83625, 207545, 324776, -335532, 293446, 174382, 141294, 62127, -149212, 285676, 37029, -55937, -87181, -109361, -62041, 211237, -165223, 132272, 113425, -52962, -67709, -258549, -128207, -45601, -241006, -122054, -297464, 125460, -53990, -192126, -132589, 147672, 48008, 81258, 162178, -19110, 58070, 151615]
$$ [...]
##END NTUPLES=NMR SPECTRUM
##END=
