##TITLE=AC1650_NSJAH14351_8531644_rksqJE5PUv
##JCAMPDX= 6.0         $$ Bruker NMR JCAMP-DX V2.0
##DATA TYPE= NMR SPECTRUM
##DATA CLASS= NTUPLES
##ORIGIN= BRUKER
##OWNER= Administrator
$$ 1.72 TOPSPIN		Version 2.1
$$ 2014-03-14 18:13:49.448 -0800  Administrator@X
$$ Compression mode = diff/dup
##.OBSERVE FREQUENCY= 400.02188249412
##.OBSERVE NUCLEUS= ^1H
##.ACQUISITION MODE= SIMULTANEOUS (DQD)
##.ACQUISITION SCHEME= undefined
##.AVERAGES= 64
##.DIGITISER RES= 22
##SPECTROMETER/DATA SYSTEM= spect
##.PULSE SEQUENCE= noesygpps1d.comp
##.SOLVENT NAME= COFFEE_meoh
##.SHIFT REFERENCE= INTERNAL, COFFEE_meoh, 1, 14.96081
##AUDIT TRAIL= $$ (NUMBER, WHEN, WHO, WHERE, PROCESS, VERSION, WHAT)
$$ ##TITLE= Audit trail, TOPSPIN		Version 2.1
$$ ##JCAMPDX= 5.01
$$ ##ORIGIN= Bruker BioSpin GmbH
$$ ##OWNER= Administrator
$$ $$ E:\/data/COFFEE/nmr/AC1650_NSJAH14351_8531644_rksqJE5PUv/12/pdata/1/auditp.txt
$$ ##AUDIT TRAIL=  $$ (NUMBER, WHEN, WHO, WHERE, PROCESS, VERSION, WHAT)
(   1,<2014-03-14 18:13:44.510 -0800>,<Administrator>,<X>,<go>,<TOPSPIN 2.1>,
      <created by zg
	started at 2014-03-14 18:02:14.546 -0800,
	POWCHK enabled, PULCHK disabled,
       configuration hash MD5:
       C8 4E 4E 5D D3 5C D8 9E 9F 52 82 E0 59 8A DE 15
       data hash MD5: 64K
       7E F3 B7 49 E6 7F BF 85 D6 1B 7F 26 85 41 49 FB>)
(   2,<2014-03-14 18:13:47.416 -0800>,<Administrator>,<X>,<proc1d>,<TOPSPIN 2.1>,
      <Start of raw data processing
       efp LB = 0.3 FT_mod = 6 PKNL = 1 PHC0 = 0 PHC1 = 0 SI = 128K 
       data hash MD5: 128K
       49 B0 CA 89 40 CA A6 72 5D 0C C3 21 E7 4A E5 43>)
(   3,<2014-03-14 18:13:48.369 -0800>,<Administrator>,<X>,<proc1d>,<TOPSPIN 2.1>,
      <pk PHC0 = -84.12781 PHC1 = 0 
       data hash MD5: 128K
       6F DA 1A D0 49 D6 BF 08 B6 17 B2 86 B2 05 45 95>)
(   4,<2014-03-14 18:13:48.807 -0800>,<Administrator>,<X>,<proc1d>,<TOPSPIN 2.1>,
      <abs ABSG = 1 
       data hash MD5: 128K
       E9 FA D8 CE 47 25 4F 60 DE B8 B1 02 14 A4 B6 96>)
(   5,<2014-03-14 18:13:48.916 -0800>,<Administrator>,<X>,<proc1d>,<TOPSPIN 2.1>,
      <abs ABSG = 2 
       data hash MD5: 128K
       8F 19 13 46 05 62 2D 17 1A EC 82 B9 AD 39 E1 32>)
(   6,<2014-03-14 18:13:49.041 -0800>,<Administrator>,<X>,<proc1d>,<TOPSPIN 2.1>,
      <abs ABSG = 3 
       data hash MD5: 128K
       CA 0C C3 5B 74 BC D7 51 AB 8A 42 68 B1 76 4A 3A>)
(   7,<2014-03-14 18:13:49.135 -0800>,<Administrator>,<X>,<proc1d>,<TOPSPIN 2.1>,
      <abs ABSG = 4 
       data hash MD5: 128K
       88 04 92 40 20 A2 4A D6 E2 F6 B7 7F D2 1C FD FC>)
(   8,<2014-03-14 18:13:49.244 -0800>,<Administrator>,<X>,<proc1d>,<TOPSPIN 2.1>,
      <abs ABSG = 5 
       data hash MD5: 128K
       E7 B7 5D 3C 6F 88 8A 1A D4 DD 08 7E 76 C8 CA FF>)
$$ ##END=
$$ 
$$ $$ hash MD5
$$ $$ 94 37 14 96 0D 59 2C 7B 03 E9 FA FB B3 9D BA DD
##$RELAX= 
##$RELAX= 
##$RELAX= 
##$RELAX= 
##$RELAX= 
##$RELAX= 
##$RELAX= 
##$RELAX= 
$$ Bruker specific parameters
$$ --------------------------
##$DU= <E:\>
##$EXPNO= 12
$$ [...]
150 150 150 150 150 150 150 150
##$TP07= 0
##$TPNAME0= <>
##$TPNAME1= <>
##$TPNAME2= <>
##$TPNAME3= <>
##$TPNAME4= <>
##$TPNAME5= <>
##$TPNAME6= <>
##$TPNAME7= <>
##$TPOAL= (0..7)
0.5 0.5 0.5 0.5 0.5 0.5 0.5 0.5
##$TPOFFS= (0..7)
0 0 0 0 0 0 0 0
##$TUNHIN= 0
##$TUNHOUT= 0
##$TUNXOUT= 0
##$USERA1= <user>
##$USERA2= <user>
##$USERA3= <user>
##$USERA4= <user>
##$USERA5= <user>
##$V9= 5
##$VALIST= <valist>
##$VCLIST= <CCCCCCCCCCCCCCC>
##$VD= 0
##$VDLIST= <DDDDDDDDDDDDDDD>
##$VPLIST= <PPPPPPPPPPPPPPP>
##$VTLIST= <TTTTTTTTTTTTTTT>
##$WBST= 1024
##$WBSW= 4
##$XGAIN= (0..3)
0 0 0 0
##$XL= 0
##$YL= 0
##$YMAX_a= 6182668
##$YMIN_a= -13622562
##$ZGOPTNS= <>
##$ZL1= 120
##$ZL2= 120
##$ZL3= 120
##$ZL4= 120
##$ABSF1= 14.96081
##$ABSF2= -5.597372
##$ABSG= 5
##$ABSL= 3
##$ALPHA= 0
##$AQORDER= 0
##$ASSFAC= 0
##$ASSFACI= 0
##$ASSFACX= 0
##$ASSWID= 0
##$AUNMP= <proc_prof1d_extract.lims>
##$AXLEFT= 0
##$AXNAME= <>
##$AXNUC= <1H>
##$AXRIGHT= 0
##$AXTYPE= 0
##$AXUNIT= <>
##$AZFE= 0.1
##$AZFW= 0.1
##$BCFW= 0
##$BC_mod= 0
##$BYTORDP= 0
##$COROFFS= 0
##$CY= 15
##$DATMOD= 1
##$DC= 0
##$DFILT= <>
##$DTYPP= 0
##$F1P= 0
##$F2P= 0
##$FCOR= 0.5
##$FTSIZE= 131072
##$FT_mod= 6
##$GAMMA= 0
##$GB= 0
##$INTBC= 1
##$INTSCL= 1
##$ISEN= 128
##$LB= 0.3
##$LEV0= 0
##$LPBIN= 0
##$MAXI= 10000
##$MC2= 0
##$MEAN= 0
##$ME_mod= 0
##$MI= 0
##$NCOEF= 0
##$NC_proc= -2
##$NLEV= 6
##$NOISF1= 0
##$NOISF2= 0
##$NSP= 0
##$NTH_PI= 0
##$NZP= 0
##$OFFSET= 14.96081
##$PC= 1
##$PHC0= -84.12781
##$PHC1= 0
##$PH_mod= 1
##$PKNL= yes
##$PPARMOD= 0
##$PPDIAG= 0
##$PPIPTYP= 0
##$PPMPNUM= 2147483647
##$PPRESOL= 1
##$PSCAL= 4
##$PSIGN= 0
##$PYNMP= <proc.py>
##$REVERSE= no
##$SF= 400.02000971271
##$SI= 131072
##$SIGF1= 0
##$SIGF2= 0
##$SINO= 400
##$SIOLD= 131072
##$SPECTYP= <>
##$SREGLST= <1H.CDCl3>
##$SSB= 0
##$STSI= 131072
##$STSR= 0
##$SW_p= 8223.68421052631
##$SYMM= 0
##$S_DEV= 0
##$TDeff= 65536
##$TDoff= 0
##$TI= <>
##$TILT= no
##$TM1= 0
##$TM2= 0
##$TOPLEV= 0
##$USERP1= <user>
##$USERP2= <user>
##$USERP3= <user>
##$USERP4= <user>
##$USERP5= <user>
##$WDW= 1
##$XDIM= 131072
##$YMAX_p= 391043550
##$YMIN_p= -11803
##$CURPLOT= <Network HP LaserJet P1505>
##$CURPRIN= <$Network HP LaserJet P1505>
##$DFORMAT= <normdp>
##$LAYOUT= <+/1D_H.xwp>
##$LFORMAT= <normlp>
##$PFORMAT= <normpl>
##$SURQMSG= 1
$$ End of Bruker specific parameters
$$ ---------------------------------
##NTUPLES= NMR SPECTRUM
##VAR_NAME=  FREQUENCY,     SPECTRUM/REAL,   SPECTRUM/IMAG
##SYMBOL=    X,             R,               I
##VAR_TYPE=  INDEPENDENT,   DEPENDENT,       DEPENDENT
##VAR_FORM=  AFFN,          ASDF,            ASDF
##VAR_DIM=   131072,        131072,          131072
##UNITS=     HZ,            ARBITRARY UNITS, ARBITRARY UNITS
##FACTOR=    0.0627417313425164, 1,          1
##FIRST=     8223.62146879497, 845,          -65742
##LAST=      0,             2940,            -65686
##MIN=       0,             -11803,          0
##MAX=       8223.62146879497, 391043550,    0
$$ Real data points
##PAGE= N=1
##DATA TABLE= (X++(R..R)), XYDATA
$$ [...]
67627 123475 125886 127726 129084 130376 131914 133616 135105 136056 136525 136966 137890 139357 140862 141842 142306 142841
67611 142841 143961 145570 147064 147875 147835 147128 146020 144664 143178 141802 140849 140377 140016 139231 137755 135647
67595 135647 133078 130306 127867 126450 126310 126839 126901 125677 123285 120631 118653 117619 117065 116392 115407 114275
67579 114275 113218 112485 112455 113398 115091 116949 118575 119953 121079 121772 121972 121929 121881 121773 121476 121105 120910 121013
67561 121013 121380 121881 122216 122055 121484 121075 121240 121725 122051 122189 122345 122259 121333 119549 117724 116647 116385 116665
67543 116665 117490 118890 120327 120963 120586 119839 119375 119042 118221 116797 115530 115306 116219 117493 118269 118279 117755
67526 117755 116912 115781 114490 113438 113008 113260 113986 114920 115680 115691 114568 112684 111053 110392 110481 110688 110916
67509 110916 111627 112981 114417 115291 115579 115652 115642 115382 114840 114215 113626 113059 112613 112499 112718 113095 113692 114824
67491 114824 116471 118020 118878 119163 119490 120198 121065 121710 122024 122142 122226 122299 122254 121975 121535 121199 121140 121287 121556
67472 121556 122146 123354 125064 126609 127276 126917 126071 125470 125457 125812 126119 126217 126217 126219 126230 126398 127007 128100 129298
67453 129298 130195 130776 131283 131814 132255 132498 132528 132376 132159 132061 132122 132231 132473 133206 134471 135671 136340 137022 138697
67434 138697 141354 143825 145248 146038 147018 148176 148796 148499 147576 146497 145594 145077 144855 144346 142955 140815
67418 140815 138701 137185 136236 135707 135762 136559 137798 138883 139421 139451 139302 139353 139788 140439 140932 140988 140549 139671 138552
67399 138552 137623 137304 137595 138163 138893 139972 141346 142574 143491 144540 145966 147177 147533 147504 148187 149683 150816
67382 150816 150725 149992 149696 149949 149974 149327 148352 147531 146957 146550 146361 146508 147049 147968 149104 150120 150776 151252 151922
67363 151922 152809 153539 153891 154150 154736 155674 156543 156870 156503 155671 154755 153950 153211 152568 152387 153050 154423 155885
67345 155885 156951 157702 158567 159868 161581 163288 164310 164214 163355 162757 163249 164863 167161 169780 172433 174670
67329 174670 176195 177426 179299 182331 186079 189648 192521 194660 196001 196218 195082 192867 190230 187787
67315 187787 185916 184825 184515 184574 184269 183160 181569 180284 179767 179808 179914 179874 179909 180444 181803 183980 186645
67298 186645 189418 192092 194550 196515 197647 197941 197854 197939 198448 199328 200418 201490 202210 202249 201501 200126 198360
67281 198360 196296 193888 191280 189067 188060 188597 190158 191752 192668 192814 192554 192419 192832 193824 195086 196468
67265 196468 198318 201060 204572 208201 211271 213255 213772 212929 211575 210656 210245 209706 208747 207711 206787 205719
67249 205719 204535 203875 204156 204962 205624 205889 205704 204959 203930 203379 203594 203847 203460 202908 203151 204248 205496
67232 205496 206624 207901 209164 209766 209675 209808 210940 212831 214694 216028 216756 216991 216918 216709 216451 216379 217027
67215 217027 218721 220987 222897 223970 224281 223905 222861 221551 220519 219718 218757 217951 218292 220112 222541 224659
67199 224659 226440 228085 229222 229429 229056 228825 228992 229487 230491 232166 234051 235413 236088 236446 236657 236602 236419
67182 236419 236502 236881 237150 237170 237438 238510 240315 242263 243862 245126 246398 247858 249269 250248 250713 250824 250552
67165 250552 249687 248361 247126 246329 245861 245784 246684 248876 251632 253792 254936 255387 255351 254783 254040 253904 254755
67148 254755 256281 258124 260260 262494 264170 264832 264871 265108 265874 266808 267413 267543 267376 267125 266885 266709 266822
67131 266822 267564 268939 270290 270735 270065 269000 268501 269007 270395 272390 274749 277137 279123 280433 281213 281953
67115 281953 283046 284402 285600 286480 287347 288446 289468 289939 289993 290371 291577 293390 295289 297030 298633 300062
67099 300062 301178 301881 302126 301877 301199 300355 299733 299684 300366 301605 302946 304021 304897 305911 307157 308358 309269
67082 309269 309943 310447 310598 310227 309623 309470 310274 311930 313833 315391 316488 317520 318983 321026 323385 325651
67066 325651 327499 328811 329736 330636 331801 333205 334645 336028 337324 338360 338957 339309 339946 341249 343183
67051 343183 345536 348123 350654 352723 354152 355212 356328 357654 359021 360192 361112 362022 363292 365001 366729
67036 366729 367995 368892 369987 371588 373538 375763 378514 381815 385169 388150 390925 393748 396327 398234
67022 398234 399694 401410 403720 406463 409566 413131 416891 420152 422541 424344 425987 427598 429318 431548
67008 431548 434501 437817 441048 444301 448030 452309 456705 460824 464611 468116 471291 474150 476945 480070
66994 480070 483840 488313 493132 497555 500973 503556 506147 509318 512712 515616 518068 521030 525359 530921
66980 530921 536859 542456 547527 552235 556947 562163 568164 574641 580979 586937 592685 598151 602891 607008
66966 607008 611678 618180 626492 635361 643703 651410 658845 666167 673448 680944 688855 697002 705069 713001
66952 713001 720986 729259 738132 747966 758732 769758 780357 790686 801625 813701 826441 838955
66940 838955 850870 862491 874254 886395 899087 912545 926818 941670 956882 972553 988859
66929 988859 1005598 1022340 1039184 1056974 1076392 1096966 1117410 1137010 1156356 1176628 1198468
66918 1198468 1221675 1245710 1270210 1295138 1320611 1346566 1372632 1398595 1425001 1452941 1482980
66907 1482980 1514573 1546743 1579062 1611678 1644716 1678101 1711835 1746064 1780986 1816977 1854596
66896 1854596 1893949 1934260 1974596 2014950 2056016 2097948 2140093 2182126 2224637 2268175 2312322
66885 2312322 2356244 2399699 2442887 2485677 2527661 2568834 2609578 2649921 2689327 2727256 2763575
66874 2763575 2798317 2831419 2862756 2892187 2919476 2944412 2967018 2987448 3005660 3021418 3034567
66863 3034567 3045012 3052462 3056531 3057127 3054465 3048643 3039542 3027245 3012229 2994964 2975513 2953598 2928807
66850 2928807 2900722 2869248 2835113 2799686 2763929 2727662 2690062 2650713 2609848 2567777 2524513
66839 2524513 2480036 2434594 2388632 2342612 2296902 2251615 2206453 2160956 2115063 2069288 2024215
66828 2024215 1979996 1936513 1893838 1852197 1811541 1771475 1731768 1692640 1654359 1616811 1579780
66817 1579780 1543493 1508433 1474570 1441186 1407712 1374464 1342323 1311843 1282911 1255087 1227972
66806 1227972 1201299 1174885 1148568 1122173 1095687 1069596 1044748 1021634 999903 978849 958151
66795 958151 937782 917459 896796 876082 856344 838342 821858 806119 790602 775174 759823
66784 759823 744607 729731 715360 701444 687902 674835 662352 650306 638406 626509 614636
66773 614636 602830 591199 580057 569799 560577 552145 544059 535989 527884 519801 511627 503096 494273
66760 494273 485753 478065 470945 463707 456358 449778 444461 439560 433694 426534 419132 412766 407786 403539
66746 403539 399036 393678 387655 381785 376833 372881 369359 365582 361198 356250 351052 345979 341242 336829
66732 336829 332682 328802 325122 321424 317483 313216 308679 304102 299892 296308 293047 289528 285735 282388
66718 282388 280030 278304 276424 273996 271013 267468 263503 259697 256643 254339 252420 250778 249399 247807
66704 247807 245364 242145 238908 236134 233646 231266 229262 227869 226857 225815 224501 222700 220160 216958
66690 216958 213655 210802 208484 206477 204607 202825 201176 199789 198639 197306 195338 192911 190677 188832
66676 188832 186839 184302 181654 179585 178215 177266 176725 176840 177543 178259 178279 177184 175116 172851 171314 170729
66660 170729 170457 169925 169370 169304 169557 169433 168625 167461 166277 165057 163720 162322 160892 159435 158140 157196
66644 157196 156371 155211 153785 152767 152503 152408 151646 150191 148812 148122 147973 147781 147149 146086 144801 143429
66628 143429 141959 140390 138987 138211 138283 138807 139021 138472 137364 136226 135409 134985 134943 135169 135257 134648 133142 131156
66610 131156 129341 128039 127252 126907 126897 126944 126715 126145 125428 124674 123797 122808 121982 121620 121731 122015 122033 121393 120031
66591 120031 118377 117076 116447 116320 116398 116515 116547 116408 116319 116673 117339 117448 116289 114302 112688 112083 112014 111705
66573 111705 110967 110110 109333 108621 108122 108251 109181 110385 110940 110410 109337 108714 109009 109856 110653 111149 111337 111083
66555 111083 110249 109077 108109 107611 107281 106591 105356 103891 102720 102168 102143 102256 102127 101655 101028 100549 100406 100517
66537 100517 100568 100287 99694 99025 98439 97954 97638 97607 97732 97639 97177 96745 96896 97729 98811 99606 99796 99320 98335
66518 98335 97158 96042 95054 94250 93818 93793 93767 93201 92073 90950 90397 90546 91234 92256 93309 94004 94143 93905
66500 93905 93567 93152 92543 91797 91149 90716 90417 90196 90179 90514 91201 92095 92985 93608 93756 93483 93079 92720 92285
66481 92285 91653 91010 90584 90246 89751 89344 89553 90272 90604 89993 89056 88789 89261 89663 89444 88788 88027 87258 86644
66462 86644 86474 86700 86855 86678 86415 86294 86156 85885 85797 86231 86989 87552 87655 87402 86996 86603 86329 86141 85931
66443 85931 85711 85555 85357 84995 84798 85342 86618 87862 88488 88705 88945 89192 89295 89420 89698 89823 89575 89320
66425 89320 89479 89828 89925 89849 89863 89699 88967 87991 87389 87019 86241 85174 84674 84903 84846 83636 81648 79886 78884
66406 78884 78586 78735 78967 78904 78577 78447 78805 79519 80485 81831 83388 84518 84870 84848 84924 84906 84378 83572 83310
66387 83310 84164 85992 88166 89998 91154 91908 92817 93968 94782 94767 94148 93491 93062 92953 93485 94891 96708
66370 96708 98023 98410 98281 98225 98315 98139 97317 95817 93918 91958 90134 88535 87296 86548 86198 85986 85822
66353 85822 85951 86616 87710 88840 89609 89779 89369 88697 88185 87958 87786 87413 86824 86168 85689 85696 86225 86724 86494
66334 86494 85592 84843 84748 84876 84690 84426 84612 85027 84864 83844 82621 81958 81956 82171 82192 81914 81485 81092 80786 80537
66314 80537 80546 81271 82936 85123 87080 88369 89038 89358 89604 89968 90332 90217 89330 88101 87354 87382 87732 87969
66296 87969 88290 89102 90266 91134 91294 90988 90687 90469 90022 89149 87972 86615 85042 83430 82358 82261 82828
66279 82828 83397 83824 84522 85640 86769 87549 88039 88314 88223 87861 87730 88063 88397 88246 87869 87892 88490 89381 90377
66260 90377 91463 92493 93210 93458 93110 92042 90479 89040 88055 87177 86125 85383 85581 86480 87273 87653 87863
66243 87863 87901 87533 87055 87171 87926 88522 88477 88330 88852 90069 91407 92371 92755 92538 91880 91062 90239 89474 88975
66224 88975 88945 89198 89347 89370 89551 89869 90052 90280 91082 92282 92803 91998 90590 89726 89596 89576 89277 88778 88099
66205 88099 87207 86485 86587 87670 89186 90491 91409 92187 93144 94383 95606 96293 96215 95707 95251 94948 94586 94031
66187 94031 93278 92295 91177 90311 90069 90384 90940 91625 92477 93289 93749 93954 94340 94994 95463 95414 95079 94819 94614
66168 94614 94347 94348 95096 96415 97425 97494 96877 96132 95251 93822 91979 90549 90089 90244 90419 90669 91404 92469
66150 92469 93192 93317 93291 93528 93937 94372 94983 95797 96396 96422 96074 95764 95576 95441 95552 96169 97157 98125 98873 99376
66130 99376 99560 99461 99459 99876 100456 100664 100449 100284 100449 100705 100723 100473 100101 99784 99739 100057 100485 100639 100515 100502 100929
66109 100929 101883 103361 105110 106376 106463 105753 105574 106684 108388 109548 110050 110719 112061 113710 114999 115555
66093 115555 115349 114665 114132 114344 115213 115986 116055 115526 114889 114423 114117 113955 113983 114211 114638 115292 116074 116670 116825
66074 116825 116640 116392 116104 115577 114845 114315 114316 114768 115434 116230 117032 117465 117281 116878 116998 117818 118724 119130 119110 118975
66054 118975 118607 117636 116147 114743 113981 114051 114929 116398 117834 118515 118393 118245 118735 119599 120117 120186 120412 121139
66036 121139 121890 122076 121921 122294 123653 125521 127149 128440 129918 131865 133822 135162 135944 136929 138740 141218
66020 141218 143666 145499 146559 146975 146951 146715 146518 146568 146991 147880 149368 151561 154327 157131 159287 160594
66004 160594 161690 163554 166624 170596 175018 179749 184658 189357 193606 197750 202266 206948 211062 214287
65990 214287 216953 219214 220514 220242 218553 216177 213728 211507 209627 207810 205289 201503 196812 192019
65976 192019 187335 182452 177585 173570 170617 167791 164264 160529 157683 155958 154706 153558 152709 152136 151415
65961 151415 150551 150213 150687 151251 151169 150912 151656 153679 155894 157159 157591 158317 160199 163129 166456 169710 172772
65944 172772 175565 177954 180019 182155 184669 187378 189801 191696 193254 194797 196569 198795 201605 204764
65930 204764 207726 210205 212534 215259 218487 221839 225013 228160 231674 235753 240216 244684 248895 252875
65916 252875 256908 261348 266429 272074 277741 282597 286131 288625 290815 292980 294592 295009 294310 293205 292265
65901 292265 291489 290556 289240 287468 285206 282439 279217 275620 271703 267515 263129 258580 253769 248518 242765
65886 242765 236614 230194 223578 216957 210734 205151 199842 194159 188086 182538 178449 175799 173820 171942
65872 171942 170145 168579 167325 166545 166365 166528 166524 166127 165504 164775 163919 163105 162590 162162 161306 160150 159659 160433
65854 160433 161847 162896 163480 164262 165578 167165 168792 170457 171975 173035 173795 174921 176781 178950 180665
65839 180665 181553 181848 182161 183099 184858 187069 189218 191201 193297 195719 198495 201749 205704 210339 215331
65824 215331 220435 225704 231278 237178 243360 249668 255660 260716 264439 266833 268040 268073 266816 264134 260010
65809 260010 254713 248814 242853 237108 231763 227047 222880 218764 214533 211009 209176 208740 208253 206805 204913
65794 204913 203411 202258 200967 199699 199221 200037 202114 205239 209070 212945 216239 219079 222354 226925 233035
65779 233035 240449 248851 257976 267558 277316 286954 296200 304836 312562 318740 322396 322689 319422 313100
65765 313100 304620 294913 284693 274410 264513 255680 248523 243056 238887 236106 235518 237611 241646 246327
65751 246327 251292 257481 266012 277044 289827 303474 317520 331820 346081 359525 371142 380390
65739 380390 387479 392812 396243 397020 394367 388033 378453 366544 353180 338687 323054 306648 290333
65726 290333 274611 259213 244068 230285 219353 211410 205063 199019 193253 188362 184433 180980 177559
65713 177559 173991 170269 166614 163511 161383 160266 159845 159577 158793 157144 155219 154293 155011 156541 157485 157485
65697 157485 157505 158581 160705 163017 164708 165564 165825 165810 165777 166056 167173 169579 173206 177416 181569 185542
65681 185542 189609 194025 198913 204402 210613 217580 225345 234081 243909 254717 266447 279472 294321
65668 294321 310939 328517 346140 363350 379970 395666 410049 423069 434999 445864 455031 461557
65656 461557 465017 466014 465843 465622 465789 466419 467730 470015 473111 476286 478839 480621 481741 481917 480357 476333
65640 476333 469660 460501 448848 434375 416946 397136 376103 354839 333748 313085 293552 276032
65628 276032 260684 246792 233778 222017 212248 204409 197615 191289 185755 181476 178147 174963 171531
65615 171531 168112 165038 162340 160049 158486 157936 158148 158405 158175 157570 157055 156777 156326 155242 153620 151996
65599 151996 150726 149797 149282 149582 150892 152703 154273 155542 157137 159439 162020 164177 165713 167045 168809
65584 168809 171592 175778 181364 187974 195268 203317 212477 223036 235081 248519 263038 278186 293699
65571 293699 309586 325693 341395 355964 369074 380588 390048 396823 400744 402095 400924 396804 389457
65558 389457 379221 366699 352344 336639 320330 304122 288397 273486 259886 247781 236661
65547 236661 225966 216029 207766 201451 196422 192146 188959 187360 187007 186954 186659 186339 186441 187205 188684 190743
65531 190743 192918 194660 195823 196637 197116 196840 195534 193532 191344 189004 186224 183067 180006 177283 174603
65516 174603 171653 168632 166099 164400 163421 162729 161840 160546 159156 158303 158281 158642 158668 158132 157415 156960 156889 157168
65498 157168 157817 158843 160168 161777 163768 166096 168425 170493 172579 175372 179289 184052 188978 193646
65484 193646 198187 202958 207992 212770 216549 218933 220145 220722 220931 220447 218659 215283 210674 205510 200257
65469 200257 195032 189911 185109 180785 176852 173206 170043 167692 166094 164640 162616 159800 156632 153914
65455 153914 152238 151498 150915 149758 148154 147019 147073 148087 149272 150218 151255 152903 155273 158054 160909
65440 160909 163740 166587 169392 171894 173820 175211 176540 178436 181215 184635 188045 190818 192771 194266
65426 194266 195814 197398 198261 197498 194932 191286 187459 183804 180257 176967 174448 172973 172123 171285 170521
65411 170521 170588 171935 174003 175776 176894 177848 179134 180606 181820 182701 183603 184866 186613 188957 192138
65396 192138 196334 201389 206771 211788 215861 218692 220216 220474 219603 217887 215625 212901 209630 205917 202222
65381 202222 199058 196676 195124 194356 194092 193813 193277 192919 193391 194753 196484 198290 200435 203097 205834 208029
65365 208029 209649 211215 213179 215666 218770 222770 227927 234295 241787 250316 259832 270299 281639 293543
65351 293543 305338 316157 325325 332524 337618 340461 340955 339216 335672 331051 326215 321761 317596 312996
65337 312996 307255 300289 292525 284342 275857 267224 258860 251103 243840 236748 229905 223870 219017 215027
65323 215027 211300 207747 204853 202868 201242 199162 196502 193921 191980 190456 188731 186710 185008 184233
65309 184233 184310 184645 184727 184378 183588 182428 181167 180218 179869 180203 181295 183241 185892 188800 191669 194673 198113
65292 198113 201926 205769 209416 212682 215065 215937 215237 213598 211665 209644 207750 206612 206758 207840 208850
65277 208850 209102 208681 207919 206808 205079 202651 199818 197055 194734 192950 191602 190601 189863 189038 187522
65262 187522 185126 182639 181295 181563 182771 184002 184939 185629 185907 185565 184823 184092 183294 181930 179872 177618
65246 177618 175629 173825 171977 170266 169092 168563 168460 168519 168482 168104 167463 167144 167675 168815 169847 170549 171397
65229 171397 172658 173797 174107 173576 172797 172290 172222 172500 172745 172423 171475 170664 170735 171310 171250 170191 169117 169140 170238
65210 170238 171575 172628 173507 174382 175172 175779 176266 176690 176974 176998 176706 176180 175640 175258 174909 174297 173404 172557
65192 172557 171877 171092 170215 169989 171123 173319 175693 178041 180997 184856 188894 192164 194423 196024 197325
65177 197325 198599 200097 201754 203049 203584 203655 203896 204573 205603 207095 209356 212304 215316 217860 220050
65162 220050 222438 225444 229087 233166 237508 242105 247068 252535 258661 265686 273857 283236 293693 305237
65148 305237 318240 333259 350703 370761 393487 418852 446809 477402 510510 545250 579831
65137 579831 612431 642208 669245 693775 715990 736541 756431 775792 792984 805357 811076 810138
65125 810138 803843 793592 780254 764361 746535 727378 706904 684259 658346 628844 596507 562471
65113 562471 527551 492342 457809 425398 396459 371635 350731 333056 317862 304588 292836
65102 292836 282217 272352 263082 254604 247275 241232 236261 232052 228557 225982 224380 223339 222284 221101
65088 221101 220264 220159 220492 220654 220519 220517 220884 221248 221109 220412 219434 218450 217798 217951 219040 220369 220872 220132 218664
65069 218664 217251 216352 216174 216782 217848 218641 218703 218374 218340 218791 219338 219672 219928 220400 221212 222329 223589 224664
65051 224664 225268 225513 225771 226029 225687 224272 222083 219806 217645 215237 212467 209949 208445 207913 207361 205726
65035 205726 202887 199664 196777 194010 190782 187380 184949 183949 183227 181303 178233 175430 173778 172797 171784
65020 171784 170885 170626 171010 171651 172356 173115 173828 174481 175317 176453 177681 179029 181111 184396 188452 192510
65004 192510 196495 200843 205483 209714 213064 215630 217588 219020 220188 221319 222008 221614 220372 219418 219403
64989 219403 219820 220104 220693 222407 225261 228527 231658 234517 236924 238592 239426 239432 238408 236183 233166 230195
64973 230195 227760 225636 223327 220633 217707 214710 211525 207857 203754 199964 197428 196312 195824 195139 194124
64958 194124 192965 191624 190123 188887 188177 187461 186077 184390 183518 183826 184394 184255 183573 183217 183565 184158 184326
64941 184326 183841 183082 182760 183358 184681 186040 186957 187567 188285 189325 190622 191969 193022 193395 192964 191988 190795
64924 190795 189547 188505 188227 189060 190416 190997 190079 188434 187658 188572 190539 192468 194171 196359 199439 202850
64908 202850 205829 208467 211582 215719 220650 225880 231316 237323 244320 252338 260838 268977 276220 282665
64894 282665 288612 293933 298157 301143 303308 305109 306606 307666 308308 308656 308719 308365 307400 305572 302723 299049
64878 299049 294944 290438 285087 278742 272258 266965 263414 261022 259069 257665 257411 258299 259382 259620 258750
64863 258750 257193 255342 253245 250832 248064 244818 240946 236571 232124 227983 224261 221006 218285 215903
64849 215903 213411 210659 208033 205864 203929 201971 200364 199647 199567 199283 198559 198110 198593 199793 201060 202078
64833 202078 202943 203877 205127 206766 208334 209147 209287 209881 211920 215074 218147 220459 222367 224651 227914
64818 227914 232438 238030 244003 249802 255789 262952 271726 281541 291746 302526 314442 327211 339360
64805 339360 349124 355536 358638 358960 357002 353128 347664 340885 332931 323899 314145 304367 295254 287122
64791 287122 279929 273603 268178 263638 259798 256442 253552 251373 250216 250140 250816 251735 252639 253716 255390
64776 255390 257993 261673 266497 272437 279267 286624 294307 302444 311254 320662 330259 339715 349040 358222
64762 358222 366680 373461 378201 381624 384743 387730 389937 390966 391229 391338 391339 390813 389431 387129 383952 380017
64746 380017 375468 370166 363556 355145 345146 334382 323588 313084 303146 294347 287237 281823 277609
64733 277609 274158 271445 269633 268741 268667 269319 270448 271456 271762 271467 271255 271474 271759 271926 272734 275149 279036
64716 279036 283343 287504 291862 296521 300582 302983 303562 302853 301354 299521 297944 296732 294890 291099 285236
64701 285236 278610 272601 267510 262883 258470 254519 251321 248776 246542 244512 243029 242461 242642 242985 243254
64686 243254 243862 245296 247592 250662 254717 259897 265781 271800 278069 285352 294242 304697 316273 328413
64672 328413 340601 352603 364349 375191 383580 388169 389116 387569 383954 377669 368612 358027 347325
64659 347325 336838 326391 316484 308063 301421 296075 291643 288269 286150 285171 285082 285731 287096 289342 292757
64644 292757 297406 303012 309537 317638 328028 340428 353685 367069 380990 396240 412887 430115
64632 430115 446746 461578 473481 481654 485854 486251 483127 476816 467817 456719 444044 430293 416062
64619 416062 401964 388552 376466 366449 358877 353309 348905 345315 342871 341836 341826 342136 342217 341675 340310
64604 340310 338554 337448 337526 337933 337285 335288 332860 330685 328440 325619 322255 318449 313899 308609 303543
64589 303543 299885 297844 296745 296014 295494 295101 294927 295639 298021 302002 306566 310709 314030 316481 318144
64574 318144 319325 320294 320818 320416 319111 317373 315212 312021 307524 302250 296707 290750 284229 277657 271659
64559 271659 266177 260873 255984 252041 248928 245940 242841 240251 238791 238307 238181 238090 238200 238745 239604 240319
64543 240319 240501 240258 240162 240718 241905 243291 244438 245118 245324 245231 244994 244447 243223 241366 239621 238777 238853 239173
64525 239173 239135 238637 237886 237208 237107 238141 240574 244201 248474 252745 256558 259990 263607 267814 272355 276714
64509 276714 280891 285352 290315 295626 301439 308444 317062 326774 336686 346571 356947 368173 379793
64496 379793 390739 399867 406212 409052 408023 403259 395410 385533 374860 364429 354786 346107 338586
64483 338586 332493 327729 323577 319275 314824 310892 307824 305139 302202 298993 295779 292354 288287 283895
64469 283895 280313 278335 277639 277391 277188 277125 277439 278517 280816 284165 287450 289604 290829 292172 293987 295525
64453 295525 296158 296271 296575 297210 298038 299310 301366 303910 306280 308406 310914 314211 318074 322373 327624
64438 327624 334397 342570 351647 361602 372836 385409 398999 413773 430681 450499 473069 498019
64426 498019 525877 557811 594467 635824 682313 735398 796717 867167 947113 1036841 1135981
64415 1135981 1242414 1352122 1460231 1562388 1655888 1740140 1815858 1883037 1939470 1981426
64405 1981426 2005720 2010988 1997537 1967020 1922417 1867306 1804083 1732800 1652051 1561092 1461188
64394 1461188 1355450 1247938 1142759 1043276 951532 868236 793355 726788 668604 618720 576495
64383 576495 540705 509983 483320 460167 440257 423436 409567 398353 389194 381321 374029 366777
64371 366777 359222 351422 343870 337014 330733 324585 318576 313334 309318 306174 303084 299646 296227 293665
64357 293665 292761 293878 296718 300520 304649 309014 313893 319510 325930 333182 341163 349398 357101 363562
64343 363562 368365 371237 371881 370147 366377 361482 356532 352147 348242 344398 340454 336670 333452 331163
64329 331163 330239 331097 333671 337142 340420 342890 344545 345514 345781 345384 344542 343355 341524 338687 335028 331363
64313 331363 328420 326074 323479 319999 315856 311688 307658 303355 298609 293972 290089 286877 283700 280227
64299 280227 276707 273455 270547 268108 266464 265756 265688 265985 266847 268662 271485 275127 279572 284905 290865
64284 290865 296951 303067 309665 317077 325026 333071 341265 350097 359849 370246 380630 390310 398787 405829
64270 405829 411355 415268 417525 418388 418323 417473 415513 412315 408557 405318 403184 402061 401730 402099 402820 403034
64254 403034 401683 397956 391554 382878 373020 363120 353559 343995 334198 324569 315778 308337 302564 298493
64240 298493 295585 293018 290584 288911 288508 288991 289585 289968 290189 290205 290119 290550 292027 294109 295768 296577 296957
64223 296957 297317 297633 297914 298290 298442 297645 295768 293660 292098 290829 289109 286800 284428 282439 280915 279869
64207 279869 279308 279054 278907 279020 279821 281517 283947 286843 289968 293068 296070 299387 303691 309238 315665
64192 315665 322583 330167 339039 349727 362367 376757 392474 408940 425489 441348 455475 466592
64180 466592 473568 475822 473291 466160 454911 440670 425127 409791 395315 381646 368679 356533
64168 356533 345339 335100 325840 317631 310498 304547 300156 297625 296487 295616 294300 292850 291875 291336
64154 291336 290837 290482 290795 291915 293544 295736 299049 303673 308894 313755 317889 321458 324636 327427 329696
64139 329696 331133 331472 330987 330407 330047 329354 327730 325525 323714 322789 322506 322679 323654 325806 328982 332623
64123 332623 336216 339536 342744 346443 351411 358026 365982 374649 383584 392700 402177 412376 423592 435647
64109 435647 447765 459029 468908 477223 483788 488438 491425 493485 495401 497711 500869 505316 511136 517923
64095 517923 525277 533139 541154 547991 552108 553404 553406 553367 552695 549840 544388 537500 530397 523140 515133 506204
64079 506204 496741 487063 477113 466772 456266 446183 437073 429002 421579 414550 408254 403298 399899
64066 399899 397787 396649 396243 396092 395547 394367 392973 391972 391702 392331 394060 396965 400846 405433 410598
64051 410598 416309 422586 429592 437517 446243 455466 465315 476527 489728 504774 521015 537987 555566
64038 555566 573664 591996 609921 626254 639533 648915 654771 658075 659304 658201 654513 648614 641370
64025 641370 633634 625967 618700 612209 606958 603041 599637 595310 589137 581303 572408 562539 551437 539356
64011 539356 527167 515661 505147 495761 487755 481309 476318 472438 469207 466149 463050 460194 458109
63998 458109 457012 456685 456928 457967 460345 464498 470435 477654 485330 492685 499311 505238 510818 516562 522941
63983 522941 530242 538611 548184 558951 570512 582308 594237 606821 620584 635504 651233 667577
63971 667577 684647 702859 723005 745947 771965 800670 831754 865389 901596 939871 980010
63960 980010 1022912 1069901 1121642 1178499 1241648 1312878 1393371 1483660 1584973 1699726 1830308
63949 1830308 1978099 2144017 2329344 2535447 2763052 3012240 3282758 3573871 3884011
63940 3884011 4210842 4551451 4902185 5258425 5614580 5964046 6299176 6611721 6893721
63931 6893721 7138054 7338500 7490076 7589588 7635475 7626914 7563492 7445934 7276696 7059727
63921 7059727 6800259 6505109 6182413 5840324 5486079 5126444 4768295 4417961 4080261
63912 4080261 3758694 3456149 3174740 2915325 2678048 2463350 2271674 2102210 1952684
63903 1952684 1820643 1704391 1602517 1513273 1434880 1366133 1306183 1253899 1207753 1166274 1128364
63892 1128364 1093270 1060457 1029531 1000135 971861 944354 917547 891835 867913 846255 826734
63881 826734 808940 792928 779425 769163 762267 758432 757407 758932 762511 767789 775188 785651 799604
63868 799604 816366 834685 853642 872978 892841 913328 934187 954911 975198 995165 1014861
63857 1014861 1033672 1050586 1065032 1077036 1086447 1092466 1094284 1091928 1086141 1077528 1066073 1051440
63845 1051440 1033538 1012790 989957 965650 939919 912391 882954 852254 821366 790969 760945
63834 760945 730812 700470 670521 641900 615261 590652 567712 546095 525739 506837 489657
63823 489657 474291 460505 447859 436058 425071 414841 405064 395517 386547 378863 372733 367656 363005
63810 363005 358774 355429 353122 351377 349633 347800 346114 344598 342966 341060 339055 337017 334508 331012
63796 331012 326720 322504 318996 316033 313147 310201 307209 303918 300132 296324 293338 291381 289792 287972
63782 287972 286076 284588 283608 282866 282151 281367 280436 279470 278851 278807 279046 279173 279236 279461 279586 279061 277942 277011
63764 277011 276751 276670 276014 274751 273437 272340 271209 269879 268614 267754 267395 267535 268234 269389 270578 271401
63748 271401 271876 272307 272854 273471 274237 275497 277537 280230 283115 285823 288361 291013 293984 297149 300174
63733 300174 302895 305475 308085 310524 312378 313625 314909 317042 320337 324568 329468 335020 341166 347457
63719 347457 353203 357979 361877 365243 368223 370579 371894 371936 370859 369108 367140 365222 363458 361935 360780
63704 360780 360088 359808 359691 359362 358604 357731 357645 359215 362440 366342 369820 372540 374918 377424 380085 382520
63688 382520 384183 384696 384315 383966 384386 385148 385006 383412 381311 380099 380162 380815 381397 381847 382293 382686 383059 383777
63670 383777 385232 387391 389780 391799 392996 393192 392471 391058 389210 387181 385137 382956 380247 376775 372779
63655 372779 368683 364594 360375 356105 352137 348676 345561 342534 339565 336914 335062 334439 334894 335529 335457
63640 335457 334760 334359 334961 336560 338983 342298 346458 351033 355622 360231 364959 369756 374778 380576 387461
63625 387461 394956 402364 409636 417259 425504 434325 443937 454946 467831 482619 499101 516998 535893
63612 535893 555359 575344 596292 618775 643047 668853 695518 722303 748765 774561 798743
63601 798743 819633 835810 846963 853347 854780 851004 843020 833212 823662 814846 806224 797484 788566
63588 788566 778854 767223 753016 736590 718729 699873 680078 659474 638525 617975 598718 581640
63576 581640 567306 555677 546310 538961 533843 531121 530321 530624 531781 534290 538477 543775 549336 555061
63562 555061 561514 568861 576490 583838 591130 598981 607552 616501 625760 636108 648874 665089 684885
63549 684885 707623 732591 759595 788972 821187 856386 893970 932111 967717 997254 1018043
63538 1018043 1029011 1030596 1024327 1012495 997685 982104 967151 953482 941241 930054 918951 906534
63526 906534 891421 872723 850345 824926 797416 768619 739085 709310 679929 651702 625344
63515 625344 601207 579071 558424 539149 521766 506795 494067 483012 473397 465303 458403 451833
63503 451833 445046 438394 432638 428144 424732 421988 419485 416956 414578 412940 412428 412717 413094 413185 413149 413249
63487 413249 413522 413865 414216 414520 414725 414950 415670 417494 420598 424437 428224 431661 434918 437825 439604 439767
63471 439767 438875 437801 436452 434034 430570 427289 425127 423598 421656 419137 416705 414774 413206 411982
63457 411982 411456 411848 412890 414105 415228 416412 418251 421488 426332 432134 438092 444220 451273 459662 468822
63442 468822 477742 485946 493900 502702 513348 526150 540844 557464 576913 600340 627957 658744
63430 658744 691137 723444 753568 779093 798373 811559 820392 827067 833304 840072 847790 856875 868333
63417 868333 883694 904017 928945 956874 985973 1014741 1041681 1064929 1082627 1093617 1097682 1095297
63405 1095297 1087486 1075847 1062236 1048025 1033657 1019021 1004049 988659 972290 953980 933091
63394 933091 909626 883762 855585 825666 795506 766735 739926 714597 690307 667228 645673
63383 645673 625749 607743 592298 579841 570156 562881 558071 555825 555693 556997 559636 564048 570396
63370 570396 578293 587387 597753 609507 622491 636537 651681 667798 684428 701473 719852 740969
63358 740969 765421 792583 821452 851493 882557 914340 946168 977081 1005791 1030607 1049755
63347 1049755 1061934 1066751 1064839 1057686 1047166 1034850 1021632 1007906 993930 979798 965210 949501
63335 949501 931931 911896 889061 863646 836610 809214 782316 756203 731133 707733 686711
63324 686711 668399 652805 639948 629959 622969 619039 618081 619506 621822 622728 619844 611667 598140 580498
63310 580498 560602 540325 521293 504707 490961 479541 469730 461456 455083 450438 446677 443354 441010
63297 441010 440149 440085 439471 437769 435479 433029 430182 426698 422867 419029 415033 410550 405677 400924 396830
63282 396830 393746 391679 390136 388461 386568 385100 384564 384666 384818 384960 385419 386209 387011 387759 388743 390147
63266 390147 391913 394045 396578 399298 402003 405033 408948 413520 417683 420831 423666 427327 432162 437810
63252 437810 444068 450948 458108 465011 471752 479165 487907 497817 508317 519157 530627 543391 558152
63239 558152 575165 593978 613954 635118 658074 683018 709359 736577 764949 794957 826371
63228 826371 858478 890976 924050 957577 990775 1022759 1053137 1082057 1110044 1137850 1166093
63217 1166093 1194814 1223606 1252232 1280866 1309486 1337170 1362182 1382802 1398067 1407754 1411635 1408846
63205 1408846 1398283 1379772 1354630 1324733 1291178 1254175 1214137 1172358 1130570 1090247 1052510
63194 1052510 1018323 988458 963282 942672 926094 912908 902826 896026 892610 892182 894434 899912
63182 899912 909455 922717 937993 953894 970530 988607 1007940 1027541 1046775 1065632 1083999 1101462
63170 1101462 1117929 1133818 1149376 1164157 1177270 1187837 1195168 1198822 1198678 1194699 1186607 1174009
63158 1174009 1156898 1135734 1110969 1082833 1051752 1018733 985088 951936 920075 890129 862497
63147 862497 837149 813686 791747 771374 752928 736603 722058 708637 695991 684442 674667 667179
63135 667179 662115 659267 658040 657545 657090 656675 656819 657865 659673 662053 665300 670120 676996 685631 694987
63120 694987 703919 711821 718721 724831 730217 734872 738842 742113 744588 746372 747897 749514 751094 752271
63106 752271 752964 753403 753723 753797 753464 752737 751799 750922 750289 749749 748876 747456 745730 743989 742216 740444 739176
63089 739176 738965 739681 740672 741583 742616 744035 745952 748600 752268 756820 761755 766898 772613 779154 786216
63074 786216 793441 801066 809822 820396 833031 847311 862192 876693 890907 906100 923576 943669
63062 943669 966030 990523 1017472 1047261 1080070 1115938 1154878 1197011 1242747 1292634 1346917
63051 1346917 1405368 1467642 1533509 1602584 1674153 1747535 1822343 1898142 1974146 2049563 2123979
63040 2123979 2197101 2268403 2337501 2404711 2470787 2536141 2600618 2663827 2725152 2783443 2837247
63029 2837247 2885503 2927600 2962443 2987718 3000345 2997760 2978852 2943985 2894410 2831676 2757508
63018 2757508 2674040 2583871 2489659 2393697 2298007 2204736 2116185 2034347 1960456 1894969 1837932
63007 1837932 1789429 1749733 1719018 1696933 1682694 1675620 1675370 1681476 1692896 1708341 1726977 1748643
62995 1748643 1773426 1801111 1830863 1861339 1891350 1920664 1949957 1979758 2009655 2038719 2066262
62984 2066262 2091694 2113931 2131574 2143645 2149633 2148867 2140418 2123693 2098642 2065312 2023799 1974898
62972 1974898 1920229 1861383 1799324 1734961 1669840 1605683 1543406 1483078 1424811 1369256 1317173
62961 1317173 1268815 1223902 1182022 1142987 1106824 1073497 1042616 1013528 985699 958941 933225
62950 933225 908486 884707 862054 840778 821051 802984 786681 772096 758904 746639 734983
62939 734983 723870 713426 703840 695217 687485 680578 674647 669857 665975 662502 659401 657252 656363 656048
62925 656048 655276 653859 652376 650960 648833 645332 640839 636275 632040 627955 623988 620387 617069 613495
62911 613495 609378 605125 601230 597613 593933 590359 587462 585349 583407 581124 578739 576774 575224 573677
62897 573677 572075 570854 570247 569843 569051 567747 566254 564875 563622 562322 560821 559246 558122 558059 559111
62882 559111 560647 562082 563509 565274 567092 568108 567927 567154 566741 567062 567785 568302 568016 566556 564141 561606
62866 561606 559647 558104 556335 554240 552449 551411 550812 550224 549906 550460 551814 553092 553630 553781 554470 556070
62850 556070 557959 559167 559285 558635 557737 556844 556095 555788 556130 556757 556949 556453 555769 555397 555138 554490 553461 552502
62832 552502 551749 550869 549759 548920 548962 550011 551799 554101 556932 560445 564768 569720 574721 579272 583570
62817 583570 588253 593403 598288 602368 606127 610513 615903 622083 628911 636376 644147 651724 659154 667081
62803 667081 675982 685733 696018 706703 717707 728935 740705 753878 769272 787063 806922 828520
62791 828520 851738 876685 903853 934089 968165 1006496 1049438 1097655 1151845 1212259 1278810
62780 1278810 1351611 1431020 1517100 1609304 1706810 1808993 1915452 2025703 2138855 2253397
62770 2253397 2367128 2477324 2581031 2675227 2756873 2823101 2871615 2900889 2910042 2898679 2867071
62759 2867071 2816416 2748802 2666797 2573038 2470081 2360424 2246560 2130926 2015760 1902873
62749 1902873 1793563 1688746 1589227 1495768 1408878 1328641 1254867 1187397 1126116 1070698 1020535
62738 1020535 975082 934191 897953 866209 838366 813733 791978 773170 757329 743942 731998
62727 731998 720651 709895 700453 692942 687274 682947 679676 677515 676567 676985 679168 683524 689964 697967
62713 697967 707249 717965 730145 743497 758170 775270 796046 820718 848604 879214 912698 949355
62701 949355 989365 1033125 1081148 1133356 1189028 1247726 1309739 1375227 1443508 1513772 1585916
62690 1585916 1659811 1733861 1805109 1870797 1929174 1978762 2017734 2044389 2057648 2056699 2040792 2009998
62678 2009998 1965882 1910930 1847499 1777649 1703478 1626869 1549045 1470926 1393861 1319439 1248595
62667 1248595 1181483 1118301 1059676 1006136 957716 914301 875828 841810 811088 782523 755748
62656 755748 731022 708644 688809 671686 657070 644017 631259 618147 605049 592807 581999
62645 581999 572695 564691 557781 551831 546683 542101 537982 534608 532552 532241 533588 535896 537958 538486 536990
62630 536990 534365 532201 531265 530876 529896 527915 525281 522460 519868 518073 517576 518397 520193 522690 525733
62615 525733 529107 532757 537066 542510 549027 556148 563754 572278 582075 592944 604472 616656 630046
62602 630046 645394 663137 683127 704946 728626 754888 784520 817764 854668 895757 941732
62591 941732 992460 1046661 1102676 1159198 1215355 1270538 1324180 1375120 1421051 1459122 1487408
62580 1487408 1505500 1513610 1511601 1499269 1477203 1446893 1410082 1368138 1321893 1271937 1219206 1165328
62568 1165328 1112122 1060695 1011369 964463 920655 880411 843555 809736 778933 751206 726399
62557 726399 704422 685435 669309 655284 642571 631047 620982 612409 605173 599221 594292 589666
62545 589666 584792 579969 575827 572390 569339 566938 565833 565933 566407 566906 567882 569369 570318 569800 568302 567216
62529 567216 567462 569240 572696 578011 584926 592959 602254 613632 627528 643374 660352 678514 698813
62516 698813 722160 748767 778350 810661 845738 883850 925299 970058 1017385 1065855 1114074
62505 1114074 1161475 1208206 1254101 1297866 1337407 1370973 1397886 1418334 1432724 1441319 1444437 1442999
62493 1442999 1438941 1434922 1433370 1435678 1442329 1453586 1469861 1491515 1518702 1551511 1589966 1633766
62481 1633766 1682174 1734212 1788511 1842593 1892482 1933684 1963034 1979765 1984923 1979833 1964848 1939017
62469 1939017 1900622 1848343 1782589 1706161 1623513 1538930 1454969 1372366 1291248 1212344 1137196
62458 1137196 1067539 1004641 949050 900673 859024 823558 793817 769260 749104 732531 719108
62447 719108 708778 701384 696357 692985 690845 689868 690163 691911 695278 700150 705979 712098 718143 723968
62433 723968 729157 732928 734605 733958 730941 725422 717468 707731 697159 686274 674959 662967 650395
62420 650395 637638 625120 613169 601950 591443 581644 572830 565308 558786 552384 545573 538868 533232
62407 533232 528952 525473 522219 519184 516690 514930 513863 513318 513190 513696 515348 518340 522013 525350 528077
62392 528077 530931 534712 539370 544164 548404 551943 555269 559281 564616 570991 577523 583854 590589 598352
62378 598352 606874 615415 623773 632305 641078 649576 657359 664685 672372 681200 691517 703275 716443
62365 716443 731354 748525 768142 790043 814312 841489 871953 905513 942006 981893 1025675
62354 1025675 1072888 1122247 1172686 1223587 1273888 1321465 1363690 1398399 1424430 1441708 1451008
62343 1451008 1453401 1449804 1441098 1428420 1412760 1394241 1372238 1346372 1317146 1285622 1252893 1219970
62331 1219970 1187709 1156639 1127049 1099357 1074042 1051131 1030029 1009976 990391 970771 950678
62320 950678 929921 908391 885687 861441 836205 811478 788534 767537 748056 729885 713014
62309 713014 697275 682671 669792 659294 651044 644294 638700 634677 632692 632578 633747 635826 638849
62296 638849 642905 647797 653239 659455 667287 677322 688906 700460 710921 720548 730196 740260 750532
62283 750532 760567 769695 777084 782379 786166 789355 792230 794487 795998 797068 798013 798927 799818 800649 801402
62268 801402 802518 805025 809718 816324 824086 833114 844590 859607 878474 901260 928349 960150 996759
62255 996759 1038176 1084362 1134674 1187612 1241445 1294741 1346012 1393283 1434523 1468364 1494162
62244 1494162 1511656 1520973 1522654 1517148 1504330 1483887 1456129 1422052 1382694 1338777 1291033 1240605
62232 1240605 1189064 1138134 1089204 1042885 999129 958047 920427 887103 857996 832251 809286
62221 809286 789230 772327 758381 746932 737494 729397 721818 714345 707242 700898 695299 690364 686458
62208 686458 684119 683382 683817 685166 687502 690710 694257 697670 700976 704531 708661 713635 719669 726616 733796
62193 733796 740481 746631 752932 760074 768129 776666 785306 794024 803019 812449 822319 832489 842695 852571
62179 852571 861786 870223 878011 885332 892210 898599 904711 911171 918744 927886 938645 951103 965916
62166 965916 984309 1007357 1035193 1067014 1101834 1139033 1177978 1217281 1254777 1288309 1316355
62155 1316355 1337989 1352741 1360789 1363063 1360734 1354505 1344518 1330781 1313431 1292625 1268508 1241508
62143 1241508 1212600 1183077 1154006 1125884 1098909 1073601 1050986 1031911 1016215 1002922 991310
62132 991310 981413 973259 966138 959137 952121 945560 939474 933217 926473 919867 914300 910024 906690 903981
62118 903981 901872 900513 900196 901312 904025 908038 912866 918266 924156 930087 934971 937396 936355 931881
62104 931881 925107 917575 910402 904139 899210 896035 894524 893844 892956 891256 888569 884942 880813 877109 874689
62089 874689 873675 873607 874140 875318 877247 879888 883226 887359 892326 898026 904400 911654 920327 931092 944230
62074 944230 959174 974822 990544 1006644 1023643 1041420 1059470 1077669 1096281 1115381 1134922
62063 1134922 1155253 1176941 1199963 1223617 1247212 1270116 1290889 1307227 1317486 1321881 1321664 1317450
62051 1317450 1309004 1296428 1280674 1262628 1242088 1217989 1189454 1156534 1120205 1081852 1042699
62040 1042699 1003538 964936 927587 892233 859145 827906 797992 769597 743602 720561 699938
62029 699938 680667 662438 646045 632315 621024 611201 602235 594276 587614 582029 576807 571185 564881
62016 564881 558458 553056 549343 546737 544066 540957 538173 536582 536334 537201 539045 541605 544293 546707 549050
62001 549050 551721 554801 558261 562301 566945 571553 575236 577660 579038 579532 579131 577978 576304 574083 571161
61986 571161 567593 563425 558254 551645 543934 536019 528287 520403 512330 504858 498670 493396 488156 482764
61972 482764 477854 473940 470793 467821 464761 461929 459878 458865 458610 458575 458386 457885 456902 455426 453978 453361
61956 453361 453809 454689 455292 455542 455727 455924 456207 457114 459335 462942 467389 472291 477857 484498 492339 501219
61940 501219 510873 521028 531545 542578 554404 567004 579983 592945 605748 618361 630663 642407
61928 642407 653272 662884 670974 677472 682279 684981 685170 683131 679883 676320 672526 668189 663462 659120
61914 659120 655930 654122 653558 654237 656570 661100 667864 676105 684825 693661 702931 712677 721946 729382 734320
61899 734320 736990 737791 736863 734355 730615 725896 720181 713600 706798 700588 695354 690949 687082 683561 680229
61884 680229 676915 673465 669655 665035 659064 651433 642233 631829 620784 609898 600017 591567 584321
61871 584321 577775 571739 566483 562416 559822 558858 559519 561462 564059 566895 570178 574454 579950 586456 593898
61856 593898 602750 613591 626360 640351 655002 670498 687475 706228 726261 746524 766032 784415
61844 784415 801940 818889 834850 848711 859495 867033 871671 873510 872342 868381 862673 856489 850404
61831 850404 844241 837873 831894 827456 825591 826727 830660 836816 844497 852989 861561 869425 875743 879743
61817 879743 880847 878748 873415 865075 854166 841188 826535 810605 794160 778447 764602 752846
61805 752846 742488 732828 723807 715551 707608 699124 689757 680023 670656 661952 653837 646192 638908 631925
61791 631925 625422 619749 614965 610760 606998 603962 601747 599834 597750 595862 594830 594471 593889 592748 591667
61776 591667 591145 590827 590216 589540 589378 589811 590438 590951 591263 591410 591811 593357 596602 600971 605347 609375 613667
61759 613667 618762 624511 630587 636984 643662 650086 655466 659225 661084 660981 659185 656269 652675 648364
61745 648364 643015 636486 629066 621453 614495 608627 603502 598453 593419 589051 585826 583484 581560 579960
61731 579960 578644 577235 575541 574194 574101 575302 576928 578282 579413 580610 581920 583420 585483 588412 592022
61716 592022 595774 599129 601563 602565 601908 599849 596913 593643 590615 588362 586923 585620 583644 580815
61702 580815 577527 574020 570078 565506 560543 555591 550765 545952 541201 536741 532613 528568 524425 520328
61688 520328 516504 512962 509614 506494 503582 500504 496881 493042 489962 488213 487220 485872 483702 481178
61674 481178 478982 477333 476000 474686 473335 472261 471958 472608 473765 474727 475189 475376 475624 476154 477210 479037
61658 479037 481545 484224 486570 488472 490146 491894 493991 496594 499564 502478 504855 506348 506809 506404 505731
61643 505731 505508 506041 507066 508111 508761 508682 507807 506680 506252 507002 508437 509648 510220 510434 510773 511392 511916
61626 511916 511531 509516 505912 501574 497366 493399 489206 484473 479430 474667 470797 468099 466218 464282
61612 464282 461545 457920 453809 449614 445552 441736 438146 434615 431034 427466 423930 420329 416786 413709
61598 413709 411191 408640 405517 402183 399481 397564 395751 393519 391028 388557 386069 383631 381730 380718
61584 380718 380281 379834 379212 378646 378260 377955 377652 377286 376676 375680 374482 373449 372756 372341 372164 372244 372443 372478 372266
61565 372266 372120 372499 373624 375333 377169 378617 379430 379875 380608 382157 384466 386956 389014 390385 391105 391199
61549 391199 390671 389861 389596 390656 392980 395558 397284 397910 398120 398704 399811 401050 402145 403273 404717 406478
61533 406478 408423 410665 413423 416434 418852 419942 419711 418662 417108 414986 412243 409101 405929 403033
61519 403033 400641 398914 397932 397664 397910 398195 397930 396902 395507 394319 393518 392950 392573 392513 392758 393227 394138
61502 394138 395812 397948 399547 399917 399526 399512 400460 401977 403426 404740 406349 408463 410708 412555 413947
61487 413947 415243 416584 417751 418860 420738 424014 427999 431159 432842 433967 435758 438406 441328 444251
61473 444251 447393 450764 453858 456055 456966 456466 454820 452779 451194 450379 450086 450058 450264 450470 449989 448231
61457 448231 445464 442782 441223 440978 441517 442371 443624 445506 447724 449514 450454 450884 451309 451681 451675 451460 451682
61440 451682 452617 453811 454751 455521 456458 457457 458032 458017 457812 457836 458047 458182 458235 458411 458727 458961 459054 459316 460065 461203
61420 461203 462365 463421 464625 466212 468015 469628 470803 471575 471995 471951 471339 470356 469441 468825 468193 467011
61404 467011 465203 463376 462212 461756 461453 460822 459902 459041 458469 458215 458321 458985 460373 462352 464458 466273
61388 466273 467793 469336 471098 473005 475014 477224 479459 481101 481780 482119 483367 486249 490491 495372 500259
61373 500259 504615 508076 510826 513483 516321 518921 520866 522378 523899 525361 526431 527358 528966 531693
61359 531693 535033 538175 540992 544100 548109 553031 558511 564483 571406 579749 589308 599120 608014 615188
61345 615188 620396 623839 625897 626772 626389 624843 622881 621575 621384 621797 621985 621507 620258 618135 615100 611411
61329 611411 607603 604293 601994 600717 599621 597571 594428 591461 590104 590619 592380 595039 598694 603119
61315 603119 607727 612472 618225 625944 635834 647510 660584 674811 689958 705812 722233 739066
61303 739066 756082 773036 789509 804613 817076 825807 830287 830493 826783 820014 811449 802145 792390
61290 792390 781912 770592 758852 747409 736811 727264 718780 711305 704691 698671 693050 687870 683289
61277 683289 679387 676366 674861 675538 678131 681295 683861 685957 688476 691680 694958 697920 701082 705209
61263 705209 710418 716246 722329 728760 735915 744068 753016 761952 769827 775924 780005 782030 782103 780649 778300
61248 778300 775383 771851 767767 763543 759507 755594 751754 748315 745605 743479 741604 740096 739410 739612 740132
61233 740132 740373 740301 740365 741126 743055 746477 751414 757552 764490 772017 780076 788552 797258 806105 815045 823771
61217 823771 831668 838354 844242 850353 857425 865278 873069 880014 885822 890656 894794 898341 901210 903495
61203 903495 905814 909026 913560 919328 926386 935243 946230 958997 973101 988755 1006369 1025456 1044582
61190 1044582 1062372 1077998 1090703 1099629 1104513 1106098 1105454 1103160 1099313 1093926 1087001 1078521 1068748
61177 1068748 1058268 1047441 1036031 1023658 1010345 996241 981141 964820 947804 931236 915813
61166 915813 901170 886435 871156 855538 840030 824921 810356 796609 784230 773788 765402 758608
61154 758608 752803 747845 744192 742543 743359 746544 751360 756697 761601 765551 768170 768811 766746 761920 755309
61139 755309 748334 741860 735892 730178 724922 720752 718220 717603 719245 723591 730600 739387 748913 759046
61125 759046 770652 784650 801253 820048 840396 861661 883497 906171 930313 956114 982997
61114 982997 1010261 1037658 1065023 1091717 1117009 1140970 1164452 1187984 1211004 1232352 1251277
61103 1251277 1267702 1281592 1292343 1298936 1300658 1297553 1290177 1278975 1264040 1245420 1223546 1199313
61091 1199313 1173847 1148138 1122762 1097843 1073394 1049687 1027267 1006670 988238 972108 958109
61080 958109 945703 934391 924347 916378 911048 908029 906472 905838 906136 907507 909933 913422 918221 924624
61066 924624 932587 941629 951237 961358 972380 984600 997988 1012623 1029087 1047974 1069075 1091469
61054 1091469 1114489 1138267 1163305 1189894 1218077 1247745 1278644 1310602 1343940 1379246 1416502
61043 1416502 1454789 1493112 1531236 1569482 1608128 1647328 1687211 1727496 1767230 1805456 1842060
61032 1842060 1877555 1912159 1945558 1977569 2008618 2039453 2070621 2102222 2133962 2165470 2196789
61021 2196789 2228538 2261443 2295825 2331633 2368792 2407407 2448118 2492748 2544357 2606080 2679954
61010 2679954 2767219 2869519 2989190 3128386 3288640 3471651 3680355 3919476 4195713 4517674
61000 4517674 4895285 5339100 5860454 6472416 7190732 8034881 9029781 10206392 11597341
60991 11597341 13224667 15079811 17099431 19147315 21021640 22504140 23441716 23816962
60983 23816962 23759223 23486698 23218628 23106296 23199369 23435354 23647658 23608452 23111947 22062788
60973 22062788 20513668 18628945 16606667 14613073 12757181 11095674 9646882 8403954
60965 8403954 7346898 6452446 5698957 5066906 4538367 4097119 3728482 3418685 3155009
60956 3155009 2927036 2727561 2552033 2397107 2259584 2136306 2024722 1923437 1832172 1750929
60946 1750929 1679051 1615010 1556975 1503391 1452971 1404441 1356672 1309190 1262364 1216924 1173371
60935 1173371 1131984 1093220 1057655 1025403 995897 968505 943183 920251 899656 880824 863273
60924 863273 847175 833156 821627 812232 803927 795671 787164 778858 771267 764551 758808 754330 751144
60911 751144 748611 745993 743322 741211 739834 738615 737018 735136 733271 731360 729068 726233 722963 719471
60897 719471 715919 712176 707669 701755 694431 686415 678402 670566 662974 656063 650244 645237 640266 634912
60883 634912 629393 623960 618370 612141 605112 597636 590332 583697 577819 572321 566747 561099 555905 551659
60869 551659 548371 545900 544507 544530 545444 545866 544997 543699 543592 545310 548292 552113 557069 563227 569829 576169
60853 576169 582370 588621 594190 598098 600440 602229 604119 606047 608046 610519 613578 616763 619554 621500
60839 621500 621822 619617 614807 608327 601168 593767 586438 579663 573557 567686 561837 556470 552002 548143
60825 548143 544432 540972 538110 535790 533700 531717 529690 527128 523714 519857 516152 512467 508147 503020
60811 503020 497581 492279 487168 482318 477996 474264 470850 467617 464840 462822 461384 459921 457891 455284
60797 455284 452699 450859 449923 449413 448880 448383 448085 447717 446919 445911 445348 445585 446514 448097 450449 453318 455979
60780 455979 457949 459464 460944 462232 462714 462140 461133 460824 461959 464332 467055 469432 471451 473372 475049
60765 475049 475959 475864 475156 474511 474417 475016 476124 477258 477869 477746 477151 476539 476193 476064 475817 474995 473316 470876
60747 470876 468118 465678 464182 463907 464418 464767 464312 463214 461886 460186 457539 453706 449039 444047 439191
60732 439191 435063 432178 430399 429020 427632 426527 426037 425965 426017 426392 427387 428628 429254 428913 428169 427836 428181
60715 428181 428935 429840 430985 432661 434974 437608 439997 441792 443187 444739 446861 449538 452433 455198 457619
60700 457619 459568 460927 461716 462286 463248 464931 466924 468376 468837 468613 468187 467595 466679 465775 465703 466926 468985
60683 468985 470995 472532 473810 475097 476227 476853 476996 477139 477801 479138 480946 482856 484440 485355 485632 485705
60667 485705 485892 485783 484491 481682 478146 475018 472574 470127 467152 464128 461977 460913 460261 459425 458636
60652 458636 458533 459301 460590 462145 464088 466463 468918 471087 472963 474593 475588 475411 474085 472163 469978
60637 469978 467416 464636 462440 461418 461016 460058 458229 456522 456089 457023 458466 459539 459922 459787 459516 459384
60621 459384 459303 458967 458385 458099 458619 459823 461178 462331 463143 463326 462655 461579 461059 461584 462728 463873 464927
60604 464927 466024 466940 467272 467004 466496 466034 465729 465731 466167 466929 467891 469255 471380 474267 477529 480858 484252
60587 484252 487767 491283 494439 496589 497046 495849 494244 493880 495345 497847 500344 502531 504667 507058 510133
60572 510133 514580 520857 528641 537137 545903 555183 565498 577116 589863 603295 617071 631136 645417
60559 645417 659365 672018 682530 690378 695076 696191 693911 689235 683290 676725 670024 664005 659519
60546 659519 656808 655670 656138 658501 662621 667788 673572 680577 690003 702578 718108 736076 756402
60533 756402 779443 805302 833303 862142 890281 916029 937554 953262 962346 964790 961006 951764
60521 951764 938440 922830 906475 890271 874721 860169 846746 834468 823604 814694 808100 803848
60509 803848 801870 801917 803152 804581 806359 810226 818131 830670 847192 867017 890116 917022 948689
60496 948689 986173 1029818 1078804 1131856 1188179 1247217 1307741 1367823 1425669 1479954 1529426
60485 1529426 1572775 1608966 1637281 1656978 1667278 1667670 1657821 1637183 1605147 1561731 1507978 1445790
60473 1445790 1377622 1306118 1233586 1161884 1092993 1029228 972198 921766 876687 836157 800171
60462 800171 768635 741103 717383 697415 680329 664561 649353 635384 623458 613217 603712 594616
60450 594616 586232 578743 572045 566043 560566 555288 550205 545923 542981 541090 539521 537942 536393 534730
60436 534730 532794 531011 530096 530000 529708 528322 525966 523478 521570 520468 519982 519619 518869 517736 516896 517072
60420 517072 518271 519810 521085 522156 523560 525729 528616 531679 534122 535329 535337 534893 534843 535466 536539 537948
60404 537948 539859 542232 544616 546741 548958 551684 554621 556963 558383 559430 560934 563268 566213 569285
60390 569285 572112 574661 577092 579397 581423 583391 586004 589646 593761 597489 600628 603472 605979 607913
60376 607913 609665 612064 615207 618277 620747 623028 625559 627992 629793 631082 632278 633355 634086 634761 636036
60361 636036 638117 640536 642743 644654 646639 649149 652290 655738 659245 663263 668709 676024 684777 694290
60347 694290 704136 713844 722700 730243 736478 741220 743792 743907 742349 740009 736545 730817 722618 713262
60333 713262 704356 696547 689580 683073 676896 671062 665483 659867 653974 648100 643113 639668 637481 635695
60319 635695 633828 632092 630957 630802 631968 634700 638939 644407 650933 658543 667318 677415 689106 702521
60305 702521 717434 733611 751159 770168 790089 809863 828566 845483 859539 869271 873589 872276
60293 872276 865639 854038 838027 818699 797618 776453 756607 738923 723539 710185 698685 689075
60281 689075 681252 674771 669093 663795 658456 652580 645924 638861 632233 626732 622365 618499 614446 610047
60267 610047 605619 601367 597089 592627 588389 585060 582843 581273 579848 578584 577830 577754 578190 578936 580038
60252 580038 581746 584181 587138 590211 593056 595396 596947 597618 597824 598233 599055 599835 600106 599908 599442 598598
60236 598598 597255 595870 595318 596185 598420 601526 604810 607703 610308 613507 618146 624112 630521 636657 642357
60221 642357 647670 652782 658282 664888 672715 681164 689690 698302 707217 716466 726011 735907 746168 756754
60207 756754 767744 779128 790333 800473 809364 817853 826799 836060 844800 852405 858639 863215 865889
60194 865889 866959 867145 866861 865936 864072 861190 857250 852157 846110 839724 833470 827146 820235 812666 804895
60179 804895 797253 789679 782280 775726 770634 766795 763491 760567 758642 758086 758269 758173 757373 756035 754272
60164 754272 752088 749844 748137 747095 746228 745178 744282 744151 744947 746339 748004 749943 752369 755493 759409
60149 759409 764074 769346 775094 781248 787740 794446 801307 808599 817021 827320 839674 853599 868772
60136 868772 885796 905701 928612 953420 978978 1004953 1030921 1055156 1075175 1089460 1097954 1100988
60124 1100988 1098677 1091597 1081235 1069177 1056302 1043299 1031441 1022095 1015523 1010755 1006724 1003084 999899
60111 999899 996964 993750 989840 985166 979841 973901 967260 959881 951927 943683 935325 926863 918316 909936
60097 909936 902251 895893 891289 888451 887160 887434 889667 894043 899926 906273 912781 920294 929800 941250
60083 941250 953734 966707 980595 996036 1012748 1029406 1044452 1056768 1065526 1069776 1068503 1061052
60071 1061052 1047342 1027780 1003284 975494 946583 918523 892385 868315 846008 825208 806006
60060 806006 788795 773828 760818 749207 738890 730330 723830 719020 715348 712709 711336 711325 712644
60047 712644 715281 719005 723243 727644 732516 738237 744487 750603 756500 762491 768343 773235 776738 779110
60033 779110 780453 780368 778752 776301 773709 770845 767177 762588 757267 751076 743564 734574 724455 713781
60019 713781 703097 692851 683246 674150 665307 656634 648344 640922 634900 630340 626541 622685 618912 616303
60005 616303 615519 615931 616469 616881 617618 618854 620312 621982 624272 627291 630562 633749 637252 641723 647237
59990 647237 653284 659440 665700 672126 678540 684716 690687 696601 702316 707372 711389 714298 716140 716916
59976 716916 716848 716543 716601 717191 718321 720382 723994 729317 736011 744057 754133 766897 782174 799259 817860
59961 817860 838409 861432 886825 913582 939908 963467 981842 993163 996573 992304 981396 965343
59949 965343 945838 924589 903140 882718 864181 847909 833591 820340 807478 795307 784719
59938 784719 775901 767942 760024 752486 746217 741464 737950 735864 735842 737965 741621 746528 753078 761375 770620
59923 770620 779960 789453 799695 810821 822309 833539 844215 854451 864797 876110 889182 904498
59911 904498 922294 942481 964433 987212 1010141 1032882 1054857 1075020 1092294 1105841 1114856 1118750
59899 1118750 1117769 1112883 1104765 1093518 1079765 1065210 1051393 1038502 1026270 1015592 1008159 1004518
59887 1004518 1003525 1003962 1005945 1010342 1017407 1026541 1037085 1048822 1061750 1075745 1090550 1105841 1121078
59874 1121078 1135411 1148067 1159054 1169279 1179598 1189785 1198698 1205448 1209975 1212439 1212548 1209732 1203615
59861 1203615 1193966 1180557 1163461 1143378 1121355 1098263 1074667 1050951 1027367 1004218 982190
59850 982190 962289 945206 930938 919094 909283 901134 894436 889552 887290 888017 891197 895939 901519
59837 901519 907024 911148 912976 912727 911321 909629 908529 909051 911603 915256 918461 920241 920133 917412 911412
59822 911412 902599 892431 881956 871184 859942 848596 837643 827189 817255 808182 800347 793619
59810 793619 787363 780958 774320 768025 762881 759194 756526 754208 751866 749329 746548 743941 742317 741839
59796 741839 741492 740270 738579 737606 737513 737194 735908 734172 732820 731976 731371 731001 730995 731335 732028 733190 734674
59779 734674 736087 737432 739323 742298 746353 751350 757374 764295 771438 778221 784854 791997 799960 808624
59765 808624 818021 828549 840600 854196 869043 884909 902060 921246 943044 967241 993218 1020949
59753 1020949 1051193 1084489 1120329 1157560 1195272 1232983 1270269 1306591 1341405 1374076 1403717
59742 1403717 1429242 1449577 1463762 1471027 1471036 1464114 1451234 1433768 1413091 1390242 1365965 1341143
59730 1341143 1316965 1294330 1273199 1252872 1232846 1213078 1193547 1174023 1154329 1134435 1114369
59719 1114369 1094429 1075397 1057935 1041718 1025815 1010050 995329 982387 970964 960586 951491
59708 951491 944134 938306 933458 929539 926843 925237 924228 923764 924388 926485 929785 933579 937117 939925 942156
59693 942156 944601 947828 951307 953822 954808 954749 954135 952628 949700 945669 941468 937467 933092 927693 921346
59678 921346 914509 907266 899358 890817 882078 873418 864739 856086 847994 840966 834911 829480 824772 821247
59664 821247 819021 817680 816852 816579 817092 818566 821193 825120 830182 835944 842089 848504 854931 860869 866002
59649 866002 870360 873829 875766 875397 872495 867481 860934 853161 844136 833756 822178 809957 797797
59636 797797 786236 775640 766359 758622 752265 746833 741930 737321 732827 728427 724319 720451 716058 710185
59622 710185 702743 694615 686704 679370 672874 667619 663592 660087 656467 652876 649846 647506 645667 644391
59608 644391 643987 644500 645540 646667 647769 649152 651307 654387 657792 660560 662252 663138 663392 662690 660992
59593 660992 659246 658602 659080 659610 659403 658781 658548 658953 659458 659323 658237 656466 654496 652584 650708 648849
59577 648849 647047 645104 642595 639437 636176 633436 631264 629295 627423 625961 625230 625273 625884 626644 627049 626890
59561 626890 626458 626091 625604 624537 622942 621569 621145 621775 623099 624721 626272 627412 628126 628983 630742 633616
59545 633616 637134 640818 644788 649562 655483 662675 671441 682292 695518 711070 728887 748618 768522
59532 768522 785152 795131 797521 794224 788141 781482 775602 771426 769339 768984 769671 770896 772260 773195 773089
59517 773089 771646 768891 764911 759739 753440 746202 738351 730179 721659 712570 703171 694540 687714 682565
59503 682565 678053 673496 668989 664573 659864 654856 650384 647312 645764 645556 646735 649104 651734 653751
59489 653751 655359 657452 660364 663660 667025 670683 674843 679283 683664 687957 692378 697134 702252 707515
59475 707515 712642 717690 723135 729248 735493 740836 744642 747057 748574 749551 750172 750593 750963 751363 751870 752709
59459 752709 754337 757246 761538 766816 772734 779489 787422 796225 805041 813385 821399 829065 835730 840791
59445 840791 844337 846689 847638 846564 843061 837167 829287 820274 811295 803169 795944 789371 783625 779268
59431 779268 776706 775897 776430 777795 779869 783216 788539 795732 804043 813353 824625 838699 855283 873629
59417 873629 893555 915186 938189 962030 986652 1012287 1038926 1066424 1094387 1120899 1141833
59406 1141833 1152864 1152797 1144568 1133061 1122434 1115163 1112430 1114758 1122439 1135312 1151725 1167829 1178657
59393 1178657 1180433 1172079 1155098 1132584 1108010 1084009 1061878 1042197 1025523 1011994 1000786 990821
59381 990821 981884 974323 967842 961535 955120 949281 944630 941136 938730 937603 937567 937778 937552 936977 936461 936213
59365 936213 936443 937583 939931 943430 948033 953877 960874 968613 976989 986569 997984 1011182 1025577 1040704
59351 1040704 1056583 1073645 1092438 1113142 1135241 1157829 1180265 1202280 1223562 1243613 1262089
59340 1262089 1278849 1293616 1305832 1314876 1320050 1320472 1315534 1305639 1292101 1276188 1258522 1239374
59328 1239374 1219032 1197829 1176240 1155021 1134831 1115673 1097245 1079869 1064495 1051605 1040691
59317 1040691 1031057 1022558 1015267 1008967 1003391 998583 994594 991167 988154 985984 985300 986191 988073 990240
59303 990240 992286 994069 995463 996184 995843 994238 991610 988541 985716 983909 983975 986522 991610 998833 1007295
59288 1007295 1015102 1019345 1017507 1009221 996381 981671 967413 955471 947180 942887 942116 944516 950320
59275 950320 959778 972636 988406 1006676 1026898 1048201 1069662 1090508 1110052 1127811 1143689 1157573
59263 1157573 1168773 1176433 1180565 1182069 1181564 1178854 1173809 1167161 1160091 1153502 1147923 1143592 1140210 1137105
59249 1137105 1134047 1131542 1130000 1129015 1127811 1126067 1123980 1121817 1119735 1117684 1115208 1111630 1106759 1101230
59235 1101230 1095987 1091627 1088250 1085444 1082159 1077060 1069411 1059492 1048119 1036011 1023586 1010843 997360
59222 997360 982924 968269 954651 942496 931054 919599 908349 897871 888197 878940 869799 860635
59210 860635 851531 843140 836437 831728 828358 825714 823952 823348 823552 824092 825108 827009 829827 833485 838275
59195 838275 844344 850982 857136 862612 868259 875060 883407 893144 903844 914969 926112 937192 948358
59182 948358 959750 971261 982314 991985 999747 1006033 1011549 1016090 1018712 1019093 1017880 1015551 1011910 1007105
59168 1007105 1002124 997626 993156 988317 983842 980487 977469 973180 967154 960221 952812 944204 933671 921610
59154 921610 909188 897261 885811 874186 861867 849197 837212 826621 817277 808815 801331 795065
59142 795065 789896 785607 782225 779647 777474 775745 775325 776884 779955 783704 788082 793401 799326 805384
59128 805384 812158 820768 831108 841691 851389 860401 869261 877851 885806 893168 900041 906161 911377 916294
59114 916294 921922 928718 936166 943243 949179 953821 957393 959970 961390 961647 960979 959417 956576 952221 946747
59099 946747 940770 934598 928398 922505 917049 911603 905777 900011 895267 892026 889972 888486 887054 885346
59085 885346 883299 880956 877926 873350 866817 858976 850808 842673 834556 826774 819684 813036 806422 800187
59071 800187 795065 791061 787461 783925 780792 778175 775524 772310 768663 765122 762100 759651 757455 755075
59057 755075 752478 750144 748370 746805 745066 743515 742835 743163 744159 745618 747394 749096 750592 752556 755730
59042 755730 759851 764058 768183 772825 778381 784892 792678 802166 813145 825131 838509 854370 873249
59029 873249 895004 919980 949169 982834 1019941 1059266 1100168 1141867 1182781 1220932 1254238
59018 1254238 1280129 1295893 1300188 1293686 1277877 1253994 1223594 1189311 1154020 1119515 1086582 1055899
59006 1055899 1028186 1003696 982305 964098 949438 938471 930876 926031 923222 921765 921117 920828 920399
58993 920399 919432 918011 916631 915639 914898 914045 912815 911145 909241 907648 906945 907368 908913 911703 915890 921300
58977 921300 927603 934767 942951 952026 961684 971998 983400 996077 1009783 1024200 1039023 1053771
58965 1053771 1068010 1081704 1094863 1106954 1117251 1125631 1132371 1137176 1139073 1137328 1131915 1123172 1111628
58952 1111628 1098076 1083093 1066533 1048235 1029111 1010683 993606 977634 963078 951136 942505
58941 942505 936678 933013 931536 932309 935003 939615 946703 956325 967582 979756 993062 1007520 1021821
58928 1021821 1034111 1043397 1049486 1052136 1051002 1046089 1037585 1025601 1010624 993854 976577 959543
58916 959543 943391 929164 917768 909150 902561 897378 893322 890265 888316 887874 889206 892266 897145 904344
58902 904344 914258 926773 941527 958061 975481 992713 1009554 1026847 1045107 1063541 1080973 1097200
58890 1097200 1112865 1128617 1145069 1163008 1182700 1203213 1223087 1241469 1258000 1271988 1282530
58879 1282530 1289355 1292875 1293420 1291002 1285807 1278424 1269532 1259652 1249166 1238343 1227447 1217037 1207926
58866 1207926 1200604 1194868 1190168 1186035 1182144 1178453 1175483 1173858 1173352 1173071 1172932 1174169 1177820 1183406 1189884
58851 1189884 1197252 1206220 1216589 1226770 1234688 1238317 1235601 1224915 1206017 1180163 1149259 1115210
58839 1115210 1079875 1044967 1011775 981075 953159 927773 904465 883478 865962 852786 843361
58828 843361 836144 830034 824817 820556 817285 815248 814810 815977 818269 821011 823584 825632 827367 829400
58814 829400 831918 834301 835866 836668 837179 837577 837789 837844 837624 836591 834318 831033 827159 822647 817318 811480
58798 811480 805591 799642 793513 787568 782133 776764 770899 765011 760181 756626 753622 750960 749546 750305
58784 750305 753259 757961 764102 771355 779172 787138 795132 802942 810137 816612 822785 828908 834378 837991
58770 837991 838809 836778 832786 828195 824058 820659 817950 816334 816700 819734 825564 834032 844880 857491
58756 857491 870724 883222 893786 901454 905472 905383 901131 893116 882274 869986 857699 846506 837034
58743 837034 829494 823743 819517 816836 816093 817507 820606 824439 828227 831698 834938 838134 841379 844612
58729 844612 847753 850870 854049 857115 859778 862025 864028 865645 866495 866743 867384 869404 872885 877148 881563
58714 881563 886016 890714 895599 899864 902231 902070 899988 896770 892046 884777 874894 863351 850494 835621
58700 835621 818585 800615 782839 764970 746328 727363 709230 692533 677380 664103 653038
58689 653038 643939 636398 630376 625629 621199 616354 611509 607356 603550 599299 594873 591404 589315 587931
58675 587931 586582 585246 584111 583344 583379 584770 587705 592082 597911 605228 613881 623868 635383 647881
58661 647881 659574 668726 675107 679285 680941 679005 673323 665147 655917 646413 637111 628413 620340 612659
58647 612659 605428 598933 593122 587751 582968 579094 575939 573097 570842 569970 570699 572414 574550 577103 580145
58632 580145 583463 586723 589545 591383 591830 591071 589723 588325 587267 586938 587440 588349 589197 590010 591135 592894
58616 592894 595698 599932 605333 611089 616956 623523 630814 637661 643214 648069 652845 656709 658761 660018
58602 660018 662320 665751 668785 670732 672343 674106 675574 676497 677127 677271 676592 676068 677715 682385 689047
58587 689047 696620 705283 715550 727224 739839 753165 766750 779811 792027 803732 815012 825328
58575 825328 834229 841773 848205 854112 860894 870072 881961 895942 912072 931340 954132 979614 1006955
58562 1006955 1036134 1067151 1099358 1131925 1163999 1194003 1219637 1239070 1251592 1257055 1255665 1248628
58550 1248628 1238130 1226232 1214309 1203491 1194621 1187501 1181015 1174237 1166678 1157363 1144705 1127594
58538 1127594 1105953 1080216 1051231 1020712 990682 962099 934810 908938 885365 864722 846898
58527 846898 831679 818934 808058 798254 789498 782250 776235 770628 765469 761616 759146 757030 754578
58514 754578 751950 749138 745792 742333 739834 738460 737330 736180 735682 735805 735457 734332 733590 733955 734607 734727
58498 734727 734738 735130 735457 735521 736359 738928 742765 746965 751580 757116 763479 770426 778375 787887 798814 810771
58482 810771 823996 839199 856872 877037 899132 922032 944768 967130 988685 1007390 1020402
58471 1020402 1026369 1025790 1019362 1007591 992151 975757 960117 945462 932433 922592 916469 912967 911600
58458 911600 913575 919698 928875 939878 953076 969114 987099 1005216 1022006 1035970 1045160 1048397
58446 1048397 1046008 1038584 1026185 1009560 990794 971689 952742 934625 919193 907755 899557 893202
58434 893202 888555 886103 885569 886304 888118 890787 893792 897466 903206 911637 921709 932360 943608 954985
58420 954985 964490 970359 972543 971383 966391 957647 946879 935657 923847 911226 899106 888749 879564
58407 879564 870549 862255 855598 849978 844378 839273 835677 833209 830860 828861 828191 829018 831086 834732 839999
58392 839999 845638 850415 854588 858759 862459 865334 868585 873504 879545 885475 891510 898712 907155 916230
58378 916230 925765 935346 943614 949879 955445 961802 968626 975130 982083 990649 1000451 1010773 1022497 1036694
58364 1036694 1052262 1067182 1081440 1096611 1113140 1130003 1146465 1162204 1176145 1186979 1194589
58353 1194589 1199589 1202055 1202046 1200535 1198431 1195669 1192591 1190971 1192049 1194777 1197789 1201826 1208383 1217219 1227231
58338 1227231 1238627 1252130 1267085 1282387 1298328 1315662 1333945 1352567 1372063 1392406 1411453
58327 1411453 1427181 1440048 1450979 1458795 1462175 1462614 1462604 1462312 1460858 1459544 1460624 1463904 1467640 1472070
58313 1472070 1479055 1488882 1500212 1512615 1526547 1541425 1556222 1571283 1587265 1603355 1618893 1635446
58301 1635446 1654717 1675754 1696822 1718456 1741763 1765426 1787637 1809387 1832460 1855705 1876987
58290 1876987 1897345 1919460 1943371 1967596 1993111 2022048 2053572 2085304 2117790 2153260 2190928
58279 2190928 2228088 2265222 2305472 2349442 2394898 2441185 2489474 2538900 2586845 2632955 2678911
58268 2678911 2724772 2769803 2816248 2867760 2924417 2983581 3044895 3109860 3177332 3244493 3311718
58257 3311718 3381395 3452467 3521405 3588263 3656580 3727734 3800680 3876692 3958632 4045882 4135825
58246 4135825 4230016 4332947 4445000 4562784 4686208 4818820 4961155 5110297 5266143 5431564
58236 5431564 5606349 5787795 5977486 6180613 6398493 6628714 6872545 7134729 7416027
58227 7416027 7713849 8030379 8372040 8740984 9135619 9559498 10020731 10522549 11063993
58218 11063993 11650001 12290770 12991176 13751898 14581655 15497346 16512233 17636921 18893263
58209 18893263 20314691 21932548 23777137 25894271 28345489 31189402 34478186 38273877
58201 38273877 42650370 47678539 53433819 60029295 67627269 76419827 86628499 98538720
58193 98538720 112520436 129018448 148557846 171754372 199211399 231201222 267153543
58186 267153543 305088555 341278255 370600053 387903999 389979179 376936124 352010831
58179 352010831 319989786 285447156 251783009 221106800 194463055 172068143 153533317
58172 153533317 138089514 124793296 112745475 101332671 90365237 79983974 70420151
58165 70420151 61824522 54246588 47668271 42014510 37168402 33012226 29451598 26401916
58157 26401916 23777610 21506788 19539629 17833292 16342489 15030716 13875811 12856984
58149 12856984 11948070 11128547 10389078 9720721 9109324 8544933 8026213 7550970 7111757
58140 7111757 6704516 6331936 5994172 5684905 5400026 5141568 4909393 4697088 4499437
58131 4499437 4316194 4145415 3980901 3819697 3665045 3518874 3378389 3242837 3116367
58122 3116367 3000832 2892420 2788530 2691516 2602566 2518309 2436773 2360637 2291181 2224905 2159526
58111 2159526 2097745 2041514 1987786 1933499 1880009 1829190 1779637 1730050 1682126 1636958 1592530
58100 1592530 1547776 1505314 1467293 1432126 1397952 1365790 1336801 1309909 1284513 1262158 1243269
58089 1243269 1225592 1207936 1192012 1178575 1165279 1150445 1135407 1121039 1105470 1087484 1068740
58078 1068740 1050430 1031126 1010210 990056 972375 955532 937937 921058 906623 893731 881136
58067 881136 869640 859849 850201 839641 829863 822577 816808 810924 805033 799396 792847 784843 776856 769786
58053 769786 762137 752609 742385 733107 724682 716623 709332 702551 694855 686230 678734 673118 667435 660578
58039 660578 654418 650436 646971 641991 636173 631030 626276 621211 616510 612396 607117 599459 590856 583004
58025 583004 575352 567003 558947 552231 545904 539069 533051 529194 526236 522244 517599 513765 510590 507098
58011 507098 503632 500999 498742 496293 494609 494690 495642 496060 496104 496469 496647 496040 495494 495867 496380 496184 496188 497432
57993 497432 498959 499260 498715 498780 499910 502007 505633 510805 515766 518789 520199 520899 520218 517134 512458 507830
57977 507830 503527 499105 495126 492319 490040 487498 485580 485574 486944 488230 489283 490758 492334 493341 494368
57962 494368 496293 498421 499426 499481 499675 500010 499754 499067 498459 497293 494627 491022 487731 484717 481277 478095
57946 478095 476793 477744 479970 482856 486438 490457 494814 500609 509093 519782 530947 541625 551876
57933 551876 561665 570908 580023 588884 595756 598862 598528 596277 592386 586104 577815 569040 560342 550966
57919 550966 540680 530434 520998 512191 503715 495758 488699 482993 479170 477200 476215 475608 475815 477175
57905 477175 478820 479785 480478 481829 483605 484795 485063 484691 483775 482663 482497 484038 486627 489529 493448 499289
57889 499289 506306 513044 519334 525691 531496 535631 538440 541176 543897 545648 546417 547081 547567 546776 544267
57874 544267 540524 535765 530036 524257 519578 515881 512445 509814 509253 510515 511938 512745 513604 514907 516279
57859 516279 517949 520912 525411 530705 536523 543270 550646 557554 563618 569331 574520 578192 580238 581760
57845 581760 583284 584008 583269 581533 579496 577376 575469 574296 573743 573135 572463 572530 573555 574678 575155 575077 574667
57828 574667 573837 572751 571915 571445 570959 570270 569364 567785 564988 561308 557606 554062 550257 546258 542450 538419
57812 538419 533353 527537 522214 517895 514068 510545 507660 504958 501145 495758 489722 483924 478452 473439
57798 473439 469404 466289 463396 460684 459097 459126 460082 461156 462225 463331 464420 465985 468980 473690 479452
57783 479452 485625 491939 497992 503608 509789 517928 527823 537775 546888 555805 564735 572343 577406 580299
57769 580299 581925 582338 581367 579582 577595 575180 572032 568784 566392 564931 563728 562357 560918 559685 558883
57754 558883 558585 558581 558612 558810 559442 560298 560898 561242 561630 561842 561407 560688 560738 561916 563485 564673 565312 565431 565169
57735 565169 565108 565698 566310 565942 564834 564214 564498 565100 566060 568265 571687 574990 577503 580157 583785 587823
57719 587823 591469 594777 597783 599831 600721 601403 602592 603774 604548 605809 608403 611432 613179 613148 612172 611008
57703 611008 609757 608258 606175 603065 599058 595073 591877 589455 587759 587256 587980 588782 588368 586631 584270
57688 584270 581699 579113 577076 576211 576606 578176 581327 586741 594776 605399 618275 632778 648683 667239
57674 667239 690732 720462 755974 796843 844363 900733 967265 1043864 1128822 1217298 1300047
57663 1300047 1364990 1401165 1402459 1369556 1309676 1233772 1152337 1072772 999611 935443 880747
57652 880747 834104 794034 760427 733585 712666 696136 683146 673376 665967 659801 654635 650933
57640 650933 648673 647148 645809 644477 642886 640895 639107 638424 638847 639375 639262 638874 639110 640324 641974 643153
57624 643153 643444 643242 643156 643214 643051 642727 642716 643014 643022 642552 642231 642547 643189 643689 644015 644190 644127 644272 645569 648171
57604 648171 650939 652856 654213 655748 657415 658770 659841 660776 661225 660934 660409 660203 660058 659528 658872 658574
57588 658574 658517 658487 658869 659993 661315 662232 663200 665020 667455 669595 671201 672630 673706 673866 673370 673294 674202
57571 674202 675601 676762 677357 677337 676915 676730 677406 678950 681003 683490 686490 689765 693036 696493 700422 704555
57555 704555 708449 712277 716594 721535 726880 732652 738982 745555 751829 757605 762904 767524 771379 774961
57541 774961 778873 783186 787758 792704 797890 802505 806035 809256 813308 818068 822419 825965 829459 833550
57527 833550 837994 842258 846229 850201 854645 859935 865855 871623 876895 882390 888882 896010 902818 909156
57513 909156 915622 922395 929034 935354 941681 948248 954970 961716 968198 973848 978507 982953 988030 993510
57499 993510 998524 1002750 1006392 1009437 1011913 1014566 1018186 1022424 1026267 1029501 1032749 1036306 1040077 1044483
57485 1044483 1050190 1056932 1063694 1070102 1076584 1083222 1089656 1096150 1103419 1111214 1118328 1124317 1129990 1135867
57471 1135867 1141442 1146493 1151882 1158264 1165022 1171322 1177471 1184405 1192467 1201390 1210916 1220768 1230483 1239894
57457 1239894 1249433 1259480 1269755 1279793 1289589 1299391 1309236 1319087 1329040 1339057 1348811 1358190 1367619
57444 1367619 1377543 1387886 1398308 1408767 1419536 1430800 1442374 1453805 1464774 1475543 1486784
57433 1486784 1498751 1510951 1523021 1535448 1548659 1561795 1573469 1583699 1594003 1605425 1617477
57422 1617477 1629390 1641334 1653768 1666338 1678264 1689460 1700667 1712667 1725712 1739478 1753280
57411 1753280 1766557 1779395 1792415 1806102 1820482 1835391 1850587 1865575 1879796 1893197 1906247
57400 1906247 1919333 1932451 1945505 1958530 1971692 1985401 2000291 2016606 2033817 2051388 2069660
57389 2069660 2089199 2109485 2129227 2148033 2166861 2186656 2207376 2228605 2250184 2271843 2292984
57378 2292984 2313300 2333099 2352676 2371886 2390643 2409248 2427897 2446302 2464126 2481360 2498138
57367 2498138 2514604 2531068 2547783 2564529 2580966 2597465 2614957 2633863 2653814 2674404 2695502
57356 2695502 2716750 2737662 2758471 2780113 2803091 2826996 2851317 2875959 2900767 2925400 2949966
57345 2949966 2975029 3000663 3026219 3051270 3076008 3100496 3124438 3148031 3172139 3197269 3223187
57334 3223187 3249856 3277693 3306406 3334694 3361812 3388521 3415746 3443251 3470447 3497588 3525156
57323 3525156 3552810 3580010 3607180 3635165 3663945 3692848 3721711 3750881 3780295 3809508 3838538
57312 3838538 3867904 3897814 3927988 3958254 3988740 4019541 4050648 4082153 4114043 4145944 4177505
57301 4177505 4208945 4240806 4273244 4305872 4338263 4370366 4402594 4435636 4469913 4505060 4540277
57290 4540277 4575372 4611003 4647669 4684899 4721764 4757801 4793194 4828490 4864448 4901668 4940037
57279 4940037 4978839 5017589 5056284 5094729 5132342 5169034 5205565 5242550 5279688 5316427 5352797
57268 5352797 5389076 5425216 5461144 5497124 5533285 5569264 5604809 5640206 5675632 5710661 5744964
57257 5744964 5778905 5812814 5846276 5878860 5911043 5943634 5976700 6009817 6043025 6076784 6111220
57246 6111220 6146084 6181216 6216500 6251628 6286440 6321184 6355929 6390129 6423264 6455468 6486999
57235 6486999 6517645 6547325 6576676 6606151 6635043 6662374 6688445 6714474 6740901 6767062 6792540
57224 6792540 6817871 6843754 6870405 6898009 6927120 6958212 6991171 7025537 7061132 7098314 7137600
57213 7137600 7178959 7221555 7264567 7308325 7354074 7402419 7452594 7503664 7555747 7609468 7664761
57202 7664761 7720921 7777455 7834186 7890851 7947287 8003808 8060760 8117809 8174051 8228594 8280772
57191 8280772 8330319 8377840 8424651 8471541 8517937 8562616 8604704 8643569 8678569 8709627 8737459
57180 8737459 8762396 8783539 8799927 8812134 8821857 8830288 8837634 8843774 8848552 8851720 8853342 8853803 8852563
57167 8852563 8847396 8835812 8816951 8791294 8759132 8720494 8676270 8628142 8577389 8524608 8470418
57156 8470418 8415469 8359907 8303785 8247938 8193636 8141516 8091680 8044561 8000729 7960120 7922385
57145 7922385 7887725 7856281 7826935 7797954 7768817 7740359 7713143 7686664 7659965 7631788 7600098
57134 7600098 7562681 7518502 7467665 7410217 7346207 7277017 7205409 7133900 7063996 6997077 6934892
57123 6934892 6878893 6829978 6788993 6756369 6730991 6710471 6692927 6677785 6664783 6653241 6642559
57112 6642559 6632604 6623580 6616736 6615582 6625652 6652836 6702522 6779807 6888993 7032600 7212049
57101 7212049 7429728 7689641 7996487 8355784 8775309 9265265 9837163 10503861 11280255
57092 11280255 12181769 13221914 14412643 15764598 17279122 18932855 20669072 22407800
57084 22407800 24071887 25616728 27051512 28438857 29861637 31365444 32912625 34383458
57076 34383458 35622381 36491320 36896989 36792187 36170202 35062160 33532584 31668570 29566173
57067 29566173 27319512 25013900 22721866 20501602 18397434 16440789 14650686 13034501
57059 13034501 11590118 10308979 9178553 8183860 7309000 6539078 5861432 5265320 4740921
57050 4740921 4278999 3871162 3509815 3187951 2899560 2640121 2406076 2193881 2000259
57041 2000259 1823435 1663246 1519615 1391383 1276746 1174097 1082077 999489 925721 860833
57031 860833 804784 756919 716495 683307 657433 638794 627300 623203 627183 640641 666086 706530
57019 706530 763645 835739 916294 993147 1049897 1071357 1050906 993716 912887 822360 732414
57008 732414 649015 574799 510282 455209 409316 371997 342005 318078 299414 285034 273415
56997 273415 263583 256057 251794 250506 250864 252059 254204 257343 261007 264921 269494 275497 283712 294728
56983 294728 308336 322905 335685 343868 345346 339040 325288 305959 283673 260781 239088 219987
56971 219987 204160 191331 180964 173244 168918 168251 170633 175245 181776 190618 202734 219232 240624
56958 240624 266370 295076 324656 351907 372529 382603 380524 367518 346592 321272 294838 269797
56946 269797 247573 228769 213648 202208 194118 188968 186581 186958 190196 196672 207014 221552 240071
56933 240071 262371 288742 319358 353089 386852 415800 434401 438537 427672 405069 375563 343197
56921 343197 310685 279942 252144 227599 206264 188203 173155 160191 148451 137896 128797 120934
56909 120934 113943 108029 103580 100422 98096 96531 95765 95417 95264 95975 98347 102063 106108 110306 115554
56894 115554 122658 131814 143137 156740 172356 189908 210569 236148 266819 300011 331723 358365
56882 358365 377359 387216 387979 381315 369657 355301 340285 326452 315057 306506 300738 297812 298120
56869 298120 302271 310849 324053 341655 363601 390607 423851 464196 512024 567337 628846 692289
56857 692289 750001 792942 814064 810967 786525 747312 700827 653265 608884 570318 538868 514868
56845 514868 498479 490196 490475 499312 516705 543181 579398 625705 682758 752146 835382 931963
56833 931963 1038170 1146453 1244801 1317964 1352531 1343128 1294278 1216726 1122589 1022926 926829
56822 926829 840320 765878 703682 653288 614199 585847 567885 560289 562773 574509 594952 624708
56810 624708 665227 717785 782571 857626 937399 1012118 1069486 1098414 1092976 1054595 991247 913914
56798 913914 832470 753547 680869 616366 560811 514263 476594 447521 426168 411202 401794 398201
56786 398201 401247 411520 429158 453935 485167 521528 560730 598820 629877 647437 647203 628739
56774 628739 594906 550368 500514 450494 403891 362076 325101 292986 265783 242855 222958
56763 222958 205230 189725 176749 165969 156466 147591 139546 132945 127909 123783 119758 115547 111435
56750 111435 107944 105609 104661 104631 104548 103898 103111 102768 102669 102231 101456 100846 100548 100270 99923 99662 99401 98984 98815
56731 98815 99493 100789 101828 102459 103552 105588 107804 109249 110072 111141 112883 115044 117274 119474 121772
56716 121772 124474 127756 131094 133350 133848 133222 132885 133721 135484 137256 138341 138814 139339 140384 141685 142661
56700 142661 143142 143314 143146 142471 141583 141086 140983 140561 139435 138185 137635 137953 138707 139400 139686 139468 139127 139296
56682 139296 140194 141468 142812 144351 146267 148482 150860 153260 155201 156049 155784 155052 154198 152856 150916
56667 150916 149249 148843 149611 150660 151476 152266 153288 154430 155464 156280 156790 156904 156689 156395 156292 156517 157033
56650 157033 157697 158399 159095 159627 159726 159385 159023 158957 158917 158538 158135 158404 159436 160597 161333 161512 161049 159944 158743
56631 158743 158117 157785 156646 154270 151507 149291 147571 145866 144109 142370 140416 138292 136859 136990 138440
56616 138440 140035 140796 140490 139412 138138 137247 136845 136467 135731 134873 134342 134190 134169 134172 134258 134477 134965 136010 137729
56597 137729 139855 141961 143697 144779 145144 145202 145490 146011 146333 146395 146595 146991 147177 147228 147948 149729 151835 153364
56579 153364 154323 155200 156051 156658 157163 157904 158950 160291 162120 164444 166889 169417 172812 177834 184240 191237
56563 191237 198581 206607 215527 225392 236562 249418 263390 276608 286568 291236 290125 284780 277904
56550 277904 271474 265796 260441 255445 251056 246940 242505 237850 233650 230149 226869 223352 219728 216480
56536 216480 213937 212041 210446 208850 207295 205928 204559 202844 200938 199433 198549 197964 197562 197630 198096 198419
56520 198419 198606 199431 201034 202149 201546 199534 197180 194734 191861 188970 187125 186683 186897 186821 185994 184356
56504 184356 182211 180258 179019 178290 177479 176269 174634 172708 171095 170772 171935 173448 174148 174274 174775 175769
56488 175769 176697 177626 179153 181092 182422 182758 182929 183831 185444 187230 188780 189785 189985 189526 189043 189122 189839
56471 189839 190826 191626 192049 192411 193196 194290 194864 194383 193300 192430 192031 191918 191891 191522 190168 187976 186356
56454 186356 186527 187979 189252 189815 190214 190714 191027 191304 192305 194387 197181 200290 203473 206114 207455 207524
56438 207524 207028 206249 204836 202835 201051 200056 199492 198682 197458 196193 195458 195677 196686 197652 197909 197743 197868
56421 197868 198377 198863 199336 200140 201126 201830 202509 204049 206675 209529 211679 212820 212912 212046 210895 210481 211070
56404 211070 211955 212573 213197 214261 215630 216906 217924 218675 219173 219579 220045 220324 220079 219638 219819 220866 222149
56387 222149 223121 223987 225166 226682 228363 230192 232108 233850 235221 236250 236933 237175 237082 236999 237129 237367 237533
56370 237533 237521 237335 237261 237818 239128 240583 241631 242647 244443 247029 249532 251269 252325 253064 253705 254457
56354 254457 255524 256883 258404 260090 261935 263788 265740 268212 271141 273561 274772 275453 276787 278844
56340 278844 280806 282453 284264 286228 287845 289404 292061 296236 300904 304881 308073 311124 314515 318328
56326 318328 322371 326268 329796 333158 336541 339632 342042 343908 345397 346000 345155 343313 341483 340067 339106
56311 339106 339216 340998 343667 345730 347088 349129 352613 356833 361119 365806 371228 377062 383270 390514
56297 390514 398872 407061 413698 418690 422856 426874 431153 436074 441789 448179 455344 463671 473250 483713
56283 483713 494807 506573 518934 531678 544849 558639 572974 587822 603602 620539 637963
56272 637963 655214 672863 691998 712735 734766 759006 787005 818793 852924 888864 927765
56261 927765 970692 1017804 1069704 1127928 1193349 1265507 1344298 1431158 1527961 1635822 1755384
56250 1755384 1886996 2029978 2182854 2344811 2515833 2694971 2879686 3067161 3254831
56241 3254831 3439155 3615412 3779353 3927733 4056684 4161226 4237300 4283068 4297698 4280542
56231 4280542 4232464 4156501 4056203 3934629 3795726 3644930 3486895 3323791 3157041 2989547
56221 2989547 2824907 2665398 2511979 2365375 2226066 2094047 1969654 1853901 1747157
56212 1747157 1648347 1556281 1470837 1392137 1319612 1252696 1191282 1134738 1081739 1032012 986915
56201 986915 947240 911718 878776 848489 821544 797500 775440 755395 737744 722013 707439
56190 707439 693941 681616 670191 659895 651707 645709 640395 634709 629571 626181 624094 622308 621034
56177 621034 620915 621500 622027 622809 624410 626326 627899 629742 632887 637243 642080 647314 653202 659670 667029
56162 667029 676283 687597 699483 710744 722209 735362 750381 766808 784981 805468 828158 853226
56150 853226 881943 915300 952969 994845 1042265 1096538 1157841 1227114 1307412 1401453 1509021
56139 1509021 1628210 1757542 1894847 2035601 2174544 2307788 2431577 2540863 2632018 2706171
56129 2706171 2767638 2819930 2865165 2905556 2942083 2972038 2990626 2995175 2986204 2965433 2935083 2898275
56117 2898275 2857090 2809890 2752282 2680510 2592626 2487718 2366743 2234023 2095990 1958563
56107 1958563 1826691 1704891 1595857 1499421 1414835 1342975 1284254 1236038 1194963 1160705 1134580
56096 1134580 1115507 1100522 1088511 1080173 1074741 1070044 1065769 1063593 1063952 1065461 1067557 1071001 1075610
56083 1075610 1080115 1084468 1089952 1096885 1104386 1112293 1121182 1130821 1140802 1152171 1166069 1181384 1196252
56070 1196252 1211140 1227813 1246056 1264399 1283326 1304475 1327065 1348512 1368337 1388199 1408233
56059 1408233 1426766 1443718 1460978 1479178 1497100 1514367 1531650 1548252 1562606 1575283 1588548
56048 1588548 1603116 1618445 1635805 1657517 1683162 1710043 1737375 1766503 1797214 1827815 1859007
56037 1859007 1893648 1932140 1971802 2011284 2051863 2093842 2135444 2176058 2217126 2259265 2301823
56026 2301823 2345480 2391664 2439253 2485558 2530782 2577741 2627342 2678450 2732107 2791203 2855700
56015 2855700 2922742 2991887 3065612 3144337 3225918 3310594 3401423 3498941 3600295 3704436 3813363
56004 3813363 3927632 4045758 4168726 4299790 4439035 4583458 4733090 4891567 5060082
55995 5060082 5236627 5421801 5619175 5829240 6049506 6281398 6530318 6798046 7082242
55986 7082242 7384320 7710237 8062413 8439013 8842653 9281423 9759648 10276411 10835041
55977 10835041 11444807 12111268 12834978 13622744 14490479 15452648 16519906 17710700 19054527
55968 19054527 20581232 22320023 24313489 26619913 29297199 32397326 35980265 40118044
55960 40118044 44881595 50344798 56614614 63846226 72227083 81971990 93350961 106711005
55952 106711005 122472774 141141745 163332707 189703275 220689431 256034074 294192404
55945 294192404 331843850 363986228 385079855 391043550 380985622 357454920 325080297
55938 325080297 288679374 252021147 217535137 186521990 159447320 136232383 116536636
55931 116536636 99946967 86040274 74401730 64658596 56497983 49647912 43864650
55924 43864650 38948414 34749764 31147566 28033575 25322354 22955999 20886950 19066644
55916 19066644 17455493 16028996 14765438 13637945 12624156 11712605 10893242 10151112
55908 10151112 9474453 8859559 8302205 7792503 7322712 6892022 6499193 6138066 5804263
55899 5804263 5498727 5220485 4963006 4721547 4497377 4291067 4098282 3915826 3745536
55890 3745536 3588537 3441627 3302734 3174002 3056129 2945391 2839637 2741658 2653339 2571906
55880 2571906 2495275 2425683 2364537 2308807 2256041 2207932 2165166 2123216 2076970 2025516 1969273
55869 1969273 1906886 1838737 1769596 1703934 1641671 1581431 1524392 1471736 1421770 1372973 1326960
55858 1326960 1285502 1247495 1211652 1179227 1151295 1126209 1102395 1080867 1062342 1044683 1025846
55847 1025846 1006687 988399 969875 950139 930584 912180 893117 871881 850202 830346 811885
55836 811885 793738 776950 762701 749779 736737 724589 714848 706801 699192 692611 687756 683228 677562
55823 677562 671693 666934 662185 655621 647612 639604 631570 622922 614694 608493 604313 601204 598999 597693
55809 597693 596469 595043 594706 596417 599264 602286 606237 611971 618710 625503 632687 640153 645912 648286
55795 648286 647933 645901 641340 633033 621635 608483 593689 577427 561572 548010 536639 526912 519824
55782 519824 516195 514350 511703 507583 502562 496323 488557 481007 476335 475451 477695 482837 491117 502064
55768 502064 514897 529052 542626 551419 551643 543172 528737 510933 491506 472249 454391 437661
55756 437661 421559 406867 394427 383567 373463 364964 359169 355134 350986 346494 342611 339256 335619
55743 335619 332042 329548 327941 326233 324482 323420 322681 321217 319112 317262 315630 313505 311120 309330
55729 309330 307959 305994 303140 299756 295752 291038 286539 283135 280107 276286 272288 269830 269154 268888 268279
55714 268279 267865 268078 268883 270817 274827 280875 287888 294975 301640 307129 310839 313024 313883 312524 308255
55699 308255 302312 296632 291298 284902 277155 269410 262755 257286 253213 250906 249793 248791 248021 248640 250906
55684 250906 253874 257024 260713 264910 269025 273208 278363 284563 290681 295771 299531 301355 300461 297382
55670 297382 293975 291461 289469 287297 284980 282802 280874 279563 279325 279811 280099 280079 280700 282547 285085 287516
55654 287516 289535 291034 291913 292406 292849 292980 292124 290078 287051 282878 277194 270290 262961 255564 248140
55639 248140 241235 235544 230803 226062 221043 216243 211856 207713 204163 201806 200275 198539 196526 195284
55625 195284 195290 195763 195871 195562 194892 193522 191208 188051 184168 179908 176297 174223 173152 171723 169615 167736
55609 167736 166572 165654 164751 164243 163973 163105 161588 160586 160819 161518 161604 160964 159964 158604 156787 154684 152345
55592 152345 149651 147031 145464 145283 145660 145683 145327 145073 145199 145809 146915 148201 149231 150009 150752 151238 151266
55575 151266 151666 153695 157190 160492 162589 164271 166689 169828 173041 176161 179309 182251 184627 186310
55561 186310 187156 186952 185984 184982 184115 182727 180401 177593 174794 171866 168702 165836 163835 162683 162278
55546 162278 162933 164773 167144 169164 170600 171873 173511 175779 178393 180452 181191 180957 180802 181032 180939 180087
55530 180087 178928 177740 175956 173149 169911 167031 164456 161680 158747 156128 153934 151773 149225 146198
55516 146198 143101 140747 139627 139076 137747 135093 131823 128755 125997 123521 121700 120707 119959 118743 116991
55501 116991 115140 113638 112863 113031 113873 114837 115688 116386 116499 115658 114623 114780 116250 117619 118031 118374 119703
55484 119703 121549 122773 123164 123188 122918 122306 121932 122345 123018 122993 122354 122103 122728 123768 124643 125081 124759 123362
55466 123362 121093 118583 116221 114028 112131 110877 110406 110485 110737 110818 110516 109999 109821 110405 111600 112936 114092
55449 114092 114914 115307 115374 115421 115604 115822 116083 116535 116935 116665 115652 114827 115234 116982 119380 121668 123301 123996
55431 123996 124006 124014 124322 124405 123577 121805 119607 117597 116347 116153 116587 116828 116771 117193 118379 119377 119329 118843 119137
55412 119137 120278 121246 121502 121472 121555 121555 121224 120657 119936 118954 117802 116845 116231 115676 114919 114121 113621 113478 113424 113270
55392 113270 113207 113544 114068 113990 112899 111595 111402 112679 114568 116182 117332 117954 117719 116661 115536 114955 114735
55375 114735 114510 114384 114446 114288 113648 113018 112919 113036 112825 112550 112896 113804 114481 114501 114186 113924 113733 113578 113627 114009
55355 114009 114545 114784 114274 113051 111902 111718 112444 113168 113453 113882 114910 115851 115668 114264 112394 110771 109874
55338 109874 110120 111486 113228 114553 115336 115743 115669 115115 114568 114288 113758 112547 111233 110633 110589 110356 109733 108932
55320 108932 107803 106286 105217 105446 106371 106553 105762 105224 105785 106958 107923 108392 108244 107375 106314 106023 106641
55303 106641 107251 107234 107086 107521 108504 109609 110660 111545 111994 112037 112199 112828 113544 113667 112848 111204 109329 108263
55285 108263 108806 110574 112301 113245 113751 114217 114302 113606 112451 111444 110716 110129 109795 109833 109958 109828 109587 109588 109840
55266 109840 110126 110463 111024 111743 112394 112927 113416 113787 113905 113831 113756 113800 114062 114714 115723 116633 116977 116901 117072 117904
55246 117904 119055 119833 119944 119672 119348 118857 117866 116418 114974 113887 113154 112856 113342 114611 115917 116453 116232
55229 116232 115765 115162 114248 113406 113408 114243 114856 114448 113371 112352 111434 110334 109399 109364 110237 111120 111305 111070 111097
55210 111097 111514 111914 112121 112456 113198 114182 115168 116214 117290 117774 116968 115152 113502 112758 112499 112072 111682
55193 111682 112038 113289 114864 116157 116821 116679 115887 115098 114921 115234 115445 115318 115055 114732 114236 113723 113593 113935
55175 113935 114447 114944 115510 116130 116655 117146 117851 118804 119807 120745 121521 121814 121432 120807 120534 120475 120005 119172 118849
55156 118849 119482 120428 120928 121188 121996 123607 125434 126677 126975 126578 126029 125601 125033 124030 122919 122442 122921
55139 122921 123989 125107 125938 126225 125810 124877 123824 122844 121969 121383 121200 121049 120483 119733 119364 119242 118683 117737
55121 117737 117388 118112 119075 119315 119039 119086 119648 120188 120366 120487 121143 122714 124989 127071 128036 127914 127643 127837
55103 127837 128153 128195 128434 129585 131440 132983 133537 133261 132636 131950 131356 131082 131368 132171 132954 132950 131978 130863
55085 130863 130600 131136 131528 131354 131272 131976 133287 134643 135866 136926 137505 137359 136796 136346 136257 136622 137583 138952
55067 138952 140040 140307 139854 139001 137895 136878 136577 136992 137095 136066 134476 133511 133459 133757 134078 134338 133956
55050 133956 132292 129848 127978 127174 126570 125408 124119 123512 123643 124074 124680 125600 126728 127841 129047 130604
55034 130604 132280 133309 133114 131944 130699 130123 130167 130200 129840 129422 129525 130271 131352 132549 133855 135046 135568
55017 135568 135073 133923 133008 133025 133913 134933 135374 135217 135030 135263 135849 136557 137293 137872 137918 137444 137179 137754 138729
54998 138729 139039 138441 137930 138524 140067 141532 142212 142266 142218 142193 141803 140718 139215 138024 137637 137987 138755 139672
54980 139672 140379 140450 139869 139249 139147 139402 139529 139569 140096 141382 143025 144345 144819 144267 143060 142136 142287 143315
54962 143315 144298 144733 145030 145809 147174 148841 150577 152165 153304 153829 153869 153571 152878 151813 150800 150384 150729
54945 150729 151621 152848 154235 155335 155465 154379 152737 151583 151326 151471 151479 151572 152381 154033 156055 158147 160524
54928 160524 163440 166928 171203 176682 183208 189793 195779 201831 209027 217205 225042 231687 237401 242265
54914 242265 245112 244422 239954 232996 225177 217449 210030 202823 195743 188919 182734 177617 173712 170797
54900 170797 168503 166555 164794 163141 161642 160547 160120 160186 160042 159114 157757 157066 157804 159793 162500 165833
54884 165833 170021 175019 180487 186271 192498 199233 206375 213811 221377 228657 235117 240448 244502 246983
54870 246983 247446 245610 241448 235126 227189 218686 210614 203206 196096 189110 182503 176446 170872 165973
54856 165973 162316 160162 159012 158098 156995 155518 153439 150815 148342 146838 146306 145826 144519 142370 140066
54841 140066 138225 136976 136153 135573 135013 134168 132949 131832 131528 132171 133088 133573 133635 133738 134128 134806 135895
54824 135895 137439 138915 139526 139078 138109 137098 136102 135292 135190 135992 137145 138070 138889 139931 140883 141104 140645
54807 140645 140298 140575 141221 141871 142608 143559 144417 144844 145091 145703 146718 147637 148232 148890 149912 150866 151010 150186
54789 150186 149008 148328 148754 150440 152839 154812 155498 155251 155291 156399 158379 160864 163920 167460 170753 173192
54773 173192 175252 178062 182243 187658 194041 201122 208320 215083 221645 228719 236169 242605 246635 248063
54759 248063 247550 245556 242069 237056 230738 223535 216008 208724 201899 195318 188869 183033 178537 175547
54745 175547 173435 171392 169173 167211 166063 165804 165990 166203 166455 166941 167576 168108 168625 169596 171349 173772
54729 173772 176624 179868 183610 188005 193275 199512 206330 212999 219109 224793 230126 234616 237578 238729
54715 238729 238116 235666 231252 225117 217905 210247 202582 195306 188768 183008 177796 173022 168928 165833
54701 165833 163795 162637 162154 162097 162056 161574 160453 158835 156894 154596 151957 149437 147789 147373 147760 148156
54685 148156 148066 147484 146645 145880 145518 145618 145792 145604 145150 144947 145225 145616 145715 145656 145890 146544 147243 147510 147159 146280
54665 146280 145042 143685 142660 142533 143485 144951 146063 146514 146725 146973 146767 145515 143593 142156 141843 142199
54649 142199 142551 142953 143862 145192 146217 146438 146144 145999 146253 146567 146476 145831 144791 143686 143020 143351 144765
54632 144765 146492 147468 147369 146814 146420 146094 145450 144497 143532 142698 142076 141930 142414 143196 143884 144597 145701 147107
54614 147107 148382 149415 150433 151416 152054 152278 152289 152080 151488 150722 150256 150116 149823 149189 148666 148743 149425 150333
54596 150333 150897 150472 148923 147114 146213 146441 147122 147945 149262 151038 152514 153321 153960 154654 154673 153568 152223
54579 152223 151771 152057 152090 151552 150921 150485 150186 150140 150399 150369 149425 148054 147485 148120 149111 149576 149464 149128 148846
54560 148846 149011 150048 151794 153446 154441 154880 154896 154228 152868 151642 151535 152601 153950 154769 155039 155260 155795
54543 155795 156632 157690 159126 161132 163452 165406 166529 166990 167203 167312 167341 167548 168217 169197 170045 170477 170373
54526 170373 169575 168188 166911 166453 166632 166570 165833 164787 163776 162612 161127 159675 158747 158436 158531 158791 158852
54509 158852 158304 157205 156248 156056 156538 157163 157619 157924 158179 158565 159298 160226 160636 159913 158367 157075 156812 157334
54491 157334 157690 157104 155664 154314 154083 155098 156465 157251 157399 157435 157567 157515 157170 156847 156762 156719 156569 156687 157642
54472 157642 159567 162088 164706 166966 168499 169301 169946 171124 172847 174416 175226 175314 175052 174697 174448 174559
54456 174559 174993 175178 174535 173189 171867 171172 171175 171559 171764 171181 169717 168205 167726 168429 169383 169720 169450 169069
54438 169069 168861 168809 168726 168205 166874 165018 163527 162823 162254 160999 159246 157936 157620 158159 159344 161174 163469
54421 163469 165749 167653 169126 170173 170730 170849 170729 170485 170121 169760 169692 170113 170918 171681 171876 171390 170941 171555
54403 171555 173346 175163 175924 175918 176259 177370 178726 179940 181288 182999 184731 185989 186628 186790 186733 186851 187399
54386 187399 188112 188493 188507 188522 188556 188234 187592 187241 187461 187795 187907 188208 189093 190130 190657 190864 191619 193366 195769
54367 195769 198393 201230 204478 208108 211744 214817 216934 218239 219243 220142 220503 219792 217959 215261 211878
54352 211878 208130 204809 202712 201817 201312 200475 199235 197927 196823 195929 194952 193484 191491 189530 188173
54337 188173 187304 186385 185358 184723 184638 184481 183617 182223 180959 180159 179719 179591 179872 180468 181064 181505 181911 182364
54319 182364 182717 182845 182844 182879 182974 183026 182836 182140 180867 179450 178588 178519 178805 179006 179224 179596 179690 179004 177992 177829
54299 177829 179032 180830 182140 182668 182783 182829 183001 183508 184344 185087 185359 185334 185442 185760 186093 186443 186928 187380
54281 187380 187556 187742 188632 190435 192482 193857 194148 193572 192690 192113 192179 192749 193384 193728 193609 192946 191892 190902
54263 190902 190336 190029 189640 189317 189561 190445 191499 192427 193497 195041 197006 199113 201072 202446 202777 202104
54247 202104 201049 200116 199188 197933 196448 195247 194774 195065 195682 195921 195397 194564 194336 195064 196215 197198 198039
54230 198039 198975 199776 199930 199301 198253 197299 196882 197389 198964 201259 203535 205070 205578 205327 204866 204493 204024
54213 204024 203205 202124 200863 199074 196556 194112 193020 193431 194082 193802 192622 191092 189432 187963 187501
54198 187501 188422 189785 190270 189655 188688 187852 187140 186791 187286 188580 190070 191362 192449 193236 193614 193935 194723
54181 194723 195812 196566 196974 197726 199019 200090 200280 199852 199375 199000 198747 198878 199369 199494 198582 196878 195117
54164 195117 193528 191917 190508 189987 190575 191583 192042 191533 190316 189014 188283 188506 189545 190823 191706 191817
54148 191817 191079 189672 187969 186359 185057 184121 183637 183684 184094 184510 184847 185542 187041 189098 190927 192073
54132 192073 192832 193591 194167 194189 193900 193973 194577 195210 195617 196268 197653 199599 201665 203672 205392 206210 205895 205393
54114 205393 206002 207790 209581 210560 211121 211992 213304 214917 216961 219555 222445 225396 228559 232006 235303
54099 235303 238078 240629 243340 245673 246519 245523 243446 241120 238607 235618 232250 228958 226098 223849 222387
54084 222387 221805 221983 222788 224327 226762 229862 232945 235321 236775 237657 238561 239835 241248 242186 242254 241662
54068 241662 240959 240499 240278 240143 239929 239439 238609 237685 236977 236356 235327 233783 232428 232138 233078 234679 236383
54051 236383 238110 240005 242089 244244 246391 248610 251188 254500 258664 263311 267888 272190 276422 280839
54037 280839 285576 290781 296607 303050 310056 317730 326138 334913 343446 351478 359059 365875 371203 374817
54023 374817 377422 379839 382146 383998 385414 386743 388118 389382 390309 390491 389298 386493 382734 378930 375205
54008 375205 370905 365481 358854 351115 342567 334076 326634 320377 314567 308747 303321 298749 294776 290912
53994 290912 287198 284009 281342 278847 276387 274156 272310 270830 269742 269136 268929 268823 268571 268121 267514 266833
53978 266833 266244 265882 265613 265073 264076 262899 262019 261567 261249 260901 260923 261913 263927 266408 268888 271455 274413
53961 274413 277866 281923 286971 293349 300905 309270 318333 327914 337028 344082 347987 348720 346828 342931
53947 342931 337925 333084 329452 327314 326523 327019 328666 330879 332954 334802 337013 340146 344112 348203 351528
53932 351528 353545 354500 355411 357332 360466 364052 367221 369850 372571 376106 380769 386512 393187 400640 408674
53917 408674 417087 425737 434485 443167 451767 460540 469688 478946 487813 496212 504548 512908 520642 527030
53903 527030 531975 535581 537449 537066 534776 531657 528317 524367 519229 513007 506368 499999 494252 488856
53889 488856 482712 474492 463856 451866 440019 429197 419663 411437 404093 396637 388362 379820 372370
53876 372370 366670 362058 357491 352610 347644 342733 337785 332857 328201 323820 319306 314355 309290 304737
53862 304737 300848 297226 293644 290438 287869 285500 282698 279546 276724 274514 272474 270165 267651 265120
53848 265120 262537 259968 257855 256571 255992 255779 255868 256330 256978 257470 257680 257676 257449 256956 256371 255992 255895 255861 255707
53829 255707 255586 255956 257231 259365 261748 263676 264934 265795 266511 267105 267691 268562 269773 270954 271774 272358
53813 272358 273034 273967 275254 277127 279739 282970 286662 290823 295363 299913 304244 308669 313697 319443 325710
53798 325710 332472 339869 347753 355554 362652 368744 373932 378634 383276 387870 392019 395398 398029 399937
53784 399937 400932 401038 400762 400473 399748 397845 394701 390950 387016 382659 377479 371436 364760 357714 350573
53769 350573 343596 336898 330494 324473 318960 313971 309507 305729 302787 300515 298469 296214 293406 289852
53755 289852 285770 281871 278797 276533 274668 273088 272094 271864 272129 272328 271882 270520 268608 266944 265883
53740 265883 264964 263826 263069 263501 264783 265736 265962 266191 266890 267468 267334 266901 266919 267388 267800 268056 268437 268971
53722 268971 269479 270216 271820 274537 277819 280849 283201 284979 286463 287732 288644 289201 289795 290861 292357
53707 292357 293965 295773 298256 301443 304646 307317 309727 312412 315422 318603 322195 326561 331514 336527
53693 336527 341396 346101 350166 352859 354129 354713 355191 355478 355390 355096 354691 353866 352449 350913 349845 349140
53677 349140 348217 346884 345521 344473 343746 343353 343512 344267 345217 345931 346430 346986 347575 347858 347715 347527 347766 348454
53659 348454 349147 349370 348956 348065 347065 346422 346520 347433 348825 350142 350996 351418 351749 352248 352825 353202 353338 353634
53641 353634 354638 356551 359009 361393 363404 365339 367709 370515 373113 374940 376172 377389 378759 380055
53627 380055 381413 383477 386560 390217 393984 398059 402769 407767 412403 416669 421140 426018 430798 434925
53613 434925 438311 441216 444042 447235 450881 454393 457124 459279 461657 464470 467139 469453 472086 475515
53599 475515 479083 481742 483241 483984 484138 483603 482641 481838 481415 481049 480354 479195 477627 475906 474438 473324
53583 473324 472070 470115 467577 465087 463013 461269 459719 458296 456768 454896 452833 450890 448957 446693
53569 446693 444352 442809 442525 442966 443324 443393 443433 443562 443651 443634 443596 443655 443894 444300 444717 445126 445981 447861 450597
53550 450597 453166 454734 455452 455935 456327 456402 456316 456691 457988 460211 463224 466986 471403 476238 481276 486382
53534 486382 491443 496460 501630 507145 513015 519341 526563 535022 544347 553778 563105 572842 583403 594632
53520 594632 606330 618700 631908 645633 659592 674180 690082 707361 725436 743932 763084
53509 763084 783237 804326 826041 848241 871025 894469 918357 942040 964667 985725 1005349
53498 1005349 1023960 1041764 1058909 1075922 1093353 1110887 1127399 1142288 1156359 1170967 1186560
53487 1186560 1202552 1218468 1234597 1251430 1268931 1286577 1303862 1320489 1336258 1351031 1364866
53476 1364866 1378018 1390713 1402841 1413901 1423275 1430575 1435654 1438352 1438500 1436259 1432200 1426798 1419987
53463 1419987 1411489 1401423 1390307 1378587 1366587 1354866 1344045 1333998 1323591 1311597 1297753
53452 1297753 1282692 1267076 1251147 1234983 1218734 1202494 1186196 1169802 1153463 1137382 1121681
53441 1121681 1106610 1092864 1081442 1073017 1067417 1063828 1061520 1060254 1059934 1060096 1060084 1059776 1059829 1061059 1063771
53426 1063771 1067870 1073302 1079955 1087261 1094492 1101748 1110240 1121180 1134542 1149286 1164717 1181123 1199013
53413 1199013 1218250 1238311 1259086 1280983 1304349 1329215 1355507 1383073 1411531 1440585 1470647
53402 1470647 1502659 1537021 1573102 1610204 1648645 1689364 1732604 1777481 1822896 1868469 1914524
53391 1914524 1961519 2009607 2058501 2107608 2156420 2204765 2252544 2299347 2344655 2388346 2430527
53380 2430527 2470762 2507946 2541254 2570952 2597876 2622254 2643357 2660309 2672911 2681569 2686571 2687642
53368 2687642 2684200 2675828 2662374 2643690 2619613 2590361 2556736 2519699 2479959 2438119 2395022 2351566
53356 2351566 2308297 2265498 2223519 2182578 2142366 2102454 2063139 2025404 1989894 1956415 1924439
53345 1924439 1893481 1862790 1831426 1799158 1766808 1735235 1704447 1674246 1645243 1618434 1594033
53334 1594033 1571456 1550411 1531324 1514650 1500362 1488201 1477826 1468471 1458888 1447940 1435070 1420257
53322 1420257 1403870 1386670 1369479 1352669 1336197 1320242 1305353 1291806 1279216 1267093 1255551
53311 1255551 1245200 1236547 1229700 1224462 1220498 1217516 1215518 1214758 1215381 1217257 1220308 1224732 1230704 1238109
53297 1238109 1246866 1257295 1269827 1284361 1300289 1317181 1335179 1354609 1375363 1396808 1418239
53286 1418239 1439324 1460127 1480666 1500498 1518824 1535009 1548835 1560204 1568866 1574647 1577751 1578562
53274 1578562 1577217 1573719 1568373 1561686 1553723 1543903 1531648 1516989 1500374 1482158 1462594 1442086
53262 1442086 1421051 1399524 1377194 1353875 1329739 1305146 1280513 1256271 1232579 1209071 1185306
53251 1185306 1161612 1139067 1118351 1098925 1079690 1060183 1040728 1021600 1002574 983299 963663
53240 963663 943711 923604 903835 885148 868038 852478 838258 825341 813754 803354 793852 784979
53228 784979 776515 768322 760370 752496 744157 734754 724325 713504 702570 690903 677739 663102 647593
53215 647593 631504 614758 597676 581170 565982 552130 539350 527703 517417 508351 500004 492057
53203 492057 484613 477828 471474 464986 457910 450200 442125 433967 425801 417488 408850 399915 391065 382835
53189 382835 375491 368890 362825 357348 352529 348115 343781 339662 336221 333484 330890 328015 325097 322534
53175 322534 320273 318048 315962 314369 313309 312435 311471 310424 309388 308447 307766 307521 307684 307992 308086 307583 306196
53158 306196 304049 301740 299872 298620 297914 297764 298065 298300 297887 296775 295333 293766 292076 290512 289488
53143 289488 288981 288476 287615 286525 285423 284378 283645 283799 285219 287710 290775 293949 296707 298470 299070 298980
53127 298980 298827 298915 299365 300364 301884 303425 304498 305249 306244 307705 309351 310917 312489 314193 315856 317099
53111 317099 317654 317557 317128 316789 316730 316727 316334 315256 313469 311091 308311 305438 302857 300845 299407 298308 297256
53094 297256 296150 295230 294854 295010 295136 294602 293327 291809 290571 289803 289526 289834 290741 291938 292960 293557 293744
53077 293744 293528 292853 291905 291159 290891 290809 290453 289851 289451 289443 289576 289685 289938 290305 290245 289354 288057 287163 286828 286431
53057 286431 285521 284446 283911 284213 285103 286164 287153 288081 289115 290400 291909 293463 294844 295859 296415 296608
53041 296608 296611 296422 295901 295173 294676 294606 294587 294238 293793 293748 294063 294210 293908 293372 292915 292765 293195 294269 295460 296047
53021 296047 296051 296239 297115 298372 299519 300500 301436 302194 302489 302130 301034 299385 297889 297362 297871 298733 299502 300373
53003 300373 301391 301999 301855 301499 301620 302121 302492 302699 303115 303899 305119 307104 309973 313029 315387 317114
52987 317114 319044 321530 324063 326116 327671 328797 329450 329928 330861 332380 333748 334209 333820 333133 332401 331592
52971 331592 330978 331144 332304 333928 335261 336106 336932 338237 340015 341915 343684 345179 346137 346400 346383 346767
52955 346767 347510 347657 346460 344221 341578 338522 334782 330847 327685 325559 323877 322289 321141 320665 320465
52940 320465 320206 320165 320646 321261 321353 320882 320418 320366 320548 320503 319935 318883 317638 316504 315570 314743 313989 313437 313259
52921 313259 313582 314395 315291 315447 314344 312549 311269 310947 310821 310180 309467 309612 310630 311609 312011 312284 313044
52904 313044 314184 315109 315520 315587 315547 315455 315336 315281 315320 315395 315591 316247 317621 319463 321067 321778 321385 320067 318235
52885 318235 316456 315263 314796 314720 314612 314267 313623 312738 312114 312629 314584 316980 318384 318566 318746 320092 322577
52868 322577 325577 328967 332989 337301 340860 342872 343473 343392 343252 343278 343333 342961 341529 338707 334896 331035
52852 331035 327804 325058 322176 318927 315768 313158 310847 308160 304924 301776 299392 297638 295680 292881
52838 292881 289493 286512 284907 284970 286251 287988 289499 290277 290055 289012 287804 287112 287142 287597 288030 288086 287593
52821 287593 286714 285926 285561 285415 285102 284763 285016 286178 287844 289396 290606 291551 292219 292532 292668 293075 294036
52804 294036 295266 296068 295965 295207 294491 294142 293729 292663 290971 289235 287960 287303 287232 287514 287618 287103 286137
52787 286137 285233 284520 283750 283021 282905 283622 284632 285338 285754 286158 286520 286715 286938 287433 288027 288348 288392 288470 288693
52768 288693 288876 288868 288665 288212 287425 286424 285550 285120 285259 285896 286743 287357 287427 287036 286563 286395 286754 287665 288947
52749 288947 290325 291623 292771 293676 294331 295084 296488 298707 301292 303698 305807 307822 309918 312138 314332
52734 314332 316041 316806 316855 317128 318268 319882 321174 322021 322950 324195 325330 325832 325593 324771 323469 321706
52718 321706 319603 317519 315966 315205 314851 314147 312806 311365 310466 310096 309867 309737 309973 310548 311049 311204 311139
52701 311139 311100 311191 311338 311327 311009 310655 310861 311759 312608 312600 311821 310910 310073 309109 308271 308236 309093 310046 310422 310377 310366
52680 310366 310429 310359 310121 309733 309052 308013 306799 305530 304137 302823 302241 302750 303746 304200 303756 302925 302317 302090
52662 302090 302173 302581 303349 304382 305605 307137 309138 311487 313781 315798 317891 320706 324409 328345 331555
52647 331555 333513 334273 334135 333446 332574 331715 330803 329829 329096 328818 328605 327849 326596 325545 325131 325114 325203 325572
52629 325572 326534 328188 330605 333860 337506 340422 341685 341339 340022 338160 335890 333418 330908 328250 325446
52614 325446 323082 321887 321851 322235 322452 322437 322221 321721 321171 321198 322114 323384 324174 324250 324033 323880 323701 323302 322794
52595 322794 322442 322282 322120 321898 321828 322102 322658 323385 324377 325723 327146 328210 328873 329532 330395 331199 331726 332239
52577 332239 333098 334124 334716 334453 333297 331355 328866 326392 324596 323675 323260 322969 322730 322431 321665 320267
52561 320267 318974 318950 320449 322271 322958 322388 321758 321976 322596 322653 322090 321726 321987 322337 322156 321572 321097 320836
52543 320836 320552 320265 320360 321076 322160 322990 322922 321740 320054 319046 319443 320774 321922 322316 322229 322043 321765 321421
52525 321421 321435 322201 323506 324717 325524 326273 327534 329550 332147 335046 338117 341405 345031 349106 353595
52510 353595 358217 362550 366329 369562 372248 374084 374603 373447 370379 365335 358933 352713 348103 344978
52496 344978 341872 337901 333847 330942 329265 328051 327068 326780 327303 328050 328461 328358 327587 326102 324585 324180
52480 324180 325162 326490 327061 326975 327135 328136 330020 332686 335848 338853 341234 343388 346195 349913 353930
52465 353930 357650 361077 364405 367455 369891 371695 373068 373951 373978 372928 370965 368348 365124 361347 357413
52450 357413 353851 350698 347459 343903 340603 338304 336958 335838 334587 333541 332954 332468 331727 331018 330848
52435 330848 331167 331488 331521 331240 330523 329309 328041 327323 327091 326635 325637 324621 324201 324375 324975 326272 328516
52418 328516 331147 333098 333962 334374 335129 336362 337760 339200 340857 342927 345583 349170 354112 360574 368331
52403 368331 377012 386336 396104 405988 415264 422693 426838 426904 423425 417971 411992 405983 399799 393546 387934
52388 387934 383755 381159 379514 377960 376195 374752 374401 375228 376465 377395 378208 379711 382302 385601 389064
52373 389064 392564 396281 400383 404998 410143 415372 419756 422602 424074 424796 424976 424352 422916 421228 419853
52358 419853 418871 418151 417745 417723 417875 417963 418102 418545 419179 419679 420171 421263 423249 425693 428115 430738 434119
52341 434119 438242 442462 446352 450094 453966 457950 462106 466968 473157 480766 489484 499231 510344 523101
52327 523101 537263 552116 566884 581264 595717 611072 627576 644433 660563 675687 690394
52316 690394 705330 720822 737282 755335 775321 797002 819954 843889 868410 892936 917257
52305 917257 941792 966912 992284 1017376 1042361 1067871 1093856 1119235 1142816 1164122 1183123
52294 1183123 1199578 1213065 1223457 1231006 1235935 1238294 1238333 1236815 1234655 1232174 1228925 1224372 1218573 1211961
52280 1211961 1204629 1196358 1187457 1179106 1172468 1167718 1164259 1161636 1159792 1158654 1158053 1158224 1159871 1163502
52266 1163502 1168908 1175517 1183044 1191669 1201721 1213358 1226505 1240960 1256596 1273403 1291338 1310220
52254 1310220 1329916 1350464 1371762 1393189 1413749 1432546 1448897 1462183 1472071 1478980 1483860 1487285
52242 1487285 1489000 1488481 1485645 1480877 1474645 1467293 1458957 1449446 1438448 1426001 1412545 1398402 1383518
52229 1383518 1367923 1352078 1336423 1320868 1305100 1289170 1273413 1257964 1242822 1228319 1215072
52218 1215072 1203412 1193125 1183794 1175127 1167025 1159663 1153502 1148926 1145841 1143887 1143026 1143543 1145425 1148114
52204 1148114 1151054 1154171 1157625 1161279 1164685 1167542 1170094 1173087 1177325 1183108 1190055 1197569 1205426 1213732
52190 1213732 1222377 1230823 1238411 1244625 1249033 1251312 1251453 1249641 1245859 1239945 1232222 1223622 1214896 1206035
52176 1206035 1196880 1187983 1180291 1174023 1168417 1162691 1156846 1151365 1146560 1142575 1139801 1138837 1139940 1142682
52162 1142682 1146269 1150153 1154241 1158529 1162678 1166095 1168410 1169686 1170066 1169437 1167761 1165675 1164420 1164937 1167130
52147 1167130 1170126 1173140 1175976 1178786 1181629 1184421 1187133 1189887 1192736 1195469 1197729 1199345 1200556 1201928
52133 1201928 1204160 1207873 1213376 1220521 1228890 1238340 1249322 1262556 1278418 1296727 1317078 1339114
52121 1339114 1362429 1386485 1410923 1435887 1461760 1488519 1515476 1541759 1566952 1591148 1614511
52110 1614511 1636953 1658285 1678520 1697936 1716850 1735468 1754006 1772873 1792561 1813167 1834024
52099 1834024 1853918 1871799 1887237 1900155 1910252 1916880 1919459 1917753 1911675 1901104 1886272 1868209
52087 1868209 1848505 1828370 1808018 1787064 1765420 1743669 1722624 1702780 1684282 1667229 1651696
52076 1651696 1637461 1624071 1611457 1600338 1591676 1585791 1582303 1580920 1581882 1585475 1591571 1599955 1610737
52063 1610737 1623936 1638858 1654409 1670076 1686220 1703394 1721748 1741122 1761235 1781564 1801376
52052 1801376 1820026 1837014 1851652 1863106 1871068 1876046 1878633 1878653 1875381 1868465 1858332 1845748 1831370
52039 1831370 1815786 1799666 1783575 1767587 1751194 1733715 1714990 1695636 1676494 1657855 1639369
52028 1639369 1620659 1601649 1582329 1562640 1542781 1523147 1503660 1483636 1462753 1441830 1422105
52017 1422105 1404003 1387097 1371066 1355962 1341618 1327516 1313436 1299702 1286600 1273971 1261423
52006 1261423 1248448 1234209 1217862 1199422 1179831 1159846 1139386 1118326 1097396 1077754 1060026
51995 1060026 1044331 1030791 1019209 1008398 996741 983646 969869 956177 942222 927026 910146
51984 910146 892019 873497 855343 837912 820936 803759 786108 768557 751959 736558 721965
51973 721965 707959 694970 683801 675170 669561 667085 667287 669414 673138 678802 686634 695881 705070 713006
51959 713006 719076 722745 723423 721139 716814 711411 705079 697617 689523 682045 676248 672568 671227 672428
51945 672428 675925 680967 687114 694797 704737 717064 731328 747070 763893 781184 798359 815403
51933 815403 832722 850273 867196 882430 895300 905275 911355 912064 906049 892670 872238 845964
51921 845964 815661 783276 750588 719216 690616 665712 644507 626292 610472 597155 586834
51910 586834 579541 574542 571000 568836 568678 570908 574937 579580 584007 588182 592451 596916 601107 604011
51896 604011 604379 601293 594684 585265 573955 561479 548508 535877 524353 514343 506012 499571 495143
51883 495143 492449 491052 491005 492913 497086 502919 509442 516424 524556 534473 545768 557071 566935 574595
51869 574595 580059 583657 585488 585257 582684 578111 572634 567606 563969 561936 561073 560749 560764 561609 563858 567221
51853 567221 570495 572661 573691 574035 573650 572002 568791 564091 557859 549952 540761 531284 522289 513840 505915
51838 505915 498973 493473 489199 485603 482654 480833 480419 481232 483000 485408 487779 489266 489631 489377 488857
51823 488857 487642 485180 481804 478609 476408 475152 474353 473659 472987 472469 472470 473377 475128 477133 478847 480212
51807 480212 481258 481593 480780 479172 477739 476933 476238 475188 474283 474422 475831 478204 481532 485861 490212 492748
51791 492748 492520 490425 487954 485576 482927 480086 477717 476103 474841 473639 472807 472714 473239 474069 475180 476799
51775 476799 479114 482274 486443 491626 497532 503845 510613 518284 527301 537567 548143 557532 564554 569028
51761 569028 571481 572234 571043 567645 562233 555158 546481 536208 524863 513534 503297 494710 487769
51748 487769 482170 477598 473854 470783 468139 465714 463674 462536 462682 464017 466292 469577 474093 479659
51734 479659 485655 491655 497815 504410 511104 516861 520641 522152 521968 520974 519763 518609 517979 518700 521225
51719 521225 524696 527162 527111 524763 521628 518938 516817 514879 513059 511488 509879 507598 504376 500628 496984
51704 496984 493909 491914 491754 493952 498125 503051 507455 510559 511948 511292 508545 504380 500173 497275 496232
51689 496232 496688 497958 499436 500419 499940 497329 492968 488116 483830 480302 477298 474820 473085 472183 472103 472807
51673 472807 473978 474950 475379 475776 476966 479174 482136 485974 491370 498824 508269 519376 531562 543438
51659 543438 552913 558383 559619 557344 552413 545740 538549 532038 526914 523516 522228 523297 526416 530894
51645 530894 536072 541203 545034 546034 543232 536650 527109 516035 505393 497078 491938 489476 488639 488651
51631 488651 489031 489241 488808 487714 486261 484500 482128 479132 476297 474673 474456 474627 473880 471742 468638 465082
51615 465082 461280 457446 454024 451277 449005 446895 444892 442961 440781 438129 435401 433308 432149 431858
51601 431858 432693 435237 439441 444210 448472 452516 457887 465935 476753 489406 502791 515953 527751
51588 527751 536627 541109 540724 536394 529880 522825 516314 511090 507809 506904 508396 512026 517643 525415 535694
51573 535694 548711 564297 581783 600206 618855 637813 657901 679887 703535 727546 750541
51562 750541 772091 792769 813532 835473 859901 887812 918753 950594 980859 1008052 1031237
51551 1031237 1048740 1058134 1057719 1047478 1028498 1002139 970116 934732 898160 861557 825335 790227
51539 790227 757614 728752 704084 683419 666462 653010 642897 635845 631134 627389 623039 617297
51527 617297 610455 603064 595103 586310 577003 567964 559548 551450 543460 535899 529036 522542 515939 509254
51513 509254 502808 496700 491013 486227 482719 479908 476584 472234 467469 462992 458852 454986 451830 449825
51499 449825 448815 448414 448625 449481 450513 451290 452234 454103 456677 458706 459361 459106 458956 459441 460495 461814
51483 461814 462913 463213 462486 461054 459296 457213 454680 451908 449419 447671 446810 446570 446294 445370 443816 442173
51467 442173 440664 438829 436213 433013 429701 426342 422750 419100 415868 413235 411001 409059 407601 406776
51453 406776 406525 406819 407778 409537 412221 416040 421064 426871 432789 438654 445110 453090 463192 475575
51439 475575 489940 505255 519741 531675 540389 546447 550931 554711 558165 561111 562822 562343 559144
51426 559144 553445 545874 537022 527548 518484 510854 504774 499299 493494 487454 481990 477566 474006 471044
51412 471044 468568 466330 464023 461863 460503 460093 459961 459665 459794 461115 463336 465485 467333 469653 473086
51397 473086 477530 482760 488859 495741 502950 510411 518794 528611 539464 550822 563212 577909 595615
51384 595615 616265 640095 668049 700714 737394 776794 818331 862379 909320 958713 1009270
51373 1009270 1059217 1106462 1148540 1182569 1205567 1215263 1211058 1194178 1166752 1130711 1087638 1039318
51361 1039318 987845 935038 882181 830516 781620 736824 696517 660414 628429 600804 577406
51350 577406 557441 540097 525095 512356 501530 492176 484136 477266 470968 464456 457528 450731 444761
51337 444761 439949 436290 433598 431543 429954 429175 429766 431645 433888 435596 436705 437650 438552 439180 439538 440000
51321 440000 440715 441234 440877 439381 437115 434776 432864 431297 429584 427584 426053 426088 427898 430392 432201
51306 432201 432928 433126 433204 432786 431336 429142 427312 426768 427337 427896 427265 424947 421262 417055 413320 410815
51290 410815 409771 409886 410628 411598 412697 414069 415969 418570 421833 425630 429968 435003 440795 447131 453612
51275 453612 459737 464878 468443 470318 471059 471412 471665 471583 470951 469996 469377 469873 471943 475335 479132 482357
51259 482357 484537 485555 485190 483214 479897 475995 472056 468008 463597 458938 454439 450375 446723 443298
51245 443298 439891 436463 433306 430807 428936 427197 425351 423923 423688 424714 426201 427232 427512 427436 427662
51230 427662 428557 429874 430999 431681 432351 433536 435102 436388 436980 437069 437126 437555 438586 440076 441378 441799 441366
51213 441366 440887 441127 442110 443287 444095 444304 444131 444200 445107 446898 449144 451597 454468 457960 461896 465950
51197 465950 469862 473183 475274 475999 476132 476582 477408 478033 478215 478188 477873 476628 474058 470711 467646 465510
51181 465510 464143 462877 461062 458538 455816 453694 452602 452445 453043 454410 456466 458807 461053 463188 465249
51166 465249 466818 467317 466827 466268 466507 467514 468596 469264 469589 469781 469805 469536 469046 468472 467761 466764 465538 464328
51148 464328 463243 462192 461148 460245 459503 458717 457758 456778 455936 455085 453986 452709 451638 451159 451536 452930
51132 452930 455228 457880 460173 461770 462866 463901 465306 467410 470196 473109 475377 476742 477667 478706
51118 478706 479844 480593 480636 480234 480040 480621 482116 484241 486595 488979 491456 494174 497166 500176 502635 504043
51102 504043 504624 505424 507376 510282 513023 514785 515771 516672 517782 518830 519451 519672 520040 521241 523339 525434
51086 525434 526460 526349 525996 526014 526106 525942 525965 526748 527995 528952 529573 530528 532062 533611 534758 535884 537497
51069 537497 539450 541359 543483 546607 551116 556721 563243 571299 581905 595556 611975 630697 651516
51056 651516 674023 696865 717863 735122 748013 757133 763662 768931 774262 780626 788186 796226 803486
51043 803486 808619 810697 809724 806585 802093 796090 787921 777886 767758 759610 754340 751390 749364 746523
51029 746523 741187 732445 720684 707187 693218 679695 667475 657381 649836 644848 642506 643113 646627
51016 646627 652295 659204 667047 676102 686533 697990 709877 721819 733737 745470 756405 765730
51004 765730 773227 779655 785872 791575 795405 796603 796050 795235 794548 793218 790734 787623 784793 782781 781904
50989 781904 782578 785063 789171 794553 801147 809231 819324 832142 848294 867792 890168 915203 943106
50976 943106 973770 1006370 1040095 1074757 1110281 1146187 1182440 1220412 1262081 1308318 1358819
50965 1358819 1413683 1474026 1540632 1612770 1688865 1767806 1849156 1932509 2017129 2101886 2185061
50954 2185061 2264357 2337480 2402680 2458826 2505412 2542729 2571509 2591999 2603753 2606757 2602366 2592614
50942 2592614 2578922 2562065 2543061 2523226 2503207 2482604 2460752 2437447 2412696 2386318 2358198
50931 2358198 2328725 2298469 2267378 2234558 2198983 2160241 2118391 2073231 2024186 1971233 1915554
50920 1915554 1858640 1800790 1741185 1679698 1618002 1558452 1502318 1449688 1400639 1355682 1315094
50909 1315094 1278488 1245197 1214720 1186724 1160996 1137396 1115591 1095014 1075525 1057935 1043194
50898 1043194 1031020 1019989 1009172 999101 990855 984813 980706 978295 977395 977534 978227 979473 981480 983948
50884 983948 986160 987902 989923 993273 998390 1004972 1012624 1021391 1031694 1043787 1057390 1071963 1087368
50871 1087368 1104101 1122708 1143110 1164747 1187419 1211687 1238371 1267898 1300376 1336079 1375435
50860 1375435 1418590 1465434 1516305 1572324 1634701 1703964 1780247 1864159 1956863 2059311 2171905
50849 2171905 2294931 2428738 2573283 2728040 2892569 3066551 3248799 3436775 3627675
50840 3627675 3819555 4010584 4197419 4375104 4538595 4683841 4807519 4906693 4979266 5024428
50830 5024428 5042559 5035125 5004818 4955300 4890476 4814144 4730351 4643600 4558451 4479005 4408474
50819 4408474 4348477 4298423 4256066 4218890 4184533 4149752 4109893 4060285 3998212 3923219 3835811
50808 3835811 3736271 3624613 3501198 3367358 3225656 3079500 2932173 2786120 2643121 2504942
50798 2504942 2373675 2251513 2140221 2040554 1952028 1873396 1803528 1741832 1687994 1641672 1602473
50787 1602473 1569864 1543018 1521091 1503713 1490712 1481249 1473670 1466558 1459520 1452715 1446096 1439438 1432640
50774 1432640 1425511 1417604 1408711 1399221 1389525 1379357 1368186 1355963 1343007 1329416 1315196 1300756
50762 1300756 1286702 1273165 1259885 1246926 1234841 1224143 1215017 1207573 1201975 1198383 1197072 1198510
50750 1198510 1202910 1209907 1219139 1231012 1246418 1265819 1289240 1316998 1349670 1387276 1429257 1475490
50738 1475490 1526666 1583306 1645063 1711464 1782786 1859638 1941930 2028809 2119415 2213251 2309862
50727 2309862 2408574 2508556 2608821 2708118 2805004 2898108 2986222 3068034 3141774 3205073 3255221
50716 3255221 3289652 3306366 3304206 3283209 3244941 3192290 3128674 3057667 2983484 2911040 2844500
50705 2844500 2785671 2734505 2691169 2656696 2631352 2613309 2599651 2588088 2576867 2563447 2544371
50694 2544371 2516740 2479367 2432356 2376054 2310687 2236889 2156438 2072357 1988059 1906066 1827609
50683 1827609 1753516 1685114 1623833 1570169 1523609 1483647 1450406 1424118 1404455 1390646 1382021
50672 1382021 1378179 1378822 1383716 1392732 1405639 1421804 1440170 1459522 1478767 1497102 1514174 1530082
50660 1530082 1545150 1559594 1573486 1586921 1600094 1613164 1626269 1639812 1654468 1670633 1687883
50649 1687883 1705374 1722893 1741290 1761746 1784871 1810787 1839734 1872116 1908021 1947106 1989034
50638 1989034 2033625 2080524 2129068 2178660 2228899 2279115 2328074 2374533 2417991 2458722 2497337
50627 2497337 2534569 2571251 2607911 2644154 2678388 2707932 2729211 2738366 2732805 2712919 2682405 2646710
50615 2646710 2611004 2579063 2553084 2533745 2520434 2511914 2506995 2504573 2503269 2501464 2497804 2491306 2480781
50602 2480781 2464405 2440210 2407004 2364684 2313906 2255818 2192135 2125039 2056645 1988512 1921629
50591 1921629 1856610 1793772 1733178 1674840 1618919 1565732 1515652 1469054 1426180 1386986 1351202
50580 1351202 1318647 1289373 1263456 1240893 1221820 1206548 1195147 1187184 1182179 1180172 1181538 1186270
50568 1186270 1193790 1203420 1214766 1227648 1241971 1257769 1275111 1293886 1313810 1334670 1356405 1379003
50556 1379003 1402475 1426831 1451809 1476683 1500762 1524203 1548012 1573082 1599362 1626016 1652128
50545 1652128 1677232 1701527 1725845 1751268 1778616 1808336 1840824 1876601 1916106 1959612 2007462
50534 2007462 2060114 2117760 2180050 2246352 2316142 2389158 2465470 2545574 2630212 2719978 2815151
50523 2815151 2915790 3021516 3130982 3241925 3351994 3459409 3562637 3659741 3748194 3825199
50513 3825199 3888125 3935032 3965051 3978062 3973911 3952312 3913688 3859675 3792456 3714053 3626800
50502 3626800 3534151 3440430 3349734 3265394 3190223 3126642 3076428 3040589 3019429 3012472 3018471 3035809
50490 3035809 3062695 3096537 3133219 3167521 3194257 3208802 3206977 3185467 3142796 3079654 2998223
50479 2998223 2901596 2793704 2678954 2561295 2443728 2328723 2218605 2115192 2019438 1931688
50469 1931688 1852014 1780069 1715006 1655905 1602074 1552673 1506558 1463074 1422920 1387649 1358207
50458 1358207 1334281 1315061 1300192 1289821 1284028 1282516 1284764 1290230 1298427 1309012 1322015 1337982
50446 1337982 1357606 1380960 1407148 1435039 1464446 1496253 1531077 1567917 1604247 1637245 1664751
50435 1664751 1685380 1698508 1704566 1705149 1702377 1697885 1692316 1685685 1678149 1670439 1663600 1658401 1655080 1653641
50421 1653641 1654154 1656676 1661095 1667415 1676219 1688582 1705372 1726784 1752608 1782752 1817346 1856502
50409 1856502 1900221 1948380 2000468 2055194 2110649 2165108 2217710 2268296 2316691 2362256 2404023
50398 2404023 2440937 2471867 2495555 2510797 2516670 2512502 2497630 2471418 2433723 2385403 2328292 2264676
50386 2264676 2196864 2127259 2058563 1993465 1933943 1880998 1835251 1797607 1769115 1750184 1740081
50375 1740081 1737262 1740063 1747185 1757757 1770938 1785261 1798205 1806572 1807513 1799359 1781792 1755594 1722246
50362 1722246 1683403 1640493 1594852 1548203 1502636 1459835 1420509 1384738 1352662 1324545 1300360
50351 1300360 1279668 1261902 1246457 1232498 1218901 1204417 1187836 1168197 1145301 1120178 1094784
50340 1094784 1071030 1050077 1032436 1018407 1008196 1001702 998322 997075 997032 997840 999806 1003347 1008350
50327 1008350 1014241 1020628 1027675 1035771 1045036 1055206 1065822 1076420 1086732 1096859 1107140 1117687
50315 1117687 1128130 1137964 1147066 1155634 1163607 1170446 1175700 1179756 1183818 1189098 1196190 1205270 1216585
50302 1216585 1230356 1246311 1263793 1282598 1303431 1327359 1355116 1387309 1425036 1469590 1521054
50291 1521054 1576935 1631810 1678031 1707388 1713661 1695060 1654928 1600154 1538587 1477074 1420541
50280 1420541 1371669 1331026 1297875 1271256 1250534 1235175 1224389 1217231 1212951 1211018 1210773 1211306 1211908
50267 1211908 1212630 1214212 1217340 1222029 1227733 1233973 1240774 1248587 1257866 1268717 1280894 1294115 1308212
50254 1308212 1322859 1337263 1350529 1362401 1373354 1383801 1393538 1402207 1409990 1417439 1424701 1431273
50242 1431273 1436394 1439420 1439830 1437191 1431153 1421471 1408335 1392983 1377732 1364755 1354765 1347145 1341258
50229 1341258 1337115 1334694 1333086 1330517 1324915 1314465 1298176 1276372 1250569 1222692 1194358 1166661
50217 1166661 1140139 1114815 1090599 1067786 1046938 1028295 1011642 996749 983467 971310 959510
50206 959510 947788 936641 926614 917708 909777 902982 897309 891977 885920 878783 871091 863602 856843
50193 856843 851108 846430 842518 838944 835396 831632 827466 823034 818844 815256 812160 809434 807337 805948
50179 805948 804528 802095 798578 794821 791493 788621 786246 784790 784474 784841 785324 785902 786839 788037 789081
50164 789081 789855 790733 792120 794068 796420 799154 802421 806250 810410 814763 819731 826184 834743 845346
50150 845346 857636 871501 886978 903786 921364 939382 958001 977695 999073 1022693 1048574
50139 1048574 1075891 1103573 1131353 1159837 1189506 1220097 1251179 1282875 1315613 1349362 1383446
50128 1383446 1416881 1448551 1477124 1501036 1518603 1528228 1528925 1520927 1505503 1483860 1456498 1424051
50116 1424051 1388411 1352250 1317321 1283783 1251398 1220811 1193264 1169463 1149266 1132232 1117865
50105 1117865 1105303 1093329 1081007 1068107 1054830 1041488 1028630 1017053 1007079 997830 987687 975754
50093 975754 962726 950197 939275 930050 922236 915983 911757 909474 908055 906253 903953 902301 902307 903680
50079 903680 905401 907211 909877 914060 919581 925982 933152 941024 949194 957337 965585 973988 981971 988947
50065 988947 995177 1001310 1007175 1011760 1014514 1016023 1017196 1018301 1019017 1018957 1017890 1015784 1012901 1009577 1005802
50050 1005802 1001395 996675 992485 989277 986692 984420 982976 983097 984747 987389 991102 996824 1005395 1016827
50036 1016827 1030514 1045647 1061292 1076630 1091536 1106759 1123197 1141027 1159663 1178471 1197354
50025 1197354 1216655 1236653 1257202 1277814 1298055 1317856 1337492 1357260 1377137 1396579 1414619
50014 1414619 1430183 1442377 1450509 1454111 1453399 1449823 1445691 1442660 1440485 1437347 1431279 1421042 1405965
50001 1405965 1385686 1360489 1331618 1300877 1269893 1239830 1211553 1185630 1162050 1140287 1119879
49990 1119879 1100899 1083627 1067824 1052555 1036885 1020527 1003725 986720 969641 952727 936221
49979 936221 920006 903798 887936 873496 861248 850816 841312 832581 825202 819355 814307 809256 804142
49966 804142 799317 794884 790760 787092 784077 781520 779067 776869 775547 775448 776382 778334 781964 787950 796049
49951 796049 805256 814829 824655 834533 843600 850899 856244 860086 862669 863787 863442 862143 860245 857385
49937 857385 853059 847583 841872 836216 829790 821620 811672 800641 788986 776681 763918 751522 740462
49924 740462 731189 723674 717916 714005 711758 710635 710235 710741 712597 715796 719754 723917 728254 732923 737709
49909 737709 742210 746568 751636 758210 766378 775776 786208 797627 809706 821853 833700 845159 855938
49896 855938 865417 873219 879545 884614 888012 888984 887228 882985 876402 867287 855682 842340 828403 814791
49882 814791 802057 790532 780221 770605 760938 750932 741018 731850 723751 716795 711272 707672 706033
49869 706033 705544 705159 704615 704628 706006 708861 712848 717856 724108 731712 740560 750657 762110 774683 787752
49854 787752 800894 814117 827198 839128 848751 855922 861589 866698 871322 874946 877190 877931 876870
49841 876870 873301 866508 856424 843973 830740 818176 806974 797077 788194 780237 773349 767664 763106
49828 763106 759444 756574 754734 754303 755290 757182 759485 762354 766520 772616 780690 790328 800975 812055
49814 812055 822976 833179 842246 849939 856201 861115 864808 867414 869145 870251 870789 870458 868799 865597
49800 865597 861128 856165 851715 848387 845697 842151 836335 827923 817530 805900 793626 781398 769908
49787 769908 759494 750343 742967 737844 734533 731910 729577 728334 728773 730092 731017 731423 732204 733847 736153
49772 736153 739380 744643 752647 762611 772896 782338 790607 797629 803222 807248 809763 811099 811939 813076
49758 813076 814725 816167 816399 815017 812110 807413 800253 790656 780074 770485 762802 756517 750810 745540
49744 745540 741058 737510 734802 733046 732562 733318 734722 736182 737655 739488 741878 744820 748498 753373 759732
49729 759732 767294 775380 783353 790793 797474 803477 809324 815772 823342 832212 842574 854790 868842
49716 868842 883792 898211 911192 922549 931856 937804 939021 935402 928226 919000 908606 897597 886742
49703 886742 876968 868974 863161 859820 859091 860731 863899 867111 868587 867154 863098 857902 852964 848753
49689 848753 845318 843150 843042 845321 849770 856254 864866 875246 886279 896926 907385 919207 934217
49676 934217 953310 976108 1001607 1028820 1056502 1082190 1102113 1112876 1113634 1106549 1095143 1082419
49664 1082419 1070409 1060684 1054515 1052500 1054453 1059822 1067820 1076862 1084034 1085675 1079079 1063949 1042342
49651 1042342 1017233 991101 965614 942008 921239 903671 888985 876594 866153 857704 851510 847749
49639 847749 846205 846176 846835 847728 848833 850115 851230 851688 851030 848720 844147 837092 828115 818280 808575 799752
49623 799752 792453 786949 782665 778444 773664 768924 765344 763247 761864 760294 758476 757089 756728 757373 758555
49608 758555 759898 761433 763426 765903 768404 770388 771835 773233 774849 776326 777242 777779 778461 779368 780121
49593 780121 780661 781443 782663 783786 784247 784300 784713 785804 787175 788271 788840 788899 788721 788878 789869 791601 793513
49576 793513 795361 797629 801055 805965 812098 818844 825593 832214 839379 848153 859008 871388 884293
49563 884293 897023 909208 920467 930378 938587 944577 947543 946963 943331 937950 931924 925654 919314 913412
49549 913412 908556 904910 902194 900198 899078 899126 900392 902540 904950 906968 908220 908806 909200 909918 911284
49534 911284 913498 916796 921471 927794 935990 946278 958785 973392 989845 1008143 1028794 1052539
49522 1052539 1079725 1109833 1141377 1172094 1199313 1220613 1234622 1241558 1243176 1242032 1240442 1239751
49510 1239751 1240444 1242826 1247335 1253942 1261328 1267027 1268534 1264309 1253872 1237452 1215858 1190583 1163606
49497 1163606 1136848 1111723 1089046 1069170 1052088 1037482 1024866 1013895 1004589 997111 991271 986422
49485 986422 982048 978292 975604 974007 973127 972950 973984 976370 979281 981677 983439 985265 987549 989893 991788
49470 991788 993290 994795 996587 998919 1002255 1006921 1012593 1018449 1023894 1028883 1033528 1037710 1041218 1044025
49456 1044025 1046182 1047583 1048040 1047529 1046106 1043620 1039798 1034770 1029322 1024480 1020879 1018598 1017443 1017195 1017686
49441 1017686 1018870 1020902 1024111 1028830 1035229 1043192 1052305 1062118 1072532 1083803 1096108 1109293 1123240
49428 1123240 1138196 1154407 1171681 1189819 1209393 1231520 1256742 1284645 1314633 1346166 1377427
49417 1377427 1404139 1420865 1424162 1414650 1396280 1374009 1351993 1333111 1319218 1311369 1309803 1313928
49405 1313928 1322633 1334806 1349556 1365972 1382966 1399632 1415732 1431532 1447128 1462133 1476049
49394 1476049 1488768 1500521 1511381 1520910 1528308 1532841 1534117 1532030 1526668 1518375 1507742 1495171 1480528
49381 1480528 1463647 1445309 1427252 1410934 1396619 1384003 1373236 1364748 1358391 1353559 1350192 1348901
49369 1348901 1349942 1352662 1356211 1360168 1364074 1366956 1367946 1367085 1364989 1361866 1357392 1351412 1344208 1336049
49355 1336049 1326995 1317319 1307704 1298807 1290871 1283926 1278133 1273685 1270547 1268491 1267386 1267289 1268202 1269794 1271353
49340 1271353 1272085 1271613 1270207 1268311 1265743 1261537 1254873 1246178 1237093 1229281 1223373 1219164 1216617 1216313 1218874
49325 1218874 1224258 1231997 1242028 1255033 1271828 1292533 1316236 1341088 1364542 1383759 1396318 1400931
49313 1400931 1397774 1388373 1375049 1360004 1344409 1328289 1311309 1293604 1275832 1258755 1243114 1229676
49301 1229676 1218926 1210697 1204419 1199816 1197107 1196541 1198085 1201512 1206311 1211351 1215182 1217120 1217774 1218173
49287 1218173 1218552 1218304 1216827 1213890 1209303 1202931 1195298 1187778 1181770 1177780 1175460 1174391 1174595 1176254 1179181
49272 1179181 1182784 1186618 1190780 1195510 1200442 1204630 1207464 1209196 1210182 1209943 1207608 1203215 1198003 1193340
49258 1193340 1189938 1188263 1189116 1193400 1201715 1214480 1231901 1253208 1276256 1298498 1318184 1334178
49246 1334178 1345071 1349472 1347209 1339423 1327270 1311298 1292452 1272813 1254566 1238632 1224886 1213388
49234 1213388 1204660 1198918 1195832 1195188 1197148 1201561 1207475 1213693 1219606 1225201 1230579 1235819 1241212 1247140
49220 1247140 1253631 1260301 1266872 1273609 1281055 1289498 1298871 1309037 1319830 1330773 1341144 1350648 1359833
49207 1359833 1369652 1380705 1393195 1407390 1423551 1441343 1459767 1477981 1495930 1514030 1532512
49196 1532512 1551277 1570020 1588145 1604815 1619461 1632211 1643615 1654156 1664177 1673890 1683089 1691214
49184 1691214 1698242 1705246 1713453 1722995 1733389 1745121 1759768 1778299 1800218 1824972 1853428 1887230
49172 1887230 1927202 1973145 2024734 2081357 2140720 2198277 2248541 2287026 2311381 2321777 2320896 2313206
49160 2313206 2303339 2294415 2287535 2282506 2278903 2276565 2275406 2275122 2275352 2276124 2277911 2281088 2285538 2291017 2297793
49145 2297793 2306621 2318019 2331780 2347215 2363684 2380825 2398432 2416309 2434353 2452769 2472075
49134 2472075 2492641 2514182 2535879 2557073 2577625 2597569 2616848 2635668 2654752 2674794 2695827
49123 2695827 2717561 2740113 2763941 2789295 2816412 2846228 2880186 2919109 2962876 3011526 3066176
49112 3066176 3128515 3199952 3281925 3376898 3488524 3620607 3775396 3951593 4142681 4337379
49102 4337379 4523736 4695269 4854300 5008317 5160293 5299913 5404025 5448379 5422746 5337335
49092 5337335 5215248 5077697 4933838 4781448 4615120 4434257 4245587 4060082 3887940
49083 3887940 3735514 3605211 3496695 3407715 3334852 3274735 3224921 3183525 3148490 3117811 3090282
49072 3090282 3065407 3042739 3021837 3002706 2985507 2969837 2954949 2940720 2927685 2915943 2904777
49061 2904777 2893597 2882573 2871981 2861561 2851040 2840767 2831307 2822726 2814746 2807337 2800763 2795297
49049 2795297 2791250 2789012 2788686 2789926 2792402 2795996 2800133 2803327 2803983 2801473 2795971 2787643 2776806 2764758
49035 2764758 2753651 2745247 2740148 2738200 2739047 2742059 2746143 2750044 2752816 2754028 2753724 2752201 2749642 2746048
49021 2746048 2741670 2737288 2733750 2731345 2729954 2729628 2730548 2732539 2735192 2738503 2742866 2748305 2754190 2759831
49007 2759831 2764997 2769800 2774497 2779469 2784883 2790207 2794522 2797478 2799542 2801156 2802207 2802519 2802238 2801337 2799253
48992 2799253 2795594 2790808 2785649 2780303 2774557 2768464 2762246 2755767 2748817 2741807 2735469 2729771 2723756 2716599
48978 2716599 2708370 2699540 2690297 2680620 2670600 2660263 2649348 2637612 2625272 2612898 2601008 2590013
48966 2590013 2580409 2572714 2567196 2563843 2562615 2563583 2566829 2572407 2580414 2590888 2603552 2617767 2632948
48953 2632948 2649014 2666395 2685668 2707215 2731013 2756464 2782392 2807591 2831651 2855149 2878798
48942 2878798 2902505 2925541 2947615 2969469 2992275 3016738 3042983 3071146 3101715 3135191 3171475
48931 3171475 3209773 3249219 3289638 3331617 3375716 3421766 3469189 3517931 3568664 3622014 3677935
48920 3677935 3736033 3796088 3857905 3920926 3984493 4048430 4112928 4177797 4242219 4305435 4367361
48909 4367361 4428289 4488102 4546000 4600893 4651802 4697953 4738883 4774726 4806315 4834669 4860379
48898 4860379 4883593 4904547 4923656 4940889 4955380 4966070 4972674 4975736 4975872 4973376 4968456 4961342 4952041
48885 4952041 4940397 4926594 4911167 4894394 4876093 4856155 4834751 4811696 4786184 4757726 4726871
48874 4726871 4694352 4659876 4622520 4582165 4539704 4495748 4449946 4401896 4352118 4301701 4251512
48863 4251512 4202200 4154622 4109661 4067661 4028351 3991273 3956047 3922307 3889735 3858240 3828018
$$ [...]
##END NTUPLES=NMR SPECTRUM
##END=
