##TITLE=AC1651_NBUAH14352_8531779_ft6pKpcJBK
##JCAMPDX= 6.0         $$ Bruker NMR JCAMP-DX V2.0
##DATA TYPE= NMR SPECTRUM
##DATA CLASS= NTUPLES
##ORIGIN= BRUKER
##OWNER= Administrator
$$ 1.72 TOPSPIN		Version 2.1
$$ 2014-03-14 17:08:42.484 -0800  Administrator@X
$$ Compression mode = diff/dup
##.OBSERVE FREQUENCY= 400.02188249412
##.OBSERVE NUCLEUS= ^1H
##.ACQUISITION MODE= SIMULTANEOUS (DQD)
##.ACQUISITION SCHEME= undefined
##.AVERAGES= 64
##.DIGITISER RES= 22
##SPECTROMETER/DATA SYSTEM= spect
##.PULSE SEQUENCE= noesygpps1d.comp
##.SOLVENT NAME= COFFEE_meoh
##.SHIFT REFERENCE= INTERNAL, COFFEE_meoh, 1, 14.96093
##AUDIT TRAIL= $$ (NUMBER, WHEN, WHO, WHERE, PROCESS, VERSION, WHAT)
$$ ##TITLE= Audit trail, TOPSPIN		Version 2.1
$$ ##JCAMPDX= 5.01
$$ ##ORIGIN= Bruker BioSpin GmbH
$$ ##OWNER= Administrator
$$ $$ E:\/data/COFFEE/nmr/AC1651_NBUAH14352_8531779_ft6pKpcJBK/12/pdata/1/auditp.txt
$$ ##AUDIT TRAIL=  $$ (NUMBER, WHEN, WHO, WHERE, PROCESS, VERSION, WHAT)
(   1,<2014-03-14 17:08:37.546 -0800>,<Administrator>,<X>,<go>,<TOPSPIN 2.1>,
      <created by zg
	started at 2014-03-14 16:57:07.763 -0800,
	POWCHK enabled, PULCHK disabled,
       configuration hash MD5:
       C8 4E 4E 5D D3 5C D8 9E 9F 52 82 E0 59 8A DE 15
       data hash MD5: 64K
       77 F6 45 7B 71 64 56 3A 32 C9 86 6B 8D E1 2B D9>)
(   2,<2014-03-14 17:08:40.515 -0800>,<Administrator>,<X>,<proc1d>,<TOPSPIN 2.1>,
      <Start of raw data processing
       efp LB = 0.3 FT_mod = 6 PKNL = 1 PHC0 = 0 PHC1 = 0 SI = 128K 
       data hash MD5: 128K
       DF 42 BA 8D 1D 0C 48 3B BA DB 2D E5 8E E1 42 61>)
(   3,<2014-03-14 17:08:41.453 -0800>,<Administrator>,<X>,<proc1d>,<TOPSPIN 2.1>,
      <pk PHC0 = -82.82593 PHC1 = 0 
       data hash MD5: 128K
       48 7B 80 13 1F F7 6B 94 7E B2 D1 0A DA DC 03 0E>)
(   4,<2014-03-14 17:08:41.843 -0800>,<Administrator>,<X>,<proc1d>,<TOPSPIN 2.1>,
      <abs ABSG = 1 
       data hash MD5: 128K
       51 EA EE 67 3D 1C F3 25 65 86 CC A4 FF E6 88 15>)
(   5,<2014-03-14 17:08:41.953 -0800>,<Administrator>,<X>,<proc1d>,<TOPSPIN 2.1>,
      <abs ABSG = 2 
       data hash MD5: 128K
       13 77 10 00 79 FF 81 8C 07 92 3D 21 60 3F A1 00>)
(   6,<2014-03-14 17:08:42.062 -0800>,<Administrator>,<X>,<proc1d>,<TOPSPIN 2.1>,
      <abs ABSG = 3 
       data hash MD5: 128K
       EB 24 75 EF 0A 82 DE B8 36 1B 16 80 B8 26 36 56>)
(   7,<2014-03-14 17:08:42.156 -0800>,<Administrator>,<X>,<proc1d>,<TOPSPIN 2.1>,
      <abs ABSG = 4 
       data hash MD5: 128K
       E9 30 A9 94 63 C5 21 21 3C E8 C6 1C 41 27 5A 78>)
(   8,<2014-03-14 17:08:42.265 -0800>,<Administrator>,<X>,<proc1d>,<TOPSPIN 2.1>,
      <abs ABSG = 5 
       data hash MD5: 128K
       6A 38 9D B8 B8 A0 57 44 0A 93 5F 55 C6 53 BD 80>)
$$ ##END=
$$ 
$$ $$ hash MD5
$$ $$ CC B5 D3 F1 3E F9 CD C5 52 AC AB B5 9D AB A1 7B
##$RELAX= 
##$RELAX= 
##$RELAX= 
##$RELAX= 
##$RELAX= 
##$RELAX= 
##$RELAX= 
##$RELAX= 
$$ Bruker specific parameters
$$ --------------------------
##$DU= <E:\>
##$EXPNO= 12
$$ [...]
##$TP07= 0
##$TPNAME0= <>
##$TPNAME1= <>
##$TPNAME2= <>
##$TPNAME3= <>
##$TPNAME4= <>
##$TPNAME5= <>
##$TPNAME6= <>
##$TPNAME7= <>
##$TPOAL= (0..7)
0.5 0.5 0.5 0.5 0.5 0.5 0.5 0.5
##$TPOFFS= (0..7)
0 0 0 0 0 0 0 0
##$TUNHIN= 0
##$TUNHOUT= 0
##$TUNXOUT= 0
##$USERA1= <user>
##$USERA2= <user>
##$USERA3= <user>
##$USERA4= <user>
##$USERA5= <user>
##$V9= 5
##$VALIST= <valist>
##$VCLIST= <CCCCCCCCCCCCCCC>
##$VD= 0
##$VDLIST= <DDDDDDDDDDDDDDD>
##$VPLIST= <PPPPPPPPPPPPPPP>
##$VTLIST= <TTTTTTTTTTTTTTT>
##$WBST= 1024
##$WBSW= 4
##$XGAIN= (0..3)
0 0 0 0
##$XL= 0
##$YL= 0
##$YMAX_a= 6579921
##$YMIN_a= -14611216
##$ZGOPTNS= <>
##$ZL1= 120
##$ZL2= 120
##$ZL3= 120
##$ZL4= 120
##$ABSF1= 14.96093
##$ABSF2= -5.597252
##$ABSG= 5
##$ABSL= 3
##$ALPHA= 0
##$AQORDER= 0
##$ASSFAC= 0
##$ASSFACI= 0
##$ASSFACX= 0
##$ASSWID= 0
##$AUNMP= <proc_prof1d_extract.lims>
##$AXLEFT= 0
##$AXNAME= <>
##$AXNUC= <1H>
##$AXRIGHT= 0
##$AXTYPE= 0
##$AXUNIT= <>
##$AZFE= 0.1
##$AZFW= 0.1
##$BCFW= 0
##$BC_mod= 0
##$BYTORDP= 0
##$COROFFS= 0
##$CY= 15
##$DATMOD= 1
##$DC= 0
##$DFILT= <>
##$DTYPP= 0
##$F1P= 0
##$F2P= 0
##$FCOR= 0.5
##$FTSIZE= 131072
##$FT_mod= 6
##$GAMMA= 0
##$GB= 0
##$INTBC= 1
##$INTSCL= 1
##$ISEN= 128
##$LB= 0.3
##$LEV0= 0
##$LPBIN= 0
##$MAXI= 10000
##$MC2= 0
##$MEAN= 0
##$ME_mod= 0
##$MI= 0
##$NCOEF= 0
##$NC_proc= -2
##$NLEV= 6
##$NOISF1= 0
##$NOISF2= 0
##$NSP= 0
##$NTH_PI= 0
##$NZP= 0
##$OFFSET= 14.96093
##$PC= 1
##$PHC0= -82.82593
##$PHC1= 0
##$PH_mod= 1
##$PKNL= yes
##$PPARMOD= 0
##$PPDIAG= 0
##$PPIPTYP= 0
##$PPMPNUM= 2147483647
##$PPRESOL= 1
##$PSCAL= 4
##$PSIGN= 0
##$PYNMP= <proc.py>
##$REVERSE= no
##$SF= 400.020009666634
##$SI= 131072
##$SIGF1= 0
##$SIGF2= 0
##$SINO= 400
##$SIOLD= 131072
##$SPECTYP= <>
##$SREGLST= <1H.CDCl3>
##$SSB= 0
##$STSI= 131072
##$STSR= 0
##$SW_p= 8223.68421052631
##$SYMM= 0
##$S_DEV= 0
##$TDeff= 65536
##$TDoff= 0
##$TI= <>
##$TILT= no
##$TM1= 0
##$TM2= 0
##$TOPLEV= 0
##$USERP1= <user>
##$USERP2= <user>
##$USERP3= <user>
##$USERP4= <user>
##$USERP5= <user>
##$WDW= 1
##$XDIM= 131072
##$YMAX_p= 385048457
##$YMIN_p= -11099
##$CURPLOT= <Network HP LaserJet P1505>
##$CURPRIN= <$Network HP LaserJet P1505>
##$DFORMAT= <normdp>
##$LAYOUT= <+/1D_H.xwp>
##$LFORMAT= <normlp>
##$PFORMAT= <normpl>
##$SURQMSG= 1
$$ End of Bruker specific parameters
$$ ---------------------------------
##NTUPLES= NMR SPECTRUM
##VAR_NAME=  FREQUENCY,     SPECTRUM/REAL,   SPECTRUM/IMAG
##SYMBOL=    X,             R,               I
##VAR_TYPE=  INDEPENDENT,   DEPENDENT,       DEPENDENT
##VAR_FORM=  AFFN,          ASDF,            ASDF
##VAR_DIM=   131072,        131072,          131072
##UNITS=     HZ,            ARBITRARY UNITS, ARBITRARY UNITS
##FACTOR=    0.0627417313425164, 1,          1
##FIRST=     8223.62146879497, 2597,         -64746
##LAST=      0,             4906,            -64501
##MIN=       0,             -11099,          0
##MAX=       8223.62146879497, 385048457,    0
$$ Real data points
##PAGE= N=1
##DATA TABLE= (X++(R..R)), XYDATA
$$ [...]
63784C19463k750k655k686j870j36J321J353J96r50j276r41n59n20p32q05n55
$$ 319463 316713 314058 311372 309502 309366 310687 312040 312236 311286 310010 309069 308510 307990 307258 306453 305898
63768C05898l36n87j060j020l50J10l69j391j981j765j262j104j332j394p23N84
$$ 305898 305562 304975 303915 302895 302545 302655 302286 300895 298914 297149 295887 294783 293451 292057 291334 291918
63752B91918J697J903J447J124J138R79M77K52P85J709K417K852L221L415L278
$$ 291918 293615 295518 296965 298089 299227 300206 300683 300935 301720 303429 305846 308698 311919 315334 318612
63737C18612L060L099L256L192K992L078L574M111M276L995L597L565M039M578
$$ 318612 321672 324771 328027 331219 334211 337289 340863 344974 349250 353245 356842 360407 364446 369024
63723C69024M636M299M170M489M833M801M445L842K864J556L25o12j416k058k164
$$ 369024 373660 377959 382129 386618 391451 396252 400697 404539 407403 408959 409284 408672 407256 405198 403034
63708D03034j729j370j454j580j340r79p56l39N81J591K198K600L098L294K791
$$ 403034 401305 399935 398481 396901 395561 394582 393826 393487 394068 395659 397857 400457 403555 406849 409640
63693D09640K157K172K414J779L06o68l64M78P83M47m8n33j051j326j013k69L85
$$ 409640 411797 413969 416383 418162 418468 417800 417436 417914 418697 419144 419096 418563 417512 416186 415173 414904 415289
63676D15289O72P25P26O56M56K30K38O73J424K068K141J512M73n07j192j782k612
$$ 415289 415961 416686 417412 418068 418524 418754 418992 419665 421089 423157 425298 426810 427283 426776 425584 423802 421190
63659D21190l586m123l923l563l882m903n816o043n700m994l893k671k026k143
$$ 421190 417604 413481 409558 405995 402113 397210 391394 385351 379651 374657 370764 368093 366067 363924
63645C63924k213j489l25M45P15J008J479J766J735J685J849K213K866L947N258
$$ 363924 361711 360222 359897 360342 361057 362065 363544 365310 367045 368730 370579 372792 375658 379605 384863
63630C84863O305O810O909O897P068P637Q442Q936Q820Q537Q743R517J0517J1733
$$ 384863 391168 397978 404887 411784 418852 426489 434931 443867 452687 461224 469967 479484 490001 501734
63616E01734J3462J5621J7673J9273K0577K1881K3352K5095K7059K8796K9707
$$ 501734 515196 530817 548490 567763 588340 610221 633573 658668 685727 714523 744230
63605G44230K9508K8213K5744K2011J7372J2613Q284M375O48k915o090q600j0269
$$ 744230 773738 801951 827695 849706 867078 879691 887975 892350 892998 890083 883993 875393 865124
63592H65124j1147j1498j1630j1805j2390j3694j5533j7269j8542j9591k0568
$$ 865124 853977 842479 830849 819044 806654 792960 777427 760158 741616 722025 701457
63581G01457k0957k0144j8230j5769j3026j0098p473n761m889m162l064j548K90
$$ 701457 680500 660356 642126 626357 613331 603233 595760 589999 585110 580948 577884 576336 576626
63568E76626K236L748M322M103L641L161K584K214K634L854N220O371P721R744
$$ 576626 578862 582610 586932 591035 594676 597837 600421 602635 605269 609123 614343 620714 628435 638179
63554F38179J2267J4737J6812J8569K0373K2724K5896K9609L3270L6466L8959
$$ 638179 650446 665183 681995 700564 720937 743661 769557 799166 832436 868902 907861
63543I07861M0168L9139L5103K8021J8773Q991M17o097j0784j3947j5247j4671
$$ 907861 948029 987168 1022271 1050292 1069065 1078056 1078473 1072376 1061592 1047645 1032398 1017727
63531A017727j3541j3442j4386j5201j5696j7093j9970k3134k5247k6528k7881
$$ 1017727 1004186 990744 976358 961157 945461 928368 908398 885264 860017 833489 805608
63520H05608k9174k9500k8684k7380k5891k3853k1260j8877j7332j6308j5047
$$ 805608 776434 746934 718250 690870 664979 641126 619866 600989 583657 567349 552302
63509E52302j3346j1692j0542r774q949p929p005o346n660m627l494k855k823
$$ 552302 538956 527264 516722 506948 497999 490070 483065 476719 471059 466432 462938 460083 457260
63496D57260k877k554j974j566j514j604j397n73O08J305R32j4l94K33J191J694
$$ 457260 454383 451829 449855 448289 446775 445171 443774 443201 443809 445114 446046 446032 445638 445871 447062 448756
63480D48756J734J803K183K824L546M064M087L587K777J748N08o27j232j485k028
$$ 448756 450490 452293 454476 457300 460846 464910 468997 472584 475361 477109 477617 476990 475758 474273 472245
63465D72245k860l052k110r44p67j428j696r90k1L76L42O49J688L093M179M573
$$ 472245 469385 466333 464223 463279 462512 461084 459388 458398 458377 458753 459095 459744 461432 464525 468704 473277
63449D73277M506M572N176O221P364Q315Q832Q715Q127P757Q241R517J1081J2852
$$ 473277 477783 482355 487531 493752 501116 509431 518263 526978 535105 542862 551103 560620 571701 584553
63435E84553J5393J9145K3745K8210L1611L3378L3174L0814K6542K1272J6307
$$ 584553 599946 619091 642836 671046 702657 736035 769209 800023 826565 847837 864144
63424H64144J2546R966Q090O934P156R124J2207J5365J8227K1176K4292K6664
$$ 864144 876690 886656 894746 901680 908836 917960 930167 945532 963759 984935 1009227 1035891
63412A035891K6990K4659K0057J4143P876K048k871o820j0024j2624j4517j5599
$$ 1035891 1062881 1087540 1107597 1121740 1129616 1131664 1128793 1121973 1111949 1099325 1084808 1069209
63400A069209j6023j6135j6300j6970j8667k1449k4491k6644k7570k7967k8464
$$ 1069209 1053186 1037051 1020751 1003781 985114 963665 939174 912530 884960 856993 828529
63389H28529k8806k8371k7067k5236k2956k0162j7214j4768j2934j1134q990o847
$$ 828529 799723 771352 744285 719049 696093 675931 658717 643949 631015 619881 610891 604044
63377F04044n110l479j304J455M019N688O660P757R341J0818J1442J1402J1688
$$ 604044 598934 595455 594151 595606 599625 605313 611973 619730 629071 639889 651331 662733 674421
63364F74421J2863J4507J6035J7590J9652K2203K4786K7129K9167L0688L1502
$$ 674421 687284 701791 717826 735416 755068 777271 802057 829186 858353 889041 920543
63353I20543L1780L1620L0415K7326K2364J6439J0344M345j207n708q908j1164
$$ 920543 952323 983943 1014358 1041684 1064048 1080487 1090831 1095176 1093969 1088261 1079353 1068189
63341A068189j2820j3939j4738j5655j6745j7616j8253j9184k0603k1941k2795
$$ 1068189 1055369 1041430 1026692 1011037 994292 976676 958423 939239 918636 896695 873900
63330H73900k3501k4267k4395k3159k0953j8761j6825j4647j2068r462o875l914
$$ 873900 850399 826132 801737 778578 757625 738864 722039 707392 695324 685862 678987 675073
63318F75073p28J553J798j13l461p411j1303j4567j6793j7877j7938j7165j5842
$$ 675073 674345 675898 677696 677583 674122 666711 655408 640841 624048 606171 588233 571068 555226
63305E55226j4282j2552j0432p906n545m081l544l183k440j723j827k755l635
$$ 555226 540944 528392 517960 510054 504509 500428 496884 493701 491261 489538 487711 484956 481321
63292D81321l864l851m329n307o086o088n319m192l227k740k510j969j049n69
$$ 481321 477457 473606 469277 463970 457884 451796 446477 442285 439058 436318 433808 431839 430790 430221
63278D30221j196k317k602j661m15K33L43M31O65R41J233J487J569J610K031K930
$$ 430221 429025 426708 424106 422445 422030 422263 422606 423037 423702 424643 425876 427363 428932 430542 432573 435503
63262D35503L793M101L903L624L601L916M323M295L635L146L964N993P665P854
$$ 435503 439296 443397 447300 450924 454525 458441 462764 467059 470694 473840 477804 483797 491462 499316
63248D99316P284P469Q730J0100J0782J0933J1073J1505J2456J4137J6425J8823
$$ 499316 506600 514069 522799 532899 543681 554614 565687 577192 589648 603785 620210 639033
63236F39033K0857K2422K3741K5204K7102K9332L1456L3162L4454L5305L5502
$$ 639033 659890 682312 706053 731257 758359 787691 819147 852309 886763 922068 957570
63225I57570L5128L4713L4498L3929L2461L0601K9480K9471K9851K9843K9423
$$ 957570 992698 1027411 1061909 1095838 1128299 1158900 1188380 1217851 1247702 1277545 1306968
63214A306968K8957K8544K7934K6718K4481K1026J6565J1441N641j092q646j6379
$$ 1306968 1335925 1364469 1392403 1419121 1443602 1464628 1481193 1492634 1498275 1497183 1488537 1472158
63202A472158k3688l0342l6099m0418m2843m3503m2920m1499l9364l6511l2898
$$ 1472158 1448470 1418128 1382029 1341611 1298768 1255265 1212345 1170846 1131482 1094971 1062073
63191A062073k8537k3817j9536j6208j3355r978n853j911R78L167N688Q790J1738
$$ 1062073 1033536 1009719 990183 973975 960620 950642 944789 942878 943856 947023 952711 961501 973239
63178I73239J3992J5833J7606J8973J9424J9114J8622J8184J7635J6903J6082
$$ 973239 987231 1003064 1020670 1039643 1059067 1078181 1096803 1114987 1132622 1149525 1165607
63167A165607J5105J3801J2134J0052P336L946L27l167o850j1207j5978k0387
$$ 1165607 1180712 1194513 1206647 1216699 1224035 1227981 1228308 1225141 1218291 1207084 1191106 1170719
63155A170719k4052k7079k9451l0985l1742l1811l0912k9003k7015k5902k5101
$$ 1170719 1146667 1119588 1090137 1059152 1027410 995599 964687 935684 908669 882767 857666
63144H57666k3211k0204j7610j6134j4544j1666q171n448l783k724k333k777l238
$$ 857666 834455 814251 796641 780507 765963 754297 746126 740678 736895 734171 731838 729061 725823
63131G25823k554o97J393L204M925O534P646Q239Q715R137R192Q892Q619Q357
$$ 725823 723269 722572 723965 727169 732094 738628 746274 754513 763228 772365 781557 790449 799068 807425
63117H07425P559N999M264L154K827K695J979M39j320k328k201j408o17j48j42
$$ 807425 814984 820983 825247 828401 831228 833923 835902 836341 835021 832693 830492 829084 828467 828319 828177
63102H28177p14j624k344k762l243l746l664k980k627k962k833j223R71K052J934
$$ 828177 827463 825839 823495 820733 817490 813744 810080 807100 804473 801511 798678 797455 798426 800478 802412
63087H02412J994K818L534L501L250L386L674L749L817M165M585M821N029N470
$$ 802412 804406 807224 810758 814259 817509 820895 824569 828318 832135 836300 840885 845706 850735 856205
63073H56205O178P142Q434R970J1496J2935J4337J5541J6400J7286J8841K1163
$$ 856205 862383 869525 877959 887929 899425 912360 926697 942238 958638 975924 994765 1015928
63061A015928K3802K6489K9299L2115L4687L7306M0713M5064M9695N4074N8384
$$ 1015928 1039730 1066219 1095518 1127633 1162320 1199626 1240339 1285403 1335098 1389172 1447556
63050A447556O2820O6980P0346P3010P5452P7853P9824Q0716Q0104P8283P6187
$$ 1447556 1510376 1577356 1647702 1720712 1796164 1874017 1953841 2034557 2114661 2192944 2269131
63039B269131P4521P3043P1149O8911O6962O5476O3989O2216O0221N7662N3658
$$ 2269131 2343652 2416695 2487844 2556755 2623717 2689193 2753182 2815398 2875619 2933281 2986939
63028B986939M7701M0060L1004K0325P948n630j9920l4859n0169o4762p7306q7085
$$ 2986939 3034640 3074700 3105704 3126029 3133977 3128347 3108427 3073568 3023399 2958637 2881331 2794246
63016B794246r4021r8178r9706r9005r6590r2778q7635q1067p3100o4265n5522
$$ 2794246 2700225 2602047 2502341 2403336 2306746 2213968 2126333 2045266 1972166 1907901 1852379
63005A852379m7340l9043k9763j9923j0991l711K505Q222J3038J6564J9425K2511
$$ 1852379 1805039 1765996 1736233 1716310 1705319 1701608 1704113 1712335 1725373 1741937 1761362 1783873
62993A783873K5714K8176K9519L0111L0367L0379L0165K9787K9141K7880K5576
$$ 1783873 1809587 1837763 1867282 1897393 1927760 1958139 1988304 2018091 2047232 2075112 2100688
62982B100688K1992J7361J2358P366J843n111j3443k2047l0098l7805m5441n2345
$$ 2100688 2122680 2140041 2152399 2159765 2161608 2156497 2143054 2121007 2090909 2053104 2007663 1955318
62970A955318n7510o0659o2191o2479o1789o0525n8929n6780n3908n0746m7907
$$ 1955318 1897808 1837149 1774958 1712479 1650690 1590165 1531236 1474456 1420548 1369802 1321895
62959A321895m5425m2948m0446l8154l6001l3661l1186k9071k7648k6685k5674
$$ 1321895 1276470 1233522 1193076 1154922 1118921 1085260 1054074 1025003 997355 970670 944996
62948I44996k4211k2221k0025j8173j6985j6280j5649j4802j3583j1988j0290
$$ 944996 920785 898564 878539 860366 843381 827101 811452 796650 783067 771079 760789
62937G60789q899p887o966o079n507n220m705l829l250l409l667l203k336k051
$$ 760789 751890 744003 737037 730958 725451 720231 715526 711697 708447 705038 701371 698168 695832 693781
62923F93781k469k737k422k098k353k982l446l607l656l756l983m288m367l971
$$ 693781 691312 688575 686153 684055 681702 678720 675274 671667 668011 664255 660272 655984 651617 647646
62909F47646l377l167l339l198k395j517j321j819k485k956l017k376j079M3Q4
$$ 647646 644269 641102 637763 634565 632170 630653 629332 627513 625028 622072 619055 616679 615600 615643 615727
62894F15727p71j400j142m55k0J28K33J56k83o92m44L93J106J247J041P66L32
$$ 615727 614956 613556 612414 611959 611939 612067 612300 612456 612173 611481 611037 611430 612536 613783 614824 615590 615922
62877F15922l44j015j376j435j393j422j689k208k588k360j715j397j622j731
$$ 615922 615578 614563 613187 611752 610359 608937 607248 605040 602452 600092 598377 596980 595358 593627
62863E93627j287q25r26j091m38R00J954K284K256K038J341K81l72j57M34O61
$$ 593627 592340 591515 590589 589498 589060 589960 591914 594198 596454 598492 599833 600114 599742 599585 600019 600680
62847F00680L51j78o02p23n82n14p99j192j270j166j365j794j817j213m55J15
$$ 600680 601031 600853 600251 599528 598946 598432 597633 596441 595171 594005 592640 590846 589029 587816 587361 587476
62831E87476O71J244J473J327J314J631J828J772K128L303M600N101M866M563
$$ 587476 588147 589391 590864 592191 593505 595136 596964 598736 600864 604167 608767 613868 618734 623297
62817F23297M456M475M853N827O987P620P580P228O761O168N731N884O654P700
$$ 623297 627753 632228 637081 642908 649895 657515 665095 672323 679084 685252 690983 696867 703521 711221
62803G11221Q717R418R431Q812Q415R107J0666J2158J3233J4410J6088J8009J9912
$$ 711221 719938 729356 738787 747599 756014 765121 775787 787945 801178 815588 831676 849685 869597
62790H69597K2099K5026K8704L2773L6942M1202M5757N0842N6454O2302O8164
$$ 869597 891696 916722 945426 978199 1015141 1056343 1102100 1152942 1209396 1271698 1339862
62779A339862P4161Q0478Q6961R3292R9427J05502J11265J15973J18845J19472
$$ 1339862 1414023 1494501 1581462 1674754 1774181 1879683 1990948 2106921 2225766 2345238
62769B345238J17798J13882J07636R8692Q6641P1574N4120L4810J3840q228k9922
$$ 2345238 2463036 2576918 2684554 2783246 2869887 2941461 2995581 3030391 3044231 3036003 3006081
62758C006081m9682o7007q2225r5271j05436j12360j16595j18861j19297j17778
$$ 3006081 2956399 2889392 2807167 2711896 2606460 2494100 2377505 2258644 2139347 2021569
62748B021569j14541j10057j04553r8072r0931q3773p7095p0862o4730n8561n2685
$$ 2021569 1907028 1796971 1692418 1594346 1503415 1419642 1342547 1271685 1206955 1148394 1095709
62737A095709m7580m3302l9359l5255l1085k7407k4511k2018j9272j6097j3024
$$ 1095709 1048129 1004827 965468 930213 899128 871721 847210 825192 805920 789823 776799
62726G76799j0753r467q696p854o724n415m034k653j427m90K60J073K116L536
$$ 776799 766046 756579 747883 740029 733305 727890 723856 721203 719776 719286 719546 720619 722735 726271
62712G26271N607Q386J1320J3664J5402J7288J9878K2995K6301K9815L3548L7052
$$ 726271 731878 740264 751584 765248 780650 797938 817816 840811 867112 896927 930475 967527
62700I67527L9859M2120M4507M7496N1068N4873N8540O1921O5187O8431P1097
$$ 967527 1007386 1049506 1094013 1141509 1192577 1247450 1305990 1367911 1433098 1501529 1572626
62689A572626P2102P0744O7189O1913N5024M6314L5740K3623J0617k445j5041
$$ 1572626 1644728 1715472 1782661 1844574 1899598 1945912 1981652 2005275 2015892 2013447 1998406
62678A998406k7290l9340n0391n9071o4980o9107p2335p4289p4283p2633p0243
$$ 1998406 1971116 1931776 1881385 1822314 1757334 1688227 1615892 1541603 1467320 1394687 1324444
62667A324444o7354o3626n9163n4626n0450m6574m2930l9483l5923l1918k7748
$$ 1324444 1257090 1193464 1134301 1079675 1029225 982651 939721 900238 864315 832397 804649
62656H04649k4144k1487j9553j7981j6580j5295j4199j3409j2724j1630j0071
$$ 804649 780505 759018 739465 721484 704904 689609 675410 662001 649277 637647 627576
62645F27576q808q461q491p839o318m635l135j473M14J817K088J432N30k42r62
$$ 627576 618768 610307 601816 593977 587659 583024 579889 578416 578830 580647 582735 584167 584697 584455 583493
62630E83493j816k817l752m280m265l861l216k246r95J30Q06J266J900K599L007
$$ 583493 581677 578860 575108 570828 566563 562702 559486 557240 556245 556375 557181 558447 560347 562946 565953
62615E65953L189L516M016M387M647N187O202P444Q575R324R577R652J0380J2306
$$ 565953 569142 572658 576674 581061 585708 590895 597097 604541 613116 622440 632017 641669 652049 664355
62601F64355J4975J7544J9935K2685K5854K8921L1839L5290L9646M4286M8352
$$ 664355 679330 696874 716809 739494 765348 794269 826108 861398 901044 945330 993682
62590I93682N1636N4414N6798N8605N9488N8964N6586N2238M6179L8788L0528
$$ 993682 1045318 1099732 1156530 1215135 1274623 1333587 1390173 1442411 1488590 1527378 1557906
62579A557906K1928J3066L278p907j9506k9558l7066m2805m7812n1891n4138n4396
$$ 1557906 1579834 1592900 1596178 1588271 1568765 1539207 1502141 1459336 1411524 1359633 1305495 1251099
62567A251099n3499n2259n0829m9009m6644m3700m0279l6643l3099k9725k6408
$$ 1251099 1197600 1145341 1094512 1045503 998859 955159 914880 878237 845138 815413 789005
62556G89005k3108k0018j7375j5165j3136j1156r538q733q674q633p964o768n639
$$ 789005 765897 745879 728504 713339 700203 689047 679509 670776 662102 653469 645505 638737 633098
62543F33098m862m168l155j803o06k35q53j705j779j031m41o35r52l77J092K655
$$ 633098 628236 624068 620913 619110 618504 618269 617416 615711 613932 612901 612460 611825 610873 610496 611588 614243
62527F14243L873M934N979O937P948R278J0828J2339J3996J6212J8816K1146K3060
$$ 614243 618116 623050 629029 635966 643914 653192 664020 676359 690355 706567 725383 746529 769589
62514G69589K5268K8441L2387L6323L9688M2581M5523M8728N1521N2776N2109
$$ 769589 794857 823298 855685 892008 931696 974277 1019800 1068528 1120049 1172825 1224934
62503A224934N0212M7760M4601M0569L6243L2079K7426K1688J6060J2799J2684
$$ 1224934 1275146 1322906 1367507 1408076 1444319 1476398 1503824 1525512 1541572 1554371 1567055
62492A567055J4432J6707J9544K3421K8057L2752L7255M1809M6768N2258N7547
$$ 1567055 1581487 1598194 1617738 1641159 1669216 1701968 1739223 1781032 1827800 1880058 1937605
62481A937605O0660N9407N3218M3617L2803K2238J2233J902j0416k5534m1962
$$ 1937605 1998265 2057672 2110890 2154507 2187310 2209548 2221781 2223683 2213267 2187733 2145771
62470B145771n6966o9172p9117q7255r2909r5671r6337r5596r2910q7716q0776
$$ 2145771 2088805 2019633 1940516 1853261 1760352 1664681 1568344 1472748 1379838 1292122 1211346
62459A211346p3293o5538n7360m9398m2597l6976l1867k7056k2762j8846j4905
$$ 1211346 1138053 1072515 1015155 965757 923160 886184 854317 827261 804499 785653 770748
62448G70748j1087p908n429l228j117P89K562M382N973O774O696O296O153O315
$$ 770748 759661 751753 746324 743096 741979 742768 745330 749712 755685 762459 769155 775451 781604 787919
62434G87919O297N391L248L86k133l820n211o991r036j0788j2057j2970j3362
$$ 787919 794216 799607 802855 803241 801108 797288 792077 785086 776050 765262 753205 740235 726873
62421G26873j2959j2008j1244j1130j1424j1492j0874r682q538p938p585o739
$$ 726873 713914 701906 690662 679532 668108 656616 645742 636060 627522 619584 611999 605260
62409F05260n275l946l363l310l281l176k996k490j565o52r9M21J363K533L363
$$ 605260 599985 596039 592676 589366 586085 582909 579913 577423 575858 575206 575107 575528 576891 579424 582787
62394E82787L746M016M335M507M401M120L915M053M590N110N082M657M652N506
$$ 582787 586533 590549 594884 599391 603792 607912 611827 615880 620470 625580 630662 635319 639971 645477
62380F45477O679P433P654P577P249O769O641P284Q453R522J0106J0218J0225
$$ 645477 652156 659589 667243 674820 682069 688838 695479 702763 711216 720738 730844 741062 751287
62367G51287J0852J2658J5185J7274J8595K0204K3110K7063L1292L5614M0044
$$ 751287 762139 774797 789982 807256 825851 846055 869165 896228 927520 963134 1003178
62356A003178M4035M7042M9365N1418N2651N2081M9568M5601M0183L2984K4503
$$ 1003178 1047213 1094255 1143620 1195038 1247689 1299770 1349338 1394939 1435122 1468106 1492609
62345A492609J6072Q596J986m097r658j4507j8483k1531k3931k6237k8543l0205
$$ 1492609 1508681 1517277 1519263 1515166 1505508 1491001 1472518 1450987 1427056 1400819 1372276 1342071
62333A342071l0786l0790l0770l0255k8530k6078k4126k3059k2294k1608k1422
$$ 1342071 1311285 1280495 1249725 1219470 1190940 1164862 1140736 1117677 1095383 1073775 1052353
62322A052353k1704k1783k1484k1418k1811k1917k0997j9201j7094j4909j2725
$$ 1052353 1030649 1008866 987382 965964 944153 922236 901239 882038 864944 850035 837310
62311H37310j0751r058p347n310l026q89O23J200J049P71O04L4j190k187j900
$$ 837310 826559 817501 810154 804844 801818 800929 801552 802752 803801 804572 805176 805210 804020 801833 799933
62296G99933o94Rl90j162j653k136k927l691m008l923l562k888k123j677j422
$$ 799933 799239 799248 798858 797696 796043 793907 790980 787289 783281 779358 775796 772908 770785 769108 767686
62281G67686q53j43j04o86n72R68K797L394K917K758L491M395M940N598O952Q767
$$ 767686 766833 766690 766586 765900 765328 766296 769093 772487 775404 778162 781653 786048 790988 796586 803538 812305
62265H12305J0449J2015J4143J7314K1155K4828K8052L1498L5955M1195M6125
$$ 812305 822754 834769 848912 866226 887381 912209 940261 971759 1007714 1048909 1095034
62254A095034M9991N2932N5212N6450N5967N3522M9333M3610L6505K8302J9421
$$ 1095034 1145025 1197957 1253169 1309619 1365586 1419108 1468441 1512051 1548556 1576858 1596279
62243A596279J0280J311p077j4765k1924k8620l4630l9830m4378m8236n0764n1250
$$ 1596279 1606559 1607870 1600793 1586028 1564104 1535484 1500854 1461024 1416646 1368410 1317646 1266396
62231A266396m9810m7439m5031m2613l9592l5693l1462k7749k4779k2048j9192
$$ 1266396 1216586 1169147 1124116 1081503 1041911 1006218 974756 947007 922228 900180 880988
62220H80988j6602j4715j3121j1026q558o764o124n812m842l407k410k132j965
$$ 880988 864386 849671 836550 825524 816966 810202 804078 798266 793424 790017 787607 785475 783510
62207G83510j298j15J320K762L930M544M694M879N502O418P094P144O637N910
$$ 783510 782212 782097 783417 786179 790109 794653 799347 804226 809728 816146 823240 830384 837021 842931
62193H42931N206M597M228M445N531P276R030J0222J0733J0780J0654J0600J0743
$$ 842931 848137 852734 856962 861407 866938 874214 883244 893466 904199 914979 925633 936233 946976
62180I46976J0906J0631R561P826N937M381L424L216L896N508P950J1066J4713
$$ 946976 957882 968513 978074 985900 991837 996218 999642 1002858 1006754 1012262 1020212 1031278 1045991
62167A045991J8664K2563K6137K9457L2767L5973L8402L9266L8196L5327L1008
$$ 1045991 1064655 1087218 1113355 1142812 1175579 1211552 1249954 1289220 1327416 1362743 1393751
62156A393751K5666J9733J3436O845L41n285r663j3551j7952k2633k6227k8019
$$ 1393751 1419417 1439150 1452586 1459431 1459772 1454487 1444824 1431273 1413321 1390688 1364461 1336442
62144A336442k8778k9504l0088k9803k8499k6609k4401k1894j9293j6855j4499
$$ 1336442 1307664 1278160 1248072 1218269 1189770 1163161 1138760 1116866 1097573 1080718 1066219
62133A066219j2080r978q853q853r429r853r648q761p654p037p074p083o380n078
$$ 1066219 1054139 1044161 1035308 1026455 1017026 1007173 997525 988764 981110 974073 966999 959916 953536 948458
62119I48458l673k265q20K14L56QJ10Q81J678K132K672L667M665M911M160K789
$$ 948458 944785 942520 941700 941914 942270 942278 942388 943269 944947 947079 949751 953418 958083 962994 967154 969943
62103I69943J264j90j532k608k925j993pK095L515M218M402L868K480P91m22j057
$$ 969943 971207 971017 969485 966877 963952 961959 961952 964047 967562 971780 976182 980050 982530 983321 982899 981842
62087I81842j424j466j025n28n03m83N23K548M533N830O873Q160R511J0726J2090
$$ 981842 980418 978952 977927 977399 976896 976413 976936 979484 984017 989847 996720 1004880 1014391 1025117 1037207
62072A037207J3704J5019J5566J5597J5548J5422J5161J5211J6102J7751J9498
$$ 1037207 1050911 1065930 1081496 1097093 1112641 1128063 1143224 1158435 1174537 1192288 1211786
62061A211786K0653K0814J9911J8209J5957J2939Q781L857p47m392p570j0987
$$ 1211786 1232439 1253253 1273164 1291373 1307330 1320269 1329050 1332907 1332160 1327768 1320198 1309211
62049A309211j4547j7761k0803k4354k8451l2105l4360l5301l5735l6036l5780
$$ 1309211 1294664 1276903 1256100 1231746 1203295 1171190 1136830 1101529 1065794 1029758 993978
62038I93978l4585l2854l1264k9740k7608k4798k2148k0231j8589j6620j4583
$$ 993978 959393 926539 895275 865535 837927 813129 790981 770750 752161 735541 720958
62027G20958j3059j1925j0627r135p864o961o388o417p202q079q184p546o858
$$ 720958 707899 695974 685347 676212 668348 661387 654999 648582 641380 633301 625117 617571 610713
62014F10713o307n525m496l568k780k041j692j873j606J66K728M216M200M078
$$ 610713 604406 598881 594385 590817 588037 585996 584304 582431 580825 580991 583719 587935 592135 596213
62000E96213M638M856L863K577K358L054L489L095K116Q11o85k160l610n317p187
$$ 596213 600851 605707 609570 612147 614505 617559 621048 624143 626259 627070 626385 624225 620615 615298 608111
61985F08111q616r372r896j0352j0239r390q465p872p137n998n156n119n228m686
$$ 608111 599495 590123 580227 569875 559636 550246 541781 533909 526772 520774 515618 510499 505271 500585
61971E00585l764l025k286j348r33j576k296j751l40K89m28j381j513r13j10O39
$$ 500585 496821 493796 491510 490162 489229 487653 485357 483606 483266 483555 483127 481746 480233 479320 479210 479849
61955D79849J151J287J326J767K615L528M502N752O998P701P975Q499R465J0359
$$ 479849 481000 482287 483613 485380 487995 491523 496025 501777 508775 516476 524451 532950 542415 552774
61941E52774J0878J1243J1570J1677J1689J2047J2658J2762J1970J0871J0152
$$ 552774 563652 574895 586465 598142 609831 621878 634536 647298 659268 670139 680291
61930F80291R625Q579O820M932L663L203K990K104R8k466m496n366n263m635l729
$$ 680291 689916 698495 705315 710247 713910 717113 720103 722207 722305 719839 715343 709977 704714 700079 696350
61915F96350k762k052j569o84J204L761N872O890P344Q163R402J0241J0151R410
$$ 696350 693588 691536 689967 689283 690487 694248 700120 707010 714354 722517 731919 742160 752311 761721
61901G61721Q322O626M195J706j31j574l256m881n572n367n219n450n287m290
$$ 761721 770043 776669 780864 782570 782439 780865 777609 772728 767156 761789 756570 751120 745833 741543
61887G41543l164k653k602k735l437n013o873q194q839r068q929q636q820r589
$$ 741543 738379 735726 733124 730389 726952 721939 715066 706872 698033 688965 680036 671400 662580 652991
61873F52991r908q839o886n271m240l115j689n80q0M81J898M125O309P635Q073
$$ 652991 643083 634244 627358 622087 617847 614732 613043 612463 612383 612864 614762 618887 625196 632831 640904
61858F40904Q367R172J0254J0933J1257J2019J3555J5333J6983J8729K0411K1085
$$ 640904 649271 658443 668697 679630 690887 702906 716461 731794 748777 767506 787917 809002
61846H09002K0366J9159J8280J7221J5205J2611J0192P671M348O40k313m163n389
$$ 809002 829368 848527 866807 884028 899233 911844 922036 929707 934055 934695 932382 928219 922830
61833I22830o092n956n176m261l100j240J031K927M342N740P059P689P436O533
$$ 922830 916738 910782 905606 901345 898245 897005 898036 900963 905305 911045 918104 925793 933229 939762
61819I39762M901K435k51k421m370o862r597j1526j2511j3349j4130j4042j2911
$$ 939762 944663 947098 946847 944426 940056 933194 923597 912071 899560 886211 872081 858039 845128
61806H45128j1583j0507r289q041p758q819j0285j1208j1614j1691j1175j0078
$$ 845128 833545 823038 813749 805708 797950 789131 778846 767638 756024 744333 733158 723080
61794G23080r009q143o914n282m236m344m853m896m607m249l367j871r07j432
$$ 723080 714071 705928 699014 693732 689496 685152 680299 675403 670796 666547 663180 661309 660402 658970
61780F58970k583k771j877j109j012r08k39O98J469K027K338K251J980K012K405
$$ 658970 656387 653616 651739 650630 649618 648710 648471 649169 650638 652665 655003 657254 659234 661246 663651
61765F63651K677K598K586L124M225N584O912P909Q315Q164P745P072N739L495
$$ 663651 666328 668926 671512 674636 678861 684445 691357 699266 707581 715745 723490 730562 736301 739796
61751G39796P80j685l698n638p620r027r211q467p815p751p750p169o169n300
$$ 739796 740576 738891 735193 729555 721935 712908 703697 695230 687415 679664 671914 664745 658576 653276
61737F53276m651l964l344l097k983k336j100p9J18j55j59L16J017J788K603L215
$$ 653276 648625 644661 641317 638220 635237 632901 631801 631722 631840 631685 631526 631842 632859 634647 637250 640465
61721F40465L206K471J427O69M91P14Q99P04Q1q05j703k411k875l240l657m037
$$ 640465 643671 646142 647569 648238 648729 649443 650342 651046 651127 650322 648619 646208 643333 640093 636436 632399
61705F32399m221m316m548m756m535l967l678l931m206m076l874m010m231m189
$$ 632399 628178 623862 619314 614558 610023 606056 602378 598447 594241 590165 586291 582281 578050 573861
61691E73861m213m733n351n314m666m046l567k814j884j537k073k805k899k222
$$ 573861 569648 564915 559564 554250 549584 545538 541971 539157 537273 535736 533663 530858 527959 525737
61677E25737j276p32r93j805k307j954j193q15q78p89k38N83J460K143K146J335
$$ 525737 524461 523729 522736 520931 518624 516670 515477 514662 513784 512995 512757 513340 514800 516943 519089 520424
61661E20424M86M94J222J879K282K778L195L051K594K582K981L008K482J951J482
$$ 520424 520910 521404 522626 524505 526787 529565 532760 535811 538405 540987 543968 546976 549458 551409 552891
61646E52891N85n03q21k87km40o55N4R25J056Q36J062J542J597J278J100J000
$$ 552891 553476 552973 552152 551865 551863 551423 550768 550822 551747 552803 553639 554701 556243 557840 559118 560218 561218
61629E61218M61o15j825k816l463l748l910m233m496m178l480l335l961m246l352
$$ 561218 561679 561064 559239 556423 552960 549212 545302 541069 536573 532395 528915 525580 521619 517373 514021
61614E14021k118k020l219m532n010m697m070l486l219l395l871m402m811m808
$$ 514021 511903 509883 506664 502132 497122 492425 488355 484869 481650 478255 474384 469982 465171 460363
61600D60363m016k551j209p40j113j790k358k667k652k428k225k049j678j165
$$ 460363 456347 453796 452587 451847 450734 448944 446586 443919 441267 438839 436614 434565 432887 431722
61586D31722r13j093j418j602j626j429r11l71l14p00j001j097j349j642j329
$$ 431722 430809 429716 428298 426696 425070 423641 422730 422359 422045 421345 420344 419247 417898 416256 414927
61571D14927l63M66Q17J267K021K249J449M73L37P89J051J195J779K626L039K877
$$ 414927 414564 415030 415847 417114 419135 421384 422833 423306 423643 424432 425483 426678 428457 431083 434122 436999
61555D36999K530K128J586J149J129J316J280R84N98J01l98m63m4J53k33m03N00
$$ 436999 439529 441657 443243 444392 445521 446837 448117 449101 449699 449800 449402 448939 448895 449048 448815 448412 448912
61538D48912J939K599K121J229M92m4j91M09J483K196K112J540Q66J71m85r39
$$ 448912 450851 453450 455571 456800 457292 457248 457057 457466 458949 461145 463257 464797 465663 465834 465349 464410
61522D64410j177j383j655j947k132j967j303n44l87q46j095o95k90n35j026j059
$$ 464410 463233 461850 460195 458248 456116 454149 452846 452302 451915 451069 449974 449279 448989 448454 447428 446369
61506D46369p98p78p74j88P81J307J197R74R36R74J212J912K773L132K920K718
$$ 446369 445571 444793 444019 443831 444612 445919 447116 448090 449026 450000 451212 453124 455897 459029 461949 464667
61490D64667K812K912K793K560K208J601R10O24J018J965L156M111M246L497K656
$$ 464667 467479 470391 473184 475744 477952 479553 480463 481087 482105 484070 487226 491337 495583 499080 501736
61475E01736K532K918K921K157J064K73J05M66P03k8j691l071l184k538k239k358
$$ 501736 504268 507186 510107 512264 513328 513601 513706 514172 514875 514847 513156 510085 506901 504363 502124 499766
61459D99766k193j683j411j359r33k60k28j012j578j124j04O07Q22Q11O32K55
$$ 499766 497573 495890 494479 493120 492187 491927 491699 490687 489109 487985 487881 488488 489310 490121 490753 491008
61443D91008k3K38J091K048K434J938R79L73M73Q91J220J550J855J581N45k94
$$ 491008 490985 491223 492314 494362 496796 498734 499713 500086 500559 501450 502670 504220 506075 507656 508201 507907
61427E07907M3J051J346O35j2K08R53J614K084K345K172J624J209J249J505J624
$$ 507907 507950 509001 510347 510982 510970 511178 512131 513745 515829 518174 520346 521970 523179 524428 525933 527557
61411E27557J516J195P41M13L68L22p0o64j110j470j882j928j152NO18N03K10
$$ 527557 529073 530268 531009 531422 531790 532112 532042 531378 530268 528798 526916 524988 523836 523841 524459 524962 525172
61394E25172k7m13p64o04p5K41M22J039J861J950J253Q89J434K150K372K550L216
$$ 525172 525145 524732 523968 523364 523289 523530 523952 524991 526852 528802 530055 530944 532378 534528 536900 539450 542666
61377E42666L938M182M320M906N602N688N132M392L537K420J403J169J805K623
$$ 542666 546604 550786 555106 560012 565614 571302 576434 580826 584363 586783 588186 589355 591160 593783
61363E93783K863K362J583J206J517K093K363K365K589L121L560L794M149M672
$$ 593783 596646 599008 600591 601797 603314 605407 607770 610135 612724 615845 619405 623199 627348 632020
61349F32020M995N116N483N986N720M199K162O43j07l59k25J36K15l15j185k010
$$ 632020 637015 642131 647614 653600 659320 663519 665681 666324 666217 665858 665633 665769 665984 665669 664484 662474
61333F62474k704l085k737j818j244j463j744j367q01p62p99RJ422K352K630L191
$$ 662474 659770 656685 653948 652130 650886 649423 647679 646312 645511 644749 643950 643959 645381 647733 650363 653554
61317F53554M450N715O500P303Q595R978J0991J2021J3590J5318J6416J6915J7597
$$ 653554 658004 663719 670219 677522 686117 696095 707086 719107 732697 748015 764431 781346 798943
61304G98943J8730J9656J9664J8665J6687J3389Q673L479p25l406n407p760j0378
$$ 798943 817673 837329 856993 875658 892345 905734 914407 917886 917161 913755 908348 900588 890210
61291H90210j2325j3085j3142j3268j3606j3640j2904j1516j0032q920q176p456
$$ 890210 877885 864800 851658 838390 824784 811144 798240 786724 776692 767772 759596 752140
61279G52140o500n346m183l092j972o24J028K720L925M346M282M236M296M197
$$ 752140 745640 740294 736111 733019 731047 730423 731451 734171 738096 742442 746724 750960 755256 759453
61265G59453L923L774L872M094M613N827P566R015R695R898R739Q571N990K834
$$ 759453 763376 767150 771022 775116 779729 785556 793122 802137 811832 821730 831469 840040 846030 848864
61251H48864L15j383k917m471n543n855n743n544n263m844m288l533k578j644
$$ 848864 849179 847796 844879 840408 834865 829010 823267 817723 812460 807616 803328 799795 797217 795573
61237G95573q46L3J068J867K198K453L005L573L924M599O101P830Q834R250R925
$$ 795573 794727 794760 795828 797695 799893 802346 805351 808924 812848 817447 823548 831378 840212 849462 859387
61222H59387J0901J1453J1442J1399J1287J0429Q909P791P675P989Q035P756P157
$$ 859387 870288 881741 893183 904582 915869 926298 935207 942998 950673 958662 966697 974453 981610
61209I81610O001M477L332K922K888L044L722M906O013O936Q396J0732J3209J5058
$$ 981610 987611 992088 995420 998342 1001230 1004274 1007996 1012902 1018915 1025851 1034247 1044979 1058188 1073246
61195A073246J6450J7834J9029J9622J9562J8696J6341J2185P191K927J36j545
$$ 1073246 1089696 1107530 1126559 1146181 1165743 1184439 1200780 1212965 1220156 1223083 1223219 1221674
61183A221674k833m246o044q138j0148j1779j3081j4221j5304j6489j7877j9160
$$ 1221674 1218841 1214595 1208551 1200413 1190265 1178486 1165405 1151184 1135880 1119391 1101514 1082354
61171A082354j9762j9509j8824j8198j7823j7783j8088j8462j8491j8033j7108
$$ 1082354 1062592 1043083 1024259 1006061 988238 970455 952367 933905 915414 897381 880273
61160H80273j5590j3517j1531j0244r267p629n103k363O2K102L565M347N129O652
$$ 880273 864683 851166 839635 829391 820124 812495 807392 805029 805091 807193 810758 815105 820234 826886
61146H26886Q165P915N509K475J35j748l635m953n109m588m003k991j052J301
$$ 826886 835051 842966 848475 850950 851085 849337 845702 840749 835640 831052 827049 824058 823006 824307
61132H24307L268N006P134R588J1900J4098J6432J8564K0015K1049K2343K4029
$$ 824307 827575 832581 839715 849303 861203 875301 891733 910297 930312 951361 973704 997733
61120I97733K5786K7581K9543L1361L2535L3117L3509L3632L2869L0915K8285
$$ 997733 1023519 1051100 1080643 1112004 1144539 1177656 1211165 1244797 1277666 1308581 1336866
61109A336866K5938K4481K3618K2361K0000J6828J3586J0405O890L142k76l455
$$ 1336866 1362804 1387285 1410903 1433264 1453264 1470092 1483678 1494083 1500973 1504115 1503839 1500384
61097A500384p233j1849j6387j9935k2439k4057k4601k4169k3407k2606k1309
$$ 1500384 1493151 1481302 1464915 1444980 1422541 1398484 1373883 1349714 1326307 1303701 1282392
61086A282392j9326j7221j5315j3076j0189p276m869k591r1K083L458M665O535
$$ 1282392 1263066 1245845 1230530 1217454 1207265 1199989 1195120 1192529 1192438 1194521 1197979 1202644 1209179
61073A209179Q816J0765J2341J3910J5284J6001J6158J6163J6103J6051J6469
$$ 1209179 1217995 1228760 1241101 1255011 1270295 1286296 1302454 1318617 1334720 1350771 1367240
61062A367240J7532J8591J9046J9252J9775K0332K0249J9551J8772J8099J7432
$$ 1367240 1384772 1403363 1422409 1441661 1461436 1481768 1502017 1521568 1540340 1558439 1575871
61051A575871J6860J6476J6112J5735J5563J5371J4509J3079J2201J2330J2324
$$ 1575871 1592731 1609207 1625319 1641054 1656617 1671988 1686497 1699576 1711777 1724107 1736431
61040A736431J1076R105P535O384N131M160M204M808M729L672K514J935J818J877
$$ 1736431 1747507 1756612 1764147 1770531 1775662 1779822 1784026 1788834 1793563 1797235 1799749 1801684 1803502 1805379
61026A805379K061K390L011M235O116Q393J1215J5170K0116K4768K8134L0643
$$ 1805379 1807440 1809830 1812841 1817076 1823192 1831585 1842800 1857970 1878086 1902854 1930988 1961631
61014A961631L3294L6510M0455M5527N1899N9462O8762Q0744R5002J09782J24537
$$ 1961631 1994925 2031435 2071890 2117417 2169316 2228778 2297540 2378284 2473286 2583068 2707605
61003B707605J40958J60752J84322K12720K48535K93219L45718M05547M74962
$$ 2707605 2848563 3009315 3193637 3406357 3654892 3948111 4293829 4699376 5174338
60994E174338N56320O50561P61192Q96606J064941J270046J514451J794178K072869
$$ 5174338 5730658 6381219 7142411 8039017 9103958 10374004 11888455 13682633 15755502
60985A5755502K262196K253411J993995J537924J013348N41143J88277j5449n3020
$$ 15755502 18017698 20271109 22265104 23803028 24816376 25357519 25545796 25530347 25477327
60976B5477327N8170K27350L07163J79146j67817o42233j124934j534464j834340
$$ 25477327 25535497 25762847 26070010 26249156 26081339 25439106 24314172 22779708 20945368
60967B0945368k008552k052332j981798j833955j648314j451153j256736j074842
$$ 20945368 18936816 16884484 14902686 13068731 11420417 9969264 8712528 7637686
60959G637686r11713p68235o42877n35703m47183l75287l16744k69833k33486
$$ 7637686 6725973 5957738 5314861 4779158 4331975 3956688 3639944 3370111 3136625
60950C136625k04965j81061j60796j44701j31960j20319j08571r7353q7531p9155
$$ 3136625 2931660 2750599 2589803 2445102 2313142 2192823 2084252 1986899 1899368 1820213
60940A820213p2038o6209o1703n8507n6506n5065n3128n0321m7327m4703m2013
$$ 1820213 1748175 1681966 1620263 1561756 1505250 1450185 1397057 1346736 1299409 1254706 1212693
60929A212693l8592l4518l0289k6348k3244k1346j9978j7895j5147j3234j2861
$$ 1212693 1174101 1139583 1109294 1082946 1059702 1038356 1018378 1000483 985336 972102 959241
60918I59241j2818j1907j0580r674q776p151n304m247l995l911l843l863l639
$$ 959241 946423 934516 923936 914262 905486 898335 893031 888784 884789 880878 877035 873172 869533
60905H69533l142l164m115n132n448n735o852q180q685q808r658j0912j1268j0721
$$ 869533 866391 863227 859112 853980 848532 842797 835945 827765 819080 810272 800614 789702 778434 767713
60891G67713j0611j1394j1949j1318r817q112o459n181m794n102n080m167l071
$$ 767713 757102 745708 733759 722441 712624 704512 698053 692872 688078 682976 677896 673729 670658
60878F70658k842l622m641n120m921m528m422m415l759k219p04l00q69j119j44
$$ 670658 667816 664194 659553 654433 649512 644984 640562 636147 632388 630169 629465 629165 628296 627177 627033
60863F27033J589K878L070K598K366K747L312L632L896M418M837M625M101L990
$$ 627033 628622 631500 634570 637168 639534 642281 645593 649225 653121 657539 662376 667001 671102 675092
60849F75092M052L271J580J88k49m41q87p83L92J438P73j450l755n269o144o649
$$ 675092 679144 682415 683995 684183 683934 683493 682606 681823 682215 683653 684426 682976 679221 673952 667808 661159
60833F61159o974p523q305q443p356o033n954p042p815p429o404n437m612l939
$$ 661159 654185 646662 638357 629914 622558 616525 610571 603529 595714 588285 581881 576444 571832 567893
60819E67893l670l800l948l975m093m292m222l706k953k297k027k285k744k763
$$ 567893 564223 560423 556475 552500 548407 544115 539893 536187 533234 530937 528910 526625 523881 521118
60805E21118k299k117k588k849k059q58m89q74q33J5Q16J031J109J423J619J485
$$ 521118 518819 516702 514114 511265 509206 508348 507859 506985 506152 506167 506983 508014 509123 510546 512165 513650
60789E13650J504K006K512K405J714Q12j48j032j412r14K64J403J797J223J11
$$ 513650 515154 517160 519672 522077 523791 524603 524455 523423 522011 521097 521361 522764 524561 525784 525895
60774E25895p44r24p63p95r50p78k77K8j66n62p37m98J38R63J489J312O18Q2J04
$$ 525895 525151 524227 523464 522669 521719 520941 520664 520692 520526 519964 519227 518729 518867 519830 521319 522631 523249 523331 523435
60755E23435M82P74P01J86o54j566k299k743k747k112r84n8L4o14j412j999k436
$$ 523435 523917 524691 525392 525578 524924 523358 521059 518316 515569 513457 512473 512415 512449 511835 510423 508424 505988
60738E05988k852l246l562l656l352k713k091j712j468j297j293j204m27J022
$$ 505988 503136 499890 496328 492672 489320 486607 484516 482804 481336 480039 478746 477542 477115 478137
60724D78137K114K044J386J235J610J614R63M27O31J289J815K090K310K521K546
$$ 478137 480251 482295 483681 484916 486526 488140 489103 489530 490161 491450 493265 495355 497665 500186 502732
60709E02732K197J561J119J325J895J914J103L93N92J023M24j095k093j800r66
$$ 502732 504929 506490 507609 508934 510829 512743 513846 514239 514831 515854 516278 515183 513090 511290 510324
60694E10324n17m42m85r44k012k878k390m90J609K637K262R91l81j119p58N91
$$ 510324 509807 509365 508880 507936 505924 503046 500656 500166 501775 504412 506674 507665 507284 506165 505407 505998
60678E05998K161L037K948K442K236K494K899L150L053K299P54r99j990j920j521
$$ 505998 508159 511196 514144 516586 518822 521316 524215 527365 530418 532717 533471 532472 530482 528562 527041
60663E27041j607k252l067l704l818l062j621l14K67L40L60L45K07K82Q99J817
$$ 527041 525434 523182 520115 516411 512593 509531 507910 507596 507863 508203 508563 508908 509115 509397 510296 512113
60647E12113K559K982L049K478J233o5p62r46j057j190j324j727k467k935k646
$$ 512113 514672 517654 520703 523181 524414 524349 523587 522641 521584 520394 519070 517343 514876 511941 509295
60632E09295k101j987j963j260j74K02k68m90J97J118J372R96N75L54K43K19K31
$$ 509295 507194 505207 503244 501984 501810 502012 501744 501254 501451 502569 503941 504937 505512 505866 506109 506328 506559
60615E06559Q5k47m41j90M04R29R71L49o74j437j411p09J57R08J535J833J485
$$ 506559 506644 506397 505956 505766 506170 507099 508070 508419 507745 506308 504897 504188 504345 505253 506788 508621 510106
60598E10106O69J50M75J365K059K128J788J529J589J887K356L105M015M451L882
$$ 510106 510775 510925 511400 512765 514824 516952 518740 520269 521858 523745 526101 529206 533221 537672 541554
60583E41554K727K018K155K563K692K723L007L455L785L906L751L360L310M304
$$ 541554 544281 546299 548454 551017 553709 556432 559439 562894 566679 570585 574336 577696 581006 585310
60569E85310O050P389P961Q687J0079J1236J1420J1525J2691J4317J4866J4068
$$ 585310 591360 598749 606710 615397 625476 636712 648132 659657 672348 686665 701531 715599
60557G15599J2896J1627R527O388L092M00j810l828n523o583o776n962m413k914
$$ 715599 728495 740122 749649 756037 759129 759529 757719 753891 748368 741785 735009 729047 724634 721720
60543G21720j879p09J276L697N729P408R313J1420J3410J5736J9075K2890K5891
$$ 721720 719841 719132 720408 724105 729834 737242 746555 757975 771385 787121 806196 829086 854977
60530H54977K7800K9291L0273K9638K6915K2815J7853J1829N049j269o391j0752
$$ 854977 882777 912068 942341 971979 998894 1021709 1039562 1051391 1056440 1055171 1048780 1038028
60518A038028j4676j7515j8672j8573j7944j6936j5490j3840j2055r831p196m747
$$ 1038028 1023352 1005837 987165 968592 950648 933712 918222 904382 892327 882496 875300 870553
60506H70553k729n79K082M764O979R215J2335J6486K1103K5745L0430L5356M0560
$$ 870553 867824 867245 869327 874091 881070 890285 902620 919106 940209 965954 996384 1031740 1072300
60493A072300M5790N0672N5113N9274O2763O4273O2786N8851N3839M8266M1836
$$ 1072300 1118090 1168762 1223875 1283149 1345912 1410185 1472971 1531822 1585661 1633927 1675763
60482A675763L4830K8046K1265J3189L298p474j8316k9487m1094n2099o1301o8313
$$ 1675763 1710593 1738639 1759904 1773093 1776391 1768917 1750601 1721114 1680020 1627921 1566620 1498307
60470A498307p2916p4486p2954o9476o5290o0637n5472n0348m5713m1120l6151
$$ 1498307 1425391 1350905 1277951 1208475 1143185 1082548 1027076 976728 931015 889895 853744
60459H53744l1501k8058k5496k2830k0009j7816j6360j4828j2745j0546q704p080
$$ 853744 822243 794185 768689 745859 725850 708034 691674 676846 664101 653555 644851 637771
60447F37771n453m112l486l472l458k993k251j834k096k773l323l499l340k908
$$ 637771 632318 628206 624720 621248 617790 614797 612546 610712 608616 605843 602520 599021 595681 592773
60433E92773k344k069k360k784k613j754p88j22K86L83On55o39j41L95P48J293
$$ 592773 590429 588360 586000 583216 580603 578849 578061 577939 578225 578608 578614 578059 577420 577279 577674 578422 579715
60416E79715K095K529K251J862K009K442K456J832Q77n9p04p90k90N42J449K224
$$ 579715 581810 584339 586590 588452 590461 592903 595359 597191 598068 598009 597305 596515 596225 596767 598216 600440
60400F00440K511K099J502J591K453L220L214K680K163J883J942K527L457M118
$$ 600440 602951 605050 606552 608143 610596 613816 617030 619710 621873 623756 625698 628225 631682 635800
60386F35800M213M027L820L471L065L036L412L495K818J911J650K211K972L181
$$ 635800 640013 644040 647860 651331 654396 657432 660844 664339 667157 669068 670718 672929 675901 679082
60372F79082K584J707J464K089K669K336J580J464J845J716J203J642L300M576
$$ 679082 681666 683373 684837 686926 689595 691931 693511 694975 696820 698536 699739 701381 704681 709257
60358G09257M268L269L079L685M043L857L752M209N201O514P806Q700R245R719
$$ 709257 713525 716794 719873 723558 727601 731458 735210 739419 744620 751134 758940 767640 776885 786604
60344G86604R761Q542O256M305L405K448J82k955n616p284q250q558q150p578
$$ 786604 796365 804907 811163 815468 818873 821321 821503 818548 812932 805648 797398 788840 780690 773112
60330G73112p486p686p569p093o574n964n098m281l847l527k900k110j479q57
$$ 773112 765626 757940 750371 743278 736704 730740 725642 721361 717514 713987 711087 708977 707498 706641
60316G06641mR40J892L154M744O071P036Q570J1220J3983J5580J6195J6855J7798
$$ 706641 706637 707577 709469 712623 717367 723438 730474 739044 750264 764247 779827 796022 812877 830675
60302H30675J8626J9495K0703K1478K0520J7696J4044J0158N720N97m689r656
$$ 830675 849301 868796 889499 910977 931497 949193 963237 973395 979115 979712 975023 965367
60290I65367j4102j7634j9822k0816k1051k0434j8721j6572j5196j4819j4415
$$ 965367 951265 933631 913809 892993 871942 851508 832787 816215 801019 786200 771785
60279G71785j3164j1449j0109r371q821q034p026o194n873n809n435m757m372
$$ 771785 758621 747172 737063 727692 718871 710837 703811 697617 691744 685935 680500 675743 671371
60266F71371m355l886k592j430j340j731j421m72Q8L1Q1M77O49M42M92J157J902
$$ 671371 667016 663130 660538 659108 657768 656037 654616 654144 654232 654263 654344 654821 655470 655912 656404 657561 659463
60249F59463K076J517L58j036j902j654p51k70n48r19q03l22K43Q64J474J894
$$ 659463 661539 663056 663414 662378 660476 658822 658071 657801 657253 656334 655531 655209 655452 656316 657790 659684
60233F59684K206K601K902K871K901L652M961N931O243O583P548Q769R499R514
$$ 659684 661890 664491 667393 670264 673165 676817 681778 687709 693952 700535 708083 716852 726351 735865
60219G35865R103Q580Q154P992Q212Q931J0209J1762J2889J3116J2809J2658J2737
$$ 735865 744968 753548 761702 769694 777906 786837 797046 808808 821697 834813 847622 860280 873017
60206H73017J2485J1564J0234Q932P859O935N886M556L268K572K341J623j07k150
$$ 873017 885502 897066 907300 916232 924091 931026 936912 941468 944736 947308 949649 951272 951165 949015
60192I49015l580m525n648o904p675p897q029q142p934p530p377p393p088o473
$$ 949015 945435 940910 935262 928358 920683 912786 904757 896615 888681 881151 873774 866381 859293 852820
60178H52820n997n604m787l639k932k911k815j967o98J19P2m97r25q00l39j76
$$ 852820 846823 841219 836432 832793 829861 826950 824135 822168 821470 821589 821661 821164 820239 819439 819100 818924
60162H18924n98j205j502j430r65J56J709K632K230J339J394K610L975M770N164
$$ 818924 818326 817121 815619 814189 813224 813380 815089 817721 819951 821290 822684 825294 829269 834039 839203
60147H39203N470N778O256P020P787Q374R335J1297J3917J6348J8422K0403K1914
$$ 839203 844673 850451 856707 863727 871514 879888 889223 900520 914437 930785 949207 969610 991524
60134I91524K2332K2051K2049K2210K1294J8724J5229J1432P124K253k371n949
$$ 991524 1013856 1035907 1057956 1080166 1101460 1120184 1135413 1146845 1153969 1156222 1153851 1147902
60122A147902q410r880j0271r737q767p546n959m441l844m138m214l451k673k974
$$ 1147902 1139492 1129612 1119341 1109604 1100837 1093291 1087332 1082891 1079047 1074909 1070695 1067244 1064571 1061597
60108A061597m343o026p567q917r930j0389j0267r672q754p785o988o183m993
$$ 1061597 1057254 1051228 1043661 1034744 1024814 1014425 1004158 994486 985732 977947 970959 964776 959783
60095I59783l424j820l19J130K338L101L777M915O338P411Q159R252J0821J2263
$$ 959783 956359 954539 954220 955350 957688 960789 964566 969481 975819 983230 991389 1000641 1011462 1023725
60081A023725J3313J4350J5339J5329J3501R907M939j108p582j3350j7726k0932
$$ 1023725 1037038 1051388 1066727 1082056 1095557 1105464 1110403 1109295 1101713 1088363 1070637 1049705
60069A049705k3378k4970k5525k5143k3945k1996j9775j8024j6755j5123j2630
$$ 1049705 1026327 1001357 975832 950689 926744 904748 884973 866949 850194 835071 822441
60058H22441r885p786o502n675n062m509l761k670j336J26J633K927L758M380
$$ 822441 812556 804770 798268 792593 787531 783022 779261 776591 775255 775381 777014 779941 783699 788079
60044G88079N314O588P768Q779R894J0800J0497Q453N313K152m13k182l146l609
$$ 788079 793393 799981 807749 816528 826422 837222 847719 856172 861485 863637 863224 861042 857896 854287
60030H54287m057m597m959n160n678o799q360j0050j1541j2303j2061j1394j1124
$$ 854287 850230 845633 840674 835514 829836 823037 814677 804627 793086 780783 768722 757328 746204
60017G46204j1102j0438q998p719p219p042o584n861m989l739k139p78k5N08J346
$$ 746204 735102 724664 715666 707947 700728 693686 687102 681241 676252 672513 670374 669596 669571 670079 671425
60002F71425K425L350L796L550K677J850J925K965M173M908N183N257N390N959
$$ 671425 673850 677200 680996 684546 687223 689073 690998 693963 698136 703044 708227 713484 718874 724833
59988G24833P011P737P287O047N161M843M263L144K081J135m58k623l908l358
$$ 724833 731844 739581 746868 752915 758076 762919 767182 770326 772407 773542 773084 770461 766553 763195
59974G63195j825o48L7Q99K227L938O067Q497J0799J2902J5261J7927K0192K1618
$$ 763195 761370 760722 760759 761658 763885 767823 773890 782387 793186 806088 821349 839276 859468 881086
59960H81086K2525K2949K2072J9324J5235J0493N072j011o792j1165j4011j5811
$$ 881086 903611 926560 948632 967956 983191 993684 998756 997745 990953 979788 965777 949966
59948I49966j6674j6479j5532j4468j3720j3384j3180j2435j0760q941q232q596
$$ 949966 933292 916813 901281 886813 873093 859709 846529 834094 823334 814393 806161 797565
59936G97565q584p278n226l139r19J404L067L806M560O109P975R447J0569J1269
$$ 797565 788981 781703 776477 773338 772419 773823 776890 780696 785256 791365 799340 808787 819356 830625
59922H30625J0743Q917P392P589Q796R453R575J0405J2218J4047J5374J6704J8398
$$ 830625 841368 850285 857677 865266 874062 883515 893090 903495 915713 929760 945134 961838 980236
59909I80236K0038K1020K0977J9647J7047J3720J0294O950L697O40k446o036r723
$$ 980236 1000274 1021294 1042271 1061918 1078965 1092685 1102979 1109929 1113626 1114266 1111820 1105784 1096061
59896A096061j2046j2194j1205j0499j0005q733o502l894j104J930M656O481P868
$$ 1096061 1084015 1071821 1060616 1050117 1040112 1031379 1024877 1020983 1019879 1021809 1026465 1032946 1040814
59883A040814R690J1779J3276J4200J5316J6613J7167J6657J5877J5479J5187
$$ 1040814 1050504 1062283 1075559 1089759 1105075 1121688 1138855 1155512 1171389 1186868 1202055
59872A202055J4517J3420J1959J0018P600M857J764j763n398q694j1748j5028
$$ 1202055 1216572 1229992 1241951 1251969 1259569 1264426 1266190 1264427 1259029 1250335 1238587 1223559
59860A223559j8478k1415k3371k4507k5113k5201k4710k3768k2566k1147j9356
$$ 1223559 1205081 1183666 1160295 1135788 1110675 1085474 1060764 1036996 1014430 993283 973927
59849I73927j6912j3788j0518p856n982m408k777j225J66J645L307M945O615Q586
$$ 973927 957015 943227 932709 924853 918871 914463 911686 910461 910627 912272 915579 920524 927139 935725
59835I35725J0411J0961R904Q336P429P192P130P276P819Q411Q522P858N950K231
$$ 935725 946136 957097 967001 975337 982766 989958 997088 1004364 1012183 1020594 1029116 1036974 1042924 1045155
59821A045155k787p310j0165j2017j3935j5632j6173j5564j4489j3197j1782j0845
$$ 1045155 1042368 1035058 1024893 1012876 998941 983309 967136 951572 937083 923886 912104 901259
59809I01259j0659j0328q949p119o047n742n348m767m593m775m654m148l777l655
$$ 901259 890600 880272 871323 864204 858157 852415 847067 842300 837707 832932 828278 824130 820353 816698
59795H16698l508l352l218k672j685j328k345l565l242j551k31N5K86J089J829
$$ 816698 813190 809838 806620 803948 802263 800935 798590 795025 791783 790232 790001 790056 790342 791431 793260
59780G93260J911J660J495J485J904L103M633N566N916O656Q119R430R853R674
$$ 793260 795171 796831 798326 799811 801715 804818 809451 815017 820933 827589 835708 845138 854991 864665
59766H64665R562R878J0878J2684J4813J6508J7660J8805K0202K1746K3591K5999
$$ 864665 874227 884105 894983 907667 922480 938988 956648 975453 995655 1017401 1040992 1066991
59754A066991K8535L0394L1471L2268L2865L2905L2414L1578K9823K6416K1900
$$ 1066991 1095526 1125920 1157391 1189659 1222524 1255429 1287843 1319421 1349244 1375660 1397560
59743A397560J7639J3725Q800K296m411r693j3390j6185j8258j9399j9786j9810
$$ 1397560 1415199 1428924 1437724 1440020 1435609 1425916 1412526 1396341 1378083 1358684 1338898 1319088
59731A319088j9491j8550j6949j5110j3738j3345j3749j4164j4134j4039j4255
$$ 1319088 1299597 1281047 1264098 1248988 1235250 1221905 1208156 1193992 1179858 1165819 1151564
59720A151564j4396j4070j3740j3887j3799j2446j0196q463p735p278o655o185
$$ 1151564 1137168 1123098 1109358 1095471 1081672 1069226 1059030 1050567 1042832 1035554 1028899 1022714
59708A022714n799m796l113j609p56n4R10J823K375K730K971K994L068L601M191
$$ 1022714 1016915 1012119 1009006 1007397 1006641 1006587 1007497 1009320 1011695 1014425 1017396 1020390 1023458 1027059 1031250
59693A031250L905K697J504P14l04j840l157l605l481l303l108k932l102l655
$$ 1031250 1035155 1037852 1039356 1040070 1039766 1037926 1034769 1031164 1027683 1024380 1021272 1018340 1015238 1011583
59679A011583m209m699n502o567p302p551p788q106p975p265o565o116n464m467
$$ 1011583 1007374 1002675 997173 990606 983304 975753 967965 959859 951884 944619 938054 931938 926474 922007
59665I22007l650l076j993j33J621K542L106M002M987N454N491N539N524N070
$$ 922007 918357 915281 913288 913155 914776 917318 920424 924426 929413 934867 940358 945897 951421 956491
59651I56491M171L109K025R51j37j578l782o448q570r622j0177j0977j1988j2644
$$ 956491 960662 963771 965796 966747 966610 965032 961250 954802 946232 936610 926433 915456 903468 890824
59637H90824j2545j1554r789p824o389n582m864m069l769m387n545o663p626q474
$$ 890824 878279 866725 856936 849112 842723 837141 832277 828208 824439 820052 814507 807844 800218 791744
59623G91744q975q886q297p443o483n626n044m580l952l254k785k394j609m18
$$ 791744 782769 773883 765586 758143 751660 746034 740990 736410 732458 729204 726419 724025 722416 721998
59609G21998O76J487K289L119L551L337K734K028J351R42J015J261J103M47k94
$$ 721998 722674 724161 726450 729569 733120 736457 739191 741219 742570 743512 744527 745788 746891 747338 747044
59594G47044q27j103j020o24l63m88m74J39P53M78m49j080j305j752k398k563
$$ 747044 746217 745114 744094 743470 743107 742619 742145 742284 743037 743515 743066 741986 740681 738929 736531 733968
59578G33968k248k166k435k470k229k294k640k615k207k046k060j545o94n79j396
$$ 733968 731720 729554 727119 724649 722420 720126 717486 714871 712664 710618 708558 707013 706319 705740 704344
59563G04344k103k142k028j944j324k45K82J8NP82J530J686J863K461K738K228
$$ 704344 702241 700099 698071 696127 694803 694558 694840 694858 694863 695645 697175 698861 700724 703185 705923 708151
59547G08151J732K028K734L306M035N218O434P506R048J1350J3823J6152J8611
$$ 708151 709883 711911 714645 717951 721986 727204 733638 741144 750192 761542 775365 791517 810128
59534H10128K0414J9472J4954Q892L932O51j667k972k758j625p98n39k82N3M6
$$ 810128 830542 850014 864968 873860 877792 878443 876776 873804 871046 869421 868623 868084 867802 867855 867901
59519H67901l74j030k073l601n190o564q136j0022j1279j1056r935r110q785q303
$$ 867901 867527 866497 864424 860823 855633 849069 840933 830911 819632 808576 798641 789531 780746 772443
59505G72443p381o314n276m282l452k721j713m34M27N06L72O37J091J362J629
$$ 772443 765062 758748 753472 749190 745738 743017 741304 740870 741297 741803 742175 742812 743903 745265 746894
59490G46894K104K522K784L349M287M765M260L442L149L222L170L145L425L715
$$ 746894 748998 751520 754304 757653 761940 766705 770965 774407 777556 780778 783948 787093 790518 794233
59476G94233L782M050M754N249M997M405L896L046J576L52K44P49Q54O89J117
$$ 794233 798015 802065 806819 812068 817065 821470 825366 828412 829988 830340 830584 831333 832187 832876 833993
59461H33993K191L128L602M100N119O647Q272R412R732R570R412Q927P435N396
$$ 833993 836184 839312 842914 847014 852133 858780 867052 876464 886196 895766 905178 914105 921540 926936
59447I26936M101L593K400k9k243l122l734n520p941r315r055p748n971m261l359
$$ 926936 931037 934630 937030 937001 934758 931636 927902 922382 914441 905126 896071 888323 882352 878091 874732
59432H74732l229k674r95R39K313L783O025Q119R067R800J1927J5278J8427K0827
$$ 874732 871503 868829 867834 868773 871086 874869 880894 889013 898080 907880 919807 935085 953512 974339
59418I74339K2762K3933K3894K3347K3335K3791K4311K5403K7034K6839K2238
$$ 974339 997101 1021034 1044928 1068275 1091610 1115401 1139712 1165115 1192149 1218988 1241226
59407A241226J4032N731n12n112q334r009o522k003L292Q960J3953J5809J2743
$$ 1241226 1255258 1260989 1260477 1255365 1247031 1238022 1231500 1229497 1232789 1241749 1255702 1271511 1284254
59394A284254N662k778j0458j6556k0902k3486k4429k4035k2833k1494k0272j8712
$$ 1284254 1289916 1287138 1276680 1260124 1239222 1215736 1191307 1167272 1144439 1122945 1102673 1083961
59382A083961j6298j3280j0438q306o967o215n508m302k846k025j945j603n18
$$ 1083961 1067663 1054383 1043945 1035639 1028672 1022457 1016949 1012647 1009801 1007776 1005831 1004228 1003710
59369A003710M11N44P98K144L870M827N424O767Q522R400R394R805J1236J3037
$$ 1003710 1004121 1004665 1005463 1007607 1011477 1016304 1021728 1028495 1037017 1046417 1055811 1065616 1076852 1089889
59355A089889J4665J6234J7781J9217K0838K2802K4364K4738K4343K4065K3825
$$ 1089889 1104554 1120788 1138569 1157786 1178624 1201426 1225790 1250528 1274871 1298936 1322761
59344A322761K3055K1961K0854J8860J4923R672M624q6n439j1254j6073j9341
$$ 1322761 1345816 1367777 1388631 1407491 1422414 1432086 1436710 1436624 1431185 1419931 1403858 1384517
59332A384517k1911k4251k5829k6477k6790k6788k5697k3420k0998j9262j8046
$$ 1384517 1362606 1338355 1312526 1286049 1259259 1232471 1206774 1183354 1162356 1143094 1125048
59321A125048j6928j5684j3953j1562r140p400o011m315k805k509l147l413k976
$$ 1125048 1108120 1092436 1078483 1066921 1057781 1050381 1044370 1040055 1037250 1034741 1031594 1028181 1025205
59308A025205k618k454j731n00J18l93j375k321l333m098l963l334l492m596n165
$$ 1025205 1022587 1020133 1018402 1017902 1018020 1017627 1016252 1013931 1010598 1006500 1002537 999203 995711 991115 985950
59293I85950m030j629J053L702O487R609J3181J6653J8392J7011J3140Q769M962
$$ 985950 981920 980291 981344 985046 991533 1001142 1014323 1030976 1049368 1066379 1079519 1088288 1093250
59280A093250J633p42r15J259M346P164R779J2330J4293J5405J6108J6641J6648
$$ 1093250 1094883 1094141 1093226 1094485 1098831 1105995 1115774 1128104 1142397 1157802 1173910 1190551 1207199
59267A207199J5970J4754J2762R693O242L594J791j38k402m214n310o254p049
$$ 1207199 1223169 1237923 1250685 1260378 1266620 1270214 1272005 1271867 1269465 1265251 1259941 1253687 1246638
59254A246638o987o099n233m542l365j918j332j689j629n67L30J5j033j970k762
$$ 1246638 1239651 1233552 1228319 1223777 1220412 1218494 1217162 1215473 1213844 1213277 1213607 1213622 1212589 1210619 1207857
59239A207857l506l806l653l805m688n884p126q701j0495j1785j2396j2926j3556
$$ 1207857 1204351 1200545 1196892 1193087 1188399 1182515 1175389 1166688 1156193 1144408 1132012 1119086 1105530
59226A105530j3886j4152j5179j6689j7116j5740j3614j1921j0707r780r461r659
$$ 1105530 1091644 1077492 1062313 1045624 1028508 1012768 999154 987233 976526 966746 957285 947626
59214I47626r471q484p343o519n571m186k818j775p88Q0L71M21J314L132M613
$$ 947626 938155 929671 922328 915809 910238 906052 903234 901459 900671 900751 901122 901543 902857 905989 910602
59199I10602N042N093N335N360N092N411O613P579P456O907O879P260P605P999
$$ 910602 915644 920737 926072 931432 936524 941935 948548 956127 963583 970490 977369 984629 992234 1000233
59185A000233Q366Q003O719N466M949M587L621K332J315M30p72k185l379m074
$$ 1000233 1008599 1016602 1023321 1028787 1033736 1038323 1041944 1044276 1045591 1046021 1045249 1043064 1039685 1035611
59171A035611m007l081j897j307j314j304j351k056l095l453l318m101o147q067
$$ 1035611 1031604 1028523 1026626 1025319 1024005 1022701 1021350 1019294 1016199 1012746 1009428 1005327 999180 991113
59157I91113q935r495j0547j1620j2190j2641j3163j2960j1592r962r007q429
$$ 991113 982178 972683 962136 950516 938326 925685 912522 899562 887970 878008 869001 860572
59145H60572p546o334n063l805k878k783l169l023k153j261l94J200L359M849
$$ 860572 853026 846692 841629 837824 834946 832163 828994 825971 823818 822557 822163 823363 826722 831571
59131H31571N412O218P735Q874Q937Q615Q333P477O128N658O545P398P317P336
$$ 831571 836983 843201 850936 859810 868747 877362 885695 893172 899300 904958 911503 918901 926218 933554
59117I33554Q291R127Q805Q228Q571R134Q543O986N609M708L830K904K013Q99
$$ 933554 941845 950972 959777 968005 976576 985710 994253 1001239 1006848 1011556 1015386 1018290 1020303 1021202
59103A021202l60j129j409k148l640m899n363n709o262o208n318m682m722m270
$$ 1021202 1020842 1019713 1018304 1016156 1012516 1007617 1002254 996545 990283 984075 978757 974075 969353 965083
59089I65083k764j461j264j263q86j421l656n971o716o766p645q738q606p711
$$ 965083 962319 960858 959594 958331 957445 956024 952368 946397 939681 932915 925270 916532 907926 900215
59075I00215p500p868p719p116o834o597n697m630m249m144l534k955l228l631
$$ 900215 892715 884847 877128 870012 863178 856581 850884 846254 842005 837861 834327 831372 828144 824513
59061H24513k939j520o87o40p11q89j505k097k138k039k061j280P59K535K487
$$ 824513 821574 820054 819367 818727 818016 817127 815622 813525 811387 809348 807287 806007 806766 809301 811788
59046H11788J424J156J738K056K151K906M132N006N795P320R247J0770J2236J4412
$$ 811788 813212 814368 816106 818162 820313 823219 827351 832357 838152 845472 854719 865489 877725 892137
59032H92137J6858J8866K1144K4630K8469L1247L3385L6082L8524L8518L5479
$$ 892137 908995 927861 949005 973635 1002104 1033351 1066736 1102818 1141342 1179860 1215339
59021A215339L0590K4375J6395P189j677r487j6461k2144k5632k7269k8251k8596
$$ 1215339 1245929 1270304 1286699 1293888 1292211 1282724 1266263 1244119 1218487 1191218 1162967 1134371
59009A134371k7329k4537k1485j8784j6059j3257j0631p774m326j248K85Q76J911
$$ 1134371 1107042 1082505 1061020 1042236 1026177 1012920 1002289 994515 990189 988941 989226 990102 992013
58996I92013L115L068J877J083J138J024M48K51N53M32k47n54k37K3K27J264L150
$$ 992013 995128 998196 1000073 1001156 1002294 1003318 1003766 1004017 1004570 1005002 1004755 1004201 1003964 1003987 1004214 1005478 1008628
58979A008628M781N642O324P136P799Q553J0075J2087J3490J4044J4475J4967
$$ 1008628 1013409 1019051 1025375 1032511 1040310 1048863 1058938 1071025 1084515 1098559 1113034 1128001
58967A128001J5014J4760J4944J5422J5192J3928J2050R433N611J231k357n048
$$ 1128001 1143015 1157775 1172719 1188141 1203333 1217261 1229311 1238744 1244355 1245586 1243229 1238181
58955A238181p936j1235j3873j5374j6495j7693j8426j8409j8181j8029j7411
$$ 1238181 1230245 1219010 1205137 1189763 1173268 1155575 1137149 1118740 1100559 1082530 1065119
58944A065119j5837j3386j0280o809l556q14J935N038P663Q915R422J0410J1713
$$ 1065119 1049282 1035896 1025616 1018807 1015251 1014437 1016372 1021410 1029073 1037988 1047410 1057820 1069533
58931A069533J2071J1035R096O365K680j287m612p492j0555j3244j4407j4125
$$ 1069533 1081604 1092639 1101735 1108100 1110780 1109493 1104881 1097389 1086834 1073590 1059183 1045058
58919A045058j3390j2424j0915r448q804q304o603l934j746m82N60J568K316L504
$$ 1045058 1031668 1019244 1008329 998881 990077 981773 975170 971236 969490 969008 969568 971136 973452 976956
58905I76956N939Q678J0091J0528J1794J4184J6263J7470J8682K0032K0523K0073
$$ 976956 982895 991573 1001664 1012192 1023986 1038170 1054433 1071903 1090585 1110617 1131140 1151213
58893A151213J9875K0335K0694K0987K2265K4466K5959K5737K4340K2301J9427
$$ 1151213 1171088 1191423 1212117 1233104 1255369 1279835 1305794 1331531 1355871 1378172 1397599
58882A397599J5918J2554R375N784K008j107l744o752r785j1714j2755j4072j5251
$$ 1397599 1413517 1426071 1435446 1441230 1443238 1442131 1438387 1431635 1421850 1410136 1397381 1383309 1368058
58869A368058j4538j1863r330q232p691o773n843n208m351l258k719k701k098
$$ 1368058 1353520 1341657 1332327 1324095 1316404 1309631 1303788 1298580 1294229 1290971 1288252 1285551 1283453
58856A283453n20J287L091N381P617Q143O292K847j812q065j5221k1338k5472
$$ 1283453 1282933 1284220 1287311 1292692 1300309 1308452 1314744 1317591 1315779 1307714 1292493 1271155 1245683
58843A245683k8410l0719l1925l1897l1243k9960k7526k4520k2245k0508j7867
$$ 1245683 1217273 1186554 1154629 1122732 1091489 1061529 1034003 1009483 987238 966730 948863
58832I48863j4275j1316r517p744n635m258l752k671n53J167J670K053L229M447
$$ 948863 934588 923272 913755 906011 900376 896118 892366 889695 889142 890309 891979 894032 897261 901708
58818I01708M885M880M756M170L333L029K966J962K23o67n46j108k860m082l780
$$ 901708 906593 911473 916229 920399 923732 926761 929727 931689 931912 931245 930699 929591 926731 922649 918869
58803I18869l359m172n454n978n925n973o129o398p036p435o511m742l922m317
$$ 918869 915510 911338 905884 899906 893981 888008 881879 875481 868445 861010 854499 849757 845835 841518
58789H41518m189k721j096P2J931M885P270P838P562P705P986P867P774P898P500
$$ 841518 837329 834608 833512 833584 835515 840400 847670 855508 863070 870775 878761 886628 894402 902300 909800
58774I09800O386N287M064J547j996m476m974m926n292m948l054o78J315L671
$$ 909800 916186 921473 925537 927084 925088 920612 915638 910712 905420 900472 897418 896740 898055 901726
58760I01726O691Q884R209Q608P833N903K229j759m727p216r693j0873r808p827
$$ 901726 908417 917301 926510 935118 942951 948854 951083 949324 944597 937381 927688 916815 907007 899180
58746H99180o577n691m121k242q99K79J903L411M009L950L721L208K645K965M239
$$ 899180 892603 886912 882791 880549 879650 879929 881832 885243 889252 893202 896923 900131 902776 905741 909980
58731I09980N196N155M946N150N225N036N392O168N988M675L928M624N592N971
$$ 909980 915176 920331 925277 930427 935652 940688 946080 952248 958236 962911 966839 971463 977055 983026
58717I83026O476P314P240N885M656M112K831J54k497m305o455r389j1497j2148
$$ 983026 989502 996816 1004056 1009941 1014597 1018709 1021540 1021694 1019197 1014892 1008437 999048 987551 975403
58703I75403j3284j6094j8803j9756k0091k1125k1697k0438j8424j7172j6102
$$ 975403 962119 946025 927222 907466 887375 866250 844553 824115 805691 788519 772417
58692G72417j4220j2252j0918r256o812n309n859o730o221n539o259p187o446
$$ 772417 758197 745945 735027 725771 718959 713650 707791 701061 694840 689301 683042 675855 669409
58679F69409m714l699l172k244j686k239k300j60K884M465M817N856P839R626
$$ 669409 664695 660996 657824 655580 653894 651655 649355 649195 652079 656544 661361 667217 675056 684682
58665F84682J1147J3010J4560J4588J3219J1169Q120L731r19m625p578j0131j1597
$$ 684682 695829 708839 723399 737987 751206 762375 770495 774226 773307 768682 761104 750973 739376
58652G39376j1803j2029j2649j1945r080o185n368n646n091l915l177k393q69
$$ 739376 727573 715544 702895 690950 681870 675685 670317 664671 659580 655665 652488 650095 649226
58639F49226M90R90J767L408M120K668Q69N87N95p60k181j839r28j452k355j377
$$ 649226 649716 650706 652473 655881 660001 662669 663538 664125 664720 663960 661779 659940 659012 657560 655205 653828
58623F53828P97J728J248J107J740K408L391N171O593O564O248P031P864P262
$$ 653828 654625 656353 657601 658708 660448 662856 666247 671418 678011 684575 690823 697854 705718 712980
58609G12980O212O201O207M693K853K626L130K335P79L25O02M3q61o41J02n4l28
$$ 712980 719192 725393 731600 736293 739146 741772 744902 747237 748016 748341 748943 748986 748125 747484 747586 747532 747204
58592G47204Q94K973M340N575Q034J0768J2009J2297J3061J3711J3231J2894J3982
$$ 747204 748098 751071 755411 760986 769020 779788 791797 804094 817155 830866 844097 856991 870973
58579H70973J4651J2728R899R231J0190J0105R113R464J1147J2461J3892J7264
$$ 870973 885624 898352 908251 917482 927672 937777 946890 956354 967501 979962 993854 1011118
58567A011118K1862K5395K8039L1630L5662L7935L8403L8502L7473L3231K6218
$$ 1011118 1032980 1058375 1086414 1118044 1153706 1191641 1230044 1268546 1306019 1339250 1365468
58556A365468J8708J1163K977m333q550j0535j2532j3910j2584r612q000p928
$$ 1365468 1384176 1395339 1398316 1393983 1385433 1374898 1362366 1348456 1335872 1326260 1318260 1310332
58544A310332p466p121r172j3219j6943k0522k5695l1011l3031l1901l1046l1325
$$ 1310332 1302866 1295745 1286573 1273354 1256411 1235889 1210194 1179183 1146152 1114251 1083205 1051880
58532A051880l0252k7018k3686k1120j8125j4904j3124j2373j0566p958o692o528
$$ 1051880 1021628 994610 970924 949804 931679 916775 903651 891278 880712 872754 866062 859534
58520H59534n266l159k604l490l289j779j251k015k102j453j965l306l134j565
$$ 859534 854268 851109 848505 845015 841726 839947 838696 836681 834579 833126 831161 827855 824721 823156
58506H23156r87j411n63J331J573n3r19m02m45j125l79J619K469K199L202N363
$$ 823156 822169 820758 820195 821526 823099 823046 822127 821725 821280 820155 819776 821395 823864 826063 829265 834628
58490H34628O116N606O772R890J2076J2704J4181J6842J8297J8552K0487K4280
$$ 834628 840744 846350 853122 863012 875088 887792 901973 918815 937112 955664 976151 1000431
58478A000431K6524K5855K4384K2628J8334J1474N157L36n271j1747j5760j6226
$$ 1000431 1026955 1052810 1077194 1099822 1118156 1129630 1134787 1135123 1129852 1118105 1102345 1086119
58466A086119j6020j6480j5295j1474p380m190k21M705Q175J0026J3225J8228
$$ 1086119 1070099 1053619 1038324 1026850 1019470 1015280 1015059 1019764 1027939 1037965 1051190 1069418
58454A069418K1474K1258K0067J9276J6596J0832M247j808q778j6384k1140k1624
$$ 1069418 1090892 1112150 1132217 1151493 1168089 1178921 1183168 1181360 1172582 1156198 1135058 1113434
58442A113434k0760k0777k0309j8343j6429j5026j2168p610l973k096K46L568
$$ 1113434 1092674 1071897 1051588 1033245 1016816 1001790 989622 982012 978039 975943 976189 979757
58430I79757N412N283O000Q526J0470J1028J2245J3893J2620P940L592J197j870
$$ 979757 985169 990452 996452 1004978 1015448 1026476 1038721 1052614 1065234 1073174 1076766 1077963 1076093
58417A076093o452r402r530r893j1824j2494j0875j0179j1688j1997r348o951
$$ 1076093 1069641 1060239 1050709 1040816 1028992 1016498 1005623 995444 983756 971759 962411 955460
58405I55460p006p006n090l569l896l572j177P10O61J167L393M542L367K905M687
$$ 955460 948454 941448 936358 932789 928893 925321 924144 924854 925515 926682 930075 934617 937984 940889 945576
58390I45576N762M362L056L311K686L85k91J794K857R85l40J226K933K938L979
$$ 945576 951338 955700 958756 962067 964753 965138 964847 966641 969498 970483 970143 971369 974302 977240 981219
58375I81219P399R699R076R119J1995J4133J3016J2090J4370J7054J7127J6694
$$ 981219 988618 998317 1007393 1016512 1028507 1042640 1055656 1067746 1082116 1099170 1116297 1132991
58363A132991J8191J9717J9450J9297K0091J8778J4341J0737R954Q272L497n18
$$ 1132991 1151182 1170899 1190349 1209646 1229737 1248515 1262856 1273593 1283547 1291819 1295316 1294798
58351A294798q85p38k737l937j940K37K14Q73M172O821O932Q277J3022J6934J6961
$$ 1294798 1293913 1293175 1290438 1286501 1284561 1284798 1285012 1285885 1290057 1296878 1303810 1312087 1325109 1342043 1359004
58336A359004J6788J9542K1904K0955J9989K1736K2635J9617J5883J4252J1673
$$ 1359004 1375792 1395334 1417238 1438193 1458182 1479918 1502553 1522170 1538053 1552305 1563978
58325A563978O102J821J892K350j74k186n78J258O45J266N358Q194O808O197J0056
$$ 1563978 1570080 1571901 1573793 1576143 1575969 1573783 1573205 1574463 1575108 1576374 1581732 1589926 1596734 1602931 1612987
58310A612987J3603J2729J1792J4787J7269J5077J2715J4786J7358J6215J5351
$$ 1612987 1626590 1639319 1651111 1665898 1683167 1698244 1710959 1725745 1743103 1759318 1774669
58299A774669J8625K1380J9275J7090J9679K2611K1105J9648K3019K6399K4479
$$ 1774669 1793294 1814674 1833949 1851039 1870718 1893329 1914434 1934082 1957101 1983500 2007979
58288B007979K1869K4156K7119K5341K3123K6052L0126L0138L0274L5223L9508
$$ 2007979 2029848 2054004 2081123 2106464 2129587 2155639 2185765 2215903 2246177 2281400 2320908
58277B320908L7226L3752L5970L9592L8233L6353M0686M7425N0339N2934O0015
$$ 2320908 2358134 2391886 2427856 2467448 2505681 2542034 2582720 2630145 2680484 2733418 2793433
58266B793433O6265O6100O5592P1399P7395P5929P2484P4914P8171P4481O8773
$$ 2793433 2859698 2925798 2991390 3062789 3140184 3216113 3288597 3363511 3441682 3516163 3584936
58255C584936O8767O9918O5720O2474O7845P5231P5969P6093Q4029R3238R4846
$$ 3584936 3653703 3723621 3789341 3851815 3919660 3994891 4070860 4146953 4230982 4324220 4419066
58244D419066R5776J05551J17122J20344J22300J33726J47601J52646J55634J68062
$$ 4419066 4514842 4620393 4737515 4857859 4980159 5113885 5261486 5414132 5569766 5737828
58234E737828J83240J89712J94687K10190K28919K38695K47453K68109K92651
$$ 5737828 5921068 6110780 6305467 6515657 6744576 6983271 7230724 7498833 7791484
58225G791484L08144L23796L53654L87882M11244M34188M73717N20151N56717
$$ 7791484 8099628 8423424 8777078 9164960 9576204 10010392 10484109 11004260 11560977
58216A1560977N94884O54145P24570P87904Q57376R55830J073753J192568J329228
$$ 11560977 12155861 12810006 13534576 14322480 15179856 16135686 17209439 18402007 19731235
58207A9731235J511318J730387J970795K261648K645827L123146L682162M356839
$$ 19731235 21242553 22972940 24943735 27205383 29851210 32974356 36656518 41013357
58199D1013357N184143O139554P192311Q391330R817738J1504319J3504599J5982459
$$ 41013357 46197500 52337054 59529365 67920695 77738433 89242752 102747351 118729810
58191A18729810J9105664K2909469K7366629L2341655L7021438L9413670L7079425
$$ 118729810 137835474 160744943 188111572 220453227 257474665 296888335 333967760
58184C33967760K8966516J6507444K675990r953077k0124265k7404593l1569941
$$ 333967760 362934276 379441720 382117710 372164633 352040368 324635775 293065834
58177B93065834l2707419l1461515k8763364k5352028k1652784j7935525j4401215
$$ 293065834 260358415 228896900 200133536 174781508 153128724 135193199 120791984
58170A20791984j1210657q584716o804270n976642n860035o040172o240252o372918
$$ 120791984 109581327 100996611 94192341 88215699 82355664 76315492 70075240 63702322
58162F3702322o378927o176900n762896n229865m663304m092621l543673l057063
$$ 63702322 57323395 51146495 45383599 40153734 35490430 31397809 27854136 24797073
58154B4797073k641297k270555j938795j665674j447877j255718j080768r40725
$$ 24797073 22155776 19885221 17946426 16280752 14832875 13577157 12496389 11555664
58146A1555664q35430p41613o52914n84664n37192m91986m45496m11391l88531
$$ 11555664 10720234 9978621 9325707 8741043 8203851 7711865 7266369 6854978 6466447
58137F466447l60233l25752l00341k84006k61098k30996k09045j96747j80198
$$ 6466447 6106214 5780462 5480121 5196115 4935017 4704021 4494976 4298229 4118031
58128D118031j58701j46521j45065j40406j29919j25388j27900j24867j14129
$$ 4118031 3959330 3812809 3667744 3527338 3397419 3272031 3144131 3019264 2905135
58119B905135j07178j06191j00707q9341q2698q2268p7593o6876o0142n9591n6313
$$ 2905135 2797957 2691766 2591059 2501718 2419020 2336752 2259159 2192283 2132141 2072550 2016237
58108B016237m8772m5645m8019m7036m1336l9222m1598m0143l4190l2408l5849
$$ 2016237 1967465 1921820 1873801 1826765 1785429 1746207 1704609 1664466 1630276 1597868 1562019
58097A562019l6110l2101l2063l6919l7838l2728k9427l0201k8371k2712k0173
$$ 1562019 1525909 1493808 1461745 1424826 1386988 1354260 1324833 1294632 1266261 1243549 1223376
58086A223376k1780k0407j5054j3203j6519j8009j5759j5902j9602k0543j7708
$$ 1223376 1201596 1181189 1166135 1152932 1136413 1118404 1102645 1086743 1067141 1046598 1028890
58075A028890j7465k0598k0308j5562j3467j5825j6094j2322j0627j2819j3008
$$ 1028890 1011425 990827 970519 954957 941490 925665 909571 897249 886622 873803 860795
58064H60795r467p915r886r579n471l591n978p025m573l764o547q044o511o590
$$ 860795 851328 843413 833527 823948 818477 814886 808908 801883 797310 793546 786999 778955 772444 765854
58050G65854r432r869o583n025p061p633m825l373n082n484l206l026o289p764
$$ 765854 756422 746553 739970 734945 727884 720251 715426 712053 706971 701487 698281 695255 688966 681202
58036F81202n449m089n751o094l470k550n220o921n564n377q117r239o655m875
$$ 681202 675753 671664 665913 659819 656349 653799 648579 641658 636094 630717 622600 613361 606706 601831
58022F01831o418p266m895k958l882m406k410j012k076k637j215q15k379k349
$$ 601831 595413 588147 583252 580294 576412 572006 569596 568584 566508 563871 562656 561841 559462 557113
58008E57113J89J121r23j628R33K662J222J80J897L310K445K137L731L834J021
$$ 557113 557302 558423 557500 555872 556805 559467 560689 560869 562766 566076 568521 570658 574389 578223 579244
57993E79244q98J00M86k027m355m286m323n825n724k786q49k103l262k029j173
$$ 579244 578346 578446 578932 576905 572550 568264 563941 558116 552392 549606 548757 546654 543392 541363 540190
57978E40190k519l039q12J045K40n41Q76K145J431R82K116K280M58q3J988K855
$$ 540190 537671 534632 533820 534865 535105 534564 535440 537585 539016 539998 542114 544394 544852 544769 546757 549612
57962E49612J80k653k554j484j613j325K52K57k496m463l462k465l629m104j683
$$ 549612 549792 547139 544585 543101 541488 540163 540415 540672 538176 533713 530251 527786 524157 520053 518370
57947E18370P78P29M30K026L302K516K375M957P603Q041Q532J0890J2350J0928
$$ 518370 519148 519877 520307 522333 525635 528151 530526 535483 543086 551127 559659 570549 582899 593827
57933E93827R749J1417J2886J0802P370N898M863J512k602m690n838q184j0399
$$ 593827 603576 614993 627879 638681 646051 651949 656812 658324 655722 651032 645194 637010 626611
57920F26611j0460r780j0299j0662r339q228r116r862q079n291l688k197M04K015
$$ 626611 616151 606371 596072 585410 576071 567843 558727 548865 540786 535495 531807 529610 530014 532029
57906E32029R00n90Q1J352R26M6N05Q77l29j212mJ361J033R94L110N164M897M395
$$ 532029 532929 532339 532420 533772 534698 534744 535249 536126 535797 534585 534581 535942 536975 537969 541079 546243 551140 555535
57888E55535O087Q019P568O414P104P979O347L712L019L404K397P32L74K54j499
$$ 555535 561622 569641 577209 583623 590727 598706 605053 608765 611784 615188 617585 618317 618691 618945 617446
57873F17446l469l449k672l212l743k175j9K96K5J508L347K871J226J374K894
$$ 617446 613977 610528 607856 604644 600901 598726 598707 599003 599028 600536 603883 606754 607980 609354 612248
57858F12248L343K950L508M307L576K417L035M538M586L652L675M063L058J474
$$ 612248 615591 618541 622049 626356 629932 632349 635384 639922 644508 648160 651835 655898 658956 660430
57844F60430J203J471M63r06o22O04Q43N75J148J521K93q84J45J974K061J296
$$ 660430 661633 663104 663567 662661 662039 662643 663486 664061 665209 666730 667023 666139 666284 668258 670319 671615
57828F71615K007L299K741J074Q20J623J272O5j47n0j641m085m952m636n341o688
$$ 671615 673622 676921 679662 680736 681556 683179 684451 684516 684369 684319 682678 678593 673641 669005 663664 656976
57812F56976o544n352n438o676o841n744n126n067m213l049l255m427m854m843
$$ 656976 650432 645080 639642 632966 626125 620381 615255 610188 605975 602926 599671 595244 590390 585547
57798E85547n777o749n661l058j321q37k58L45Q5m5J468L443L679K833L188M624
$$ 585547 579770 573021 567360 564302 562981 562144 561886 562231 562316 562271 563739 567182 570861 573694 576882 581506
57782E81506N414N822P262Q897Q967Q406R260J0543R731P428O332O369N156K705
$$ 581506 586920 592742 600004 608901 617868 626274 635534 646077 655808 663236 669568 675937 681093 683798
57768F83798J282R41m38k825l889l258k874l118k415q54l28q49m20J222K232K160
$$ 683798 685080 686021 685583 682758 678869 675611 672737 669619 667204 666350 666022 665173 664753 665975 668207 670367
57752F70367K496L606M377M799N680O106M657K695K796M297M221K368J356J745
$$ 670367 672863 676469 680846 685645 691325 697431 702088 704783 707579 711876 716097 718465 719821 721566
57738G21566J333l94j341q50p48j572j542k04N97K01K36J347K054J728J668K341
$$ 721566 722899 722505 721164 720314 719566 717994 716452 716248 716845 717046 717282 718629 720683 722411 724079 726420
57722G26420K547J974J822K276K165J445J312J583R33j39L10K098K927K245J817
$$ 726420 728967 730941 732763 735039 737204 738649 739961 741544 742477 742338 742648 744746 747673 749918 751735
57707G51735K191J907P76N46J623K225J589J026J165J074O61R66J614R58p73j535
$$ 751735 753926 755833 756609 757155 758778 761003 762592 763618 764783 765857 766518 767484 769098 770056 769283 767748
57691G67748j060j225k393k691j557p47r46o54P53J943K530M004O839R627J1913
$$ 767748 766688 765463 763070 760379 758822 758075 757129 756475 757228 759171 761701 765705 772544 782171 794084
57676G94084J5067J9440K3648K7474L2654L9806M7529N5406O4833P5575Q3928
$$ 794084 809151 828591 852239 879713 912367 952173 999702 1055108 1119941 1195516 1279444
57665A279444Q5437P7542N9585L3301L838k2633m3390n9039o9345p2595o9381
$$ 1279444 1364881 1442423 1502008 1535309 1539147 1516514 1473124 1414085 1344740 1272145 1202764
57654A202764o3227n6496m8830m0431l3248k7819k2390j6441j1915r752q287o329
$$ 1202764 1139537 1083041 1034211 993780 960532 932713 910323 893882 881967 872215 863928 857599
57642H57599m766m029l018j690j465k027j069J609L241K633K025K884L514K645
$$ 857599 852833 848804 845786 844096 842631 840604 839535 841144 844385 847018 849043 851927 855441 858086
57628H58086J903K567L059J936M23r1l34q91o14P64J261J6q21L06J705J585J108
$$ 858086 859989 862556 865615 867551 867974 867883 867549 866658 866044 866808 868069 868085 867264 867570 869275 870860 871968
57611H71968J789K592K144J486J985K698K362J988K950M336M555L918L401K636
$$ 871968 873757 876349 878493 879979 881964 884662 887024 889012 891962 896298 900853 904771 908172 910808
57597I10808J231L90J061K076K051J579J697J871J385R97J425J811J421J179J869
$$ 910808 912039 912429 913490 915566 917617 919196 920893 922764 924149 925146 926571 928382 929803 930982 932851
57582I32851K516K199J726J937K173J929K078K906L016J810R31J508K163J608
$$ 932851 935367 937566 939292 941229 943402 945331 947409 950315 953331 955141 956072 957580 959743 961351
57568I61351J038J843L057L220K907L247L716L479L235L759M278M166M453N825
$$ 961351 962389 964232 967289 970509 973416 976663 980379 983858 987093 990852 995130 999296 1003749 1009574
57554A009574O938O640O042O547P614Q313R065J0013R822Q128O982P704Q450P291
$$ 1009574 1016512 1023152 1029194 1035741 1043355 1051668 1060733 1070746 1080568 1088696 1095678 1103382 1111832 1119123
57540A119123N463N055N533N348M981N534O020N051L751M070N483O188O329P194
$$ 1119123 1124586 1129641 1135174 1140522 1145503 1151037 1157057 1162108 1165859 1169929 1175412 1181600 1187929 1195123
57526A195123Q293Q099O928O424O890P440Q014Q927R381Q644P949Q831J0458J0787
$$ 1195123 1203416 1211515 1218443 1224867 1231757 1239197 1247211 1256138 1265519 1274163 1282112 1290943 1301401 1312188
57512A312188R659Q620Q407Q664R289J0124J0124Q768P424P525Q363Q451P935
$$ 1312188 1321847 1330467 1338874 1347538 1356827 1366951 1377075 1385843 1393267 1400792 1409155 1417606 1425541
57499A425541P784P805P400P063P238P027N949N478O707Q068P729O700O967P979
$$ 1425541 1433325 1441130 1448530 1455593 1462831 1469858 1475807 1481285 1487992 1496060 1503789 1510489 1517456 1525435
57485A525435P827O831O980Q552R945J0371J0319R956R347R506J0960J2065J1084
$$ 1525435 1533262 1540093 1547073 1555625 1565570 1575941 1586260 1596216 1605563 1615069 1626029 1638094 1649178
57472A649178R037Q231Q779R040Q695Q823R551J0061J0444J1280J1998J1809J1529
$$ 1649178 1658215 1666446 1675225 1684265 1692960 1701783 1711334 1721395 1731839 1743119 1755117 1766926 1778455
57459A778455J2288J3323J3263J2662J2861J3343J2782J1837J2114J3150J3213
$$ 1778455 1790743 1804066 1817329 1829991 1842852 1856195 1868977 1880814 1892928 1906078 1919291
57448A919291J2460J2441J3065J2953J2366J2869J4249J4700J4024J3873J4719
$$ 1919291 1931751 1944192 1957257 1970210 1982576 1995445 2009694 2024394 2038418 2052291 2067010
57437B067010J5275J5087J5201J5912J6242J5875J5597J5617J5402J5113J5321
$$ 2067010 2082285 2097372 2112573 2128485 2144727 2160602 2176199 2191816 2207218 2222331 2237652
57426B237652J5486J4741J3783J4015J5209J6090J6639J7561J8146J7252J5845
$$ 2237652 2253138 2267879 2281662 2295677 2310886 2326976 2343615 2361176 2379322 2396574 2412419
57415B412419J5920J7209J7781J7535J8210K0032K1332K1625K2097K2824K2347
$$ 2412419 2428339 2445548 2463329 2480864 2499074 2519106 2540438 2562063 2584160 2606984 2629331
57404B629331K0591J9401J9509J9561J8812J8333J8816J9489J9972K0979K2507
$$ 2629331 2649922 2669323 2688832 2708393 2727205 2745538 2764354 2783843 2803815 2824794 2847301
57393B847301K3308K3013K2792K3267K3644K3462K3423K3902K4400K4900K6044
$$ 2847301 2870609 2893622 2916414 2939681 2963325 2986787 3010210 3034112 3058512 3083412 3109456
57382C109456K7602K8445K8389K8338K8472K7979K6872K6114K5790K4923K3401
$$ 3109456 3137058 3165503 3193892 3222230 3250702 3278681 3305553 3331667 3357457 3382380 3405781
57371C405781K2270K1937K1820K1820K2377K3066K2962K2446K2715K3610K3967
$$ 3405781 3428051 3449988 3471808 3493628 3516005 3539071 3562033 3584479 3607194 3630804 3654771
57360C654771K4022K5171K7295K8610K8417K7873K7766K7699K7674K8387K9626
$$ 3654771 3678793 3703964 3731259 3759869 3788286 3816159 3843925 3871624 3899298 3927685 3957311
57349C957311L0381L0661L1199L1524L0562K9093K9036L0294L0870L0309L0267
$$ 3957311 3987692 4018353 4049552 4081076 4111638 4140731 4169767 4200061 4230931 4261240 4291507
57338D291507L1329L2089L1935L1967L2487L2297L1345L1280L2465L3104L2465
$$ 4291507 4322836 4354925 4386860 4418827 4451314 4483611 4514956 4546236 4578701 4611805 4644270
57327D644270L2323L3867L5658L6103L5780L5762L5660L4871L4059L3966L4256
$$ 4644270 4676593 4710460 4746118 4782221 4818001 4853763 4889423 4924294 4958353 4992319 5026575
57316E026575L4600L5464L6817L7630L7529L7391L7661L7711L7505L8012L9244
$$ 5026575 5061175 5096639 5133456 5171086 5208615 5246006 5283667 5321378 5358883 5396895 5436139
57305E436139L9824L9276L8904L9536M0289M0415M0437M0642M0312L9418L9119
$$ 5436139 5475963 5515239 5554143 5593679 5633968 5674383 5714820 5755462 5795774 5835192 5874311
57294E874311L9706L9886L9060L8408L8778L9330L9268L9059L9010L8505L7593
$$ 5874311 5914017 5953903 5992963 6031371 6070149 6109479 6148747 6187806 6226816 6265321 6302914
57283F302914L7505L8516L9175L8648L8058L8463L9284L9789M0417M1499M2349
$$ 6302914 6340419 6378935 6418110 6456758 6494816 6533279 6572563 6612352 6652769 6694268 6736617
57272F736617M2626M3056M3945M4487M4302M3992M3633M2554M1159M0890M1751
$$ 6736617 6779243 6822299 6866244 6910731 6955033 6999025 7042658 7085212 7126371 7167261 7209012
57261G209012M1996M1026M0356M0833M1237M0699M0164M0304M0227L9480L9097
$$ 7209012 7251008 7292034 7332390 7373223 7414460 7455159 7495323 7535627 7575854 7615334 7654431
57250G654431L9420L9104L7602L6405L6386L6167L4587L2672L1603L0854K9958
$$ 7654431 7693851 7732955 7770557 7806962 7843348 7879515 7914102 7946774 7978377 8009231 8039189
57239H039189K9935L1238L2310L1968L1438L2267L3995L5504L6937L8661M0000
$$ 8039189 8069124 8100362 8132672 8164640 8196078 8228345 8262340 8297844 8334781 8373442 8413442
57228H413442M0652M1651M3476M4876M4943M4657M5024M5543M5772M6352M7225
$$ 8413442 8454094 8495745 8539221 8584097 8629040 8673697 8718721 8764264 8810036 8856388 8903613
57217H903613M7001M5626M5345M7304M9527M9880M8874M7679M5913M3382M1683
$$ 8903613 8950614 8996240 9041585 9088889 9138416 9188296 9237170 9284849 9330762 9374144 9415827
57206I415827M1727M1886M0804L9743L9808L9210L6079L1933K9324K7812K5271
$$ 9415827 9457554 9499440 9540244 9579987 9619795 9659005 9695084 9727017 9756341 9784153 9809424
57195I809424K1671J8662J6638J4979J4087J4571J5398J5238J4561J4166J2982
$$ 9809424 9831095 9849757 9866395 9881374 9895461 9910032 9925430 9940668 9955229 9969395 9982377
57184I982377R727N544K477O13r73j712n23J873M138O645J0119J3155J3795J2634
$$ 9982377 9992104 9997648 10000125 10000738 9999765 9998053 9997530 9999403 10003541 10010186 10020305 10033460 10047255 10059889
57170A0059889J1848J1946J1898J1606J1762J1981J1374J0203Q939O689K675j828
$$ 10059889 10071737 10083683 10095581 10107187 10118949 10130930 10142304 10152507 10161446 10168135 10170810 10168982
57158A0168982n227q066j1660j5615j9102k3125k8967l5672m1667m7467n4102
$$ 10168982 10163755 10155689 10144029 10128414 10109312 10086187 10057220 10021548 9979881 9932414 9878312
57147I878312o0229o3817o5516o7256o8515o7120o2947n7837n2508m6453m0231
$$ 9878312 9818083 9754266 9688750 9621494 9552979 9485859 9422912 9365075 9312567 9266114 9225883
57136I225883l5080l0821k6778k3928k3571k4886k6496k9115l3700l8268l9956
$$ 9225883 9190803 9159982 9133204 9109276 9085705 9060819 9034323 9005208 8971508 8933240 8893284
57125H893284l9132l8065l6535l2374k5577j8116j0377j415P762J4940K0371K6298
$$ 8893284 8854152 8816087 8779552 8747178 8721601 8703485 8693108 8691693 8699455 8714395 8734766 8761064
57113H761064L3317M0715M9798O3154Q1153J02886J30066J66212K12486K68182
$$ 8761064 8794381 8835096 8884894 8948048 9029201 9132087 9262153 9428365 9640851 9909033
57103I909033L34836M16177N15158O35257P83510R67435J189571J449329J748223
$$ 9909033 10243869 10660046 11175204 11810461 12593971 13561406 14750977 16200306 17948529
57094A7948529K087722K463824K870402L306746L775318M273049M786621N280574
$$ 17948529 20036251 22500075 25370477 28677223 32452541 36725590 41512211 46792785
57086D6792785N668266N805478N561821M938025M103577L282263K580113J923561
$$ 46792785 52461051 58266529 63828350 68766375 72869952 76152215 78732328 80655889
57078H0655889J157962J95454r19068k047778l041631l802845m307590m592676
$$ 80655889 81813851 82009305 81090237 79042459 76000828 72197983 67890393 63297717
57070F3297717m720594m745938m700946m598964m443221m234142l975083l675416
$$ 63297717 58577123 53831185 49130239 44531275 40088054 35853912 31878829 28203413
57062B8203413l348938l010076k672059k346963k044896j772382j531934j323073
$$ 28203413 24854475 21844399 19172340 16825377 14780481 13008099 11476165 10153092
57054A0153092j143426r89458q57314p43631o45934n62629m92570m34245l85437
$$ 10153092 9009666 8020208 7162894 6419263 5773329 5210700 4718130 4283885 3898448
57045C898448l43879l08037k76890k49348k24439k01789j81348j62847j45881
$$ 3898448 3554569 3246532 2969642 2720294 2495855 2294066 2112718 1949871 1803990
57036A803990j30401j16529j04172r3136q3420p4997o7544o0687n4265m8126m2006
$$ 1803990 1673589 1557060 1452888 1359752 1276332 1201335 1133791 1073104 1018839 970713 928707
57025I28707l5778k9524k3248j6807j0121l011N081J4811K6708M1474N9278P7049
$$ 928707 892929 863405 840157 823350 813229 810218 815299 830110 856818 898292 957570 1034619
57013A034619Q7261Q2065N9791K6337r882m2869o9184q6411r3769r3079q7405
$$ 1034619 1121880 1203945 1263736 1290073 1280191 1237322 1168138 1081727 987958 894879 807474
57002H07474p9033o9461o0128n1859m4240l6683k9587k3647j8672j3955r342n228
$$ 807474 728441 658980 598852 546993 502753 466070 436483 412836 394164 380209 370867 365639
56990C65639j962K30J358K170L841O669R666J1662J2001J0000N051k225r947j6700
$$ 365639 363677 363907 365265 367435 371276 377945 387611 399273 411274 421274 426325 424100 414153 397453
56976C97453k2210k6052k7133k5253k1924j8751j5944j3147j0420p657m289m99
$$ 397453 375243 349191 322058 296805 274881 256130 240186 227039 216619 208962 204673 204174
56964B04174K466M215O182R653J3962J7877K1457K5006K7144K5640J9837J1008
$$ 204174 206640 210855 217037 226690 240652 258529 279986 304992 332136 357776 377613 388621
56952C88621R06q897j6769k1539k3362k3235k1944k0005j8017j6109j3569r835
$$ 388621 389527 380630 363861 342322 318960 295725 273781 253776 235759 219650 206081 196246
56940A96246n426j196K758O680J0362J3705J7522K2704K8799L4115L6846L5564
$$ 196246 190820 189624 192382 199062 209424 223129 240651 263355 292154 326269 363115 398679
56928C98679K9329J8405M769q785k0052k7822l1728l2386l1198k9263k6735k3562
$$ 398679 428008 446413 451182 442397 422345 394523 362795 330409 299211 269948 243213 219651
56916B19651k0340j7799j5965j4315j2425j0142p632n485m312l908l455k666k010
$$ 219651 199311 181512 165547 151232 138807 128665 121033 115548 111236 107328 103873 101207 99197
56903I9197j645j092j16R81K256M209O605Q379R159R832J1114J2697J4422J7007
$$ 99197 97552 96460 96344 97325 99581 103790 110395 118774 127933 137765 148879 161576 175998 193005
56889A93005K0836K4991K8322L0506L1246K9422K4064J5606N595m261j2389j7655
$$ 193005 213841 238832 267154 297660 328906 358328 382392 397998 403593 399332 386943 369288
56877C69288k0099k0632j9685j7063j3295r782p014l799R28O664J2358J7750K3103
$$ 369288 349189 328557 308872 291809 278514 268732 261718 257919 258847 265511 277869 295619 318722
56864C18722K8639L4972M3009N2641O2106O8853P0020O2625M5549K2078j460k0613
$$ 318722 347361 382333 425342 477983 540089 608942 678962 741587 787136 809214 807754 787141
56852G87141l4868m4648m8962m7457m2432l6552l0036k1954j2816l944M616J3633
$$ 787141 752273 707625 658663 611206 568774 532222 502186 480232 467416 463472 468088 481721
56840D81721K3096L2748M3355N5808O9821Q4672R9677J11959J15215J03553P6796
$$ 481721 504817 537565 580920 636728 706549 791221 890898 1002857 1118072 1221625 1298421
56829A298421M0605J980l3842o3211q3656r4447r6503r1563q2074p0964o0121
$$ 1298421 1339026 1341006 1307164 1243953 1160297 1065850 969347 877784 795710 724746 664625
56818F64625m9346l7857k6127j5179m824N919J7252K8774M0744N3713O6923P7731
$$ 664625 615279 577422 551295 536116 531292 537211 554463 583237 623981 677694 744617 822348
56806H22348Q2255P6419N8092K9727k005l0596n3180o9252p8113p9545p5529o8833
$$ 822348 904603 981022 1039114 1068841 1066836 1036240 983060 913808 835695 756150 680621 611788
56794F11788o0462n0375l9826l0747k3267j5997q515j654M505J0947J8038K5197
$$ 611788 551326 500951 461125 430378 407111 391114 382599 380945 385450 396397 414435 439632
56782D39632L2046L8181M1758M0046L1766J7970J000j6217l0440l9622m4326m6442
$$ 439632 471678 509859 551617 591663 623429 641399 642399 626182 595742 556120 511794 465352
56770D65352m6687m4596m0499l5779l1308k7084k3285k0268j7645j4734j1868
$$ 465352 418665 374069 333570 297791 266483 239399 216114 195846 178201 163467 151599
56759A51599r929q782p591o422o031o173n701m388l235k796k547k042j501j059
$$ 151599 141670 132888 125297 118875 112844 106671 100970 96582 93347 90551 88004 85962 84461 83402
56745H3402n51j35k15o86j076j308j465j164j14J026J335Q13J2r26j838j825l38
$$ 83402 82851 82716 82501 81815 80739 79431 77966 76802 76688 77714 79049 79862 79874 78948 77110 75285 74947
56728G4947J549K282J905J672K033K341K298K273K364K272J997J706J248P11R14
$$ 74947 76496 78778 80683 82355 84388 86729 89027 91300 93664 95936 97933 99639 100887 101598 102512
56713A02512K214L527L641K857K159J566O57p9R6P77J135J368J944K219J385J15
$$ 102512 104726 108253 111894 114751 116910 118476 119133 119054 119150 119927 121062 122430 124374 126593 127978 128093
56697A28093l82k38l17m58p3L14L1p6J108K696K873J685O80K91j77m92K79J687
$$ 128093 127711 127473 127156 126698 126625 126939 126970 126894 128002 130698 133571 135256 135936 136227 136050 135558 135837 137524
56679A37524K326K162K257K439J552r8q98o35o92j389j492o77k13o33q35j07P66
$$ 137524 139850 142012 144269 146708 148260 148162 147264 146629 145937 144548 143056 142379 142166 141533 140698 140591 141357
56662A41357R84O62l4j081j674q79O18J108L81j22K74P61Q59J037J308J091O49
$$ 141357 142341 143003 142969 141888 140214 139335 139953 141061 141442 141320 141594 142355 143214 144251 145559 146650 147299
56645A47299Q20J189M82j016j502m23P95J139J082Q72j08j721k725k773k897l452
$$ 147299 148119 149308 149790 148774 147272 146849 147644 148783 149865 150737 150629 148908 146183 143410 140513 137061
56629A37061l361k098p36l39p26j344j955k112j379k84K69N18J225J851J231j61
$$ 137061 133700 131602 130866 130527 129801 128457 126502 124390 123011 122727 122996 123514 124739 126590 127821 127660
56613A27660p38m83q00j674j564l28L19k07n13QQ0q29j222p4J506K204K249K178
$$ 127660 126922 126439 125639 123965 122401 122073 122392 122185 121672 121680 121760 120931 119709 119635 121141 123345 125594 127772
56595A27772J719Q75N23R79J526J884K485K903K000J22q60l00M36N00O48J192
$$ 127772 129491 130366 130889 131868 133394 135278 137763 140666 142666 142788 141928 141628 142064 142564 143212 144404
56579A44404J147L05m7O48J345J548K216L584M308L802L285L522L615L078K972
$$ 144404 145551 145856 145809 146457 147802 149350 151566 155150 159458 163260 166545 170067 173682 176760 179732
56564A79732L941N205O532Q999J2634J5425J5918J4773J2681R066M070m12l170
$$ 179732 183673 188878 195410 204409 217043 232468 248386 263159 275840 284906 288976 288564 285394
56551B85394n102o926p644o755n768n863o014n035l635k898k532k136k346l233
$$ 285394 280292 273366 265722 258967 253199 247336 241322 236287 232652 229754 227222 225086 222740 219507
56537B19507l383k127q90r00j381j385j494k166k322j233o7Q0j29N0q9r05j131
$$ 219507 216124 213997 213107 212207 210826 209441 207947 205781 203459 202226 202159 202239 202110 202160 202071 201166 200035
56520B00035m3R61O68O8K51K49j014k453k563j944j949k278j889j141j098j723
$$ 200035 199992 200953 201621 201689 201940 202189 201175 198722 196159 194215 192266 189988 188099 186958 185860 184137
56504A84137k321k763k920k205q91m20j196j691r52j43k23j63R75K105K035J494
$$ 184137 181816 179053 176133 173928 173037 172617 171421 169730 168778 168635 168412 168249 169224 171329 173364 174858
56488A74858J494J526J036Q81J554J859J125P11J525K081J036l90o51n38j315
$$ 174858 176352 177878 178914 179795 181349 183208 184333 185044 186569 188650 189686 189296 188645 188107 186792
56473A86792k147j780r57q87q94M0J038R99P66J359J703N94p56o18L21M01q6K1
$$ 186792 184645 182865 181908 181021 180127 180167 181205 182204 182970 184329 186032 186626 185870 185252 185573 185974 185888 185909
56455A85909K85j95n72L26J583J750J405J782K211J519N97R63J910J749P26J96
$$ 185909 186194 185999 185427 185753 187336 189086 190491 192273 194484 196003 196600 197563 199473 201222 201948 202144
56439B02144Rp89j742j896j782k175k160q22N21L08m58J2J152J366J113J709K403
$$ 202144 202153 201364 199622 197726 195944 193769 191609 190787 191308 191616 191158 191170 192322 193688 194801 196510 198913
56422A98913J628R0l58N6j60p23k88O58N50l28n06l3R7L35J606K925K743J767
$$ 198913 200541 200631 200273 200329 200169 199446 199158 199816 200366 200038 199532 199499 199596 199931 201537 204462 207205 208972
56404B08972J611J694M88j183j226J15Q91R07J423K136J656N64O95J830K084J287
$$ 208972 210583 212277 212765 211582 210356 210471 211362 212269 213692 215828 217484 218048 218743 220573 222657 223944
56388B23944R99J480J538J064R26Q05j26r10l4J619J946J183J236K033J783M60
$$ 223944 224943 226423 227961 229025 229951 230756 230630 229720 229686 231305 233251 234434 235670 237703 239486 239946
56372B39946j17M83R82J062J504J922J247J83L60J392J542R03R46J478J102K35
$$ 239946 239829 240312 241294 242356 243860 245782 247029 247212 247572 248964 250506 251409 252355 253833 254935 255170
56356B55170N87J955K570K325K593L270L074K352K465K865J941K84j70L14l0p99
$$ 255170 255757 257712 260282 262607 265200 268470 271544 273896 276361 279226 281167 281451 281281 281595 281565 280766
56340B80766q0J675K238J752K466M362N045M091L668M482M868M378M577N700O007
$$ 280766 280686 282361 284599 286351 288817 293179 298224 302315 305983 310465 315333 319711 324288 329988 335995
56325C35995N058M327M151L310J999J772K274J514l40r65PM24l13l69P65J330
$$ 335995 341053 345380 349531 352841 354840 356612 358886 360400 360060 359095 359102 359526 359213 358844 359609 360939
56309C60939Q46J039K384L175K875L060M237N021N228O383Q382R021P750O612
$$ 360939 361785 362824 365208 368383 371258 374318 378555 383576 388804 395187 403569 412590 420340 426952
56295D26952O633O467N555N327O312P123P195P679Q850R551R697J0363J1127J0512
$$ 426952 433585 440052 445607 450934 457246 464369 471564 479243 488093 497644 507341 517704 528831 539343
56281E39343R276R813J2018J3349J3274J3859J5531J6223J5527J5694J7566J9347
$$ 539343 548619 558432 570450 583799 597073 610932 626463 642686 658213 673907 691473 710820
56269G10820K0341K2131K5064K7343K8711L1294L5717M0032M3545M8016N4047
$$ 710820 731161 753292 778356 805699 834410 865704 901421 941453 984998 1033014 1087061
56258A087061O0051O5902P3768Q4098R4572J04187J14720J26954J39184J50694
$$ 1087061 1147112 1213014 1286782 1370880 1465452 1569639 1684359 1811313 1950497 2101191
56248B101191J62825J75368J85759J93108J99327K04883K07208K04523J97502
$$ 2101191 2264016 2439384 2625143 2818251 3017578 3222461 3429669 3634192 3831694
56239C831694J86060J68507J45190J19067R1319O0339K6239p710l9432o9699r8188
$$ 3831694 4017754 4186261 4331451 4450518 4541837 4602176 4628415 4620705 4581273 4511574 4413386
56228D413386j22204j40818j56056j68556j76269j78902j79267j78614j75141
$$ 4413386 4291182 4150364 3994308 3825752 3649483 3470581 3291314 3112700 2937559
56219B937559j68620j61882j55939j48280j37982j27947j20030j12476j04124
$$ 2937559 2768939 2607057 2451118 2302838 2164856 2036909 1916879 1804403 1700279
56210A700279r6598r0287q2869p4063o7093o3228n9436n3832m8616m5271m1663
$$ 1700279 1603681 1513394 1430525 1356462 1289369 1226141 1166705 1112873 1064257 1018986 977323
56199I77323l6543l2204k9882k7248k3107j9952j9077j7897j4903j2533j2247
$$ 977323 940780 908576 878694 851446 828339 808387 789310 771413 756510 743977 731730
56188G31730j1537q899o914p248p407n643m369n319o044m605l140l366l209j277
$$ 731730 720193 711294 704380 697132 689725 684082 679713 674394 668350 663745 660605 657239 654030 652753
56174F52753M8o19o24J578L172K420K315M959P328O732N604O664Q102P871Q061
$$ 652753 652801 652182 651558 653136 656308 658728 661043 666002 673330 680062 685666 692330 700432 708303 716364
56159G16364J0610J3158J3589J4176J7033J9930K0844K2072K5459K8397K8972
$$ 716364 726974 740132 753721 767897 784930 804860 825704 847776 873235 901632 930604
56148I30604L0310L5167M0958M4844M9044N6131O3911P0044P7148Q8092J00618
$$ 930604 960914 996081 1037039 1081883 1130927 1187058 1250969 1321013 1398161 1486253 1586871
56137A586871J11528J21552J30978J35289J30840J20680J09579R7716Q4370P2893
$$ 1586871 1698399 1819951 1950929 2086218 2217058 2337738 2447317 2545033 2629403 2702296
56127B702296O6056O0781N3060M3897L5169K4447R815m842j5327k3551l2824m1617
$$ 2702296 2768352 2829133 2882193 2926090 2961259 2985706 2995521 2990679 2975352 2951801 2918977 2877360
56115B877360m8137n6245p0103q6993j01670j13713j24497j31399j31481j26897
$$ 2877360 2829223 2772978 2702875 2615882 2514212 2400499 2276002 2144603 2013122 1886225
56105A886225j20588j10995r6937q2791p2466o3138n1450m0618l4489k9968k2860
$$ 1886225 1765637 1654642 1557705 1474914 1402448 1339310 1287860 1247242 1212753 1182785 1159925
56094A159925j6058j3947j3686j0172n210l409l215l44L805N303N409P332R162
$$ 1159925 1143867 1129920 1116234 1106062 1100852 1097443 1094228 1093884 1097689 1102992 1108401 1115733 1124895
56081A124895P917O472Q696J1800J1398R769J1195J3687J3497J3076J6124J9569
$$ 1124895 1132812 1139284 1147980 1159780 1171178 1180947 1192142 1205829 1219326 1232402 1248526 1268095
56069A268095J9119J7803K0082K2567J9981J5372J4629J5767J3599J0217J0672
$$ 1268095 1287214 1305017 1325099 1347666 1367647 1383019 1397648 1413415 1427014 1437231 1447903
56058A447903J2889J2191J1072J4075J7705J6308J3151J4672J8449J8293J6411
$$ 1447903 1460792 1472983 1484055 1498130 1515835 1532143 1545294 1559966 1578415 1596708 1613119
56047A613119J8758K2843K2413J9859K1620K5484K4984K2318K4232K8929K9825
$$ 1613119 1631877 1654720 1677133 1696992 1718612 1744096 1769080 1791398 1815630 1844559 1874384
56036A874384K8394L0462L3841L2805L0734L4906M2733M6578M7849N2524N7439
$$ 1874384 1902778 1933240 1967081 1999886 2030620 2065526 2108259 2154837 2202686 2255210 2312649
56025B312649N5682N1120N2457N7308N7448N5325N9274O6742O8880O7543P0942
$$ 2312649 2368331 2419451 2471908 2529216 2586664 2641989 2701263 2768005 2836885 2904428 2975370
56014B975370P6600P6140P2828P6420Q4499Q7179Q6355R1350R9561J01125R9016
$$ 2975370 3051970 3128110 3200938 3277358 3361857 3449036 3535391 3626741 3726302 3827427 3926443
56003C926443J04348J15262J21022J23264J32034J44590J50127J51774J61299
$$ 3926443 4030791 4146053 4267075 4390339 4522373 4666963 4817090 4968864 5130163
55994E130163J75909J83682J87841K01089K20128K31476K38374K55191K79340
$$ 5130163 5306072 5489754 5677595 5878684 6098812 6330288 6568662 6823853 7103193
55985G103193K96727L10667L35963L68792L93431M14466M49584M95046N32939
$$ 7103193 7399920 7710587 8046550 8415342 8808773 9223239 9672823 10167869 10700808
55976A0700808N68147O21295O89555P53596Q18958R08965J021153J135517J261453
$$ 10700808 11268955 11890250 12579805 13333401 14152359 15061324 16082477 17217994 18479447
55967A8479447J428719J636996J866849K136224K489885K938213L467745M104080
$$ 18479447 19908166 21545162 23412011 25548235 28038120 30976333 34444078 38548158
55959C8548158M892826N824975O862284Q033257R419395J1061883J2992097J5342005
$$ 38548158 43440984 49265959 56128243 64161500 73580895 84642778 97634875 112976880
55951A12976880J8291795K1918375K6225855L1177541L6230312L9670451L8945969
$$ 112976880 131268675 153187050 179412905 210590446 246820758 286491209 325437178
55944C25437178L2368401K0658404O584474o933081j8210915k6640275l1952872
$$ 325437178 357805579 378463983 385048457 378115376 359904461 333264186 301311314
55937C01311314l4111383l3618215l1413735k8366737k5000839k1624839j8468617
$$ 301311314 267199931 233581716 202167981 173801244 148800405 127175566 108706949
55930A08706949j5645372j3151664j0979627r155769p664318o429753n397833
$$ 108706949 93061577 79909913 68930286 59774517 52110199 45680446 40282613
55923D0282613m561313l895605l341229k864299k472471k159318j889035j646109
$$ 40282613 35721300 31825695 28484466 25620167 23147696 20988378 19099343 17453234
55915A7453234j447198j293044j156159j025237r16862q34245p56248o75834o09971
$$ 17453234 16006036 14712992 13556833 12531596 11614734 10780489 10024241 9348407 8738436
55906H738436n62788n15883m63305m21047l93735l65082l29299l00482k83036
$$ 8738436 8175648 7659765 7196460 6775413 6381678 6016596 5687297 5386815 5103779
55897E103779k62841k35593k15226k06386j95582j77348j63304j57851j49701
$$ 5103779 4840938 4605345 4390119 4183733 3988151 3810803 3647499 3489648 3339947
55888C339947j34888j24525j22414j17550j05724r6904r4589q9086p7659p0672
$$ 3339947 3205059 3080534 2958120 2840570 2734846 2637942 2543353 2454267 2376608 2305936
55878B305936p1185o8440n8145m9860m7852m3581l3861k8138l0931l4329l4277
$$ 2305936 2234751 2166311 2108166 2058306 2010454 1966873 1933012 1904874 1873943 1839614 1805337
55867A805337l7427m5533m9712m6663m4601m7014m6265l9497l5253l7855m0136
$$ 1805337 1767910 1722377 1672665 1626002 1581401 1534387 1488122 1448625 1413372 1375517 1335381
55856A335381l7909l7187m0654m1307l6007l1727l2071l0963k5696k2991k5823
$$ 1335381 1297472 1260285 1219631 1178324 1142317 1110590 1078519 1047556 1021860 998869 973046
55845I73046k7259k3605k1025k2954k3440j9337j6829j9285k0501j6686j3626
$$ 973046 945787 922182 901157 878203 854763 835426 818597 799312 778811 762125 748499
55834G48499j5330j6602j3603j1055j2289j2524q617n526o647p435m925l895p241
$$ 748499 733169 716567 702964 691909 679620 667096 658479 652953 646306 638871 633946 630051 622810
55821F22810r629p185m468n577p011n490m216n385m949p73K302J328Q98M281P246
$$ 622810 613181 605996 601528 595951 588940 583450 579234 573849 568900 568127 570429 571757 572655 576936 584182
55806E84182O485N924Q539J0034O996L679M193N213K680j104l144n737j0828j4852
$$ 584182 590667 596591 605130 615164 622160 625839 630032 635245 637925 636821 633677 627940 617112 602260
55792F02260j4990j4393j5842j6523j4234j2216j2590j1573o645j970j195j338
$$ 602260 587270 572877 557035 540512 526278 514062 501472 489899 483254 481284 480089 478751
55780D78751O56J797p55l526k741p74q23p42K110N334O310P303J0300J1933Q928
$$ 478751 479407 481204 480449 476923 474182 473408 472585 471843 473953 479287 485597 492900 503200 515133 524061
55765E24061L622q92n921j2495j7096j7302j6437j7398j7252j3368r405r404j0984
$$ 524061 527683 526791 520870 508375 491279 473977 457540 440142 422890 409522 400117 390713 379729
55752C79729j0303q847r459j0293q754p074q046r340p803n401n220n599l807j757
$$ 379729 369426 360579 351120 340827 332073 324999 316953 307613 299810 294409 289189 283590 279783 278026
55738B78026k270l411k157j62l36j194j13J207J13j509o68Q95j36k566l226k813
$$ 278026 275756 272345 270188 270026 269690 268496 268383 269590 269703 268194 267526 268421 268285 265719 262493 259680
55722B59680l836n287m601k660j911j701j84J472J343Q06J983L613L690L588N247
$$ 259680 255844 250557 245956 243296 241385 239684 239500 240972 242315 243121 245104 248717 252407 255995 261242
55707B61242O968O355M723M270L731J225j539k361k981n672q344p907n856n463
$$ 261242 268210 274565 279288 283558 287289 288514 286975 284614 281633 275961 267617 259710 253854 248391
55693B48391n937m438j679m40m41M34J643J433R62K344M269M089K608K517L694
$$ 248391 242454 238016 236337 235897 235456 235890 237533 238966 239928 242272 246541 250630 253238 255755 259449
55678B59449M247M403N192N157K628m86j381r65j731l061k943k248k879l531j896
$$ 259449 263696 268099 273291 278448 281076 280590 279209 278244 276513 273452 270509 268261 265382 261851 259955
55663B59955O98J435J016J982L646L449J894J546K330K299J745K098K088l87l796
$$ 259955 260653 262088 263104 265086 268732 272181 274075 275621 277951 280250 281995 284093 286181 285794 281998
55648B81998m962m433n214p173p495n962n063n266m688l281l050m161m753m554
$$ 281998 277036 272603 267389 260216 252721 246759 241696 236430 231742 228461 225411 221250 216497 211943
55634B11943m930n604m915l150k116j788p48N17J76j478k361j995j523j031M3
$$ 211943 207013 201409 196494 193344 191228 189440 188692 189209 189385 187907 185546 183551 182028 180997 181040
55619A81040P04l38k001k461k344l221m256l701k430k388k886k052o91q61j768
$$ 181040 181744 181406 179405 176944 174600 171379 167123 163422 160992 158604 155718 153666 152975 152114 150346
55604A50346j139M54O64k26j20O19n7j590j657o69j018k338j992q9M73r43j906
$$ 150346 149207 149661 150325 150099 149979 150598 150541 148951 147294 146625 145607 143269 141277 141188 141661 140718 138812
55587A38812j437j131j401o73J066J708P40P3N80J121J289J929K556J666r3l05
$$ 138812 137375 136244 134843 134170 135236 136944 137684 137757 138337 139458 140747 142676 145232 146898 146805 146500
55571A46500J323K683K978L479M380M300L258K870L221K635R44j82l99j031k033
$$ 146500 147823 150506 153484 156963 161343 165643 168901 171771 174992 177627 178571 178389 177990 176959 174926
55556A74926j888p68o05j573j732n70J98j16l01J1k89j162j160k46J9m65j20J159
$$ 174926 173038 172270 171665 170092 168360 167790 167988 167872 167571 167582 167293 166131 164971 164725 164744 164279 164159 165318
55538A65318J628R08N30Q26K74j470k818l060l222l650l530l072l365l893l105
$$ 165318 166946 167854 168384 169210 169484 168014 165196 162136 158914 155264 151734 148662 145297 141404 138299
55523A38299j573j470k712k994j891j452k211k265j101p04j798k403j436m76n71
$$ 138299 136726 135256 132544 129550 127659 126207 123996 121731 120630 119926 118128 115725 114289 113813 113242
55508A13242m28Q10J843J781J686K144J900L61j003j127r01j094r74k25P5n04
$$ 113242 112814 113624 115467 117248 118934 121078 122978 123339 122336 121209 120308 119214 118240 118015 118090 117586
55492A17586q81o19p31j418j384l09L55kq5P50J292Q18L20L65K8r75j403p65k42
$$ 117586 116705 116086 115355 113937 112553 112244 112599 112597 112512 113262 114554 115372 115692 116057 116085 115110 113707 112942 112700
55473A12700l62rJ182J801J101K93K88K94l05q03q84j381k361k612j857j369j539
$$ 112700 112338 112329 113511 115312 116413 116706 116994 117288 116983 116180 115296 113915 111554 108942 107085 105716 104177
55456A04177j141J41R03O50P87J811K178J116J01J28k8j305k394j937o35L03R17
$$ 104177 103036 103177 104080 104730 105517 107328 109506 110622 110723 110851 110823 109518 107124 105187 104552 104855 105772
55439A05772J366J005p8m37M38J106N99o5K4J67j16J11J218J835J121K92M59Q20
$$ 105772 107138 108143 108065 107628 108066 109172 109771 109706 109730 109897 109781 109892 111110 112945 114066 114358 114817 115637
55421A15637M23j42k25m36j095j179j76P26O23L44O57Q56L77k7P5j48q69q27K54
$$ 115637 116060 115918 115693 115257 114162 112983 112807 113533 114156 114500 115157 116013 116390 116363 116438 116290 115421 114594 114848
55402A14848O70l97j221m50N74K99l90j19L39l05j252j041k37l10r82r33k43j0
$$ 114848 115518 115121 113900 113450 114024 114323 113933 113814 114153 113848 112596 111555 111318 111008 110026 109093 108850 108840
55384A08840k66j51L91P88J116J631J732Q18m00q10n76n79q39o70J4O02O26Q9
$$ 108840 108574 108423 108814 109602 110718 112349 114081 114899 114499 113689 113113 112534 111695 111025 111039 111641 112267 112356
55366A12356o37q49j19Q50R16J20n09p19j072j246l02J152J250o2o15N10J460
$$ 112356 111719 110870 110751 111601 112517 112637 112128 111409 110337 109091 108789 109941 111191 111129 110514 111024 112484
55349A12484O86p26j203r88p90k22Q51J237L43n07k36K82J25J00R22J504Q88J67
$$ 112484 113170 112444 111241 110253 109463 109241 110092 111329 111672 111165 110929 111211 111336 111436 112358 113862 114750 114917
55331A14917N98J347J083K72K8k3p48j618j696j296j029m29P93J395M11r89j177
$$ 114917 115515 116862 117945 118217 118245 118222 117474 115856 114160 112864 111835 111406 112199 113594 114005 113016 111839
55314A11839m70r2M1N98J039N21l53m61oJ40K6J1k74r23q17N80J767J259o2m56
$$ 111839 111369 111277 111318 111916 112955 113476 113123 112662 112656 112796 112822 112833 112559 111636 110819 111399 113166 114425 114363 113907
55294A13907l0j1m40n51n51j078j551r66L12J161J419J451R57k37j069o10L00
$$ 113907 113877 113866 113426 112875 112324 111246 109695 108729 109041 110202 111621 113072 114029 113792 112723 112113 112413
55277A12413L51k29m36l00l57l17J14J92n04p95K26J393J277N71O38R70L91l65
$$ 112413 112764 112535 112099 111799 111442 111125 111239 111431 110927 110132 110358 111751 113028 113599 114237 115207 115598 115233
55259A15233K14J560J812Q63J96J46k46r45q44Q6O71M97K32K2n30j054p80j05
$$ 115233 115447 117007 118819 119682 119878 120024 119778 118833 117989 118075 118746 119243 119475 119497 118967 117913 117133 117028
55241A17028o7n27n10q6k06q48j046n39N6M56P09L71p24j501r41J81M65O8K9J96
$$ 117028 116961 116434 115924 115838 115632 114784 113738 113199 113255 113711 114420 114791 114067 112566 111625 111806 112271 112339 112368 112564
55221A12564k06o56j37O68K79q26o98Q95K060J667N81k41q82j306r82j26K42j01
$$ 112564 112358 111702 111565 112233 112512 111686 110988 111883 113943 115610 116191 115950 115068 113762 112780 112654 112896 112795
55203A12795l13n9N6k30m08k27RK18M67L04n50j210o47N53R16L76K33R95J741
$$ 112795 112482 112423 112479 112249 111841 111614 111623 111841 112308 112612 112062 110852 110205 110758 111674 112050 112283 113278 115019
55184A15019J644Q25k52j070r72o6L24o30j732j401j46M29L91J114K516K912J728
$$ 115019 116663 117488 117236 116166 115194 115128 115452 114822 113090 111689 111543 111972 112363 113477 115993 118905 120633
55167A20633K99k67k50r4K42N00K26j70J55R20J095O60M94O42L89r9Q4P31O30
$$ 120633 120932 120665 120415 120321 120563 121063 121289 121119 121274 122194 123289 123949 124443 125085 125474 125375 125459 126190 126820
55148A26820m04j213j147o70j10O02J005N26k15j69L08P8n62k91P43R89J72l35
$$ 126820 126416 125203 124056 123386 123276 123878 124883 125409 125194 125025 125333 125411 124849 124558 125301 126290 126462 126127
55130A26127m9j17j011j580j050j55L84P05O96j50j270j263j88K50n40j058k50
$$ 126127 126078 125961 124950 123370 122320 122165 122549 123254 123950 123800 122530 121267 121079 121329 120789 119731 119481
55113A19481Q30R97P81J108J651J623J125O29J04m36n27q8K55K45M00R20J215
$$ 119481 120311 121308 122089 123197 124848 126471 127596 128225 128329 127893 127366 127278 127533 127778 128178 129098 130313
55096A30313R85O78N08J44l20k85J68K51p4Q2R04J478J354J140J142Q19N1m24
$$ 130313 131298 131976 132484 132628 132308 132023 132191 132442 132368 132450 133354 134832 136186 137326 138468 139287 139338 138914
55078A38914l08j22KN35J218J081K05k00J82K60l55o57k30j54r82j574j020j49
$$ 138914 138606 138484 138486 139021 140239 141320 141525 141325 141507 141767 141412 140755 140525 140371 139389 137815 136795 136646
55060A36646L5q3J62L77R0k07p8j05p55j366j298j051j249j564j563j500j393
$$ 136646 136681 136598 136760 137137 137227 137020 136942 136837 136082 134716 133418 132367 131118 129554 127991 126491 125098
55043A25098n10J145K102J403K35K12J021J157L28l79k85J74M30M59N05P68J231
$$ 125098 124588 125733 127835 129238 129473 129685 130706 131863 132191 131812 131527 131701 132131 132590 133095 133863 135094
55026A35094J483J034O9o50q19r04j159j228r24o42n89n20m00m61m31K42J172
$$ 135094 136577 137611 137680 137030 136211 135307 134148 132920 131996 131354 130765 130245 129845 129384 128953 129195 130367
55009A30367J282N43J47N83R60P61P47J407J935J645J140J080J036N11N1K32O11
$$ 130367 131649 132192 132339 132922 133882 134643 135390 136797 138732 140377 141517 142597 143633 144144 144195 144427 145038
54992A45038N96L98L02k4o43p91j78K55j77o92l80K65K95j28k36L6L38P73J413
$$ 145038 145634 146032 146334 146310 145667 144876 144698 144953 144776 144084 143704 143969 144264 144136 143900 143936 144274 145047 146460
54973A46460J673J165N75O45R81Q52M64M74P55P10L35ml73r66j374j028r1P70
$$ 146460 148133 149298 149873 150518 151499 152351 152815 153289 154044 154754 155089 155085 154712 153746 152372 151344 151253 152023
54955A52023J175J089N58j63o27p58q88j032q47n24o74j050n51R71K111J844R28
$$ 152023 153198 154287 154845 154682 154055 153297 152409 151377 150530 150006 149332 148282 147731 148702 150813 152657 153585
54938A53585N59P76J098J595K281K433J748J295K171L870N120N677O243P138Q031
$$ 153585 154144 154920 156018 157613 159894 162327 164075 165370 167541 171411 176531 182208 188451 195589 203620
54923B03620Q556Q415P346N718M552M210L751K282J92j676l270m900o345p288
$$ 203620 212176 220591 227937 233655 238207 242417 246168 248450 248642 246966 243696 238796 232451 225163
54909B25163p947q471q378p404o197n378m645l562k509j970j647j052l95m8J67
$$ 225163 217216 208745 200367 192963 186766 181388 176743 173181 170672 168702 167055 166003 165608 165560 165727
54894A65727M40N47N44J021K002K603K527K708L694M631M862N230O536P939Q200
$$ 165727 166167 166714 167258 168279 170281 172884 175411 178119 181813 186444 191306 196536 203072 211011 219211
54879B19211P558O911O124M599K637Q50j005l179m771m994m772n517o923p566
$$ 219211 226769 233680 239804 244403 247040 247890 246885 243706 238935 233941 229169 223652 216729 209163
54865B09163p125o410n734m856m100l953l895l197k478k835l788l758k472j232
$$ 209163 202038 195628 189894 185038 180938 176985 173090 169893 167415 164580 160792 157034 154562 153330
54851A53330p96o60m95p21j365j713j532j416j654j737j296o21l0M63P59P15N96
$$ 153330 152534 151874 151379 150658 149293 147580 146048 144632 142978 141241 139945 139324 139294 139757 140516 141231 141827
54834A41827P62J007R23O91P90J047R09L91p2m04p63q62l61L37N85N11O72R85
$$ 141827 142589 143596 144519 145210 146000 147047 147956 148347 148275 147871 147108 146246 145885 146222 146807 147318 147990 148975
54816A48975R37N51K16j32p62j347j359r39n36o9O46J111Q54M37O71J232J193
$$ 148975 149912 150463 150679 150547 149785 148438 147079 146140 145604 145535 146181 147292 148146 148583 149254 150486 151679
54799A51679O11L83P55J219J553J872J879J230M37J81P5o27j356q15Q72K026J695
$$ 151679 152290 152673 153428 154647 156200 158072 159951 161181 161618 161799 161874 161247 159891 159076 159948 161974 163669
54782A63669P01K38N08J140J857K403K611K814L546M764N962O899P642Q060Q075
$$ 163669 164370 164608 165116 166256 168113 170516 173127 175941 179487 184251 190213 197112 204754 212814 220889
54767B20889Q028Q017P320N385K963J188J2j347k891m000m750n701o626o818o478
$$ 220889 228917 236934 244254 249639 252602 253790 253802 252455 249564 245564 240814 235113 228487 221669 215191
54752B15191o406o457n695m117k826k413k403k382k407k321j827j285j282j421
$$ 215191 208785 202328 196633 192516 189690 187277 184874 182492 180085 177764 175937 174652 173370 171949
54738A71949q02M29J290J616K107K796L012K922L495M752N586N659N898O735P299
$$ 171949 171147 171576 172866 174482 176589 179385 182397 185319 188814 193566 199152 204811 210709 217444 224743
54723B24743O879N846M578K852P97q03j780k953m676o158o774o887o822o245n168
$$ 224743 231622 237468 242046 244898 245695 244892 243112 240159 235483 229325 222551 215664 208842 202597 197429
54708A97429m528m879n522n513m826l902k896j882j081m04M53J205J144L63j30
$$ 197429 192901 188022 182500 176987 172161 168259 165363 163481 162400 161996 162449 163654 164798 165161 165031
54693A65031J45N50N13J94k86j125j935j797p92k28p09j172o95m6l41j229j521
$$ 165031 165176 165726 166239 166433 166147 165022 163087 161290 160498 160270 159561 158389 157694 157648 157307 156078 154557
54676A54557r84k88L01J021J677J589N24r38k025k339j953j272o92k24L09Q26
$$ 154557 153573 153285 153586 154607 156284 157873 158397 157459 155434 153095 151142 149870 149178 148954 149263 150089
54660A50089J007Q27N45K35j53l24R1Q10J110P87K95j5j53n6L15N29J76l08j97
$$ 150089 151096 151923 152468 152703 152550 152226 152317 153127 154237 155024 155319 155304 155151 155095 155410 155939 156115 155807 155610
54641A55610K83L28m9j28O8k24r53j098m02J33j28n32l64J59O25J048J277R27
$$ 155610 155893 156221 156172 156044 156112 155888 154935 153837 153435 153568 153440 152908 152544 152703 153328 154376 155653 156580
54623A56580L18M04J248J734J257N31J57l33j230j716j130j42L03L05M48P01P19
$$ 156580 156898 157302 158550 160284 161541 162072 162229 161896 160666 158950 157820 157678 157981 158286 158734 159435 160154
54606A60154N63L32j97r23j158o26jJ52J12J41j57r30j458j194o50m28k85J32
$$ 160154 160717 161049 160852 159929 158771 158145 158144 158296 158408 158549 158392 157462 156004 154810 154160 153732 153447 153579
54588A53579M83M72N46J030J293P26k21p09o21k70K36O51L76n47j055m58M93P81
$$ 153579 154062 154534 155080 156110 157403 158129 157908 157199 156578 156308 156544 157195 157571 157024 155969 155511 156004 156785
54570A56785N28L68K48j54n42m79k33j56R8Q81J671J795J458J181Q75L43k1Q3
$$ 156785 157313 157681 157929 157775 157233 156754 156521 156365 156463 157344 159015 160810 162268 163449 164324 164667 164646 164729
54552A64729Q7m20o72K36J786K707K687K321J825J051L68L73Q44J045Q52O18K69
$$ 164729 164816 164396 163724 163960 165746 168453 171140 173461 175286 176337 176705 177078 177922 178967 179819 180437 180706
54535A80706m48j047p82J06N76J99n21j086j449j597j529j560j882k045j531o29
$$ 180706 180258 179211 178429 178535 179111 179310 178789 177703 176254 174657 173128 171568 169686 167641 166110 165481
54519A65481k9J52J61j13p36j013k68R22J367R95Q18J212J419R03J80l5K69O29
$$ 165481 165452 165604 165765 165652 164916 163903 163635 164557 165924 166919 167737 168949 170368 171271 171451 171416 171685 172314
54501A72314O61K19m12n69k0M53l2j081j458p77J12M72M82N32O14O90Q81R82N22
$$ 172314 172975 173194 172782 172213 172193 172646 172614 171533 170075 169298 169410 169882 170364 170896 171510 172200 173081 174063 174585
54482A74585m00r93q42m32k40K8P59J578J798J469J280J560J875J739J273R68
$$ 174585 174185 173192 172350 171918 171678 171706 172465 174043 175841 177310 178590 180150 182025 183764 185037 186005
54466A86005J005J110R97P40N41L92J82lO3L62N71M28n5o39r91q96n84o07j047
$$ 186005 187010 188120 189117 189857 190398 190790 190972 190969 191032 191394 191965 192393 192338 191699 190708 189812 189228 188621 187574
54447A87574j205o24Lk37r66r79j63L60O3k23J04M57K38j06l2J13o6j42K15L67
$$ 187574 186369 185745 185748 185511 184545 183566 183403 183763 183826 183603 183707 184164 184402 184296 184264 184377 184311 184169 184384 184751
54427A84751k34q65n88J78L26j10q6P73J714K028J769J331R78P85N00k42j168
$$ 184751 184517 183652 183064 183242 183568 183458 183372 184145 185859 187887 189656 190987 191965 192750 193250 193008 191840
54410A91840j379o82j87p05j358q50M77J196R90Q12J050R90L03k95k52P3K58M79
$$ 191840 190461 189779 189592 188887 187529 186679 187156 188352 189342 190154 191204 192194 192497 192202 191950 192023 192281 192760
54392A92760Q81J128J047J055J381J556J160O26O52J094J013o1j358j686q08L74
$$ 192760 193641 194769 195816 196871 198252 199808 200968 201594 202246 203340 204353 204292 202934 201248 200440 200814
54376B00814J140J862L039L936L270J298n9M32J870K761K885K849K726K272J834
$$ 200814 201954 203816 206855 210791 214061 215359 215300 215732 217602 220363 223248 226097 228823 231095 232929
54361B32929J816J740Q92l85j122j188j296j774k276k583k749k606j981j320j291
$$ 232929 234745 236485 237377 236992 235870 234682 233386 231612 229336 226753 224004 221398 219417 218097 216806
54346B16806j899k587l053l211k752j613n74m83j029j206p58k82j35j59l45q08
$$ 216806 214907 212320 209267 206056 203304 201691 201117 200634 199605 198399 197641 197359 197224 197065 196720 195912
54330A95912j195j022m96j53P3N97J217J425J443J803K104J430J0p80l41L93M22
$$ 195912 194717 193695 193199 193046 193119 193716 194933 196358 197801 199604 201708 203138 203148 202368 202027 202420 202842
54313B02842m7k56JL62M38N8n37p62l85j0k93q97j039p17n25m54m7M36K17o14
$$ 202842 202795 202539 202540 202902 203340 203398 202861 202099 201714 201704 201411 200514 199475 198758 198233 197779 197732 198168 198385 197771
54293A97771j049o81j47R0K89M75J84m56m93M23J324J256N43O9N2R0p2m04q21
$$ 197771 196722 196041 195894 195984 196273 196748 196932 196476 195983 196406 197730 198986 199529 199598 199650 199740 199668 199264 198443
54274A98443j039o67K68J144J382J019M94K02K61M53M48L32O48J483J975J409
$$ 198443 197404 196737 197005 198149 199531 200550 201044 201246 201507 201960 202408 202740 203388 204871 206846 208255
54258B08255M51L58J179J714J234K83k66r2O26J354J310K57q87j065n25k71m18
$$ 208255 208706 209064 210243 211957 213191 213474 213208 213116 213742 215096 216406 216663 215776 214711 214186 213915 213497
54241B13497l04j34r15k546l456k729j304m94l62k66K6M40J063J784K126J907
$$ 213497 213193 213059 212144 209598 206142 203413 202109 201615 201253 200987 201013 201453 202516 204300 206426 208333
54225B08333J528J225P62J52n2L96J031J442J722J843J376K51r21j627j927j970
$$ 208333 209861 211086 211848 212000 211948 212344 213375 214817 216539 218382 219758 220009 219088 217461 215534 213564
54209B13564j760j609j926k333j919p08J58O2k30J06O99P15P8p17j343j609j227
$$ 213564 211804 210195 208269 205936 204017 203309 203467 203529 203299 203405 204104 204819 204897 204180 202837 201228 200001
54192B00001k39P72J279J272R04K50m16o82m76j9O82J613K230K061J654J880K384
$$ 200001 199762 200534 201813 203085 203989 204239 203823 203141 202665 202646 203328 204941 207171 209232 210886 212766 215150
54175B15150K008P61q2mR8l97r80j330j877k478k083n26P69P75J70j56m53r47
$$ 215150 217158 217919 217837 217833 217931 217534 216554 215224 213347 210869 208786 208260 209029 209804 209974 209818 209365 208418
54157B08418q39K18R88L64q55j337j252j497j786j217j7P54Q23O61L04m30j008
$$ 208418 207579 207797 208785 209149 208294 206957 205705 204208 202422 201205 201188 201942 202765 203426 203730 203300 202292
54140B02292p55p6J04k12k40L01J083J968K848L103K301J071L55J48r0k94q9K59
$$ 202292 201537 201461 201565 201353 201113 201414 202497 204465 207313 210416 212717 213788 214143 214291 214201 213907 213818 214077
54122B14077L07M14J067J735J546Q08O27J284K161K968L848M458M271L705L812
$$ 214077 214384 214798 215865 217600 219146 219954 220581 221865 224026 226994 230842 235300 239571 243276 247088
54107B47088M737N482N231M098K661J491R45P17J3j157j565o11K96l95j881k149
$$ 247088 251825 257307 262538 266636 269297 270788 271733 272450 272463 271306 269741 269130 269426 269031 267150 265001
54091B65001j133o87j542k360k184j854k254k816k774k528k754l056k578j261
$$ 265001 263868 263181 261639 259279 257095 255241 252987 250171 247397 244869 242115 239059 236481 235220
54077B35220K49J382J845J547Q54L71K45J89L42J246K659L355K615J228M29M88
$$ 235220 235469 236851 238696 240243 241097 241468 241713 241902 242244 243490 246149 249504 252119 253347 253776 254264
54061B54264Q22R57P89L41k20n81o28n77n38l30J55P65J394K017K426K404K225
$$ 254264 255086 256043 256832 257173 256953 256372 255744 255167 254629 254299 254454 255219 256613 258630 261056 263460 265685
54044B65685K402K912L303L552M130N023N625N756O018O738P384P521P649Q375
$$ 265685 268087 270999 274302 277854 281984 287007 292632 298388 304406 311144 318528 326049 333698 342073
54030C42073R323R529Q709P549O859O795O825O298N157M113L809L927L582K572
$$ 342073 351396 360925 369634 377183 384042 390837 397662 403960 409117 413230 417039 420966 424548 427120
54016D27120J468N38o31k100l104l164k908l183l901m532n208o451q025q918q514
$$ 427120 428588 429126 428495 426395 423291 420127 417219 414036 410135 405603 400395 393944 385919 377001 368487
54001C68487p243n975n307n355n737n734m876l591k866l102l632l543k697j755
$$ 368487 361244 355269 349962 344607 338870 333136 328260 324669 321803 318701 315069 311526 308829 307074
53987C07074j384j697k339k797k680k017j328j155j397j399q51k62j93l78j00
$$ 307074 305690 303993 301654 298857 296177 294160 292832 291677 290280 288881 288030 287768 287575 287197 287097
53972B87097P27J534K036K507K915K703J892J674L150N882Q353R608R846R577
$$ 287097 287824 289358 291394 293901 296816 299519 301411 303085 306235 312117 320470 330078 339924 349501
53958C49501Q890P546N350K425o22k993m468n594o719p237o335m283k264j053
$$ 349501 358391 365937 371287 373712 373090 370097 365629 360035 353316 346079 339744 335461 333197 332144
53944C32144l84M08J657L200M519N068M800M296M082M059L894L588L202K465J305
$$ 332144 331760 332168 333825 337025 341544 346612 351412 355708 359790 363849 367743 371331 374533 376998 378303
53929C78303L97M75J389K488L604M849N888O325O545P177P911P973P660Q105R390
$$ 378303 378700 379175 380564 383052 386656 391505 397393 403718 410263 417440 425351 433324 440984 449089 458479
53914D58479J0181R708Q880Q903R733J0642J1396J2085J2370J1697J0031P817
$$ 458479 468660 478368 487248 496151 505884 516526 527922 540007 552377 564074 574105 581922
53902E81922N455L176J147n75j991k908l155l071l262l803m355n045o426q312
$$ 581922 587377 590553 591700 591125 589134 586226 583071 580000 576738 572935 568580 563535 557109 548797
53888E48797r590r708r486r893j0749j1260j1211j0863j0277r526r071r147r118
$$ 548797 539207 529499 520013 510120 499371 488111 476900 466037 455760 446234 437163 428016 418898
53875D18898q260o916o043n850n711n317n039n075n087m845m643m718m780m477
$$ 418898 410638 403722 397679 391829 386118 380801 375762 370687 365600 360755 356112 351394 346614 342137
53861C42137l982l783m088m663n077m970m225l137k263j959k065k158k019j750
$$ 342137 338155 334372 330284 325621 320544 315574 311349 308212 305949 303990 301925 299767 297748 295998
53847B95998j500j268j078j108j464j917k074j814j325o85J72R81J071K18p99
$$ 295998 294498 293230 292152 291044 289580 287663 285589 283775 282450 281765 281937 282918 283989 284207 283408
53832B83408r66k54M53N01Q1l09m31k26L11R28J158Q52M23M04Q97J588K127K402
$$ 283408 282442 282188 282641 283142 283223 282914 282483 282257 282568 283496 284654 285506 285929 286333 287230 288818 290945 293347
53814B93347K529K635K586K131J473J366K247L470L973L624L357L975N308O644
$$ 293347 295876 298511 301097 303228 304701 306067 308314 311784 315757 319381 322738 326713 332021 338665
53800C38665P423P420O820O315O640P735Q747R009Q623P943P011N846M813M218
$$ 338665 346088 353508 360328 366643 373283 381018 389765 398774 407397 415340 422351 428197 433010 437228
53786D37228L794K985J651K08q21j258j351j579k273l348m440n285n882o367o875
$$ 437228 441022 444007 445658 445866 445045 443787 442436 440857 438584 435236 430796 425511 419629 413262 406387
53771D06387p409p684p342o568o121o378o700o302n418m883m752m338l545l138
$$ 406387 398978 391294 383952 377384 371263 364885 358185 351883 346465 341582 336830 332492 328947 325809
53757C25809l462l770l347k507k008k021k225k410k475k222j637j111r22q56o79
$$ 325809 322347 318577 315230 312723 310715 308694 306469 304059 301584 299362 297725 296614 295692 294836 294157
53742B94157o05r06j295j241o79p5J53J4k23l48m11n99q16o08J58P63M25m22m41
$$ 294157 293552 292646 291351 290110 289431 289356 289509 289523 289300 288952 288541 287942 287126 286518 286676 287439 287864 287442 287001
53723B87001Q30K286K675K028J209O66L39K96P03J319J671J648J556J613J783
$$ 287001 287831 290117 292792 294820 296029 296695 297034 297330 298033 299352 301023 302671 304227 305840 307623
53708C07623K031K395K818L115L136K895K624K682L159L675L860L932M382N102
$$ 307623 309654 312049 314867 317982 321118 324013 326637 329319 332478 336153 340013 343945 348327 353429
53694C53429N455N236M861M509L806K654J620J037M37n88j536j647j002l18j02
$$ 353429 358884 364120 368981 373490 377296 379950 381570 382607 383044 382456 380920 379273 378271 377953 377851
53679C77851m61j354k400k776k017o75K77N14L77K00J68M68R81J089M01n29q57
$$ 377851 377390 376036 373636 370860 368843 368168 368445 368959 369336 369536 369704 370172 371153 372242 372643 372114 371257
53662C71257n99m86q06j114j040p43m02J40J006J975K629K651K027J153O52P36
$$ 371257 370658 370172 369366 368252 367212 366469 366067 366207 367213 369188 371817 374468 376495 377648 378300 379036
53646C79036R00O44K43L50R71J399J200O82L34K58L46O73J359K254K949L080K669
$$ 379036 379936 380580 380823 381173 382144 383543 384743 385425 385759 386017 386363 387036 388395 390649 393598 396678 399347
53629C99347K148J990K229K484K505K543K913L526M009M146L949L526L125L116
$$ 399347 401495 403485 405714 408198 410703 413246 416159 419685 423694 427840 431789 435315 438440 441556
53615D41556L574M052M083L754L471L320L061K600K156J918J872J940K063K182
$$ 441556 445130 449182 453265 457019 460490 463810 466871 469471 471627 473545 475417 477357 479420 481602
53601D81602K315K526K732K681K291J827J500J194P75M27L48L32K3n63j132j522
$$ 481602 483917 486443 489175 491856 494147 495974 497474 498668 499443 499870 500218 500550 500573 500010 498878 497356
53585D97356j735j719j467j165r82q13n82n51r64j561j837j733j683j961k391
$$ 497356 495621 493902 492435 491270 490288 489475 488893 488342 487378 485817 483980 482247 480564 478603 476212
53570D76212k655k629k417k247k299k438k262j590p18mN67J134J515J448J124
$$ 476212 473557 470928 468511 466264 463965 461527 459265 457675 456957 456953 457520 458654 460169 461617 462741
53555D62741J056J465K096K590K742K414J594N96m4L8P41J568J952J715J289J324
$$ 462741 463797 465262 467358 469948 472690 475104 476698 477294 477250 477288 478029 479597 481549 483264 484553 485877
53539D85877J939K596K821K733K756L099L706M421N014N332N591O176P061P866
$$ 485877 487816 490412 493233 495966 498722 501821 505527 509948 514962 520294 525885 532061 539122 546988
53525E46988Q590R703J1188J2215J2258J1893J1895J2122J2032J1817J2183J3238
$$ 546988 555578 565281 576469 588684 600942 612835 624730 636852 648884 660701 672884 686122
53513F86122J4459J5568J6679J7742J8627J9651K1234K3012K4021K3902K3236
$$ 686122 700581 716149 732828 750570 769197 788848 810082 833094 857115 881017 904253
53502I04253K2646K2176K1683K1191K0648J9899J9083J8570J8385J8105J7494
$$ 904253 926899 949075 970758 991949 1012597 1032496 1051579 1070149 1088534 1106639 1124133
53491A124133J6811J6347J6160J6274J6709J7145J7086J6554J6145J6182J6279
$$ 1124133 1140944 1157291 1173451 1189725 1206434 1223579 1240665 1257219 1273364 1289546 1305825
53480A305825J6049J5752J5815J6115J6172J5850J5353J4595J3126J0816Q253
$$ 1305825 1321874 1337626 1353441 1369556 1385728 1401578 1416931 1431526 1444652 1455468 1463721
53469A463721O157M606L125J481j01j619l624o401r145j0725j1133j1418j2089
$$ 1463721 1469878 1474484 1477609 1479090 1478989 1477370 1473746 1467345 1458200 1447475 1436342 1424924 1412835
53456A412835j2500j2140j1702j2170j3459j4674j5318j5567j5705j5900j6304
$$ 1412835 1400335 1388195 1376493 1364323 1350864 1336190 1320872 1305305 1289600 1273700 1257396
53445A257396j6712j6490j5467j4527j4524j4911j4349j2417r877p442n296l803
$$ 1257396 1240684 1224194 1208727 1194200 1179676 1164765 1150416 1137999 1128122 1120680 1115384 1111581
53433A111581l502m033m097k969j315k5J051K546M379N802O461O745P170P851
$$ 1111581 1108079 1104046 1099949 1096980 1095665 1095640 1096691 1099237 1103616 1109418 1115879 1122624 1129794 1137645
53419A137645Q681R717J1135J2904J4656J6020J7095J8370K0085K1884K3270K4093
$$ 1137645 1146326 1156043 1167178 1180082 1194738 1210758 1227853 1246223 1266308 1288192 1311462 1335555
53407A335555K4433K4430K4504K5299K6900K8515K9539L0602L2752L5874L8741
$$ 1335555 1359988 1384418 1408922 1434221 1461121 1489636 1519175 1549777 1582529 1618403 1657144
53396A657144M0623M2012M3638M5514M7249M8591M9395M9560M9308M9141M9257
$$ 1657144 1697767 1739779 1783417 1828931 1876180 1924771 1974166 2023726 2073034 2122175 2171432
53385B171432M9308M8897M7952M6575M4838M2852M0765L8619L6389L4048L1420
$$ 2171432 2220740 2269637 2317589 2364164 2409002 2451854 2492619 2531238 2567627 2601675 2633095
53374B633095K8150K4260K0364J6909J3476R446M987O52l750q925j4792k0357
$$ 2633095 2661245 2685505 2705869 2722778 2736254 2745700 2750687 2751339 2747589 2738664 2723872 2703515
53362B703515k5000k9035l2855l6311l9161m1376m2780m3139m2803m2543m2547
$$ 2703515 2678515 2649480 2616625 2580314 2541153 2499777 2456997 2413858 2371055 2328512 2285965
53351B285965m2252m1391m0338l9240l7724l5823l4373l3933l4027l3942l3561
$$ 2285965 2243713 2202322 2161984 2122744 2085020 2049197 2014824 1980891 1946864 1912922 1879361
53340A879361l2971l1966l0499k9026k7850k6771k5686k4836k3905k1853j8426
$$ 1879361 1846390 1814424 1783925 1754899 1727049 1700278 1674592 1649756 1625851 1603998 1585572
53329A585572j5069j3316j2883j2377j1458j1101j1890j3238j4474j5681j7047
$$ 1585572 1570503 1557187 1544304 1531927 1520469 1509368 1497478 1484240 1469766 1454085 1437038
53318A437038j8153j8398j7823j7005j6329j5590j4346j2509j0530q949p811o706
$$ 1437038 1418885 1400487 1382664 1365659 1349330 1333740 1319394 1306885 1296355 1287406 1279595 1272889
53306A272889n359l932k724j852j222n25P15K667M756O216P140Q331J0069J1794
$$ 1272889 1267530 1263598 1260874 1259022 1257800 1257275 1257990 1260657 1265413 1271629 1278769 1287100 1297169 1308963
53292A308963J3257J5056J7441J9462K0168K0042K0294K1052K1273K0313J8640
$$ 1308963 1322220 1337276 1354717 1374179 1394347 1414389 1434683 1455735 1477008 1497321 1515961
53281A515961J6977J5539J4237J2997J1578R683P403N176L108Q26j798m244o002
$$ 1515961 1532938 1548477 1562714 1575711 1587289 1596972 1604375 1609551 1612659 1613485 1611687 1607443 1601441
53268A601441p374r162j1620j4096j5870j7066j8455k0337k2063k2895k3019k3245
$$ 1601441 1594067 1584905 1573285 1559189 1543319 1526253 1507798 1487461 1465398 1442503 1419484 1396239
53256A396239k3882k4508k4790k4952k5192k5226k4722k3762k2618k1447k0442
$$ 1396239 1372357 1347849 1323059 1298107 1272915 1247689 1222967 1199205 1176587 1155140 1134698
53245A134698j9888j9784j9808j9913k0431k1275k1620k0852j9376j7965j6821
$$ 1134698 1114810 1095026 1075218 1055305 1034874 1013599 991979 971127 951751 933786 916965
53234I16965j5834j5232j5172j4988j3736j1492r335q083p600p342o995o572o425
$$ 916965 901131 885899 870727 855739 842003 830511 821176 813093 805493 798151 791156 784584 778159
53221G78159p170r018j1115j2236j2239j2286j3345j5032j6259j6561j6298j5844
$$ 778159 770989 761971 750856 738620 726381 714095 700750 685718 669459 652898 636600 620756
53209F20756j5174j4225j3234j2474j1862j1067j0008r021q453q250q160q162
$$ 620756 605582 591357 578123 565649 553787 542720 532712 523691 515238 506988 498828 490666
53197D90666q373q631q606q346q251q353q161p478o831o711o794o496n868n388
$$ 490666 482293 473662 465056 456710 448459 440106 431945 424467 417636 410925 404131 397635 391767 386379
53183C86379n104m648m026l691l816m026l978l710l310k678j850j205j079j397
$$ 386379 381275 376627 372601 368910 365094 361068 357090 353380 350070 347392 345542 344337 343258 341861
53169C41861j858k258k490k417j998j443j072r96j004q68o79p76j263j774j892
$$ 341861 340003 337745 335255 332838 330840 329397 328325 327329 326325 325457 324778 324002 322739 320965 319073
53154C19073j717j658j765j654j144n44j00K99O78O37Lo51o40n7M39N68N76O00
$$ 319073 317356 315698 313933 312279 311135 310591 310491 310790 311468 312105 312108 311457 310817 310760 311199 311767 312343 312943
53136C12943M64J65k2Jk4j99k27J30O73J072J343J747K332K819K920K588J996
$$ 312943 313407 313572 313550 313551 313527 313328 313101 313231 313904 314976 316319 318066 320398 323217 326137 328725 330721
53119C30721J398J109J404K211K908K769J756O96L68O71R09P17K46l27r83j520
$$ 330721 332119 333228 334632 336843 339751 342520 344276 344972 345340 346011 346920 347637 347883 347556 346573 345053
53103C45053j675j604j757k187k460k379k190j936j390q10r60j872k431j783o19
$$ 345053 343378 341774 340017 337830 335370 332991 330801 328865 327475 326665 325705 323833 321402 319619 319000
53088C19000k57j001k068k682k488j323M62J731J503J78q75q77j86N12P33J42
$$ 319000 318743 317742 315674 312992 310504 309181 309643 311374 312877 313055 312180 311303 311117 311629 312362 312504
53072C12504j137k092j637q7R85N87o46j508j566j127n00J45N49N59L35J04j07
$$ 312504 311367 309275 307638 307551 308536 309123 308477 306969 305403 304276 303776 303921 304470 305029 305364 305468 305361
53055C05361k95k80P5O42J170J472J437J109P90P58Q38N86o6o84r04p75m39O1
$$ 305361 305066 304786 304861 305503 306673 308145 309582 310691 311481 312239 313077 313663 313597 312913 312009 311234 310795 310856
53037C10856N35N72J4p50j170r65j21J125K154K229J260M6n28l62k5j4m22j062
$$ 310856 311391 311963 311977 311227 310057 309092 308971 310096 312250 314479 315739 315785 315257 314895 314870 314856 314434 313372
53019C13372j533j284p1J558K545K242J001k20o65k48N93J280J434J031M43J96
$$ 313372 311839 310555 310484 312042 314587 316829 317830 317610 316945 316697 317290 318570 320004 321035 321478 321674
53003C21674N10J038J219R35O15O90J129J648K106K472K562K172J436Q17P14J189
$$ 321674 322184 323222 324441 325376 325991 326681 327810 329458 331564 334036 336598 338770 340206 341023 341737 342926
52987C42926J993K694K877K442J777J369J222Q31j92j542k380k188j351p21n64
$$ 342926 344919 347613 350490 352932 354709 356078 357300 358131 357939 356397 354017 351829 350478 349757 349193
52972C49193k59O89J680J707Q53K92O43J149R42L85M33J136J647J541J281J318
$$ 349193 348934 349623 351303 353010 353863 354155 354798 355947 356889 357274 357707 358843 360490 362031 363312 364630
52956C64630J422J132M19l80r78j386j813k351k725k518j813j321j545k110k234
$$ 364630 366052 367184 367603 367223 366245 364859 363046 360695 357970 355452 353639 352318 350773 348663 346429
52941C46429j697r61m88l72m87o40n74j83L31P09Q89Q11L28m18r02q61o86p72
$$ 346429 344732 343771 343283 342911 342424 341784 341210 341027 341358 342067 342956 343767 344095 343677 342775 341914 341228 340456
52923C40456q78o73m49n87p28k65N71J009R57R80J195J108O12K17O9l55j223j857
$$ 340456 339578 338905 338456 337869 337141 336876 337447 338456 339413 340393 341588 342696 343308 343525 343594 343239 342016 340159
52905C40159j665r62m02j59n2kO4K74N04L53k21o67n06J56R51J668K105J940J155
$$ 340159 338494 337532 337130 336971 336919 336917 336981 337255 337759 338112 337891 337224 336718 336874 337825 339493 341598 343538 344693
52886C44693K19m10o77o56l45M6J26o7J06R69J931K184J768J426J681K406L216
$$ 344693 344912 344502 343825 343169 342824 342870 342996 342929 343035 344004 345935 348119 349887 351313 352994 355400 358616
52869C58616L844M140L989L355K334J257N73L89J04j017k803m170m327l624k933
$$ 358616 362460 366600 370589 373944 376278 377535 378108 378497 378601 377584 374781 370611 366284 362660 359727
52854C59727k639k587k648k794k830k539k116k040k470k989l055k556j905j647
$$ 359727 357088 354501 351853 349059 346229 343690 341574 339534 337064 334075 331020 328464 326559 324912
52840C24912j946k443k607k231j498p16j20P0k46q83j405j469j046l87J43L01
$$ 324912 322966 320523 317916 315685 314187 313471 313351 313421 313175 312292 310887 309418 308372 307985 308128 308429
52824C08429J66M3N0M2M1L26Q41R82M35j65j6P33J307J471J530J416P79j3k5Q10
$$ 308429 308595 308638 308688 308730 308771 309097 309938 310920 311355 311190 311174 311907 313214 314685 316215 317631 318410 318397 318372 319182
52804C19182J341P60m06j236j632j947k131j999j818j935k110j896j391j047r39
$$ 319182 320523 321283 320877 319641 318009 316062 313931 311932 310114 308179 306069 304173 302782 301735 300796
52789C00796p90o15o82q76o72J10R28J185R95J023J567K143K091J519J192J483
$$ 300796 300006 299391 298709 297833 297161 297271 298199 299384 300379 301402 302969 305112 307203 308722 309914 311397
52773C11397J835J607R79N50L56l5o54j081j215j362j499j195l99L17M98K77j6
$$ 311397 313232 314839 315818 316368 316724 316689 316035 314954 313739 312377 310878 309683 309284 309601 310099 310376 310360
52756C10360j27K59J209K036J908J116Q58J490J942J367M16K19Q51J547J825J661
$$ 310360 310233 310492 311701 313737 315645 316761 317619 319109 321051 322418 322834 323053 323904 325451 327276 328937
52740C28937J134N70N80J272J788J324K46m23k45M10J101J522J403P90K48K50
$$ 328937 330071 330641 331221 332493 334281 335605 335851 335428 335183 335593 336694 338216 339619 340409 340657 340907
52724C40907N56O81N72L76m2p54j304j241q56p72j065j330j336j109o51j26O5
$$ 340907 341463 342144 342716 343092 343050 342296 340992 339751 338895 338123 337058 335728 334392 333283 332632 332506 332571
52707C32571j06pO77J213P62l42j087j160r38n03L09J092J179P19M92O29N21M1
$$ 332571 332465 332458 333135 334348 335110 334768 333681 332521 331583 331080 331389 332481 333660 334379 334871 335500 336021 336062
52689C36062j73J36M02K50P1K13L62J40k59n05o55q34r18q10o26l71N9L94J32
$$ 336062 335889 336025 336427 336677 336748 336961 337323 337463 337204 336699 336044 335210 334292 333482 332856 332485 332544 332938 333070
52670C33070n57p58j01N71L36m71q02k99N66J426K257K727K212P61n42n86O41
$$ 333070 332513 331755 331654 332225 332561 332090 331288 330989 331555 332981 335238 337965 340177 340938 340396 339810 340451
52653C40451K232L371L846L769L262K432J459M49n63j427j853j730j341j038p99
$$ 340451 342683 346054 349900 353669 356931 359363 360822 361271 360708 359281 357428 355698 354357 353319 352520
52638C52520l85J49L90Q0n70j152j397j148l38Q61K057K956L427L295K428J135
$$ 352520 352135 352284 352674 352754 352184 351032 349635 348487 348149 349010 351067 354023 357450 360745 363173 364308
52622C64308M2o37j326k300l111l159k483j586p84j96q8o07j289j382p07J80P06
$$ 364308 364350 363713 362387 360087 356976 353817 351334 349748 348964 348768 348680 348073 346784 345402 344695 344875 345581
52605C45581Q20P87P76P81P48O88O73P07O53M29K38K89L51J3n49o69j87K19R1
$$ 345581 346401 347188 347964 348745 349493 350181 350854 351561 352214 352643 352881 353170 353521 353534 352985 352316 352129 352348 352439
52586C52439j9N78J552J943J439O70L47O29J189J449R65q6r07r28m00J32N28Q37
$$ 352439 352420 352998 354550 356493 357932 358602 358949 359578 360767 362216 363181 363095 362188 361260 360860 360992 361520 362357
52568C62357Q54M75M9j33l34p60r29m05K66K36l73p54p31p80r23o81j38j1m94
$$ 362357 363211 363686 363735 363602 363268 362508 361579 361174 361440 361676 361303 360549 359818 359038 358115 357434 357296 357285 356791
52549C56791r51r99j008j233j298r19m16q4K64P55J072R60O18K61j43m47k27N11
$$ 356791 355840 354841 353833 352600 351302 350383 349967 349883 350147 350902 351974 352934 353552 353813 353670 353223 352996 353507
52531C53507J067R67O03N99R59J287J462J603J641J423J108J066J481K189K842
$$ 353507 354574 355541 356144 356743 357702 358989 360451 362054 363695 365118 366226 367292 368773 370962 373804
52516C73804L130L069L066L441L904L917L504L199L073K523J239j71j043j550
$$ 373804 376934 380003 383069 386510 390414 394331 397835 401034 404107 406630 407869 407698 406655 405105
52502D05105k268l170l721l747l647l740l869l769l467l133k714j976r56j72j69
$$ 405105 402837 399667 395946 392199 388552 384812 380943 377174 373707 370574 367860 365884 364928 364756 364587
52487C64587q18j354j231o88k95k60m28n98m71L26J638K515K217J329J124J927
$$ 364587 363769 362415 361184 360496 360201 359941 359513 358915 358444 358770 360408 362923 365140 366469 367593 369520
52471C69520K906L356L389L248K870K454K587L347L892L492K406J327M61l78j170
$$ 369520 372426 375782 379171 382419 385289 387743 390330 393677 397569 401061 403467 404794 405255 404877 403707
52456D03707j783k314k919l467l744l788l755l684l660l858m168m035l075j636
$$ 403707 401924 399610 396691 393224 389480 385692 381937 378253 374593 370735 366567 362532 359457 357821
52442C57821m78j5o7k15j75kPl43q98j415j825j954j246M90K239K594J533N42
$$ 357821 357343 357328 357261 357046 356871 356869 356876 356533 355635 354220 352395 350441 349195 349685 351924 354518 356051 356593
52424C56593O19J143J154Q55R69J308J054K06l02Q7R29J574J969K411K974L412
$$ 356593 357212 358355 359509 360364 361333 362641 363695 363901 363599 363686 364615 366189 368158 370569 373543 376955
52408C76955L496L298L275M008N704P878R724J0689J0721J0067Q987P500N401
$$ 376955 380451 383749 387024 391032 396736 404614 414338 425027 435748 445815 454802 462302 467703
52395D67703K651k25k541m230n864p669q982r042p952o501n227m080k846j513
$$ 467703 470354 470129 467588 463358 457494 449825 440843 431801 423849 417348 412121 408041 405195 403682
52381D03682k50O95J172J320J518J993K557K943L213L658M331M824M590L469J986
$$ 403682 403432 404127 405299 406619 408137 410130 412687 415630 418843 422501 426832 431656 436246 439715 441701
52366D41701R71P20O66J44p40j346j438j346j253r69m83j48j06n2K49O43R79J321
$$ 441701 442672 443392 444058 444202 443462 442116 440678 439332 438079 437110 436627 436479 436373 436321 436570 437213 438192 439513
52348D39513J602J624J530J732K197K430K360K466K745K489J578J116J995L581
$$ 439513 441115 442739 444269 446001 448198 450628 452988 455454 458199 460688 462266 463382 465377 468958
52334D68958M736N533O874Q774J0167J0438J0190J0333J1106J2195J3173J3607
$$ 468958 473694 479227 486101 494875 505042 515480 525670 536003 547109 559304 572477 586084
52322E86084J3222J2180J0979J0037R589R815J0610J1371J1602J1722J2763J5083
$$ 586084 599306 611486 622465 632502 642091 651906 662516 673887 685489 697211 709974 725057
52310G25057J7835J9943K1177K2125K3308K4714K6025K7032K7778K8460K9238
$$ 725057 742892 762835 784012 806137 829445 854159 880184 907216 934994 963454 992692
52299I92692L0052L0478K9823K7649K4397K1245J9008J7362J5500J3308J1358
$$ 992692 1022744 1053222 1083045 1110694 1135091 1156336 1175344 1192706 1208206 1221514 1232872
52288A232872R887Q515P073N871M902L532J457o72k079k814l360l778l889l877
$$ 1232872 1242759 1251274 1258347 1264218 1269120 1272652 1274109 1273437 1271358 1268544 1265184 1261406 1257517 1253640
52274A253640m098m484m717m731m583m078l073j944j165o59%R36J965L029M171
$$ 1253640 1249542 1245058 1240341 1235610 1231027 1226949 1223876 1221932 1220767 1220108 1220108 1221044 1223009 1226038 1230209
52259A230209N327O723R041J2538J6129J8228J8511J8243J8697J9791K0412J9656
$$ 1230209 1235536 1242259 1251300 1263838 1279967 1298195 1316706 1334949 1353646 1373437 1393849 1413505
52247A413505J7554J4955J2872J1719J1080J0276R084P788O685N794M875L519
$$ 1413505 1431059 1446014 1458886 1470605 1481685 1491961 1501045 1508833 1515518 1521312 1526187 1529706
52235A529706J405j271l891o063p964r762j1215j2184j3089j4292j5378j5678
$$ 1529706 1531111 1529840 1525949 1519886 1511922 1502160 1490945 1478761 1465672 1451380 1436002 1420324
52223A420324j5279j4945j5175j5828j6475j6651j5962j4511j3021j2018j1187
$$ 1420324 1405045 1390100 1374925 1359097 1342622 1325971 1310009 1295498 1282477 1270459 1259272
52212A259272j0067r052q870r235q998p608n647l812k163o68L39O79Q51J524K800
$$ 1259272 1249205 1240153 1231283 1222048 1213050 1205442 1199795 1195983 1193820 1193152 1193491 1194170 1195021 1196545 1199345
$$ [...]
##END NTUPLES=NMR SPECTRUM
##END=
