##TITLE=AC1652_NBEAH14353_8530975_WknsuoUOY3
##JCAMPDX= 6.0         $$ Bruker NMR JCAMP-DX V2.0
##DATA TYPE= NMR SPECTRUM
##DATA CLASS= NTUPLES
##ORIGIN= BRUKER
##OWNER= Administrator
$$ 1.72 TOPSPIN		Version 2.1
$$ 2014-03-14 14:02:21.662 -0800  Administrator@X
$$ Compression mode = diff/dup
##.OBSERVE FREQUENCY= 400.02188249412
##.OBSERVE NUCLEUS= ^1H
##.ACQUISITION MODE= SIMULTANEOUS (DQD)
##.ACQUISITION SCHEME= undefined
##.AVERAGES= 8
##.DIGITISER RES= 22
##SPECTROMETER/DATA SYSTEM= spect
##.PULSE SEQUENCE= zg30
##.SOLVENT NAME= COFFEE_meoh
##.SHIFT REFERENCE= INTERNAL, COFFEE_meoh, 1, 14.98509
##AUDIT TRAIL= $$ (NUMBER, WHEN, WHO, WHERE, PROCESS, VERSION, WHAT)
$$ ##TITLE= Audit trail, TOPSPIN		Version 2.1
$$ ##JCAMPDX= 5.01
$$ ##ORIGIN= Bruker BioSpin GmbH
$$ ##OWNER= Administrator
$$ $$ E:\/data/COFFEE/nmr/AC1652_NBEAH14353_8530975_WknsuoUOY3/10/pdata/1/auditp.txt
$$ ##AUDIT TRAIL=  $$ (NUMBER, WHEN, WHO, WHERE, PROCESS, VERSION, WHAT)
(   1,<2014-03-14 14:02:13.912 -0800>,<Administrator>,<X>,<go>,<TOPSPIN 2.1>,
      <created by zg
	started at 2014-03-14 14:01:06.259 -0800,
	POWCHK enabled, PULCHK disabled,
       configuration hash MD5:
       C8 4E 4E 5D D3 5C D8 9E 9F 52 82 E0 59 8A DE 15
       data hash MD5: 64K
       E4 A2 0F 85 08 93 A9 12 38 73 86 B3 A2 CC ED 6B>)
(   2,<2014-03-14 14:02:17.115 -0800>,<Administrator>,<X>,<proc1d>,<TOPSPIN 2.1>,
      <Start of raw data processing
       efp LB = 0 FT_mod = 6 PKNL = 1 PHC0 = 0 PHC1 = 0 SI = 32K 
       data hash MD5: 32K
       31 05 53 F5 C7 60 46 F0 48 12 4C 06 92 64 D4 7D>)
(   3,<2014-03-14 14:02:17.506 -0800>,<Administrator>,<X>,<proc1d>,<TOPSPIN 2.1>,
      <pk PHC0 = 95.58105 PHC1 = 0 
       data hash MD5: 32K
       81 C4 64 B5 6D 56 BD D5 A6 4B 56 72 C6 65 0E 53>)
(   4,<2014-03-14 14:02:17.646 -0800>,<Administrator>,<X>,<proc1d>,<TOPSPIN 2.1>,
      <abs ABSG = 1 
       data hash MD5: 32K
       E1 23 B6 11 83 DC 0E BD B5 09 8F 78 8D 66 D7 7A>)
(   5,<2014-03-14 14:02:17.756 -0800>,<Administrator>,<X>,<proc1d>,<TOPSPIN 2.1>,
      <abs ABSG = 2 
       data hash MD5: 32K
       87 93 11 2C 80 60 7D B2 A7 FA 31 2C E0 F3 43 E2>)
(   6,<2014-03-14 14:02:17.881 -0800>,<Administrator>,<X>,<proc1d>,<TOPSPIN 2.1>,
      <abs ABSG = 3 
       data hash MD5: 32K
       4B 02 1A ED BE 19 DA 9D 72 31 85 0E 3D A0 49 BB>)
(   7,<2014-03-14 14:02:17.928 -0800>,<Administrator>,<X>,<proc1d>,<TOPSPIN 2.1>,
      <abs ABSG = 4 
       data hash MD5: 32K
       E6 F3 FE 01 39 78 2E 5F DC 40 79 D7 F7 92 9D 42>)
(   8,<2014-03-14 14:02:18.006 -0800>,<Administrator>,<X>,<proc1d>,<TOPSPIN 2.1>,
      <abs ABSG = 5 
       data hash MD5: 32K
       C2 E7 98 07 EA 25 C7 DE 8A 66 A0 EB 04 84 FA 8A>)
$$ ##END=
$$ 
$$ $$ hash MD5
$$ $$ 52 97 80 2D F8 4C 88 6B 9B FF D4 B5 B2 8F E9 5D
##$RELAX= 
##$RELAX= 
##$RELAX= 
##$RELAX= 
##$RELAX= 
##$RELAX= 
##$RELAX= 
$$ Bruker specific parameters
$$ --------------------------
##$DU= <E:\>
##$EXPNO= 10
##$NAME= <AC1652_NBEAH14353_8530975_WknsuoUOY3>
$$ [...]
150 150 150 150 150 150 150 150
##$TP07= 0
##$TPNAME0= <>
##$TPNAME1= <>
##$TPNAME2= <>
##$TPNAME3= <>
##$TPNAME4= <>
##$TPNAME5= <>
##$TPNAME6= <>
##$TPNAME7= <>
##$TPOAL= (0..7)
0.5 0.5 0.5 0.5 0.5 0.5 0.5 0.5
##$TPOFFS= (0..7)
0 0 0 0 0 0 0 0
##$TUNHIN= 0
##$TUNHOUT= 0
##$TUNXOUT= 0
##$USERA1= <user>
##$USERA2= <user>
##$USERA3= <user>
##$USERA4= <user>
##$USERA5= <user>
##$V9= 5
##$VALIST= <valist>
##$VCLIST= <CCCCCCCCCCCCCCC>
##$VD= 0
##$VDLIST= <DDDDDDDDDDDDDDD>
##$VPLIST= <PPPPPPPPPPPPPPP>
##$VTLIST= <TTTTTTTTTTTTTTT>
##$WBST= 1024
##$WBSW= 4
##$XGAIN= (0..3)
0 0 0 0
##$XL= 0
##$YL= 0
##$YMAX_a= 570613
##$YMIN_a= -485054
##$ZGOPTNS= <>
##$ZL1= 120
##$ZL2= 120
##$ZL3= 120
##$ZL4= 120
##$ABSF1= 14.98509
##$ABSF2= -5.573092
##$ABSG= 5
##$ABSL= 3
##$ALPHA= 0
##$AQORDER= 0
##$ASSFAC= 0
##$ASSFACI= 0
##$ASSFACX= 0
##$ASSWID= 0
##$AUNMP= <proc_prof1d_extract_pilot.lims>
##$AXLEFT= 0
##$AXNAME= <>
##$AXNUC= <1H>
##$AXRIGHT= 0
##$AXTYPE= 0
##$AXUNIT= <>
##$AZFE= 0.1
##$AZFW= 0.1
##$BCFW= 0
##$BC_mod= 0
##$BYTORDP= 0
##$COROFFS= 0
##$CY= 15
##$DATMOD= 1
##$DC= 0
##$DFILT= <>
##$DTYPP= 0
##$F1P= 0
##$F2P= 0
##$FCOR= 0.5
##$FTSIZE= 32768
##$FT_mod= 6
##$GAMMA= 0
##$GB= 0
##$INTBC= 1
##$INTSCL= 1
##$ISEN= 128
##$LB= 0
##$LEV0= 0
##$LPBIN= 0
##$MAXI= 10000
##$MC2= 0
##$MEAN= 0
##$ME_mod= 0
##$MI= 0
##$NCOEF= 0
##$NC_proc= -8
##$NLEV= 6
##$NOISF1= 0
##$NOISF2= 0
##$NSP= 0
##$NTH_PI= 0
##$NZP= 0
##$OFFSET= 14.98509
##$PC= 1
##$PHC0= 95.58105
##$PHC1= 0
##$PH_mod= 1
##$PKNL= yes
##$PPARMOD= 0
##$PPDIAG= 0
##$PPIPTYP= 0
##$PPMPNUM= 2147483647
##$PPRESOL= 1
##$PSCAL= 4
##$PSIGN= 0
##$PYNMP= <proc.py>
##$REVERSE= no
##$SF= 400.02
##$SI= 32768
##$SIGF1= 0
##$SIGF2= 0
##$SINO= 400
##$SIOLD= 32768
##$SPECTYP= <>
##$SREGLST= <1H.CDCl3>
##$SSB= 0
##$STSI= 32768
##$STSR= 0
##$SW_p= 8223.68421052631
##$SYMM= 0
##$S_DEV= 0
##$TDeff= 65536
##$TDoff= 0
##$TI= <>
##$TILT= no
##$TM1= 0
##$TM2= 0
##$TOPLEV= 0
##$USERP1= <user>
##$USERP2= <user>
##$USERP3= <user>
##$USERP4= <user>
##$USERP5= <user>
##$WDW= 1
##$XDIM= 32768
##$YMAX_p= 453448665
##$YMIN_p= -660224
##$CURPLOT= <Network HP LaserJet P1505>
##$CURPRIN= <$Network HP LaserJet P1505>
##$DFORMAT= <normdp>
##$LAYOUT= <+/1D_H.xwp>
##$LFORMAT= <normlp>
##$PFORMAT= <normpl>
##$SURQMSG= 1
$$ End of Bruker specific parameters
$$ ---------------------------------
##NTUPLES= NMR SPECTRUM
##VAR_NAME=  FREQUENCY,     SPECTRUM/REAL,   SPECTRUM/IMAG
##SYMBOL=    X,             R,               I
##VAR_TYPE=  INDEPENDENT,   DEPENDENT,       DEPENDENT
##VAR_FORM=  AFFN,          ASDF,            ASDF
##VAR_DIM=   32768,         32768,           32768
##UNITS=     HZ,            ARBITRARY UNITS, ARBITRARY UNITS
##FACTOR=    0.250966925370066, 1,           1
##FIRST=     8223.43324360094, 87995,        -221747
##LAST=      0,             -130918,         -35534
##MIN=       0,             -660224,         0
##MAX=       8223.43324360094, 453448665,    0
$$ Real data points
##PAGE= N=1
##DATA TABLE= (X++(R..R)), XYDATA
$$ [...]
19570A45457a38468k57332E28203a191k14375i5796M4001l00869H7661b09343
19559a56891I5010d0726B44422B9550f3241p0367l0005f0782j47047b4404j42508
19548a66912J8092J3546j01715c2827A05802b05286C05576j39431f9487I1950
19537c64791C3772j1450f8930l25542b7393B8832i6852j0714J2375j48809A9127
19525c07435a0869C9018e7929l68822J50546L5784A73744d046H0238d2762m4447
19514h7209G930e6115J0850k5716G9258J16366a42450b9547n1200L4753k27394
19503b73388I6330A8217c9264l27293A09008e6394j01968c031k45951O7439j6930
19492a98473D7756b30579D3660a3143j14985G7806r787b45519a0004B43983a05297
$$ plain form
19570 145457 -138468 -395800 528203 -1191 -215566 -95796 -51795 -352664 87661 -209343
19559 -156891 95010 -40726 244422 29550 -63241 -133608 -163613 -60782 -207829 -24404 -166912
19548 -166912 -148820 -135274 -236989 -32827 105802 -205286 305576 166145 -69487 91950
19537 -364791 33772 22322 -68930 -394472 -27393 28832 -96852 -107566 -95191 -244000 19127
19525 -307435 -10869 39018 -57929 -426751 -276205 -240421 173744 -4046 80238 -42762 -87209
19514 -87209 7930 -56115 -45265 -70981 79258 195624 -142450 -29547 -80747 -45994 -273388
19503 -273388 96330 18217 -39264 -366557 109008 -56394 -158362 -3031 -248982 -181543 -198473
19492 -198473 47756 -230579 43660 -13143 -128128 77806 68019 -245519 -10004 243983 -105297
19480h9783n0796H1259a23788J5006k93791C9815C772J70290b56480m7073A17493
19468a65433b1931A67957a36046o6353a9447k68053B18276K0941a20177j22033
19458b42210A91368a80952M4380b379l46057r6338i004F0030L4605c5934H586
19446B58565b59678C3235J43006b85627f1834B23827b34220r8398J01253O7040
19436a64325d5165l9954L2208o4621l88706f2670o9965A18195k9472c8468l91235
19425d29703a77045P1378d1521D0045b27456J12206j59908K2774A85535b1324
19414B85479a62813D1043K57801A29861A2139J04368b4610j92158i98k7004j84256
19403b12258i5207b3243k16861h026A52360c42065A3497b68828c7101a8425O308
$$ plain form
19480 -89783 -140579 81259 -123788 -108782 -402573 39815 3772 174062 -256480 -303553 117493
19468 -165433 -21931 167957 -136046 -202399 -19447 -287500 218276 239217 -120177 -242210
19458 -242210 191368 -180952 -136572 -2379 -348436 -444774 -9004 60030 94635 -35934 8586
19446 258565 -259678 33235 176241 -285627 -61834 223827 -234220 -332618 -231365 -164325
19436 -164325 -45165 -85119 -52911 -117532 -506238 -62670 -132635 118195 88723 -38468 -429703
19425 -429703 -177045 -105667 -41521 40045 -227456 -115250 -275158 -252384 185535 -21324
19414 285479 -162813 41043 298844 129861 12139 116507 -24610 -216768 -998 -28002 -212258
19403 -212258 -95207 -23243 -240104 -8026 152360 -342065 13497 -268828 -37101 -18425 -12117
19392a2117A23493a60594C04392b57598e6538B235i4879l8932m229N1351k13749
19381c00438B95125b1189B2474i1377p5792h1372n5772b8982l99990a14735d305
19369A04150a82490B05266g1251o9293o6228A56910b02575H972i0354A30784j9562
19358A11222a86830k3372C1315b30808i3932c0720B9009j4260g2774A40841D5418
19346b46613L1383J7660r326O8506G5303c44972M9992J28470o0284C3054O6832
19335I9886h4957k07688J24655H886d2077I3007a13624l7947B27336b27787j3467
19324b41254P9866j44042C11413A00988J36640a91763P8994A4801a16462j44078
19314b60540c6011k28591P2624A05275d39557A50736c82846J89970B25979a16466
$$ plain form
19392 -12117 123493 -160594 304392 -257598 -56538 2235 -94879 -133811 -138040 -86689 -300438
19381 -300438 295125 -21189 22474 -91377 -167169 -81372 -137144 -28982 -428972 -114735 -4305
19369 104150 -182490 205266 -71251 -140544 -206772 156910 -202575 8972 -90354 130784 111222
19358 111222 -186830 -210202 31315 -230808 -93932 -30720 29009 14749 -72774 140841 45418
19346 -246613 -215230 -197570 -206896 -138390 75303 -344972 -294980 -166510 -226794 33054 99886
19335 99886 -84957 -292645 -167990 8886 -42077 93007 -113624 -151571 227336 -227787 -241254
19324 -241254 -161388 -305430 311413 100988 237628 -191763 -112769 14801 -116462 -260540
19314 -260540 -36011 -264602 -191978 105275 -439557 150736 -382846 -192876 225979 -116466
19303a84140f0565j08258M8351B7247R3110a48681b1138A65581J3542l0249a10718
19291D6038g8618j05542f6262j70056j5985b7677l4631k82152D067a83891h1074
19279c7160n7584D4388R0057b80240L8572a00701Q935C1207M8903a10202A31002
19267b49835R4019L5284K0456c1947D5717b87340a21330k9451m325a3456C2874
19255E7552Q875h6946F6236J4990a59410A9490i0882A21517a85071M7737d2944
19243e4327P934F6868A5389a00626q6292k29777n6329D0994a86746m7284C15698
19231c9992A76499F6440b2365j48108p5530H2711a73140A05040a28913p0597H7485
19219h7410l9597l2799k1651k4488D0269f8339m3713n2347c1404G5192g7048B33342
$$ plain form
19303 -184140 -60565 -168823 -120472 27247 120357 -148681 -21138 165581 179123 148874 -110718
19291 46038 -78618 -184160 -66262 -236318 -252303 -27677 -62308 -344460 4067 -183891 -81074
19279 -37160 -94744 44388 134445 -280240 -241668 -100701 -91766 31207 80110 -110202 131002
19267 -249835 -155816 -120532 -100076 -31947 45717 -287340 -121330 -150781 -155106 -13456 32874
19255 57552 66427 -86946 66236 81226 -159410 19490 -90882 121517 -185071 -137334 -42944
19243 -54327 -46393 66868 15389 -100626 -186918 -416695 -473024 40994 -186746 -234030 315698
19231 -39992 176499 66440 -22365 -170473 -246003 82711 -173140 105040 -128913 -199510 87485
19219 -87410 -127007 -159806 -181457 -205945 40269 -68339 -112052 -164399 -31404 75192 -77048 233342
19206B56487a07566D3766b41611M4612C1842c40260J66437j58127A20117C1765
19195B74531a47608I2155h5034L0691k37516B7727J55120e00785i8237b8530j71000
19184a99530A48769p785a27322j86899J06887B36570d6472c989p4455A53437j6720
19173A36717a62176A77984H2991a38840j33778d2846j23770A30932O0981E2246
19162b06332k17072a6742o250k05573m91F7770J27528f8931n5620I6291a93982
19150B8924R1012b4174A72554a01227d5468F5420a17280I3822K7167A3477i6441
19138B3543O5873a40805A57482G5507a06757A46372D7039M2124a4363k14653l2584
19127b61600D2820N6729c6024m3767A60292o9422a09619l0481K1201B94487K046
$$ plain form
19206 256487 -107566 43766 -241611 -196999 31842 -340260 -173823 -331950 120117 31765
19195 274531 -147608 92155 -85034 -54343 -291859 27727 182847 -500785 -98237 -28530 -199530
19184 -199530 148769 140984 -127322 -314221 -207334 236570 -46472 -3989 -78444 153437 136717
19173 136717 -162176 177984 82991 -138840 -272618 -42846 -166616 130932 191913 52246
19162 -206332 -423404 -16742 -22992 -228565 -229056 67770 195298 -68931 -124551 96291 -193982
19150 28924 119936 -24174 172554 -101227 -45468 65420 -117280 93822 120989 13477 -96441
19138 23543 89416 -140805 157482 75507 -106757 146372 47039 89163 -14363 -229016 -261600
19127 -261600 42820 99549 -36024 -79791 160292 90870 -109619 -140100 -118899 294487 296533
19116B96533d34184a3170k64274h0276M359P647C5068b00262A5851a15951j11029
19105b26980B69477j05763D7857K56198D1215d97127a8436j21388D430O7380r625
19094F2185g7145k67185E4473c01385P4433j17315Q8699A58662j9894M5937a98766
19082a64943l83J7940A01453c5577m601k76456k081f2580a9055B604c0836j01042
19070a31878A38082R8743j2349b53869c1662j89759h1959j75246A22969c5124
19059b17610C35225c9834o3623i411j59693k2651A20291a07695E179b50525a0735
19047A64383K9246a09746A25751M9016n0243E5795a55797C7546N527a20542j01359
19036b21901m0070N8233q1613a9753p1207K4175A05720d1212I8602a49176d9132
$$ plain form
19116 296533 -434184 -13170 -277444 -80276 -75917 -68270 35068 -200262 15851 -115951 -226980
19105 -226980 269477 163714 47857 304055 41215 -497127 -18436 -139824 4430 71810 62185
19094 62185 -77145 -344330 54473 -301385 -226952 -344267 -255568 158662 138768 184705 -198766
19082 -164943 -165326 -147386 101453 -35577 -40178 -316634 -318715 -62580 -19055 2604 -30836 -131878
19070 -131878 138082 236825 224476 -253869 -31662 -221421 -81959 -257205 122969 -35124
19059 -217610 335225 -39834 -103457 -9411 -169104 -191755 120291 -107695 5179 -250525 -10735
19047 164383 193629 -109746 125751 174767 124524 55795 -155797 37546 43073 -120542 -221901
19036 -221901 -261971 -203738 -285351 -19753 -90960 -66785 105720 -41212 98602 -149176 -49132
19024B38799a30193I5974C3043N2598b89103A90974c8592A50414n9736i2637c1101
19012a07000A70484a35635B44109a71478a8931G5630b08297b6254j16553N8448
19002h4359j70239B83634a6989H6298B2354R8086e2410A47564a33383A71163o9170
18991A01993i7521B4272R0849f9161A07617d33921B7555l006a7861j2791k83085
18980c13737I7744c80913H0289a53221j56041J2921A37258b95988J43583M6668
18970a05737j5964l5117C7558b64928H0808J06316h8797B92520j39120k5669K627
18959A30358c8867l20663J01191E9353B4137d2427A71174b50291F6094M6656a17076
18947c97931f5486J6965G7272a3844k62347O1272C2587a65246d5627B82723b64800
$$ plain form
19024 238799 -130193 95974 33043 85641 -289103 190974 -38592 150414 90678 -92637 -31101
19012 -107000 170484 -135635 244109 -171478 -18931 75630 -208297 -26254 -142807 -84359
19002 -84359 -254598 283634 -16989 86298 22354 120440 -52410 147564 -133383 171163 101993
18991 101993 -97521 24272 115121 -69161 107617 -433921 27555 24549 -17861 -30652 -313737
18980 -313737 97744 -380913 80289 -153221 -309262 -296341 137258 -295988 -152405 -105737
18970 -105737 -121701 -156818 37558 -264928 80808 187124 -88797 292520 153400 127731 130358
18959 130358 -38867 -359530 -258339 59353 24137 -42427 171174 -250291 66094 112750 -117076
18947 -397931 -65486 -48521 77272 -13844 -276191 -214919 32587 -165246 -45627 282723 -264800
18935b49929A23003a05346m9548r7673c6924B82247b45850g6006k27876a47272
18924f8576k60010J03106h0743L3344l11465a40701E6067a39087A5665L3450a87844
18912a80731k3698j39550g6873k35084a10259C7844a63243P4658o8550A63819
18901A68250f9972N511j6369A17138a18764G2804J17795L1079a8313j1418j37786
18890a67517h1087K0820J97A71433b56691E1520d6174B51160d0342j14317P5586
18879g9073r5447d1587B27676D090J96997G6212B0156c15j19474m3213j04260
18868b67262J29942A7371b74005B99530a94959J0216D2860E847J03819D8419N1803
18857A00222O7648M1586a09816F4885o245c331k82168A04332a9850j53038l2602
$$ plain form
18935 -249929 123003 -105346 -154894 -252567 -36924 282247 -245850 -76006 -303882 -147272
18924 -68576 -328586 -225480 -80743 -47399 -358864 -140701 56067 -139087 15665 49115 -187844
18912 -180731 -204429 -343979 -76873 -311957 -110259 37844 -163243 -88585 -157135 163819
18901 168250 -69972 -64461 -80830 117138 -118764 72804 190599 221678 -18313 -29731 -167517
18890 -167517 -81087 -60267 -60070 171433 -256691 51520 -46174 251160 -40342 -154659 -79073
18879 -79073 -174520 -41587 227676 4090 201087 76212 20156 -315 -119789 -163002 -267262
18868 -267262 -137320 17371 -274005 299530 -194959 -184743 42860 5847 109666 48419 100222
18857 100222 167870 209456 -109816 64885 58640 -3331 -285499 104332 -19850 -172888 -205490
18846b05490R6276A18969b21734k0471I5989b93004a20350e8646A25478c9108
18835F8891k4698a63413A58676f8066j17086L4100C05294g968l19666M946a08522
18823a33363M9462l3331j45475I5190k0945k1873R050A9504K6307K35137i6362
18811b13590D37401A796L4631a71246A52117n0176f3423k055A57839D0752N9382
18800A00134c20752a34667a8903k01032B06572n5868D7245Q3057n4138a81745
18789A71287J4888Q9701A37917b04535k6237j06153f4952B41258a9134j41845
18779a60979M109n1576A80002B85a05125k70483a83780A36914h9012J5191q1144
18768a54965M1497A17228o900b80830c942l67443J38235A22701b9773J1138B03415
$$ plain form
18846 -205490 -109214 118969 -221734 -242205 95989 -293004 -120350 -58646 125478 -39108
18835 68891 44193 -163413 158676 -68066 -185152 -151052 305294 -7968 -327634 -322688 -108522
18823 -133363 -83901 -117232 -262707 95190 74245 52372 61422 19504 45811 280948 -96362
18811 -213590 437401 1796 36427 -171246 152117 101941 -63423 -65478 157839 40752 100134
18800 100134 -320752 -134667 -18903 -219935 206572 150704 47245 130302 76164 -181745
18789 171287 186175 275876 137917 -204535 -230772 -336925 -64952 241258 -19134 -160979
18779 -160979 -156870 -208446 180002 285 -105125 -375608 -183780 136914 -89012 -73821 -154965
18768 -154965 -113468 117228 110328 -280830 -3942 -371385 -233150 122701 -29773 -18635 203415
18756a19720F2165a02726o6627q605B7831g1099G676b03832A07743K4317c78234
18744a41401d2498k16522l8141A13855d7980B19070A2465J44761a08034B03051
18733c89194J30614n6435A73038i4350j06070b3867k83672C01660a40605j36437
18723b77042A27992a04358p4773G3905a57902j943C553M5064a43103j05695L9670
18712b09128P0966G878g6470k80012J62992E63170g0036o1494F0486P0194H889
18700f2329A65240O0488a11411n9234f7479K5333k0408a7861A35346a01283a8316
18688I9305K9851c29391B85068j32431b46001Q9509f5318p3357a8018j11024A72815
18676c5326k37830A45622b74509J36993l4934C013K47442i0712a2656m4895j85933
$$ plain form
18756 -119720 62165 -102726 -169353 -177958 27831 -71099 7676 -203832 107743 132060 -378234
18744 -141401 -42498 -259020 -297161 113855 -47980 219070 12465 157226 -108034 203051
18733 -389194 -258580 -315015 173038 -94350 -200420 -23867 -307539 301660 -140605 -277042
18723 -277042 127992 -104358 -179131 73905 -157902 -159845 3553 48617 -143103 -248798 -209128
18712 -209128 -138162 7878 -76470 -356482 -193490 563170 -70036 -131530 60486 130680 8889
18700 -62329 165240 225728 -111411 -170645 -67479 -42146 -62554 -17861 135346 -101283 -18316
18688 99305 129156 -329391 285068 152637 -246001 -156492 -65318 -138675 -18018 -129042 172815
18676 -35326 -273156 145622 -274509 -137516 -172450 3013 250455 -90712 -12656 -57551 -243484
18665b43484I4574D0100N3223D6392a69219Q2167G1500c835n0119j37045D3528
18653g9151K2054m7811D7469R5207h9307a4789q947j19908f2066C5878a5518o9902
18641h5420B38846D8110d96631J39425a62949A55763b66215i5473L7991C697K32463
18630B36160a52277e9961g038A64667a20945e0243A27373c47070D5932Q9117a92553
18618C4151e2141D0616K87538j26026a89180B27854G6339b25111B06869i2495
18607a20431K0628m6864G6242b90154B7892d8986A1387a48021E7673b28959A14605
18595a51510c8871l56174B71570b02265B18681d34739I0627b20536B14520j0800
18585B03720d6916p379A77623b83899a880A28063e7606l18144B84610c14954B1125
$$ plain form
18665 -243484 94574 40100 93323 46392 -169219 -87052 71500 -3835 -53954 -190999 43528
18653 -79151 -57097 -104908 47469 142676 -89307 -14789 -23736 -143644 -62066 35878 -15518 -85420
18641 -85420 238846 48110 -496631 -357206 -162949 155763 -266215 -95473 -57482 3697 236160
18630 236160 -152277 -59961 -7038 164667 -120945 -50243 127373 -347070 45932 135049 -192553
18618 34151 -52141 40616 328154 202128 -189180 227854 76339 -225111 206869 -92495
18607 -120431 -99803 -146667 76242 -290154 27892 -48986 11387 -148021 57673 -228959 114605
18595 -151510 -38871 -395045 271570 -202265 218681 -434739 90627 -220536 214520 203720
18585 203720 -46916 -54295 177623 -283899 -1880 128063 -57606 -375750 284610 -314954 21125
18573A3272e3892K2022r8058n4953E18L81090A2076a00649p6678B7698i7520o8985
18561a66505M476B31438a54945J5588k49057e2979j25997O3787C3331j1053M41318
18550D63596b12081H411N4138c7940r8042j13512D5573a75411P9402j93406J31416
18539a57999b2571G7214c07315O1714K3061O4488j01677h1855q551j21021J6142
18528a95285j09789d4601k82185e8763k63102g7755r7157B01785e97617a86448
18517H0087J925d2565n6662j85543B6311J26413a20872B34667a87784j334r5663
18506b84781L082d9145A0890b80797A00774a13916B36125c39205B80580I307i4874
18494b33744a5628k17836g9603l7920O345n8387M9219c2938k67312G8395J09889
$$ plain form
18573 13272 -53892 -31870 -129928 -184881 518 381608 12076 -100649 -177327 27698 -97520 -166505
18561 -166505 -162029 231438 -154945 -139357 -388414 -52979 -178976 -115189 33331 22278 463596
18550 463596 -212081 8411 62549 -37940 -135982 -249494 45573 -175411 -96009 -289415 -157999
18539 -157999 -22571 77214 -307315 -245601 -222540 -158052 -259729 -81855 -90406 -211427 -195285
18528 -195285 -305074 -44601 -326786 -58763 -321865 -77755 -174912 201785 -597617 -186448
18517 80087 82012 -42565 -99227 -284770 26311 152724 -120872 234667 -187784 -189118 -284781
18506 -284781 -281699 -49145 10890 -280797 100774 -113916 236125 -339205 280580 9307 -94874
18494 -233744 -15628 -233464 -79603 -117523 -111178 -169565 -120346 -32938 -300250 78395 188284
18483A88284d8366q0624A00323j2333b37430k651P009a11374A76518c19390e7073
18471A63456L0887a60998A6753b2685k59052A26617a82283I8735A0041L91994
18461D02035H5000h7055l9921N1393A1337a8768E48636b11382F3443B2536b38894
18449a40541A91796N2425f5035n1413E9692B8929Q0603a78765L0283d5984A66022
18437a40556K6352d3460o2594e1041D02251a90365B6473b01753h637A64409q0914
18426H3495a6295p714j52211Q1960b5351q8194k1782B19464l0234a61572j19195
18415b80767k23277b49912a6930k21169k73558J72480h0232k1027H927K67356
18405B76283I3903J85228h758G9958J90371a42248n6150B8115M689J41350a71403
$$ plain form
18483 188284 -48366 -128990 100323 87990 -237430 -240081 -233072 -111374 176518 -319390 -57073
18471 163456 194343 -160998 16753 -22685 -281737 126617 -182283 98735 10041 402035
18461 402035 85000 -87055 -126976 -75583 11337 -18768 548636 -211382 63443 22536 -238894
18449 -140541 191796 244221 -65035 -116448 59692 28929 109532 -178765 -148482 -45984 166022
18437 -140556 -114204 -43460 -106054 -51041 402251 -190365 26473 -201753 -8637 164409 83495
18426 83495 -16295 -24009 -176220 -94260 -25351 -113545 -135327 219464 189230 -161572 -280767
18415 -280767 -504044 -249912 -16930 -238099 -511657 -339177 -80232 -101259 8927 276283
18405 276283 93903 279131 -8758 79958 270329 -142248 -198398 28115 32804 174154 -171403
18393F1477A8404a3571r7416B64818n1551h5545A27169g715H3849b63711A68608
18381A75538L7921b25659a12324J4200F7043d2671A35642j3925a5807A7183a77199
18369b70029R2587k9449r9261a13852B67315F3145i5776A961J56508h8082A11566
18357A41544J47850h2306I472J07966a40170N3395L8034p9390C41031m7013e7237
18345E7089J20603a69242h2873c6491O195A19440h9138B03270d78592d9186j09880
18334a59066p1937i1367A29680a00630j84939e2998j58239B5778b45731A143c91671
18322b19693d1226j06452j74447A22257C3348P8832D8552J27597d5092H6860c07362
18310I1319a85803A44953g5338F804i0037b8973k25188a20174C14695H4346f0085
$$ plain form
18393 61477 18404 -13571 -110987 264818 213267 -85545 127169 -7715 83849 -263711 168608
18381 175538 213459 -225659 -112324 -98124 67043 -42671 135642 121717 -15807 17183 -177199
18369 -270029 -177442 -206891 -306152 -113852 267315 63145 -95776 1961 158469 -88082 111566
18357 141544 289394 -82306 9472 117438 -140170 -86775 -48741 -128131 341031 294018 -57237
18345 57089 177692 -169242 -82873 -36491 -30296 119440 -89138 203270 -478592 -49186 -159066
18334 -159066 -231003 -91367 129680 -100630 -285569 -52998 -211237 25778 -245731 1143 -391671
18322 -219693 -41226 -147678 -322125 122257 33348 112180 48552 176149 -45092 86860 -307362
18310 91319 -185803 144953 -75338 6804 -90037 -28973 -254161 -120174 314695 84346 -60085
18298H3049J21849a6720P073j18769b7796C5237K1515b59747I3060J6591i2288
18286a03817B43812a82266B1606a16638B9284c12203B31387a84516D6217a92720
18275h1444m1664j16051i4973i453k31841n2097I1461g485D667e5804A09005b43852
18262b00117A81761a20102B18306P8811a90922F7218b03268F1067a4949j88453
18252b03402E4349J1553d48486B30983B2332J23297B3573a18114j30039e1738
18241G0092d97261a46081B8124a31004I0677b66935A58041b33388J05759k64097
18231c91726a56868C0602K87048a54272I2151b20400h8226B75367b6109I3900
18220a93409B4566M619b92841J33031C0142b5884n2832A40957B8024a1142C16339
$$ plain form
18298 83049 204898 -16720 -9647 -128416 -27796 35237 56752 -259747 93060 109651 -92288
18286 -103817 243812 -182266 21606 -116638 29284 -312203 231387 -184516 46217 -192720
18275 -81444 -123108 -239159 -94973 -9453 -241294 -293391 91461 -7485 4667 -55804 109005 -243852
18262 -200117 181761 -120102 218306 297117 -190922 67218 -203268 61067 -14949 -203402
18252 -203402 54349 65902 -448486 230983 22332 145629 23573 -118114 -248153 -51738
18241 70092 -497261 -146081 28124 -131004 90677 -266935 158041 -233388 -127629 -391726
18231 -391726 -156868 30602 317650 -154272 92151 -220400 -88226 275367 -26109 93900
18220 -193409 24566 29185 -292841 -159810 30142 -25884 -78716 140957 28024 -11142 316339
18208A08870a20775l1688H7759a16127e005B34859e1908q1741A81634H9191l8776
18197E0415c0842B77204d8919F0447e7176A31531a93615d1270q9677G2530A885
18185H3685b8455r1158q3096l12180b6108l29099c7808p1787c2507m1985k3552
18174i8044j97191E4286L33427a82175A53478a75217O9621A06933d643A06619
18163C2929d495D0018K98154a19172q1250A54945O3533k3636k4081c25637D5415
18151d5496j43823I9846e5008a6354B2513R7058c71383a70067J9446A31772B4886
18139A21833c0646k8105A80782n3447h8418k8810b5330H4577l2652i5689l2743
18128a28432j01794g0297B1628K69725A45119h7412k888q5561A83235a4606A81243
$$ plain form
18208 108870 -120775 -152463 87759 -116127 -5005 234859 -51908 -133649 181634 89191 50415
18197 50415 -30842 277204 -48919 60447 -57176 131531 -193615 -41270 -130947 72530 1885
18185 83685 -28455 -119613 -202709 -514889 -26108 -355207 -37808 -109595 -32507 -74492 -98044
18174 -98044 -295235 54286 387713 -182175 153478 -175217 -105596 106933 -4643 106619
18163 32929 -4495 40018 338172 -119172 -200422 154945 218478 194842 170761 -325637 45415
18151 -45496 -189319 99846 -55008 -16354 22513 119571 -371383 -170067 -150621 131772 24886
18139 121833 -30646 -58751 180782 127335 -88418 -117228 -25330 84577 51925 -95689 -128432
18128 -128432 -230226 -70297 21628 291353 145119 -87412 -90300 -175861 183235 -14606 181243
18116i1540j31166b1752o3665A3120Q2909c49239H4045b859m42199a01330j59803
18105b61133B7579c77823q222d7999J9560l5281L769B18812E4803a40407I7045
18093A42657b91584A31598J84916F1245M867c23110J11596a6422j63732b336k1731
18082b4067D6296b3317D7767J18566b43596a03372q7180A35392d7746A95055F4839
18070B8127h2830H200K04327c47592J59236A20205g3845E26Q4981b51038F2742
18058a44210F6324J48049B6244h9632B92921G9910b30123A14981K19422j22244
18048B12159a07734G5175A4308J81492F4317b0386k03777R1582k02373B6423J06694
18037A33117h4433o6600f7291L627r5649p1932K5256j31522A5894L41036A34536
$$ plain form
18116 -91540 -222706 -21752 -85417 13120 96029 -349239 84045 -2859 -445058 -101330 -261133
18105 -261133 27579 -377823 -386045 -47999 -28439 -63720 -59951 218812 54803 -140407 97045
18093 142657 -291584 131598 316514 61245 66112 -323110 -211514 -16422 -180154 -2336 -24067
18082 -24067 46296 -23317 47767 166333 -243596 -103372 -190552 135392 -47746 195055 64839
18070 28127 -82830 8200 212527 -347592 -188356 120205 -73845 526 85507 -251038 62742
18058 -144210 66324 214373 26244 -89632 292921 79910 -230123 114981 334403 212159
18048 212159 -107734 75175 14308 195800 64317 -20386 -224163 -132581 -334954 26423 133117
18037 133117 -84433 -151033 -67291 -63664 -159313 -231245 -205989 -337511 15894 356930 134536
18025A14464c26245g9812l8012B07192c20909j1396C9771a23277I5768d85927
18014B97688a91461G3776L77957a60115D3048b20441C4335a69910G5253d973H4292
18002g4297E9736g2744J0322o2289a1236r2144D3097d1564d316j11984A15124
17990G1485J24929b9106n8170F361a54029G1194a14602C3438h912m7715f716A42561
17977b51147f643k19201r383Q0450E989a14777H8112a57251A20157f4056j54682
17966b18738a1078j65828k16194G1109a22216B11921G7612i2277A14847q786e2865
17954H3418N3603o3536g4757a1322G8190a69513B50816d69l34357B1431e0108
17942B7965R6773e3044p6514A29367a25758d5353A47772D878a25370B99768f3297
$$ plain form
18025 114464 -326245 -79812 -117824 207192 -320909 -332305 39771 -123277 95768 -485927
18014 297688 -191461 73776 451733 -160115 43048 -220441 34335 -169910 75253 -4973 84292
18002 -74297 59736 -72744 -62422 -124711 -11236 -103380 43097 -41564 -4316 -116300 115124
17990 71485 196414 -29106 -87276 6361 -154029 71194 -114602 33438 -8912 -56627 -6716 142561
17977 -251147 -6643 -225844 -235227 -154777 5989 -114777 88112 -157251 120157 -64056 -218738
17966 -218738 -11078 -176906 -393100 71109 -122216 211921 77612 -92277 114847 106061 -52865
17954 83418 137021 73485 -74757 -11322 78190 -169513 250816 -469 -334826 21431 -50108
17942 27965 124738 -53044 -129558 129367 -125758 -45353 147772 4878 -125370 299768 -63297
17930B13903I1570h0357p7527j18399r867A41318c23658J04708I3829o070a58739
17918b87095B33928D1130A3447a70435O2591A5799e5248H5346C8378K16307c14611
17906F1220c3567D58J165a90925Q0407G9904Q8836f7033D75513b67917a03008
17894C2658g9489C7334c0085A37974a91269M6630B14272q5712e4575j41477Q8428
17883a07624I034M321K59702b6788H4044b02758H7969J60097b42212C0493a02880
17871A13462Q131B9764J67066E5220P2658a15590M9803r1401A55936G2488a56334
17859C8578d68477B22245B1697O9355h1431C32384m4874c17727b4195l09973B88661
17847b27255c5869l7350E3883J27907R1335b51866A68793c38432A56786J12972
$$ plain form
17930 213903 91570 -80357 -157884 -276283 -286150 141318 -323658 -218950 93829 87759 -158739
17918 -287095 233928 41130 13447 -170435 -107844 15799 -55248 85346 38378 254685 -314611
17906 61220 -33567 458 1623 -190925 -110518 79904 168740 -67033 475513 -267917 -103008
17894 32658 -79489 37334 -30085 137974 -191269 -144639 214272 128560 -54575 -196052 -107624
17883 -107624 9034 13355 273057 -26788 84044 -202758 87969 248066 -242212 30493 -102880
17871 113462 121593 29764 196830 55220 127878 -115590 -65787 -157188 155936 72488 -156334
17859 38578 -468477 222245 21697 91052 -81431 332384 287510 -317727 -24195 -334168 288661
17847 -227255 -35869 -73219 53883 181790 273125 -251866 168793 -338432 156786 269758
17837B69758I0499m5063b62463A25581d3211p1170C6265i0734B18829c56353A07199
17825G5790C4074P3220D8140a50084I2281e8559A6321h3454A56584a52113o6097
17814b18210B29425H50O0378b35383B0485i6631n2849A12765B9005J21456c3402
17802a21257D5653b37749J10363j48395G0634J0455d3845k05106a06757K6487
17792h0270B29858H4551f7562o9083o6116f7205l5982j17863i6719A49570c44226
17780c9442B4586l549a89514A1770M757a61036E1635a30058A83806a03650H0168
17768C9069b02219D2591a1095A99929c8207F7543K9183e44201a43024A39843a27354
17756B89329A11525l7851a82885I7055a64848A35976N8620E5865a15440J0868
$$ plain form
17837 269758 90499 45436 -262463 125581 -43211 -114381 36265 -90734 218829 -356353 107199
17825 75790 34074 107294 48140 -150084 92281 -58559 16321 -83454 156584 -152113 -218210
17814 -218210 229425 850 61228 -235383 20485 -96631 -149480 112765 29005 150461 -33402
17802 -121257 45653 -237749 -127386 -275781 70634 81089 -43845 -248951 -106757 -80270
17792 -80270 229858 84551 -67562 -136645 -202761 -67205 -103187 -221050 -96719 149570 -344226
17780 -39442 24586 21037 -189514 11770 16527 -161036 51635 -130058 183806 -103650 80168
17768 39069 -202219 42591 -11095 199929 -38207 67543 96726 -544201 -143024 139843 -127354
17756 289329 111525 73674 -182885 97055 -164848 135976 194596 55865 -115440 -104572
17746a04572C0818a21760q2396d5024B25660E3571a52525L0818o8528c6454o622
17735d3076A64125d2631j61263A37502b20468A71230F9270b15141i5063A62284
17724a59085B52332M8770b36787E1859L4466a15149j15508h0578L0345D45297
17713C11411o1755j04059g9352j80806d2071B2769b58218g0166A54910J84618
17703C39528f6528j43699B21218a46422A05729c46248A14632a74435j25366a44612
17692d2893l43462a81977A87136i1080r220H9704K71845C5764e1366j19200A85299
17680C53221j38813a31532M0439c4785j9504A03990n0987L6781a40253A41221
17669f4678B20192b41245A62829F3610J8115C1053a36811C5323J71629B4619g598
$$ plain form
17746 -104572 30818 -121760 -204156 -45024 225660 53571 -152525 -121707 -190235 -36454 -43076
17735 -43076 164125 -42631 -203894 137502 -220468 171230 69270 -215141 -95063 162284
17724 -159085 252332 301102 -236787 51859 86325 -115149 -230657 -80578 -50233 445297
17713 311411 249656 145597 -79352 -260158 -42071 22769 -258218 -70166 154910 339528
17703 339528 -66528 -210227 221218 -146422 105729 -346248 114632 -174435 -299801 -144612
17692 -42893 -386355 -181977 187136 -91080 -100300 89704 361549 35764 -51366 -170566 185299
17680 353221 214408 -131532 -91093 -34785 -54289 103990 53003 89784 -140253 141221
17669 -64678 220192 -241245 162829 63610 81725 31053 -136811 35323 206952 24619 -7598
17657A47712a7200B03216J38518q2270j07705K8776B117J5101J69722N1733B5968
17645a18488e6586j55307P9268L4167B01953E3483L6268J19774E2198R1399J14442
17634B58039H1197K32232o1878a83994A17661A2703b02148k05845J41412A194
17623b1541j67904H8001a88204F0463c1166A44097a3352j33897c8906A22861J06576
17612B29437H525K47599a63604B44126L6952g648B5516J65083l9838a21373F1864
17600B53103q4125a07143A70359d5938H921a8083C5354C148J44028P1162h9070
17588D5384J37330O4901a40799B66927k8057i9437A04117a76282k7783A72428
17577A79035E8763K9597K70740p9825b01137d2948C35770I3855a27267J9899I6795
$$ plain form
17657 147712 -17200 203216 341734 259464 151759 180535 2117 17218 186940 238673 25968
17645 -118488 -56586 -211893 -132625 -98458 201953 53483 89751 209525 52198 143597 258039
17634 258039 81197 313429 251551 -183994 117661 12703 -202148 -407993 -266581 1194
17623 -21541 -189445 88001 -188204 60463 -31166 144097 -13352 -147249 -38906 122861 229437
17612 229437 8525 256124 -163604 244126 281078 -7648 25516 190599 150761 -121373 61864
17600 253103 168978 -107143 170359 -45938 8921 -18083 35354 3148 147176 218338 -89070
17588 45384 182714 247615 -140799 266927 238870 -99437 104117 -176282 -204065 172428
17577 179035 58763 88360 359100 279275 -201137 -42948 335770 93855 -127267 -107368 96795
17565a83041A96068M6028A10580a37444C9296b18493C75130b53013n00E246a16467
17553B00561r9041a04086A14054i2719A08025e1760A37918P625a11761N856r335
17542a15240A21475k0137a37422m3131M9962B36407f4852A11336d18089A01294
17531B3274K21563A0047J57966i5252A95429P7112e0270G5495b06446B55828d9385
17519b83797b6140j68259F7325Q9049F4075K51930A03942P8404D7135d5443k33184
17508b78627A52297k2702a51855C6573b5305A69941K0540a03289Q826B41024j13999
17497A27025j589O4057a17246H392b07503L6196p0074a9361A96817a82874G7996
17485E6623J45658a1402A12648e7776I1993h7267a8438E2249M3604g2664B2192
$$ plain form
17565 -183041 196068 242096 110580 -137444 39296 -218493 375130 -253013 -253513 5246 -116467
17553 200561 101520 -104086 114054 -92719 108025 -51760 137918 145543 -111761 -105905 -115240
17542 -115240 121475 101338 -137422 -180553 -130591 236407 -64852 111336 -418089 101294
17531 23274 244837 10047 168013 -95252 195429 272541 -50270 75495 -206446 255828 -49385
17519 -283797 -26140 -194399 67325 156374 64075 316005 103942 182346 47135 -45443 -278627
17508 -278627 152297 129595 -151855 36573 -25305 169941 190481 -103289 -94463 241024 127025
17497 127025 125436 189493 -117246 8392 -207503 -171307 -241381 -19361 196817 -182874 77996
17485 56623 202281 -11402 112648 -57776 91993 -87267 -18438 52249 95853 -72664 22192
17473F6385K94687A77856K76891a86704A06388D5799K01910M3362h5694A38116
17462h8250E3702b02419A6082J64761E9192Q3006n6916N3551B1471K93600A5053
17450C74485a00425D57239j53739H6858e4152C16794j29877L46616A63501e1211
17439G8959N71456A074J65172J24070Q4437g4757k272I4661b28063A25604D0335
17427c8545A54681J69925a0775A82592N9201H7746K83001F4734J96322J32251
17417C93307A07406J41029J70552B01225e4864C99536j63586E8174b7126B32323
17406h3147a1066B43276l0439K75288A16252N2116i2103H4007i3032I2293J1199
17395A03492K3340C193a65386I3249P2063b260B74053a1306C43188a13698A59219
$$ plain form
17473 66385 361072 177856 454747 -186704 106388 45799 247709 291071 -85694 138116
17462 -88250 53702 -202419 16082 180843 59192 142198 85282 138833 21471 315071 15053
17450 374485 -100425 457239 303500 86858 -54152 316794 186917 533533 163501 -51211
17439 78959 650415 1074 166246 290316 374753 -74757 -77029 94661 -228063 125604 40335
17427 -38545 154681 324606 -10775 182592 241793 87746 370747 64734 261056 393307
17417 393307 107406 248435 418987 201225 -54864 399536 235950 58174 -27126 232323
17406 -83147 -11066 243276 212837 488125 116252 168368 -92103 84007 -93032 92293 103492
17395 103492 126832 3193 -165386 93249 165312 -2260 274053 -11306 343188 -113698 159219
17383a13379E2012R0246A2486K37549f4952r9917M9065H2516P489a09365C0789
17371B85884j41559K05777A31551Q0405a46697j98659B05315B0211i0793A19960
17360H7922G554a8471O212C5815J02232O2211J55776H3693a51090b1714G2352
17348B3648N14734H1333j9584J03755C2757L95281h1159C3741L18808a05800D8968
17336A55446L33358D5210a11237A1878k087a0355C04703b90043B59560k3068n6824
17325A79668q1687g7840A46727o103M4826C3293L6724K2145d9293b2934A86124
17313B22379r7007k035K61872j75155K6743P502F3132c2891A27070G940J51057
17302A58997P5306A1460K03198k2961A933K6380N41675I6401J37437K50107F7810
$$ plain form
17383 -113379 52012 142258 12486 250035 -64952 -164869 -115804 82516 90005 -109365 30789
17371 285884 144325 350102 131551 211956 -146697 -345356 205315 20211 -90793 119960
17360 87922 7554 -18471 -12259 35815 138047 200258 356034 83693 -151090 -21714 72352
17348 23648 538382 81333 61749 165504 32757 428038 -81159 33741 352549 -105800 48968
17336 155446 488804 45210 -111237 11878 9791 -10355 304703 -290043 259560 236492 179668
17325 179668 97981 -77840 146727 140624 185450 33293 70017 92162 -49293 -22934 186124
17313 222379 125372 123337 385209 210054 236797 244299 63132 -32891 127070 7940 158997
17302 158997 234303 11460 214658 191697 1933 28313 569988 96401 233838 483945 67810
17290A70284P6401b12311D7046H1a0532E6669b2068q208A35664A5283d0046p2011
17278a12057C07271G0406K03625a53136A68234O8059g6506D28236C7381P9783
17268A17164c8165B44916F0940J03285j1972F1780k3331i2276A30202a13788C75022
17256A97989I431R9006F023K11766O8076f909A87651B6731L49800K1403A93637
17244B55907J6500H7360M75939k54433J89745a4236O680B54026M7440l8263N1305
17233C14508c2665B39624K2963N8746a9691C90838L8732A03147J46624b03418
17222F7568A9563g0015A3140a06190A05008K92138H2741j3134A6260L19621J7476
17211C53357m093P4482j76017q1027J05947E5516O6718E3883J9130J97430j24975
$$ plain form
17290 170284 246685 -212311 47046 81 -10532 56669 -22068 -30276 135664 15283 -40046 -112057
17278 -112057 307271 70406 274031 -153136 168234 236293 -76506 428236 37381 117164
17268 117164 -38165 244916 60940 164225 152253 61780 38449 -92276 130202 -113788 375022
17256 197989 9431 108437 6023 217789 285865 -6909 187651 26731 376531 397934 193637
17244 255907 272407 87360 563299 308866 498611 -14236 -7556 254026 301466 263203 314508
17233 314508 -32665 239624 262587 321333 -19691 390838 429570 103147 249771 -203418
17222 67568 19563 -70015 13140 -106190 105008 397146 82741 69607 16260 335881 353357
17211 353357 349264 423746 247729 166702 272649 55516 122234 53883 73013 270443 145468
17200A45468D3710a35064A28504k2157L55021H1012K4697D0566J65923j1590k9598
17189A65301O3501q4115J38905b02231E4546M14833a27672f95A77130Q0568F6911
17177E54308A88952n285p8954P1942A2197J72427L3447j9589n5859L21166Q725
17166D72514B04536k6028n1386K88634j48279O8060d7901C0728O2967J54930K96382
17155E45007c8723A77310m7851L4040K66708J1912A00970e6202j13931G7671K53483
17144C31154m5297G4727K26179j38870J58200j33789m8298J64077j10197R4723
17134B86752Q7570M07K0921j75496q7947M56852B19579G6700J59592A9562J40037
17123A59599K71390j36930o0538o4131J80892j08606J06393A47261e132D24696
$$ plain form
17200 145468 43710 -135064 128504 106347 461368 81012 105709 40566 206489 194899 165301
17189 165301 228802 144687 283592 -202231 54546 469379 -127672 -695 177130 257698 66911
17177 554308 188952 183667 104713 176655 12197 184624 218071 198482 142623 463789 472514
17166 472514 204536 178508 127122 415756 267477 335537 -47901 30728 93695 248625 545007
17155 545007 -38723 177310 129459 163499 430207 442119 100970 -56202 -170133 77671 331154
17144 331154 285857 74727 300906 162036 320236 186447 138149 302226 192029 286752
17134 286752 374322 374729 395650 220154 132207 589059 219579 76700 236292 19562 159599
17123 159599 430989 294059 233521 169390 350282 241676 348069 147261 -5132 424696
17112E1379b18914D19559L6138A1703K92358n2859L7291K41143k23274j20502
17102A85860J61632j19123J3489K30978j61036K67282n5334k37641K45953k36485
17092B95575J81900A34172K13669r9435R0560j7836J56391k22473p4176K68934
17082D49806A90004J24338o7029O4658Q0448A51034L04536l1888J88259B40844
17071C30124j01840k4299K04983k7249p8502m4374A15149M32116J1967B46664
17060C04952J46391k4823m7452O2437m5524j95747J45657j49003n5465J59239
17050C00662P8993N2479J66585j0622k32778J08490b0223E25520O7519R7265l35836
17039C54468o4028L0955O2322K10956j54470J66777P5469k63754K28995j23484
$$ plain form
17112 51379 -218914 419559 455697 11703 304061 251202 288493 529636 306362 185860
17102 185860 347492 228369 241858 472836 311800 579082 523748 286107 532060 295575
17092 295575 477475 134172 347841 248406 338966 321130 477521 255048 180872 449806
17082 449806 190004 314342 247313 311971 392419 151034 455570 423682 611941 240844
17071 330124 228284 203985 408968 381719 303217 258843 115149 547265 559232 246664
17060 304952 451343 426520 379068 441505 395981 200234 345891 196888 141423 300662
17050 300662 379655 432134 598719 588097 355319 463809 -20223 525520 593039 690304 354468
17039 354468 290440 321395 383717 594673 440203 606980 682449 418695 647690 524206
17029E24206r2162J92346j74140j74868j27831N96869k01108o2818M3326q1678
17019D42142p4439K18801N5635q7559A53385M38311n7107o3305J17882j00074
17009D89092Q2950J63126k23414l784J75025r3642P6844k38924K10227k02108
16999D35392M4898K06412q6998O0539J26039l39808J74464j50159j07909K12562
16989E75432n7125j77352J90030J22104K1804J9116j05932j4269J51262j19649
16979F05421K42346j55863n1143n9221j05198L52964j59781J14276P3656k24427
16969F33030P7590L64523m29128k8623L02321l61126J93624K46882j40506J19046
16959I77633J7107m24224K21492K74832l04341J78503p0666K04535k3064K09170
$$ plain form
17029 524206 432044 624390 450250 275382 147551 744420 543312 480494 523820 442142
17019 442142 367703 586504 642139 554580 153385 591696 534589 471284 589166 489092
17009 489092 572042 735168 511754 507970 682995 589353 666197 427273 637500 435392
16999 435392 480290 686702 599704 660243 786282 446474 620938 470779 362870 575432
16989 575432 518307 340955 530985 653089 674893 694009 588077 573808 725070 605421
16979 605421 847767 691904 640761 581540 476342 829306 669525 783801 857457 633030
16969 633030 710620 1075143 646015 617392 919713 558587 752211 999093 858587 977633
16959 977633 994740 570516 792008 1066840 762499 941002 870336 1074871 1051807 1260977
16949A260977m87926k45358L20292j7037K99300k27894J49101J3646k85924K94247
16939A073424N9663k94208K84032r1497P8135j70113J42045o3277j74236J37332
16929I81300J63176O4770k59359L54531j35080K6055j21734j59441J52676K28864
16919A295758j43463r1253L4187K96281j43901l11054k5161L07436J71943j62989
16909A227784l15205K10207K64938j51457K19652k20889K8604l659K4569L06227
16899A590771k44954j70506L39502m13827N74461o21166M95446j731J86653k79664
16889A454985K89810q3672L7788q5875K11818l55707M96794j15750l20911M7649
16879A576929M15120l71736Q1590k61391N47246j43958n6148J80717j6243L54122
$$ plain form
16949 1260977 773051 527693 847985 830948 1130248 902354 1051455 1065101 779177 1073424
16939 1073424 1133087 838879 1122911 1031414 1109549 939436 1081481 1018204 843968 981300
16929 981300 1144476 1209246 949887 1304418 1169338 1195393 1073659 914218 1066894 1295758
16919 1295758 1152295 1061042 1095229 1391510 1247609 936555 911394 1218830 1390773 1227784
16909 1227784 912579 1122786 1387724 1236267 1455919 1235030 1263634 1259975 1284544 1590771
16899 1590771 1345817 1175311 1514813 1100986 1675447 1054281 1549727 1547996 1734649 1454985
16889 1454985 1744795 1661123 1698911 1613036 1824854 1469147 1965941 1850191 1529280 1576929
16879 1576929 1992049 1620313 1701903 1440512 1987758 1843800 1787652 1968369 1952126 2306248
16869B306248J3724k70757K39484K1372j19459K9892j70738J06816L97621K8240
16859B582443l60993K00269J41369n18581j706L79833L90420j60333K02163o9968
16849B784916j55495j524J95967J08723j70696K09390j93293J99660r570r8582
16839B869496J3228q732L73899J4508M22596m63707L35043j92861K97933M5755
16829C707158j70450j62226K81790L43597o8204q0591K29647k12749N07397k04659
16819D170710L76769r3082m6699J00834J84103Q7273j37450J31818K12809m131
16809D982954K0133j7388M31564K78298k15410L03701j43473O17146j7859K50861
16799F490527j06470J67301R199K54371M21606k11578L90374J8454L75767K0558
$$ plain form
16869 2306248 2319972 2049215 2288699 2310071 2190612 2220504 2049766 2156582 2554203 2582443
16859 2582443 2221450 2421719 2563088 2044507 2042801 2422634 2813054 2652721 2854884 2784916
16849 2784916 2629421 2627897 2823864 2932587 2761891 2971281 2777988 2977648 2968078 2869496
16839 2869496 2882724 2873992 3247891 3262399 3684995 3221288 3556331 3363470 3661403 3707158
16829 3707158 3536708 3374482 3656272 3999869 3931665 3851074 4080721 3867972 4375369 4170710
16819 4170710 4547479 4454397 4407698 4508532 4692635 4779908 4642458 4774276 4987085 4982954
16809 4982954 5003087 4985699 5417263 5695561 5480151 5783852 5640379 6257525 6239666 6490527
16799 6490527 6384057 6551358 6560557 6814928 7236534 7024956 7415330 7433784 7809551 7830109
16789G830109N90598k5181m9751O19363K13042L40984k5529M50881K76538L32746
16779A0553800J92784N98205J83915J60666O61Q04639M84917K69834M13763N39620
16769A4202804N98161J68514P88572N94985N99528N52841M80912R26333O64564
16760A9577214J262848N28861M04552J015042J230936R89003N60205J610996J131903
16751B8311560J347065J150080J535715J425552J970362J859270K397073J575720
16743D1572397K547768K399328K512227K980111K827435L476349L488472M098838
16735F5902925L814070M154756N277703M707743N586623N283946O294901O589999
16727A07612666O982808P395443P312445P480057P297411P652676O837612O695486
$$ plain form
16789 7830109 8420707 8395526 8345775 8965138 9178180 9519164 9493635 9944516 10221054 10553800
16779 10553800 10746584 11344789 11528704 11689370 11690031 12494670 12979587 13249421 13663184 14202804
16769 14202804 14800965 14969479 15758051 16353036 16952564 17505405 17986317 18912650 19577214
16760 19577214 20840062 21368923 21773475 22788517 24019453 25008456 25568661 27179657 28311560
16751 28311560 29658625 30808705 32344420 33769972 35740334 37599604 39996677 41572397
16743 41572397 44120165 46519493 49031720 52011831 54839266 58315615 61804087 65902925
16735 65902925 69716995 73871751 79149454 83857197 89443820 94727766 101022667 107612666
16727 107612666 114595474 121990917 129303362 136783419 144080830 151733506 158571118 165266604
16719A65266604O053163M715520M009503K545480J432631j46603j712605k981727
16711A79181966l984157n532164n833556p139591o942886p505096p847330p490002
16703A26907184p603860p003817o913586o781221o054398o139905m987967n299837
16695G6122593m675407m434162m292102l636627l304059l513493l115479k504869
16687D6646395k568770k322311k075782k317627j894019k156820j314340j639318
16679C0357408j557803j199293j156635j207697j027525j414301o24754j119210
16671B1050190p87476o19141j067498r18152j80174p59677o53701j131366j24285
16662A4808720m18237q04620o16753K5103m83092m65938l24348p64302p3560m87685
$$ plain form
16719 165266604 171319767 176035287 180044790 182590270 184022901 183876298 182163693 179181966
16711 179181966 175197809 169665645 163832089 156692498 149749612 142244516 134397186 126907184
16703 126907184 119303324 112299507 105385921 98604700 92550302 86410397 81422430 76122593
16695 76122593 71447186 67013024 62720922 59084295 55780236 52266743 49151264 46646395
16687 46646395 44077625 41755314 39679532 37361905 35467886 33311066 31996726 30357408
16679 30357408 28799605 27600312 26443677 25235980 24208455 22794154 22169400 21050190
16671 21050190 20262714 19643573 18576075 17657923 17477749 16718072 16064371 14933005 14808720
16662 14808720 14390483 13585863 12969110 12994213 12511121 12045183 11720835 10956533 10882973 10395288
16652A0395288l96214j88648l68832p61722M58666m49106m13682M5873l48690
16643G972933r613l89637m65448L3506k37053j40956m15846J77803m61745j36632
16633E927312J17807j98255k50165k46067P9480p7394n606k27585j87849k04334
16623D727344l56791L84048l58115m1139r3259p4661j69004L59222n78689K48549
16613D047505p745n42179J78367J33603l03970k35250K69497j36312j47830p6530
16603C179156J57778l94093M3579J66751k02703j94100q2181J59489k8969m32831
16593B371876o5873J47911J8792j73933R6449j04744j57716J63390k55718M99904
16583B540338l22659J0258l70968L89322l47339R9736m58522M98611j38882l53302
$$ plain form
16652 10395288 9999074 9810426 9441594 8679872 9138538 8689432 8275750 8321623 7972933
16643 7972933 7963320 7573683 7108235 7141741 6904688 6763732 6347886 6525689 6063944 5927312
16633 5927312 6045119 5846864 5596699 5350632 5430112 5352718 5347112 5119527 4931678 4727344
16623 4727344 4370553 4754601 4396486 4355347 4262088 4187427 4018423 4377645 3798956 4047505
16613 4047505 4039760 3497581 3675948 3809551 3505581 3270331 3539828 3403516 3255686 3179156
16603 3179156 3336934 2942841 2986420 3153171 2950468 2756368 2674187 2833676 2804707 2371876
16593 2371876 2306003 2453914 2472706 2298773 2395222 2290478 2132762 2296152 2040434 2540338
16583 2540338 2217679 2227937 1856969 2246291 1898952 1998688 1540166 2038777 1899895 1546593
16573A546593J96058L51413m24939K92200l69597j0287L5979k04819M90335l06988
16563A595948K17724r7291k78462j62411J26928K92868j77216m78928N00740m1980
16553A497920k38263n6061P4169L9665l2103M2119l108J85776n17527L07998k07002
16542A093583J79939J39612j84491M0433l107k80307J40064j88298j11827N2632
16532H78233M88764k40438q2841J56088m17568K72126M776J54378K17700l96887
16522A034331Q3191j24402k2154J15632N9670k92205k69199m432K1986K03781
16512H06199L12314m49547N9457j6542j24085K78139j38226K68148l70418p3139
16502E52300L63300J8591k81157k76379K12611K55401R4587k13913k03333J0518
$$ plain form
16573 1546593 1742651 2094064 1669125 1961325 1591728 1581441 1617420 1412601 1902936 1595948
16563 1595948 1813672 1716381 1437919 1275508 1402436 1695304 1518088 1039160 1539900 1497920
16553 1497920 1259657 1203596 1277765 1317430 1285327 1327446 1324338 1510114 992587 1300585 1093583
16542 1093583 1273522 1413134 1228643 1269076 1265969 985662 1125726 937428 825601 878233
16532 878233 1366997 1126559 1043718 1199806 782238 1054364 1059140 1213518 1431218 1034331
16522 1034331 1117522 993120 970966 1086598 1146268 854063 584864 580432 602418 806199
16512 806199 1118513 668966 728423 711881 587796 865935 727709 995857 625439 552300
16502 552300 915600 934191 653034 376655 589266 844667 939254 725341 522008 532526
16492E32526K36542C47332M14725r096J4032M9617P4132k88888k12745p9857K79630
16481E88882k44794M29874C80791J83577M7332L8622j51952Q3590J55235r5868
16471F41327J65268j10296B17159K85851j22319p600K11627k03282o2036L32359
16461F51759k24698M6136k24405M53257C16609L29963C11409K16500n9936o6920
16451D01053O3266L07047m6589C40067J05556l5727P6923J3357j10283j53749
16441B36144K77334D182L00714F032K21416K06428j49656K60778k08873L6917
16431C73042E9210M09391j18054J87848B53625m6904J50915A46829R9330K48228
16421D94387B16699P5947n1951K1995k3364K09891l1195J79798A88867J74305
$$ plain form
16492 532526 769068 347332 762057 752961 766993 816610 890742 601854 389109 309252 588882
16481 588882 344088 773962 380791 564368 611700 650322 498370 581960 737195 641327
16471 641327 806595 696299 217159 503010 380691 373091 584718 381436 319400 651759
16461 651759 427061 473197 248792 702049 316609 646572 311409 527909 467973 401053
16451 401053 464319 771366 724777 340067 445623 409896 486819 500176 389893 236144
16441 236144 513478 4182 304896 6032 227448 433876 284220 544998 336125 373042
16431 373042 59210 468601 350547 538395 253625 206721 357636 146829 246159 494387
16421 494387 216699 292646 240695 262690 239326 449217 418022 597820 188867 363172
16411C63172j34052J34421j39652J47083d6991B44654I8712K34672j28916L36763
16401E41231j77309A68159p2962R3298J19546b1209D46412f7931A69382h514H6583
16389C18295O7036k1819Q2201A08735L2417m7942K95348j20170O5177E9978J66229
16378B26207K17428k1213K43148p68k43002A65029J75391j53094P9044a48686
16367A51133n3335K3536b4406D37225k5393m1917p6904A05272n1811g7751D34638
16355B21533J9539K63066A09519f6870A79267J02865n6362k6537Q6654G1738J34821
16344B06559D6411J45507J01417D8333a10558D06536A88666n8231R2595n1597
16334A71433a03523E1848M36377j84546C6739b06096D47683j02303a55907B04842
$$ plain form
16411 363172 229120 363541 223889 370972 -46991 244654 98712 333384 204468 541231
16401 541231 363922 168159 95197 188495 308041 -21209 446412 -67931 169382 -8514 86583
16389 318295 385331 363512 445713 108735 141152 93210 388558 268388 333565 59978 226207
16378 226207 443635 422422 665570 664802 421800 165029 340420 187326 266370 -148686
16367 151133 97798 121334 -24406 437225 411832 369915 293011 105272 53461 -77751 434638
16355 221533 241072 504138 109519 -66870 179267 282132 225770 199233 285887 71738 206559
16344 206559 46411 191918 293335 48333 -110558 406536 188666 130435 223030 171433
16334 171433 -103523 51848 488225 303679 36739 -206096 447683 345380 -155907 204842
16323A40805K39546a44821G3155Q0100A2302N6755K04676j28872l1084C1969Q4430
16312A16399R62j4800b14367A43871a08475B74994a42352e8098C53874A40866
16301B7981a30100o3303b1261D2733J55776J8166n0303E7555a04380A86887i7522
16289B02341F0168e0003A52174M4040L4189k6504H4767e8428B56496O8267D951
16277c141A26711L08508E6263J43800a50460f2214c63k66479B62564I4215C6424
16265C397R7660h0181k27920I2971c2561H9816h3913O461a0791j11532B05480
16253D29139g175j7914D8271b320l7962j23612g1229A18326a03554C0287c10429
16241B57479J08916o4777A50153l2921J51588E7699R1902C5164j2265b6495B26107
$$ plain form
16323 140805 380351 -144821 73155 153255 12302 69057 273733 144861 113777 31969 116399
16312 116399 117361 102561 -214367 143871 -108475 274994 -142352 -58098 353874 140866
16301 27981 -130100 -193403 -21261 42733 198509 216675 166372 57555 -104380 186887 -97522
16289 202341 60168 -50003 152174 196214 230403 203899 84767 -58428 256496 324763 4951
16277 -3141 126711 435219 56263 200063 -150460 -62214 -363 -266842 262564 94215 36424
16265 3397 101057 -80181 -308101 92971 -32561 89816 -83913 -77452 -10791 -122323 205480
16253 429139 -7175 -25089 48271 -2320 -40282 -163894 -71229 118326 -103554 30287 -310429
16241 257479 366395 301618 150153 117232 268820 57699 149601 35164 22899 -26495 226107
16229a49621A59024L0480b4038B34120i1140H1781a44291A59830b05809G2190
16218C74220a84546p4195G9481b43550a13574A7949J69632J5709G7574a38461
16207B71651I941d4281A4941d3135A48416p2880h2771A18953h7042F6686g4997
16195A06070a22214A91861c1925H863f871k78081B20907b8198C93098A7243J73529
16184A90772a4663B33246F0788f1986j07104A505K3645L953b66441G5719J9416
16173I5135a92643j02747a6209C7899O851J157a16119D3718A8943O119K9573k5744
16161B8891L3696K2972k3366K9300b07046D4484a25897r1913f4098B23975i884
16149e74006d3015l6372d896q5308K1457a3765A7131c5299I1246C1872o231N6788
$$ plain form
16229 -149621 159024 189504 -24038 234120 -91140 81781 -144291 159830 -205809 72190
16218 374220 -184546 -258741 79481 -243550 -113574 17949 187581 203290 77574 -138461
16207 271651 9941 -44281 14941 -43135 148416 75536 -82771 118953 -87042 66686 -74997
16195 106070 -122214 191861 -31925 8863 -6871 -284952 220907 -28198 393098 17243 190772
16184 190772 -14663 233246 60788 -61986 -169090 1505 25150 29103 -266441 75719 95135
16173 95135 -192643 -295390 -16209 37899 44750 45907 -116119 43718 18943 25062 54635 28891
16161 28891 62587 85559 62193 91493 -207046 44484 -125897 -217810 -64098 223975 -9884
16149 -574006 -43015 -79387 -4896 -90204 -68747 -13765 17131 -35299 91246 31872 25641 82429
16137H2429a6876A9160R4328K53525j05039J4480c58493A47190h7049c2149A14270
16125I2375h673B67403A20812d41306a32064b5033A33489a3085G9724J62237B2064
16113b27676A67425M1273E744g860j2416m330D5760c9321j9503A16224D5198C567
16100A00738i3920A12632l2865l4129j8983g3473H4687L0736e2139C785P5005
16089G8790k8054b0390G5740f8499G4307O1066F0246Q9019e5671A4617a97110
16077H1219a44144f3206k13066F3941c03619J24469d8286j00305E7678c67721
16066d5697A68047a33985D8283R5866N8701b11528K1177m0863d7855j46564A3381
16054c72366a66880F6385b17503l9545L2636g7196r4719E09323h461D35199A15980
$$ plain form
16137 82429 -16876 19160 113488 367013 261974 276454 -358493 147190 -87049 -32149 114270
16125 92375 -8673 267403 120812 -441306 -132064 -25033 133489 -13085 79724 241961 22064
16113 -227676 167425 208698 5744 -7860 -20276 -24606 45760 -39321 -58824 116224 45198 3567
16100 100738 -93920 112632 79767 45638 26655 -73473 84687 115423 -52139 3785 78790
16089 78790 50736 -20390 75740 -68499 74307 135373 60246 149265 -55671 14617 -197110
16077 81219 -144144 -63206 -276272 63941 -303619 -179150 -48286 -148591 57678 -367721
16066 -45697 168047 -133985 48283 144149 202850 -211528 -190351 -231214 -47855 -194419 13381
16054 -372366 -166880 66385 -217503 -257048 -224412 -77196 -171915 509323 -8461 435199 115980
16042c72536a802j67649j44575E2932b84572A66206e9457k54441k7489E7938K21391
16031B79329f3559l68003J32041B23394q4838f7138A66644B8801c6947D6227L35099
16020C81326b7629H0750a15963k65447a8132j32105k5733d2292B99110j34209
16010A64901b59328C4256b01085P2304Q742H1582M5584a76593A78979f8635D8776
15998f9745A63462B2522K1476e5478a4623l48405f7665C1988a4891B4472f8433
15986d4964H0565a21963A73763J09111O6901j07880n8591J66366j65759J59821
15976C43732j56928d7853j6000A01018A3405a58014D6196K69476A04384l5374
15966F9010k9124K3742R4433a85206B3425J82189q9560k8278c61658a16749j2895
$$ plain form
16042 -372536 -1802 -169451 -314026 52932 -284572 166206 -59457 -313898 -341387 57938 279329
16031 279329 -63559 -431562 -299521 223394 138556 -67138 166644 28801 -36947 46227 381326
16020 381326 -27629 80750 -115963 -381410 -18132 -150237 -175970 -42292 299110 164901
16010 164901 -259328 34256 -201085 -128781 -120039 81582 127166 -176593 178979 -68635 48776
15998 -69745 163462 22522 43998 -55478 -14623 -363028 -67665 31988 -14891 24472 -68433
15986 -44964 80565 -121963 173763 282874 349775 241895 183304 349670 183911 343732
15976 343732 186804 -47853 -63853 101018 13405 -158014 46196 315672 104384 69010
15966 69010 39886 63628 158061 -185206 23425 205614 116054 87776 -361658 -116749 -129644
15955a29644A95965i8637A55373a95610e804A90358a1368j36266k35106J72918
15945b09822P1875A4160a54725J6339j02277j19027a63295o7847e3858C06727
15934f3454H0736b62389n6064g5986j56124C0934J34300n8529b59353F5233a49337
15922b96937P0075g709k9791B77038i0636o8740C29480h990I1846j5797b12613
15910a82765n2705O9546n9861C17781b20681n6849A43406c0591k4225G0611Q6269
15899A56880h4716j34309A55166j6322a99249A07779b016A43442a80053O3140
15889a16913A05290h5745B73366F0569b89179E7398b1736j7749j72325A18541
15878B2891J16895c07040M4762G9591c8881F2061a78098k03033J73993B6054J35116
$$ plain form
15955 -129644 195965 -98637 155373 -195610 -5804 190358 -11368 -147634 -382740 -209822
15945 -209822 -137947 14160 -154725 -138386 -240663 -359690 -163295 -231142 -53858 306727
15934 -63454 80736 -262389 -318453 -75986 -232110 30934 165234 106705 -259353 65233 -149337
15922 -296937 -226862 -7709 -37500 277038 -90636 -159376 329480 -8990 91846 76049 -212613
15910 -182765 -235470 -165924 -225785 317781 -220681 -277530 143406 -30591 -54816 70611 156880
15899 156880 -84716 -219025 155166 138844 -199249 107779 -2016 143442 -180053 -116913
15889 -116913 105290 -85745 273366 60569 -289179 57398 -21736 -39485 -211810 118541
15878 22891 139786 -307040 -262278 79591 -38881 62061 -178098 -381131 -207138 26054 161170
15867A61170J1155g6429l07250e6482A85711b16517E9958a534D4478n599a96102
15855a80853C41418a54394F0462o665J98706d5622A73400A9458l829P9962e9435
15843E4129d39543a06462H3702A537J6167f6939D0472h6254A37590c23795f8474
15831b6448m5426j17951i2177r8179D7675R9111A0152J75645c03708A46875n8869
15820H8006l1202a35604n2350A30444g2022C6807H918c74917J66096i2104j15714
15809b07818P6751A04529A1000a65551J2572A77521a31077A67918D9404J189b24967
15797b80207H5465N9551a63582a5236A03148b28963D5040d96843a36829A51032
15786B06521a30589d7667j52615E5220b20834F7383N5921c21681J51793B40867
$$ plain form
15867 161170 172325 -76429 -383679 -56482 185711 -216517 59958 -1534 44478 38879 -196102
15855 -180853 341418 -154394 60462 53797 252503 -45622 173400 19458 15629 95591 -59435
15843 54129 -439543 -106462 83702 1537 17704 -66939 40472 -86254 137590 -323795 -68474
15831 -26448 -71874 -189825 -92177 -190356 47675 146786 10152 185797 -303708 146875 88006
15820 88006 56804 -135604 -187954 130444 -72022 36807 8918 -374917 -208821 -92104 -207818
15809 -207818 -131067 104529 11000 -165551 -152979 177521 -131077 167918 49404 50593 -224967
15797 -280207 85465 145016 -163582 -15236 103148 -228963 45040 -496843 -136829 151032
15786 206521 -130589 -47667 -200282 55220 -220834 67383 123304 -321681 -169888 240867
15775b82702f1282A7577a02161A81235a06167m1350A68710q3686a06234r0245
15765a96479j85262A71371b09743A56054a11631B59321l0926K63553a05973D61254
15754B2607p800b53559K5556A70418o6766J2448A4108N1127a46761A16595e7035
15742d2309A73223p2226b36783f3110p8066I3448a98614n2610p8018g5215j23728
15731a98943j25614F1934e923k3129Q479m4097A7052J4747b3722G5110f3894A98574
15718B27559i9591H4769J67718J1861A27941g1275A8706K75665b37067L2941a6410
15706A83551a94340d8195j99462a13386K7393k01816a23984q1035B49506A2098
15695B75793c1253A3285K3885J78050l2167a01798C23791b179p1031j4668c1776
$$ plain form
15775 -282702 -61282 17577 -102161 181235 -106167 -147517 168710 85024 -106234 -196479
15765 -196479 -381741 171371 -209743 156054 -111631 259321 228395 491948 -105973 461254
15754 22607 14807 -253559 -228003 170418 103652 116100 14108 65235 -146761 116595 -57035
15742 -42309 173223 100997 -236783 -63110 -141176 93448 -198614 -251224 -329242 -75215 -198943
15731 -198943 -324557 61934 -5923 -29052 -20573 -64670 17052 31799 -23722 75110 -63894 198574
15718 227559 -99591 84769 252487 264348 127941 -71275 18706 294371 -237067 -204126 -16410
15706 183551 -194340 -48195 -247657 -113386 -85993 -287809 -123984 -205019 249506 12098
15695 275793 -31253 13285 37170 215220 183053 -101798 323791 -2179 -73210 -87878 -31776
15683a10605N3596j40832R7626L9369k36058A79227b28589A33852e6780m25496
15673d82276a3454C91644j86234H0565a14041d4644n1522A46605J22795A25625
15662B5203e1708m0915B4751e3505j54299h8964a0397j9879A07746d2712r433
15651e2145B68479b17430q398L3871O7452C08372a07035M4636k50581B75780c3073
15639b30897D2834K141g3691m9838N7436A57689c4100M20n6677j03518E8957b84567
15626I6623c93835D7738L43905b30849P2536j76716D05911b61205A68578B9809
15615a06251E8500M57211A38482J28116b56456J1106C2896b32341j13477R7524
15605b48294C29267E1690b64682B23076a31404j37301A84895l0661A7990J23896
$$ plain form
15683 -110605 -57009 -197841 -100215 -60846 -296904 179227 -228589 133852 -56780 -482276
15673 -482276 -13454 391644 205410 80565 -114041 -44644 -96166 146605 269400 125625
15662 25203 -51708 -92623 24751 -53505 -207804 -88964 -10397 -30276 107746 -42712 -52145
15651 -52145 268479 -217430 -225828 -191957 -124505 308372 -107035 -62399 -312980 275780 -33073
15639 -230897 42834 44975 -73691 -123529 -66093 157689 -34100 -33680 -90357 -193875 58957 -284567
15626 96623 -393835 47738 391643 -230849 -158313 -335029 405911 -261205 168578 29809
15615 -106251 58500 515711 138482 266598 -256456 -245350 32896 -232341 -345818 -248294
15605 -248294 329267 51690 -264682 223076 -131404 -268705 184895 154234 17990 141886
15595A41886a2034j27038j8109q2932A38650j7557a6900l6415j63855N5342B2288
15583a26718C12726j03379J11410c78615B94284C1123A3520L5857a16645A01999
15572a75183N9347L291A83141O4974h9215j77214f2394B4655a8017p4927C4436
15560A62187b47716B53013E0656g8066j77686j65193N1241l6743A69436d2569
15549A29334C7127b49221H5322R907B0353a0059A29412i3584I3931c18698c212
15537A00262K03502f8857r4622A76177B6745K87227b63663B28700H0987d22953
15526b7602G3598a3230l01205d7477j3778r3251B09028b6534r71C5429c23583
15514F4314j2734J47149H2746k6988M24732f597D5189J08536a90359E6166O254
$$ plain form
15595 141886 -12034 -139072 -157181 -240113 138650 121093 -16900 -53315 -217170 -161828 22288
15583 -126718 312726 209347 320757 -378615 294284 31123 13520 49377 -116645 101999
15572 -175183 -115836 -112545 183141 248115 -89215 -266429 -62394 24655 -18017 -92944 34436
15560 162187 -247716 253013 50656 -78066 -255752 -420945 -369704 -406447 169436 -42569
15549 129334 37127 -249221 85322 95229 20353 -10059 129412 -93584 93931 -318698 -3212
15537 100262 303764 -68857 -163479 176177 26745 313972 -263663 228700 80987 -422953
15526 -27602 73598 -13230 -314435 -47477 -61255 -154506 209028 -26534 -27505 35429 -323583
15514 64314 51580 198729 82746 55758 480490 -6597 45189 153725 -190359 56166 62420
15503F2420j7985K97102a47816j29361B6835a7185A13032c2510A89701b03290
15492a889j95001A04751J10464c19319M4580A4791J26123i8541o3637B72627A01284
15480e3951j10515r7431g7466A9421b33000C82399C0641O3358h5636B4556b27800
15468b5515j77924N5155l1087B49188b0496m2734C9620N0958a52276e7499A0415
15456A2925P0137Q5966a2338C90609A46525a48184A94147C8296l894J53883A3224
15444c53822J56601G3060b61205A7482g9025j66693G3946b02050B08013a92746
15433A60498m7766b94788L5532B59771a82162e1101j83448E5161J4238h2647P813
15422g4834m9758j71694c5954C20470j57929a85980F6862c4059O107k6697H386
$$ plain form
15503 62420 44435 341537 -147816 -277177 26835 -17185 113032 -32510 189701 -203290
15492 -1889 -196890 104751 215215 -319319 -274739 14791 140914 -98541 -162178 272627 101284
15480 -53951 -164466 -261897 -77466 19421 -233000 382399 30641 93999 -85636 24556 -227800
15468 -25515 -203439 -148284 -179371 249188 -20496 -63230 39620 90578 -152276 -57499 10415
15456 12925 83062 169028 -12338 390609 146525 -148184 194147 38296 34402 188285 13224
15444 -353822 -197221 73060 -261205 17482 -79025 -245718 73946 -202050 208013 -192746
15433 160498 112732 -294788 -259256 259771 -182162 -51101 -234549 55161 69399 -82647 -74834
15422 -74834 -124592 -296286 -35954 320470 162541 -185980 66862 -34059 -27952 -54649 8386
15410a12285j77665G7830g7127D2483b6391B27822a12568r6282I3840a96026A27169
15398d2054j5809B58042k9338a24802c4097j05684l0164F1983a6054B55275a27454
15386b05488l8736A06146h9403e889D9435a07145b1355C7266A6471J65086q6658
15375I4899J1273m8865K87015E2925e4261J4247k23148D3533J12239a56562D7061
15363B32379E0749d30850B20041J5217J02840d8675k16371B37095a3116E736a36391
15351a59866g6893A971K49371e2177B22782g353j05816A3897c9543H8571D0320
15339g6557A88287c26837a30545A60901D3575f9566H7229C7738L9978k2882k3331
15328C1503b00239m8130a10567k48842a02665C13534i4178A97319f7928a2731
$$ plain form
15410 -112285 -289950 77830 -77127 42483 -26391 227822 -112568 -208850 93840 -196026 127169
15398 -42054 -57863 258042 228704 -124802 -34097 -139781 -169945 61983 -16054 255275 -127454
15386 -205488 -244224 106146 -89403 -5889 49435 -107145 -21355 37266 16471 181557 94899
15375 94899 106172 57307 344322 52925 -54261 -40014 -263162 43533 155772 -156562 47061
15363 232379 50749 -430850 220041 235258 338098 -48675 -265046 237095 -13116 5736 -136391
15351 -159866 -76893 1971 251342 -52177 222782 -7353 -113169 13897 -39543 88571 40320
15339 -76557 188287 -326837 -130545 160901 43575 -69566 87229 37738 77716 54834 31503
15328 31503 -200239 -248369 -110567 -359409 -102665 313534 -94178 197319 -67928 -12731
15317C0211c1583o2859c1450j30671A14048L6972J19592g6584B32486b20898o617
15306b27515b2809j67046H9022B6855J53077a21231A21383a27742K2505o94k69495
15295c75426e8044D7291J57966I810K14630A7091b46410I2685J4654b16731k05925
15284d22656B16557j37R3563F978L04866A07208a46555A61244J93816b8572A17250
15272A39840F9748O4072N640J28510F9951J39124b50130A34014B3857b22187h6656
15260A47513b41699M595A61202b51683C0695R6662N8262C4821l274K85342A32471
15248A12043k2282P25652M59601L27153m16224L64304G38050G8487J94146j13527
15238A59106F9736p776J0071J40366J06200a27782C95131j18686A07175Q7578
$$ plain form
15317 30211 -31583 -94442 -31450 -162121 114048 151020 270612 -76584 232486 -220898 -227515
15306 -227515 -22809 -189855 89022 26855 179932 -121231 121383 -127742 -105237 -105931 -375426
15295 -375426 -58044 47291 205257 9810 224440 17091 -246410 92685 107339 -216731 -422656
15284 -422656 216557 216420 309983 6978 311844 107208 -146555 161244 355060 -28572 117250
15272 139840 69748 133820 139460 267970 69951 209075 -250130 134014 23857 -222187 -86656
15260 147513 -241699 -237104 161202 -251683 30695 127357 185619 34821 31547 316889 132471
15248 112043 89761 815413 1275014 1602167 1185943 1550247 738050 78487 272633 159106
15238 159106 69736 61960 72031 212397 318597 -127782 395131 276445 107175 194753
15228A94753i7263A97173k0324d2529m9587A95729a34689F5790a69331q4716B6453
15216A05251c70184e5898j9506q5311C21348a02510j25135f8134j09577b1489
15205a77353r8973i8943H2853k2586P3378J53889b18214E9896J17120a0043B76957
15193A70626K01951D3763L8127a30530b5100A76534J078E6144M85278D7404a58134
15181a62973B11360h4072E5759K01044n0198R0968i1059a3833j38306I7827a10391
15169B37265G1522j095K62359a83603G9906d04716D66118j90928j25499b18947
15158E2301L34093f720p3660A00980J84236F0080R2199d1361C4366b10280J1646
15147a98634A48873L9719M31510A20683j9353K51026h9641H0815N4562J16137
$$ plain form
15228 194753 -97263 197173 176849 -42529 -92116 195729 -134689 65790 -169331 -254047 26453
15216 105251 -370184 -55898 -75404 -160715 321348 -102510 -227645 -68134 -177711 -21489
15205 -177353 -276326 -98943 82853 60267 133645 287534 -218214 59896 177016 -10043 276957
15193 170626 372577 43763 81890 -130530 -25100 176534 177612 56144 541422 47404 -158134
15181 -162973 211360 -84072 55759 256803 206605 297573 -91059 -13833 -152139 97827 -110391
15169 237265 71522 70427 332786 -183603 79906 -404716 466118 275190 149691 -218947
15158 52301 386394 -6720 -80380 100980 285216 60080 152279 -41361 34366 -210280 -198634
15147 -198634 148873 188592 620102 120683 101330 352356 -89641 80815 135377 251514
15137B51514B4438O4352Q2198e4087H5352P327K4212L13239G5374a36810A3910
15125B01429j424D9163J48595B9769a77406A30567K0700K22544j51516N9346c689
15113B89231r4686g8518F4545P8924D2777M8778m3606o149g1295j2445k2822o5821
15101a72383B24964K462N2558A27356i566A79354J8833M8661fA75701K39114b41761
15088H4895o745R1446K21230r3012G3593b34390J7157M3158c0295G6281J82387
15077B58668A2045a01236k31459B24467a98229F5237K01843B8878g3469B44238
15066A95175d7581F7240K07630A26028R4369K6201m4302a75147A02468j7043n610
15055G9815J0333O2700k452P9867a52437A84104Q8238q3676K39750a45270A98807
$$ plain form
15137 251514 24438 88790 170988 -54087 85352 92679 116891 430130 75374 -136810 13910
15125 201429 200005 49163 197758 29769 -177406 130567 151267 373811 222295 281641 -3689
15113 289231 194545 -78518 64545 143469 42777 91555 47949 41800 -71295 -83740 -106562 -172383
15101 -172383 224964 227426 279984 127356 -9566 179354 198187 246848 -6 175701 414815 -241761
15088 84895 78150 169596 390826 297814 73593 -234390 -217233 -174075 -30295 76281 258668
15077 258668 12045 -101236 -332695 224467 -198229 65237 267080 28878 -73469 244238
15066 195175 -47581 67240 274870 126028 220397 246598 202296 -175147 102468 85425 79815
15055 79815 90148 152848 150396 230263 -152437 184104 272342 188666 428416 -145270 198807
15043A27346E7964J30541Q5129G6013c73217A54671L9744K24195K84896A56771
15032A89637B5804Q6205J05335i2509A82035b8159B35938A8031m395a81628C8095
15020A76585J05107J04603F7648O0114R3754a41686I6712Q0358G2893J49747A133
15008a74857I0086R4519K15622e5328J9314B78120J23024A78440a36501B72533
14997A90887O8787a43407C21332J61708D4704K34695q7439P4936O2435j00338
14987B28993C1133K32252i9757A04469a09533F5268J53127p506M8914j4970c05326
14975e0150B98588J7053n4864J77981A81463n1780a18753H4038l4105h9506b1655
14963C2203K20148L9275j42547M03302h7319G6825J59742H9924M2394J8596K60083
$$ plain form
15043 127346 57964 188505 273634 76013 -373217 154671 194415 418610 703506 156771
15032 189637 25804 112009 217344 -92509 182035 -28159 235938 18031 13636 -181628 38095
15020 176585 281692 386295 67648 127762 221516 -141686 96712 177070 72893 222640 1133
15008 -174857 90086 184605 400227 -55328 -36014 278120 401144 178440 -136501 272533
14997 190887 259674 -143407 321332 483040 44704 279399 191960 266896 329331 228993
14987 228993 31133 263385 -99757 104469 -109533 65268 218395 210889 259803 244833 -305326
14975 -50150 298588 315641 260777 438758 181463 129683 -118753 84038 49933 -89506 -21655
14963 32203 252351 291626 149079 552381 -87319 76825 236567 89924 132318 150914 410997
14952D10997B9298K11461L44374B33518a14383C08150k4912J059o5386J23839
14942C42750c2442D47617k20892N8377j19297K17657a30412C63535I0471k489
14932H7982j3014a14621A70668C2891J21299R2298H7527L35327a9903k51880B37936
14920C05907L6692j25162J1257n9965j9348C6499M76213A70474J16401F5842L3496
14909I9338K52536a09169A80733G8524O28534A51163J59805k9859K07798E1421
14898a91373C64223j33330L3017J91082j16147A63064K21839r5659r7532K39433
14888D31145j83294A17671M47322j46084M0884j55907q4228q6830k6114J8987
14878A25701a23824C63089J5151R4389l1800A22467J92003J07522k09139K53227
$$ plain form
14952 410997 29298 240759 585133 233518 -114383 308150 283238 284297 218911 342750
14942 342750 -32442 447617 226725 285102 165805 383462 -130412 363535 90471 87982
14932 87982 74968 -114621 170668 32891 154190 246488 87527 422854 -19903 -271783 237936
14920 305907 342599 217437 228694 168729 149381 36499 512712 170474 286875 65842 99338
14909 99338 351874 -109169 180733 78524 707058 151163 310968 281109 488907 51421
14898 -191373 364223 230893 263910 454992 338845 163064 384903 289244 191712 431145
14888 431145 247851 117671 564993 418909 459793 303886 219658 132828 106714 125701
14878 125701 -123824 363089 378240 472629 440829 122467 314470 421992 212853 466080
14868D66080A08824K54367A04888K96412A53755a96025C59736I0069J63950M12502
14858F66521A98606J13851c43520C58521A65232J40739r2334K00045G3364J27874
14848B01238J60795q8639M8887K52024L8709k16708J7120j41660l6255C5683J98551
14837B34234j6964R9966R6628j90856M23116k82505j52277J04517j31255N6060
14827B40664L39243A74045P7061A17620N55565B71867K53722j43205A71470R5822
14817B67292O6095K37873B45987K16402k25061K46431K192m044k38417L11889
14807E55379j62554j00724L21658B66436J93711Q9026R8063B70314M20496j87623
14797E03187A67404M33802o5672k24582J20997j94346J88751J57342k9737d4180
$$ plain form
14868 466080 108824 363191 104888 401300 153755 -196025 359736 90069 254019 666521
14858 666521 198606 312457 -343520 358521 165232 305971 213637 413682 73364 201238
14848 201238 362033 273394 322281 574305 613014 396306 413426 271766 235511 35683 234234
14837 234234 217270 317236 413864 223008 646124 363619 211342 315859 184604 240664
14827 240664 579907 174045 251106 117620 673185 271867 525589 382384 171470 267292
14817 267292 333387 571260 245987 462389 237328 483759 485951 481907 243490 555379
14807 555379 392825 292101 613759 266436 460147 549173 647236 270314 690810 503187
14797 503187 167404 601206 535534 310952 431949 237603 426354 583696 553959 -44180
14786D20304P1084A65833N42570k16671B04313K90024n8289j85169R0044N5950
14776C96873j25467K45065L51115m27028r6583L5635J81146n7653n9480p2948
14766C70675K60101j95364n497J18933B43844J52990m6960J24092J83824j39963
14756E17827p6327J13927J13272L334q6292O5578k34669j91185n2966J95934L04398
14745F72831J63165k13873K6783l5397K3566k84106J85975M0057k07624K43805
14735F15182k80733J68202N7963m4755R6468J89440C70501n1814J98803N1946
14725E69436K4264p3802K99280j59641j4021M2360j46082k9905R5714K12310A33748
14713A98587M11915K28289m937j80416j5127q6956K39390q4388k11424J53869
$$ plain form
14786 420304 491388 165833 708403 491732 204313 494337 436048 250879 340923 396873
14776 396873 271406 516471 867586 440558 343975 379610 560756 503103 443623 370675
14766 370675 630776 435412 429915 548848 243844 396834 349874 473966 657790 517827
14756 517827 441500 555427 668699 672033 585741 651319 416650 225465 172499 368433 672831
14745 672831 835996 622123 648906 613509 637075 352969 538944 579001 371377 615182
14735 615182 334449 502651 560614 515859 612327 801767 370501 318687 517490 569436
14725 569436 593700 519898 819178 659537 645516 687876 541794 511889 607603 819913 133748
14713 198587 610502 838791 833854 653438 638311 551355 790745 706357 494933 648802
14703F48802J30376B62569K30305J92858r917J74993k58959L3958R997C15695
14692D14431K5738M46947r4411N0169j5898l33590J45417J73398l09190L89934
14682H92945D30365L78919k0024l60444N00665J4445n9816p1989j73313N9656
14672F98464P0493q3646N0960K8700k9233N2624M0804p4910J28438L1949j54030
14661G60613j27o3963L22863l68139K21646J33852j65277L20847l90628Q4565
14651H56252p4504J20568k51696K40887J76172j0313m6900L8383j81974p023R5442
14640I55294l99564O46566k62329J63290j67914L63962j95546j38109j07997K78904
14630A136557k40948J4449M13079m75228J99734p9824k9548p324J81234P9775
$$ plain form
14703 648802 779178 262569 492874 685732 675815 850808 591849 625807 635804 315695
14692 414431 440169 887116 792705 842874 826976 493386 638803 812201 503011 892945
14682 892945 430365 809284 789260 428816 929481 943926 884110 812121 638808 698464
14672 698464 768957 685311 736271 764971 735738 788362 829166 754256 882694 914643 760613
14661 760613 760486 696523 1019386 651247 872893 1006745 841468 1162315 771687 856252
14651 856252 781748 902316 650620 891507 1067679 1057366 1010466 1048849 866875 859852 955294
14640 955294 555730 1202296 939967 1103257 935343 1299305 1103759 965650 857653 1136557
14630 1136557 895609 910058 1323137 847909 1047643 967819 938271 930947 1112181 1191956
14620A191956j78170L20779l18266M7345j70705K87397l71428K83054q6877J84973
14610A190058p5441K69004l93720L01173j75425K41910j98293K51525k34311l1797
14600A144683K41528k37902J05116q6504o8611J80009J23440j75027r0151L53184
14590A489765m70085L62773L70982k56248L06108j36160m35527M60670m82837
14581A209441M15794k60534J91932p9731P6870M9119j18169k6872l9457o6522
14571A351871K18708J76231j9932K58201l67677M11188k8982l77480J03642K97318
14561B023088k63135J93973K94420m46139N14342j77450L87498P7514P0311M46482
14551C120904P1649Q89963J014011L134176Q514615J5830958J1147284k1620061
$$ plain form
14620 1191956 1013786 1334565 1016299 1063644 892939 1180336 808908 1091962 1005085 1190058
14610 1190058 1114617 1383621 989901 1291074 1115649 1357559 1159266 1410791 1176480 1144683
14600 1144683 1386211 1148309 1253425 1166921 1098310 1278319 1401759 1226732 1136581 1489765
14590 1489765 1019680 1382453 1753435 1497187 1803295 1667135 1231608 1692278 1209441
14581 1209441 1625235 1364701 1556633 1476902 1553772 1602891 1484722 1457850 1418393 1351871
14571 1351871 1570579 1746810 1726878 1985079 1617402 2028590 1999608 1622128 1725770 2023088
14561 2023088 1759953 1953926 2248346 1802207 2316549 2139099 2526597 2604111 2674422 3120904
14551 3120904 3192553 4082516 5096527 8230703 16745318 32576276 43723560 22103499
14543B2103499I078459k775847k248161j762624n14261L2048k57444j02777j77735
14534A271658J62283j10306M12875J50626l64861K08274m0503J8764J66593q5987
14524A789416k56983M53380m8544j95687K00847k45889k0382M53098j06480j51203
14514A871573R3343K12687j99705R1571j00496L63860J58529l01699J77304k34077
14504B132890q9422K83388M478L439J2013K15530l91720N07801j12864J37208
14494B702741m19962L40576r9657L44142p5424k8774J74059k48179K45503j98903
14484B736122r3945Q81828p76080j27167N24455j80203K07524j86140J09958L02213
14474C398565m29840J01175K04773L10642l23359K65733k75082K13639m6166m2753
$$ plain form
14543 22103499 9078459 6302612 4054451 2291827 1777566 1809614 1552170 1449393 1271658
14534 1271658 1433941 1323635 1736510 1887136 1522275 1730549 1690046 1708810 1875403 1789416
14524 1789416 1532433 1985813 1937269 1741582 1942429 1696540 1676158 2129256 2022776 1871573
14514 1871573 1964916 2177603 1977898 2069469 1968973 2332833 2491362 2189663 2366967 2132890
14504 2132890 2043468 2326856 2331334 2334773 2346786 2562316 2170596 2678397 2565533 2702741
14494 2702741 2282779 2623355 2523698 2867840 2792416 2763642 2937701 2689522 2935025 2736122
14484 2736122 2642177 3524005 2747925 2620758 3145213 2965010 3172534 2986394 3096352 3398565
14474 3398565 2968725 3069900 3274673 3585315 3261956 3527689 3252607 3466246 3420080 3377327
14464C377327p0752N00126j59592K00666K5249j69689J46169K05493m04109J85255
14454C836143L19076J2301j1805K2269K38186j26547n9029L30091k66771K89536
14444D583450n2110J85837j3610K9605L53335k15807l9536K31491L54970k82156
14434E135469L9727K74865q8086j17056L4656M27525k39662J18520J99562J98523
14424E984043k21809J19099p7852J07115M26389j64852K75998M0424Q835K91888
14414F789278r3084J02736K64859J58623J90694m55324j4704M00625L26818j36444
14404G534077M53864j83654L76193l4076o3557M64624J22417J3291J51007K64545
14394I098731k06766M35269L04157k00496J51589M09211L4455M26732o9614K37200
$$ plain form
14464 3377327 3306575 3806701 3647109 3847775 3873024 3703335 3849504 4054997 3650888 3836143
14454 3836143 4155219 4167520 4155715 4177984 4416170 4289623 4230594 4560685 4293914 4583450
14444 4583450 4531340 4717177 4703567 4733172 5086507 4870700 4831164 5062655 5417625 5135469
14434 5135469 5175196 5450061 5361975 5244919 5279575 5707100 5467438 5585958 5785520 5984043
14424 5984043 5762234 5881333 5803481 5910596 6336985 6172133 6448131 6488555 6497390 6789278
14414 6789278 6696194 6798930 7063789 7222412 7413106 6957782 6943078 7343703 7670521 7534077
14404 7534077 7987941 7804287 8180480 8146404 8082847 8547471 8669888 8683179 8834186 9098731
14394 9098731 8891965 9327234 9631391 9430895 9582484 9991695 10026150 10452882 10383268 10620468
14384A0620468J60790L36521l5161L32696r4325M95016M77971p4415K09254K75857
14374A2704672L19887J12011J29611J40097J051870k33772L01677K87096M90625
14365A5303774j09107M94682O54393J65705K12185N11750L42484K52545M99739
14356A8328150Q90758R879J38628N18431P01341P45233M73918M79073K26518Q44969
14346B3356898N77152O79480L10408J172369K41590Q49898R67917Q02061O71183
14337B9628956R07673Q33922P37613J275138P27417J344402P90105J117327J252585
14328C8615138J051140J540232J190511J641308J166739K088851J271387J817595
14320E0382901J873816J780935K153710J831161K438093K458826K408590K407205
$$ plain form
14384 10620468 10781258 11117779 11082618 11415314 11320989 11816005 12293976 12219561 12428815 12704672
14374 12704672 13024559 13136570 13266181 13406278 14458148 14224376 14526053 14813149 15303774
14365 15303774 15194667 15689349 16343742 16509447 16721632 17233382 17575866 17828411 18328150
14356 18328150 19218908 19228787 19367415 19885846 20587187 21332420 21806338 22285411 22511929 23356898
14346 23356898 23934050 24613530 24923938 26096307 26337897 27187795 28155712 28957773 29628956
14337 29628956 30536629 31370551 32108164 33383302 34110719 35455121 36245226 37362553 38615138
14328 38615138 39666278 41206510 42397021 44038329 45205068 47293919 48565306 50382901
14320 50382901 52256717 54037652 56191362 58022523 60460616 62919442 65328032 67735237
14312F7735237K766402L092116L387953K967896L938706L291267L884961M535665
14304I5600203M155272N236372M977241N307373N851550N901463P139293P127971
14296A41296738O795269Q374673Q668758R133662R678836J0270537J1217891J1710925
14288B17147289J2462446J3022419J4184935J4326084J5367689J5478795J6138601
14281C18128258J6314289J6706991J6404749J6185058J5531979J4631844J3452155
14274D27355323J1565739R481516N046087j700382k323889L54272k547601k941351
14266D44289714o792919q370825j1488157j3084730j5285741j5822083j6814772
14259C56630487j7005097j6945963j7052372j6288397j6022760j4751775j3504722
$$ plain form
14312 67735237 70501639 73593755 76981708 79949604 83888310 87179577 91064538 95600203
14304 95600203 99755475 104991847 109969088 115276461 121128011 127029474 134168767 141296738
14296 141296738 148092007 156466680 165135438 174269100 183947936 194218473 205436364 217147289
14288 217147289 229609735 242632154 256817089 271143173 286510862 301989657 318128258
14281 318128258 334442547 351149538 367554287 383739345 399271324 413903168 427355323
14274 427355323 438921062 448402578 453448665 451748283 449424394 449778666 447231065 444289714
14266 444289714 437496795 429125970 417637813 404553083 389267342 373445259 356630487
14259 356630487 339625390 322679427 305627055 289338658 273315898 258564123 245059401
14252B45059401j2812420j2639140j2277243j1249826j0802709j0000410r680002
14245A65597651q428346p411614p677055p098260p150036n986143o007063n081849
14237A10757285m809369n040512m826670m497361l870576l291737l094491l656755
14229G7669814l381065l355412k613129k722454k441620k343929k655849j602573
14221E6553783k184801j964077j906353j343459k100075j480430j347342j368535
14213D2858711q14855j639993j529099j032292j547829p86334l98236r91202j170298
14204C2948573j156071j032156q85837n73422n01219o64730j005929j140121n62967
14195B5426121m60136m46580o15425o36505p63015m87213j09773r89830o03760
$$ plain form
14252 245059401 232246981 219607841 207330598 196080772 185278063 175277653 165597651
14245 165597651 157169305 149757691 142080636 134982376 127832340 121846197 115839134 110757285
14237 110757285 105947916 100907404 96080734 91583373 87712797 84421060 81326569 77669814
14229 77669814 74288749 70933337 68320208 65597754 63156134 60812205 58156356 56553783
14221 56553783 54368982 52404905 50498552 49155093 47055018 45574588 44227246 42858711
14213 42858711 42043856 40403863 38874764 37842472 36294643 35508309 35110073 34118871 32948573
14204 32948573 31792502 30760346 29874509 29301087 28799868 28135138 27129209 25989088 25426121
14195 25426121 24965985 24519405 23903980 23267475 22504460 22017247 21907474 20917644 20313884
14186B0313884k64685l10090o14482n18719l30174m03319k30742n16409k80835
14177A6844429l21600m78633r8714p49790r9435N9805r77970l20823K17114m34875
14167A3639508k28622k16109k87295l34791j27512l32828m74279K0128L78032
14158A2036232r19520K00490m75928k67617N0255k64560K1926l07296m69027M4930
14148I649885k08274n9403k0384k78340j60037J06412m52463q00j88128m63945
14138G924523J75949j82604o1954j15455q2335J77470j23865k21000l48671K58052
14128G400110j80415k03842j57475J32026j69449l41862Q4923o10936M62025j65835
14118F249270j57955L4308j11867m6693l95132J74724j42241P0152J60666K30027
$$ plain form
14186 20313884 20049199 19739109 19124627 18605908 18275734 17872415 17641673 17125264 16844429
14177 16844429 16522829 16044196 15945482 15195692 15096257 15156062 14178092 13857269 14074383 13639508
14167 13639508 13410886 13194777 12907482 12572691 12445179 12112351 11638072 11658200 12036232
14158 12036232 11116712 11317202 10841274 10573657 10623912 10359352 10381278 10073982 9604955 9649885
14148 9649885 9441611 9382208 9361824 9083484 8923447 9029859 8577396 8576596 8388468 7924523
14138 7924523 8100472 7917868 7855914 7740459 7658124 7835594 7711729 7490729 7142058 7400110
14128 7400110 7219695 7015853 6858378 6990404 6820955 6479093 6564016 5953080 6415105 6249270
14118 6249270 6091315 6125623 6013756 5967063 5571931 5746655 5604414 5674566 5835232 6065259
14108F065259p85199O3007n8399K75550l42157l20746K34321J53765m77143Q0555
14098D888813j60287o9j74207j02953L7516K45606m73713M1731r4405K93606m84970
14087D016668P4666j34170o0801K24853j10283J23022l13412J32981j7926l54571
14077C581027K19942J50234M5503l06346J57681k77666r453r8203L02884j91095
14067C574508k83124K79038q8752k66915L74335l15050R4596j00263M0844M4775
14057C353992L86241l16568R2434l90374j36488K88657K3200k60745q0770l5554
14047B924025L12255n28570J10076k1945l54584K7950L43671l12726Q6717p22
14037B586147K64082l53240Q7935K64347l19692K0130J90711j6833j84515j77686
$$ plain form
14108 6065259 5280060 5343067 5284668 5560218 5218061 4897315 5131636 5285401 4808258 4888813
14098 4888813 4728526 4728457 4554250 4451297 4488813 4734419 4260706 4302437 4208032 4501638 4016668
14087 4016668 4091334 3957164 3896363 4121216 4010933 4133955 3820543 3953524 3935598 3581027
14077 3581027 3800969 3951203 3996706 3690360 3848041 3570375 3560922 3462719 3765603 3574508
14067 3574508 3291384 3570422 3481670 3214755 3589090 3274040 3368636 3268373 3309217 3353992
14057 3353992 3740233 3423665 3516099 3125725 2989237 3277894 3301094 3040349 2959579 2924025
14047 2924025 3236280 2707710 2817786 2795841 2441257 2469207 2812878 2500152 2586869 2586147
14037 2586147 2850229 2496989 2584924 2849271 2529579 2549709 2740420 2723587 2539072 2361386
14027B361386J47267j39381k00976J94819k1330l18736K66887K1027o8245J6172
14017B258890m37656M09996j06687M3489l18827J86799j03652j61282k4925L28944
14007B075089p6538j59593k81244K89494j82642J99709l2899Q3972l12251K86529
13997A889626j84208l96018M35713P83k38185K33077J65581J41950J25961J604637
13987C778917P208767J5470271J7550576j6206987A2767487n392768k319819j100174
13979C954726n47329m40361k19282k10899l9498k094m21299j36078q6351M14672
13969B266207l56275l2238J4503N0221J87870m65580J8704R9495L78789j49179
13959B012517k13968l93708K52730k42585L47040n64595M60823J662O6522m4541
$$ plain form
14027 2361386 2508653 2369272 2168296 2363115 2341785 2023049 2289936 2310963 2242718 2258890
14017 2258890 1821234 2231230 2124543 2168032 1849205 2036004 1932352 1771070 1746145 2075089
14007 2075089 1998551 1838958 1557714 1847208 1664566 1864275 1831376 1915348 1603097 1889626
13997 1889626 1705418 1309400 1745113 1745896 1507711 1740788 1906369 2048319 2174280 3778917
13987 3778917 10987684 26457955 44008531 27801544 12767487 7374719 5054900 3954726
13979 3954726 3407397 2967036 2747754 2536855 2497357 2495263 2073964 1937886 1851535 2266207
13969 2266207 1909932 1877694 1892197 1942418 2130288 1664708 1683412 1782907 2161696 2012517
13959 2012517 1798549 1404841 1657571 1414986 1762026 1197431 1658254 1659916 1726438 1681897
13949A681897r3857k3400p9158K13434l43441M47758l73774j90462N79201k50761
13939A567437p484j42669l7230Q9277r6345J6967j61231M65146l96883k14699
13929A082286O93094m88497K12537k8981k62287j5820K15947k02645L51081l50954
13919A205761m9826J18963o2335r5378J52430j47574J97633j88576j49818J06312
13909A087592J42388r1649o5097J33840o2540k04556R9047j74299M95445j06248
13899A253923j55177K39980l42261J52168M452J95858l12777O6892k22458O6473
13889I47073J72928j26008j67304M95105k35127M5762m58051O02869l89256K67423
13879A155414k15185M028K81117q9665l86051J62245M54049l6765n06327K58919
$$ plain form
13949 1681897 1588040 1564640 1485482 1698916 1355475 1803233 1429459 1238997 1818198 1567437
13939 1567437 1559953 1417284 1380054 1469331 1372986 1389953 1228722 1693868 1296985 1082286
13929 1082286 1775380 1286883 1499420 1470439 1208152 1192332 1408279 1205634 1556715 1205761
13919 1205761 1155935 1274898 1212563 1117185 1269615 1122041 1319674 1131098 981280 1087592
13909 1087592 1229980 1138331 1073234 1207074 1144534 939978 1039025 864726 1360171 1253923
13899 1253923 1098746 1338726 996465 1148633 1153085 1348943 1036166 1103058 880600 947073
13889 947073 1120001 993993 826689 1321794 1086667 1132429 674378 1277247 887991 1155414
13879 1155414 940229 944257 1225374 1135709 749658 911903 1365952 1329187 822860 1081779
13869A081779j90305L31249r1291k00953n0916j44365K96477n8172j88772L9341
13859H24072n0360p2137N4572n2631q7912K93863l0779k89526J91621J62430L8077
13848I81290j94155p3036K35899j46223J38142J6190j45381k89731K94757j67721
13838F50031o3166L59978R4578m6121q7902j5687l3573k98908L51170j82868j032
13827G26500J58810l63655M18600m37805K76988j39751k00464L75589k82511N54303
13817A086604k77637Q5028k06292n2650L20087k57515j64922j15409K27430j27326
13807E17398j66224M08629k7584J12948l05404M93805k15256L552l59277j24900
13797C37687L5155M39002k41031K35301Q8225k10018j08649J42428J39825m08064
$$ plain form
13869 1081779 891474 1222723 1131432 930479 879563 735198 1031675 973503 784731 824072
13859 824072 773712 701575 756147 703516 615604 909467 878688 589162 780783 943213 981290
13848 981290 787135 714099 949998 803775 941917 958107 812726 522995 817752 650031
13838 650031 586865 946843 1041421 995300 907398 891711 858138 559230 910400 727532 726500
13827 726500 885310 521655 940255 502450 779438 639687 439223 814812 532301 1086604
13817 1086604 808967 893995 687703 635053 955140 697625 532703 417294 644724 517398
13807 517398 351174 759803 732219 845167 539763 1033568 818312 821864 462587 337687
13797 337687 372842 811844 570813 806114 894339 684321 575672 718100 857925 449861
13787D49861o0082L61010N3931J45992k00209l2694l11687K35942R8586k54057
13777D86593n6484J48332j92501K21039k555l02135L90797K27227D31234Q6193
13767E17427K77682m1006j51075j5560k50655r0655M09300M8963P8042j41871
13757F40592j06476r4640J75204r9130J59533J80919k04099B72620K1124J54853
13747D48597K89018j70646k1603B52761M43597C26278N70164D25223p8262j16442
13737B30519k6312N83208q7768j21641o3174J9089l3481k3610k0582a8494D11449
13725F64942m0738J63707k34837J25926k35002K21595k93050k1856K66100B58367
13714B13737K7264K84503J39839k98151A08924M10546A49158N56292k98562j61646
$$ plain form
13787 449861 389779 750789 804720 950712 750503 717809 406122 642064 740650 486593
13777 486593 430109 578441 385940 606979 604424 302289 693086 920313 431234 517427
13767 517427 795109 754103 603028 587468 336813 246158 655458 704421 782463 640592
13757 640592 534116 439476 614680 515550 675083 856002 651903 272620 293744 448597
13747 448597 737615 566969 545366 252761 696358 326278 896442 425223 346961 230519
13737 230519 204207 787415 699647 578006 514832 533921 500440 476830 456248 -18494 411449
13725 664942 624204 787911 553074 679000 443998 665593 372543 350687 616787 258367
13714 213737 241001 525504 665343 367192 108924 519470 149158 705450 406888 245242
13704B45242K68417l4713J90175j4696J2614l5555J48123B13823J6045K78779
13694E08647k33691j2407L05728K1752j36522H2497K70843r0672L65106n6160
13684E71614r3275Q6356k51098Q8633K3343l4479J11828m453k26337L2078J26451
13673D30661j44359K08732m4916p1408M2695K16778j24468O5921n6292B40395
13662D56278F6738N04752k82927R8147A66500K88401k5088O9058Q1122A86941
13651D07545A40276J90946K89218k77994M11013j41419j42482J6863A87378K68219
13641D55597J98641I9508L6752M01274j13155l4270n8224r2451J23852c655C74815
13629B92753K85977M2940B76976O8456A21759J98734j49375N10996k95160R8603
$$ plain form
13704 245242 513659 478946 669121 654425 667039 631484 779607 213823 229868 508647
13694 508647 274956 262549 568277 590029 453507 82497 353340 262668 627774 571614
13684 571614 478339 564695 313597 402230 425573 391094 502922 498469 272132 304210 430661
13673 430661 286302 495034 450118 378710 421405 638183 513715 579636 523344 240395
13662 456278 66738 571490 288563 386710 166500 454901 429813 498871 579993 186941
13651 407545 140276 331222 620440 342446 753459 612040 469558 486421 187378 455597
13641 455597 654238 99508 136260 537534 424379 390109 331885 239434 363286 -3655 374815
13629 292753 578730 621670 276976 345432 121759 320493 171118 682114 386954 485557
13619D85557n0632o3929K9037o5715A47368p0219K47051J45868j42532B7469K57551
13608B85020K29783A34550K0818L69613Q689F8677J90938j19053Q7052o3369M3601
13597B07846n3125L79368B10634j00503C4720N92644B73883N927p842H2893L70742
13586D53635j57812H4885L30058j51446J37506q067m2812J97070k16614A49025
13575D75613g4311A56460J42929j07168J14415A0733J43487D8840N87601l10402
13565C26039Q5560n8132J58976k49862K16225J46489G6718Q6318N6328J05393
13555C24757K03745P8506A03084J1224K63111k8292a7193A31359j8533K69161
13545C81987N7798j55461R9769j30651q8894K47244D2138L43070A22801J05108
$$ plain form
13619 485557 434925 370996 400033 334318 147368 77149 324200 470068 327536 27469 285020
13608 285020 514803 134550 155368 524981 533670 68677 259615 140562 227614 164245 207846
13597 207846 154721 534089 210634 110131 34720 627364 273883 279810 271968 82893 453635
13586 453635 295823 84885 414943 263497 401003 392936 350124 547194 330580 149025
13575 475613 -74311 156460 299389 192221 306636 10733 154220 48840 636441 326039
13565 326039 411599 353467 512443 262581 478806 625295 76718 163036 219364 324757
13555 324757 528502 607008 103084 114308 377419 349127 -17193 131359 112826 381987
13545 381987 439785 284324 384093 253442 164548 411792 42138 385208 122801 227909
13535B27909j0733m4158N3592o7711J19747H9076R8337O5633F4858O3455K09006
13524C37319n7841b4486C43142r1881J72678C777J78321J60001j49116K31253
13514D24236A65068K5207D7564J44441L16437B14474M7316F7488J24742L5097
13504B27327a48989P1839C11264J55861j90081J38889E4849K29139q9554f5763
13493C80334F7431a36030C16764A00973N55348B97166j30183C1791K35120J51366
13483D18277q8745J23657A7219M00239A68373M9340J00429a023A36406P3819D4698
13471B85527k2202J46578A86562J91001j68409B4913K65291A6982K54406H448
13460A82771n1933h9306A01259Q0857c4064A74748L01454e2171A85089J7501n5859
$$ plain form
13535 227909 217176 173018 226610 158899 278646 89076 187413 253046 64858 128313 337319
13524 337319 279478 -24486 343142 251261 423939 3777 182098 342099 192983 424236
13514 424236 165068 190275 47564 192005 508442 214474 261790 67488 192230 227327
13504 227327 -148989 -77150 311264 467125 277044 415933 54849 283988 194434 -65763
13493 380334 67431 -136030 316764 100973 656321 297166 166983 31791 266911 418277
13483 418277 329532 453189 17219 417458 168373 217713 318142 -1023 136406 210225 44698
13471 285527 263325 409903 186562 377563 209154 24913 290204 16982 271388 8448
13460 182771 130838 -89306 101259 182116 -34064 174748 476202 -52171 185089 202590 146731
13449A46731J16010F625K12015r157j00099J47254j03184J02111A19946l4535
13439H5411M67442A30289K05807f4873j01557A83798K5332J23080F547P2356K35132
13428C14035p1178L23983j54985j38316K4104a31559B33720b00761B18974q6465
13418A32509P0009G5805K98977J24679j43362j11803M3696p0201M0217J15012
13408C73020m192A59225b9953H0726M29790E1812d8297B80240J01609j42092A6507
13396B41342A05939K47555j05868A14692J92978K13883k37421N2094b2329B41245
13385D91524H4802b27687B22107r1830k8051M2869J86595j43646o2854L55823
13375D81013A55009O0479E349K635J17126C2068J65J29545a93340B84527k5559
$$ plain form
13449 146731 262741 6625 218640 209483 109384 256638 153454 255565 119946 85411
13439 85411 552853 130289 336096 -64873 -166430 183798 209130 332210 6547 78903 314035
13428 314035 242857 566840 411855 273539 297643 -131559 233720 -200761 218974 132509
13418 132509 202518 75805 374782 499461 356099 244296 287992 217791 258008 373020
13408 373020 368828 159225 -29953 80726 510516 51812 -48297 280240 381849 239757 16507
13396 241342 105939 353494 247626 114692 307670 521553 284132 336226 -22329 241245
13385 491524 84802 -227687 222107 130277 102226 145095 331690 188044 125190 481013
13375 481013 155009 215488 5349 7984 125110 32068 32233 161778 -193340 284527 258968
13364B58968A26803J61749J02833J89723f4062B93152C5600a50193D8259L07392
13354C55651j20692p9622R8890B6587J35154q869J55348B7839K59301K15797m6357
13343D56580B24173K22913H5733J48115j1512Q2094K4969H9795J16706a19624
13332A40585l938J0783N1732g193D7716g8679n440q2030B86533J01111a39607
13320A57379J13443p019K0207O8770P5045A67914G2728J08880o3544J65712I3634
13308A24184a25928A20223J09119L04669j08846C1579J2171b14887q0754B19573
13297B32966g1192A81295i3952r0065D21512k03027l6646a09871K4803l3742L731
13286a15079A76824m5561b917o7473L3699A51108J85061o4510p048M9579j53750
$$ plain form
13364 258968 126803 288552 391385 581108 -64062 293152 35600 -150193 48259 355651
13354 355651 234959 155337 254227 26587 161741 152872 308220 27839 287140 502937 456580
13343 456580 224173 447086 85733 233848 222336 304430 329399 89795 206501 -119624
13332 140585 136647 147430 199162 -7193 47716 -78679 -84119 -166149 286533 387644 -139607
13320 157379 270822 263803 284010 352780 427825 167914 72728 181608 118064 283776 93634
13308 124184 -125928 120223 229342 534011 425165 31579 43750 -214887 -295641 219573
13297 232966 -71192 181295 -93952 -184017 421512 218485 181839 -109871 -85068 -118810 -115079
13286 -115079 176824 131263 -2917 -70390 -36691 151108 336169 271659 264611 314190 160440
13275A60440J1892o5846K51923p1495C6391f7904B5656K75327I7828i611A88446
13263i8348J2384K0604C71286g0220m8788B31803m5434Q7214o4143m1460a45730
13251b0914C39422A64701a09998L2545B37786d4022b1139A16789J08179A04019
13240B04639j00317K177e272p7555l5409B73870f6349C546J03178R7878c4856
13228g5135C26785j0900j24795n3523O0837k294I3371L7552j9614O0157a72636
13216a9746A75163q785G5149i5511B63805R7809I3096r893J59010p9824j5778
13205A46611F9541K15450G4109J53381I0464P3677m8955a52818C63730b2816e898
13193B01060a63298C4676a04299C04693a11364A56159C9048i4684B00013d282
$$ plain form
13275 160440 172332 106486 358409 286914 36391 -67904 25656 300983 97828 -9611 188446
13263 -98348 -85964 -65360 371286 -70220 -119008 231803 186369 273583 209440 167980 -145730
13251 -20914 339422 164701 -109998 -77453 237786 -44022 -21139 116789 224968 104019
13240 204639 104322 106499 -5272 -82827 -118236 273870 -66349 3546 106724 204602 -34856
13228 -75135 326785 315885 191090 137567 198404 196110 93371 130923 111309 171466 -172636
13216 -19746 175163 166378 75149 -95511 263805 361614 93096 83203 242213 162389 146611
13205 146611 69541 284991 74109 227490 90464 164141 115186 -152818 363730 -22816 -5898
13193 201060 -163298 34676 -104299 304693 -111364 156159 39048 -94684 200013 -4282
13182B32488j12329M8177J45047j30352L504l2098o1969J85274A37364a16305
13171b28110K4615C80788I4851K9508r728E1063K75902F6884P6320b32351n8862
13160b91213B25775c8479E4554F657a27156A90243a98170c0439H0812J17133f3509
13148c47621F2686k903J71001J83864a1876N360G6972J65293D8263K70228r5707
13137B22784J5965H5834j5810J59947a44299B66029A4892c73624J46387B01128
13126E7601L6057l5634N4092a59405a4402j5894A56315h927j06044A56008L6614
13115A92622a29802c4903A45332C0974a55273m0051n6784C71716f101j02227A61946
13103C09791Q0250A16502D0908K4911a20151B58401j00646o7904C948a12875C67557
$$ plain form
13182 232488 120159 168336 313383 183031 186535 154437 92468 277742 137364 -116305
13171 -228110 -203495 380788 94851 124359 114631 51063 326965 66884 143204 -232351 -291213
13160 -291213 225775 -38479 54554 6657 -127156 190243 -198170 -30439 80812 197945 -63509
13148 -347621 62686 59783 230784 414648 -11876 -6516 76972 242265 48263 318491 222784
13137 222784 238749 85834 70024 229971 -144299 266029 14892 -373624 -227237 201128
13126 57601 93658 58024 112116 -159405 -14402 -30296 156315 -8927 -114971 156008 192622
13115 192622 -129802 -34903 145332 30974 -155273 -195324 -252108 371716 -6101 -108328 161946
13103 309791 390041 116502 40908 65819 -120151 258401 157755 89851 3948 -112875 367557
13091G0713j8403a14671c1123D9709d1482k55125f2257B01511q1388Q865d24461
13079B95346a88053c7074j61885j65174b1370C7454I172b26050g5533K3271j0753
13068f3015I1040a13838A8785J52843b13926D9464A3035a05592H4089a05920A69666
13056g4117M11j12508c143A71057A7081J13330e1028B84771f7203L1193A92110
13044C18300A40640J49394A30762o0264J42110N9764a28832A52406J31209Q4533
13034C68148a39342b8496B96584a03376j11126H9904J26728A744a12316C70587
13023A8898J77532M4508A15857j3290c3367j14237B3165L09464b9621H1896J0286
13012I2182M9899J74607F2329K18926o5189l8154q2226n031K75855c5648H6621
$$ plain form
13091 70713 52310 -114671 -31123 49709 -41482 -296607 -62257 201511 120123 128988 -424461
13079 295346 -188053 -37074 -198959 -364133 -21370 37454 9172 -226050 -75533 -52262 -63015
13068 -63015 91040 -113838 18785 171628 -213926 49464 13035 -105592 84089 -105920 169666
13056 -74117 -73706 -186214 -3143 171057 17081 130411 -51028 284771 -67203 -36010 192110
13044 318300 140640 290034 130762 70498 212608 272372 -128832 152406 283615 368148
13034 368148 -139342 -28496 296584 -103376 -214502 89904 216632 1744 -112316 370587
13023 18898 196430 240938 115857 102567 -33367 -147604 23165 332629 -29621 81896 92182
13012 92182 142081 316688 62329 281255 216066 177912 95686 90655 366510 -35648 86621
13000H2403B3110d8942G1489J11089D7439L557K954i8011A04926a29104n2873
12989a81977C51406r3918r0334F0478K02349m8682E1957J76143m5093m9681J5387
12978A48713B5442M0102e9865A41532E2491R7345J03477a88528f5114A85972o5084
12967A20888I477c4571K433B11604b33292c8541A53498D6517g3131j96077C3426
12955B80802G4659a30968e662E4152K7313M2564d71454h9886B2819J72675N8577
12944B54071o9852A311a10827D9781b0546B21239B424Q4434b9055F4188f0841
12932I7125J24512p080L0687i9015B07914d31944A68152g7879o1002f5847B13091
12920a49135g94G6322g1656A07895K65117g098C69275b09410B30509R3395a69007
$$ plain form
13000 82403 23110 -48942 71489 182578 47439 50996 53950 -98011 104926 -129104 -181977
12989 -181977 351406 257488 167154 60478 262827 214145 51957 228100 183007 133326 148713
12978 148713 25442 65544 -59865 141532 52491 149836 253313 -188528 -65114 185972 120888
12967 120888 9477 -34571 -32138 211604 -233292 -38541 153498 46517 -73131 -269208 33426
12955 280802 74659 -130968 -5662 54152 81465 124029 -471454 -89886 22819 195494 254071
12944 254071 184219 1311 -110827 49781 -20546 221239 2424 86858 -29055 64188 -60841
12932 97125 221637 214557 245244 -99015 207914 -431944 168152 -77879 -138881 -65847 213091
12920 -149135 -794 76322 -71656 107895 373012 -7098 369275 -209410 230509 323904 -169007
12908b1675A78198a33043j4783j46521A35414M65676b99838b8132D3950i4430
12897b1446A93076a10850B58452a12596I6246J76169K0706b29435H0822a90888
12886F3028a86910f6246k53481A54302g418n5756o8127D02N8838q719b86296A71062
12873a04348A24805d8230C4191L0004f6504A21857c89111e662B35258k2629H2285
12861I7095a87555E03221B15042a27253A41991B0064K14859a9558j78406h4174
12850B45699D8662f7469B12591F7838P6088a14554o3041H1847a61407A55506a77680
12838e9700r0729A25707a70070j52851C68945A35433a20052C0432J99431c04882
12827A74153D6411j0579a2371l6087k3537B36212f9081B24383h1804B0070b41794
$$ plain form
12908 -21675 178198 -133043 -147826 -294347 135414 601090 -299838 -28132 43950 -94430
12897 -21446 193076 -110850 258452 -112596 96246 272415 293121 -229435 80822 -190888
12886 63028 -186910 -66246 -319727 154302 -7418 -63174 -131301 402 59240 50521 -286296 171062
12873 -104348 124805 -48230 34191 64195 -66504 121857 -389111 -5662 235258 212629 82285
12861 97095 -187555 503221 215042 -127253 141991 20064 234923 -19558 -197964 -84174
12850 245699 48662 -67469 212591 67838 143926 -114554 -177595 81847 -161407 155506 -177680
12838 -59700 -150429 125707 -170070 -322921 368945 135433 -120052 30432 229863 -304882
12827 174153 46411 35832 -12371 -48458 -71995 236212 -69081 224383 -81804 20070 -241794
12815a55684A70940n8741L2767J31794a05281k07699b2636B03340f4774A48692
12804a12657o9744k6592B30468B9612J3863f2741E0435a68556D1278A6062a23975
12792B91265A16782n5147B2897L7708J38040b31417D92207A03327a75501o3942
12782b39443B90229a77322p5000F6718J4355j9029a16107B62510C221K04585O5549
12771B73355a54166B40857a11994J6729L2705J0819b4544p1130C02760i6794A04796
12759d7644B54717b1195A05811M0329J10667b56239C2400H514L3173P3992c30626
12747a16309I0931D3736L9101a12889j7269k5136f4078A34630J5388J6119P6317
12736B42454F9269J60015f3727r8074E5691J35444R070B578O8453J04011M62q0910
$$ plain form
12815 -155684 170940 112199 144966 276760 -105281 -312980 -22636 203340 -64774 148692
12804 -112657 -182401 -208993 230468 29612 43475 -62741 50435 -168556 41278 16062 -123975
12792 291265 116782 61635 22897 60605 198645 -231417 492207 103327 -175501 -239443
12782 -239443 290229 -177322 -252322 66718 81073 62044 -116107 262510 3221 207806 273355
12771 273355 -154166 240857 -111994 -95265 -62560 -51741 -24544 -95674 302760 -96794 104796
12759 -47644 254717 -21195 105811 146140 256807 -256239 32400 8514 41687 115679 -330626
12747 -116309 90931 43736 82837 -112889 -130158 -155294 -64078 134630 150018 166137 242454
12736 242454 69269 229284 -63727 -161801 55691 191135 200205 2578 71031 175042 175504 94594
12724I4594A6069P3723a82008b9524D5606K01739a21531A10309b0531D8051Q7342
12713A35393i3391A18509b24812g7633A97665m4418R8528j16673L07629H4337
12702E1024K100L23658j65386b9283I8455m206a1199E6383J82599I9660N3176
12691A52836a92642C91008c18108a18154G7371A2581B33a73459N3263A27854b2861
12679C83125a44335B67588a24435D07245A03047D6330d0965A46017b9029B15921
12668c25955A64875f63A365J16639D5463Q1415E4203B220Q5626K00807f0348k3980
12656h4328C6403J32436J15733J18970j19852a84383H7996l853J35958M935k8083
12645A96953K5631b84089E9962a3664n990E31243A2820d5985A30048k1422l8812
$$ plain form
12724 94594 16069 89792 -182008 -29524 45606 247345 -121531 110309 -20531 48051 135393
12713 135393 -93391 118509 -224812 -77633 197665 153247 251775 135102 442731 84337
12702 51024 53124 376782 211396 -29283 98455 94249 -11199 56383 238982 99660 152836
12691 152836 -192642 391008 -318108 -118154 77371 12581 233 -173459 -120196 127854 -22861
12679 383125 -144335 267588 -124435 407245 103047 46330 -40965 146017 -29029 215921
12668 -325955 164875 -663 1365 118004 45463 126878 54203 2220 87846 288653 -60348 -84328
12656 -84328 36403 168839 284572 403542 283690 -184383 87996 84143 220101 225036 196953
12645 196953 222584 -284089 59962 -13664 -19654 531243 12820 -45985 130048 108626 69814
12634F9814C711J57986J14795d3810J014B39592A18018j3801a33477A85843K4139
12623B09982L5155D1345O5597K85470H1027d1023B86688K6389g8294j518E3256
12611B4907J21886L76121E591a96270A39583b78083A48618o7916l6422K85176
12601C29456B3413M9554Q8163E4124M01922Q2442A44509J96845e4487n4980A31627
12589c1060F3127L14973a52114a4407A14563i8866D5829b06187P6098n7575A07127
12577A33720N9073N096G0521a89289M8378A0777a31494I110c733k05567C6024
12565A16791b24128A08633j4566j4375a98366A53264b9663A63893J41510j33022
12555A72381N4924J58040d3411a5388C59293a78340b48D3048L5250e8391G9293
$$ plain form
12634 69814 3711 161697 276492 -43810 -42796 239592 118018 104217 -133477 185843 209982
12623 209982 245137 41345 106942 392412 81027 -41023 286688 313077 -78294 -79812 53256
12611 24907 146793 522914 5591 -196270 139583 -278083 148618 80702 44280 329456
12601 329456 23413 72967 161130 54124 456046 538488 144509 341354 -54487 -109467 131627
12589 -31060 63127 378100 -152114 -14407 114563 -98866 45829 -206187 -130089 -187664 107127
12577 133720 192793 197889 70521 -189289 -140911 10777 -131494 9110 -3733 -209300 36024
12565 116791 -224128 108633 94067 79692 -198366 153264 -29663 163893 305403 172381
12555 172381 227305 385345 -43411 -15388 359293 -178340 -248 43048 78298 -58391 79293
12543A87088b16960B07126g8698j78841g705f86A48713J15890e0927q3696A81865
12531b194r2199k52628A27466a8608A33922a5861B03751d7286A41976K60843f1936
12519A50057L6436E5691d8196k3381B49084a42430D8095b28019K5680A33462d2559
12507A09432K01857l7293a17438c2984G4964c4178C9250J55453g422j10307M2233
12496g5496j20204O5612n2456D5364Q5267a65512A07675a48079E2660b5200A6842
12484H2313l9163B0973i6751K3325A72890o5769J42236I5228h3127K3113G8943
12472e4123m9090C83995B8846J1263J48819b18828B99481a30478e1548F2289a0344
12460A25518C6172e01275a00852m8896j40080a01539A05596A4343E620a89725
$$ plain form
12543 187088 -216960 207126 -78698 -257539 -7705 -686 148713 264603 -50927 -134623 181865
12531 -2194 -94393 -347021 127466 -18608 133922 -15861 203751 -47286 141976 402819 -61936
12519 150057 186493 55691 -48196 -71577 249084 -142430 48095 -228019 -202339 133462 -42559
12507 109432 311289 273996 -117438 -32984 74964 -34178 39250 194703 -7422 -117729 -75496
12496 -75496 -195700 -130088 -182544 45364 130631 -165512 107675 -148079 52660 -25200 16842
12484 82313 43150 20973 -96751 -73426 172890 107121 249357 95228 -83127 -60014 78943
12472 -54123 -103213 383995 28846 40109 188928 -218828 299481 -130478 -51548 62289 -10344
12460 125518 36172 -501275 -100852 -149748 -289828 -101539 105596 14343 5620 -189725
12449D3830h736k48862E8213N1892b38739C6141J02764a7212k7010p4596E0985
12437a09556A69467J31122F2128K4813a2505B14844D7591b60888g368A9708h1733
12425b62512B43974c4639C7042J11522F1568c5507B86787A0742a83121C87623
12414G3377K47929E8227g7190A85549b76468e2241J7701r2869B9273b83244A16129
12402A7864a00693j09022J00076C4631a15630H6084c52987e466D33976A60802
12391d386C32344b78550I3321e5106E7594B3518g6732j12743N4035Q945O1767
12380f4728q94B32086o1217d32816H2562M0829O1588J0173p3850b06872j35058
12369c41930d7490A91460a92506B96165R7253c402k73700F8086I2K58110F6916
$$ plain form
12449 43830 -8736 -257598 58213 110105 -238739 36141 138905 -17212 -44222 -118818 50985
12437 -109556 169467 300589 62128 86941 -12505 214844 47591 -260888 -7368 19708 -81733
12425 -262512 243974 -34639 37042 148564 61568 -35507 286787 10742 -183121 387623
12414 73377 321306 58227 -77190 185549 -276468 -52241 -34540 -127409 29273 -283244 116129
12402 17864 -100693 -209715 -109639 34631 -115630 86084 -352987 -5466 433976 160802
12391 -4386 332344 -278550 93321 -55106 57594 23518 -76732 -189475 -135440 -126495 -64728
12380 -64728 -65622 232086 170869 -432816 82562 123391 184979 195152 121302 -206872 -341930
12369 -341930 -47490 191460 -192506 296165 393418 -3402 -277102 68086 92 258202 66916
12357A18888b84727H4803b40517M5896c0j57392A77586e4817F9900L38160j28589
12346B79471A11818h5598j27837k1525A85638A7388J6680b49228F901J78243h168
12334b86383J3120f658A72849f2060b0620A22368h2463A19756a70663K1930N1924
12323i6809A34464N1558k7729K8451b61204A04132b75475a34919A08512a02223
12312a17624a7900j74471d6071r5503A74476a40560B40096E3691f5145A43242
12301b3704B33424E029a39282D00923e0371j58923B75882b20050C3671a308B0587
12289C15572E6739J4640J21958J81602c99570H9268A4992g8425L8407B94296b12460
12277E8383J64309j09439j255K7223j4574J65312o3115j04101A6981J81349a13561
$$ plain form
12357 118888 -284727 84803 -240517 -194621 -30 -157422 177586 -54817 69900 408060 279471
12346 279471 111818 -85598 -213435 -234960 185638 17388 34068 -249228 6901 185144 -8168
12334 -286383 -273263 -6658 172849 -62060 -20620 122368 -82463 119756 -170663 -148733 -96809
12323 -96809 134464 186022 158293 186744 -261204 104132 -275475 -134919 108512 -102223
12312 -117624 -17900 -192371 -46071 -141574 174476 -140560 240096 53691 -65145 143242
12301 -23704 233424 5029 -139282 400923 -50371 -209294 275882 -220050 33671 -1308 20587
12289 315572 56739 71379 193337 374939 -399570 89268 14992 -78425 -40018 294296 -212460
12277 58383 222692 113253 111998 139221 124647 289959 226844 122743 16981 198330 -113561
12265B07363m5497a9686j24247O1486J2397e668E7861J0220B0546K28604B6892
12253a8691D16245b5500B64100I221J14497n6606K3272D0943A3582a32695A30977
12241A87292G8698h9706D07451A94238D9953b85710A13690a56145g5943j17292
12231a93235e2089A28501J39336p1324L4799D1645R0805K07027j00126k4482R6586
12220C11455p2450j04067P6939J18224C9499M13924d8823A29186a98237B18798
12209a52045d9405G1380K84653G5147f7673G4718J59015I2999N0543m6095g6520
12197a67174C21554G8068K87261j01545b3889B66201J02384A51726r956J0781
12187A52551a501A53757N4905j00631b365D66172b758o4926o0403I5311b09152
$$ plain form
12265 207363 161866 -19686 -143933 -82447 -70050 -5668 57861 68081 20546 249150 26892
12253 -18691 416245 -25500 264100 9221 123718 67112 90384 40943 13582 -132695 130977
12241 187292 78698 -89706 407451 194238 49953 -285710 113690 -156145 -75943 -193235
12231 -193235 -52089 128501 267837 196513 231312 41645 132450 339477 239351 214869 311455
12220 311455 239005 134938 211877 330101 39499 453423 -48823 129186 -198237 218798
12209 -152045 -49405 71380 356033 75147 -67673 74718 233733 92999 143542 97447 -76520
12197 -167174 321554 78068 365329 263784 -23889 266201 368585 151726 141770 152551
12187 152551 -1501 153757 208662 108031 -2365 466172 -2758 -67684 -128087 95311 -209152
12175G1353J64859J5098R7051J00373k6002A70537c03351A07246B8225K47084
12165B75309A03079J93479h373D2764J55501N2949g1238B60093g2857C15002a30683
12153f044j33269H7561J75853c13738D9767K75669K50080C5592a6188l78297E9912
12141f430A83368m568q1710g1625m80721K58644a3477j34204H110a18355N5609
12130f2746C11621j29260g8788O734C70197A0875L42814c42297Q0476J02616A44082
12118a13466j423r7388A64698m9314b62585A56622M4055L6702k9333A868b74638
12106b86679c3325J0064r8298G1098L3460R8058i7526A41287a77490a358A76491
12094D1195g8663A5911J3497e3622j10440B4278a81084Q6826c6617k23458b0396
$$ plain form
12175 71353 236212 251310 348361 448734 422732 170537 -303351 107246 28225 275309
12165 275309 103079 296558 -8373 42764 198265 251214 -71238 260093 -72857 315002 -130683
12153 -6044 -139313 87561 263414 -313738 49767 325436 575516 35592 -16188 -394485 59912
12141 -6430 183368 178800 97090 -71625 -552346 -293702 -13477 -147681 8110 -118355 -62746
12130 -62746 311621 182361 -78788 -72054 370197 10875 353689 -342297 -261821 -159205 144082
12118 -113466 -114889 -212277 164698 115384 -262585 156622 200677 237379 208046 1868 -274638
12106 -286679 -33325 -23261 -121559 71098 104558 202616 -97526 141287 -177490 -1358 176491
12094 41195 -78663 15911 29408 -53622 -164062 24278 -181084 -94258 -36617 -260075 -20396
12082a36309M3477A62860a81538C8572L7172K08673R87356Q29519q33986E41694
12071C20751j48870E1103B015b09078i8840A90056A2267e0026C07716b48647B03649
12059e8643B30850F3079K1461b74379A6302J22756j0031a78605A55038b70699
12048a10916n3770E3131c75069f2256I401Q6317a8388l7689A16523J42839a999
12036H7823a90762O1712A6056K45785c42279B82432b17818P6367D2696K98553
12026C41249a97818l42583K49570i5626D0179Q9191B2902k886o148k922d5331
12014d9531k47349B01867r6895a78019A96186N8321o8277n0537A8592e4872q5753
12003a40625b5201r2017B04641l3141a44773J2262k8719B36641h270j29923K6815
$$ plain form
12082 -136309 -92832 162860 -181538 38572 75744 284417 1271773 2101292 1267306 541694
12071 320751 171881 51103 2015 -209078 -98840 190056 12267 -50026 307716 -248647 203649
12059 -58643 230850 63079 84540 -274379 16302 139058 129027 -178605 155038 -270699
12048 -110916 -164686 53131 -375069 -62256 9401 95718 -18388 -56077 116523 259362 -1999
12036 87823 -190762 -129050 16056 261841 -342279 282432 -217818 -141451 42696 341249
12026 341249 -197818 -540401 -290831 -95626 40179 129370 22902 20016 13868 10946 -45331
12014 -49531 -296880 201867 104972 -178019 196186 254507 186230 135693 18592 -54872 -140625
12003 -140625 -25201 -117218 204641 171500 -144773 -132511 -161230 236641 -8270 -138193 -111378
11992a11378M4927e791l4445k08612a0438l9880E5256i2290A91061a72145G1614
11980a36938A36908a65548P3089d2816B71055d94200B15101l3934E7102H74P9637
11969H0511K67305i4419M1184p5850B14020b09472d921l17562a12824B2464a8200
11957a26622k87480a17037A01409b99179c0873A13815J03885n7514Q3375q7028
11947A56533M4177g1166B09473e3218A70804e3196j29046j41547A3272a23385
11936I6977a48877P2344l26507b0053j67214B16582e1509j67584D26060A13910
11925I5675a94942I5276a19407B77260o2603A5727J01803e6572j61568A02577
11914A81712H9630a42357A14065j0072J979d0901B12205R010C877i3686C4697
$$ plain form
11992 -111378 -66451 -5791 -40236 -248848 -10438 -50318 55256 -92290 191061 -172145 71614
11980 -136938 136908 -165548 -92459 -42816 271055 -494200 215101 181167 57102 874 80511
11969 80511 347816 -94419 -53235 -129085 214020 -209472 -4921 -322483 -112824 22464 -18200
11957 -126622 -414102 -117037 101409 -299179 -30873 113815 217700 160186 243561 156533
11947 156533 200710 -71166 209473 -53218 170804 -53196 -182242 -323789 13272 -123385
11936 96977 -148877 -76533 -403040 -20053 -187267 216582 -51509 -219093 426060 113910
11925 95675 -194942 95276 -119407 277260 214657 15727 117530 -56572 -218140 102577
11914 181712 89630 -142357 114065 103993 105972 -40901 212205 221215 3877 -93686 34697
11902C0226H692a29677N6872A08844a20728A6035i8389M4422q3268r2909i7398
11890a46372l7328e7990I2724f4259K7962m2961j49209A4580f436m60740B03740
11878A11125b58612P5839a4386j10115E15259E6494J53872c23222C2600b28828
11867g0143n0340j03081R4981d980j64187B4854a0201j20066G4647K18170P5552
11856C68369q0043o5564H0851b08824E9326J12479h6514M0920A70875E3226h6825
11844a44903c0550k7977j37395C1305a57950f8357k921j12413I9442a6939k86490
11833c03429a24256j05140A66569p5443b05138D4513K6423b41044G5054h3536
11822A87088b81146c5471m259j59783C72810A45424H301a39423A20399a95484
$$ plain form
11902 30226 8692 -129677 -72805 108844 -120728 16035 -98389 -53967 -137235 -230144 -97398
11890 -146372 -183700 -57990 92724 -64259 -36297 -79258 -228467 14580 -6436 -467176 203740
11878 111125 -258612 -182773 -14386 -124501 515259 56494 210366 -323222 32600 -228828
11867 -70143 -120483 -223564 -128583 -4980 -169167 24854 -10201 -130267 74647 292817 368369
11856 368369 288326 222762 80851 -208824 59326 171805 -86514 -45594 170875 53226 -86825
11844 -144903 -30550 -58527 -195922 31305 -157950 -68357 -71278 -183691 99442 -16939 -303429
11833 -303429 -124256 -229396 166569 91126 -205138 44513 70936 -241044 75054 -83536
11822 187088 -281146 -35471 -39730 -199513 372810 145424 8301 -139423 120399 -195484
11811a84907N9912c2672a1078j93386M5417j6972B44528a533k9838E4344M3321
11800I7665M9335C8786K0266J34413c44277J21014D45392A74327a23336H8876
11789b78762A7819b74510g1731J176D2b55626B38O6284K37980r6406J576b03060
11776I1778J04166o1737a8005I4541a9785j64314G2284O6905J8306a7269A77691
11764B09662h2310C2028B573b2613o1559A05571a09253l2886A58747a9510H8559
11752A43061b26530h0536k96707E7149Q0436A9423h8278q687k4103L7872j48840
11741b32036j7278A85321K1954p4777b6990A47370p1891K0968R8848d9136n0024
11730i9160I3181J45671q8326R382l7215c5806j19028g6365A9257i1908B42095
$$ plain form
11811 -184907 -124995 -32672 -11078 -204464 -159047 -176019 244528 -1533 -31371 54344 97665
11800 97665 147000 38786 59052 193465 -344277 -223263 445392 174327 -123336 88876
11789 -278762 17819 -274510 -71731 -70555 42 -255626 238 66522 304502 208096 209672 -203060
11776 91778 195944 134207 -18005 94541 -19785 -184099 72284 139189 157495 -17269 177691
11764 209662 -82310 32028 2573 -22613 -84172 105571 -109253 -142139 158747 -19510 88559
11752 143061 -226530 -80536 -377243 57149 137585 19423 -88278 -96965 -121068 -83196 -232036
11741 -232036 -249314 185321 207275 132498 -26990 147370 75479 96447 195295 -49136 -99160
11730 -99160 93181 238852 150526 159908 122693 -35806 -154834 -76365 19257 -91908 242095
11718A32410D6024a24075L7888I4172M0388b63615c3379C83057I3923i852k07659
11707b17511Q5826A7592K04569j09394P2529a72926A44785b70424D04551a76331
11696B34582c17635B3592a98173A85764a07581j7719k73884C6393J3397c456A31202
11684C46729F125a13213A09253J18704g4435B29167p4814a4017j7145C15125D851
11672a94264C70992a25832A74066B4061d41674a6334A0300f4303j7388A62507
11661i5609K3702a6963A09409l7479A2141J61378b40451A20035A1252J15675h068
11649C07530a35639b3390A0449K22578b89899H9545a99105B83681j08872o3563
11639A11246m6442L15193b52590a01577A8482L41908g3014C41885A35454a55185
$$ plain form
11718 132410 46024 -124075 -86187 94172 134560 -263615 -33379 383057 93923 -9852 -217511
11707 -217511 -131685 17592 222161 112767 185296 -172926 144785 -270424 404551 -176331
11696 234582 -317635 23592 -198173 185764 -107581 -125300 -399184 36393 49790 -3456 131202
11684 346729 6125 -113213 109253 227957 -74435 229167 154353 -14017 -31162 315125 4851
11672 -194264 370992 -125832 174066 24061 -441674 -16334 10300 -64303 -81691 162507
11661 -95609 -71907 -16963 109409 71930 12141 173519 -240451 120035 11252 126927 -8068
11649 307530 -135639 -23390 10449 233027 -289899 89545 -199105 283681 174809 111246
11639 111246 64804 379997 -252590 -101577 18482 360390 -73014 341885 135454 -155185
11628B41842r5153F9174A5075e9984A64016K9753R7414a24939C11668I3569c11406
11616f6378A5981D497L11779e7966k83164a32141C98950b47756g9142L5309D3538
11604a76329D46865q146C2662J14207A1024L43198A30968A6481d4235m9345A48236
11592D7307e8444b3483j7402A11720a6310o2981A74214P5507L9824O9923A46184
11580A48674C4424L20026D1484R0520a3847A03190a61363e7627G641Q8997O1483
11569A58121K69561B10886a02258Q016C1235J69903d7158B40850I2281k2084k584
11558F7613O8932m2735j549D790L9035a28236F4683A9166b6596G7918G196K47410
11546B54606j15668O7634j0895d05863H6238a7974I7288b66835A8833f1179D893
$$ plain form
11628 241842 146689 69174 15075 -59984 164016 193769 291183 -124939 311668 93569 -311406
11616 -66378 15981 4497 316276 -57966 -341130 -132141 398950 -247756 -79142 -43833 43538
11604 -176329 446865 438719 32662 146869 11024 354222 130968 16481 -44235 -93580 148236
11592 47307 -58444 -23483 -40885 111720 -16310 -79291 174214 249721 289545 359468 146184
11580 148674 34424 354450 41484 132004 -13847 103190 -161363 -57627 7641 96638 158121
11569 158121 427682 210886 -102258 -94242 31235 201138 -47158 240850 92281 70197 67613
11558 67613 136545 93810 92261 4790 43825 -128236 64683 19166 -26596 77918 7196 254606
11546 254606 138938 206572 195677 -405863 86238 -17974 97288 -266835 18833 -61179 4893
11534D8617P8257q743J6315a8478I6321J46847E4728A4833a00116C85891F2899
11522B57874j24165A6009J96698h6809D0404M66053A09267a7470I967J33925J32671
11511B76563h0488m158D9162P9938K25270L6954H9856a42287B74986l7477O6312
11500C03821m8775A20144J80880A46181o7661c2676B63403L6741a11043A98073
11489B86864o6396O9643J04805A0207a37125E4872b2898k2294q3603B1306c3136
11477C21016A06851K25156i2538C3381a28111D8337L77759a37249C1111L44061
11467C75172j3427K2426a0211D33520A34738m1468K9223K04136g25E2384R9553
11456A51937F591J49536a04302D3022j2258b3187k44632G0552L18402j52564a16077
$$ plain form
11534 48617 126874 118131 134446 -18478 96321 243168 54728 14833 -100116 385891 62899
11522 257874 133709 16009 212707 -86809 40404 506457 109267 -17470 9967 143892 276563
11511 276563 -80488 -84646 49162 129100 354370 391324 89856 -142287 274986 237509 303821
11500 303821 255046 120144 301024 146181 78520 -32676 263403 300144 -111043 198073
11489 286864 220468 290111 394916 10207 -137125 54872 -22898 -45192 -128795 21306 -33136
11477 321016 106851 332007 -92538 33381 -128111 48337 426096 -137249 31111 375172
11467 375172 361745 384171 -10211 433520 134738 93270 122493 326629 -725 52384 151937
11456 151937 6591 156127 -104302 43022 30764 -23187 -267819 70552 388954 236390 -116077
11444I1587K53038G937M1174J53752j0047b67528H9191b11901B41642G9631J60420
11433B40051A10946J88326A05820J7570J2748l6437l1397a71547A52670p0280
11423H2390g3119D2343i9294b9276e576j54773D26828F4894Q532o364d5167C52814
11410E16759a76686A11475f0408j64011A45276l2394J2921K84634A8433J8631
11400C7064c82860B15014m3221G1680J70782E1142J33772G4513a21346H280b1077
11388A03499M9422e0390B7363m525e7075r9834B0069e8970H9015i592A2335f0028
11375A94039b04056C36236a41279O570Q974e6714A39750b2841q8479A06724f3029
11363d9323k66451a09293j57087H5050e4774D04878f2447A16022i9542j42153
$$ plain form
11444 91587 344625 7937 49111 202863 192816 -267528 89191 -211901 241642 79631 240051
11433 240051 110946 299272 105820 123390 136138 99701 68304 -171547 152670 82390
11423 82390 -73119 42343 -99294 -29276 -5576 -160349 426828 64894 73426 67062 -45167 352814
11410 516759 -176686 111475 -60408 -224419 145276 112882 125803 410437 18433 37064
11400 37064 -382860 215014 171793 71680 242462 51142 184914 74513 -121346 8280 -21077
11388 103499 152921 -50390 27363 22838 -57075 -156909 20069 -58970 89015 -9592 12335 -60028
11375 194039 -204056 336236 -141279 -134709 -125735 -56714 139750 -22841 -111320 106724 -63029
11363 -49323 -315774 -109293 -266380 85050 -54774 404878 -62447 116022 -99542 -241695
11353b41695C00986a50392G2588b67174J6565E8159P481K40982o6083f9590j11049
11342a80639A28692E5490M528P4675O0822b85746D7501b61031A71331c45470A97044
11330b29900F5846a54080j00333o4882e5592A25622a48585A77492E4946A5287
11319C98095a19275B3625J23429k9274n4992b59740j00540H3940b72574h0569
11308B77219r9384a39810A7983a68583k12130I3145i6317b6524p9379A19399b7315
11296b13652i5457F1083d26001F442b0005B61131I8693B2238m767a86942d7281
11284a63755m4491B51336a03179G6321P7964F8960h0183m7625B40306I4095f10
11272D4262b32473D4037g0758k82454B1765c00063B4909a3595j86494r3902j15399
$$ plain form
11353 -241695 300986 -150392 72588 -267174 -250609 58159 65640 306622 240539 -69590 -180639
11342 -180639 128692 55490 60018 134693 195515 -285746 47501 -261031 171331 -345470 197044
11330 -229900 65846 -154080 -254413 -319295 -55592 125622 -148585 177492 54946 15287
11319 398095 -119275 23625 147054 117780 62788 -259740 -360280 83940 -272574 -80569
11308 277219 177835 -139810 17983 -168583 -380713 93145 -96317 -26524 -105903 119399 -27315
11296 -213652 -95457 61083 -426001 6442 -20005 261131 98693 22238 17471 -186942 -47281
11284 -163755 -208246 251336 -103179 76321 154285 68960 -80183 -127808 240306 94095 -610
11272 44262 -232473 44037 -70758 -353212 21765 -300063 24909 -13595 -200089 -293991 -409390
11261d09390g449k35401i3089D5851O8776N3345a80465A04342a06705A7947c15063
11249a6299C18423r3941J22268r7990c82772I828J4475C017e4110A11341A8945
11237e1558A3487b69909b7561k0095j87166J338F4742h2267C40749I0025b71739
11225a5845n896o9143J6317B53964g7297B08841c56409J15804H178c1035k09302
11214b40337C07540A04101f2108n6043C98218B9442P5473b63684D3314J89798
11204B33112a02962i804j40461q5133e5032l5896E4194b44655j6432J01748k33785
11193c93124E9961M9034r711a6033o6737j29372l8836H2611a81437C6252c3979
11181e885H4749c46761A11641g6362o5651j5681A15719e7143A92273J3281B8767
$$ plain form
11261 -409390 -7449 -242850 -93089 45851 114627 167972 -180465 104342 -106705 17947 -315063
11249 -16299 318423 224482 346750 248760 -382772 9828 24303 3017 -54110 111341 18945
11237 -51558 13487 -269909 -27561 -47656 -234822 -233484 64742 -82267 340749 90025 -271739
11225 -15845 -21741 -90884 -74567 253964 -77297 208841 -356409 -240605 8178 -31035 -240337
11214 -240337 307540 104101 -62108 -118151 398218 29442 104915 -263684 43314 233112
11204 233112 -102962 -9804 -150265 -235398 -55032 -90928 54194 -244655 -261087 -159339 -393124
11193 -393124 59961 108995 99284 -16033 -82770 -212142 -250978 82611 -181437 36252 -33979
11181 -5885 84749 -346761 111641 -76362 -142013 -157694 115719 -57143 192273 205554 28767
11169i4761A31875a32608f5974j07803A69447H2335I633b70428a11242A76978
11158c9882p9132N900j4576C66826a46228c6289C00924d3698j21617m2901i2711
11146b64241C7254d1805F9204a89280D4720P0625f8370e112C33014A35207f737
11134D3097L56749A50986m4095g8082j83386d4963C69979I2045j9253a01725b8937
11122B3795e6253k40747a22104B48609n1379N9259b74510H4974j5803R0346m5278
11111A14239i8549R889A48221O1176a10399C7597N7110J67131D0973J14613a83606
11099C22993A8479M16914a16701A17651J38013F4370a89277H136J00746P1836
11089A80718l6875Q1176J10567j52836a0923B73433m7780k2786J10637a65125
$$ plain form
11169 -94761 131875 -132608 -65974 -173777 169447 82335 9633 -270428 -111242 176978
11158 -39882 -119014 -113114 -127690 366826 -146228 -36289 300924 -43698 -165315 -208216 -92711
11146 -264241 37254 -41805 69204 -189280 44720 115345 -68370 -5112 333014 135207 -6737
11134 43097 399846 150986 106891 -78082 -261468 -44963 369979 92045 72792 -101725 -28937
11122 23795 -56253 -297000 -122104 248609 197230 256489 -274510 84974 69171 159517 114239
11111 114239 -98549 -88660 148221 209397 -110399 37597 94707 261838 40973 155586 -183606
11099 322993 18479 435393 -116701 117651 255664 64370 -189277 8136 108882 180718
11089 180718 143843 225019 335586 182750 -10923 273433 225653 202867 313504 -165125
11078C76031o8711h1519E88638j46175q4954M4832D8576L9460L29371D3615M68692
11067E12307B41226J03148m5431N59567A69551L14100J18917J09951k92129q9886
11057C30504L63458M764k32105m7430M25333q8146m4915k67306L91824l24157
11047E11824J89597P7585k30259K98215l54638K34507l46959M59584j96288j61555
11037D81613K37576J96155k82235k11347J86321k4862k128k12279M32510j83703
11027F17621K46872r0975l9693j71559j82761L42035J72672l79335L0778j92364
11017C53291K1663L77945l19997Q4762J7940j90354K69388M5168k25115L1467
11007D66158o3773K09069M363O5542R1797R9815A41244L65564B43161K82181J21631
$$ plain form
11078 376031 307320 -81519 588638 442463 357509 402341 48576 88036 417407 43615 512307
11067 512307 241226 344374 298943 858510 169551 483651 602568 712519 420390 330504
11057 330504 693962 698726 466621 419191 844524 756378 711463 444157 835981 511824
11047 511824 701421 779006 548747 846962 492324 726831 379872 839456 643168 481613
11037 481613 719189 915344 633109 421762 608083 583221 581093 368814 801324 617621
11027 617621 864493 773518 733825 562266 379505 721540 894212 514877 545655 353291
11017 353291 374954 752899 432902 517664 535604 345250 614638 659806 434691 466158
11007 466158 402385 611454 615817 681359 773156 872971 141244 506808 243161 525342 646973
10996F46973K49678k23406L36149m60763Q247M15315j05290j41214j28597J27453
10986G24545j75900L98642N1521k8859O2382J20182M0542L27801k22592J92093
10976A490357R9483J39276J95295L78961K86831J60887j34501k05166J30075k25271
10966B316227l07426r3362l06768O6655j63877N8679N16130k94644J35937J01024
10956B028575j2408r3708J97567p53886j49649r9680l1253l21040K40651l74712
10946F30457R6450q3501k19602A39243F6561j701L5106J04916R5663J57732A29849
10934b6658I3701a50495C11415d2220k26535A37390a66445d8166A4498e6824r9573
10923a56397f3017a9572B07962a92131H5517b20550A28261m9686P4212a76012
$$ plain form
10996 646973 896651 673245 1009394 548631 556878 972193 866903 725689 597092 724545
10986 724545 548645 947287 998808 969949 1032331 1152513 1193055 1520856 1298264 1490357
10976 1490357 1589840 1729116 1924411 2303372 2590203 2751090 2616589 2411423 2541498 2316227
10966 2316227 2008801 1915439 1608671 1675326 1511449 1570128 2086258 1791614 1927551 2028575
10956 2028575 2016167 1922459 2120026 1366140 1216491 1116811 1085558 764518 1005169 630457
10946 630457 726907 643406 423804 139243 66561 64860 99966 204882 300545 458277 129849
10934 -26658 93701 -150495 311415 -42220 -268755 137390 -166445 -48166 14498 -56824 -156397
10923 -156397 -63017 -19572 207962 -192131 85517 -220550 128261 78575 152787 -176012
10912a17070p3907K9254K4769A67930i990j86816D2665K29765G0392e1032A65726
10900c01473D7689J50986r6024b05297b8577A35796J07235J6236a36903N2115
10890h4788C4596A3328g0848G9368a70042P4109B24443c1298k9533q5872L9319
10879a07384A48571d3981o1447q8145A18922a79591d0766G172O6461a84116B42920
10867c09634e092j18915B62572A2221J06625a13691N4694m4135m7184J0511B59806
10855A39064D3223b33997B1030b53971A39283J38052p6575a09210m45951i666
10844c07743a46261j11610A19608a72184f5064r2320g3374F3943a29296N027c1005
10832F1848j9547a20278A700b9085B42564c756l79705b6684k06806e5440m9891
$$ plain form
10912 -117070 -190977 -161723 -136954 167930 -9990 -196806 42665 272430 70392 -51032 165726
10900 -301473 47689 198675 102651 -205297 -28577 135796 243031 259267 -136903 -84788
10890 -84788 34596 13328 -70848 79368 -170042 -95933 224443 -31298 -60831 -146703 -107384
10879 -107384 148571 -43981 -105428 -193573 118922 -179591 -40766 7172 73633 -184116 242920
10867 -309634 -5092 -124007 262572 12221 118846 -113691 -58997 -103132 -150316 -139805 259806
10855 139064 43223 -233997 21030 -253971 139283 277335 200760 -109210 -555161 -9666
10844 -307743 -146261 -257871 119608 -172184 -65064 -157384 -73374 63943 -129296 -124269 -31005
10832 61848 42301 -120278 1700 -29085 242564 -3756 -383461 -26684 -233490 -55440 -105331
10821a05331p6593o8671R7091A19514B6256c81150e0387j85348C5427K43886A8599
10809G2511c2132H6663k3215e9926j45815R1755j30635B1496J4252f6604e288
10797C03996e8359B402K52686m8017g4312p7847C28914a99949i7551h608j55935
10786a64543e0722J2691j56601K1643c343k29677l0374k65910a08449n057n9300
10775a72806C79168e1701n7891j67951E5051J550A1924a82864F0535J53134B0012
10763b46931C25988a33840B01923b27964c1475A3448b28867C9994A3907R4311
10753A08218J44070j23739E4501K57081E9263a74623A1662b09981A02774A5481
10742a74453g9032d339j25438g313j27334A74518n6022g6175j50594A39195K0921
$$ plain form
10821 -105331 -181924 -250595 -153504 119514 26256 -381150 -50387 -235735 35427 279313 18599
10809 72511 -32132 86663 63448 -59926 -205741 -113986 -244621 21496 35748 -66604 -5288
10797 303996 -58359 2402 255088 207071 -74312 -152159 328914 -199949 -97551 -8608 -164543
10786 -164543 -50722 -38031 -194632 -172989 -3343 -233020 -263394 -529304 -108449 -113506 -172806
10775 -172806 379168 -51701 -109592 -277543 55051 56601 11924 -182864 60535 213669 20012
10763 -246931 325988 -133840 201923 -227964 -31475 13448 -228867 39994 13907 108218
10753 108218 252288 128549 54501 311582 59263 -174623 11662 -209981 102774 15481
10742 -174453 -79032 -4339 -129777 -7313 -134647 174518 118496 -76175 -226769 139195 160116
10731A60116b03979c0211k5418A19874b06441C45694f079C4751K84573c24777
10720a23426A26952a49130f7336j37555J0652F1677c3510k7923K5410j78656P3111
10709a41568E5315c2621l40922F876h7542A07460b34008A82915b59617a28621
10698d0691E9921a74A26960b00395j71466A31477a0033F5419b60947r3629g1637
10686G0296i8890j2546j4885B51464a27172B09462G7436A612J00575c5246B31764
10674b5264H1204a40654M2227A58302a32723A62689B493d9173A76826b42828G2872
10662b7661n1746j5687B1269b80166d685n7238D553c29486e5187f25m5881o1862
10650a08368k28497a67081a1670j58925G0648a12631o4337A31326n0761K60357
$$ plain form
10731 160116 -203979 -30211 -55629 119874 -206441 345694 -6079 34751 319324 -324777
10720 -123426 126952 -149130 -67336 -204891 -194239 61677 -33510 -61433 -36023 -214679 -141568
10709 -141568 55315 -32621 -373543 6876 -87542 107460 -234008 182915 -259617 -128621
10698 -40691 59921 -174 126960 -200395 -371861 131477 -10033 65419 -260947 -354576 -71637
10686 70296 -98890 -111436 -126321 251464 -127172 209462 77436 1612 102187 -35246 231764
10674 -25264 81204 -140654 -98427 158302 -132723 162689 2493 -49173 176826 -242828 72872
10662 -27661 -79407 -95094 21269 -280166 -4685 -61923 4553 -329486 -55187 -625 -46506 -108368
10650 -108368 -336865 -167081 -11670 -170595 70648 -112631 -176968 131326 80565 340922
10640C40922h5327B761K70160j19072r677e1195j10129C3948J6436Q0290e3497
10628A26048b3805j48672B95918d19156i3610G3915f8018C10666b01379B40348
10617E0781a41593j3676D3575a50403j35127b3821d460k01532f7607b4904B47613
10605b50899A05339c30021g7660k21454a33976n741k17539a24379j64562a42053
10594b42824J07905p5414d6409l68879A15256k6290b56127n7642A59201J76984
10584C36185E5839d6877k76620J47017A21626a5840G234a82326A32383b39285
10573a46837b0249A47160C5282K17401a30652A0044a3903k28782D5442a91346
10562G7164N0514a37683j54369h3226F0323a01091D3264L9276J05389q732h7612
$$ plain form
10640 340922 -85327 2761 272921 153849 144172 -51195 -161324 33948 50384 130674 -53497
10628 126048 -23805 -172477 295918 -419156 -93610 73915 -68018 310666 -201379 240348
10617 50781 -141593 -155269 43575 -150403 -285530 -23821 -4460 -205992 -67607 -24904 247613
10605 -250899 105339 -330021 -77660 -299114 -133976 -139717 -357256 -124379 -288941 -142053
10594 -242824 -134919 -210333 -46409 -415288 115256 88966 -256127 -313769 159201 336185
10584 336185 55839 -46877 -323497 -176480 121626 -15840 7234 -182326 132383 -239285
10573 -146837 -20249 147160 35282 252683 -130652 10044 -13903 -242685 45442 -191346
10562 77164 127678 -137683 -292052 -83226 60323 -101091 43264 82540 187929 179197 -87612
10550F8037b23985A9244O0892g8584k81453D013L2222b51363J08596N6138m2298
10539a28927D00904a27588K7409j15421B8631J44041b29811A95766H0903k2644
10529E8259d0286A97332f787k40297J21014j07315A349J31219J0264b2214C9738
10517f5482C67625a05935r8349B71407k1863j10014a77212A28946a07233B0840
10506c24295h9021A11356k4870a66303p52j02345B1605b7912j69274o6572R8161
10495a65597G9591g2877L1798B26570I5989c06172b556j78865K5970k6900A92477
10483a50395d0535A56186K56968M8676J96753k00118k8782j20714J44096a75747
10472A31399i1683m4257a6472D6597b21384J06807I6645m5376K33298b26892P8817
$$ plain form
10550 68037 -223985 19244 80136 -78584 -360037 4013 36235 -251363 -142767 -86629 -128927
10539 -128927 400904 -127588 -100179 -215600 28631 172672 -229811 195766 80903 58259
10529 58259 -40286 197332 -6787 -247084 -126070 -233385 1349 132568 142832 -22214 39738
10517 -65482 367625 -105935 -204284 271407 249544 139530 -177212 128946 -107233 20840
10506 -324295 -89021 111356 86486 -166303 -167055 -269400 21605 -27912 -197186 -263758 -165597
10495 -165597 79591 -72877 -41079 226570 95989 -306172 -2556 -181421 -155451 -182351 192477
10483 -150395 -40535 156186 413154 461830 658583 458465 429683 308969 453065 -175747
10472 131399 -91683 -135940 -16472 46597 -221384 -114577 96645 51269 284567 -226892 -148075
10461a48075C4275K7198K0584J57525g0245j37899A74736b55701F6482A5844g1062
10449a83016A35736D4300i1408b2632o988k09503H8137b22493A89390C1646h1834
10437e8861a7874k45362J12680f2505p5934f9113a1720p6363A89492D6480b88718
10425f420n6932j88671E492L2877K08451D5270b88551C54981A23066j1734L5077
10414A46409n8264a7346r62k10847e6092k07716j34802b8274o4356C41181B8126
10402A06818i1483A15167E2988g8606H8897L010k0299J11465q9999f6066b514
10390D0560c57846B0979b35821C0566d5232l9419C2143c9584A99647j0757l821
10379A85069J98800j79070J35039A23359D6396J62627k9985K02432R9939j48720
$$ plain form
10461 -148075 34275 61473 82057 239582 -70245 -208144 174736 -255701 66482 15844 -71062
10449 -183016 135736 44300 -91408 -22632 -29620 -239123 88137 -222493 189390 31646 -81834
10437 -58861 -17874 -263236 -150556 -62505 -138439 -69113 -11720 -88083 189492 46480 -288718
10425 -6420 -63352 -252023 5492 38369 246820 45270 -288551 354981 123066 111332 146409
10414 146409 88145 -17346 -18308 -229155 -56092 -263808 -398610 -28274 -92630 341181 28126
10402 106818 -91483 115167 52988 -78606 88897 91907 71608 183073 93074 -66066 -2514
10390 40560 -357846 20979 -235821 30566 -45232 -84651 32143 -39584 199647 188890 185069
10379 185069 383869 204799 339838 123359 46396 209023 179038 381470 481409 332689
10369C32689J07927k08756m9557L1115J24786J66380B3861L47998j51549J45333
10359C65643K26739H6921K47429J36946j61008A39955K70357j96639a365E62904
10348G43602k53279j97366L1151p4947M44194j50122k31608K96865A81149H3769
10337B55566q2321J31703j16898G1650O6356a55383C77090g2450G9394J09693
10327A89087q7372a9429k5695H5835J08776E2087L54188a9081B35171l3134K54445
10316D56482B23518H6310a8529B39370D389a00674l25352J76370A2808M2778a14589
10304A02429J68139N0845g4006q314k00181a28861F9240j5876K83494C4489j5797
10293A8692J64741n8514h1186o9774j39205a38363d5653A32397b00742b163q5285
$$ plain form
10369 332689 440616 231860 182303 213418 338204 504584 23861 371859 220310 365643
10359 365643 592382 86921 334350 471296 310288 139955 410312 213673 -1365 562904
10348 743602 490323 292957 324108 249161 693355 543233 311625 608490 181149 83769
10337 255566 173245 304948 188050 71650 138006 -155383 377090 -72450 79394 189087
10327 189087 101715 -19429 -45124 85835 194611 52087 406275 -19081 235171 202037 456482
10316 456482 223518 86310 -18529 239370 4389 -100674 -426026 -249656 12808 55586 -114589
10304 102429 270568 321413 -74006 -82320 -282501 -128861 69240 53364 336858 34489 18692
10293 18692 183433 124919 -81186 -150960 -290165 -138363 -45653 132397 -200742 -2163 -87448
10282h7448B16302a04436j08368a0875A48144d0865j01450k1587I4735d4205a2066
10270H51R5365b95541J06682d2029k8612n3500C45389E7102K4545l0776L34933
10259C85804j59171a9859C35609m3986O0899f3378A08226b7856D1352Q97c8859
10247f6060B33987b07786A59230b62184m6346A374b4853p6248k31853F68274A96067
10235a99345d2047C5178d8914F1959J46990i3190j49310I2300J01336a54172B09248
10223b3279j52973j4931Q1708K2307G6291b06985L1852k0458A08957h3747K7088
10212e6659B4001f6634D73463d1596h660A384d856A64074b22734C2244K58605
10201B90849c0164C9329J62773d24740c4874k82193b0256k3392j61230M8371d9090
$$ plain form
10282 -87448 216302 -104436 -212804 -10875 148144 -40865 -142315 -163902 94735 -44205 -12066
10270 851 96216 -295541 -188859 -42029 -70641 -124141 345389 57102 81647 50871 385804
10259 385804 226633 -19859 335609 291623 352522 -63378 108226 -27856 41352 42249 -38859
10247 -66060 233987 -207786 159230 -262184 -308530 1374 -24853 -101101 -332954 668274 196067
10235 -199345 -42047 35178 -48914 61959 208949 -93190 -242500 92300 193636 -154172 209248
10223 -23279 -176252 -191183 -109475 -87168 76291 -206985 -175133 -195591 108957 -83747 -56659
10212 -56659 24001 -66634 473463 -41596 -8660 1384 -4856 164074 -222734 32244 290849
10201 290849 -30164 39329 202102 -424740 -34874 -317067 -20256 -43648 -204878 -156507 -49090
10189a987A06948c03208A0203c3047l49992g6916H0842g087C62437e0981k4732
10178g5713E1633a34095O1792C12151a69295F2201a70850o1112a765A37007a31510
10166a39178k0229j27844B36778L3823B4496c84945A99198c33616A93867A4705
10155c0241o4510a6234j92627A00336R609b62237a06460A6330h4608c4933C13390
10143a44915F3182L1105a92067f834k8116C4274B673R7332a85772O0471k8396
10132a53697m62422A83635g3580K0112J3319k14705A0158b28918C5772J44185
10122A79957b52444R5670A2855a48136N1566c2254k00953a1017n8187F4841b2155
10110A85250b89010B26194n8487J05755C7374a46012d6510k08539J11043J8222
$$ plain form
10189 -1987 106948 -303208 10203 -33047 -383039 -76916 80842 -7087 362437 -50981 -75713
10178 -75713 51633 -134095 -72303 312151 -169295 62201 -170850 -231962 -1765 137007 -131510
10166 -139178 -159407 -287251 236778 270601 24496 -384945 199198 -333616 193867 14705
10155 -30241 -94751 -16234 -208861 100336 109945 -262237 -106460 16330 -84608 -34933 313390
10143 -144915 63182 94287 -192067 -6834 -34950 34274 2673 100005 -185772 -125301 -153697
10132 -153697 -616119 183635 -73580 -53468 -40149 -254854 10158 -228918 35772 179957
10122 179957 -252444 -156774 12855 -148136 -96570 -32254 -233207 -11017 -69204 64841 -22155
10110 185250 -289010 226194 167707 273462 37374 -146012 -46510 -255049 -144006 -125784
10100a25784C221g6909A37344d2194i757k2271j31239L3965m20945B46054a62950
10088b29282a9608j01042K4044e908k86280A25280i6786G9239L9173a54204G4511
10076a58063C00333c12707J29676B4658J18050a71560l1070J7466A55371e8876
10065a70510j49245A93732J91199g3245A96282m5043b8901q0067a1235A92124
10054H9649M3924f64j03809M6944j23758b8967A84976h3274q6026F9633k4959
10043D4674d90835G9943a6694a319j52582j78375n7724c0367E7643d9760H5028
10031A39543R4633J40545A37251j4920O3367p6622f1451E4056b17186E070b01659
10019a19594N7311K0683n4022E9445c51514e4151K0962k95770J28376g256k7165
$$ plain form
10100 -125784 3221 -76909 137344 -42194 -9757 -32028 -163267 -129302 -550247 246054 -162950
10088 -229282 -19608 -120650 -96606 -5908 -292188 125280 -96786 79239 118412 -154204 74511
10076 -158063 300333 -312707 -183031 24658 142708 -171560 -202630 -185164 155371 -58876
10065 -170510 -319755 193732 384931 -73245 196282 151239 -28901 -108968 -11235 192124
10054 89649 133573 -664 -104473 -57529 -181287 -28967 184976 -83274 -169300 69633 44674
10043 44674 -490835 79943 -16694 -1319 -153901 -332276 -390000 -30367 57643 -49760 85028
10031 139543 234176 374721 137251 122331 185698 109076 -61451 54056 -217186 5070 -201659
10019 -119594 -62283 -41600 -95622 59445 -351514 -54151 -33189 -328959 -200583 -7256 -34421
10008c4421A49907E3719b7588q8627l1051j2530G6088b58795J05081q7544A14549
9996H3451c31370R5187O2757M4666j54220A31657i3250n9741j21952a27941b8437
9984a51878F173K11709F4506J673b50531A22582b40771C2860c6979A40398i9544
9972h8249j49155d4863j76378o7805K8334C5361i4124F3029a82937A39800a35811
9960c09641A42273M5075f3179A7329J62292b36072k76778C0307a78166g4157A08477
9948i4276k91927g5873A22571b62234j32286J43526D511J14026n8508a809k93211
9937b95020N3274H88J85161g1751q0645B0837K5713K79285h1001j35871h8069
9925f7095j42680A76210G4356d50656h6349j99315g4018k0508j06794B2941r787
$$ plain form
10008 -34421 149907 53719 -27588 -116215 -147266 -159796 76088 -258795 -153714 -241258 114549
9996 83451 -331370 -236183 -173426 -128760 -282980 131657 -93250 -152991 -274943 -127941 -28437
9984 -151878 6173 217882 64506 66179 -250531 122582 -240771 32860 -36979 140398 -99544
9972 -88249 -237404 -44863 -221241 -289046 -260712 35361 -94124 63029 -182937 139800 -135811
9960 -309641 142273 187348 -63179 17329 179621 -236072 -512850 30307 -178166 -74157 108477
9948 -94276 -386203 -75873 122571 -262234 -394520 -250994 4511 118537 60029 -1809 -295020
9937 -295020 -241746 888 186049 -71751 -152396 20837 46550 325835 -81001 -216872 -88069
9925 -67095 -209775 176210 74356 -450656 -86349 -285664 -74018 -94526 -201320 22941 13154
9914A3154R0454K6713f1676A28487L9526K498a53437k63778a72326n1060C1011
9902d3793k5666E0534K3193A1518a85728l4637E9534M7184h9188C7684c93362
9890B2848g3070B91700b81292a22074k61222a30173C08073I8974g1949k18976
9880b90925f6477C8800c24524A28285a9157o3365B6491a78039B9327f0006H4114
9868c0831A37296b35304A7747O1114a43265j50394A8502c40453B81096A37485
9857d541k37001C32563b31302m4234A27045l8553b56244c7157B80663a52153A76926
9845B7702J59106G8504b46095C0904P4287B3934a01553E3817d915E7439h6365
9833b78200C1106c812A84918P0327F3634J76476C1109J31350b18153Q9308B0212
$$ plain form
9914 13154 103608 130321 -61676 128487 168013 170511 -153437 -417215 -172326 -223386 31011
9902 -43793 -69459 50534 73727 11518 -185728 -220365 59534 106718 -89188 37684 -393362
9890 22848 -73070 291700 -281292 -122074 -383296 -130173 308073 98974 -71949 -290925
9880 -290925 -66477 38800 -324524 128285 -19157 -82522 26491 -178039 29327 -60006 84114
9868 -30831 137296 -235304 17747 78861 -143265 -293659 18502 -340453 281096 137485
9857 -4541 -241542 332563 -231302 -275536 127045 88492 -256244 -37157 280663 -152153 176926
9845 27702 186808 78504 -246095 30904 105191 23934 -101553 53817 -4915 57439 -86365
9833 -278200 31106 -3812 184918 255245 63634 240110 31109 162459 -218153 -128845 20212
9821f6241B37901m0644B6971d12184J61406f7082A35485a63945r4253A10282c33298
9809B57873b56146O6629J1114H5384b19711P741e1432E2205b44595D1600J09434
9798A51034a71053G7775E019b05811c0727l1962o5384B99335j12485p1989E4006
9786b27993k3669P3311J2655d2052m2244H1033c60663A62281D8463e7686m8115
9775a05801c3141j45290g7842P331B17814h0260b7524k33824L3392M6061B55507
9763b40873A46350j4240J17874c69549h504j05273m655k13381E7624c91903H2676
9751f2296E0871b48702d7444k30821g5044a0003l1690C3086J02871d3401A3935
9739a6166k50316A25335b64336b620I9029a40254A01330c08500i8022B679J53808
$$ plain form
9821 -66241 237901 197257 26971 -412184 -250778 -67082 135485 -163945 -258198 110282 -333298
9809 257873 -256146 -189517 -178403 85384 -219711 -211970 -51432 52205 -244595 41600 151034
9798 151034 -171053 77775 5019 -205811 -30727 -62689 -128073 299335 186850 114861 54006
9786 -227993 -251662 -178351 -165696 -42052 -84296 81033 -360663 162281 48463 -57686 -105801
9775 -105801 -33141 -178431 -77842 -70511 217814 -80260 -27524 -261348 -227956 -181895 255507
9763 -240873 146350 132110 249984 -369549 -8504 -113777 -118432 -331813 57624 -391903 82676
9751 -62296 50871 -248702 -47444 -278265 -75044 -10003 -41693 33086 135957 -43401 13935
9739 -16166 -266482 125335 -264336 -2620 99029 -140254 101330 -308500 -98022 2679 156487
9728A56487E8935R2613c24130L5089J6488a26036B02686i7027A84121B9698a40607
9716a51631O1473A04998a07331A3224Q369R937a12430A48691c32301a9934r3431
9705a13365j29621A29466g9102l25191F7154h7838j38724r8816f6206F0220a49398
9693A00392m0865d3240J1203B8937b27986A37943l312a97754D1618a45312A01937
9681A84967f3783j00159A85891p0179d81696c4078j14926o954j74227Q6889c8272
9669i8529p492A14596a94859A48610a48424a1761k42639e6657A70214C4834g2585
9657E4854P8929O2959I3822b29688I7714D976Q6171a70197M6899b6768D6451c78929
9644b45733g2969j80308A41542C8372d5250E8689M6354i3250o5059F3662A7228
$$ plain form
9728 156487 58935 151548 -324130 -289041 -272553 -126036 202686 -97027 184121 29698 -140607
9716 -151631 -90158 104998 -107331 13224 21593 31530 -112430 148691 -332301 -19934 -113365
9705 -113365 -242986 129466 -79102 -404293 67154 -87838 -226562 -325378 -66206 60220 -149398
9693 100392 59527 -43240 -32037 28937 -227986 137943 134631 -197754 41618 -145312 101937
9681 184967 -63783 -163942 185891 115712 -481696 -34078 -149004 -155958 -330185 -243296 -38272
9669 -98529 -106021 114596 -194859 148610 -148424 -11761 -254400 -56657 170214 34834 -72585
9657 54854 133783 196742 93822 -229688 97714 4976 91147 -170197 -123298 -26768 46451 -378929
9644 -245733 -72969 -253277 141542 38372 -45250 58689 105043 -93250 -158309 63662 17228
9632B18090H5068b65086j08694B35503m3408A5974J92444m0821J9836F1488J1938
9621G3426K04248r8564E9378e688l67137J47993B78861f133l85624C6116a15681
9609b90146a35474M1086l03448J96240Q2229j10187a04206l28554P4887j03832
9599d61705g2137A82099o2109c3774A0550b40419b9078C71210a04585k9529f1364
9587b8565n8305A68080a78862d4371j38272B56404B7566b15064K3793e446l15536
9576c20982a6742j69729e1228b374A41906B3115a92888N2789M4225A30279e4940
9564a01610m8352E8104R7437d09386a74052J9910B3535N4321b50597A18640l5346
9553H3294a16020D06174D7875b97622A60358D4207b5775k66930a00110A93230
$$ plain form
9632 218090 85068 -265086 -373780 235503 192095 15974 208418 167597 187433 61488 73426
9621 73426 277674 179110 59378 -5688 -372825 -224832 278861 -6133 -391757 36116 -115681
9609 -290146 -135474 -94388 -397836 -201596 -119367 -229554 -104206 -432760 -357873 -461705
9599 -461705 -72137 182099 119990 -33774 10550 -240419 -29078 371210 -104585 -134114 -61364
9587 -28565 -86870 168080 -178862 -44371 -182643 256404 27566 -215064 -191271 -5446 -320982
9576 -320982 -16742 -186471 -51228 -2374 141906 23115 -192888 -140099 -95874 130279 -54940
9564 -101610 -149962 58104 155541 -409386 -174052 -154142 23535 77856 -250597 118640 83294
9553 83294 -116020 406174 47875 -297622 160358 44207 -25775 -292705 -100110 193230
9542i269I7048e4193C4836d5623F3667a96221i1654A72970b97852G9101a01024
9530a06053l07812q1225b06601I7317o300K555K7664a6925j13858A76138M0667
9519B16805l0342n7718a18825b4736Q262j31604E754e96155a44443k9771O3540
9508a10674l5264G1196a94171g5940L5939m114m5455A67527C5939K72348e2547
9496d16091a8122m9221G1772c31309b0455D4151d4012B77381a53211C55093j19331
9485B35762d5532A91525h4596r7361j04587A27789l5975g1352A17269i4227D8417
9473A2130a63153j34726O9414A11096a58913j49706a27579b3201r1853M1055a4729
9461c24920D2571a17981A36006E9278M4993b28967Q359A81707a69348L2357c2833
$$ plain form
9542 -9269 97048 -54193 34836 -45623 63667 -196221 -91654 172970 -297852 79101 -101024
9530 -106053 -413865 -495090 -206601 97317 91017 93572 121236 -16925 -130783 176138 216805
9519 216805 186463 128745 -118825 -24736 -16474 -148078 5754 -596155 -144443 -174214 -110674
9508 -110674 -145938 71196 -194171 -75940 -40001 -44115 -89570 167527 35939 308287 -52547
9496 -416091 -18122 -67343 71772 -331309 -20455 44151 -44012 277381 -153211 355093 235762
9485 235762 -45532 191525 -84596 -181957 -286544 127789 91814 -71352 117269 -94227 48417
9473 12130 -163153 -297879 -228465 111096 -158913 -308619 -127579 -23201 -115054 -73999 -14729
9461 -324920 42571 -117981 136006 59278 104271 -228967 -220608 181707 -169348 -136991 -32833
9449a31106O1168I008K18400A05342i6518j32826g9006k10200P4796P1864C4179
9437b17161C4529c48998k52304E2074a97682A05375i9491k331m454A02360l0489
9426G1871J20764a30061j55094i3264A22442b77152J15792M2229F6694b35514
9415A54734b50814i0900I938J24773d1400k87804h570B02626h0877r4026E9833
9403D9360a31019f4885G2779c42652J70217A74b19646e4315B5472e2018l60607
9392d12625J77460l8547I333L01518a99146j14341A09663i518j9778C437L2839
9381C6276J00724B0802b28370H8195b47733a18887B9341N3794J82816a71581d1568
9369C54841a42216B38655r8644g7055A38631g9407m9092D1056b7047E5516a3607
$$ plain form
9449 -131106 -69938 9008 227408 105342 -96518 -229344 -79006 -289206 -214410 -142546 34179
9437 -217161 34529 -348998 -601302 52074 -197682 105375 -99491 -101822 -106276 102360 71871
9426 71871 192635 -130061 -285155 -93264 122442 -277152 -161360 -119131 66694 -235514
9415 154734 -250814 -90900 9938 134711 -41400 -329204 -8570 202626 -80877 -174903 59833
9403 49360 -131019 -64885 72779 -342652 -172435 174 -219646 -54315 25472 -52018 -412625
9392 -412625 -235165 -273712 9333 310851 -199146 -313487 109663 -9518 -29296 3437 36276
9381 36276 137000 20802 -228370 88195 -247733 -118887 29341 83135 265951 -171581 -41568
9369 354841 -142216 238655 140011 -77055 138631 -79407 -128499 41056 -27047 55516 -13607
9357A90386a88413C87656I9965a08069k9731e3969j94654A02251d8268j17784
9347a66052J8218C0687n192A1890J4124a43711B35177f8845K4929o7626J3664
9336i7878a8930o3519c5496j97495A00141E582M4971J84027A2540c17446i4303
9324A11990a93901j36395a64635d2842j28443d5684o6304r0095A00871R4908e139
9312E2087b4166k57537H1908O0167a99566j0653d7150r1588m4530A06974h1774
9300B32834i5443j59301g4933k1821r9927p6204J35460M9209j35381O4142m4785
9289b04240A35591R2156q9893h7428E8962b87773A83090c57483E8890J04394f1974
9277E7967a9770p3234A10848a92148b4287j21943R181A24565a80058g9136k09752
$$ plain form
9357 190386 -188413 387656 99965 -108069 -137800 -53969 -248623 102251 -48268 -166052
9347 -166052 -147834 30687 25495 11890 26014 -143711 235177 -68845 -43916 -111542 -97878
9336 -97878 -18930 -82449 -35496 -232991 100141 5582 50553 234580 12540 -317446 -94303
9324 111990 -193901 -330296 -164635 -42842 -171285 -45684 -111988 -202083 100871 195779 -5139
9312 52087 -24166 -281703 81908 142075 -199566 -210219 -47150 -138738 -183268 106974 -81774
9300 232834 -95443 -254744 -74933 -96754 -196681 -272885 -137425 -88216 -223597 -159455 -204240
9289 -204240 135591 227747 137854 -87428 58962 -287773 183090 -357483 58890 163284 -61974
9277 57967 -19770 -93004 110848 -192148 -24287 -146230 -137049 124565 -180058 -79136 -288888
9266b88888h3894A12850M4694m1459K5772A5317d1116F5530d127j45527K8794
9255a20860q1834M8274b1684B41932a9723A34636a31197A53975o9689a21522k6037
9244a47559A09623a43507A16352K16466A2793K2813i0422E4852h1158j07215A9868
9232d7094A4115e218D648J59866J2139b40282n8497c0502j5385l0697j78156e4693
9219c40701j49028K18620h7845j45952h6393k10560G7072N0897p436a04882k03941
9208c08823J13000E1605q394a36544L3757B79408h3149j57838A23295g7770j25165
9197b02935C51154a4192I7920d80030a90743A24494n4450i8490d3192A25603e353
9185i8767A341a27541I6127c53008F5843F000Q9959B4831b45544A15945B4676
$$ plain form
9266 -288888 -83894 112850 157544 116085 141857 15317 -41116 65530 -4127 -149654 -120860
9255 -120860 -202694 -154420 -21684 241932 -19723 134636 -131197 153975 84286 -121522 -147559
9244 -147559 109623 -143507 116352 332818 12793 35606 -90422 54852 -81158 -188373 19868
9232 -47094 14115 -5218 4648 164514 176653 -240282 -298779 -30502 -45887 -76584 -254740 -54693
9219 -340701 -489729 -271109 -87845 -233797 -86393 -296953 77072 127969 120533 -104882 -308823
9208 -308823 -195823 51605 43211 -136544 -102787 279408 -83149 -240987 123295 -77770 -202935
9197 -202935 351154 -14192 97920 -480030 -190743 124494 70044 -98490 -43192 125603 -5353
9185 -98767 1341 -127541 96127 -353008 65843 6000 95959 24831 -245544 115945 24676
9173a75402A850b50744A8649a60303c7176E1377f3318a2687B01115o4863b53135
9161a49888B66843b5675j8720A07674b66881a17653B90951d844j1624l8681A83599
9149D2079J37021d2280l85097F8568c63875J04738h7427n6981J0599e1139j45629
9138a96768C37597H8529l2486c35908m5789e6066j04668M044L3514m27532a75867
9126a48694G8366C793i2271J4085A15164b35482H3639a82923m4525e1546j0482
9115f2028G6624a641k9731k296n98B75810a68723j6442e1456A92623a82116b7079
9102a87206o3588j91324J69488E2660a01309j01756A99889l3861a73722j62359
9092c36081D9185M2662J86803j11423b01733D7371a79588Q3592j08762H4153a30307
$$ plain form
9173 -175402 1850 -250744 18649 -160303 -37176 51377 -63318 -12687 201115 136252 -253135
9161 -149888 266843 -25675 -44395 107674 -266881 -117653 290951 -4844 -16468 -55149 183599
9149 42079 179100 -42280 -427377 68568 -363875 -259137 -87427 -144408 -133809 -51139 -196768
9138 -196768 337597 88529 56043 -335908 -381697 -56066 -160734 -156690 -123176 -550708 -175867
9126 -148694 78366 3793 -92271 -78186 115164 -235482 83639 -182923 -227448 -51546 -62028
9115 -62028 76624 -1641 -31372 -33668 -34266 275810 -168723 -185165 -51456 192623 -182116 -27079
9102 -187206 -250794 -442118 -272630 52660 -101309 -203065 199889 166028 -173722 -336081
9092 -336081 49185 91847 278650 167227 -201733 47371 -179588 -95996 -204758 84153 -130307
9080g6675a1221m9271F0398b7055M304j76232N4974q52L4957o1176f5651k70736
9068c36387J07945i9170a2922A08755D6374K34327A7380K2095d3029j2619r6120
9057a51768P5011k3758A89609e1554j38824H7106a67404g1645D9182L6031a94377
9045b47006A30702g550a561j25366j35111B97087b2359k86608J10931A90015m4849
9034A45166A8409K46059h2248A8551J62264g208A11333j6028a42885e4311C4259
9022a98802g3183I301b26562B27673D0790J8132a49410M1716I3913f8345E3542
9010e2424A59723d75987a07275j32718f4673I2922a36666B66983a62452A23314
8999A7109f7144N248k12985h8929c3417k55497I708J5699M7903h5779A79706o3504
$$ plain form
9080 -76675 -11221 -60492 60398 -27055 -22751 -198983 -144009 -144861 -109904 -171080 -65651 -336387
9068 -336387 -228442 -99170 -12922 108755 46374 280701 17380 39475 -43029 -55648 -151768
9057 -151768 -76757 -100515 189609 -51554 -190378 87106 -167404 -71645 49182 85213 -194377
9045 -247006 130702 -7550 -1561 -126927 -262038 297087 -22359 -308967 -198036 190015 145166
9034 145166 18409 264468 -82248 18551 180815 -7208 111333 95305 -142885 -54311 34259
9022 -198802 -73183 9301 -226562 227673 40790 58922 -149410 -107694 93913 -68345 53542
9010 -52424 159723 -475987 -107275 -239993 -64673 92922 -136666 266983 -162452 123314
8999 17109 -67144 -61896 -274881 -88929 -33417 -288914 9708 25407 73310 -85779 179706 116202
8987A16202a00295q5192B14162b04339j73210A5615i7389J776k4882J4017p3219
8976a79697e8997B11781c46624C951K59338a00574A07138c48157E9460b85037
8965b9535A52373d4509l00850A95930o9107J6026l0965C5950K59205R7883h8046
8953e6576k50313H9505B8995a29643E6323f1869j45882G7570N5477L57380b96258
8941c98511b696A38055a40168B4800P6654L30860A45477a99303A07039l9989i6478
8929A23274a53254M5874A99308i194B89050R2428J473606M300673K785722B736555
8918I60582A89091J9398r7284P2127a12383m04M4314k73267H4860m051K94371
8907C75180b4598A08104a54628a2683H2833b29338B40413a70988j4312g6842p0051
$$ plain form
8987 116202 -100295 -185487 214162 -204339 -377549 15615 -97389 -95613 -120495 -106478 -179697
8976 -179697 -58997 211781 -346624 3951 263289 -100574 107138 -348157 59460 -285037
8965 -29535 152373 -44509 -345359 195930 126823 142849 111884 35950 295155 393038 -88046
8953 -56576 -306889 89505 28995 -129643 56323 -61869 -207751 77570 133047 490427 -296258
8941 -398511 -2696 138055 -140168 24800 101454 432314 145477 -199303 107039 67050 -96478
8929 123274 -153254 -107380 199308 -9194 289050 381478 1855084 6155757 8941479 2736555
8918 960582 189091 208489 111205 183332 -112383 -112787 -68473 -341740 84860 80809 375180
8907 375180 -24598 108104 -154628 -12683 82833 -229338 240413 -170988 -185300 -76842 -146893
8896a46893F7571l0932a29022o2366b7930A88494E0463b26343A90646I2925J3235
8885A06160k4481I257c73916J26808a13697q8737A08960f4970B09658p3824b35205
8873a12836m9923j74503C1559f6056l6534l8273k27492A57989n801b46174c7299
8861a78185l4771c684k1266k02889B472a18831c4691C39680c87784A08532a76185
8849G4142f7610C3591a30126r3976B8380K54964a88793P2507k1830G7640a99133
8837a40896D4310J30718g6832B0504g4551A48853J05812d4608A42654k7993D6565
$$ plain form
8896 -146893 67571 36639 -129022 -191388 -27930 188494 50463 -226343 190646 92925 106160
8885 106160 81679 9257 -373916 -247108 -113697 -202434 108960 -64970 209658 135834 -235205
8873 -112836 -162759 -337262 31559 -66056 -102590 -140863 -368355 157989 152188 -246174 -37299
8861 -178185 -212956 -3684 -24950 -227839 2472 -118831 -34691 339680 -387784 108532 -176185
8849 74142 -67610 33591 -130126 -224102 28380 283344 -188793 -116286 -138116 77640 -199133
8837 -140896 44310 175028 -76832 20504 -74551 148853 254665 -44608 142654 114661 46565
$$ [...]
##END NTUPLES=NMR SPECTRUM
##END=
