##TITLE=AC1653_NARAH14389_8531193_FYCxipjwgZ
##JCAMPDX= 6.0         $$ Bruker NMR JCAMP-DX V2.0
##DATA TYPE= NMR SPECTRUM
##DATA CLASS= NTUPLES
##ORIGIN= BRUKER
##OWNER= Administrator
$$ 1.72 TOPSPIN		Version 2.1
$$ 2014-03-14 14:35:11.105 -0800  Administrator@X
$$ Compression mode = diff/dup
##.OBSERVE FREQUENCY= 400.02188249412
##.OBSERVE NUCLEUS= ^1H
##.ACQUISITION MODE= SIMULTANEOUS (DQD)
##.ACQUISITION SCHEME= undefined
##.AVERAGES= 8
##.DIGITISER RES= 22
##SPECTROMETER/DATA SYSTEM= spect
##.PULSE SEQUENCE= zg30
##.SOLVENT NAME= COFFEE_meoh
##.SHIFT REFERENCE= INTERNAL, COFFEE_meoh, 1, 14.98509
##AUDIT TRAIL= $$ (NUMBER, WHEN, WHO, WHERE, PROCESS, VERSION, WHAT)
$$ ##TITLE= Audit trail, TOPSPIN		Version 2.1
$$ ##JCAMPDX= 5.01
$$ ##ORIGIN= Bruker BioSpin GmbH
$$ ##OWNER= Administrator
$$ $$ E:\/data/COFFEE/nmr/AC1653_NARAH14389_8531193_FYCxipjwgZ/10/pdata/1/auditp.txt
$$ ##AUDIT TRAIL=  $$ (NUMBER, WHEN, WHO, WHERE, PROCESS, VERSION, WHAT)
(   1,<2014-03-14 14:35:04.907 -0800>,<Administrator>,<X>,<go>,<TOPSPIN 2.1>,
      <created by zg
	started at 2014-03-14 14:33:56.722 -0800,
	POWCHK enabled, PULCHK disabled,
       configuration hash MD5:
       C8 4E 4E 5D D3 5C D8 9E 9F 52 82 E0 59 8A DE 15
       data hash MD5: 64K
       8D 75 14 2C 13 D3 C6 3F 9A 29 50 01 51 CA 25 1E>)
(   2,<2014-03-14 14:35:07.401 -0800>,<Administrator>,<X>,<proc1d>,<TOPSPIN 2.1>,
      <Start of raw data processing
       efp LB = 0 FT_mod = 6 PKNL = 1 PHC0 = 0 PHC1 = 0 SI = 32K 
       data hash MD5: 32K
       B8 E6 B6 E2 40 3D 5A 5B C2 D8 97 4E 8C 47 CB CC>)
(   3,<2014-03-14 14:35:07.695 -0800>,<Administrator>,<X>,<proc1d>,<TOPSPIN 2.1>,
      <pk PHC0 = 93.47168 PHC1 = 0 
       data hash MD5: 32K
       40 FC 04 C6 F5 E5 40 ED C0 C0 1A 6A EA ED 91 4A>)
(   4,<2014-03-14 14:35:07.802 -0800>,<Administrator>,<X>,<proc1d>,<TOPSPIN 2.1>,
      <abs ABSG = 1 
       data hash MD5: 32K
       16 48 93 68 A0 30 94 4D B8 19 FD 7F C0 05 32 7C>)
(   5,<2014-03-14 14:35:07.842 -0800>,<Administrator>,<X>,<proc1d>,<TOPSPIN 2.1>,
      <abs ABSG = 2 
       data hash MD5: 32K
       C5 E9 94 AA D2 CD 4A 9E CB 23 03 BF C0 10 99 04>)
(   6,<2014-03-14 14:35:07.909 -0800>,<Administrator>,<X>,<proc1d>,<TOPSPIN 2.1>,
      <abs ABSG = 3 
       data hash MD5: 32K
       F7 7F CF AC C1 D6 87 43 37 30 E3 88 33 71 94 AA>)
(   7,<2014-03-14 14:35:07.949 -0800>,<Administrator>,<X>,<proc1d>,<TOPSPIN 2.1>,
      <abs ABSG = 4 
       data hash MD5: 32K
       C3 E5 0A D8 AF DA DC CB 03 68 D0 2B CA C3 0F DE>)
(   8,<2014-03-14 14:35:08.002 -0800>,<Administrator>,<X>,<proc1d>,<TOPSPIN 2.1>,
      <abs ABSG = 5 
       data hash MD5: 32K
       E0 D7 3F 67 50 F4 0A 42 E0 F1 BF 76 B2 DD 1E 4E>)
$$ ##END=
$$ 
$$ $$ hash MD5
$$ $$ 27 2B C7 A6 66 27 BC D3 C1 BB D7 7A 27 6E 29 6C
##$RELAX= 
##$RELAX= 
##$RELAX= 
##$RELAX= 
##$RELAX= 
##$RELAX= 
##$RELAX= 
$$ Bruker specific parameters
$$ --------------------------
##$DU= <E:\>
##$EXPNO= 10
##$NAME= <AC1653_NARAH14389_8531193_FYCxipjwgZ>
$$ [...]
150 150 150 150 150 150 150 150
##$TP07= 0
##$TPNAME0= <>
##$TPNAME1= <>
##$TPNAME2= <>
##$TPNAME3= <>
##$TPNAME4= <>
##$TPNAME5= <>
##$TPNAME6= <>
##$TPNAME7= <>
##$TPOAL= (0..7)
0.5 0.5 0.5 0.5 0.5 0.5 0.5 0.5
##$TPOFFS= (0..7)
0 0 0 0 0 0 0 0
##$TUNHIN= 0
##$TUNHOUT= 0
##$TUNXOUT= 0
##$USERA1= <user>
##$USERA2= <user>
##$USERA3= <user>
##$USERA4= <user>
##$USERA5= <user>
##$V9= 5
##$VALIST= <valist>
##$VCLIST= <CCCCCCCCCCCCCCC>
##$VD= 0
##$VDLIST= <DDDDDDDDDDDDDDD>
##$VPLIST= <PPPPPPPPPPPPPPP>
##$VTLIST= <TTTTTTTTTTTTTTT>
##$WBST= 1024
##$WBSW= 4
##$XGAIN= (0..3)
0 0 0 0
##$XL= 0
##$YL= 0
##$YMAX_a= 613526
##$YMIN_a= -520272
##$ZGOPTNS= <>
##$ZL1= 120
##$ZL2= 120
##$ZL3= 120
##$ZL4= 120
##$ABSF1= 14.98509
##$ABSF2= -5.573092
##$ABSG= 5
##$ABSL= 3
##$ALPHA= 0
##$AQORDER= 0
##$ASSFAC= 0
##$ASSFACI= 0
##$ASSFACX= 0
##$ASSWID= 0
##$AUNMP= <proc_prof1d_extract_pilot.lims>
##$AXLEFT= 0
##$AXNAME= <>
##$AXNUC= <1H>
##$AXRIGHT= 0
##$AXTYPE= 0
##$AXUNIT= <>
##$AZFE= 0.1
##$AZFW= 0.1
##$BCFW= 0
##$BC_mod= 0
##$BYTORDP= 0
##$COROFFS= 0
##$CY= 15
##$DATMOD= 1
##$DC= 0
##$DFILT= <>
##$DTYPP= 0
##$F1P= 0
##$F2P= 0
##$FCOR= 0.5
##$FTSIZE= 32768
##$FT_mod= 6
##$GAMMA= 0
##$GB= 0
##$INTBC= 1
##$INTSCL= 1
##$ISEN= 128
##$LB= 0
##$LEV0= 0
##$LPBIN= 0
##$MAXI= 10000
##$MC2= 0
##$MEAN= 0
##$ME_mod= 0
##$MI= 0
##$NCOEF= 0
##$NC_proc= -8
##$NLEV= 6
##$NOISF1= 0
##$NOISF2= 0
##$NSP= 0
##$NTH_PI= 0
##$NZP= 0
##$OFFSET= 14.98509
##$PC= 1
##$PHC0= 93.47168
##$PHC1= 0
##$PH_mod= 1
##$PKNL= yes
##$PPARMOD= 0
##$PPDIAG= 0
##$PPIPTYP= 0
##$PPMPNUM= 2147483647
##$PPRESOL= 1
##$PSCAL= 4
##$PSIGN= 0
##$PYNMP= <proc.py>
##$REVERSE= no
##$SF= 400.02
##$SI= 32768
##$SIGF1= 0
##$SIGF2= 0
##$SINO= 400
##$SIOLD= 32768
##$SPECTYP= <>
##$SREGLST= <1H.CDCl3>
##$SSB= 0
##$STSI= 32768
##$STSR= 0
##$SW_p= 8223.68421052631
##$SYMM= 0
##$S_DEV= 0
##$TDeff= 65536
##$TDoff= 0
##$TI= <>
##$TILT= no
##$TM1= 0
##$TM2= 0
##$TOPLEV= 0
##$USERP1= <user>
##$USERP2= <user>
##$USERP3= <user>
##$USERP4= <user>
##$USERP5= <user>
##$WDW= 1
##$XDIM= 32768
##$YMAX_p= 449431999
##$YMIN_p= -669589
##$CURPLOT= <Network HP LaserJet P1505>
##$CURPRIN= <$Network HP LaserJet P1505>
##$DFORMAT= <normdp>
##$LAYOUT= <+/1D_H.xwp>
##$LFORMAT= <normlp>
##$PFORMAT= <normpl>
##$SURQMSG= 1
$$ End of Bruker specific parameters
$$ ---------------------------------
##NTUPLES= NMR SPECTRUM
##VAR_NAME=  FREQUENCY,     SPECTRUM/REAL,   SPECTRUM/IMAG
##SYMBOL=    X,             R,               I
##VAR_TYPE=  INDEPENDENT,   DEPENDENT,       DEPENDENT
##VAR_FORM=  AFFN,          ASDF,            ASDF
##VAR_DIM=   32768,         32768,           32768
##UNITS=     HZ,            ARBITRARY UNITS, ARBITRARY UNITS
##FACTOR=    0.250966925370066, 1,           1
##FIRST=     8223.43324360094, 99292,        203566
##LAST=      0,             -131270,         -313069
##MIN=       0,             -669589,         0
##MAX=       8223.43324360094, 449431999,    0
$$ Real data points
##PAGE= N=1
##DATA TABLE= (X++(R..R)), XYDATA
$$ [...]
$$ plain form
19566 129501 -294944 405465 -166221 21732 37724 145061 -18941 -186856 -102592 -235374
19556 -235374 -328452 1719 -282608 -36790 -31437 -336944 -32561 -50570 366294 -3544 -152323
19545 -152323 -132542 -194572 5866 -209027 106817 -157569 -13349 -341666 -228904 81788 -265812
19533 -116848 204754 157031 -154600 -277209 -46563 -422357 25619 -327871 -331510 -99434 130247
19521 27141 43391 -13415 124395 128658 114966 196271 27702 104088 -445505 269930 -291239
19509 159965 -121880 223099 -176703 -113215 29843 32083 154494 -269038 33953 -33132 25507
19497 -26402 -339790 -82357 -67464 -212712 -36154 -81250 44123 -301516 -91585 33287 -201377
19485 -82509 53788 223875 -77287 132808 -332529 -182161 -36563 184040 -68683 -46421 47444
$$ packed form
19566A29501b94944D05465a66221B1732J5992J07337a8941j67915Q4264j32782
19556b35374r3078A719b82608c6790N353l05507c2561j8009C66294c544j48779
19545a52323J9781o2030E866b09027A06817a57569a3349l28317J12762H1788b65812
19533a16848B04754m7723a54600j22609d6563l75794B5619c27871l639i9434A30247
19521B7141J6250a3415A24395M263j3692Q1305B7702P6386d45505B69930b91239
19509A59965a21880B23099a76703O3488B9843K240J22411b69038C3953c3132B5507
19497b6402l13388h2357J4893j45248c6154m5096D4123c01516i1585C3287b01377
19485h2509E3788J70087g7287A32808c32529J50368c6563A84040f8683K2262D7444
$$ plain form
19473 -7245 -25973 -221353 -81803 -84964 -234554 -283603 -8263 -47951 -143947 -92259 12738 3878
19460 -3038 -124042 -212781 -93476 237218 73098 -206695 -35112 462448 69518 391331 -207911
19448 249177 -114037 -110473 -29779 83811 -348239 -186984 52673 43216 -185166 35047 -38651
19436 -133533 -83825 56645 -136457 236390 -78290 284820 138205 -191845 -4001 157321
19425 -441190 -71972 -123523 223986 95118 -148284 148681 -38831 -78383 -9725 -67333 88936
19413 149252 -154650 -248463 -109171 -177940 130973 -197451 -228608 176680 -9740 -228760
19403 -228760 37649 -179917 39407 -44498 -81076 -22357 -222604 -41606 -114649 -42823 -275553
19392 -275553 264788 11766 130833 -53357 1740 -227780 -295279 -505892 320213 -179837
$$ packed form
19473g245j8728j95380h1803l161j49590m9049h263l9688r5996N1688A2738C878
19460c038j21004q8739i3476B37218G3098b06695c5112D62448F9518L21813b07911
19448B49177a14037L564b9779H3811c48239J61255E2673r457a85166C5047c8651
19436a33533M9708E6645a36457B36390g8290B84820A38205a91845d001A57321
19425d41190g1972n1551B23986I5118a48284A48681c8831l9552i725n7608H8936
19413A49252a54650r3813a09171o8769A30973a97451l1157A76680i740k19020
19403b28760C7649a79917C9407d4498l6578b2357k00247d1606p3043d2823k32730
19392b75553B64788A1766J19067e3357A740b27780o7499k10613C20213a79837
$$ plain form
19381 76188 -12632 79332 -83521 -252173 106535 -334078 311137 -49679 -141048 -5586 78606
19369 -25291 105937 208630 244632 -149826 -265715 91711 -161765 -102625 -157654 134649
19358 168673 -36494 3999 4595 -131939 108254 42829 177301 -52374 87427 -74967 -232183
19347 -232183 105117 48132 57664 5098 -86760 -6219 -167683 67875 -280053 20429 -80032
19335 -169481 13664 -149427 -383956 -6624 194191 177018 413352 -272930 -114343 320206
19324 -35360 -64841 -146700 183809 220817 -109685 -4912 -81874 65980 -258135 6090 -51374
19312 -81491 311757 8494 -274537 -229057 -135599 -86075 -396253 -123639 -152343 -138394 18701
19300 103250 96262 94658 16962 16103 -376754 168680 -3519 -199572 80990 -35300 83098 -100925
$$ packed form
19381G6188a2632G9332h3521j68652A06535c34078C11137d9679r1369e586G8606
19369b5291A05937J02693L6002a49826j15889I1711a61765N9140n5029A34649
19358A68673c6494C999N96a31939A08254D2829J34472e2374H7427g4967j57216
19347b32183A05117D8132R532E098h6760f219j61464F7875b80053B0429h0032
19335a69481A3664a49427k34529f624A94191j7173K36334b72930a14343C20206
19324c5360k9481q1859A83809L7008a09685d912p6962F5980b58135F090e1374
19312h1491C11757H494b74537M5480R3458M9524l10178a23639k8704J3949A8701
19300A03250o988j604A6962q59c76754A68680c519j96053H0990c5300H3098a00925
$$ plain form
19287 188018 -21339 -101605 108695 38203 -135951 -78072 -155610 83007 -91288 24379 27664
19276 27664 -23794 79616 -55219 -197622 62359 -254000 -389667 271069 291837 -24983 -193844
19265 -193844 -256315 -18770 -84752 20493 -248283 -94931 -58604 4849 -251379 66209 -436128
19253 200718 -178615 -40971 30848 38695 -283090 84315 103095 -331693 -301377 -230815 -5866
19241 -197946 284590 -72079 49192 -339848 -175325 122045 -149217 31204 -128584 76267
19230 -148452 -175130 -330026 -117440 -81493 -171099 -489147 -22281 391328 -525531 -290914
19220 -290914 146525 127698 11652 -200485 -9913 -120850 -107369 222371 176523 -233342 -19397
19208 243256 -275028 -347988 26050 -162035 -19914 85907 -269458 -179011 129495 192972 -204309
$$ packed form
19287A88018b1339q0266A08695C8203a35951N7879p7538H3007i1288B4379L285
19276B7664b3794G9616e5219j42403F2359b54000j35667B71069K0768b4983j68861
19265a93844o2471a8770o5982B0493b48283i4931L6327D849b51379F6209d36128
19253B00718a78615d0971C0848P847b83090H4315J8780c31693L0316P0562e866
19241a97946B84590g2079D9192c39848J64523A22045a49217C1204a28584G6267
19230a48452k6678j54896a17440L5947q9606l18048b2281C91328e25531K34617
19220b90914A46525j8827A1652b00485i913j10937J3481B22371m5848b33342a9397
19208B43256b75028p2960B6050a62035a9914H5907b69458R0447A29495O3477b04309
$$ plain form
19196 -176475 42327 -28936 -193248 202222 -133565 329041 85371 -149144 228684 -158801
19185 31571 618 -250057 -296811 157479 -101852 -129015 -45296 -184398 67142 -172991 -387123
19174 -387123 176064 108541 85134 -169665 -158253 -218894 -208239 -320964 224235 405284
19164 405284 -177457 -44640 10700 -549502 136880 -145985 16279 151126 180324 159379
19154 159379 2675 -12993 252516 32762 543728 -74807 -67985 182724 -35344 -75479 -53934
19143 -53934 -56775 -113283 26901 151108 505685 -113928 -364855 -156906 -274436 82443 111614
19132 111614 -37211 132580 -64580 -20129 -128800 -42216 181520 -183779 -144966 -178861 -40984
19120 -284321 -278899 -63192 -315827 -217561 -194363 5286 -117653 -52549 -48044 -70124 117565
$$ packed form
19196a76475D2327b8936j64312B02222a33565C29041H5371a49144B28684a58801
19185C1571F18b50057m6754A57479a01852k7163d5296j39102F7142a72991k14132
19174c87123A76064o7523k3407a69665J1412o0641J0655j12725B24235J81049
19164D05284a77457d4640A0700e49502A36880a45985A6279J34847K9198k0945
19154A59379B675a2993B52516C2762N10966g4807O822A82724c5344m0135K1545
19143e3934k841n6508B6901J24207L54577a13928k50927a56906j17530H2443K9171
19132A11614c7211A32580f4580b0129j08671d2216A81520a83779L8813l3895d0984
19120b84321N422f3192k52635R8266K3198E286a17653e2549M505k2080A17565
$$ plain form
19108 275798 -268226 -79026 147023 -199014 32800 -121673 50202 -152054 109071 41682
19097 -121913 -138080 -33921 356657 208859 -136298 -269552 -33808 5616 -92797 78269 23267
19085 -76311 -440583 3356 114385 -184482 -138321 -192120 -23692 -25877 141347 -80928 -118762
19074 -118762 -155480 -164219 56094 -284859 41423 -234032 -257843 -326706 -188098 -75272 30246
19062 -257681 -69928 51383 -117561 59697 -30041 -50997 126233 -111873 -193329 -221778 -154057
19051 -154057 91565 14874 -272608 -56995 -341038 -284883 146598 -212279 71528 -28008 -68512
19040 -68512 -139130 46908 -188863 -45683 102886 -407076 -38840 -124188 371287 103651 157133
19029 157133 -202986 -88403 -101510 184012 25662 -282495 -216083 211790 122228 -342308
$$ packed form
19108B75798b68226g9026A47023a99014C2800a21673E0202a52054A09071D1682
19097a21913j6167c3921C56657j47798a36298j33254c3808E616i2797G8269B3267
19085g6311l64272C356J11029a84482M6161n3799b3692k185A41347h0928l7834
19074a18762l6718q739E6094b84859D1423b34032k3811o8863J38608g5272C0246
19062b57681f9928E1383a17561E9697c0041k0956A26233a11873q1456k8449O7721
19051a54057I1565A4874b72608e6995k84043N6155A46598b12279G1528b8008m0504
19040f8512p0618D6908a88863d5683A02886d07076c8840q5348C71287A03651N3482
19029A57133b02986h8403j3107A84012B5662b82495O6412B11790q9562c42308
$$ plain form
19018 17887 -54328 103856 -346159 90159 -94656 -234215 -131076 -248537 -365575 -197966
19008 -197966 -20536 -249670 16555 -16889 3821 -298707 54876 -139387 -17457 106679 -25825
18996 164779 142420 -246229 129789 -82569 97951 -140076 -51021 -73720 -178507 -124544 -235173
18985 -235173 -137747 2659 54029 -220747 -88770 -345684 79451 -151693 -301207 95791 132474
18974 132474 -14987 -286099 384830 -86378 283795 -78846 -153869 272337 315717 -22216 -40857
18963 -40857 -17335 -328931 15587 -200668 -96746 -85110 37102 88581 -12859 100969 -38778
18951 190299 -300725 20616 -94462 -67752 -300632 1716 52876 -188171 -96305 140794 -306216
18939 77442 87757 -135892 19077 -124256 -85534 93092 295692 -14787 -121888 -167343 -214771
$$ packed form
19018A7887e4328A03856c46159I0159i4656j39559J03139j17461j17038J67609
19008a97966b0536k29134A6555a6889C821b98707E4876a39387a7457A06679b5825
18996A64779k2359b46229A29789h2569I7951a40076e1021k2699j04787N3963j10629
18985b35173R7426B659N1370b20747h8770k56914G9451a51693j49514I5791L6683
18974A32474a4987k71112C84830h6378B83795g8846p5023B72337M3380b2216j8641
18963d0857a7335l11596A5587b00668i6746J1636C7102N1479a2859A00969c8778
18951A90299c00725B0616i4462K6710k32880A716N1160a88171R1866A40794c06216
18939G7442J0315a35892A9077a24256L8722I3092K02600a4787j07101m5455m7428
$$ plain form
18928 -214771 165163 -24655 90442 -364823 -107243 16641 45944 121783 -131763 -533718
18918 -533718 -275780 -157845 132548 287293 -45457 -93385 -167262 37276 -332570 174239
18907 -85709 50501 -3216 -106432 365171 -442171 -188905 -38303 -326320 -127534 -275046
18897 -275046 -261754 131388 -222106 107388 -71420 262967 7953 -39497 81177 232581 104501
18885 320836 23302 -249860 -151450 -220038 -217588 58835 148015 -50178 -90681 -40554 -176219
18874 -176219 -374204 -61565 -63027 -244976 -126044 179310 122223 -55238 -84419 -124951 -61933
18862 -74494 -92779 -96416 -134863 27680 -43458 -211156 -274759 11186 100477 45051 112765 3399
18849 -161340 -240025 128917 424680 -182762 77212 206282 65566 -244356 54175 -109094
$$ packed form
18928b14771A65163b4655I0442c64823a07243A6641K9303P5839a31763m01955
18918e33718K57938J17935A32548J54745d5457m7928p3877C7276c32570A74239
18907h5709E0501c216j03216C65171d42171a88905c8303k88017a27534j47512
18897b75046J3292A31388b22106A07388g1420B62967G953c9497H1177J51404A04501
18885C20836B3302b49860R8410o8588K450E8835Q9180e0178m0503d0554j35665
18874a76219j97985f1565j462j81949J18932A79310n7087e5238k9181m0532f1933
18862g4494j8285l637l8447B7680d3458j67698o3603A1186Q9291D5051O7714C399
18849a61340p8685A28917K95763a82762G7212J29070F5566b44356E4175a09094
$$ plain form
18838 -150585 269430 115382 21247 -42935 -155822 270876 231109 -93481 418798 -89563
18827 -145858 63928 -169698 -179761 1718 79100 178292 -13127 -145216 175311 -95604 181267
18815 -200238 46701 371502 176394 288500 273843 -125394 116206 487476 -108558 27668
18804 338768 -66018 -390092 -69653 174413 -91366 1963 258 -152503 248927 -196942 -94346
18792 36655 -388945 -112084 -200682 -16674 -145753 -230393 -46477 -53309 213728 -18754 -224103
18781 -224103 -362074 -140963 -210517 99198 -436838 -226847 66422 -158057 -76297 -82197 -239637
18770 -239637 -213840 324714 -178096 -231035 -185814 -39017 -116528 -440370 -329245 -158425
18759 -24488 16266 -51275 -48994 -112286 -122145 160132 130140 -107381 17921 -29610 234266
$$ packed form
18838a50585B69430A15382B1247d2935j12887B70876l9767i3481D18798h9563
18827a45858F3928a69698j0063A718P7382R9192a3127j32089A75311i5604A81267
18815b00238D6701L24801A76394J12106j4657a25394A16206L71270a08558B7668
18804C38768f6018l24074f9653A74413i1366A963B58a52503B48927a96942i4346
18792C6655c88945a12084q8598a6674j29079q4640d6477o832B13728a8754k05349
18781b24103j37971a40963o9554I9198d36838K09991F6422a58057g6297n900j57440
18770b39637K5797C24714a78096n2939M5221c9017p7511l23842J11125a58425
18759b4488A6266e1275K281o3292r859A60132k9992a07381A7921b9610B34266
$$ plain form
18747 39045 138772 343902 -302084 153518 -58647 209678 -53974 139153 -180821 -172410 82442
18735 -403796 -223346 -39520 -449034 42366 -188284 132808 -78567 -123374 -157889 -106812 58598
18723 -81114 -43062 40459 -90022 -162464 318591 95631 65128 186149 -52076 24295 -54368
18711 -238841 43913 -35537 169935 168129 300158 -80093 102808 -144701 42446 14888 -90617
18699 152844 -31307 224397 -187646 -151311 -262015 -81422 7918 124003 -62841 -85398 17161
18687 -60826 -323779 110856 -98463 62374 332304 49727 66032 13882 -93683 131176 63359
18675 -26173 -131452 -124539 -139561 62868 40660 -123472 -256535 -65490 165936 131718 -77251
18663 103515 123053 22143 -2680 -220042 -65715 266001 48263 222027 -261124 -103552 -37273
$$ packed form
18747C9045R9727K05130c02084A53518e8647B09678e3974A39153a80821Q411H2442
18735d03796J80450c9520m09514D2366a88284A32808g8567m4807l4515N1077E8598
18723h1114L8052D0459i0022p2442C18591I5631l0503J21021e2076B4295e4368
18711b38841D3913c5537A69935j806J32029h0093A02808a44701D2446A4888i0617
18699A52844c1307B24397a87646L6335j10704h1422G918J16085f2841k2557A7161
18687f0826k62953A10856i8463F2374K69930D9727J6305A3882i3683A31176F3359
18675b6173j05279O913j5022F2868k2208a23472j33063f5490A65936l4218g7251
18663A03515J9538B2143b680k17362f5715B66001D8263J73764b61124a03552c7273
$$ plain form
18651 -419259 141983 25999 -229865 -65314 108472 123528 -110221 -133565 64331 -200544
18640 68501 119903 -48894 -232179 105835 46368 -104090 -280844 47308 -57470 55846 40961
18629 40961 160755 44150 -219092 -172253 -125673 -302867 -28891 -18457 -54052 -189020 -81375
18617 -206150 28307 64992 -346698 19301 -44398 23959 -53240 -482697 -142125 -244054 -283322
18606 -283322 -271788 123335 -44591 -262237 -188588 -164404 -49839 -180916 -268466 137493 160063
18595 160063 -32056 -245791 -99649 -89901 -116208 -130669 -252511 210575 -141382 101886 -60671
18583 -94658 -115809 -468529 -70378 167432 37872 540327 186345 -62408 -167061 -185761 -126505
18572 -126505 -35267 147505 -163816 -263867 109551 231551 -193792 -25996 -162972 76265
$$ packed form
18651d19259A41983B5999b29865f5314A08472J5056a10221k3344F4331b00544
18640F8501N1402d8894j83285A05835D6368a04090j76754D7308e7470E5846j4885
18629D0961J19794D4150b19092M6839M6580j77194b8891J0434l5595j34968h1375
18617b06150B8307L6685c46698A9301d4398B3959e3240m29457a42125j01929l9268
18606b83322J1534A23335d4591k17646P3649K4184d9839j31077q7550A37493K2570
18595A60063c2056k13735i9649R748k6307j4461j21842B10575a41382A01886f0671
18583i4658k1151l52720g0378A67432C7872N02455A86345f2408j04653j8700N9256
18572a26505c5267A47505a63816j00051A09551J22000a93792b5996j36976G6265
$$ plain form
18561 390896 227133 -359659 -211180 -863 -7050 134516 -101999 -108178 -32736 44302 -82980
18549 -9773 -262930 15631 -275465 -101103 -280370 75560 20011 -9075 -253263 196166 -124602
18537 -11833 -58985 45012 -70918 28631 -101932 5885 -58742 -140099 19875 -74129 29178 -158866
18524 -98588 236503 -11293 328669 -26443 109003 -38264 -66692 2122 -263561 -123238 58566
18512 -19301 -241038 -396673 -167023 127980 84498 72612 287475 -70405 166106 66145
18501 -121572 56670 -163409 -76225 -425107 -91181 18590 -205946 39544 -111924 -94406 236678
18489 -143700 7330 9254 -171099 -176919 100083 55426 56421 7822 -184243 453016 -131239 -118335
18477 -118335 -113579 -306313 -160548 -350543 -9555 -85494 183503 128626 225739 -154478 455108
$$ packed form
18561C90896j63763c59659J48479h63o187A34516a01999o179c2736D4302h2980
18549i773k53157A5631b75465a01103j79267G5560B0011i075k44188A96166a24602
18537a1833m7152D5012g0918B8631a01932E885e8742q1357A9875g4129B9178a58866
18524i8588B36503a1293C28669b6443A09003c8264k8428B122b63561a23238E8566
18512a9301k21737j55635a67023A27980m3482j1886K14863g0405A66106F6145
18501a21572E6670a63409g6225l48882i1181A8590b05946C9544a11924J7518B36678
18489a43700G330J924a71099n820A00083m4657R95G822a84243D53016a31239J2904
18477a18335M756j92734J45765j89995i555p5939A83503n4877R7113a54478D55108
$$ plain form
18465 -283504 -71236 168199 -139427 33659 -372679 -218295 -114770 45833 -165531 -394604
18455 -394604 161808 446407 329969 -103808 180530 118979 -144040 -106663 -188631 332176
18444 -237525 -206198 210390 68777 -134673 -82863 -44241 -216097 85471 -105797 -392953
18434 -392953 -11795 -99846 -99943 158519 -218259 37844 34128 -253113 3587 59392 38604 -243510
18421 -205261 -245863 -139876 187776 281990 52458 194622 -30398 -103666 374734 136590
18410 -97234 45306 80403 19164 25850 -287405 217986 -210445 -215022 -216505 86997 -304218
18398 -281340 -283530 20598 -9484 -188031 -7973 154159 -176456 161695 -152002 53785 -99723
18386 -406596 -130321 -50031 -39058 -47409 -267559 -91527 -187650 -113151 25889 52916 -12879
$$ packed form
18465b83504g1236A68199a39427C3659c72679J54384J03525D5833a65531k29073
18455c94604A61808K84599j16438a03808A80530o1551a44040L7377q1968C32176
18444b37525L1327B10390F8777a34673N1810L8622j71856H5471a05797k87156
18434c92953a1795q8051r7A58519b18259C7844l716b53113C587N5805k0788b43510
18421b05261m0602J05987A87776R4214E2458J42164c0398p3268C74734A36590
18410i7234D5306L5097A9164O686b87405B17986b10445m577j483H6997c04218
18398b81340k190B0598i484j78547g973A54159a76456A61695a52002E3785i9723
18386d06596a30321e0031J0973q351k20150i1527r6123P4499B5889K7027a2879
$$ plain form
18374 -131630 197884 -81826 -321686 2996 276904 109911 -72946 10890 122517 -120626
18363 -25032 -117990 172187 -210956 140443 -186937 -197539 -550530 -49158 -32304 -232006
18353 -232006 -27613 -154317 256499 84093 -134913 357121 -248548 -66857 -464459 -50548
18342 -217749 -14821 -210466 -119454 33282 -151502 -133138 42988 -72505 -2660 78049 -101749
18330 128545 35749 54206 32878 -228141 -93846 -103207 -267337 366027 -151730 -169965 -57557
18318 -192407 -77798 -45738 -48999 -236712 -223182 -16517 -177019 210097 -71680 73626 38592
18307 38592 -158543 298642 -68637 157652 -433270 -123718 62503 -189202 -361013 -75318
18296 -83763 -285792 -111939 -261563 -157078 31894 131669 -11730 -97339 116653 63145 -121916
$$ packed form
18374a31630A97884h1826k39860B996K73908A09911g2946A0890J11627a20626
18363b5032r2958A72187b10956A40443a86937j0602l52991d9158J6854j99702
18353b32006b7613j26704B56499H4093a34913C57121b48548f6857l97602e0548
18342b17749a4821j95645R1012C3282a51502J8364D2988g2505b660G8049a01749
18330A28545C5749J8457k1328b28141i3846r361j64130C66027a51730j8235e7557
18318a92407g7798L2060l261j87713J3530a6517j60502B10097g1680G3626l5034
18307C8592a58543B98642f8637A57652d33270a23718F2503a89202j71811g5318
18296h3763k02029a11939j49624J04485C1894R9775a1730q5609A16653n3508a21916
$$ plain form
18284 -153561 -127742 6416 165870 131083 -260821 -138610 -146880 250352 22302 -30684 298527
18272 -135174 198708 -112664 -221260 -39738 48997 -46450 -231997 41433 81321 301821
18262 301821 -352111 -97016 127331 -268744 -303706 -56726 -140437 -29536 74287 86422 -54409
18250 -205036 -37727 10902 -70123 67462 91971 11626 -15219 -48221 79213 -163154 -191637
18239 -191637 -143565 116696 57336 -11617 137094 362358 -167515 -320918 58511 159953
18229 159953 -132869 -222687 -445712 -171745 -448413 -185408 -369630 -112530 10947 -15211
18218 -118607 36544 -109095 -409561 -166101 -408462 321723 65612 -153936 23419 -73257
18207 -176343 -378237 -61954 309385 -178126 143930 14881 137678 -7356 -128557 -11563
$$ packed form
18284a53561K5819F416J59454l4787b60821J22211q270B50352B2302c0684B98527
18272a35174A98708a12664j08596c9738D8997d6450j85547D1433L9888K20500
18262C01821c52111i7016A27331b68744l4962e6726q3711b9536G4287J2135e4409
18250b05036c7727A0902g0123F7462K4509A1626a5219l3002G9213a63154k8483
18239a91637M8072A16696E7336a1617A37094K25264a67515j53403E8511J01442
18229A59953a32869q9818k23025a71745k76668a85408j84222a12530A0947a5211
18218a18607C6544a09095l00466a66101k42361C21723F5612a53936B3419g3257
18207a76343k01894f1954C09385a78126A43930A4881J22797g356j21201a1563
$$ plain form
18196 251698 206571 -208620 338622 161708 -117245 74643 -136462 -204627 -89093 -179384
18186 -179384 251233 -275498 -51933 47576 -61910 -109796 10620 -117209 -163063 67034 189170
18175 189170 98996 90316 -76122 62646 -113767 41387 101669 -123978 -262004 -114413 -83172
18164 -83172 -46072 -182546 85770 222654 -108089 221967 -90714 227350 3133 77682 63381
18153 63381 -111155 420146 -236724 -123896 -153991 34234 -301021 270483 56899 -48 93468
18141 -135731 -263866 -155020 -22962 -176774 -78337 98511 104701 336906 132420 -204056
18130 -124704 54089 -973 -46201 -26333 -76918 -142286 6378 -211552 -48012 -168350 79149 -263726
18117 97633 -90377 -265548 274695 -142667 -45146 146291 -136406 64830 261411 -231431
$$ packed form
18196B51698m5127b08620C38622A61708a17245G4643a36462o8165h9093r0291
18186a79384B51233b75498e1933D7576f1910m7886A0620a17209m5854F7034J22136
18175A89170r0174q680g6122F2646a13767D1387O0282a23978j38026a14413L1241
18164h3172L7100j36474H5770J36884a08089B21967i0714B27350C133P4549j4301
18153F3381a11155D20146b36724J12828l0095C4234c01021B70483E6899d8I3468
18141a35731j28135J08846b2962j53812g8337I8511O190K32205A32420b04056
18130a24704E4089i73m5228J9868n0585o5368F378b11552d8012j20338G9149b63726
18117I7633i0377j75171B74695a42667d5146A46291a36406F4830J96581b31431
$$ plain form
18106 -86109 135876 -49613 -114373 20760 -234084 369602 91756 -106946 86808 -137588 -22292
18094 132976 206029 89281 -231531 58353 -34247 -77065 -225504 -68887 -5103 -139914 149507
18082 -348738 77619 121728 -226699 -189534 -3098 -89408 -69828 87597 96045 217935 123182
18071 123182 -241744 -135390 160461 90727 -228898 -289345 138813 228707 29881 196824
18061 196824 -370507 -60932 -31560 201253 -280008 -22890 -258038 -40399 29687 -104186
18050 -63194 219327 93955 19625 -54116 -162862 10046 -96301 51635 -11755 -77922 -270934
18039 -270934 538766 20475 10243 -476037 -195082 72197 -125809 -40375 89002 61582 96074
18028 96074 5823 -303449 -196335 -204382 -445894 -199078 118004 -238609 155933 -135784
$$ packed form
18106h6109A35876d9613o4760B0760b34084C69602I1756a06946H6808a37588b2292
18094A32976P3053H9281b31531E8353c4247m2818j48439f8887e103j34811A49507
18082c48738G7619M4109b26699L7165c098q6310J9580H7597Q448J21890r4753
18071A23182b41744J06354A60461o9734b28898o0447A38813Q9894B9881J66943
18061A96824c70507f0932K9372B01253b80008b2890k35148d0399B9687a04186
18050f3194B19327I3955A9625e4116j08746A0046i6301E1635a1755o6167j93012
18039b70934E38766B0475j0232d76037a95082G2197a25809d0375H9002k7420L4492
18028I6074E823c03449J07114q047k41512a99078A18004b38609A55933a35784
$$ plain form
18017 -28754 196475 8960 -317731 12748 76185 232631 -17478 151502 -26421 158756 318475
18006 318475 61499 -107434 66343 156942 -214719 213292 -41729 103133 -27428 233411
17995 1087 322099 -63374 -142106 116863 52899 -77102 151740 -1957 325165 201760 -177965
17983 -178749 26395 12862 -60190 87032 76928 -296724 132053 -224319 92382 -186455 -68123
17971 489980 -236626 -165023 174877 9567 172794 -58984 -283383 200243 -136185 58855
17960 -23747 -44379 99110 72833 -87285 249757 -455869 -46091 141442 -477166 160838 199164
17949 199164 263949 -496060 112256 234831 558 -60795 -95035 -312463 -67180 123374 -48639
17937 -291799 -357835 -147085 188758 -117965 -392175 200020 222790 -24521 -24719 131195 47914
$$ packed form
18017b8754A96475H960c17731A2748O3437J56446a7478A51502b6421A58756J59719
18006C18475F1499a07434F6343R0599b14719B13292d1729A03133b7428B33411
17995A087L21012f3374p8732A16863E2899g7102A51740a957C25165j23405a77965
17983a78749B6395A2862f0190H7032j0104b96724A32053b24319I2382a86455f8123
17971D89980b36626P1603A74877I567J63227e8984k24399B00243a36185E8855
17960b3747k0632I9110k6277h7285B49757d55869d6091A41442d77166A60838L8326
17949A99164O4785d96060A12256J22575E58f0795l4240k17428f7180A23374d8639
17937b91799o6036a47085A88758a17965k74210B00020K2770b4521j98A31195D7914
$$ plain form
17925 246762 -155881 -10059 46497 44240 253217 -191451 -146076 341632 -129325 -72727 201288
17913 -58188 43574 -91035 -108098 140684 -62608 171354 317379 224191 69927 216696 83832
17901 -73652 -29600 -36087 -377674 142561 -15833 191991 28664 -222719 -73906 111512 -246664
17889 84130 63795 31538 132047 51620 109624 300609 -56646 -243551 248958 173228 33177
17877 -36599 47573 64858 73014 119259 340844 450470 -207650 56660 -176468 16837 108708
17866 108708 254668 -197103 120802 175441 69333 -55781 111562 -109935 -200071 -4711 146323
17854 -30051 193900 -145631 -34829 33379 192971 -283727 191653 -64048 50545 -22929 19874
17842 -272750 -1124 -185578 -245693 13165 50089 -63465 -8730 -154867 -63999 386377 142438
$$ packed form
17925B46762a55881a0059D6497k257K08977a91451M5375C41632a29325N6598B01288
17913e8188D3574i1035j7063A40684f2608A71354J46025r3188F9927J46769H3832
17901g3652b9600o487l41587A42561a5833A91991B8664b22719g3906A11512b46664
17889H4130k0335C1538J00509E1620N8004J90985e6646j86905B48958p5730C3177
17877c6599D7573J7285Q156M6245K21585J09626b07650E6660a76468A6837R1871
17866A08708J45960a97103A20802N4639F9333e5781A11562a09935r0136d711A46323
17854c0051A93900a45631c4829C3379J59592b83727A91653f4048E0545b2929A9874
17842b72750a124j84454o0115A3165L6924f3465h730j46137f3999C86377A42438
$$ plain form
17830 49526 -113419 39884 -242507 34623 249915 -113810 242699 -1649 63574 -49866 218615
17818 20921 54431 -45255 98364 180110 -210708 -102731 -119903 183692 -10078 -30617 118647
17806 -274621 -199679 46234 6229 132390 280862 348198 31868 -263424 138509 -4024 -43051
17795 -43051 291816 9439 176211 298181 -231292 -218031 261937 -39082 -81034 381751 -176910
17783 23089 -151035 56903 113826 255637 -20430 -40954 323649 -36821 -50686 -190654 -239969
17772 -239969 -131054 10281 208033 -89557 -28200 -320865 -102897 205385 116908 213583
17762 213583 -269071 264167 31576 -49812 -252268 113739 8723 72747 -64856 23670 -252265
17750 -401534 -57272 -8199 76898 -153817 318122 -222436 4273 -196722 145085 113070 -147999
$$ packed form
17830D9526a13419C9884b42507C4623K15292a13810B42699a649F3574d9866B18615
17818B0921L3510d5255I8364Q1746b10708a02731j7172A83692a0078k0539A18647
17806b74621P4942D6234F229J26161J48472O7336C1868b63424A38509d024l9027
17795d3051B91816I439J66772J21970b31292J3261B61937c9082m1952C81751a76910
17783B3089a51035E6903N6923J41811b0430k0524C23649c6821j3865j39968m9315
17772b39969J08915A0281J97752h9557b8200k92665a02897B05385q8477R6675
17762B13583b69071B64167C1576d9812k02456A13739H723O4024f4856B3670b52265
17750d01534e7272h199G6898a53817C18122b22436D273a96722A45085l2015a47999
$$ plain form
17738 21239 80788 -34710 240078 13801 86978 84714 234708 106287 -97249 13614 168096
17727 168096 -14685 -92871 256171 60338 39728 -74601 156085 -133452 119302 81176 17839
17715 107291 12792 123518 -170370 -254469 -50537 259019 14720 98530 -17041 -62305 -157132
17704 -157132 113737 72035 -82278 20675 -73360 83213 -282706 140778 174552 433002 51046
17692 324252 127332 106971 -175581 -127586 -119316 -97879 -19878 263111 -42774 77782 3580
17680 8572 122659 11690 296471 -199452 -128468 111436 98218 -24943 60212 -70854 65349
17668 -328920 -227518 -33954 -71161 99434 -43951 53260 244455 9978 378794 22437 125957
17657 125957 -270362 -327342 23129 -31704 -228335 126776 -3302 35091 165850 31339 -232084
$$ packed form
17738B1239N9549c4710B40078A3801P3177k264J49994A06287i7249A3614J54482
17727A68096a4685p8186B56171F0338k0610g4601A56085a33452A19302l8126A7839
17715A07291A2792J10726a70370q4099e0537B59019A4720Q3810a7041m5264r4827
17704a57132A13737m1702h2278B0675g3360H3213b82706A40778L3774K58450E1046
17692C24252A27332k0361a75581M7995Q270K1437a9878B63111d2774G7782C580
17680H572J14087A1690K84781a99452P0984A11436j3218b4943F0212g0854F5349
17668c28920J01402c3954l7207I9434d3951E3260J91195I978L68816B2437J03520
17657A25957b70362n6980B3129c1704j96631A26776c302C5091J30759C1339b32084
$$ plain form
17645 -229511 -159343 -155782 42585 300014 42454 -38505 233629 104968 14007 -332342 -136546
17633 -163378 -359866 -5079 22268 -31581 -61989 17998 160457 152904 133210 -234339 -152444
17622 -152444 -188659 -43368 67749 150707 148080 251333 103926 291974 19133 -9017 274667
17610 120341 4676 -127722 21338 336427 258328 200051 104435 57115 -263855 142925 115665
17599 115665 213777 16401 243075 140613 18354 151615 -106289 -91727 74337 -110482
17588 159479 101367 -145980 206674 98049 165126 -80493 -65842 -252438 -223582 125598 -33488
17576 -155689 78011 -89400 -36551 151528 -103273 25276 103852 56013 -389146 92526 -69670
17564 -192041 18412 84152 -29496 -125113 245942 68721 411512 15019 6608 26042 147073
$$ packed form
17645b29511P0168L561D2585K57429D2454c8505B33629A04968A4007c32342a36546
17633a63378j96488e079B2268c1581l0408A7998J42459p553j9694b34339Q1895
17622a52444l6215d3368F7749Q2958k627J03253A03926J88048A9133i017B74667
17610A20341D676a27722B1338L15089p8099n8277r5616m7320b63855A42925k7260
17599A15665R8112A6401K26674j02462A8354J33261a06289J4562G4337a10482
17588A59479n8112a45980B06674I8049O7077h0493J4651j86596K8856A25598c3488
17576a55689G8011h9400c6551A51528a03273B5276P8576m7839c89146I2526f9670
17564a92041A8412O5740b9496r5617B45942F8721L42791A5019F608J9434J21031
$$ plain form
17553 147073 42087 -101240 -58614 -210992 -149396 247973 302605 186797 90386 117893 -174047
17541 198914 -173608 -171737 6979 -260943 -154917 34163 -54629 168686 75478 -17953 94764
17529 -9012 -80867 -30209 194535 236960 154476 -207003 -172480 61159 167066 -101621 231102
17517 -32455 245099 -87807 -79194 -35785 216096 250325 38992 77116 181836 -161146 4019
17505 -45749 444856 102007 468567 57807 149447 -162543 38866 93920 280870 94801 167319
17494 167319 286278 -97034 158757 125665 236880 33222 -196338 129768 -116050 113960
17483 89583 61646 158876 -4072 317774 194278 344151 110474 -11168 14898 113561 279612
17472 279612 10378 508863 190483 -20358 45106 215553 376668 282022 464052 171111
$$ packed form
17553A47073D2087a01240M2626j52378O1596B47973N4632j15808I0386K7507a74047
17541A98914a73608J871F979b60943J06026C4163e4629A68686G5478a7953I4764
17529i012p1855c0209A94535M2425q2484b07003L4523F1159J05907a01621B31102
17517c2455B45099h7807Q613c5785B16096L4229C8992L8124J04720a61146D019
17505d5749D44856A02007L66560E7807R1640a62543C8866N5054J86950I4801P2518
17494A67319J18959i7034A58757l3092J11215C3222a96338A29768a16050A13960
17483H9583k7937R7230d072C17774j23496J49873A10474a1168A4898R8663J66051
17472B79612A0378M98485A90483b0358D5106J70447J61115r4646J82030A71111
$$ plain form
17461 -68953 42597 35090 53982 -86626 298962 -192757 -65692 83364 352776 208819 125077
17450 125077 431820 414506 297259 -35766 316309 466892 430614 241861 -58325 404465
17439 46152 259919 128076 476071 465429 420915 162284 332074 238035 343091 114365
17428 218966 -32175 -47043 -12460 407887 326641 255962 80491 225281 330664 52772 7704
17416 91133 13500 105530 -18427 266640 -38465 20965 317977 589522 341659 203937 -233158
17404 -277093 89163 133827 178400 298684 -118467 163407 325749 261108 272801 162421
17394 162421 6271 220596 -281538 176333 -167534 35831 224357 161836 -210568 -92673
17383 108909 535825 352327 179671 102608 609898 179229 -141158 332703 102642 -192406
$$ packed form
17461f8953D2597p507J8892h6626B98962a92757f5692H3364K69412j43957q3742
17450A25077L06743j7314j17247c5766C16309J50583l6278j88753e8325D04465
17439D6152K13767A28076L47995j0642m4514A62284J69790r4039J05056A14365
17428B18966c2175j4868a2460D07887q1246p0679H0491J44790J05383E2772G704
17416I1133A3500R2030a8427B66640c8465B0965K97012K71545k47863j37722b33158
17404b77093H9163M4664M4573J20284a18467A63407J62342o4641J1693j10380
17394A62421F271K14325b81538A76333a67534C5831J88526o2521b10568i2673
17383A08909M26916j83498j72656p7063N07290A79229a41158C32703A02642a92406
$$ plain form
17372 370264 -85430 282116 198814 181015 -221502 332846 112619 10083 -55918 -98967 76277
17360 119934 289003 196512 174195 127955 244679 60793 120125 319096 318777 208642 80780
17348 -36731 312279 118626 126963 123292 -128322 307240 -12305 324903 66239 210131 35857
17336 212937 449120 120569 -60725 31559 15087 404139 246654 177152 -73068 236121
17325 165338 30443 57354 279324 79283 271181 236006 42491 91215 103252 53163 7773
17313 214992 -156646 9727 166481 215708 451910 227855 476862 -38514 112565 135764
17303 135764 -181052 -232636 558964 459488 78256 252937 232781 141678 239226 209342 88815
17291 -30483 140461 -181180 210561 -192969 306261 141780 530708 178872 -251697 6761
$$ packed form
17372C70264h5430B82116q3302j7799b21502C32846A12619A0083e5918m3049G6277
17360A19934J69069r2491k2317m6240J16724F0793N9332J98971l19j10135H0780
17348c6731C12279A18626Q337l671a28322C07240a2305C24903F6239J43892C5857
17336B12937K36183A20569f0725C1559A5087L89052j57485o9502g3068B36121
17325A65338C0443K6911K21970G9283J91898l5175D2491M8724J2037n0089G773
17313B14992a56646I727J56754M9227K36202k24055K49007c8514A12565K3199
17303A35764a81052n1584E58964r9476G8256J74681k0156r1103R7548k9884H8815
17291c0483A40461a81180B10561a92969C06261A41780L88928A78872b51697F761
$$ plain form
17280 174486 498 73710 -104083 -35388 294829 323997 280659 28540 36454 13907 415270
17269 415270 5969 547218 67435 50646 123855 32594 -9438 370778 327790 33537 60308
17258 60308 316772 -8849 140027 84892 247737 323433 202000 152920 43534 282983 164995
17247 164995 52035 312817 380456 -173790 249469 432013 199640 259535 211610 251278
17237 251278 87756 484437 159562 361921 158096 28137 -88625 70291 241928 46447
17226 266390 114338 -133083 368856 255576 -92820 94058 342122 146224 297054 196794
17216 196794 287081 382345 -88097 383730 117915 377145 141275 450376 382767 282334
17206 282334 450261 48854 172234 98905 368861 -49567 355217 355076 56891 306807 430532
$$ packed form
17280A74486D98P3212a04083c5388B94829K9168m3338B8540P914A3907M01363
17269D15270E969N41249F7435j6789P3209C2594i438C70778m2988C3537K6771
17258F0308K56464h849A40027n5135J62845P5696j21433m9080D3534K39449j17988
17247A64995E2035K60782O7639a73790B49469J82544A99640N9895m7925L9668
17237B51278H7756L96681A59562K02359A58096B8137h8625G0291J71637D6447
17226B66390A14338a33083C68856j13280i2820I4058K48064A46224J50830j00260
17216A96794R0287R5264h8097C83730A17915K59230A41275L09101o7609j00433
17206B82334J67927D8854J23380p3329K69956d9567C55217j41E6891K49916J23725
$$ plain form
17195 430532 101981 80509 294287 224657 141916 143859 330540 170634 139930 174241 -5694
17183 336787 390744 405296 301172 135392 -28139 135437 499790 468315 319306 203993
17173 203993 234718 570506 304063 177098 314877 -91122 490634 549119 270891 325016
17163 325016 590624 -37752 415454 555860 162959 244085 186955 328496 376175 436363
17153 436363 476989 313541 88873 372609 505681 94884 186351 84376 -88418 319303 62969
17141 202273 151489 353834 276892 330042 423509 313120 241367 398501 640832 104625
17130 318051 333243 389168 326994 97715 283440 655933 516480 432573 488449 468103 206489
17118 115735 114124 472347 208822 280604 491181 245774 377335 613075 595505 122799
$$ packed form
17195D30532A01981k1472K13778o9630q2741J943J86681j59906l0704L4311e694
17183C36787N3957J4552j04124A35392b8139A35437L64353l1475j49009j15313
17173B03993L0725L35788k66443j26965J37779i1122D90634N8485B70891N4125
17163C25016K65608c7752D15454J40406A62959Q1126n7130J41541M7679O0188
17153D36363M0626j63448H8873K83736J33072I4884R1467H4376h8418C19303F2969
17141B02273n0784K02345p6942N3150R3467j10389p1753J57134K42331A04625
17130C18051J5192N5925o2174I7715J85725L72493j39453q3907N5876k0346B06489
17118A15735j611L58223B08822P1782K10577k45407J31561K35740j7570A22799
$$ plain form
17107 448661 117049 396573 511023 61481 250599 499094 311551 426066 430810 526601
17097 526601 440075 386914 580947 361049 301655 345396 573627 457433 546881 616187 337159
17086 337159 108255 748154 379699 75564 300089 239045 424625 750357 606223 635021
17076 635021 371275 534404 514292 275117 249615 338459 485642 478912 596644 565097 295355
17065 295355 590829 668854 490745 717698 444569 420195 420918 323703 276369 356300 266039
17054 266039 481558 632128 535741 674309 336137 556272 578039 602492 386712 563293
17044 563293 468899 418624 219578 615079 466321 886304 510548 657037 303053 280034
17034 280034 532870 439954 651254 377962 599361 264373 742458 588349 504839 491610
$$ packed form
17107D48661A17049K79524J14450F1481J89118K48495j87543J14515M744R5791
17097E26601q6526n3161J94033k19898n9394M3741K28231j16194Q9448O9306k79028
17086C37159A08255O39899l68455G5564K24525o1044J85580L25732j44134K8798
17076F35021k63746J63129k0112k39175k5502Q8844J47183o730J17732l1547k69742
17065B95355K95474P8025j78109K26953k73129k4374P23r7215m7334P9931r0261
17054B66039K15519J50570r6387J38568C36137K20135K1767K4453k15780J76581
17044E63293r4394n0275j99046L95501j48758M19983l75756J46489C03053k3019
17034B80034K52836r2916K11300k73292K21399B64373M78085j54109q3510j3229
$$ plain form
17024 491610 -65231 721053 487058 183389 336440 756604 585541 526021 631526 698097
17014 698097 762496 555713 551734 930916 627711 571531 924182 582241 765561 558078
17004 558078 556130 764757 516767 673088 524185 579765 774318 761949 745761 756250 500524
16993 500524 645073 531320 582332 790357 991165 598047 770961 952261 581317 888964
16983 888964 941490 956534 551564 744622 603192 718326 630085 801616 782580 1117080
16973 1117080 596487 960766 850075 963023 874686 831388 870166 616879 977746 835781
16963 835781 885501 819302 1068817 1188002 818334 818426 1156687 941522 826935 1027224 735052
16952 735052 941507 925086 1140557 807348 959046 1030005 1045371 1088117 919846 1180781
$$ packed form
17024D91610f5231G21053k33995A83389J53051M20164j71063n9520J05505O6571
17014F98097O4399k06783l979L79182l03205n6180L52651l41941J83320k07483
17004E58078j948K08627k47990J56321j48903N5580J94553j2369j6188J0489k55726
16993E00524J44549j13753N1012K08025K00808l93118J72914J81300l70944L07647
16983H88964N2526J5044m04970J93058j41430J15134q8241J71531j9036L34500
16973A117080n20593L64279j10691J12948q8337m3298L8778k53287L60867j41965
16963H35781M9720o6199K49515J19185l69668R2L38261k15165j14587K00289k92172
16952G35052K06455j6421K15471l33209J51698P0959J5366M2746j68271K60935
$$ plain form
16942 1180781 987499 1067364 1205382 1315225 896574 1074007 963428 1147884 1201575 1194838
16932 1194838 1109893 1014276 1214494 1351965 1413109 1119810 1305833 1255613 1216198 1200944
16922 1200944 1455889 1626106 1259654 1401970 1414558 1293569 1387876 1358685 1421070 1549775
16912 1549775 1089266 1428320 1343775 1659470 1333170 1577231 1272151 1594390 1547165 1649021
16902 1649021 1780805 1381419 1726069 1585322 1568351 1435897 1623494 1549793 1851314 1780102
16892 1780102 2087765 1829580 1691718 1899337 1988264 2062438 1969148 2058466 1802947 2040770
16882 2040770 1941711 1763901 2261344 2054502 2262102 2087623 2036863 1817660 2249964 2129970
16872 2129970 2199941 2394294 2285320 2254746 2128153 2150694 2379720 2494469 2637086 2332372
$$ packed form
16942A180781j93282P9865J38018J09843m18651J77433j10579J84456N3691o737
16932A194838q4945r5617K00218J37471O1144k93299J86023n0220l9415j5254
16922A200944K54945J70217l66452J42316J2588j20989R4307k9191O2385J28705
16912A549775m60509L39054q4545L15695l26300K44061l05080L22239m7225J01856
16902A649021J31784l99386L44650j40747j6971j32454J87597p3701L01521p1212
16892A780102L07663k58185j37862K07619Q8927P4174r3290Q9318k55519K37823
16882B040770r9059j77810M97443k06842K07600j74479n0760k19203M32304j19994
16872B129970O9971J94353j08974l0574j26593K2541K29026J14749J42617l04714
$$ plain form
16862 2332372 2668186 2571469 3136665 2674239 2948666 2787262 2204217 2786163 2756096 2859516
16852 2859516 3004181 2783300 3193716 3033129 2980516 2962141 3429379 3177598 3376747 3303475
16842 3303475 3356254 3440034 3597976 3757006 3715234 3732323 3913312 3584801 3839565 3712398
16832 3712398 4020524 3886596 4187535 4107870 4373368 4391476 4558624 4146655 4661188 4480853
16822 4480853 4510198 4752471 5232862 4997858 5080398 5266741 5154647 5437198 5279694 5445565
16812 5445565 6010768 6023893 5950583 6246369 6331219 6517426 6406316 6691812 6652446 6815267
16802 6815267 7036941 7139133 7547367 7381333 7639478 7778108 7871336 8049640 8429697 8319831
16792 8319831 8919442 9132805 9218225 9266153 9715398 9684035 10010658 10303954 10590417 11052819
$$ packed form
16862B332372L35814r6717N65196m62426K74427j61404n83045N81946l0067J03420
16852B859516J44665k20881M10416j60587n2613j8375M67238k51781J99149p3272
16842C303475N2779Q3780J57942J59030m1772J7089J80989l28511K54764j27167
16832C712398L08126j33928L00939p9665K65498J8108J67148m11969N14533j80335
16822D480853K9345K42273M80391k35004Q2540J86343j12094K82551j57504J65871
16812E445565N65203J3125p3310K95786Q4850J86207j11110K85496l9366J62821
16802F815267K21674J02192M08234j66034K58145J38630R3228J78304L80057j09866
16792H319831N99611K13363Q5420M7928M49245l1363L26623K93296K86463M62402
$$ plain form
16782 11052819 11242870 11664784 12256822 12131966 12818132 13016964 13036569 14063412 14628189
16773 14628189 14722655 15403285 15818755 16177086 17042188 17313988 17899597 18771697 19277272
16764 19277272 20057591 20829892 21247915 22239800 22832700 24131342 25470779 26147473 26961435
16755 26961435 28182761 29535124 30807692 32120131 33726516 34950674 37028567 38546606
16747 38546606 40685904 42515205 44754677 46912170 49266680 51754093 54844562 57479962
16739 57479962 61119780 64716963 68105915 72347215 76251994 81506664 86075759 91398068
16731 91398068 97100688 102835048 109191366 115559201 122736620 129881518 136930128 144627046
16723 144627046 152334758 159587385 166955415 173304562 179198376 183946752 188111483 190923552
$$ packed form
16782A1052819J90051M21914N92038j24856O86166J98832J9605J026843N64777
16773A4628189R4466O80630M15470L58331Q65102K71800N85609Q72100N05575
16764A9277272P80319P72301M18023R91885N92900J298642J339437O76694Q13962
16755B6961435J221326J352363J272568J312439J606385J224158K077893J518039
16747C8546606K139298J829301K239472K157493K354510K487413L090469K635400
16739E7479962L639818L597183L388952M241300L904779N254670M569095N322309
16731I1398068N702620N734360O356318O367835P177419P144898P048610P696918
16723A44627046P707712P252627P368030O349147N893814M748376M164731K812069
$$ plain form
16715 190923552 192514661 192906590 191178376 188545329 184729709 179423780 173455103 166660320
16707 166660320 159185549 151502701 144019027 135984562 127951119 120751641 113315945 106351822
16699 106351822 99844397 93614552 87867935 82608573 77309763 72795827 68024458 64178288
16691 64178288 60211511 56897335 53783194 50366989 47928206 45439253 43069502 40710826
16683 40710826 38485988 36518846 35054683 33163681 31685219 30110569 28800667 27550596
16675 27550596 26068857 25232960 24180069 22853936 21852578 21225104 20616746 19321804
16667 19321804 18645174 17897645 17353112 16848969 16074397 15526177 14868876 14250806 13928200
16658 13928200 13396102 13033564 12618526 12292378 11557884 11281983 11229391 10694320 10249100
$$ packed form
16715A90923552J591109L91929j728214k633047l815620n305929n968677o794783
16707A66660320p474771p682848p483674q034465q033443p199478p435696o964123
16699A06351822o507425o229845n746617n259362n298810m513936m771369l846170
16691F4178288l966777l314176l114141l416205k438783k488953k369751k358676
16683D0710826k224838j967142j464163j891002j478462j574650j309902j250071
16675B7550596j481739q35897j052891j326133j001358o27474o08358j294942
16667A9321804o76630p47529n44533n04143p74572n48220o57301o18070l22606
16658A3928200n32098l62538m15038l26148p34494k75901n2592n35071m45220
$$ plain form
16649 10249100 10094150 9704105 9626342 9346675 8654806 8467736 8312654 8235256 7917381 7862426
16639 7862426 7543128 6909057 7258293 6803704 6910500 6447053 6681373 6711644 5984893 5842443
16629 5842443 6104562 5753820 5328699 5480940 5347533 5102505 5070454 4815513 4893051 4548191
16619 4548191 4394959 4641766 4276366 4306234 4324429 4310206 3964736 3951487 3823555 3701611
16609 3701611 3546773 3526455 3593679 3607275 3581887 3489921 3543498 3268265 3085362 3101963 3118059
16598 3118059 2969437 2906996 3047644 3207240 3057882 2752090 3043190 2565060 2693337 2476322
16588 2476322 2338987 2294530 2628929 2510615 2489908 2491756 2329373 2038112 1764495 2170433
16578 2170433 2551661 2415112 2001176 1978519 2037949 1957134 2020418 2057806 2065204 1667357 1875955
$$ packed form
16649A0249100j54950l90045p7763k79667o91869j87070j55082p7398l17875n4955
16639G862426l19298o34071L49236m54589J06796m63447K34320L0271p26751j42450
16629E842443K62119l50742m25121J52241j33407k45028l2051k54941P7538l44860
16619D548191j53232K46807l65400K9868J8195j4223l45470j3249j27932j21944
16609C701611j54838k0318O7224J3596k5388r1966N3577k75233j82903J6601J6096
16598C118059j48622o2441J40648J59596j49358l05792K91100m78130J28277k17015
16588B476322j37335m4457L34399j18314k0707J848j62383k91261k73617M05938
16578B170433L81228j36549m13936k2657N9430q0815O3284L7388P398l97847K08598
$$ plain form
16567 1875955 2126037 1792821 1714320 1994938 1504332 1850598 1442376 1689693 1372093 1268468
16557 1268468 1549884 1505868 1625656 1554004 1484053 1501873 1586350 1558343 1388946 1387715 1442547
16546 1442547 1234205 1410576 1523820 1397690 1227126 1228332 1071544 1176951 1596400 1184216
16536 1184216 1357817 1159144 1037272 1205607 1306938 1352494 1231932 1129491 1002584 1144798
16526 1144798 1015691 858011 1074699 853260 1152513 785584 1249719 834810 726260
16517 726260 656580 1011329 1214799 881585 1146248 1120186 941676 969522 843386 691137
16507 691137 745603 736863 967672 781780 899575 964093 1008890 755417 690779 949429 655907
16496 655907 886495 745139 512222 587050 798505 511071 745980 273370 730233 1011447
$$ packed form
16567A875955K50082l33216p8501K80618m90606L46266m08222K47317l17600j03625
16557A268468K81416m4016J19788p1652o9951J7820Q4477k8007j69397j231N4832
16546A442547k08342J76371J13244j26130j70564J206j56788J05407M19449m12184
16536A184216J73601j98673j21872J68335J01331M5556j20562j02441j26907J42214
16526A144798j29107j57680K16688k21439K99253l66929M64135m14909j08550
16517G26260o9680L54749K03470l33214K64663k6062j78510K7846j26136j52249
16507F91137N4466q740K30809j85892J17795O4518M4797k53473o4638K58650k93522
16496F55907K30588j41356k32917P4828K11455k87434K34909B73370M56863K81214
$$ plain form
16486 1011447 391982 850341 701932 596522 366824 565075 427759 808544 753296 529122
16476 529122 694871 563857 977947 741243 566146 833308 526359 473974 60171 633455
16466 633455 351079 394325 664642 721843 415739 405945 725951 261537 558064 760307
16456 760307 435828 382364 789542 370942 409070 843774 418713 486650 528498 724181
16446 724181 476104 473922 432691 246893 325183 496235 393528 461079 255372 460362
16436 460362 266807 591903 619949 479070 565096 386826 434908 241601 879400 669656
16426 669656 323899 269608 363444 428990 239011 306535 283867 99731 400795 604336 311941
16415 311941 447111 149146 369813 242188 189210 367861 338280 323728 189386 524846
$$ packed form
16486A011447C91982M58359j48409j05410k29698J98251j37316L80785n5248k24174
16476E29122J65749j31014M14090k36704j75097K67162l06949n2385F0171N73284
16466F33455k82376M3246K70317N7201l06104r794L20006B61537K96527K02243
16456G60307l24479n3464M07178C70942L8128M34704D18713O7937M1848J95683
16446G24181k48077k182m1231j85798P8290J71052j02707O7551k05707K04990
16436D60362j93555L25096K8046j40879Q6026j78270M8082j93307O37799k09744
16426F69656C23899n4291R3836O5546j89979O7524k2668I9731L01064K03541k92395
16415C11941J35170A49146K20667j27625n2978J78651k9581j4552j34342L35460
$$ plain form
16405 524846 223192 180398 151870 -60268 301960 485234 550514 516702 193483 675809
16395 675809 361060 30681 126853 430907 364455 10534 186180 87239 434985 126496
16384 82070 16460 352202 338493 -43272 207998 251823 462731 74875 81380 -5624 474726
16372 196020 215032 -3030 108941 328678 -21824 -50335 24841 193135 -39325 31534 235056
16361 235056 34694 -177377 210875 47484 346740 68559 41187 121605 121215 -151284 223094
16349 -73950 104645 243494 14467 173537 380164 185622 180437 138754 135087 181812 201201
16338 201201 23634 332994 -62075 -533 335144 75284 346794 172666 211919 207686 38388
16326 6567 376571 316533 201197 111998 26861 -45249 -258663 -42165 -54893 26824 -180979
$$ packed form
16405E24846B23192m2794k8528f0268C01960J83274O5280l3812A93483M82326
16395F75809l14749C0681R6172L04054o6452A0534J75646H7239L47746A26496
16384H2070A6460L35742j3709d3272B07998M3825K10908G4875O505e624D74726
16372A96020J9012c030A08941K19737b1824k8511B4841J68294c9325C1534K03522
16361B35056C4694a77377B10875D7484K99256F8559k7372Q0418l90a51284B23094
16349g3950A04645J38849A4467J59070K06627A85622n185m1683l667M6725J9389
16338B01201B3634L09360f2075e33C35144G5284K71510A72666L9253m233C8388
16326F567L70004o0038j15336q9199B6861d5249k13414d2165j2728B6824a80979
$$ plain form
16314 401342 358713 56985 357786 -88819 132418 180890 -116627 316474 165357 273720
16304 273720 230176 128831 60126 382277 63221 74807 -8727 -307642 3636 78949 -63030
16292 139094 217474 369925 134134 112016 127907 106785 -71519 40487 -176565 -145201 -60242
16280 5464 -33066 -191438 -43663 -101714 108540 330339 158845 109933 358793 69563 -178831
16268 88427 239329 244179 300171 -83663 152285 108930 98861 37188 -141642 163763 346697
16257 346697 134405 62654 -41798 128429 -70131 104507 15475 -46440 -136249 84795 314544
16246 314544 203822 251264 -210666 -25057 245695 173979 -87641 227224 -32691 99835 432949
16235 432949 -86183 -21744 44184 10061 -142478 229571 -87565 -34837 79951 203999 142281
$$ packed form
16314D01342m2629E6985L00801h8819A32418M8472a16627C16474j51117J08363
16304B73720m3544j01345F0126L22151F3221J1586h727k98915C636P5313f3030
16292A39094P8380J52451A34134k2118J5891k1122g1519D0487a76565L1364f0242
16280E464c3066j58372d3663n8051A08540K21799A58845m8912K48860F9563a78831
16268H8427J50902M850N5992h3663A52285m3355j0069C7188a41642A63763J82934
16257C46697A34405F2654d1798A28429g0131A04507A5475d6440q9809H4795K29749
16246C14544j10722M7442b10666b5057B45695p1716h7641B27224c2691I9835L33114
16235D32949h6183b1744D4184A0061a42478B29571h7565c4837G9951J24048o1718
$$ plain form
16224 142281 178382 93999 61179 -130793 112485 -51016 22765 -343508 139408 135814 -264182
16212 70225 -12268 339770 428692 67391 -201862 13292 61007 356810 -105938 -199850 136156
16200 103201 234307 4934 -275695 -197255 16215 -207468 93101 63588 -35107 -47877 160094
16188 65178 22750 141624 215556 98573 -56491 205969 125991 139527 25188 249367 -885
16176 -130674 -287921 16626 -71366 -374921 86903 -308559 -54031 56509 -116914 -253166
16166 -253166 -110608 -49489 -132974 -168437 193585 221434 176503 294350 282544 452561 -155384
16154 172127 -115131 -222906 233368 -12452 -59978 -294440 29389 -98756 -71697 170783
16143 -294196 -439349 -118347 -56248 -93449 -43057 -165505 64882 -44246 77273 34204 -69838
$$ packed form
16224A42281L6101q4383l2820a30793A12485e1016B2765c43508A39408l594b64182
16212G0225a2268C39770Q8922F7391b01862A3292M7715K95803a05938r3912A36156
16200A03201J31106D934b75695P8440A6215b07468I3101k9513c5107j2770A60094
16188F5178B2750J18874P3932I8573e6491B05969p9978J3536B5188K24179h85
16176a30674j57247A6626g1366l03555H6903c08559e4031E6509a16914j36252
16166b53166a10608d9489q3485l5463A93585K7849m4931J17847j1806J70017a55384
16154A72127a15131j07775B33368a2452m7526k34462B9389i8756K7059A70783
16143b94196j45153a18347e6248l7201d3057j22448F4882d4246G7273C4204f9838
$$ plain form
16131 243451 17765 380827 38304 -142020 -13385 262704 126745 -98268 408175 96168
16120 -6606 -355693 -128524 -66004 -266628 -306574 -86835 169130 207720 -25801 38722 -184560
16108 -304414 -67970 15482 98797 -334395 68086 256326 580210 82069 178903 -69122 197069
16096 -85710 -183456 -9424 88579 158477 -212090 -343887 18961 89702 -54175 -152173 -32673
16084 259202 -290552 36849 -322222 58556 69358 -31151 -67587 -76806 258282 -30096 -76323
16073 -76323 -373012 -56689 -143380 -383429 -281222 -155937 -33455 159120 -279885 -105568
16062 -96615 -52452 -296538 51367 -252471 -32190 151462 -125378 159042 -70256 7465 -136042
16050 177764 -43229 -188726 99155 102113 107780 -190579 -137890 -64817 443 -38129 69560 -126539
$$ packed form
16131B43451A7765L63062C8304a42020a3385B62704A26745i8268D08175I6168
16120f606l49087a28524O2520k00624l9946h6835A69130L8590b5801C8722a84560
16108c04414f7970A5482Q3315c34395F8086J88240L23884H2069R6834f9122A97069
16096h5710r7746i424H8579O9898b12090j31797A8961P0741e4175r7998c2673
16084B59202b90552C6849c22222E8556J0802c1151l6436r219B58282c0096m6227
16073g6323k96689e6689q6691k40049J02207J25285c3455A59120b79885a05568
16062i6615M4163k44086E1367b52471c2190A51462a25378A59042g0256G465a36042
16050A77764d3229j45497I9155K958N667a90579N2689f4817D43c8129F9560a26539
$$ plain form
16037 -397344 43838 265414 240382 144424 -41232 -193014 -9327 -182647 -144030 -155232 83874
16025 -236307 207347 -124056 -78376 100454 -50780 71512 60625 -106664 46426 -180064
16014 -122048 -33943 135522 -284206 24809 -95280 -293002 -147435 247995 -327060 47096
16003 153848 -104128 89273 119838 70198 -318854 237929 -143019 242625 229918 98035
15992 -192709 -57551 197367 -57664 -127729 52648 -158149 27206 39142 338994 225928 201961
15981 201961 171879 276767 297716 140003 237632 65571 267101 -4842 -344774 85781 318894
15970 318894 6999 33067 40797 -30965 -67541 47637 43755 256176 -99525 120408 -160498
15958 66308 -140759 14346 -260599 82056 32649 -372900 -125424 -185646 15998 -142981 -276695
$$ packed form
16037c97344D3838K21576k5032r5958d1232j51782i327j73320L8617j1202H3874
16025b36307B07347a24056M5680A00454e0780G1512j0887a06664D6426a80064
16014a22048c3943A35522b84206B4809i5280j97722J45567B47995c27060D7096
16003A53848a04128H9273L0565m9640c18854B37929a43019B42625j2707I8035
15992a92709e7551A97367e7664p0065E2648a58149B7206J1936K99852j13066k3967
15981B01961l0082J04888K0949A40003R7629F5571K01530d842l39932H5781K33113
15970C18894F999K6068P730c0965l6576D7637l882K12421i9525A20408a60498
15958F6308a40759A4346b60599H2056C2649c72900a25424o0222A5998a42981j33714
$$ plain form
15947 -276695 -8455 -122630 -60093 64725 -112213 164397 -113847 -173903 -133962 78597 -75080
15935 -34277 309965 138012 23034 -163491 -428220 -166876 -83041 -291350 -357829 -174530
15924 135784 -417796 -157799 146148 -134338 141902 325463 -125480 -317 55179 64585 -52790
15912 -141376 139661 125222 296060 51283 100231 -83477 49941 -46617 -189822 -124783 -2600
15900 -158828 48090 -190137 -154 132311 -252662 137741 -83773 48468 265891 -124469 -498628
15889 -498628 219818 -91223 -152870 -259960 117473 -120564 60013 -208005 -139697 107196
15878 58603 129317 19006 -214159 -4274 -34729 -126250 -29741 61003 66954 147167 -13129 -118424
15866 -118424 -92944 -42867 55628 6950 -195743 -111488 -12463 -207523 -280736 -69711 -111281
$$ packed form
15947b76695h455j14175f0093F4725a12213A64397a13847o0056L9941G8597g5080
15935c4277C09965A38012B3034a63491k64729a66876h3041k08309o6479a74530
15924A35784d17796a57799A46148a34338A41902J83561a25480c17E5179R406e2790
15912a41376A39661j4439J70838E1283M8948h3477D9941d6617j43205O5039b600
15900a58828D8090a90137a54A32311b52662A37741h3773D8468K17423a24469l74159
15889d98628B19818i1223o1647j07090A17473a20564F0013b08005O8308A07196
15878E8603P0714A9006b14159d274l0455r1521b9741F1003N951Q0213a3129j05295
15866a18424K5480d2867E5628F950a95743Q4255a2463j95060p3213f9711m1570
$$ plain form
15855 -111281 92677 -118928 -71802 135365 -395356 -59797 177993 -294072 -245952 209614
15844 -305297 65964 131724 -185733 -180654 -257168 -85197 208605 73390 -49430 -80075 16707
15832 137723 -45512 -163603 -104962 23052 -84907 -221038 18002 78686 -115950 96504 314530
15821 314530 -321314 46113 327911 163434 -101420 139359 34647 -154678 -34370 -101939
15811 -101939 -161641 -201752 152337 40234 59457 -217412 -99378 182264 -147531 102628
15800 93601 24558 -31837 319895 -52658 -91599 56603 -128712 -17444 -126482 -176401 214493
15788 -15602 -77842 173453 -184496 -13210 190747 117207 129029 -9496 -486641 194121 41482
15776 25582 100365 -182887 -192271 -152182 202956 89395 34814 61363 33609 -24483 33794
$$ packed form
15855a11281I2677a18928M7126A35365c95356e9797A77993b94072M8120B09614
15844c05297F5964O5760a85733N079p6514h5197B08605G3390d9430l0645A6707
15832A37723d5512j18091N8641B3052h4907j36131A8002O0684a15950I6504K18026
15821C14530c21314D6113K81798A63434a01420A39359C4647a54678c4370o7569
15811a01939n9702m0111A52337D0234J9223b17412i9378A82264a47531A02628
15800I3601B4558c1837C19895e2658l8941E6603a28712a7444j09038m9919B14493
15788a5602o2240A73453a84496a3210A90747p3540J1822i496m77145A94121D1482
15776B5582P4783a82887r384M0089B02956H9395C4814K6549k7754b4483C3794
$$ plain form
15764 -11424 43732 108993 -249306 -351688 -55736 14736 253079 107956 26993 -10846 145560
15752 126595 -214520 -61523 -77804 286687 -173518 173535 -439 -96036 86138 135665 109629
15741 109629 406195 31206 -128772 -219680 -220709 -52332 -247734 128291 96782 123930 -193590
15729 -41644 -76642 -188404 -180753 128327 -115647 40663 -88430 156354 -59542 -70867 -174947
15718 -174947 -117631 127818 -218879 6232 -323348 -46867 -140017 -344900 -262060 25487 -159544
15706 -109351 96056 -162155 108620 123629 -383363 -27459 -239271 159662 -301895 132312
15695 -255533 -255887 -162177 -118705 -131987 46794 33568 45870 110282 303489 -9358 123807 275274
15683 275274 -59633 -61897 -196641 -337291 41419 -114266 -246132 -80921 -274416 96242 437883
$$ packed form
15764a1424D3732O5261b49306j02382e5736A4736K38343A07956B6993a0846A45560
15752A26595b14520f1523j6281B86687a73518A73535d39r5597H6138M9527k6036
15741A09629K96566C1206a28772r0908j029e2332j95402A28291l1509K7148a93590
15729d1644l4998j11762P651A28327a15647D0663h8430A56354e9542j1325j04080
15718a74947N7316A27818b18879F232c23348d6867r3150k04883Q2840B5487a59544
15706a09351I6056a62155A08620J5009c83363b7459k11812A59662c01895A32312
15695b55533l54R3710M3472j3282D6794j3226J2302O4412J93207i358A23807J51467
15683B75274e9633k264j34744j40650D1419a14266j31866h0921j93495I6242L41641
$$ plain form
15672 437883 -49900 -36516 36551 227129 201544 -109562 -35833 62563 -6562 -158843 -187123
15661 -187123 22612 -25755 -87053 -48039 -342227 -29237 32660 -83955 -58008 -90153 -90599 118843
15648 330764 183081 -329614 99137 -127462 100368 75295 193834 204440 24533 -305445
15637 18046 106668 -421302 46815 -38525 -155238 137652 305773 -115441 68076 152049 -12945
15625 -1271 231430 -24775 20233 -310935 114593 -16028 -70949 280206 123840 -202227 256077
15613 57136 -432246 -13495 -110461 -243031 333003 116716 64524 -5741 -200861 -250224 -25372
15601 182498 145522 12277 64575 -217321 -145149 -71252 30570 -137622 -134558 -100715 253477
15589 -200605 -211300 109746 -200739 -178696 -155761 37066 -419769 144602 -81769 -84893 -370524
$$ packed form
15672D37883d9900J3384C6551J90578k5585a09562c5833F2563f562j52281k8280
15661a87123B2612b5755o1298L9014k94188b9237C2660h3955K5947l2145m46A18843
15648C30764j47683c29614I9137a27462A00368k5073J18539J0606B4533c05445
15637A8046Q8622d21302D6815c8525j16713A37652J68121a15441F8076Q3973a2945
15625a271B31430b4775B0233c10935A14593a6028n4921B80206A23840b02227B56077
15613E7136d32246a3495r6966j32570C33003A16716n2192e741j95120m9363b5372
15601A82498l6976A2277N2298b17321P2172g1252C0570a37622L064L3843B53477
15589b00605j0695A09746b00739K2043K2935C7066d19769A44602h1769l124k85631
$$ plain form
15578 -370524 383928 -54974 -225405 228676 108547 69850 25133 132561 -283947 142777
15567 -117493 -154589 39400 -144988 -17331 240840 -57864 -233000 174301 -169984 28872
15556 105130 -132385 135411 -48311 -131728 -95744 -279005 -285375 -192524 62103 -210418 -62682
15544 -15865 198651 222227 -82556 -72327 232539 -26008 94487 60763 -141603 50203 20055
15532 128927 -213670 -126494 90172 82017 -232704 86087 -96644 -54680 241429 34931 -4015
15520 248824 22998 -30458 -111143 -36262 1739 -167272 -34073 -283529 324147 -13697 290953
15508 157285 -324203 200692 -1971 -223190 171604 484874 221395 27791 -79541 -116511
15498 -116511 -142327 -123856 -111816 136697 177361 131127 -18906 213136 184477 -122819 307291
$$ packed form
15578c70524C83928e4974j70431B28676A08547l8697B5133J07428b83947A42777
15567a17493l7096C9400a44988a7331B40840e7864j75136A74301a69984B8872
15556A05130a32385A35411d8311q3417L5984j83261o370R2851F2103b10418f2682
15544a5865A98651K3576h2556J0229B32539b6008I4487l3724a41603E0203B0055
15532A28927b13670Q7176I0172q155b32704H6087i6644M1964B41429C4931d015
15520B48824B2998c0458q0685c6262A739a67272c4073k49456C24147a3697B90953
15508A57285c24203B00692a971k21219A71604L13270B21395B7791g9541l6970
15498a16511k5816J8471J2040A36697M0664m6234a8906B13136k8659a22819C07291
$$ plain form
15486 -173609 86069 -88088 -127483 184494 -91954 -105884 55714 280929 182261 187168 -137275
15474 -125149 355259 -143728 -388872 121765 -15256 -59818 91930 35240 -126668 52202
15463 -125853 -100404 -84176 144364 9704 199375 -46061 -89493 -82080 290429 -87564 714 -85829
15450 60785 17931 339221 93835 -64685 -152877 -351619 -188523 317143 -375533 -119640
15439 -191415 147841 106269 203647 461727 -66729 -31670 166372 -15163 62943 -17485 129962
15427 -166805 331724 150093 -168468 -79857 -233694 -133802 -314605 -65782 -200948 211433
15416 -117295 -238139 -4367 68079 -208204 350924 99958 21025 -45901 -177759 -266811 43968
15404 244933 68451 -12807 135766 120169 -415535 -148932 182124 17049 29945 253336
$$ packed form
15486a73609H6069h8088l9395A84494i1954j3930E5714K25215r8668M907a37275
15474a25149C55259a43728k45144A21765a5256m4562I1930C5240a26668E2202
15463a25853K5449J6228A44364I704J89671d6061m3432P413B90429h7564G14h5829
15450F0785A7931L21290I3835f4685q8192j98742J63096C17143c75533a19640
15439a91415A47841m1572R7378K58080f6729c1670A66372a5163F2943a7485A29962
15427a66805C31724A50093a68468g9857j53837R9892j80803f5782j35166B11433
15416a17295j20844d367F8079b08204C50924I9958B1025d5901j31858q9052D3968
15404B44933F8451a2807A35766j5597d15535a48932A82124A7049J2896K23391
$$ plain form
15394 253336 111212 204190 286746 -85734 45719 34109 100654 -2360 -201662 1392 30811
15383 30811 -48474 -228836 -13614 289371 -105659 -205467 -64464 -116981 -114227 -201302 -45546
15371 -231324 207502 64222 -193968 -187728 229161 85190 -231466 17722 23243 -75953 201007
15359 17444 -100548 211617 347605 225131 150264 138881 192569 -117918 -30006 -223421
15349 -223421 92283 -201797 39773 39842 -261865 49009 116979 53329 -20971 42553 -35254 -187393
15337 -187393 3029 -88557 -2410 74557 171361 374344 -131177 13951 -10815 39577 -13050
15325 284984 -9508 29186 -174207 -159960 -60363 -64739 133506 30793 32354 44689 -486935
15313 210883 192850 -67986 -281268 -224584 -226155 43730 -352944 -597 263970 245621 -96461
$$ packed form
15394B53336A11212R2978Q2556h5734D5719j1610O6545b360j99302A392K9419
15383C0811d8474j80362a3614B89371a05659r9808f4464n2517K754q7075d5546
15371b31324B07502F4222a93968O240B29161H5190b31466A7722N521g5953B01007
15359A7444a00548B11617J35988j22474p4867j1383N3688a17918c0006j93415
15349b23421I2283b01797C9773O9b61865D9009O7970E3329b0971D2553c5254j52139
15337a87393C029h8557b410G4557R6804K02983a31177A3951a0815C9577a3050
15325B84984i508B9186a74207J4247f0363m376A33506C0793J561J2335d86935
15313B10883j8033f7986k13282N6684j571D3730c52944e97B63970j8349i6461
$$ plain form
15301 108970 -164926 237076 212591 252744 172441 282947 202270 18729 -198422 -238302 -23889
15289 -12680 155701 28985 127909 187618 -139041 -63247 412553 -294275 309481 -98020 112781
15277 -79270 63490 171915 166144 127721 310898 158482 200345 240677 165935 161938 -35045
15265 278980 -426953 -1794 -127334 176978 -48531 396131 -88883 324721 273624 129925
15254 130394 236056 6412 262812 -6 230123 270668 1030111 1587942 1203331 1159159 1309257
15243 1309257 176415 367319 146190 226713 118793 123384 44464 -117813 122591 110726
15233 110726 225095 213230 -305620 493314 165274 -28465 206978 39294 -231269 -102087
15222 167363 320087 -97734 -211931 74811 361383 101700 104872 236852 -128820 -333684
$$ packed form
15301A08970a64926B37076k4485M0153q0303J10506q0677A8729a98422l9880b3889
15289a2680A55701B8985R8924N9709a39041f3247D12553b94275C09481i8020A12781
15277g9270F3490J08425n771l8423J83177j52416M1863M0332p4742l997c5045
15265B78980d26953a794j25540A76978d8531C96131h8883C24721n1097A29925
15254A30394J05662F412K56400fB30123M0545P59443N57831l84611m4172J50098
15243A309257A76415J90904A46190Q0523j07920M591D4464a17813A22591j1865
15233A10726J14369j1865c05620D93314A65274b8465B06978C9294b31269a02087
15222A67363J52724i7734j14197G4811K86572A01700L172J31980a28820k04864
$$ plain form
15212 -333684 21267 20650 115220 -205497 -138086 -72758 -30600 82457 83054 -80390 -273143 -65425
15199 -63826 -37752 -63981 -142911 232077 82411 -79655 436499 -150965 246921 24615 94055
15188 94055 414851 278774 -43385 -29830 -233610 458926 228869 173681 -53055 -72204 -146786
15177 -146786 -11080 231808 214883 402398 -110808 -199928 159241 274159 358252 185534
15167 185534 45816 117912 -264319 -24112 9758 15007 -19157 -93346 218163 52112 117616
15156 117616 188513 163063 97103 402485 334787 280372 271787 -12229 148651 -222829 243641
15144 -11355 3366 310556 28046 80929 407889 216361 202059 78514 191409 272627 123338
15132 144147 -6176 31423 174552 -71822 128848 -75033 -326472 62481 -258300 -55782 180745
$$ packed form
15212c33684B1267o17R4570b05497O7411O5328c0600H2457N97h0390j92753f5425
15199f3826K6074k6229p8930B32077H2411g9655D36499a50965B46921B4615O9440
15188I4055L20796j36077d3385J3555k03780D58926B28869n5188e3055j9149p4582
15177a46786a1080B31808j6925J87515a10808q9120A59241J14918Q4093j72718
15167A85534D5816P2096b64319b4112I758N249a9157p4189B18163E2112O5504
15156A17616P0897k5450o5960L05382o7698n4415q585a2229A48651b22829B43641
15144a1355C366L07190B8046N2883L26960j91528j4302G8514J12895Q1218A23338
15132A44147f176C1423J43129g1822A28848g5033k51439F2481b58300e5782A80745
$$ plain form
15120 217038 83482 409330 108087 245418 369254 116442 183779 105197 236251 38791
15109 68973 109846 166417 339676 428147 155736 362914 -112682 -114019 -13832 254734 192591
15098 192591 -173324 -21495 143624 -127167 261459 26008 266228 43554 212833 286113
15088 286113 68819 73397 -48216 123987 371831 115862 160461 214623 427476 51617 -33526
15076 -224573 183135 328853 206768 61149 -151661 310542 83923 147975 153979 92163 58007
15065 58007 90875 225319 141762 261818 426481 70139 42193 465685 321192 -5182 -61960
15054 -61960 345176 321825 162149 163914 52033 57200 359112 145192 324735 40616 442261
15043 442261 115852 231575 29998 273968 203431 -186045 348605 396039 242758 133459
$$ packed form
15120B17038H3482L25848A08087J37331J23836A16442O7337p8582J31054C8791
15109F8973M0873N6571J73259Q8471A55736K07178a12682j337a3832B54734o2143
15098A92591a73324b1495A43624a27167B61459B6008K40220D3554J69279P3280
15088B86113F8819M578d8216A23987K47844A15862M4599N4162K12853E1617c3526
15076b24573A83135J45718j22085F1149a51661C10542H3923O4052O004o1816l4156
15065E8007L2868J34444q3557J20056J64663G0139k7946M23492j44493e182n6778
15054f1960C45176k3351j59676J765E2033N167L01912A45192J79543D0616M01645
15043D42261A15852J15723B9998K43970p0537a86045C48605M7434j53281j09299
$$ plain form
15033 133459 292158 111924 143296 -289480 60233 212665 93473 168875 491199 352081
15023 352081 42020 123694 632430 269108 224032 333240 259916 484434 75755 -22073 58222
15011 124139 40268 61897 166382 517098 461580 183677 275896 514167 -40957 155591
15000 2731 262951 242272 379639 30207 89063 171733 278256 245046 293713 155511 353938
14989 353938 299136 336829 562540 219381 233320 -78093 319111 120234 262169 47396
14978 67889 297025 251202 323292 249952 482067 165773 342686 151867 222715 146602 274612
14967 274612 217213 121037 67247 311865 209820 -215286 353760 482386 304791 -231207
14956 -57171 83181 -7123 100686 -10290 495994 26546 325152 255159 150315 482334 190671
$$ packed form
15033A33459J58699A11924L1372b89480F0233J52432I3473P5402L22324j39118
15023C52081D2020Q1674N08736B69108m5076J09208p3324K24518G5755b2073E8222
15011A24139D0268K1629J04485L50716n5518A83677R2219K38271d0957A55591
15000B731K60220k0679J37367C0207N8856Q2670J06523l3210M8667j38202J98427
14989C53938n4802L7693K25711B19381J3939g8093C19111A20234J41935D7396
14978F7889K29136m5823P2090p3340K32115A65773J76913A51867P0848p6113J28010
14967B74612n7399r6176n3790K44618j02045b15286C53760J28626j77595b31207
14956e7171H3181g123A00686a0290D95994B6546K98606o9993j04844L32019A90671
$$ plain form
14944 259816 230241 136494 213892 -86131 338953 362849 410019 204037 366259 407460 182243
14932 342410 -36605 88054 387767 294717 222173 97130 363341 938165 569857 128008
14921 248788 421392 204967 406857 132248 362993 136869 107423 87394 180155 58015
14910 483175 441083 243474 308525 318296 366892 237251 286248 179667 442447 183848 -14552
14898 281376 434973 460444 587638 109569 520069 441719 318824 620981 321091 380629
14888 380629 516377 174261 85392 193956 -96317 416574 411939 181250 398797 288748
14878 288748 588920 140659 140468 202128 377192 392684 266254 527372 651043 223463
14867 475791 388304 481925 425467 224028 -80963 445585 373683 699175 577261 86445 475119
$$ packed form
14944B59816k9575r3747P7398h6131C38953K3896M7170B04037J62222M1201A82243
14932C42410c6605H8054K99713r3050p2544I7130K66211N74824l68308A28008
14921B48788J72604B04967K01890A32248K30745A36869k9446k0029R2761E8015
14910D83175m2092j97609O5051R771M8596j29641M8997j06581K62780A83848a4552
14898B81376J53597K5471J27194A09569M10500p8350j22895L02157k99890N9538
14888C80629J35748A74261H5392J08564i6317D16574m635A81250K17547j10049
14878B88748L00172A40659j91O1660J75064J5492j26430K61118J23671B23463
14867D75791q7487R3621n6458k01439h0963D45585p1902L25492j21914H6445L88674
$$ plain form
14856 475119 445601 508778 378593 534971 284482 382642 334826 599882 216402 508321
14846 508321 428719 -23099 284040 427294 479625 115804 346738 438390 652982 554277
14836 554277 145666 339422 419757 287824 227220 457092 648583 67131 200089 400108
14826 400108 313748 355902 328070 400764 327522 491488 37471 109690 604191 498756 438603
14815 438603 717029 545087 455412 533704 482927 274919 405315 582620 173615 254559
14805 254559 565802 423845 747968 311321 357241 437232 434043 642931 487056 496246 486847
14794 486847 612857 371880 651811 314154 353942 556096 775507 548863 750143 468560
14784 468560 887513 427925 710275 568630 338621 588774 407867 878966 361345 711235
$$ packed form
14856D75119k9518O3177j30185J56378k50489R8160m7816K65056B16402K91919
14846E08321p9602b3099B84040J43254N2331A15804K30934R1652K14592r8705
14836E54277A45666J93756Q0335j31933o0604K29872J91491F7131J32958K00019
14826D00108q6360M2154k7832P2694p3242J63966C7471P2219M94501j05435o0153
14815D38603K78426j71942q9675P8292n0777k08008J30396J77305A73615Q0944
14805B54559L11243j41957L24123C11321M5920P9991l189K08888j55875R190r399
14794D86847J26010k40977K79931C14154L9788K02154K19411k26644K01280k81583
14784D68560M18953D27925K82350j41645k30009K50153j80907M71099C61345L49890
$$ plain form
14774 711235 529675 435421 670755 764784 590080 654764 526101 630339 631313 761329 573409
14763 573409 549961 434336 437721 688835 711799 586902 431989 802860 611824 393207
14753 393207 440452 642044 820984 598480 421441 444794 889687 830422 888687 846835
14743 846835 746322 911644 564303 452211 366269 509422 611896 640430 827148 645973
14733 645973 907080 516930 927755 663877 841487 369862 1113315 617795 995372 749616
14723 749616 815837 766197 625972 632949 753492 675920 1029992 947597 658758 1016072 959591
14712 959591 315350 723053 839461 769679 987435 865805 686246 932691 1143447 486488
14701 686085 1079269 804228 981346 779744 713127 719189 613518 1190198 653658 901330
$$ packed form
14774G11235j81560r4254K35334R4029j74704O4684j28663J04238R74J30016j87920
14763E73409k3448j15625L385K51114K2964j24897j54913L70871j91036k18617
14753C93207M7245K01592J78940k22504j77039K3353M44893n9265N8265m1852
14743H46835j00513J65322l47341j12092q5942J43153J02474K8534J86718j81175
14733F45973K61107l90150M10825k63878J77610C69862P43453m95520L77577k45756
14723G49616O6221m9640j40225O977J20543p7572L54072q2395k88839L57314n6481
14712I59591C15350M07703J16408o9782K17756j21630j79559K46445K10756D86488
14701F86085L93184k75041J77118k01602o6617O062j05671N76680n36540K47672
$$ plain form
14691 901330 879644 616572 657127 1078459 397713 1061134 1107601 861323 1036231 1021108
14681 1021108 1001200 1276426 842730 1154411 1134405 667214 1194173 865286 507246 793381
14671 793381 1161936 922457 875919 766123 946859 1020254 1376068 1177839 994963 1011462
14661 1011462 743514 1082029 1130191 1042309 944131 1327645 1081016 740367 1015392 914331
14651 914331 1163630 1308272 935450 1526782 924533 1153103 918014 1241660 1230235 1152179
14641 1152179 1336345 1346162 1164338 1280469 1510896 1054138 1043761 1413764 1203839 956454
14631 956454 1132180 1188516 1087418 1209968 1054352 1236730 1524626 1526011 1411297 1658983
14621 1658983 961020 1681835 1380551 1245023 1211237 1553018 1166287 1364688 1416248 1204258
$$ packed form
14691I01330k1686k63072M0555M21332C97713O63421M6467k46278J74908j5123
14681A021108j9908K75226m33696L11681k0006m67191N26959l28887l58040K86135
14671G93381L68555k39479m6538j09796J80736P3395L55814j98229j82876J6499
14661A011462k67948L38515M8162q7882r8178L83514k46629l40649K75025j01061
14651I14331K49299J44642l72822N91332o02249K28570k35089L23646j1425p8056
14641A152179J84166R817j81824J16131K30427m56758j0377L70003k09925k47385
14631I56454J75726N6336j01098J22550j55616J82378K87896J385j14714K47686
14621A658983o97963P20815l01284j35528l3786L41781l86731J98401N1560k11990
$$ plain form
14611 1204258 1458908 1505772 1269339 1402446 1569374 1549848 1055043 1848929 1582663 1229854
14601 1229854 1753880 1477194 2006282 1598740 1498625 1688009 1405454 1742430 1778204 1638341
14591 1638341 1524819 1830943 1865598 1399774 1649326 1593199 1875299 1908364 1617925 1573605
14581 1573605 1590683 2277533 1884367 2257515 1772940 2111194 2197031 1875628 2016392 2258877
14571 2258877 2030078 2593787 2073878 2009647 2383494 1913454 2157797 2478322 1926120 2385499
14561 2385499 2363185 2652523 2624552 2841777 3511311 2900487 3013108 3215790 3703174 3844027
14551 3844027 4800424 5491013 7474732 11493264 21905841 36805200 38413214 19983623
14543 19983623 10436287 5555027 3338224 2662747 2335225 1865890 1742408 1924337 2132781
$$ packed form
14611A204258K54650M6864k36433J33107J66928j9526m94805P93886k66266l52809
14601A229854N24026k76686N29088m07542j00115J89384k82555L36976L5774j39863
14591A638341j13522L06124L4655m65824K49552n6127K82100L3065k90439m4320
14581A573605J7078O86850l93166L73148m84575L38254Q5837l21403J40764K42485
14571B258877k28799N63709n19909o4231L73847m70040K44343L20525n52202M59379
14561B385499k2314K89338k7971K17225O69534o10824J12621K02682M87384J40853
14551C844027R56397O90589J983719M018532J0412577J4899359J608014j8429591
14543A9983623r547336m881260k216803o75477l27522m69335j23482J81929K08444
$$ plain form
14534 2132781 1675478 2034927 1863297 2036156 1686792 1893341 1908812 2440214 1935197 2056276
14524 2056276 2244463 2364876 2505908 2569343 2140838 2590985 2298874 2594361 2660322 2482582
14514 2482582 2625009 2536789 2242481 3044750 2870126 2821492 2694948 2867849 2709959 2834492
14504 2834492 2823960 2978550 2517923 3074634 2877380 3241056 3071932 2841433 3024418 3212634
14494 3212634 3131207 3238505 3365678 3154385 3223534 3295454 3328702 3868447 3549962 3416859
14484 3416859 3570118 3693578 3645990 3714725 3862072 3987794 3925727 3497821 3950005 3717243
14474 3717243 4066200 4185836 4203688 4026673 4269527 4150932 4260737 4646901 4075397 4182968
14464 4182968 4545306 4246988 4527750 4519527 4789044 4896410 4771470 4487315 4633805 4821922
$$ packed form
14534B132781m57303L59449j71630J72859l49364K06549J5471N31402n05017J21079
14524B056276J88187J20413J41032O3435m28505M50147k92111K95487O5961j77740
14514B482582J42427q8220k94308Q02269j74624m8634j26544J72901j57890J24533
14504B834492j0532J54590m60627N56711j97254L63676j69124k30499J82985J88216
14494C212634q1427J07298J27173k11293O9149P1920L3248N39745l18485j33103
14484C416859J53259J23460m7588O8735J47347J25722o2067m27906M52184k32762
14474C717243L48957J19636J7852j77015K42854j18595J09805L86164n71504J07571
14464D182968L62338k98318K80762q223K69517J07366j24940k84155J46490J88117
$$ plain form
14454 4821922 4727333 4922525 5162494 5213367 4837296 5521379 5111273 5333876 5203781 5561793
14444 5561793 5628421 5664823 5855778 5928318 5728543 6077283 6061449 5871289 6504937 5917713
14434 5917713 6166120 6475661 6355933 6629813 6557427 6972612 6865186 7155456 6881003 7330037
14424 7330037 7291407 7313541 7157311 7847414 7608787 8075351 7902507 8241689 8043697 8559854
14414 8559854 8514962 8533091 8945931 8696834 9008525 9018192 9228419 9220754 9391444 9439032 9387504
14403 9387504 10067344 10010091 10217321 9943964 10329327 10610581 10693176 11020270 11063120 11306255
14393 11306255 11675694 11991534 11908017 12104168 12083088 12630005 12665500 12837547 12953547 13415452
14383 13415452 13651170 13910722 14036401 14546197 14625040 15216366 15121847 15595511 15750740 16348118
$$ packed form
14454D821922r4589J95192K39969N0873l76071O84083m10106K22603j30095L58012
14444E561793O6628L6402J90955P2540j99775L48740j5834j90160O33648n87224
14434E917713K48407L09541j19728K73880p2386M15185j07426K90270k74453M49034
14424G330037l8630K2134j56230O90103k38627M66564j72844L39182j97992N16157
14414H559854m4892J8129M12840k49097L11691R667K10227p665J70690M7588n1528
14403I387504O79840n7253K07230k73357L85363K81254Q2595L27094M2850K43135
14393A1306255L69439L15840q3517J96151k1080N46917L5495J72047J16000M61905
14383A3415452K35718K59552J25679N09796P8843N91326r4519M73664J55229N97378
$$ plain form
14373 16348118 16252109 16450639 17487886 17395385 17550664 18264104 18621886 18972421 19097987
14364 19097987 19994105 19968238 20638142 21002119 21252935 21787329 22448484 23047688 23487857
14355 23487857 23896303 24315373 24999748 25547422 26165998 26745980 27647429 28389302 29431961
14346 29431961 29801719 30415146 31214787 32210151 32965602 33868804 34678082 35867818 36607277
14337 36607277 37504084 38758892 39840005 41085907 42478535 43559791 44705587 46070148
14329 46070148 47995614 49321696 50961760 52511928 54052286 56270367 58201286 60537120
14321 60537120 62174597 64746651 66928682 69599179 72285560 75066813 77500701 80557319
14313 80557319 83804225 87236917 90908920 94581599 98028742 102509625 106593600 111428241
$$ packed form
14373A6348118r6009J98530J037247r2501J55279P13440L57782L50535J25566
14364A9097987Q96118k5867O69904L63977K50816N34394O61155N99204M40169
14355B3487857M08446M19070O84375N47674O18576N79982R01449P41873J042659
14346B9431961L69758O13427P99641R95364P55451R03202Q09278J189736P39459
14337C6607277Q96807J254808J081113J245902J392628J081256J145796J364561
14329D6070148J925466J326082J640064J550168J540358K218081J930919K335834
14321F0537120J637477K572054K182031K670497K686381K781253K433888L056618
14313H0557319L246906L432692L672003L672679L447143M480883M083975M834641
$$ plain form
14305 111428241 116147229 121343069 126765129 132497488 138592583 145166882 151899671 159205097
14297 159205097 166881043 174690861 183155074 191821938 201332594 211261202 221931288 232688060
14289 232688060 244478237 256615854 268996857 282173245 295828381 309557258 323919338
14282 323919338 338378456 353103321 367645731 381535788 395766931 408562485 420726092
14275 420726092 431508478 440551292 447152018 449431999 447045340 446497909 444988672 440611218
14267 440611218 436732542 430639543 422738147 412249395 399725548 385854326 370948481
14260 370948481 355376336 340025774 324082022 308503467 293543363 278701345 265225843
14253 265225843 252189859 239385832 227386935 215647945 204853775 194134646 184448643
$$ packed form
14305A11428241M718988N195840N422060N732359O095095O574299O732789P305426
14297A59205097P675946P809818Q464213Q666864R510656R928608J0670086J0756772
14289B32688060J1790177J2137617J2381003J3176388J3655136J3728877J4362080
14282C23919338J4459118J4724865J4542410J3890057J4231143J2795554J2163607
14275D20726092J0782386R042814O600726K279981k386659n47431j509237m377454
14267D40611218l878676o092999p901396j0488752j2523847j3871222j4905845
14260C70948481j5572145j5350562j5943752j5578555j4960104j4842018j3475502
14253B65225843j3035984j2804027j1998897j1738990j0794170j0719129r686003
$$ plain form
14246 184448643 175415005 167101129 159220607 151452011 143924746 137350869 131166034 124968142
14238 124968142 119777904 114323381 109562550 104823385 100435634 96145705 92160568 88968359
14230 88968359 84948499 81874109 78628846 75545100 72762408 69941391 67490758 65021216
14222 65021216 62561420 60300357 58579033 56786791 54587981 52857992 50927615 49508052
14214 49508052 48378904 46920045 45538051 43782386 42394674 40983065 40577428 39668024
14206 39668024 38339933 37063069 35825003 34595957 34042162 33500179 32673043 31555999
14198 31555999 30611337 29385164 28758764 28368012 28061962 27096036 25981139 25974971 24834963
14189 24834963 24226762 23848704 23341090 22768553 22267916 21562949 21081954 20754038 19947704
$$ packed form
14246A84448643r033638q313876p880522p768596p527265o573877o184835o197892
14238A24968142n190238n454523m760831m739165m387751m289929l985137l192209
14230H8968359m019860l074390l245263l083746k782692k821017k450633k469542
14222F5021216k459796k261063j721324j792242k198810j729989j930377j419563
14214D9508052j129148j458859j381994j755665j387712j411609m05637r09404
14206C9668024j328091j276864j238066j229046n53795n41983q27136j117044
14198C1555999r44662j226173o26400l90752l06050r65926j114897o168j140008
14189B4834963o08201l78058n07614n72537n00637p04967m80995l27916q06334
$$ plain form
14180 19947704 19656547 19541345 19458718 18933817 18172226 17353216 17466511 16988695 16914476 16270720
14170 16270720 16257973 15805933 15590120 15562185 14934961 14664131 14624192 14292116 13802631 13666211
14160 13666211 13402917 13039246 13150893 12976511 12457682 12653820 11951223 12017428 12113596 11068402
14150 11068402 11238073 11212347 11417415 10664154 10583196 10583051 10505915 10332847 10072157 9573297
14140 9573297 9524854 9818342 9453443 9077978 9026076 9102191 8672395 8591361 8570783 8179646
14130 8179646 8291887 8422916 8250814 7857727 7877816 7585185 8022879 7726333 7665573 7043273
14120 7043273 7231338 7328706 6782464 6897359 6801393 7127442 6872750 6970325 6869618 6916849
14110 6916849 6093441 6403584 6134907 6058552 6217846 5971208 5868503 5887358 5740732 5558386
$$ packed form
14180A9947704k91157j15202q2627n24901p61591q19010J13295m77816p4219o43756
14170A6270720j2747m52040k15813k7935o27224k70830l9939l32076m89485j36420
14160A3666211k63294l63671J11647j74382n18829J96138p02597O6205R6168j045194
14150A1068402J69671k5726K05068p53261q0958j45p7136j73068k60690m98860
14140I573297m8443K93488l64899l75465n1902P6115m29796q1034k0578l91137
14130H179646J12241J31029j72102l93087K0089k92631M37694k96546o0760o22300
14120G043273J88065R7368n46242J14895r5966L26049k54692R7575j00707M7231
14110F916849q23408L10143k68677p6355J59294k46638j02705J8855j46626j82346
$$ plain form
14100 5558386 6000892 5615968 5659929 5679652 5722059 5431813 5216778 5218637 5142067 4935120
14090 4935120 5009702 5014463 5025403 4909997 5290685 5120736 4756345 4574540 4651959 4588594
14080 4588594 4729054 4579807 4728445 4629426 4205162 4492761 4180946 4095787 4121820 4160458
14070 4160458 3938349 4163491 4204178 4223843 4046824 4005398 3908598 3989645 3598826 3675488
14060 3675488 3916443 3835429 3624567 3883178 3870388 3827148 3542747 3630685 3724254 3471267
14050 3471267 3417734 3240071 3192860 3208911 3071232 3141596 3216783 2963812 3209185 2949228
14040 2949228 3066590 3044109 2985747 2961972 3053489 2920219 2940863 2887779 3103036 2680264
14030 2680264 2969163 2905471 3088070 2754060 2523022 2598579 2654227 2516220 2546257 2986675
$$ packed form
14100E558386M42506l84924M3961J9723M2407k90246k15035J859p6570k06947
14090D935120P4582M761J0940j15406L80688j69949l64391j81805P7419o3365
14080D588594J40460j49247J48638r9019m24264K87599l11815q5159K6033L8638
14070D160458k22109K25142M0687J9665j77019m1426r6800Q1047l90819P6662
14060C675488K40955q1014k10862K58611j2790m3240k84401Q7938R3569k52987
14050C471267n3533j77663m7211J6051j37679P0364P5187k52971K45373k59957
14040B949228J17362k2481n8362k3775R1517j33270K0644n3084K15257m22772
14030B680264K88899o3692J82599l34010k31038P5557N5648j38007L0037M40418
$$ plain form
14020 2986675 2637401 2482831 2273341 2128653 2551779 2694248 2557739 2349528 2555685
14011 2555685 2660602 2210137 1965569 2298796 2351667 2523342 2215195 2226513 2488513 2047909
14001 2047909 1875925 2208939 2220077 2161092 2255102 2142412 2275713 2460423 1903930 2194515
13991 2194515 2098198 2800611 3830331 6291808 15488909 31326299 40387317 24234046
13983 24234046 13013565 7781911 5826438 4481125 3881620 3575208 2964864 3044483 2682199
13974 2682199 2712822 3086151 2535926 2113558 2449243 2242481 2226319 1954846 2332905 2198315
13964 2198315 2057103 2496410 2096642 2174906 2124984 2170374 1903389 1916989 2122285 2075302
13954 2075302 2095521 1885308 1903608 1827396 2077312 1670165 1923916 1886119 1601846 1790684
$$ packed form
14020B986675l49274j54570k09490j44688M23126J42469j36509k08211K06157
14011B555685J04917m50465k44568L33227N2871J71675l08147J1318K62000m40604
14001B047909j71984L33014J1138n8985R4010j12690J33301J84710n56493K90585
13991B194515r6317P02413J029720K461477R197101J5837390R061018j6153271
13983B4234046j1220481n231654j955473j345313n99505l06412o10344P9619l62284
13974B682199L0623L73329n50225m22368L35685k06762j6162k71473L78059j34590
13964B198315j41212M39307l99768P8264m9922M5390k66985J3600K05296m6983
13954B075302K0219k10213J8300p6212K49916m07147K53751l7797k84273J88838
$$ plain form
13944 1790684 1959817 1683173 1719615 1557666 1665124 1678766 1877630 1704788 1592558 1643037
13934 1643037 1681239 1609602 1827489 1563741 1458522 1612249 1549989 1208555 1360880 1762129
13924 1762129 1475369 1405828 1348055 1791582 1419303 1481523 1474852 1281042 1866731 1569778
13914 1569778 1316372 1287967 1358079 1708285 1610992 1172331 1418168 1381433 1170399 1166771
13904 1166771 1221830 1092606 1767619 1247026 1244819 1315291 1171111 1539646 1237962 1375646
13894 1375646 1309976 1343125 1374524 1414814 1444493 1207014 1032202 1126701 1534559 1110389
13884 1110389 1349512 1343220 1131404 1202483 1122699 1235215 1004824 1132147 1238115 1395977
13874 1395977 1277090 1183195 999358 1373612 1098824 1052611 987009 1053110 890828 1018110
$$ packed form
13944A790684J69133k76644L6442j61949J07458J3642J98864j72842j12230N0479
13934A643037L8202p1637K17887k63748j05219J53727o2260l41434J52325M01249
13924A762129k86760o9541n7773M43527l72279O2220o671j93810N85689k96953
13914A569778k53406k8405P0112L50206r7293m38661K45837l6735k11034l628
13904A166771N5059j29224O75013n20593k207P0472j44180L68535l01684J37684
13894A375646o5670L3149L1399M0290K9679k37479j74812R4499M07858m24170
13884A110389K39123o292k11816P1079p9784J12516k30391J27323J05968J57862
13874A395977j18887r3895j83837L74254k74788m6213o5602O6101j62282J27282
$$ plain form
13864 1018110 1189189 1270856 1110880 889913 1083179 1001744 719395 903262 1043092 999480
13854 999480 728508 833003 942981 754143 872104 1110924 1109904 779072 1032105 1041942
13844 1041942 1187521 893359 963745 437814 888766 750962 899463 847542 872078 843410
13834 843410 1278355 1071858 901244 562291 940123 1119521 749423 922179 725570 988525
13824 988525 795039 801842 672133 785523 777683 677365 1009510 615683 829696 1039248
13814 1039248 932536 779068 708444 959354 700700 795398 765709 925427 819022 1029956
13804 1029956 982064 1124504 836947 637655 766302 818675 893130 810029 551244 742268
13794 742268 518398 540420 691615 754127 674491 739024 788255 969126 862620 727397
$$ packed form
13864A018110J71079Q1667j59976k20967J93266q1435k82349J83867J39830m3612
13854I99480k70972J04495J09978j88838J17961K38820j020l30832K53033R837
13844A041942J45579k94162P0386D37814M50952j37804J48501n1921K4536k8668
13834H43410M34945k06497j70614l38953L77832J79398l70098J72756j96609K62955
13824I88525j93486O803j29709J13390p840j00318L32145l93827K14013K09552
13814A039248j06712j53468p0624K50910k58654R4698k9689J59718j06405K10934
13804A029956m7892J42440k87557j99292J28647N2373P4455q3101k58785J91024
13794G42268k23870K2022J51195O2512p9636O4533M9231J80871j06506j35223
$$ plain form
13784 727397 915870 379041 675568 565114 541764 107592 878322 711336 711014 1210736
13774 1210736 673841 795441 512560 541373 797352 496152 822736 428091 686926 184736
13763 646150 604805 452339 627640 487769 544570 921587 374801 784814 767981 585469
13753 585469 878264 502712 527739 607551 661614 670401 345298 467114 578038 559454 521480
13742 521480 455173 852911 586189 715256 528728 287747 340073 604694 772870 696046
13732 696046 594359 680054 443395 409412 397381 379072 489570 769339 545135 537166 561499
13721 561499 562663 554577 493424 557661 504096 388496 709121 473889 449194 452241 342718
13710 342718 475798 669628 882414 491259 95465 296932 442376 516000 296118 199189
$$ packed form
13784G27397J88473C79041K96527j10454k3350A07592P70730j66986l22M99722
13774A210736n36895J21600k82881K8813K55979l01200L26584l94645K58835A84736
13763F46150m1345j52466J75301j39871N6801L77017C74801M10013j6833j82512
13753E85469K92795l75552K5027P9812N4063Q787l25103J21816J10924j8584l7974
13742E21480o6307L97738k66722J29067j86528k40981N2326K64621J68176p6824
13732F96046j01687Q5695k36659l3983j2031j8309J10498K79769k24204p969K4333
13721E61499J164q086o1153O4237n3565j15600L20625k35232k4695L047j09523
13710C42718J33080J93830K12786l91155I5465K01467J45444P3624k19882r6929
$$ plain form
13700 199189 296955 335852 386580 586917 642761 547900 694755 529090 429349 622638 220418
13688 633737 653837 529683 686525 668085 639432 104074 569437 470107 677227 627517
13678 627517 512734 525358 377970 529884 677051 694431 341109 259394 196030 574683
13668 574683 416395 334267 278501 486891 501575 418005 414627 226945 253527 376536 387995
13657 387995 419867 691608 259595 230833 92460 530014 600905 498618 332052 491624
13647 491624 455986 401113 535424 153050 542137 354487 567575 291145 694174 931356
13637 931356 570492 706358 434779 282187 320058 351570 158969 244360 289545 358052
13627 358052 349462 436434 395370 332215 550811 570582 260800 347586 280441 546236 479054
$$ packed form
13700A99189R7766L8897N0728K00337N5844r4861J46855j65665r9741J93289B20418
13688F33737K0100j24154J56842j8440k8653A04074M65363r9330K07120m9710
13678F27517j14783J2624j47388J51914J47167J7380C41109q1715o3364L78653
13668E74683j58288q2128n5766K08390J4684q3570l378j87682K6582J23009J1459
13657C87995L1872K71741B59595k8762I2460M37554P0891j02287j66566J59572
13647D91624l5638n4873J34311A53050L89087j87650K13088k76430M03029K37182
13637I31356l60864J35866k71579j52592L7871L1512A58969Q5391M5185O8507
13627C58052q590Q6972m1064o3155K18596J9771B60800Q6786o7145K65795o7182
$$ plain form
13616 479054 300127 517220 292607 139591 412651 681040 333865 228784 378400 445981
13606 445981 346766 243002 409401 251974 374027 617436 242913 349816 314051 396518
13596 396518 571950 121000 240645 152194 131345 33914 390058 459974 187781 377098
13586 377098 153708 287117 405872 283474 232380 442691 27944 283619 26519 476227
13576 476227 490902 84171 39036 454732 551697 298677 235526 466671 376525 78614 216808
13565 216808 235172 290084 25585 216102 266071 330202 83376 -56542 128854 445807 265868
13554 265868 419161 174981 542241 289430 345192 295490 245562 236854 256082 95040 384442
13543 384442 281611 72822 409982 56941 481807 156979 258455 168991 -32331 205595
$$ packed form
13616D79054j78927K17093k24613A39591K73060K68389C33865j05081J49616O7581
13606D45981r9215j03764J66399j57427J22053K43409B42913J06903l5765Q2467
13596C96518J75432A21000J19645q8451k0849C3914L56144O9916A87781J89317
13586C77098A53708J33409J18755j22398n1094K10311B7944K55675B6519M49708
13576D76227J4675H4171C9036M15696R6965k53020o3151K31145r0146G8614J38194
13565B16808J8364N4912B5585J90517M9969O4131H3376e6542A28854L16953j79939
13554B65868J53293A74981L67260k52811N5762m9702m9928q708J9228I5040K89402
13543C84442j02831G2822L37160E6941M24866A56979J01476q9464c2331B05595
$$ plain form
13532 542966 -44503 212421 161409 272885 417844 88363 25450 172526 316469 538901
13522 538901 713922 302868 120640 222022 301430 287349 138531 121870 82563 365260
13512 365260 337375 575105 196609 -131214 240722 465375 195396 313729 365799 246125
13502 246125 440502 438019 487750 -144689 412220 229671 442010 -162345 403424 146461
13491 565995 104290 52024 179468 402932 -99315 182374 294610 271984 120396 201712
13481 201712 377476 501490 -46887 183211 398677 -170498 217527 -15484 367077 -32527
13470 -147449 387898 189734 273428 362769 119801 237076 24299 287948 -42294 148420
13459 286733 404628 152069 121645 390527 40082 458223 218586 45667 197845 -53184
$$ packed form
13532E42966d4503B12421n1012J11476J44959H8363B5450J47076J43943K22432
13522E38901J75021C02868A20640J01382P9408j4081A38531j6661l9307K82697
13512C65260k7885K37730A96609a31214B40722K24653A95396J18333N2070j19674
13502B46125J94377k483M9731a44689D12220j82549K12339a62345D03424A46461
13491E65995A04290E2024J27444K23464i9315A82374J12236k2626A20396Q1316
13481B01712J75764J24014d6887A83211K15466a70498B17527a5484C67077c2527
13470a47449C87898A89734Q3694Q9341A19801J17275B4299K63649d2294A48420
13459B86733J17895A52069l0424K68882D0082M18141B18586D5667J52178e3184
$$ plain form
13448 197271 261905 174851 268235 239780 77129 -104069 -644 -139828 129794 310874 141201
13436 330567 437598 -40812 129652 86162 -16896 293795 161041 227693 226431 -127308 -94632
13425 -94632 -33079 136169 210431 123239 172892 240458 261182 -46565 684658 35336 310461
13414 310461 175033 7844 323323 102229 73362 12184 89073 -105290 570215 173807
13403 149011 -104809 -97561 664128 534088 -58547 321659 249825 5380 113635 249144 220260
13392 220260 329776 151997 266528 352732 479763 142278 -7618 226688 324401 433766
13382 433766 90304 -45021 322757 462034 352942 148824 155450 65722 338690 514812
13372 514812 113117 -52775 204037 76078 26418 -4043 162192 274672 215179 12280 206757
$$ packed form
13448A97271O4634q7054R3384k8455G7129a04069f44j39184A29794J81080A41201
13436C30567J07031d0812A29652m3490a6896B93795j32754O6652j262a27308L2676
13425i4632c3079A36169P4262q7192M9653O7566K0724d6565F84658C5336K75125
13414C10461j35428G844L15479A02229k8867A2184P6889a05290E70215A73807
13403A49011a04809P248F64128j30040e8547C21659p1834E380J08255J35509k8884
13392B20260J09516A51997J14531Q6204J27031A42278g618B26688R7713J09365
13382D33766I0304d5021C22757J39277j09092A48824O626F5722K72968J76122
13372E14812A13117e2775B04037G6078B6418d043A62192J12480n9493A2280J94477
$$ plain form
13361 206757 368841 201098 -129211 100552 308262 498278 -89518 -288089 383337 85304
13350 256373 414138 308220 420833 262499 307660 166666 4680 300181 250691 510489
13340 510489 172736 211707 475273 -13304 468300 206797 232412 210623 379766 293395
13330 293395 154209 361026 158735 162174 146386 335104 382913 -74728 149999 30722 -29063
13318 499229 460455 124139 -58870 192400 76351 147497 -104774 -17057 354332 310147 -5450
13306 19789 257122 158488 317323 394297 127134 135574 -15034 608 -160429 -90797 -50469
13295 -50469 -168559 233127 -39027 44206 183525 73931 108091 58421 53494 373098 -3347
13283 95446 -29652 299253 21329 -17589 342239 -88672 35158 85977 179264 8009 286512
$$ packed form
13361B06757J62084j67743a29211A00552K07710J90016h9518j98571C83337H5304
13350B56373J57765j05918J12613j58334M5161j40994D680K95501m9490K59798
13340E10489A72736L8971K63566a3304D68300B06797K5615k1789J69143q6371
13330B93395j39186K06817A58735L439j5788J88718M7809g4728A49999C0722b9063
13318D99229l8774A24139e8870A92400G6351P1146a04774a7057C54332m4185e450
13306A9789K37333r8634J58835P6974A27134Q440a5034F08a60429O9632M0328
13295e0469j18090B33127c9027D4206J39319G3931L4160m9670m927L19604c347
13283I5446b9652B99253B1329a7589C42239h8672C5158N0819R3287H009K78503
$$ plain form
13272 286512 56175 371675 -6155 -155871 51924 -81706 -117344 358384 245586 223111 397269
13261 397269 89622 355824 365090 119419 -249252 -88215 -9119 189782 -102299 180922 129594
13250 129594 143994 -80877 37534 54049 299098 51643 249056 -233785 -22525 275267 164426
13239 164426 -87004 -27512 -33164 208453 -68019 215937 -123581 358739 -18212 235733 84417
13227 5068 -139186 124687 91575 -186645 243665 159265 343117 289561 -381667 201847
13216 89981 151801 95612 -66063 48274 -5695 105478 144249 -61093 209961 89375 304115
13205 304115 129133 -117095 218287 -48505 153056 -37749 43745 -9098 117989 -103516
13194 155120 188488 -6 -151761 379736 95918 280155 119064 159182 241849 -160371 53675
$$ packed form
13272B86512E6175L15500f155j49716E1924h1706l5638C58384j12798k2475J74158
13261C97269H9622K66202R266A19419b49252h8215i119A89782a02299A80922n1328
13250A29594J4400h0877C7534J6515K45049E1643J97413b33785b2525B75267j10841
13239A64426h7004b7512n652B08453f8019B15937a23581C58739a8212B35733H4417
13227E068a39186A24687l3112a86645B43665q4400J83852n3556c81667B01847
13216H9981O1820n6189f6063D8274e695A05478L8771f1093B09961H9375K14740
13205C04115A29133a17095B18287d8505A53056c7749D3745i098A17989a03516
13194A55120L3368fj51755C79736I5918J84237A19064M0118Q2667a60371E3675
$$ plain form
13182 245805 35411 8065 89031 188233 225476 400976 151428 14237 242054 -202472 102883
13170 178474 352890 106493 -107623 6882 -38049 97675 75660 -69816 76261 115930 -98525
13158 86874 4244 6153 115855 -82947 75278 220550 -100695 -289698 1054 56271 -151144
13146 -264345 244392 -100958 -181311 -100651 266234 -237618 133872 131300 412988 276981
13136 276981 -12917 363869 94011 159331 -158279 234697 44771 -43746 165335 -63075 -75613
13125 -75613 46972 62305 -202713 169295 126500 227900 -71667 41626 -218805 128861 215532
13114 215532 160441 -85556 280974 -205855 -83571 270581 102762 -7289 35800 46632 142244
13103 142244 -171580 6277 145794 -104383 -26409 -172166 19213 192749 -23634 198603
$$ packed form
13182B45805C5411H065Q0966R9202L7243J75500A51428A4237K27817b02472A02883
13170A78474J74416A06493a07623F882c8049I7675k2015f9816G6261L9669i8525
13158H6874D244J909J09702h2947G5278J45272a00695j89003A054N5217a51144
13146b64345B44392a00958q0353Q0660B66234b37618A33872k572K81688j36007
13136B76981a2917C63869I4011O5320a58279B34697D4771d3746A65335f3075j2538
13125g5613D6972J5333b02713A69295m2795J01400g1667D1626b18805A28861Q6671
13114B15532n5091h5556B80974b05855h3571B70581A02762g289C5800J0832R5612
13103A42244a71580F277J39517a04383b6409j45757A9213J73536b3634A98603
$$ plain form
13092 36128 200441 34317 -116309 72926 191863 183992 -33373 185403 -68076 142888 127692
13081 127692 127897 64391 41780 121424 729613 212871 101647 161417 20308 -68015 270163
13069 180264 151432 116659 93458 -18683 39350 246293 -132810 109387 -338 42981 241732
13058 241732 365034 -66217 136942 281721 -13418 13260 196060 44786 -13513 64488 -52391
13046 100436 204554 319078 -54997 219694 113444 -157217 109151 63077 67805 392056
13036 392056 86029 36275 93357 313878 46762 203379 -73293 19635 -355238 453502 235654
13025 235654 80031 78513 -185669 188490 61713 -129350 170485 240203 -415310 367622
13014 88725 481781 -155616 418834 154482 8209 252361 -160697 -170245 334935 -426019
$$ packed form
13092C6128J64313C4317a16309G2926J18937p871c3373A85403f8076A42888j5196
13081A27692K05o3506k2611P9644O08189B12871A01647N9770B0308f8015B70163
13069A80264k8832l4773k3201a8683C9350K06943a32810A09387c38D2981J98751
13058B41732J23302f6217A36942J44779a3418A3260J82800D4786a3513F4488e2391
13046A00436J04118J14524e4997B19694j06250a57217A09151m6074M728L24251
13036C92056H6029C6275N7082K20521D6762J56617g3293A9635c55238D53502k17848
13025B35654H0031j518a85669A88490F1713a29350A70485O9718d15310C67622
13014H8725L93056a55616D18834A54482H209K44152a60697r548C34935d26019
$$ plain form
13003 -84644 83137 152415 203297 79118 -158485 257842 -247215 239401 9982 266569 51693
12991 148397 83889 -53994 201170 64993 -17316 305732 359193 23634 78799 33832 145511
12980 145511 -112383 -21027 182438 -129112 -31615 -19494 33461 405267 109903 209462
12970 209462 102423 139421 -27565 -78240 -175771 -329261 -46620 250387 -100869 126137
12959 74783 33984 196891 -189945 -229508 -31233 137125 102527 76493 56789 -55558 351156
12947 -44638 141166 -216718 160843 155680 -332875 -51510 -38217 -29163 206254 244678 148740
12936 148740 -70568 175410 -47968 94733 301305 -21182 510470 -139658 176481 146632
12926 146632 18608 4510 18393 97148 -7987 99788 -203058 -231620 -36265 147638 -45331
$$ packed form
13003h4644H3137O9278N0882G9118a58485B57842b47215B39401I982K56587E1693
12991A48397o4508e3994B01170F4993a7316C05732N3461B3634N5165C3832J11679
12980A45511a12383b1027A82438a29112c1615J2121C3461L71806A09903R9559
12970B09462A02423L6998b7565n0675r7531j53490d6620B50387a00869A26137
12959G4783C3984J62907a89945l9563c1233A37125l4598k6034j9704e5558C51156
12947d4638A41166b16718A60843n163c32875e1510J3293R054B06254L8424r5938
12936A48740g0568A75410d7968I4733K06572b1182E10470a39658A76481k9849
12926A46632A8608D510J3883P8755g987I9788b03058k8562c6265A47638d5331
$$ plain form
12914 436952 -131398 -144873 52862 -133686 252006 -20142 -207418 -44090 -95610 124985
12903 218698 99760 228502 272166 301033 -102247 -91391 164361 -62613 -33399 -256765 -492940
12892 -492940 -345159 126448 231772 -116281 430734 -31997 -36761 276503 -29541 -121798
12882 -121798 164682 163516 -84653 -88465 225372 83755 -29819 25707 265018 128393 -54106
12870 -263643 -23207 33436 -126891 79374 305403 396084 220534 -108090 160708 452550
12860 452550 -78452 227226 -13754 214596 -252556 -75958 129493 13693 77079 -46952 63616
12848 -10288 -41696 36101 209447 -67863 -102855 65171 -16846 -140378 250815 5473 -91226
12836 13115 -431178 -182197 250737 -72398 80729 -36050 133024 -13859 -169637 -133766 -274506
$$ packed form
12914D36952a31398j3475E2862a33686B52006b0142j87276d4090n1520A24985
12903B18698I9760J28742M3664K8867a02247J0856A64361f2613K9214k23366k36175
12892d92940J47781A26448J05324a16281D30734c1997m764B76503b9541r2257
12882a21798A64682j166h4653l812B25372H3755b9819B5707K39311A28393e4106
12870b63643b3207C3436a26891G9374K26029R0681j75550a08090A60708K91842
12860D52550g8452B27226a3754B14596b52556g5958A29493A3693O3386d6952F3616
12848a0288l1408C6101J73346f7863l4992F5171a6846j23532B50815E473i1226
12836A3115d31178a82197B50737g2398H0729c6050A33024a3859j55778L5871j40740
$$ plain form
12825 -274506 -8927 109601 158666 114473 130678 220527 -82677 -13999 -137487 -196924 -116223
12814 -116223 -242676 162712 -137427 -10840 37999 -174950 -328008 -167204 -103397 276676
12803 289898 -133985 -124053 -177858 -103398 40282 -23165 203009 181882 -128594 -254536 -83088
12791 -95631 -205456 347448 -58283 325263 -122961 177953 -175854 -39400 4240 -342495
12780 -49282 34039 -165332 -43127 269690 85312 54332 38330 161750 206012 -113524 150101
12768 447204 127414 50357 57810 49659 -8785 -56152 47984 -62823 90150 -53472 -192171 177145
12755 -35793 4927 75745 141581 316445 242486 -217 -36904 231907 123068 218100 44130 104969
12743 104969 12539 -88506 335077 -38869 47194 184187 68154 207502 83371 190020 409337
$$ packed form
12825b74506h927A09601M9065m4193J6205Q9849h2677a3999j23488n9437Q0701
12814a16223j26453A62712a37427a0840C7999a74950j53058J60804O3807B76676
12803B89898a33985R932n3805P4460D0282b3165B03009k1127a28594j25942h3088
12791i5631j09825C47448e8283C25263a22961A77953a75854c9400D240c42495
12780d9282C4039a65332d3127B69690H5312l0980j6002J23420M4262a13524A50101
12768D47204A27414E0357P453q151h785m7367D7984f2823I0150e3472j38699A77145
12755c5793D927P0818O5836J74864p3959b17l6687B31907j08839R5032D4130O0839
12743A04969A2539h8506C35077c8869D7194J36993F8154J39348H3371J06649K19317
$$ plain form
12732 409337 63137 201245 -11231 -139316 278538 -45651 551852 174268 45286 87400
12722 87400 -6449 -149877 -102122 -296499 -30346 -26247 114214 -123069 -372075 95193 116552
12711 116552 11168 65727 193127 29118 -17941 548278 42824 91925 381723 453307 15114
12699 61626 -214934 -64313 -29345 120508 -77327 81192 -32094 19262 240644 -88675 228760
12687 202874 239466 393374 -87388 198857 163520 -48070 -117245 127168 140281 249262 203941
12676 203941 -21116 335036 34326 -35460 312198 53759 -92492 -91859 254933 80020 64314
12665 64314 164619 79447 -173302 -2314 -252265 26628 -58611 349863 85594 278634 303835
12654 303835 14055 26974 327998 312363 -51749 -113899 -109023 38412 -108488 16624 -20878
$$ packed form
12732D09337F3137J38108a1231j28085B78538d5651E51852A74268D5286M2114
12722H7400f449j43428M7755j94377c0346M099A14214a23069k49006I5193K1359
12711A16552A1168N4559J27400B9118a7941E48278D2824M9101K89798P1584A5114
12699F1626b14934f4313b9345A20508g7327H1192c2094A9262K21382h8675B28760
12687B02874L6592J53908h7388A98857l5337d8070o9175A27168J3113J08981m5321
12676B03941b1116C35036C4326c5460C12198E3759i2492O33B54933H0020j5706
12665F4314J00305G9447a73302b314k49951B6628e8611C49863H5594J93040K5201
12654C03835A4055J2919L01024j5635e1749o2150M876C8412a08488A6624b0878
$$ plain form
12642 118838 -25940 -56841 -284293 -10731 261763 65101 31475 127372 -140353 68958 52601
12631 52601 31471 381944 340987 145519 -40435 71255 117785 120723 123784 190284 447650
12620 447650 466732 -387346 200687 23795 -30443 65937 -70560 89427 -399568 -51705 263039
12608 -77265 64222 72217 317372 -9878 109562 215044 -95957 143828 196271 425524 -76869
12596 310993 268372 203556 91099 -60333 11206 -68006 4778 285933 -150579 320347 48688
12584 -410509 162708 19338 121923 62990 68725 37883 296760 49275 97730 77159 710
12572 -235589 -15351 -75510 -98171 -317906 50723 32354 197430 -129416 -120259 290636 -88430
12560 286136 14225 87410 -28693 -277569 269676 16045 -235164 105377 68503 -408201
$$ packed form
12642A18838b5940l0901k27452a0731B61763F5101C1475R5897a40353F8958j6357
12631E2601k1130L50473m0957A45519d0435G1255M6530K938L061O6500K57366
12620D47650J9082c87346B00687B3795c0443F5937g0560H9427c99568e1705B63039
12608g7265F4222P995K45155i878A09562J05482i5957A43828N2443K29253g6869
12596C10993m2621o4816I1099f0333A1206f8006D778K81155a50579C20347D8688
12584d10509A62708A9338J02585n8933N735l0842K58877D9275M8455k0571G10
12572b35589a5351o0159k2661k19735E0723j8369J65076a29416R157B90636h8430
12560B86136A4225P3185b8693k48876B69676A6045b35164A05377l6874d08201
$$ plain form
12549 -250450 66848 4589 41123 141545 -141749 79024 162062 67914 -43682 86666 -260586
12537 -68040 143044 407714 206111 97907 -16132 141689 -47012 -34250 9331 62707 146784
12526 146784 -234643 9917 22080 110524 111890 41973 -254013 -118452 220056 15130 238774
12515 238774 -148083 -30295 361039 6210 115569 -35432 -133087 164464 147597 -6228 14513
12503 355060 199751 229748 73409 -226078 -2674 140355 -15849 -145827 -124621 -224240 391434
12491 -117567 21814 -148695 -302692 125497 -2368 -84699 -92758 200493 -90525 363918 13277
12479 -59928 -252037 102538 -79666 53766 201388 -146799 -303222 -197164 17443 -743 -48650
12468 -48650 -226499 -49990 69057 -46421 -8176 164284 149026 318467 103053 205205 -85274
$$ packed form
12549b50450F6848D589L6534J00422a41749G9024Q3038F7914d3682H6666b60586
12537f8040A43044K64670k01603I7907a6132A41689d7012J2762I331N3376Q4077
12526A46784b34643I917J2163Q8444J366D1973b54013a18452B20056A5130K23644
12515B38774a48083c0295C61039F210J09359c5432r7655A64464j6867f228A4513
12503C55060j55309K9997G3409b26078b674A40355a5849j29978K1206r9619C91434
12491a17567B1814a48695j53997A25497b368q2331q059B00493i0525C63918A3277
12479e9928j92109A02538g9666E3766J47622a46799j56423J06058A7443g43m7907
12468d8650j77849d9990F9057d6421h176A64284j5258J69441A03053J02152h5274
$$ plain form
12456 -6502 180985 -61437 184608 -45665 -76380 122634 168844 -146912 -246196 94933 -89649
12444 368239 -225587 223944 -276978 -323609 -139744 -220800 317895 -231652 64094 70265
12434 70265 -3728 -198105 107967 237338 133907 37930 -134575 -151785 191725 -264903
12423 -192646 -115592 50618 199199 385666 -11316 -73752 77801 -281070 159533 -185440
12412 -6275 -41532 73380 -136363 -182770 37667 -60797 70895 -108991 -325348 118254 -52854
12400 52849 170737 -90544 -166503 194686 -252645 142384 -25079 73072 -186592 58170 -228855
12388 -364281 -9193 132695 -348049 -83336 -168887 -276659 -30493 259301 165659 -106031 11101
12376 57752 -71937 -309634 -6326 -52753 96251 72778 129679 -209542 -3254 -64232 140972
$$ packed form
12456f502A80985f1437A84608d5665l0715A22634M6210a46912r9284I4933h9649
12444C68239b25587B23944b76978m6631a39744q1056C17895b31652F4094O171
12434G0265c728j94377A07967J29371j03431C7930a34575j7210A91725b64903
12423a92646P7054E0618J48581J86467a1316o2436G7801b81070A59533a85440
12412f275l5257G3380a36363m6407C7667f0797G0895a08991k16357A18254e2854
12400E2849J17888i0544p5959A94686b52645A42384b5079G3072a86592E8170b28855
12388c64281i193A32695c48049h3336q5551j07772c0493B59301r3642a06031A1101
12376E7752g1937k37697f326m6427I6251k3473N6901b09542c254o0978A40972
$$ plain form
12364 85713 25210 -130616 -11546 103520 -124598 85577 456821 -241897 316970 -8278 396677
12352 111662 -508953 200284 -86431 97388 362039 -24866 60556 73507 195489 103536 -103964
12340 152564 -118880 -218352 79455 -24593 48755 -58068 -155579 52779 43405 -9787 -85439 316685
12327 -47406 194907 115965 -130827 49941 170814 180883 140052 -141911 55897 -148802 259933
12315 228278 196844 -314808 -59103 175548 -108701 164102 -53761 -104906 55614 -163272
12304 46900 121786 -49788 260133 -95229 -11546 -7090 58873 -128359 294181 390431 264046
12293 264046 1173 91192 231946 -149482 -109841 73087 228131 -90349 -44188 81603 496400
12282 496400 -244835 104418 -10869 84514 -37708 113556 -125037 273574 198426 227676
$$ packed form
12364H5713B5210a30616a1546A03520a24598H5577L71244b41897C16970h278C96677
12352A11662e08953B00284h6431I7388K64651b4866F0556J2951J21982r1953a03964
12340A52564a18880r9472G9455b4593D8755e8068r7511E2779r374i787p5652C16685
12327d7406A94907p8942a30827D9941J20873J0069m0831a41911E5897a48802B59933
12315B28278l1434c14808e9103A75548a08701A64102e3761n1145E5614a63272
12304D6900P4886d9788B60133i5229a1546M456E8873a28359B94181R6250j26385
12293B64046A173R0019J40754a49482L9641G3087J55044i0349d4188H1603M14797
12282D96400b44835A04418a0869H4514c7708A13556a25037B73574p5148K9250
$$ plain form
12272 227676 364911 163192 64749 216658 128067 -181292 88488 341319 782 25397 90776
12261 90776 -87141 95984 181377 81519 -94526 -3584 -71981 -179920 -24147 -17556 -98372 96887
12248 -17060 313806 314788 -150417 60324 286172 103876 125464 -177980 -170701 80143 -161425
12236 86345 -67177 133438 -84447 -145856 247651 287718 -352087 81370 151759 50741 213643
12225 213643 250331 370340 284509 31833 -91267 95915 195077 198045 174922 -114403 -53770
12213 -11738 142970 361066 -61901 51620 104970 200456 250231 15842 171173 174860 86886
12201 31419 -42247 186523 225623 265530 181506 109705 -287026 102630 181801 188878 416982
12190 416982 49441 -93131 293020 144765 -241626 190494 396183 271190 -129386 253794
$$ packed form
12272B27676J37235A63192F4749J51909q8591a81292H8488K52831G82K4615O5379
12261I0776h7141I5984Q5393H1519i4526c584o8397j07939b4147O591q0816I6887
12248a7060C13806R82a50417F0324K25848A03876K1588a77980P279H0143a61425
12236H6345f7177A33438h4447o1409B47651M0067c52087H1370P0389E0741J62902
12225B13643L6688J20009q5831C1833i1267I5915R9162K968k3123a14403e3770
12213a1738A42970K18096f1901E1620N3350R5486M9775A5842J55331L687H6886
12201C1419d2247A86523L9100L9907q4024p1801b87026A02630P9171P077K28104
12190D16982D9441i3131B93020A44765b41626A90494K05689j24993a29386B53794
$$ plain form
12179 244716 264845 347870 325825 100200 62977 156581 -4626 -42920 154812 368634 224935
12168 224935 42310 -127125 -115285 214019 32859 -17620 61202 -75155 -71651 -71189 -24548 -140505
12156 -140505 -174012 -137812 -139166 69341 80851 -305016 -63550 -69495 -196463 98899 245496
12145 245496 39210 -62791 -130427 142101 -168960 264212 28483 138023 152261 201399 44370
12133 -170238 -99491 -179367 117781 11385 260867 104824 363369 156603 164771 159959 -154503
12121 68628 -53515 -78789 43538 113725 1354 -264882 176119 151185 59495 137579 283780
12110 283780 274483 60099 -162750 -354591 344319 -19175 17047 -99661 149480 180647 146667
12099 146667 39659 -133855 -96253 231422 40622 -40467 76877 -88267 -299981 -102044 202514
$$ packed form
12179B44716K0129Q3025k2045A00200l7223R3604d626l8294A54812K13822j43699
12168B24935D2310a27125J1840B14019C2859a7620F1202g5155L504M62b4548j15957
12156a40505l3507L6200j354F9341J1510c05016f3550n945j26968I8899J46597
12145B45496C9210f2791o7636A42101a68960B64212B8483J09540J4238M9138D4370
12133a70238P0747p9876A17781A1385K49482A04824K58545A56603Q168m812a54503
12121F8628e3515k5274D3538P0187A354b64882A76119k4934E9495P8084J46201
12110B83780r297F0099a62750j91841C44319a9175A7047i9661A49480L1167l3980
12099A46667C9659a33855L7602B31422D0622d0467G6877h8267k11714a02044B02514
$$ plain form
12087 220251 -236881 150416 -61820 -92296 139608 109047 140530 85355 331452 1122168
12077 1122168 2022412 843595 152462 -343434 119221 -244903 63817 47318 -212180 162952
12066 282560 -230458 9725 -89200 -81298 199472 226358 264551 179377 200612 -78663 -166546
12055 -166546 97963 -149426 355196 166129 -19179 -27633 293650 34243 94594 -197636 159456
12043 -50130 -39629 11210 -109862 66619 -155623 162535 123822 -325053 -125949 -71901 86558
12031 -46400 121081 93696 254196 -60343 102943 -159997 -350960 -201113 33052 -33719
12020 -38920 78191 -196766 -86422 148807 56379 -164196 79624 -221488 -156459 30132 10800
12008 65229 79882 -93813 152089 -148950 -4920 -163296 334 150990 -196345 -29183 71316
$$ packed form
12087B20251b36881A50416f1820l0476A39608l0561L1483n5175K46097P90716
12077A122168R00244H43595A52462c43434A19221b44903F3817j6499b12180A62952
12066B82560b30458I725h9200P902A99472K6886L8193q5174K1235g8663q7883
12055a66546I7963a49426C55196A66129a9179q454B93650C4243O0351a97636A59456
12043e0130J0501A1210a09862F6619a55623A62535l8713c25053a25949N4048H6558
12031d6400A21081k7385J60500f0343A02943a59997j90963J49847C3052c3719
12020c8920G8191a96766h6422A48807E6379a64196G9624b21488O5029C0132A0800
12008F5229J4653i3813A52089a48950d920j58376C34J50656a96345b9183G1316
$$ plain form
11996 48576 -67277 199679 51769 -95550 -60823 -219661 53951 251914 75818 199614 -3768
11984 127326 -33193 141872 84491 7430 -418 -43602 237769 -105558 -126846 72921 36631
11973 36631 -10156 -223318 124500 52668 -274986 -78016 47346 -96213 273251 423081 142459
11961 -47160 137191 -110797 31529 76730 -68929 140948 -50773 157313 190059 -191941 166509
11949 176676 -324389 24801 -240904 -152837 -35295 279321 8331 -11460 -229467 -195474 -242085
11938 -242085 -124843 73553 189344 -20739 19193 64101 255547 -134777 6301 -115984 -121863
11927 -121863 -335012 -275888 120830 -14 -166968 -9059 -112571 4969 -1469 -48652 64012 -53365
11914 -185905 148084 -152903 -139744 -80248 -26696 -71987 256257 -41584 238073 -193502
$$ packed form
11996D8576f7277A99679E1769i5550L4727j58838E3951J97963G5818J23796c768
11984A27326c3193A41872n7381G430d18m3184B37769a05558k1288G2921l6290
11973C6631a0156k13162A24500E2668b74986g8016D7346i6213B73251J49830A42459
11961d7160A37191a10797C1529M5201f8929A40948e0773A57313L2746a91941A66509
11949A76676c24389B4801b40904Q8067c5295B79321H331a1460k18007L3993m6611
11938b42085J17242G3553J15791b0739A9193M4908J91446a34777F301a15984n879
11927a21863k13149N9124A20830a4j66954i059j03512D969a469m7183F4012e3365
11914a85905A48084a52903J3159N9496b6696m5291B56257d1584B38073a93502
$$ plain form
11903 -138462 254765 2509 -198477 -57944 -122337 -265720 40567 80882 270753 -37907 234543
11891 -9152 -93089 145590 -51880 -121996 -77019 24500 -225985 -108388 -65057 -242325 6335
11879 -179627 -902 234625 271602 -57656 -150807 -74694 -288062 -103530 141286 201999 -98760
11867 153004 30970 -58682 -34875 187465 -232009 -405291 126436 27643 18458 -7692 192594
11855 -239867 58171 448552 -263300 184445 296604 -52292 -274929 -368497 -122041 -18394
11844 -240164 5291 -367436 356345 -284671 -202368 148554 152706 -61498 -155651 -107728 -286466
11833 -286466 -178907 240619 -98352 -53443 26974 42248 -53604 187354 -291359 79803 -193053
11821 -3979 19027 -79167 -129223 138068 -418676 7839 294317 -55327 -52319 111985 53920
$$ packed form
11903a38462B54765B509a98477e7944o4393j43383D0567M0315J89871c7907B34543
11891i152q3937A45590e1880p0116M4977B4500b25985a08388M3331j77268F335
11879a79627i02B34625L6977e7656r3151g4694k13368a03530A41286O0713i8760
11867A53004C0970e8682K3807A87465b32009j73282A26436B7643r185g692A92594
11855b39867E8171L90381b63300A84445J12159e2292k22637r3568a22041a8394
11844b40164E291c67436C56345b84671Q2303A48554M152f1498r4153M7923j78738
11833b86466J07559B40619i8352M4909B6974J5274e3604A87354b91359G9803a93053
11821c979A9027g9167n0056A38068d18676G839K86478e5327L008A11985E3920
$$ plain form
11809 -250502 -381749 -93914 -47674 -127173 -127862 -167824 25760 -10960 -92742 56107 162894
11798 162894 -137705 -44775 -67231 174384 183495 163837 88481 14496 -229648 -167521 -25046
11786 -256728 89744 233559 58883 -31808 78470 431720 5287 77892 -230817 143426 134166
11775 134166 -205369 -319046 -96610 -34315 21977 -175735 -195598 -130245 -244676 118070
11764 157511 18922 57160 -324745 -264194 -231072 123458 67536 73863 95550 46231 11339
11752 -78559 65344 -149871 122008 -122545 201578 18383 -202584 83539 63466 -24743 -236306
11741 -236306 250108 162952 1036 -163898 -4064 27172 -19118 -483415 -170098 -55586 129200
11729 -142710 116117 13004 -171162 157126 3175 -177045 50327 -79089 185406 -166293
$$ packed form
11809b50502j31247i3914M6240p9499o89l9962B5760a0960q1782E6107J06787
11798A62894a37705d4775k2456A74384R111j9658p5356A4496b29648O2127b5046
11786b56728H9744J43815E8883c1808G8470L53250E287P2605b30817A43426r260
11775A34166b05369j13677i6610c4315B1977a75735j9863O5353j14431A18070
11764A57511A8922L8238c24745O0551L3122A23458n5922O327K1687D6231A1339
11752g8559F5344a49871A22008a22545B01578A8383b02584H3539k0073b4743k11563
11741b36306B50108q7156A036a63898d064B7172a9118m64297a70098e5586A29200
11729a42710A16117A3004a71162A57126C175a77045E0327g9089A85406a66293
$$ plain form
11718 39152 64113 32135 -591976 121986 -24304 -45712 41372 -43732 -165195 -131119 66434
11706 -209584 132280 -15815 -84726 123353 -167201 107491 217341 30119 -191857 6448
11695 333085 172331 47821 -195246 21953 102142 191442 35001 209233 51486 228280 -126594
11683 228117 49837 642923 215067 -90555 -80651 -28427 243051 185085 13250 97896 -80108
11671 -55628 -160319 98791 -119866 -303130 61282 -131525 135802 -21879 26901 25071 -95694
11659 -4308 175138 -6149 183802 91092 59136 56783 -85445 51795 57568 -191038 164960 -159306
11646 -235383 30936 25758 78539 306328 189832 334942 134111 108910 233864 170921 -114417
11634 166097 36429 -99065 -159815 208786 154448 413117 72939 48194 376798 319112 -3084
$$ packed form
11718C9152K4961l1978e91976A21986b4304k1408D1372d3732j21463L4076F6434
11706b09584A32280a5815o8911A23353a67201A07491J09850C0119a91857F448
11695C33085j60754D7821a95246B1953Q0189Q9300C5001J74232E1486J76794a26594
11683B28117D9837N93086B15067i0555R904b8427B43051n7966A3250Q4646h0108
11671e5628j04691I8791a19866j83264F1282a31525A35802b1879B6901j830i5694
11659d308A75138f149A83802I1092l1956k353h5445E1795N773a91038A64960a59306
11646b35383C0936n178N2781K27789j16496J45110A34111k5201J24954o2943a14417
11634A66097C6429i9065o0750B08786n4338K58669G2939k4745L28604n7686c084
$$ plain form
11622 -98411 187335 15737 -6742 -304219 102406 302152 148486 -86647 -13750 -96346 39233
11610 -61266 76806 333343 330392 -32617 -206461 -19900 -221256 174691 251229 199196 156827
11599 156827 102717 221053 40534 48523 -28926 -54774 -49729 -68406 125633 345374 43986
11587 113853 -137951 -147826 199166 18613 -9277 92271 70264 -205796 65775 -39113 185555
11575 252875 -114328 164137 -43526 -93627 64017 -38702 81009 25877 949 173857 227616
11564 227616 9937 -186447 144878 80248 -31981 357756 73449 193470 88043 204791 135360
11553 135360 167182 -218028 380248 112175 240829 307440 479158 224642 56340 244011
11543 244011 116607 125552 -85782 246037 -23272 -33859 -13064 -91281 215689 -87882 73152
$$ packed form
11622i8411A87335A5737f742k97477A02406J99746A48486h6647a3750q2596C9233
11610f1266G6806K56537k951c2617j73844a9900k01356A74691P6538n2033m2369
11599A56827n4110J18336D0534P989b8926k5848N045j8677A25633K19741D3986
11587A13853a37951r875A99166A8613i277I2271k2007b05796F5775c9113A85555
11575B52875a14328A64137d3526n0101F4017c8702H1009B5877I49J72908N3759
11564B27616I937a86447A44878o4630c1981C57756G3449J20021H8043J16748o9431
11553A35360L1822b18028C80248A12175J28654O6611J71718B24642E6340J87671
11543B44011A16607Q945h5782B46037b3272j0587a3064p8217B15689h7882G3152
$$ plain form
11531 63004 249143 59610 -2207 -87675 -31132 -80533 5117 416962 343174 35014 248636
11520 248636 64534 -331825 235834 71160 294305 197546 -32559 -375291 189971 70538
11509 244059 435256 182380 130810 168748 361313 108497 386650 -63394 327755 315882
11499 315882 445716 44882 237783 311282 379754 208474 -17973 58362 209984 -56123 -259544
11488 -259544 215418 172679 -75343 -107014 76348 46088 213771 419273 316605 97443 -111583
11476 196585 219988 220706 -48436 47660 49793 334324 43969 10099 118960 48376 450054
11465 450054 274853 407675 -82801 -27180 956 12246 377130 -41526 287134 -296877 -306810
11454 -306810 135481 33262 -109784 20047 -18293 -202317 27754 -115358 125901 153048
$$ packed form
11531F3004J86139E9610b207q5468c1132m9401E117M11845p3788C5014K13622
11520B48636F4534c31825B35834G1160K23145r6759c2559l42732A89971G0538
11509B44059J91197A82380n1570L7938J92565A08497K78153f3394C27755j1873
11499C15882J29834D4882J92901P3499O8472j71280a7973E8362J51622e6123k03421
11488b59544B15418m2739g5343l1671G6348l0260J67683K05502j02668I7443a11583
11476A96585K3403P18d8436D7660K133K84531D3969A0099J08861D8376M01678
11465D50054j75201J32822h2801b7180I56J1290L64884d1526B87134b96877r933
11454c06810A35481C3262a09784B0047a8293j84024B7754a15358A25901K7147
$$ plain form
11444 153048 82511 216851 185691 130418 -51879 -69644 300371 111363 45553 -115336 -198156
11433 -198156 302787 231078 -39505 -253567 -90130 -101842 -180742 -132180 -45671 201260 217630
11422 217630 382124 23517 113927 27396 -80961 25654 186402 342688 112839 -1127 -153561
11411 -153561 -166572 272140 -22818 -299905 -93012 -31864 215388 44430 59257 -111869 3416
11399 27895 -49737 211825 181431 75542 87948 27731 79571 -221953 -237335 -40520 -4378
11387 -90064 48608 -112383 49085 330653 -190885 86203 -467942 -287771 -41442 -22647 -57147
11376 -57147 90690 -327305 118158 -260349 162979 -158467 165175 -228302 -108358 166902
11365 175517 -107902 -31794 -93027 -73325 47484 -4370 214945 33478 -120586 -81447 -137199
$$ packed form
11444A53048p0537J34340l1160n5273e1879j7765C00371A11363D5553a15336q2820
11433a98156C02787p1709c9505k14062i0130j1712p8900M8562d5671B01260J6370
11422B17630J64494B3517R0410B7396h0961B5654J60748J56286A12839a127j52434
11411a53561j3011B72140b2818k77087i3012c1864B15388D4430J4827a11869C416
11399B7895d9737B11825l0394G5542J2406B7731N1840b21953j5382d0520d378
11387i0064D8608a12383D9085K81568a90885H6203d67942J80171d1442J8795l4500
11376e7147I0690c27305A18158b60349A62979a58467A65175b28302a08358A66902
11365A75517a07902c1794o1233J9702D7484d370B14945C3478a20586L9139n5752
$$ plain form
11354 -137199 207994 6182 -33936 -16599 68389 -425561 70984 105854 65912 -138376 -112536
11343 -112536 121139 -3670 134104 -78282 -17293 90868 315328 -91616 -32016 -99434 8208
11331 25930 -165549 -2555 -180038 4193 -95454 241437 -407021 -86839 87354 325093 -272913
11319 147136 -133375 -13618 -52881 -248814 250369 61442 103407 -236169 -63781 -63364 272057
11307 -194325 112308 36487 -45864 -256425 152061 -57809 -91827 37487 21036 145635 20459
11295 126275 157492 159205 -51649 150892 -62976 -22244 -90385 -225510 -230223 49049 -74211
11283 -22184 251052 -89638 -164677 -71910 -26999 -175382 -121635 65765 17072 89621 -210147
11271 95333 65070 -208897 -39838 -422446 -219971 77989 -223190 -91677 -101000 -157586 7562
$$ packed form
11354a37199B07994F182c3936a6599F8389d25561G0984L4870l9942a38376K5840
11343a12536A21139c670A34104g8282a7293I0868K24460i1616c2016o7418H208
11331B5930a65549b555j77483D193i5454B41437d07021h6839H7354K37739b72913
11319A47136a33375a3618l9263j95933B50369F1442M1965b36169f3781M17B72057
11307a94325A12308C6487d5864k10561A52061e7809l4018C7487j6451J24599B0459
11295A26275L1217J713e1649A50892f2976b2244o8141j35125m713D9049g4211
11283b2184B51052h9638p5039g1910b6999j48383N3747F5765A7072P2549b10147
11271I5333l0263b08897c9838l82608K02475G7989b23190i1677r323n6586G562
$$ plain form
11259 97918 156989 79481 -102901 -189659 -63676 -204731 -206639 -30189 -175795 220654 -48665
11247 -40536 -90084 74596 -339051 -244003 -89320 15560 -221486 -277912 -91828 235140 28507
11235 -32312 114339 -421671 -199511 -300863 23601 222980 -275233 -42952 223086 151563
11225 151563 -199844 182376 -138898 -230905 84472 -145444 72850 -175579 -268571 -221755
11215 -221755 -116697 145438 190375 281580 63342 -260926 304229 79164 9247 7780 66476
11204 66476 -49299 -216600 -54660 158 63272 -169393 -280683 -37016 -17187 -266481 249978
11192 349485 39813 -173494 -85527 -317721 -883 229306 -21562 63336 144726 50297 -74920
11180 200797 -31656 65117 -86715 -31436 -229476 80925 -117069 -331730 -122667 -392430
$$ packed form
11259I7918N9071p7508a02901q6758f3676j41055j908c0189j45606B20654d8665
11247d0536m9548G4596c39051R5048h9320A5560b21486n6426i1828B35140B8507
11235c2312A14339d21671a99511j01352B3601J99379b75233d2952B23086p1523
11225A51563a99844A82376a38898r2007H4472a45444G2850a75579r2992M6816
11215b21755J05058A45438M4937R1205F3342b60926C04229G9164I247j467N8696
11204F6476d9299j67301e4660A58O3114a69393j11290c7016a7187k49294B49978
11192C49485C9813a73494h5527k32194h83B29306b1562F3336Q1390E0297g4920
11180B00797c1656F5117h6715c1436j98040H0925a17069k14661a22667k69763
$$ plain form
11170 -392430 -153350 18105 -37561 55363 117156 -21486 149648 -204967 -211875 64293 -69538
11158 -129547 -92863 121611 140341 -122068 -65571 -127500 203423 -89074 -71440 174666 197087
11147 197087 327953 -67992 -189043 29453 82210 164821 -230692 235225 97993 300431
11137 300431 -6157 60061 216356 -153679 -146825 69385 145774 7678 289170 123682 228923
11126 228923 66471 65508 -346849 13697 364978 88121 116267 385891 -26371 -211134 -121495
11115 -121495 32381 264809 169761 184308 410601 -30912 -265683 -30665 213841 -47013 396331
11103 -131611 195980 113479 291976 -34606 297352 10636 221855 267658 96205 377487
11093 377487 1847 153103 -109090 520450 171213 4771 194509 208387 218415 349428 -205420
$$ packed form
11170c92430a53350A8105c7561E5363O1793b1486A49648b04967o908F4293f9538
11158a29547L6684A21611J8730a22068N6497o1929B03423h9074J7634A74666K2421
11147A97087J30866f7992j21051B9453N2757Q2611b30692B35225I7993K02438
11137C00431f157F0061J56295a53679O854F9385P6389G678K81492A23682J05241
11126B28923F6471r63c46849A3697L51281H8121K8146K69624b6371j84763Q9639
11115a21495C2381K32428r5048J4547K26293c0912k34771c0665B13841d7013C96331
11103a31611A95980q2501J78497c4606B97352A0636K11219M5803I6205K81282
11093C77487A847J51256a09090E20450A71213D771J89738J3878J0028J31013b05420
$$ plain form
11081 371631 245668 281148 -11805 379792 154928 179977 222959 352472 361415 459122 375529
11070 375529 132494 645854 431162 459429 183771 271507 479219 269504 529214 664087
11060 664087 568143 195572 360331 476536 598119 396688 584034 700566 613122 671388
11050 671388 917496 470484 860690 823187 337193 698621 996851 1115754 766754 740714
11040 740714 574743 492627 793578 784156 449978 530673 615166 669369 698541 369593 547382
11029 547382 746084 635795 701557 907182 684090 595986 830367 702451 597634 729947
11019 729947 488020 715201 590769 688054 185086 736385 317404 795085 481859 528869
11009 528869 668280 634952 554446 623627 720234 594411 601171 734875 412898 533708 941907
$$ packed form
11081C71631j25963L5480a1805C79792A54928K5049M2982J29513Q943R7707q3593
11070C75529A32494N13360k14692K8267A83771Q7736K07712k09715K59710J34873
11060F64087r5944A95572J64759J16205J21583k01431J87346J16532q7444N8266
11050F71388K46108m47012L90206l7503C37193L61428K98230J18903l49000k6040
11040G40714j65971q2116L00951r422l34178Q0695Q4493N4203K9172l28948J77789
11029E47382J98702j10289O5762K05625k23092q8104K34381j27916j04817J32313
11019G29947k41927K27181j24432R7285A85086N51299C17404M77681l13226M7010
11009E28869J39411l3328q0506O9181R6607j25823O760J33704l21977J20810M08199
$$ plain form
10998 941907 489040 391945 900071 747313 525256 728371 701395 788970 759037 1044451
10988 1044451 753486 1037324 996945 830304 700199 939577 1003685 1042357 1066472 1257858
10978 1257858 1414189 1730434 1522404 2221042 2279446 2193659 2726349 2390250 2800304 2532660
10968 2532660 2565302 2233563 1693900 1840079 1511641 1718201 1624405 1736924 1724196 1499194
10958 1499194 2003439 1960222 1477736 1538776 1636497 1038916 1082597 1139763 1040262 901899
10948 901899 421044 462521 321020 618482 193409 439164 390007 123588 135274 258215
10938 258215 177930 -190870 35178 -172322 125548 52251 121937 147959 -27720 -88253 -90144
10927 -90144 127948 54237 213754 -941 244863 30852 43684 -93944 27634 175763 192599
$$ packed form
10998I41907m52867r7095N08126j52758k22057K03115k6976Q7575k9933K85414
10988A044451k90965K83838m0379j66641j30105K39378O4108L8672K4115J91386
10978A257858J56331L16245k08030O98638N8404q5787N32690l36099M10054k67644
10968B532660L2642l31739n39663J46179l28438K06560r3796J12519j2728k25002
10958A499194N04245m3217m82486O1040R7721n97581M3681N7166r9501j38363
10948I01899D21044M1477j41501K97462A93409K45755m9157A23588J1686J22941
10938B58215q0285a90870C5178a72322A25548E2251O9686K6022b7720o0533j891
10927i0144A27948E4237J59517i41B44863C0852J2832i3944B7634J48129J6836
$$ plain form
10916 192599 -55946 257158 62471 76412 -187183 -84714 -89372 -13307 278462 -20743 -16318
10905 -16318 174242 30249 25340 -6500 83019 333432 96240 -59256 89204 142134 -48319 -252303
10893 -252303 -249383 -77109 -199369 -93566 105799 -22488 73243 218265 114844 -139826 -283258
10882 -283258 38100 -115897 -188842 216178 1437 -50504 -223055 304333 -25790 125562 28004
10870 145469 168295 -72320 352303 -62374 -40339 -333034 240348 -50766 -112449 -25317 -82563
10859 -82563 91235 -70067 -25750 96741 238322 84173 52333 91870 -433430 -300673 145334
10847 -28293 135205 60049 -176068 36366 -2131 7893 170205 -45326 6943 -311966 -81192
10835 -107739 -189057 -48365 167599 -46102 -303758 84089 7168 -92567 72302 -71713 52307
$$ packed form
10916A92599e5946B57158F2471J3941a87183h4714m658a3307B78462b0743M425
10905a6318A74242C0249m909f500H3019K50413I6240e9256H9204N2930d8319k03984
10893b52303K920g7109j22260i3566A05799b2488G3243J45022j03421a39826j43432
10882b83258C8100a15897p2945B16178A437e0504j72551C04333b5790A25562B8004
10870A45469K2826g2320C52303f2374K2035k92695B40348e0766o1683b5317n7246
10859h2563I1235g0067b5750I6741J41581H4173l1840L9537d33430J32757A45334
10847b8293A35205F0049a76068C6366b131G893J62312d5326F943c11966h1192
10835a07739q1318d8365A67599d6102k57656H4089G168i2567G2302g1713E2307
$$ plain form
10823 -101842 -44663 128295 -43339 -67533 114801 59526 -235059 -236831 -191210 19632 -487856
10811 -235932 -206346 147325 1627 -42516 -89450 -17709 163688 -142852 247311 -205856 -114068
10800 -114068 -234827 -123894 -221624 -11831 16979 -270800 98036 -368313 195813 -10637
10789 -379630 42088 200056 -64880 88388 89144 -19436 -264803 -30336 -153222 15903 89413
10778 89413 165300 -232188 -140481 -351737 -299021 301870 -193880 -5587 38540 -177721 -131280
10767 -131280 132855 2887 -151516 -17398 -154957 40367 87970 -36520 54957 71881 -100860
10755 -104773 20995 -90933 189656 191814 -53919 -42429 -171134 -256265 265568 -59946 97900
10743 -54437 -296222 -32338 51966 177321 207113 35647 -186481 -37382 9688 -52584 17478
$$ packed form
10823a01842d4663A28295d3339k4194A14801n5275b35059j772M5621A9632d87856
10811b35932K9586A47325A627d2516m6934a7709A63688a42852B47311b05856R1788
10800a14068j20759J10933r7730a1831A6979b70800I8036c68313A95813a0637
10789c79630D2088J57968f4880H8388P56a9436k45367c0336j22886A5903P3510
10778H9413P5887b32188R1707k11256N2716C01870a93880e587C8540a77721M6441
10767a31280A32855B887a51516a7398j37559D0367M7603c6520E4957J6924a00860
10755a04773B0995i0933A89656K158e3919J1490j28705q5131B65568e9946I7900
10743e4437k41785c2338E1966J25355K9792C5647a86481c7382I688e2584A7478
$$ plain form
10731 -78513 -136943 137741 -146224 -100805 -98543 37085 -53471 -430869 -177782 -58700 -384521
10720 -384521 74172 -141348 -204898 102189 -47323 111380 -322016 -402863 141322 45724
10709 -224898 -40 360632 132954 180106 39514 -18130 66482 -190333 5142 84438 -20196 6988
10696 63460 308745 -330558 -192483 -283084 -115587 -37300 -110404 -89620 -12311 106962 -135203
10684 -122258 6792 -195793 96700 62474 -452541 1768 77953 -89415 -56015 491493 -64952
10672 175189 210851 -27712 -160371 50749 -425603 111359 -202469 -33018 -409377 -193837
10661 -104849 -172332 43231 -69227 156219 130441 191449 -28119 117979 117743 -143109 -175734
10650 -175734 -347136 -38230 -432173 -247696 -180531 -102340 120212 138736 76691 -225509
$$ packed form
10731g8513n8430A37741a46224M5419K262C7085e3471l77398a77782e8700l25821
10720c84521G4172a41348o3550A02189d7323A11380c22016q0847A41322D5724
10709b24898d0C60632A32954M7152C9514a8130F6482a90333E142P9296b0196F988
10696F3460K45285c30558J38075r0601a15587c7300p3104K0784a2311A06962a35203
10684a22258F792a95793I6700l4226d52541A768P6185h9415L3400D91493f4952
10672A75189L5662b7712j32659E0749d25603A11359b02469c3018l76359a93837
10661a04849o7483D3231f9227A56219k5778O1008b8119A17979k36a43109l2625
10650a75734j71402c8230l93943J84477O7165P8191A20212J8524o2045b25509
$$ plain form
10639 -152849 -226006 -49811 17897 16289 195771 -62527 158845 -172932 -306134 -131325 131931
10627 22722 -50691 95095 -90038 -155348 -180130 293907 -138331 -303397 -81656 -318599 -60824
10615 -31701 43586 -168512 -283124 23042 -398337 -301254 -37737 73809 -227316 -296128 -103023
10603 -58018 -37073 -57865 -888 -187791 33857 -341670 -312402 -403078 -46969 46806 127918 -159566
10590 120135 82847 66330 -86407 -236273 -85103 -191729 24968 193055 7827 198039 -60867
10578 319936 -183565 114162 -96631 -78227 140216 70045 154564 22576 -127108 -31224 -298466
10567 -298466 -169081 -108031 -36683 -219665 -37929 -337495 147390 237781 -37919 59653 -75513
10555 205503 303872 -140149 136982 -85101 -17744 -225555 -125347 19439 26920 59630 156999
$$ packed form
10639a52849p3157d9811A7897j608J79482f2527A58845a72932j33202a31325A31931
10627B2722e0691I5095i0038o5310k4782B93907a38331j65066h1656k36943f0824
10615c1701D3586a68512j14612B3042c98337R7083c7737G3809b27316o8812a03023
10603e8018K0945k0792h88j86903C3857c41670K9268r0676d6969D6806Q1112a59566
10590A20135l7288j6517h6407j49866h5103j06626B4968J68087G827J90212f0867
10578C19936a83565A14162i6631J8404A40216G0045Q4519B2576a27108c1224k67242
10567b98466J29385O1050c6683j82982c7929k99566A47390R0391c7919E9653g5513
10555B05503R8369a40149A36982h5101a7744k07811J00208A9439P481L2710R7369
$$ plain form
10544 156999 6346 340898 43200 -152440 176852 -139203 -178830 -9589 -93988 -175393 -137185
10533 -137185 -3678 -245734 -92413 -260932 -312319 24939 145491 -45685 227129 119149 -120435
10521 88071 -29467 -26814 14664 234479 -235028 161927 -198530 37938 -129142 226475 -155318
10509 61736 95975 -211903 125806 142065 55036 232274 117636 30603 -100789 -76321 -32383
10497 254073 -238067 70335 168065 -434707 -54719 -214330 220842 73250 -155079 13876
10486 -293313 -148430 199252 303796 220501 139052 414946 697913 340001 62473 421205
10476 421205 -87318 -199956 203482 -130575 184335 45575 -37648 -36114 -63557 61928 193614
10465 193614 212338 7064 143473 -146896 -167854 -47427 -65566 18066 191051 -176790 59135
$$ packed form
10544A56999F346L34552D3200a52440A76852a39203l9627i589q4399q1405L8208
10533a37185c678k42056i2413j68519n1387B4939J20552d5685B27129j07980a20435
10521H8071b9467K653A4664K19815b35028A61927a98530C7938a29142B26475a55318
10509F1736L4239b11903A25806J6259E5036J77238j14638C0603a00789K4468c2383
10497B54073b38067G0335R7730d34707e4719j59611B20842G3250a55079A3876
10486b93313J44883A99252J04544q3295q1449K75894K82967C40001F2473L58732
10476D21205h7318j12638B03482a30575A84335D5575c7648J534k7443F1928J31686
10465A93614J8724G064J36409a46896k0958d7427j8139A8066J72985a76790E9135
$$ plain form
10453 -78633 81387 232878 -54913 2740 -395898 5741 1272 3157 -15917 -75335 -10999 -40369
10441 -40369 262042 288902 -217089 -56737 -67897 -229641 138546 2008 120967 -348119 -20821
10429 339421 -204989 -50947 -103923 -50022 -201906 -253373 3688 342691 -29372 -314982 291940
10417 341609 74063 -304303 -122838 55096 -178100 -38477 47519 -34325 235646 -223125
10406 -123602 -3871 -135284 104848 -178760 25770 279169 42496 -77684 -61363 -20046 -111177
10395 -111177 -91819 107835 152171 -89243 124347 281460 -40715 78592 176542 127775 219652
10384 219652 5601 -199141 44411 -84044 -148070 125831 72991 50843 202557 332482 259705
10373 259705 96036 -35385 43769 221604 217396 117800 502552 507199 395628 402057 186274
$$ packed form
10453g8633H1387J51491e4913B740c95898E741A272J885a5917n9418a0999k9370
10441d0369B62042K6860b17089e6737j1160j61744A38546B008J18959c48119b0821
10429C39421b04989e0947n2976e0022j51884n1467C688L39003b9372k85610B91940
10417C41609G4063c04303a22838E5096a78100c8477D7519c4325B35646b23125
10406a23602c871j31413A04848a78760B5770K53399D2496g7684J6321b0046r1131
10395a11177J9358A07835M4336h9243A24347J57113d0715G8592R7950m8767R1877
10384B19652E601a99141D4411h4044o4026A25831n2840k2148J51714J29925p2777
10373B59705I6036c5385D3769J77835m208r9596L84752M647j11571O429A86274
$$ plain form
10361 302040 330891 221986 228536 276220 274234 357946 -35471 305841 330174 283219 550873
10350 550873 310291 564769 152203 455944 152329 345227 112761 244464 288826 200387
10340 200387 180627 149674 97963 -91478 86942 -7324 365028 -234691 68487 149895 -324680
10328 114768 -53271 -412789 -44441 102096 -178025 609067 134458 192684 -143766 462748
10317 3222 936 138469 574012 118200 85770 -76406 141161 -369513 -4572 59821 -188005
10305 -187327 49224 244548 318536 239459 -529720 175002 285037 32505 49491 68679 40783
10294 40783 174953 -304383 -97301 -28661 -36271 -47996 -311984 7838 83046 -128996 90222
10282 58482 -41816 -117518 -395872 64690 84145 25515 -173420 2994 58559 10625 -108828
$$ packed form
10361C02040K8851j08905O550M7684j986Q3712c5471C05841K4333m6955K67654
10350E50873k40582K54478A52203L03741A52329J92898A12761J31703M4362q8439
10340B00387j9760l0953n1711i1478H6942g324C65028b34691F8487Q1408c24680
10328A14768e3271l59518d4441A02096a78025F09067A34458N8226a43766D62748
10317C222I36J37533M35543A18200l2430g6406A41161c69513d572E9821a88005
10305a87327D9224J95324P3988p9077e29720A75002J10035C2505J6986J9188k7896
10294D0783J34170c04383i7301b8661p610j1725k63988G838P5208a28996I0222
10282E8482d1816p5702k78354F4690J9455B5515a73420B994N5565A0625a08828
$$ plain form
10270 -97883 164073 -143630 44552 4113 103659 78411 -122601 55298 166556 146692 149877
10259 149877 325967 390847 194699 106897 271147 3450 51307 -111256 143582 86096 -57053
10247 58432 -323705 86191 -30347 11234 -122144 -102498 68635 -117586 -289469 276141 -20529
10235 -190650 29403 -121635 9817 26262 -90628 -81431 -102352 -96318 -12008 -126 190250 -200987
10222 -247186 213986 -170630 -143791 155236 -170214 -379633 -92992 -234882 -9387 -301166
10212 -301166 36007 312850 266907 170792 -14226 102242 -85572 -111984 -231556 -309909 -270197
10201 -270197 -47061 -14803 -82645 113910 38332 92572 -196145 120210 -357950 10697 197544
10190 197544 26278 133536 242962 -117280 119154 -183651 87040 -277182 -306840 -84824
$$ packed form
10270i7883A64073a43630D4552D113R9546k5248a22601E5298J11258j9864L185
10259A49877J76090O4880A94699q7802J64250C450M7857a11256A43582n7486e7053
10247E8432c23705H6191c0347A1234a22144J9646F8635a17586j71883B76141b0529
10235a90650B9403a21635I817J6445i0628R197k0921O034a2008a26A90250b00987
10222b47186B13986a70630K6839A55236a70214k09419i2992j41890i387k91779
10212c01166C6007K76843m5943r6115a4226A02242h5572k6412j19572p8353L9712
10201b70197d7061a4803o7842A13910C8332N4240a96145A20210c57950A0697J86847
10190A97544B6278J07258J09426a17280A19154a83651H7040b77182k9658h4824
$$ plain form
10179 70605 -390407 15071 -123723 -282569 -139030 186927 149415 -157182 113819 -75630
10168 -335592 158262 -20089 -178225 88953 366682 -65663 -223906 -47240 -90269 -56683 63671
10156 80275 -68529 -319532 321635 278914 135321 -6088 -218402 17508 108442 122749 -55014
10144 -140287 -246037 -168852 -230997 -124936 281644 -323272 -5354 -179605 -67562 199950
10133 -278131 76732 -500025 -224886 -632 115151 171911 -141467 -270494 -397947 -61939 -4172
10121 -268843 -23361 -255793 115820 -214837 -100286 -146130 32710 -164553 -22612 273754
10110 -194065 -77845 -422007 110169 -116849 79057 84145 171422 41834 -71383 -89197 16822
10098 -27500 -143624 -44463 -68700 -80991 34384 -77796 -196022 -35265 200404 -154860 381312
$$ packed form
10179G0605c90407A5071a23723j58846a39030A86927l7512a57182A13819g5630
10168c35592A58262b0089j58136H8953K77729f5663j58243d7240m3029L3586F3671
10156H0275f8529k51003C21635m2721A35321f088k12314A7508R0934J4307e5014
10144a40287j05750P7185o2145J06061B81644c23272e354j74251f7562A99950
10133b78131G6732e00025b24886f32A15151N6760a41467j29027j27453f1939d172
10121b68843b3361k32432A15820b14837a00286m5844C2710a64553b2612B73754
10110a94065g7845l44162A10169a16849G9057N088Q7277D1834g1383j7814A6822
10098b7500j16124d4463k4237j2291C4384g7796j18226c5265B00404a54860C81312
$$ plain form
10086 -258476 -22163 86077 5987 127780 -124026 79677 113435 -125158 -22370 -174840 213038
10074 -107948 122887 47911 127221 53701 136638 156510 -67071 -405994 -104133 40238 -64669
10062 259231 -238423 255370 49471 11270 -163954 -94669 -179136 -219298 54301 187449 -279275
10050 -363444 -224770 -33985 -350254 99681 -88368 -25477 55507 -260568 -82649 -262049 -269069
10039 -269069 -167245 -162618 174900 -230123 -61467 -76632 -289466 202034 -73422 -197070
10029 -197070 -184272 -132116 -233779 -47121 269111 225107 -163278 -99388 293763 -145400
10018 -253595 -167358 -202589 163703 -194115 -13416 -421719 -110665 -45840 -193293 -56369
10007 -127152 106925 -65931 -26115 -32980 102006 -267348 130466 -132180 145680 -170768
$$ packed form
10086b58476b2163H6077E987J21793a24026G9677L3758a25158b2370j52470B13038
10074a07948A22887D7911P9310E3701Q2937J9872f7071l38923a04133D0238f4669
10062B59231b38423B55370D9471A1270a63954O9285q4467m0162E4301J33148b79275
10050c63444J38674c3985l16269I9681h8368b5477E5507b60568h2649j79400p020
10039b69069J01824M627A74900b30123f1467j5165k12834B02034g3422j23648
10029a97070J2798N2156j01663d7121B69111m4004a63278O3890B93763a45400
10018b53595Q6237l5231A63703a94115a3416m08303a10665d5840j47453e6369
10007a27152A06925f5931b6115o865A02006b67348A30466a32180A45680a70768
$$ plain form
9996 65529 11127 -60201 -97737 -125121 -453022 -208590 -349400 4193 -147653 -33680 30914
9984 -229367 -252150 -274102 274791 -212088 -303001 -190035 -69450 198951 -96481 -124001 -26191
9972 -6336 79150 147800 -33560 146075 -33520 -116842 -257821 -130515 -291568 226887 -393704
9960 -251866 -97219 -87996 120030 -18232 -346881 -6743 -9815 -160823 -70951 -64171 -361381 -200633
9948 -200633 29032 30175 177725 -25621 311262 185539 -16589 -365128 -93940 -52853 -60486
9937 -60486 77062 103937 187100 -71845 -133764 -79436 -32398 -31409 102409 63214 -281806 281056
9924 77752 -215437 -208276 220394 -152447 -24396 -55238 81115 72939 50259 -79929 -219444
9913 -219444 -46851 155487 -182294 -198139 -69843 64328 -121370 -308205 83718 117742 -156677
$$ packed form
9996F5529A1127f0201l7536k7384l27901b08590j40810D193a47653c3680C0914
9984b29367k2783k1952B74791b12088r0913J12966f9450A98951i6481k7520b6191
9972f336G9150O8650c3560A46075c3520q3322j40979J27306j61053B26887c93704
9960b51866i7219R223A20030a8232l28649f743l072j51008g0951O780k97210J60748
9948b00633B9032J143J47550b5621C11262j25723a6589l48539i3940M1087p633
9937f0486G7062K6875Q3163g1845o1919N4328c2398R89A02409l9195b81806B81056
9924G7752b15437P161B20394a52447b4396l0842H1115q176k2680g9929j39515
9913b19444d6851A55487a82294j5845f9843F4328a21370j86835H3718L4024a56677
$$ plain form
9901 -219593 380621 -195081 -285203 -138590 446 -158124 14433 35003 -252365 -180980 123811
9889 -320110 45479 -198053 -106969 82245 -97562 -34647 -66316 -147907 -263800 -127785 -42570
9877 -200170 -92548 -64346 -104347 65513 398448 48925 203601 -38548 -278397 -50706 -175897
9866 -175897 -106206 -126031 -80288 121127 14800 -67657 66463 33198 90219 -114367 432218
9854 280266 -268059 -319903 72747 -29412 123336 -7177 277094 107798 -71788 -84318 67864
9842 80641 -159686 -135276 -214045 -311022 -147334 -406487 235282 -110752 -130060 -215795 -217985
9831 -217985 -62533 -113108 -221297 134813 -141833 157745 182438 7526 102053 -224727 -204296
9820 -204296 -240999 -302300 60304 -125224 -11771 186643 35245 -256897 203397 221250 -167529
$$ packed form
9901b19593C80621a95081r0122a38590D46a58124A4433K0570b52365P1385A23811
9889c20110D5479a98053R1084H2245i7562c4647l1669q1591j15893a27785d2570
9877b00170i2548K8202m0001F5513L32935D8925J54676c8548k39849e0706j25191
9866a75897O9691j9825M5743A21127A4800f7657F6463C3198N7021a14367D32218
9854B80266b68059n1844G2747b9412A23336g177B77094A07798g1788j2530F7864
9842H0641a59686K4410p8769r6977a47334k59153B35282a10752j9308q5735k190
9831b17985f2533n0575j08189A34813a41833A57745K4693G526R4527b24727K0431
9820b04296l6703o1301F0304a25224a1771A86643C5245b56897B03397J7853a67529
$$ plain form
9808 -47071 412333 69223 -56937 -196491 116252 -395174 -16508 305290 -46584 -230740 -81304
9796 -21348 -45140 -44254 -255627 -370808 -194226 -250004 -120256 3170 76872 -193015 -126155
9785 -126155 111791 141444 56718 105109 -29780 -51622 -308511 -145090 -88857 -341042 -43089
9773 -132842 89708 -213605 -155881 186956 -239153 -97856 -196774 -152544 -86377 -123943 103883
9761 -68483 -244951 -90320 2661 17801 175105 -109800 -318079 147064 63140 -99359 -139996
9750 -139996 -307889 -57900 -107344 57864 -248734 -94149 -11291 -87746 65591 -176449 -93481
9739 -93481 -137580 85188 11098 -141522 211817 -302843 -18538 213245 -260582 -115071 -17604
9727 -74895 239032 255501 -3731 141817 -149482 -266346 -219211 69618 -61622 -101011 -232618
$$ packed form
9808d7071D12333F9223e6937j39554A16252c95174a6508C05290d6584j84156h1304
9796b1348k3792Q86k11373j15181J76582n5778a20256C170P3702a93015O6860
9785a26155A11791K9653E6718M8391b9780k1842k56889a45090N6233k52185d3089
9773a32842H9708b13605N7724A86956b39153i7856r8918M4230O6167l7566A03883
9761f8483j76468i0320B661J5140J57304a09800k08279A47064F3140i9359m0637
9750a39996j67893e7900m9444E7864b48734i4149a1291p6455F5591a76449Q2968
9739i3481m4099H5188A1098a41522B11817c02843a8538B13245b60582a15071a7604
9727g4895B39032J6469c731A41817a49482j16864M7135F9618f1622l9389j31607
$$ plain form
9716 -232618 115418 79563 -9569 22982 -83952 -162284 -97332 -109028 -151016 86926 71740 25375
9703 -142867 48956 -105095 -129545 -36633 -9294 158306 17050 97668 -12157 40822 93844
9692 93844 -152047 -249548 152078 -91465 -121588 -4441 -54003 -105218 -72137 -38055 -156732
9681 -156732 135662 -210270 7168 -78424 -60307 -302615 -26272 -150137 188533 -460331 -68304
9669 -261822 -47000 -189678 -41765 -30525 153133 -93734 40494 -79987 -145942 -151338 137317
9657 667 -105739 101723 23399 -304357 -264259 1760 -226502 94256 -267106 20306 -83502
9645 94144 -350584 2846 -238412 -111200 -15658 166115 -151496 -77051 -105032 -44753 211168
9633 -168880 -30171 219790 -68748 -57140 193857 106326 -163082 232217 -215907 -42645 -194762
$$ packed form
9716b32618A15418l5855i569B2982h3952p8332O4952j1696m1988H6926j5186B5375
9703a42867D8956a05095k4450c6633i294A58306A7050Q0618a2157D0822N3022
9692I3844a52047r7501A52078i1465l0123d441m9562n1215L3081L4082j18677
9681a56732A35662b10270G168g8424J8117k42308b6272j23865A88533d60331f8304
9669b61822d7000j42678d1765J1240A53133i3734D0494g9987o5955n396A37317
9657F67a05739A01723B3399c04357M0098A760b26502I4256b67106B0306h3502
9645I4144c50584B846b38412a11200a5658A66115a51496P4445k7981d4753B11168
9633a68880c0171B19790f8748J1608A93857q7531a63082B32217b15907d2645j52117
$$ plain form
9622 -194762 64904 -125260 77304 33979 167135 -307923 7382 -165339 -28713 -18826 167088
9610 -290462 95519 -412623 -291744 -86377 -180448 -127699 5255 -279602 -79687 47991 -122429
9598 -236918 -139019 -189171 -84769 183967 -156540 26149 -274491 -354110 -54885 -254127 9748
9586 327204 90034 107342 -361737 -229155 38931 36212 -189579 -196336 -91243 -113321 23852
9574 -208108 -207258 24279 181170 69414 155556 -133825 108039 212929 -173623 -127350 -127260 131566
9561 75919 156230 15271 -320415 -134726 -216817 -168272 -252184 -122719 -276104 -244486 38251
9549 95022 -154390 -6462 -64790 243034 -35549 41142 -11752 32595 -374691 74863 -148686
9537 67813 -229051 -154722 -246644 -154750 -176775 84262 -120638 15996 -237447 -96 114076 309609
$$ packed form
9622a94762F4904a25260G7304C3979J33156c07923G382a65339b8713R887A67088
9610b90462I5519d12623J20879h6377r4071N2749E255b79602g9687D7991a22429
9598b36918R7899n0152h4769A83967a56540B6149b74491p9619e4885j99242I748
9586C27204I0034J7308c61737J32582C8931k719a89579o757i1243k2078B3852
9574b08108Q50B4279J56891F9414Q6142a33825A08039J04890a73623M6273R0A31566
9561G5919Q0311A5271c20415a34726q2091M8545q3912a22719j53385L1618C8251
9549I5022a54390f462n8328B43034c5549D1142a1752C2595c74691G4863a48686
9537F7813b29051P4329r1922R1894k2025H4262a20638A5996b37447i6A14076J95533
$$ plain form
9525 309609 125597 145525 -195673 -50117 -123468 138253 -271866 -52950 68934 -92683 146753
9513 -23860 -181257 -185207 133625 173155 -194997 56899 -87542 -29626 116420 -92257 -305322
9502 -305322 -45934 -23498 -21216 6857 -29485 -19634 -114121 -201473 -27150 136897 -219307 92304
9489 -274712 -286914 43690 -40563 -168768 -62615 -6533 -327055 -97127 -7331 93448 -43493 52556
9476 -43176 -137910 65879 360724 -281063 64509 -307006 -97663 -248763 -22597 -58583 -73237
9465 -73237 -286784 -141147 -48746 193643 -332666 91709 -243920 -11953 -302964 144014
9454 -314434 -157974 -194877 151948 -319896 204186 -2230 -17356 -104819 -210466 135564 -312560
9442 65342 -142384 -131523 -203644 -78719 68145 -108254 -76955 67514 -195933 -186422 -27120
$$ packed form
9525C09609A25597J9928a95673e0117p3351A38253b71866e2950F8934i2683A46753
9513b3860j57397l950A33625L9530a94997E6899h7542b9626A16420i2257k13065
9502c05322d5934K2436K282F857b9485R851r4487q7352b7150A36897b19307I2304
9489b74712j2202D3690d0563j28205f2615f533l20522i7127g331I3448d3493E2556
9476d3176r4734F5879K94845b81063F4509c07006i7663j51100b2597l5986j4654
9465g3237k13547a41147d8746A93643c32666I1709b43920a1953k91011A44014
9454c14434J56460l6903A51948c19896B04186b230j5126q7463j05647A35564c12560
9442F5342a42384J0861p2121g8719F8145a08254L1299F7514a95933R511b7120
$$ plain form
9430 -308066 248878 -72011 -216028 38270 -114253 -178710 -212043 -172748 -310706 64157 -51773
9418 105262 -190798 202687 5076 158252 -10237 -418216 240905 -1460 -270177 -212048 -125219
9407 -125219 -56697 10024 -111588 -21636 75779 -351961 173471 -572716 -26399 -193940 -1303
9395 72336 -101871 -4882 17041 32615 -65792 46608 -45846 22729 261187 316896 138097
9383 -201093 -8807 11588 -327294 -232961 42887 -142931 -155102 -79484 -21427 25128 -169753
9371 -80732 -258908 17579 -217935 -338856 106889 111900 115868 107233 80989 17602 311953
9360 311953 321824 234954 141617 -153452 -247282 64367 -104142 -482672 -91231 162174 34719
9348 232971 -193698 -153930 73882 243019 5165 136621 -145422 -300699 -143554 -334539
$$ packed form
9430c08066B48878g2011j44017C8270a14253o4457l3333L9295j37958F4157e1773
9418A05262a90798B02687E076J53176a0237m07979B40905a460k68717N8129Q6829
9407a25219e6697A0024a11588b1636G5779c51961A73471e72716b6399j67541a303
9395G2336a01871d882A7041J5574f5792D6608d5846B2729K38458N5709A38097
9383b01093h807A1588c27294R4333D2887a42931j2171P5618b1427B5128a69753
9371h0732j78176A7579b17935j20921A06889N011L968q635k6244A7602K94351
9360C11953R871q6870r3337a53452r3830F4367a04142l78530i1231A62174C4719
9348B32971a93698L9768G3882J69137E165J31456a45422j55277a43554j90985
$$ plain form
9338 -334539 228030 111175 164314 -35208 -223117 127656 -264976 4363 60800 3695 -59010
9326 -155815 -223039 -43706 55296 -73049 112296 -256824 -160152 -382601 -59295 32534 -91283
9314 7329 101504 11214 3808 -218663 -351266 -7732 -72545 -107030 273274 111316 -71107 99562
9301 -41110 228808 -64533 -62956 241477 -136581 -91517 -39398 -220598 -284751 -28656 -100702
9290 -100702 234062 64424 120345 217975 -174354 -26025 102404 -367691 -175848 -75008 13743
9278 30494 -53897 109033 -291578 -190252 3367 -25557 -24973 -154156 -502960 225884 133717
9267 133717 -39356 51867 -125568 -91400 -192986 -60839 -141300 82519 -102360 -233937 249003
9255 -75648 -13047 75711 25452 7805 18216 -68363 -57644 -46096 54132 -336319 133630 55611
$$ packed form
9338c34539B28030A11175N3139c5208j87909A27656b64976D363N6437C695e9010
9326a55815o7224d3706E5296g3049A12296b56824R6672k22449e9295C2534i1283
9314G329R4175A1214C808b18663j32603g732o4813l4485B73274A11316g1107I9562
9301d1110B28808f4533J577B41477a36581M5064c9398j81200o4153b8656p2046
9290a00702B34062F4424N5921R7630a74354b6025A02404c67691a75848g5008A3743
9278C0494e3897A09033b91578J01326C367b5557N84j29183l48804B25884r2167
9267A33717c9356E1867a25568L4168j01586f0839q0461H2519a02360j31577B49003
9255g5648a3047G5711B5452G805J0411f8363J0719J1548E4132c36319A33630E5611
$$ plain form
9242 -48576 -868 -167761 -65354 316223 -117626 26670 -156377 111410 -125702 -225657 84611
9230 22303 -214675 -372878 228270 -411945 92087 -33848 -126613 -158652 -103772 -74120 56891
9218 -186513 74010 -186821 86241 -28642 -105629 -411708 -154964 4293 -104144 -419633 -26820
9206 -63934 103514 -447992 30433 31515 23374 76969 -57872 109656 223750 -84487 -101976
9195 -101976 -256982 96269 -145365 376247 322721 -204356 -290861 -236327 -380211 35164 -324255
9183 -149051 -48387 -377923 -321904 -303347 -455223 -36146 145855 -208392 156558 -171712
9172 -64332 -33272 101275 -98642 115834 -115273 162272 -47550 -59035 118392 9318 -10089
9160 -199571 -108385 -152478 -38010 -125134 112656 181398 184315 165570 -192490 -165846 41222
$$ packed form
9242d8576h68j66893f5354C16223a17626B6670a56377A11410a25702r9955H4611
9230B2303b14675j58203B28270d11945I2087c3848r2765l2039N4880K9652E6891
9218a86513G4010a86821H6241b8642p6987l06079a54964D293a04144l15489b6820
9206f3934A03514d47992C0433J082q141N3595e7872A09656J14094h4487j7489
9195a01976j55006I6269a45365C76247n3526b04356q6505N4534j43884C5164c24255
9183a49051d8387l29536N6019J8557j51876c6146A45855b08392A56558a71712
9172f4332L1060A01275i8642A15834a15273A62272d7550j1485A18392I318a0089
9160a99571R1186m4093c8010q7124A12656O8742K917j8745a92490K6644D1222
$$ plain form
9148 -150113 -147577 -44119 303000 98825 57927 43553 -12704 243108 -228358 -144114 -160304
9137 -160304 111518 -192177 -258747 58243 21799 -36784 81704 33418 -323588 -139377 37925
9125 -85752 -164613 -19658 -68142 212027 -278792 37498 -80405 -109191 -5136 -18861 294688
9113 98499 -118274 114164 -208320 23425 -446640 91385 -60546 -99532 52458 -233382 15287
9101 91412 -95455 -241619 24086 -79751 -193467 -166103 -258966 386755 -151484 -203679 -229322
9090 -229322 211507 143848 -403369 93205 -155285 -63375 47845 53781 92391 19853 129009
9079 129009 -56414 149462 -79299 -236765 -85077 -63217 -331682 -327355 -22574 -24987 138578
9067 111928 -15243 7375 4303 234719 67924 44017 -390553 -37167 -205805 -45888 46571
$$ packed form
9148a50113K536d4119C03000I8825m0898j4374a2704B43108b28358Q4244j6190
9137a60304A11518a92177o6570E8243B1799c6784H1704C3418c23588a39377C7925
9125h5752p8861a9658m8484B12027b78792C7498h0405k8786e136j3725B94688
9113I8499a18274A14164b08320B3425d46640I1385f0546l8986E2458b33382A5287
9101I1412i5455j46164B4086g9751j13716K7364r2863C86755a51484n2195k5643
9090b29322B11507o7659d03369I3205a55285f3375D7845N936L8610A9853J09156
9079A29009e6414A49462g9299j57466h5077K1860k68465M327b2574k413A38578
9067A11928a5243G375l072K30416F7924k3907c90553c7167j68638d5888D6571
$$ plain form
9055 -74711 -64730 -183340 -326526 -181408 -23000 -321977 -165204 -422918 -291416 -184132
9045 -184132 -223197 27001 360828 -24330 128512 -150134 -168325 -153085 38421 -97057 110906
9033 46218 240038 -79708 18328 -83899 100489 -111548 325671 22114 57607 -142134 -124389
9022 -124389 124210 168032 -42823 -12914 67067 45404 -274332 89418 -54877 -182841 -238745
9011 -238745 -300056 -186521 35709 280483 -251701 -55653 31840 -164167 -92405 44962 193294
9000 193294 67146 -157326 -255575 13232 -209496 -122550 -88795 96859 -114747 66243 -241913
8988 82958 -49947 -293665 275490 323472 -35248 -207472 -88173 -41110 -352088 89656 -282256
8976 -162858 -191623 231414 60457 82530 -143983 -62670 -239423 4909 -96258 78242 -5039
$$ packed form
9055g4711R981j18610j43186J45118b3000k98977J56773k57714J31502J07284
9045a84132l9065B7001L33827b4330A28512a50134j8191J5240C8421i7057A10906
9033D6218J93820g9708A8328h3899A00489a11548C25671B2114L5493a42134J7745
9022a24389A24210M3822d2823a2914F7067k1663b74332H9418e4877j27964n5904
9011b38745o1311J13535C5709K44774b51701e5653C1840a64167P1762D4962J48332
9000A93294F7146a57326r8249A3232b09496Q6946L3755I6859a14747F6243b41913
8988H2958d9947k43718B75490M7982c5248j72224h8173d1110l10978H9656b82256
8976a62858k8765B31414F0457K2073a43983f2670j76753D909i6258G8242e039
$$ plain form
8964 -72920 154081 -344826 111034 213064 -210017 -141721 58478 209441 -22383 -310130
8954 -310130 -94702 -318557 -42204 -324952 -96919 -69930 -261586 15471 51434 -35382 206347
8942 77094 141238 -11711 -66881 -153461 130018 -95388 183476 239631 46049 -40154 151272
8930 -3474 -63276 -17640 110196 33489 294652 254625 914825 2739298 6651717 5774451
8920 5774451 1887264 712620 193656 375150 11077 66399 -85820 265963 127574 -76502
8909 185885 36090 322805 373586 76069 -197749 -54233 237243 214070 93427 -119398 117912
8897 13154 -103038 47189 177680 476 211990 -291372 128028 -83081 15174 22990 -45768
8885 -15826 63917 -76215 103912 -165663 -141087 -5500 -13726 -192207 104205 263593 164393
$$ packed form
8964g2920A54081c44826A11034J02030b10017O8296E8478J50963b2383k87747
8954c10130i4702k23855d2204k82748i6919K6989j91656A5471L5963c5382B06347
8942G7094O4144a1711n5170q6580A30018i5388A83476N6155D6049d0154A51272
8930c474n9802a7640A10196C3489K61163m0027O60200J824473L912419q77266
8920E774451A887264G12620A93656J81494A1077N5322h5820B65963A27574g6502
8909A85885C6090K86715N0781G6069a97749e4233B37243k3173I3427a19398A17912
8897A3154a03038D7189J30491D76K11514b91372A28028h3081A5174P816d5768
8885a5826F3917g6215A03912a65663K4576e500q226j78481A04205J59388r9200
$$ plain form
8874 164393 -191560 -288085 35167 -187643 244938 -149029 128388 -250913 -234143 -164760
8864 -164760 7804 42721 38076 -178638 -2975 203377 -45563 84340 89606 220832 209121 -306385
8851 14807 -234610 -80593 -42061 -267898 -69480 -458430 -115870 -163643 -191615 216528 -26598
8839 129831 105889 -21087 -282446 -79960 140356 148144 -83826 129173 -161358 178437 36590
$$ packed form
8874A64393a91560r6525C5167a87643B44938a49029A28388b50913J6770O9383
8864a64760G804L4917m645a78638b975B03377d5563H4340N266J31226j1711c06385
8851A4807b34610h0593L8532k25837f9480l88950a15870m7773k7972B16528b6598
8839A29831k3942b1087k61359g9960A40356P788h3826A29173a61358A78437C6590
$$ [...]
##END NTUPLES=NMR SPECTRUM
##END=
