##TITLE=AC1654_NARAH14390_8531325_FUju9iZESU
##JCAMPDX= 6.0         $$ Bruker NMR JCAMP-DX V2.0
##DATA TYPE= NMR SPECTRUM
##DATA CLASS= NTUPLES
##ORIGIN= BRUKER
##OWNER= Administrator
$$ 1.72 TOPSPIN		Version 2.1
$$ 2014-03-14 19:39:12.548 -0800  Administrator@X
$$ Compression mode = diff/dup
##.OBSERVE FREQUENCY= 400.02188249412
##.OBSERVE NUCLEUS= ^1H
##.ACQUISITION MODE= SIMULTANEOUS (DQD)
##.ACQUISITION SCHEME= undefined
##.AVERAGES= 8
##.DIGITISER RES= 22
##SPECTROMETER/DATA SYSTEM= spect
##.PULSE SEQUENCE= zg30
##.SOLVENT NAME= COFFEE_meoh
##.SHIFT REFERENCE= INTERNAL, COFFEE_meoh, 1, 14.98509
##AUDIT TRAIL= $$ (NUMBER, WHEN, WHO, WHERE, PROCESS, VERSION, WHAT)
$$ ##TITLE= Audit trail, TOPSPIN		Version 2.1
$$ ##JCAMPDX= 5.01
$$ ##ORIGIN= Bruker BioSpin GmbH
$$ ##OWNER= Administrator
$$ $$ E:\/data/COFFEE/nmr/AC1654_NARAH14390_8531325_FUju9iZESU/10/pdata/1/auditp.txt
$$ ##AUDIT TRAIL=  $$ (NUMBER, WHEN, WHO, WHERE, PROCESS, VERSION, WHAT)
(   1,<2014-03-14 19:39:05.751 -0800>,<Administrator>,<X>,<go>,<TOPSPIN 2.1>,
      <created by zg
	started at 2014-03-14 19:37:59.501 -0800,
	POWCHK enabled, PULCHK disabled,
       configuration hash MD5:
       C8 4E 4E 5D D3 5C D8 9E 9F 52 82 E0 59 8A DE 15
       data hash MD5: 64K
       5B E9 AD 86 31 9F D0 13 89 64 CB 40 A5 D1 1D 88>)
(   2,<2014-03-14 19:39:08.658 -0800>,<Administrator>,<X>,<proc1d>,<TOPSPIN 2.1>,
      <Start of raw data processing
       efp LB = 0 FT_mod = 6 PKNL = 1 PHC0 = 0 PHC1 = 0 SI = 32K 
       data hash MD5: 32K
       7C 52 ED 3B 91 04 E2 8E 6C D1 1A F9 B9 53 4A E6>)
(   3,<2014-03-14 19:39:08.955 -0800>,<Administrator>,<X>,<proc1d>,<TOPSPIN 2.1>,
      <pk PHC0 = 95.13062 PHC1 = 0 
       data hash MD5: 32K
       79 04 D8 06 A5 F9 E6 F7 BC F7 FB F7 4E B6 F8 B9>)
(   4,<2014-03-14 19:39:09.064 -0800>,<Administrator>,<X>,<proc1d>,<TOPSPIN 2.1>,
      <abs ABSG = 1 
       data hash MD5: 32K
       68 30 22 A5 33 C0 40 9B 56 65 E8 A6 7A 14 2E 2E>)
(   5,<2014-03-14 19:39:09.142 -0800>,<Administrator>,<X>,<proc1d>,<TOPSPIN 2.1>,
      <abs ABSG = 2 
       data hash MD5: 32K
       15 AF DC B6 32 73 2D 4E A3 B1 68 A7 F5 1F C7 F4>)
(   6,<2014-03-14 19:39:09.205 -0800>,<Administrator>,<X>,<proc1d>,<TOPSPIN 2.1>,
      <abs ABSG = 3 
       data hash MD5: 32K
       E5 6E 2C 69 39 9E CD 87 26 BE 64 DC 5B 84 06 0E>)
(   7,<2014-03-14 19:39:09.251 -0800>,<Administrator>,<X>,<proc1d>,<TOPSPIN 2.1>,
      <abs ABSG = 4 
       data hash MD5: 32K
       C0 75 67 A7 29 4F 1F 4C 6A D6 1C DB 13 61 E8 EE>)
(   8,<2014-03-14 19:39:09.330 -0800>,<Administrator>,<X>,<proc1d>,<TOPSPIN 2.1>,
      <abs ABSG = 5 
       data hash MD5: 32K
       BE 4C B1 93 A9 91 DE 00 57 B9 94 A7 D4 33 CB 75>)
$$ ##END=
$$ 
$$ $$ hash MD5
$$ $$ FD 90 A0 02 4D 02 E0 BC 56 72 55 AF F2 7D C1 C0
##$RELAX= 
##$RELAX= 
##$RELAX= 
##$RELAX= 
##$RELAX= 
##$RELAX= 
##$RELAX= 
$$ Bruker specific parameters
$$ --------------------------
##$DU= <E:\>
##$EXPNO= 10
##$NAME= <AC1654_NARAH14390_8531325_FUju9iZESU>
$$ [...]
##$TP= (0..7)
150 150 150 150 150 150 150 150
##$TP07= 0
##$TPNAME0= <>
##$TPNAME1= <>
##$TPNAME2= <>
##$TPNAME3= <>
##$TPNAME4= <>
##$TPNAME5= <>
##$TPNAME6= <>
##$TPNAME7= <>
##$TPOAL= (0..7)
0.5 0.5 0.5 0.5 0.5 0.5 0.5 0.5
##$TPOFFS= (0..7)
0 0 0 0 0 0 0 0
##$TUNHIN= 0
##$TUNHOUT= 0
##$TUNXOUT= 0
##$USERA1= <user>
##$USERA2= <user>
##$USERA3= <user>
##$USERA4= <user>
##$USERA5= <user>
##$V9= 5
##$VALIST= <valist>
##$VCLIST= <CCCCCCCCCCCCCCC>
##$VD= 0
##$VDLIST= <DDDDDDDDDDDDDDD>
##$VPLIST= <PPPPPPPPPPPPPPP>
##$VTLIST= <TTTTTTTTTTTTTTT>
##$WBST= 1024
##$WBSW= 4
##$XGAIN= (0..3)
0 0 0 0
##$XL= 0
##$YL= 0
##$YMAX_a= 621571
##$YMIN_a= -527189
##$ZGOPTNS= <>
##$ZL1= 120
##$ZL2= 120
##$ZL3= 120
##$ZL4= 120
##$ABSF1= 14.98509
##$ABSF2= -5.573092
##$ABSG= 5
##$ABSL= 3
##$ALPHA= 0
##$AQORDER= 0
##$ASSFAC= 0
##$ASSFACI= 0
##$ASSFACX= 0
##$ASSWID= 0
##$AUNMP= <proc_prof1d_extract_pilot.lims>
##$AXLEFT= 0
##$AXNAME= <>
##$AXNUC= <1H>
##$AXRIGHT= 0
##$AXTYPE= 0
##$AXUNIT= <>
##$AZFE= 0.1
##$AZFW= 0.1
##$BCFW= 0
##$BC_mod= 0
##$BYTORDP= 0
##$COROFFS= 0
##$CY= 15
##$DATMOD= 1
##$DC= 0
##$DFILT= <>
##$DTYPP= 0
##$F1P= 0
##$F2P= 0
##$FCOR= 0.5
##$FTSIZE= 32768
##$FT_mod= 6
##$GAMMA= 0
##$GB= 0
##$INTBC= 1
##$INTSCL= 1
##$ISEN= 128
##$LB= 0
##$LEV0= 0
##$LPBIN= 0
##$MAXI= 10000
##$MC2= 0
##$MEAN= 0
##$ME_mod= 0
##$MI= 0
##$NCOEF= 0
##$NC_proc= -8
##$NLEV= 6
##$NOISF1= 0
##$NOISF2= 0
##$NSP= 0
##$NTH_PI= 0
##$NZP= 0
##$OFFSET= 14.98509
##$PC= 1
##$PHC0= 95.13062
##$PHC1= 0
##$PH_mod= 1
##$PKNL= yes
##$PPARMOD= 0
##$PPDIAG= 0
##$PPIPTYP= 0
##$PPMPNUM= 2147483647
##$PPRESOL= 1
##$PSCAL= 4
##$PSIGN= 0
##$PYNMP= <proc.py>
##$REVERSE= no
##$SF= 400.02
##$SI= 32768
##$SIGF1= 0
##$SIGF2= 0
##$SINO= 400
##$SIOLD= 32768
##$SPECTYP= <>
##$SREGLST= <1H.CDCl3>
##$SSB= 0
##$STSI= 32768
##$STSR= 0
##$SW_p= 8223.68421052631
##$SYMM= 0
##$S_DEV= 0
##$TDeff= 65536
##$TDoff= 0
##$TI= <>
##$TILT= no
##$TM1= 0
##$TM2= 0
##$TOPLEV= 0
##$USERP1= <user>
##$USERP2= <user>
##$USERP3= <user>
##$USERP4= <user>
##$USERP5= <user>
##$WDW= 1
##$XDIM= 32768
##$YMAX_p= 450381330
##$YMIN_p= -652963
##$CURPLOT= <Network HP LaserJet P1505>
##$CURPRIN= <$Network HP LaserJet P1505>
##$DFORMAT= <normdp>
##$LAYOUT= <+/1D_H.xwp>
##$LFORMAT= <normlp>
##$PFORMAT= <normpl>
##$SURQMSG= 1
$$ End of Bruker specific parameters
$$ ---------------------------------
##NTUPLES= NMR SPECTRUM
##VAR_NAME=  FREQUENCY,     SPECTRUM/REAL,   SPECTRUM/IMAG
##SYMBOL=    X,             R,               I
##VAR_TYPE=  INDEPENDENT,   DEPENDENT,       DEPENDENT
##VAR_FORM=  AFFN,          ASDF,            ASDF
##VAR_DIM=   32768,         32768,           32768
##UNITS=     HZ,            ARBITRARY UNITS, ARBITRARY UNITS
##FACTOR=    0.250966925370066, 1,           1
##FIRST=     8223.43324360094, -134653,      -67949
##LAST=      0,             69738,           87231
##MIN=       0,             -652963,         0
##MAX=       8223.43324360094, 450381330,    0
$$ Real data points
##PAGE= N=1
##DATA TABLE= (X++(R..R)), XYDATA
$$ [...]
19555B81733h2815c1487j40292D9673c84101a75881A82758a15944B99704b11356
19544a51165b1123d413l39443c6766j2406I0425b2373l28444a11202j8658l5539
19533a65399H486J77887a53654c6757l43942a20027C1708f5766k01933I187a67766
19521a28547j78524A12296N5578e37554h7589B85456i3904A052d77817G9142J59668
19510B38810q3758k7350a3029j79568h7964o6621f4070b0330D3723R2884D8429
19498b89430C55046j30651a29216j7880e6302j2307A09109a9327j22053r785A3476
19486I9287K8735F1203O1171c0785K161A1343i355E1681H077g8825p7351d8242
19473a12628q4911B0968b09299A39622d3575m27316B6064r011e02498A82171g4479
$$ plain form
19555 281733 -82815 -31487 -171779 49673 -384101 -175881 182758 -115944 299704 -211356
19544 -151165 -21123 -4413 -343856 -36766 -49172 90425 -22373 -350817 -111202 -129860 -165399
19533 -165399 8486 186373 -153654 -36757 -380699 -120027 31708 -65766 -267699 9187 -167766
19521 -128547 -307071 112296 167874 -537554 -87589 285456 -93904 1052 -477817 79142 238810
19510 238810 155052 127702 -13029 -192597 -87964 -154585 -64070 -20330 43723 136607 48429
19498 -289430 355046 224395 -129216 -147096 -56302 -68609 109109 -19327 -141380 -151165 13476
19486 99287 128022 61203 122374 -30785 -28624 11343 -9355 51681 8077 -78825 -156176 -48242
19473 -112628 -197539 20968 -209299 139622 -43575 -470891 26064 17053 -502498 182171 -74479
19461B85148H8629J9335d4856l2242p9712B35762i8918j9055b2239e593j13627
19450a19220k93640A7974a79535g9466F0952c41380f1437A19717k1014b68442
19439a05642L7838l4111k5709j01194k8790g6992A93670d0182A60022l3612c1351
19427F8636J33976p1145D5996J22163h2304j43709b8051k62883a08669j20132
19417b28801A20561a41872N0309q1848d3830j64091A07438n2051b6087B9571h1567
19405a3279r9667c5955A99190g0840G2523K9250B5467L3411C864a66307L2082
19394a34225A97868b46415D5508b27493A84509a37347q6267E0988J03373b2281
19383A28719L7610H055a08895L454A76962J81209j44552a23609A66447a0201q4077
$$ plain form
19461 285148 88629 107964 -44856 -77098 -156810 235762 -98918 -117973 -22239 -5593 -119220
19450 -119220 -412860 17974 -179535 -79466 60952 -341380 -61437 119717 98703 -268442
19439 -105642 -67804 -101915 -127624 -228818 -257608 -76992 193670 -40182 160022 126410 -31351
19427 68636 202612 131467 45996 168159 -82304 -226013 -28051 -290934 -108669 -228801
19417 -228801 120561 -141872 -91563 -173411 -43830 -207921 107438 55387 -26087 29571 -81567
19405 -13279 -112946 -35955 199190 -70840 72523 101773 25467 58878 3864 -166307 -134225
19394 -134225 197868 -246415 45508 -227493 184509 -137347 -223614 50988 154361 -22281
19383 128719 166329 8055 -108895 -105441 176962 358171 213619 -123609 166447 -10201 -94278
19372i4278l3145A87652a17713j07022a8001o5979k34746a12695m89E2171a11026
19360a55052I0540a71606g0288G7558a34239k05952a18967L2651J755A07094d7846
19348H3805J3626J10283C3875K97862c24941d2833m0425b738j96708A37822m2796
19337I5026a26573B12962e5509I6459c82457j85542a65044A89393J75199G8143
19326a29211q4087I0624C6435c69749J33843N1647b6329l31406f2255a4237l112
19315a7349C1194M5913J88508B3595b73026D3611N28b71139o8175c3356D4090
19303D7412c36615A85675m6665A6582a3299A65945C2596a26532b7512m9800k6124
19292a03436j5340B70265a41771a3693H704h6216P752j08529a5608k00195B42142
$$ plain form
19372 -94278 -127423 187652 -117713 -224735 -18001 -83980 -318726 -112695 -113184 52171 -111026
19360 -155052 90540 -171606 -70288 77558 -134239 -340191 -118967 -86316 -84561 107094 -47846
19348 83805 97431 207714 33875 331737 -324941 -42833 -83258 -2738 -199446 137822 95026
19337 95026 -126573 212962 -55509 96459 -382457 -567999 -165044 189393 364592 78143
19326 -129211 -213298 90624 36435 -369749 -235906 -184259 -26329 -357735 -62255 -14237 -17349
19315 -17349 31194 77107 265615 23595 -273026 43611 44139 -271139 -339314 -33356 44090
19303 47412 -336615 185675 139010 16582 -13299 165945 32596 -126532 -27512 -77312 -103436
19292 -103436 -118776 270265 -141771 -13693 8704 -86216 -78464 -186993 -15608 -215803 242142
19280c6998j74675C6023L5111a21004b2355j48495d1167j68591F7286a43808k1405
19269a65213j79328A00483M9141b3428q3821B20050C6214b15025A55857b60154
19258A68837m4236B622K97319c00921i195A04237h3001k92918e1918J6610j60487
19247a95795m4411d395A2664a07576C89097D2890b770A6793R4432c31667m0947
19236c72614d6932j70782A69064e1891A78346n1295a33556H0459B834b27372j91024
19225d18396B64500b01103j75270D9451j4847b84006d9552j01764I8087J05232
19215B03319c233G4121e5110j24984d8047l7585A25975a8252j48500j00550B22563
19203E157a3998m42210a20850n6222k35961a1505j73073A8149c13665A03398a04372
$$ plain form
19280 -36998 -211673 36023 71134 -121004 -22355 -170850 -41167 -209758 67286 -143808 -165213
19269 -165213 -344541 100483 149624 -23428 -107249 220050 36214 -215025 155857 -260154
19258 168837 124601 2622 299941 -300921 -9195 104237 -83001 -375919 -51918 -35308 -195795
19247 -195795 -240206 -4395 12664 -107576 389097 42890 -2770 16793 111225 -331667 -372614
19236 -372614 -46932 -217714 169064 -51891 178346 127051 -133556 80459 2834 -227372 -418396
19225 -418396 264500 -201103 -376373 49451 34604 -284006 -49552 -151316 98087 203319
19215 203319 -3233 74121 -55110 -180094 -48047 -85632 125975 -18252 -166752 -267302 222563
19203 5157 -13998 -456208 -120850 -177072 -413033 -11505 -184578 18149 -313665 103398 -104372
19191e23682c0330B699h9468r2342L6722f2776I3748R1363l8300a44067A20591
19179A06461C188K069f422A19096J33667E2917f7961q1401c8064m08607D4718
19167a26723r1139H0093c30061B4034b50371I7810g0228n928D5259c01977a147
19155a44497j22448g2755j84829C17499C6508N6148c18399g5303A90827b49849
19144B33697f5332b9323A33656a58613K5603K2620j84253d8700r0331r9315i0609
19132I600J28256P0071a85200J2736r1917J30629j32962R1135F9081d0484I1338
19120D6742P7116c32030N00A45809h8325C80680a65496l2258A23119c25357A29474
19108b1777k10942f5942B2360a17610A7490d89925f7856G591Q8952a35199k49503
$$ plain form
19191 -523682 -30330 2699 -89468 -181810 -145088 -62776 93748 185111 146811 -144067 120591
19179 106461 3188 5257 -6422 119096 252763 52917 -67961 -149362 -38064 -446671 44718
19167 -126723 -217862 80093 -330061 24034 -250371 97810 -70228 -76156 45259 -301977 -1147
19155 -144497 -266945 -72755 -257584 317499 36508 92656 -318399 -75303 190827 -249849
19144 233697 -65332 -29323 133656 -158613 -133010 -110390 -294643 -48700 -139031 -238346 -90609
19132 9600 137856 207927 -185200 -172464 -264381 -133752 -266714 -175579 69081 -40484 91338
19120 46742 123858 -332030 -331530 145809 -88325 380680 -165496 -197754 123119 -325357 129474
19108 -21777 -232719 -65942 22360 -117610 17490 -489925 -67856 7591 96543 -135199 -384702
19097c84702a14367k9995A05134A569J29182D386P0882a81982A10825B7233A0362
19085g8274J4228b3448k51447G2136O0799c6217O240E6643J36662C937Q7465a83758
19072A31603O0198b41969C03758a18296J0597N1002j79515c690D2361b32974j34620
19061c67594F8127e9551K880o5091A0205b36626p2064A88477F57K95094b46501
19049B893a24300f0494q7085B06858D2926j2525J80838r0065a60098e8026b2786
19037D135a32469J6816H2088J3351m2187c1965A53495A9020c2546A52302b29913
19025A83562k7840A1789J08296O7176D9334b70539B03958D2649B0254L43767a08925
19013a18466j84614C4201J08253r792a16790o943A99710D9287b77170a09649d4682
$$ plain form
19097 -384702 -114367 -144362 105134 1569 130751 4386 75268 -181982 110825 27233 10362
19085 -78274 -64046 -23448 -274895 72136 132935 -36217 -29977 56643 193305 3937 91402 -183758
19072 131603 191801 -241969 303758 -118296 -107699 -56697 -236212 -3690 42361 -232974 -367594
19061 -367594 68127 -59551 -56671 -121762 10205 -236626 -308690 188477 657 295751 -246501
19049 2893 -124300 -60494 -147579 206858 42926 30401 211239 121174 -160098 -58026 -22786
19037 4135 -132469 -115653 82088 95439 53252 -31965 153495 19020 -32546 152302 -229913
19025 183562 155722 11789 120085 187261 49334 -270539 203958 42649 20254 364021 -108925
19013 -118466 -303080 34201 142454 132662 -116790 -123733 199710 49287 -277170 -109649 -44682
19001B39739g8738A51156b61252p6663H6279b8501j2944q7196k3165f2782l83092
18990d45874C8147a8553A22188h913H0708e0426l81521i0090c9344k66941d1664
18978a59939k9453B57553b50070A1849f3511l4665j83976a07849j17218A43342
18967C6424a70671b3590j29373A06509Q7320K4587a20447n6822C25195A57266
18956e3785H1921B7831g6954A23784b49474b0625A12963c3229j87578E2469a08086
18944a9739B30658I2962a58369D2799a48741D0189i9673B097c21270I9650R2402
18933A92052H4067R7039e3154j82274k3034A53039A156M4896N8060J0736g3993
18921g9667Q767C7552b48222Q9629A47298a03328L5604m849J5613C65355d69813
$$ plain form
19001 239739 -78738 151156 -261252 -337915 86279 -28501 -41445 -128641 -151806 -62782 -445874
18990 -445874 38147 -18553 122188 -8913 80708 -50426 -431947 -90090 -39344 -306285 -41664
18978 -159939 -189392 257553 -250070 11849 -63511 -98176 -282152 -107849 -225067 143342
18967 36424 -170671 -23590 -152963 106509 193829 218416 -120447 -177269 325195 157266
18956 -53785 81921 27831 -76954 123784 -249474 -20625 112963 -33229 -220807 52469 -108086
18944 -19739 230658 92962 -158369 42799 -148741 40189 -99673 2097 -321270 99650 192052
18933 192052 84067 181106 -53154 -235428 -258462 153039 1156 46052 104112 114848 -73993
18921 -79667 -70900 37552 -248222 -158593 147298 -103328 -67724 -72573 -56960 365355 -469813
18909A22859c18900a5053r3636B01237l5362a46172r4005j55971B1256a32691
18898b51492D0394a54996i15C2556J11776a23633D6008P8048c01A37879c08834
18886H1070f4086A69355b288A16889m1135Q0063d2589B3421g3855c4611Q981R00
18874b4730j60464D6845M8235a00545k10597R6468E3888a66570f8479G659a88271
18862F5950J53145h475k8092A58099a65987g9505q9416M0561k34981A519J34524
18851A36043o4086c87223I5482b37141K2129A58233C1137a37874e0547A38252
18840A71497d30455g5596k62004b9057A59313P6449b97035B477a56070J3974N5723
18829h6373j11453k7623m322B1870d4922o9703j19027C6583d1443B1808b13644
$$ plain form
18909 122859 -318900 -15053 -108689 201237 165875 -146172 -240177 -396148 21256 -132691
18898 -251492 40394 -154996 -915 32556 144332 -123633 46008 124056 -301 137879 -308834
18886 81070 -64086 169355 -2288 116889 75754 155817 -42589 23421 -73855 -34611 -25630 -24730
18874 -24730 -185194 46845 95080 -100545 -311142 -214674 53888 -166570 -68479 7659 -188271
18862 65950 219095 -8475 -36567 158099 -165987 -79505 -168921 -128360 -363341 1519 136043
18851 136043 71957 -387223 95482 -237141 -215012 158233 31137 -137874 -50547 138252
18840 171497 -430455 -75596 -337600 -29057 159313 235762 -297035 2477 -156070 -142096 -86373
18829 -86373 -197826 -225449 -229771 21870 -44922 -114625 -233652 36583 -41443 21808 -213644
18817B7449G385f9470A00254k0341l012J41258K3102E3403j6164J60821J37465
18806C35525H1484R9904a25782C9206c04610E8768c48462F5011a39172C6303O7972
18795A04275j3504a32266N3192j44759j55321C0210J12729L3437g8755J2950F7021
18783c441A60645g945j4137A1613c73017h0334c9618E9240L0787l6478K1648c54684
18770e42068a02486j04619A80244E5001a76192m0535C2349J2786a30325K4661
18760a05664l6233k6169A76026K93558B17162A0029a381D21b0104o7695l10175
18749c97974h5979q314B4384K22497b77599C3217c76532B35262i8682B46229i7106
18737A1824M5111L1693B4736O8083d9455E7804j9634a66391c0041j13357a4571
$$ plain form
18817 27449 7385 -69470 100254 79913 76901 218159 241261 53403 37239 198060 335525
18806 335525 81484 181388 -125782 39206 -304610 58768 -348462 65011 -139172 36303 104275
18795 104275 90771 -132266 -79074 -223833 -379154 30210 142939 176376 -78755 -65805 67021
18783 -3441 160645 -7945 -22082 11613 -373017 -80334 -39618 59240 90027 53549 75197 -354684
18770 -542068 -102486 -207105 180244 55001 -176192 -216727 32349 45135 -130325 -105664
18760 -105664 -141897 -168066 176026 469584 217162 10029 -1381 421 -20104 -87799 -397974
18749 -397974 -85979 -94293 24384 246881 -277599 33217 -376532 235262 -98682 246229 -97106
18737 11824 56935 88628 24736 92819 -49455 57804 38170 -166391 -30041 -143398 -14571
18725g0366j6254E6585j3093N3381k0695b6069k28875A01958a51659k8778O7287
18714a13150k4266o2261F7937j6033b83709I3486e4276A36604a07749k1114j24487
18703b53350J16092l9664A66713g1001B03807H6054a75078K1987a1229j67745
18693a78974B89106F5545a2533j13932B57711R5736A15468a10346b0779k19013
18683b39792J15341m73716a92679q6018B39571a82987A87301m769L5366I1749
18672a49232A08884B5201A2461a6906l1320I0690b25600K7784L1578A42223e4164
18660D1129b52526J04313g1214p73j73291h8625C9747b58183a07375J8015L4544
18649e4816j34582h9104l534j17682D9042a42618g0787j1552B91427b37742A59274
$$ plain form
18725 -70366 -86620 56585 43492 96873 76178 -26069 -254944 101958 -151659 -180437 -113150
18714 -113150 -137416 -199677 67937 51904 -283709 93486 -54276 136604 -107749 -128863 -253350
18703 -253350 -137258 -176922 166713 -71001 203807 86054 -175078 -153091 -11229 -178974
18693 -178974 289106 65545 -12533 -126465 257711 353447 115468 -110346 -20779 -239792
18683 -239792 -124451 -598167 -192679 -278697 239571 -182987 187301 182532 217898 91749
18672 -149232 108884 25201 12461 -16906 -48226 90690 -225600 -197816 -166238 142223 -54164
18660 41129 -252526 -148213 -71214 -71987 -245278 -88625 39747 -258183 -107375 -89360 -54816
18649 -54816 -189398 -89104 -92638 -210320 49042 -142618 -70787 -82339 291427 -237742 159274
18637D4202f2058o880n8905H4981a01834q1664Q2855k8758A07907J71487b78107
18625b0765F7414c77833A18824b22568A11083L957b6379B7906A930b0711j03157
18614a23868B05914j8306q9207b88325F7520a32834C4620a12436I9514c12570
18603E765a39900f5584g603j73988c7810J5986B961a57611A37805a18424B66405
18591b5899j97614c8737k28525B2992a53379C0659e1329a5691A3131a60555f1373
18579A07581a7360k3798a0213k65834g3480B43224C2279d3390E5949K61983a24362
18567a58353r1550A51196f4376j33488r535g8830k2557J1703E7953b8979A71538
18555A12532e8993B6745b10704O8554F1910c43829G6354L7022O6283M9725I1084
$$ plain form
18637 44202 -62058 -68938 -127843 84981 -101834 -183498 -100643 -129401 107907 279394 -278107
18625 -20765 67414 -377833 118824 -222568 111083 115040 -26379 27906 1930 -20711 -123868
18614 -123868 205914 187608 98401 -288325 67520 -132834 34620 -112436 99514 -312570
18603 5765 -139900 -65584 -7603 -181591 -37810 -21824 2961 -157611 137805 -118424 266405
18591 -25899 -223513 -38737 -267262 22992 -153379 30659 -51329 -15691 13131 -160555 -61373
18579 107581 -17360 -41158 -10213 -276047 -73480 243224 32279 -43390 55949 317932 -124362
18567 -158353 -249903 151196 -64376 -197864 -207399 -78830 -101387 -89684 57953 -28979 171538
18555 112532 -58993 26745 -210704 -142150 61910 -343829 76354 113376 179659 229384 91084
18543b6207B0740d9833G334J50121n3526a18130b7202q8327l4133l409E5782j4475
18531D1307i4156A67038g221j56730N6118j92424H5692a03107B56388D8804c03803
18519G3979c96403A69788M0523b6691p8426q0634g0339f846A23224M051b21710
18507e8924p9701j52079e198k20610e0030C14222a30191B30228a75457a6201A1867
18495a37844m9961j9616C8625b12709A5334J78844b56892B23215N308d8469B1812
18483d19902J07554A35869a78162p3431h1873j01495A3945K2272R1509e3285A7523
18471a30550J371h184H1314K2858d29405H8737a32141e8572C1819b87400D442
18459A22231c26166D00732f1520F1592b6489A78649b18174O205N5486l1260K124
$$ plain form
18543 -26207 20740 -49833 7334 157455 103929 -118130 -27202 -115529 -149662 -153071 55782 41307
18531 41307 -94156 167038 -7221 -163951 -107833 -300257 85692 -103107 256388 48804 -303803
18519 73979 -396403 169788 210311 -26691 -105117 -185751 -70339 -6846 123224 127275 -221710
18507 -58924 -138625 -290704 -5198 -225808 -50030 314222 -130191 230228 -175457 -16201 11867
18495 -137844 -187805 -207421 38625 -212709 15334 194178 -256892 223215 228523 -48469 21812
18483 -419902 -312348 135869 -178162 -251593 -81873 -183368 13945 36217 127726 -53285 17523
18471 -130550 -129179 -8184 81314 104172 -429405 88737 -132141 -58572 31819 -287400 4442
18459 122231 -326166 400732 -61520 61592 -26489 178649 -218174 -211969 -156483 -187743 -185619
18448a85619B1552i4275I871a3203n27896g7093A08276m3317A0947b69310B1488
18436a49674A58125a01195k26103I4558a2969j53373K2773p3372h053m4448o9561
18425a22062A60111a30515d2939j71490G3201a56151k49372I292b44720K7978
18415b16742d8753k10422e9591A2432a81259l4937A07671a590C7022r758M3428
18404G0692B5370g551m1522G6392K36482e68493a68236C7066a11866i834j33686
18393a43520l75501K28689b2191j81587N8608k65423a58621a9075j31375a4969
18382b24326B89918A9254a25231N7642j99921j7370G5902K3061Q7667d79065a24617
18370a74550Q6278B89552E3595j8261K92844i1466C3742Q4845d4695B20017b7651
$$ plain form
18448 -185619 21552 -94275 9871 -13203 -541099 -77093 108276 64959 10947 -269310 21488
18436 -149674 158125 -101195 -327298 94558 -12969 -166342 -143569 -216941 -8053 -52501 -122062
18425 -122062 160111 -130515 -42939 -214429 73201 -156151 -405523 9292 -244720 -216742
18415 -216742 -48753 -259175 -59591 12432 -181259 -216196 107671 -1590 37022 27264 70692
18404 70692 25370 -7551 -49073 76392 312874 -568493 -168236 37066 -111866 -9834 -143520
18393 -143520 -519021 -290332 -22191 -203778 -145170 -410593 -158621 -19075 -150450 -14969
18382 -224326 289918 19254 -125231 -67589 -267510 -284880 75902 98963 186630 -479065 -124617
18370 -174550 -88272 289552 53595 35334 328178 -91466 33742 118587 -44695 220017 -27651
18358A27982l8362a75749b7035A23606b70466h4435H4816b65682F2953b48085
18347b06343Q6682N2206k900n2902N2670B4974c40244D96934k45671K0669a97422
18335d3851k16149f9663a3514l6787D2937e7496b002j11695C0752M7369a72063
18323b43763C7438f1969A32721a38284A84673p5530C1879K46407a98302g7849
18312b57917N4079n0488G2611e3814n06A80585A5287J34976B5281f1887l7404
18301i9291I7854g4592j26732O9836b6803j51827N6069j94769B6466L145J21674
18290A51285J1364O1059c28365N6018a14772E0104e7203j07832e2226B29327A09085
18278a03482L5560D7703K03823e1492j67331C6368b97236g8884A20242e8266n7618
$$ plain form
18358 127982 89620 -175749 -27035 123606 -270466 -84435 84816 -265682 62953 -248085
18347 -206343 -119661 -67455 -70355 -123257 -70587 24974 -340244 496934 251263 271932 -197422
18335 -43851 -260000 -69663 -13514 -50301 42937 -57496 -2002 -113697 30752 78121 -172063
18323 -243763 37438 -61969 132721 -138284 184673 109143 31879 278286 -198302 -77849
18312 -257917 -203838 -254326 72611 -53814 -54320 180585 15287 150263 25281 -61887 -99291
18301 -99291 97854 -74592 -201324 -131488 -26803 -178630 -122561 -317330 26466 29611 151285
18290 151285 162649 223708 -328365 -272347 -114772 50104 -57203 -165035 -52226 229327 109085
18278 -103482 -67922 47703 251526 -51492 -218823 36368 -297236 -78884 120242 -58266 -115884
18267a15884c9462A95220l5084D1568A4437M8731a93050A60800C7706e0841D72436
18255B2296e0144A0826b95258C9052P7375d6420k20319k838L886C2967j3913b82278
18242a56879D8793a72868A54089D3834a74250E57b75772m07d0996j30142O3825
18231a07313F9173K29862f924j82730b1283F4857g7616J3411E6161k121a48876
18219I5799J0461c39j31847C40806b45104B17393a48834c2920m8402D50971a08779
18207b68301B06371a7507k50375a30904B2243a17711o2936a9214k20443a5028
18196H0217O0951c84531J74875A30730A0516a81341C9473a9884l57844a42258
18185B19297l3586h5102k09495a33754q0203f7284a03k8910F2501J28022E6010
$$ plain form
18267 -115884 -39462 195220 160136 41568 14437 63168 -193050 160800 37706 -50841 472436
18255 22296 -50144 10826 -295258 39052 116427 -46420 -266739 -269577 -265691 32967 19054 -282278
18242 -156879 48793 -172868 154089 43834 -174250 557 -275772 -276179 -40996 -171138 -107313
18231 -107313 69173 299035 -6924 -189654 -21283 64857 -77616 -64205 56161 54040 -148876
18219 95799 106260 -339 -132186 340806 -245104 217393 -148834 -32920 -81322 450971 -108779
18207 -268301 206371 -17507 -267882 -130904 22243 -117711 -180647 -19214 -239657 -15028
18196 80217 141168 -384531 -209656 130730 10516 -181341 39473 -19884 -377728 -142258
18185 219297 185711 -85102 -294597 -133754 -213957 -67284 -103 -29013 62501 190523 56010
18173a2110B42978b30321a07369k3138j03929c0735A13202b16014i1712L9096
18163e2616A31684K6815e1000m32713b29141P050C17391p9915a23511E9991b29892
18151c0368n5489q6206B57931j2876a13584l33788K07304a3864A69260a9971B69418
18139a5359E6722A2739b46548b2099H146a64649A82506c40911J57306b7604A43977
18127D7163A988J83361c84284A17146i3809j27123H7018e31743b57686A29561
18116I1025a51672k8360A49966a4206D681b05920l7660A22047J1711b2345j4280
18105c6625E1322B4554L3518a14782C0178P3435A9382c01007J28534P4374b466
18093a64365B6904A1498J41752c00940m5722A18749a18831L087g565p1561k369
$$ plain form
18173 -12110 242978 -230321 -107369 -130507 -234436 -30735 113202 -216014 -91712 -52616
18163 -52616 131684 158499 -51000 -483713 -229141 -222091 317391 237476 -123511 59991 -229892
18151 -30368 -85857 -172063 257931 245055 -113584 -447372 -240068 -13864 169260 -19971 269418
18139 -15359 56722 12739 -246548 -22099 8146 -164649 182506 -340911 -183605 -27604 143977
18127 47163 1988 185349 -384284 117146 -93809 -220932 87018 -531743 -257686 129561
18116 91025 -151672 -180032 149966 -14206 4681 -205920 -243580 122047 133758 -22345 -36625
18105 -36625 51322 24554 58072 -114782 30178 103613 19382 -301007 -172473 -98099 -2466
18093 -164365 26904 11498 153250 -300940 -346662 118749 -118831 -115744 -7565 -79126 -81495
18082h1495C3434M44623c3595j57518b9711J1748j30172F5816b12145c0364q5976
18071a16340A71840d26620a11435d1883a9372j68942C41487D5727K35482p6072
18061B05137a57365A7834a57815A8905Q1524K49076D1520b343A3078J25247b46199
18049A1134M62973H4449a94551A3716f8481H2483a76022A20111Q6044d6950I56
18037a37262B46835f9893J4449p8513j22558A06182b3966l64838H377b21324C53548
18025a33847K7232m5647b3491o5725B0957J26155a9373j13479j21433j22940F8031
18013b05157d5884l81476a71988c0321F7106B0538c31156A72702a11773l02586
18003d14359A741f0662l8243D27173a44277A2870g8735D80a88364j4198L5205
$$ plain form
18082 -81495 33434 478057 -33595 -191113 -29711 -17963 -148135 65816 -212145 -30364 -116340
18071 -116340 171840 -426620 -111435 -41883 -19372 -188314 341487 45727 281209 205137
18061 205137 -157365 17834 -157815 18905 100429 349505 41520 -2343 13078 138325 -246199
18049 11134 474107 84449 -194551 13716 -68481 82483 -176022 120111 206155 -46950 956
18037 -137262 246835 -69893 -55444 -133957 -256515 106182 -23966 -388804 8377 -221324 353548
18025 -133847 -106615 -152262 -23491 -89216 20957 147112 -19373 -132852 -254285 -377225 68031
18013 -205157 -45884 -427360 -171988 -30321 67106 20538 -331156 172702 -111773 -414359
18003 -414359 1741 -60662 -98905 427173 -144277 12870 -78735 480 -188364 -202562 -167357
17992a67357p8505E0305J10145a30535k4755d2944a7145A01823a60072K1143k0140
17981a59069A56207d4147A24376b43332B4430K16252h3415A0377Q3194m5328e9044
17969a24177k6352E0585G858a2039k28144e2930n1360C38486j05466H4892k9590
17958E5302J7384b06437B02460a80958A90555G0520a21824j03933k6898A53865
17947h5752C39227h564A98920d9157k0918G3228k5792K2489b84751i0877A86009
17935a33146c3941A66938J0953c27046G7736c25460d0405D5637J90770B6719a66126
17923d7262D9224R4742D012Q4684a09818j12674f6707D96774f4529K3419C31617
17911a97525C18207A43258C5398K12555I8898f3572C9209M64467A25263e6753
$$ plain form
17992 -167357 -245862 50305 160450 -130535 -155290 -42944 -17145 101823 -160072 -138929 -159069
17981 -159069 156207 -44147 124376 -243332 24430 240682 -83415 10377 93571 48243 -59044
17969 -124177 -150529 50585 7858 -12039 -240183 -52930 -104290 338486 233020 84892 55302
17958 55302 72686 -206437 202460 -180958 190555 70520 -121824 -225757 -252655 153865
17947 -85752 339227 -8564 198920 -49157 -70075 73228 47436 69925 -284751 -90877 186009
17935 -133146 -33941 166938 177891 -327046 77736 -325460 -40405 45637 236407 26719 -166126
17923 -47262 49224 143966 4012 88696 -109818 -222492 -66707 496774 -64529 -41110 331617
17911 -197525 318207 143258 35398 247953 98898 -63572 39209 503676 125263 -56753
17900A6151N9190a94378B105J72114N7939A3446Q7562b69426R6072c4733o9870
17889a04603r3422P5531L1026P347A34540n6944M6917k8249J0565I692i095G9282
17876a02208k2961f458j3059C5239a64096d0694A1756M9085a59807C8846a12990
17864a16753q8301c5860k13776l6529G9652a09335j94258d3705m01808B16109
17853A3490a51984L3536B190c2317j316k40721a00284B87419C8227J00972J07247
17842B46446a1715A19823J78201G7288L24239b30271A93010G7737I961a06310
17831C9217a4395r4715m6642F05607b45965d0148m43596b39644a0201m17571b5077
17819a4729A09336b67635R0123Q5011K0172n8321L0382j5913C6139J82107L7398
$$ plain form
17900 16151 75341 -194378 2105 174219 232158 13446 101008 -269426 -173354 -34733 -104603
17889 -104603 -198025 -122494 -91468 -84121 134540 77596 124513 96264 106829 9692 -9095 79282
17876 -102208 -125169 -6458 -19517 35239 -164096 -40694 11756 60841 -159807 38846 -112990
17864 -116753 -205054 -35860 -249636 -286165 79652 -109335 -303593 -43705 -445513 216109
17853 13490 -151984 -118448 2190 -32317 -33633 -274354 -100284 287419 38227 139199 246446
17842 246446 -11715 119823 298024 77288 401527 -230271 193010 77737 9961 -106310
17831 39217 -14395 -109110 -155752 605607 -245965 -40148 -483744 -239644 -10201 -427772 -25077
17819 -14729 109336 -267635 -177512 -92501 -72329 -130650 -100268 -116181 36139 218246 255644
17808B55644d6280r481m3518c9028F3112a26322b6443j57043f6733b5033F142
17796A9053b17033E0836i6272m0454B516M0213b1701I5339a13994E0540c9409
17784h8640j90377H5779k4373k9230K0115h263C00027F9069f8779H8850b009l00205
17772c02214A52199l6797b49101B95456D7295J26986c1213j314F6436L159b02223
17760b10081C0895J18011N5744b6768j93301e1076o4451r7171R4052A69816g3121
17748c56818f4497q6870D32481j22492r9547c72506a3653j41885A42600a35161
17737e7747A23157E5445Q3061K2693a46149f6723k42260P9167i4957E058a39235
17725d0405j67109h3123a5967E5741f6838A53183d2416j5306A36085M128a48659
$$ plain form
17808 255644 -46280 -55761 -99279 -39028 63112 -126322 -26443 -183486 -66733 -25033 6142
17796 19053 -217033 50836 -96272 -136726 2516 42729 -21701 95339 -113994 50540 -39409
17784 -88640 -279017 85779 61406 32176 52291 -8263 300027 69069 -68779 88850 -2009 -302214
17772 -302214 152199 115402 -249101 295456 47295 174281 -31213 -32527 66436 69595 -202223
17760 -210081 30895 148906 204650 -26768 -220069 -51076 -115527 -212698 -118646 169816 -73121
17748 -356818 -64497 -151367 432481 309989 210442 -372506 -13653 -155538 142600 -135161
17737 -57747 123157 55445 138506 161199 -146149 -66723 -308983 -229816 -94957 5058 -139235
17725 -40405 -207514 -83123 -15967 55741 -66838 153183 -42416 -57722 136085 140213 -148659
17713i5003k39278g8075B00093q6937a17871a1648I0353J11507D2825g9825g130
17701b02810g6975k8609a2740m38102i3779c3110B12674K07528b60411A53415
17690b41601H0096f4882Q336C49003A53933K6321a00283A04058Q1386k3406R2800
17679B54838A26176b65252A60479a27079k05085a26108j8865j9988A9552G347
17668A46536j7283A2629b87079G46J99925J65573A68979b14906C20510j00956
17658B19554b2834C2285f696A44466F3214b075q0632E665j503L00190A01997j542
17646A00455b00390O6257O341B27873O2877d4975B9536J23852K78955a29520f3471
17634B7023K04649F8907b6848j80501Q7486B63622i9962k4309A89307a8004m8312
$$ plain form
17713 -95003 -334281 -78075 200093 113156 -117871 -11648 90353 201860 42825 -79825 -7130
17701 -202810 -76975 -105584 -12740 -450842 -93779 -33110 212674 420202 -260411 153415
17690 -241601 80096 -64882 -56546 349003 153933 180254 -100283 104058 185444 162038 254838
17679 254838 126176 -265252 160479 -127079 -332164 -126108 -144973 -164961 19552 7347
17668 146536 129253 12629 -287079 746 200671 366244 168979 -214906 320510 219554
17658 219554 -22834 32285 -6696 144466 63214 -2075 -82707 5665 4162 304352 101997 100455
17646 100455 -200390 -134133 -127792 227873 290750 -44975 29536 153388 432343 -129520 -63471
17634 27023 231672 68907 -26848 -207349 -119863 263622 -99962 -124271 189307 -18004 -66316
17623f6316A04824a54311n2975A0088c0512n2845j83435A43890b44801e4106A02372
17611c6426I3318L23743H9955e7376k70700A78469n7073j7002Q9910A4634N6540
17600G1174e3331K0663j71668q9649c3113e986A23840B0297J735e5171j86723
17589b41894B99251G8064Q749R1575J74044a34560q3697A48702a56784B3155j1367
17578A1788J33475I77L73479G8409J2836e6914k15214h9570c4563k74426A13826
17566e4901A3689L68521C8765J09675G550b31308A38183L02855j66306d1760R677
17555c2083l530B07853D3817J15854a14900j31201a04062A1585f9277A90149c8978
17543b01882n2576A29028j2366A4319b34438B86150h7704j34872O7349P7468j93070
$$ plain form
17623 -66316 104824 -154311 -207286 10088 -30512 -83357 -266792 143890 -244801 -54106 102372
17611 -36426 93318 417061 89955 -57376 -328076 178469 121396 104394 194304 14634 71174
17600 71174 -53331 -32668 -204336 -293985 -33113 -5986 123840 20297 22032 -55171 -241894
17589 -241894 299251 78064 86813 178388 352432 -134560 -218257 148702 -156784 23155 11788
17578 11788 145263 977 374456 78409 91245 -56914 -272128 -89570 -34563 -308989 113826
17566 -54901 13689 382210 38765 148440 7550 -231308 138183 441038 274732 -41760 -32083
17555 -32083 -35613 207853 43817 159671 -114900 -246101 -104062 11585 -69277 190149 -38978
17543 -201882 -254458 129028 116662 14319 -234438 286150 -87704 -222576 -155227 -77759 -270829
17532b70829e5820k32784B27713k3657r9175l4839K39857a05058D4023K40874
17522B84897b24712A7291c0624J4604E4980d8199A16493e7729j02021j10505b7309
17510A11433e3336j0265d362l7320B14611B8911K83464C6596K5531f9948I7751
17498F5861a73164B29083d3851G2891j8451Q509Q8528a4485A93441f523r3041
17487i9564A00249J78342j5207n8081L4191m5645a71953C97427A37135E6913N33818
17476E90731E289K4050M0738J41054D5108M3611N75337A95163M0237I1296b89327
17464D0961e4933E9825J23820E018K97805A18068b11957e3307A76966k1856G2441
17452E16636G2745J59235C687L50319j27425L08132A97762H5630J68783q6186
$$ plain form
17532 -270829 -55820 -288604 227713 204056 104881 70042 309899 -105058 44023 284897
17522 284897 -224712 17291 -30624 -16020 54980 -48199 116493 -57729 -159750 -270255 -27309
17510 111433 -53336 -63601 -4362 -41682 214611 28911 312375 36596 62127 -69948 97751
17498 65861 -173164 229083 -43851 72891 54440 62949 151477 -14485 193441 -6523 -99564
17487 -99564 100249 278591 263384 205303 239494 193849 -171953 397427 137135 56913 590731
17476 590731 5289 29339 70077 211131 45108 88719 664056 195163 235400 91296 -289327
17464 40961 -54933 59825 183645 5018 302823 118068 -211957 -53307 176966 155110 72441
17452 516636 72745 231980 3687 354006 226581 534713 197762 85630 254413 168227
17442A68227C7667K24319p6629G0710J64647q5303L60518j67849K8622f6345B74347
17430E5244K36628l7703F2990K70215M8503A48004J10789J32166j95258J87850
17420C83551l6892m3703J90764A73399J52300j43061k5499L77947H2346a82405
17409I1797l1760Q9923K55881f1776B04218a05808A90106K4786h9509G0804k7396
17398D3408M7315K86309n3007j17171r9179i2633I7733K24252D2176K66892L6959
17387C46027a39547C97692j35716c3790B20859L1694L5538o5505L2110a8999A51067
17375C9151R9241R7359k2348J36044F9275B7185L12691j31528r9632l0970K1136
17364I8882m1653J58059D9310J58818a59922f4695E2552K45168a0858A87782E5894
$$ plain form
17442 168227 37667 261986 185357 70710 235357 150054 510572 342723 371345 -66345 274347
17430 55244 291872 254169 62990 333205 381708 148004 258793 390959 195701 383551
17420 383551 346659 302956 493720 173399 325699 182638 157139 535086 82346 -182405
17409 91797 60037 149960 405841 -61776 204218 -105808 190106 214892 -89509 70804 43408
17398 43408 90723 377032 324025 206854 107675 -92633 97733 321985 42176 309068 346027
17387 346027 -139547 397692 261976 -33790 220859 252553 288091 222586 254696 -18999 151067
17375 39151 138392 235751 213403 349447 69275 27185 339876 208348 108716 77746 98882
17364 98882 57229 215288 49310 208128 -159922 -64695 52552 297720 -10858 187782 55894
17352A5374K54927J05116I8520K76935a60140a7197A09562J01321H3394h0101
17341A02423A6529K97470A7140a16741B39912J14822A20685p303K17265a6639
17330C38989J0456A12194K96373a31536L0830A64325O1557A05987J47725j26345
17320A27367k1742g1681H2756J94515A5434L49300j69503E1609a79056C50756
17309A9518c0936A39807o6723l483M5626J52442a26364A79691P9509A15151C7351
17297D27684j36613R4038A67946q936L8265L1348J05113j23723Q9726q8801a20748
17285D54296j67180q8753O3918B9495L70181A92396b21490F9193R9790F4706O5105
17274A29811J64512H1755J96231d6949q6749D10259A41789F4733K12407o2286
$$ plain form
17352 15374 270301 375417 98520 375455 -160140 -17197 109562 210883 83394 -80101
17341 102423 16529 313999 17140 -116741 239912 354734 120685 113382 330647 -16639
17330 338989 349445 112194 408567 -131536 -100706 164325 225882 105987 253712 127367
17320 127367 105625 -71681 82756 277271 15434 364734 195231 51609 -179056 350756
17309 19518 -30936 139807 73084 69601 115227 267669 -126364 179691 259200 115151 37351
17297 427684 291071 385109 167946 159010 197275 228623 333736 210013 299739 210938 -120748
17285 454296 287116 198363 262281 29495 399676 192396 -221490 69193 168983 64706 129811
17274 129811 294323 81755 277986 -46949 -133698 410259 141789 64733 277140 214854
17264B14854F5087h9568C2789K13297A16080d2034C17102j53736K919a36407k3416
17253a59823M2234L9892C36158o9836A28888a17352B02192J91106H3456J428L76874
17242D61758L5816A67841a01869D4809N6862J80807j06956j6875g4923E34360
17231C62707A59855a0641j15494B69402A4278J97844F8252L4255J15169L90561
17221F08237A59223O7107R3094J83685A75460K57168k0129b0591B16363K9272
17211B45635A6899L99119A63693L99766A65434K2213L17039j84217R4484G9437
17200A10087J70392a53985A27113K6117B5394J15408J84033m9184K9567i4477
17189C58065i4183r729I9456M40762B47078A11615L8931j1134K05378j59586m6410
$$ plain form
17264 214854 65087 -89568 32789 246086 116080 -42034 317102 163366 166285 -136407 -159823
17253 -159823 -117589 -77697 336158 266322 128888 -117352 202192 393298 83456 84884 461758
17242 461758 497574 167841 -101869 44809 101671 282478 175522 158647 -74923 534360
17231 362707 159855 -10641 -126135 269402 14278 212122 68252 102507 217676 608237
17221 608237 159223 226330 319424 503109 175460 432628 412499 -20591 216363 245635
17211 245635 16899 416018 163693 563459 165434 187647 504686 320469 414953 79437
17200 110087 280479 -153985 127113 153230 25394 140802 324835 275651 305218 -94477
17189 358065 -94183 -103912 99456 540218 247078 111615 150546 139412 344790 185204 138794
17178A38794J31669j04646K99816A17086J41431A24366K16982J57826A20473K31153
17168C51626A3164J01795K17061j5127k1230I1315K16637O7650A30757K98662
17158D29419A22506P9128M20254D1556j2354J65948J81133k3344j00679o2720
17148A89540K48886B15686N5671K23491B34999f0682B75719O1147P5163m3884
17138C68145M7058j82807H7468J51455o9118K96040k6413r2328j31620K55201
17128D70685j38260D3237K41036J56313A02924K46393J66787B09082K54303k0988
17118D42397Q861A94201L10843m2314B13711K58739p8367m2045n7961Q3165L7487
17107D14729p216j65900K42821B34476J18810J64898o3230K67099j62584A17620
$$ plain form
17178 138794 270463 165817 465633 117086 258517 124366 341348 499174 120473 351626
17168 351626 13164 114959 332020 316893 295663 91315 307952 375602 130757 429419
17158 429419 122506 201634 621888 41556 29202 195150 376283 352939 252260 189540
17148 189540 438426 215686 271357 494848 234999 -60682 275719 336866 412029 368145
17138 368145 415203 232396 87468 238923 169805 465845 439432 347104 215484 470685
17128 470685 332425 43237 284273 440586 102924 349317 516104 209082 463385 442397
17118 442397 451258 194201 505044 462730 213711 472450 394083 352038 294077 377242 414729
17107 414729 407513 241613 484434 234476 353286 518184 454954 722053 559469 117620
17096B32218J77280L10392l14949K19165m2318A58614l5361L07746J71461j52199
17086D50261k00003O3110O7949n5650q7817J1723L06759O8313k62364K02344m9112
17075E15513B33346J65082J37402J23474A67180K35895k2825J98166k21542J2279
17065C69153j08186K82706j50718j57210M76593B39092L51507P512k53208J31087
17055D75990j25957K41532k21135M85J69294P5596j35909L34791j00354j35256
17045E79077k83582J89918J01459J680J4288r8522j67770j02895N15751k78307
17035D71097J6296r1364K42256J55367j02668k96589M58550l75847m3994K82782
17025G15886k38918R1191K4777B0728P19065C06700Q3657L37406O9868J58356
$$ plain form
17096 232218 409498 719890 404941 624106 581788 158614 123253 430999 602460 450261
17086 450261 250258 313368 381317 325667 237850 249573 556332 624645 362281 564625 515513
17075 515513 233346 398428 535830 659304 167180 403075 380250 578416 356874 369153
17065 369153 260967 543673 392955 235745 712338 239092 590599 598111 344903 475990
17055 475990 350033 591565 370430 370915 540209 615805 479896 814687 714333 579077
17045 579077 295495 485413 586872 588552 602840 504318 336548 233653 749404 471097
17035 471097 487393 396029 638285 793652 690984 394395 852945 477098 433104 715886
17025 715886 476968 568159 592936 20728 739793 306700 390357 727763 797631 955987
17015I55987j32122j56736j42675K26674j18162L30813D21242r0730L38735B92156
17004G15000j52684K59968j62063K48947k80710j50047K24168q7654J97826o1428
16994G51323R8834l10417J54685Q9265P6140l95844Q2033J58031j2289L75745
16984A067506p0167J17286l55920n3389N8698J26912l48244L28000M6042k43441
16974F73283J23081J2875Q3683J62716l03372L8678J60527m5982M3455j80902
16964G68042J42189j15184J95912K83497l00148j27530K41117j53279n9935j19228
16954G55453N00730j05869j54509M04193m49148M33736k84295j32493R964K4420
16944A002182K58780L08772m67575J65453k49062J75138J51677k57072L2945j90946
$$ plain form
17015 955987 823865 667129 524454 751128 632966 963779 421242 330512 669247 292156
17004 715000 562316 822284 660221 909168 628458 478411 702579 614925 812751 751323
16994 751323 850157 539740 694425 783690 859830 463986 546019 704050 691761 1067506
16984 1067506 997339 1114625 758705 705316 764014 890926 542682 870682 916724 673283
16974 673283 796364 809239 892922 1055638 752266 790944 951471 905489 948944 768042
16964 768042 910231 795047 990959 1274456 974308 846778 1087895 934616 874681 755453
16954 755453 1256183 1150314 995805 1399998 950850 1384586 1100291 967798 977762 1002182
16944 1002182 1260962 1569734 1102159 1267612 1018550 1193688 1345365 1088293 1121238 930292
16934I30292J40342J15446j08736K89588k80852J30403k03520K63226J48673j92186
16924A232676j8753k0162R5497J52016k13524L3741K82194k12924J01623j50838
16914A281546J71089m0131o0786J13881k22894M33483P5316n62069O40658j63724
16904A666369j34914J57611q3460r164M4124R1607j93411J39378L85153l55758
16894A707535J05585J39492p3085m6717q3122K14665r9447o574J00993j25308
16884A834017M79646l14430l50096L34052K45221j44439k0557p6614J88295j08850
16874B066245o7056L9151M7228K68695n1692p955J37296k27197M68060q9036j65238
16863B418501L53324k84953J82042q3626K70538n7768J5539l39595O34456o18347
$$ plain form
16934 930292 1070634 1186080 1077344 1366932 1086080 1216483 1012963 1276189 1424862 1232676
16924 1232676 1213923 1193761 1289258 1441274 1227750 1261491 1543685 1330761 1432384 1281546
16914 1281546 1452635 1412504 1351718 1465599 1242705 1676188 1751504 1189435 1830093 1666369
16904 1666369 1531455 1689066 1605606 1596442 1640566 1732173 1538762 1678140 2063293 1707535
16894 1707535 1813120 1952612 1879527 1832810 1749688 1964353 1864906 1858332 1959325 1834017
16884 1834017 2313663 1999233 1649137 1983189 2228410 2083971 2063414 1986800 2175095 2066245
16874 2066245 1999189 2038340 2085568 2354263 2302571 2294616 2431912 2204715 2672775 2583739 2418501
16863 2418501 2771825 2486872 2668914 2585288 2855826 2798058 2813597 2474002 3108458 2490111
16853B490111L91457N0263m7315K71175k09248L80963j23984j95155P64362j82366
16843C590263j24087J0294J37883j82653L23744P2019l60849J51349J35605J07332
16833C860900n1349K88640J0002j06633L29428k19966K32039m09075M86627K29425
16823D650038o1117J06936K55386l09110M94742q8364M9071J58424p4455K64882
16813E446433K17867j43839J39228N77561k8581N6176k6362j23022O63323j33078
16803F645706M57048r9042L29369j78067M10273L30228j81197L15761M13893m9161
16793H394811L87344n9977N43040J87589K84509J21408M04312J41361K26594R5980
16783A0726971M54820M56112J98143J25949O43529J17100P29013K79296L51349
$$ plain form
16853 2490111 2881568 2931831 2884516 3155691 2946443 3327406 3203422 3008267 3772629 3590263
16843 3590263 3466176 3476470 3614353 3431700 3755444 3827463 3466614 3617963 3753568 3860900
16833 3860900 3809551 4098191 4108193 4001560 4330988 4111022 4343061 3933986 4420613 4650038
16823 4650038 4588921 4695857 4951243 4642133 5136875 5048511 5097582 5256006 5181551 5446433
16813 5446433 5664300 5520461 5659689 6237250 6208669 6264845 6238483 6115461 6778784 6645706
16803 6645706 7102754 7003712 7333081 7155014 7565287 7895515 7714318 8030079 8443972 8394811
16793 8394811 8782155 8722178 9265218 9452807 9737316 9858724 10263036 10404397 10630991 10726971
16783 10726971 11181791 11637903 11836046 11961995 12605524 12722624 13451637 13730933 14082282
16774A4082282J45637M92237R92977L64149L58138P64935M39745R53894L62392
16765A8956386O31389O77220N20162J298265M15604J060211P97320J088527J139239
16756B6584323P71158J393168R08080J459948J170394J603164J535725J885748
16748C7311708J638646J976170J956159K106885K231023K631802K910108K303141
16740E5065642L291032L468206K928415L895034M200725L769113N169038M726462
16732H6513667N109454N623764O363320O157335O223582O872516P173712P262474
16724A37299824P402359P025121P353286O556212O355087N443335M614222L491298
16716A85540744K039329J141626l98310j702731k732269l688209m491377n523096
$$ plain form
16774 14082282 14227919 14720156 15713133 16077282 16435420 17200355 17640100 18593994 18956386
16765 18956386 19587775 20264995 20785157 22083422 22499026 23559237 24356557 25445084 26584323
16756 26584323 27355481 28748649 29656729 31116677 32287071 33890235 35425960 37311708
16748 37311708 38950354 40926524 42882683 44989568 47220591 49852393 52762501 55065642
16740 55065642 58356674 61824880 64753295 68648329 72849054 76618167 81787205 86513667
16732 86513667 91623121 97246885 103610205 109767540 115991122 122863638 130037350 137299824
16724 137299824 144702183 151727304 159080590 165636802 171991889 177435224 182049446 185540744
16716 185540744 187580073 188721699 188323389 186620658 183888389 180200180 175708803 170185707
16708A70185707n977149o713611p353415p166556p197958p107347p284089o806146
16700A14579436o720675o339986n793352n882247n379522n241124m585323m159163
16692G0478044m282900l572955l881568l171784l427900k362524k937434k446863
16684D4394116k430094k057626j914942j928381k030500j356974j523561j289440
16676B9862598j387809j543798j151739r84059q46539j203306r31594q95172o80825
16667B0237757p85474n93360q82710p75847p46542j72113p72917m48437p38375
16658A4321982j13828r85143p4307l06298n96149m42702k53009m64277j69074
16649A0917195j87277q71407J2996n46040m30648L60157m16050k55596r7226l23302
$$ plain form
16708 170185707 164208558 157494947 150141532 142974976 135777018 128669671 121385582 114579436
16700 114579436 107858761 101518775 95725423 89843176 84463654 79222530 74637207 70478044
16692 70478044 66195144 62622189 58740621 55568837 52140937 49778413 46840979 44394116
16684 44394116 41964022 39906396 37991454 36063073 34032573 32675599 31152038 29862598
16676 29862598 28474789 26930991 25779252 24795193 23948654 22745348 21813754 20918582 20237757
16667 20237757 19452283 18858923 17976213 17200366 16453824 16281711 15508794 15060357 14321982
16658 14321982 14208154 13223011 13148704 12842406 12246257 11803555 11550546 11086269 10917195
16649 10917195 10729918 9858511 9871507 9325467 8894819 9254976 8838926 8583330 8486104 8162802
16639H162802j62475n36911N4220m30155l00844J37808l06019J4830k66727k89927
16629F076602J11921j99380m18140J49813l3654l38188K48898n00465m3574j00532
16619D953301j4052j86152k4446J2065l84274K11294k11770k93753J48911j80388
16609D030736k12354j49359K08503m43964M32578l32333k5021k8432m69405N25228
16599C536177m37558K21665j24681j33526m0916l15896N60033l27670l2158l7973
16589B867497m73150L99289p7433J30287k66913n9397j67636J15235j97388K26544
16579B496935j83211j04014J77316l70856K01126j03615n6279r304j86578j52435
16569A709085L53828j25013O3971j85802M25849k89978K4931l26325J54755K45786
$$ plain form
16639 8162802 8000327 7463416 7517636 7087481 6786637 6924445 6618426 6633256 6366529 6076602
16629 6076602 6188523 5989143 5571003 5720816 5687162 5348974 5597872 5097407 5053833 4953301
16619 4953301 4939249 4753097 4728651 4740716 4356442 4567736 4355966 4062213 4211124 4030736
16609 4030736 3818382 3669023 3877526 3433562 3866140 3533807 3508786 3480354 3010949 3536177
16599 3536177 3098619 3320284 3195603 3062077 3021161 2705265 3265298 2937628 2905470 2867497
16589 2867497 2394347 2793636 2716203 2846490 2579577 2520180 2352544 2467779 2270391 2496935
16579 2496935 2313724 2209710 2387026 2016170 2217296 2113681 2057402 2048098 1861520 1709085
16569 1709085 2062913 1937900 2001871 1816069 2241918 1951940 1976871 1650546 1805301 2051087
16559B051087k21690Q0639k51272n2239j05349p4895L84514l24038L49336J08525
16549A944618m29436k16304J98972r5762M5053l33107N9230L20092K21093p07309
16539A007140O35862k73276K18813n46299K84136l791m11414J95448J27635k3924
16529A210330J14280l47892M53630j25599K80874o54657k6301L01169k91203L02792
16519A217423k58598l8758K12370k54986p9830n5403m9909M16238j50928n603
16509I52016m8536j70532J80132j70353m9080J01362M93178m97253q753K61265
16499A043446j75092m06722L53606M3426N1226l15899J13768K09896m07455j03569
16489D06631K53646R2290r4437j55934J05261K43967C99020M23805j85089j65336
$$ plain form
16559 2051087 1829397 1910036 1658764 1606525 1501176 1426281 1810795 1486757 1836093 1944618
16549 1944618 1515182 1298878 1497850 1402088 1447141 1114034 1173264 1493356 1714449 1007140
16539 1007140 1643002 1369726 1588539 1042240 1326376 1322585 911171 1106619 1234254 1210330
16529 1210330 1324610 976718 1430348 1304749 1585623 930966 904665 1205834 914631 1217423
16519 1217423 958825 920067 1132437 877451 797621 742218 692309 1108547 957619 952016
16509 952016 903480 732948 913080 742727 693647 795009 1288187 790934 782181 1043446
16499 1043446 868354 461632 815238 858664 909890 593991 707759 917655 510200 406631
16489 406631 660277 752567 658130 502196 607457 851424 399020 822825 637736 472400
16479D72400L11827j18452J62591P1714l95534N9772q5218J41674j17833J94911
16469F97852B89757K47820J44552B87018L77586J30938J3676k74407O3680j75490
16459D23001J06541L7720j14811M35649B69660k0193K00149j85539K57654K20167
16449G41898l55432L41079B84880J50455L27687B56284L78559J2682n1036r5151
16439E01338J60340n4011J9512k77590J65605R5469k89103J34492k15449J77111
16429D17714K09383B48465R9559K39167k39038J7565J8058o9172K90486j53199
16419D51891p5383o9342j1810J85211A36443J42139L0624A10863P4781K6144R5753
16408C07541l25k9811M840L3475J63824b5131D0034J47534K97921k19995Q569
$$ plain form
16479 472400 784227 665775 828366 900080 504546 564318 479100 620774 502941 697852
16469 697852 289757 537577 682129 287018 664604 795542 809218 534811 598491 423001
16459 423001 529542 567262 452451 888100 269660 249467 449616 264077 521731 741898
16449 741898 386466 727545 284880 435335 763022 256284 634843 647525 596489 501338
16439 501338 661678 607667 627179 349589 515194 610663 321560 456052 240603 417714
16429 417714 627097 248465 348024 587191 348153 365718 383776 314604 605090 451891
16419 451891 376508 307166 295356 480567 136443 278582 309206 110863 185644 211788 307541
16408 307541 307216 277405 282245 315720 479544 -25131 40034 187568 485489 265494 274063
16397B74063l3980r4948M3202k7108K42510m8999P9993B13067R2503n2751j21634
16386A31185J34352l257K19587a7940B7642J95056A00002L3774K53727A42619
16375B20735D6345K67943j0683J7721A43462F8832M76030k15181o8206R8849E1135
16363A98003L7105q8534N2764n6580a14106E47818j01713c3878A99821L05308
16353E05129D7098L1678j5823K72231k5545K3348h2362A28765J01509j06236R8345
16342B22383l1623D9468L47195p4673K06251A72771N0440B9184O3245L15726j90999
16331B17156E6017J55500j0269b13915b5535A83467L13259C2014K41138a25177
16320A83736g1456a4967j41250F19942l02529a525C94860l8629k7105D6221L3763
$$ plain form
16397 274063 240083 145135 188337 161229 403739 354740 434733 213067 305570 252819 131185
16386 131185 265537 262280 481867 -17940 27642 222698 100002 133776 387503 142619
16375 220735 46345 314288 303605 321326 143462 68832 544862 329681 261475 360324 51135
16363 198003 235108 146574 199338 142758 -114106 547818 446105 -33878 199821 505129
16353 505129 47098 78776 62953 335184 309639 332987 -82362 128765 230274 124038 222383
16342 222383 190760 49468 396663 321990 528241 172771 223211 29184 92429 408155 217156
16331 217156 56017 211517 201248 -213915 -25535 183467 496726 32014 273152 -125177
16320 183736 -71456 -14967 -156217 619942 317413 -1525 394860 356231 329126 46221 79984
16309G9984K17174I9417N8354e7969k8332A34473L15491A00285b4070C78484A1548
16297a8602A9592K15385q6849K5117M1481O3299A17714R9105j9905d7228J4919
16286c2309A33470C0359A4902e3193A94195e8780b7381B56188K252j2991F156
16274h0358C3383a08070B08842I2998c2280G6306a7122B00321N4333I9444O0707
16263A60151N8841G4273q126B9594N3036c3792C70278a0389B76931H6747J592
16252H8339Q6611i8902c0854I126K47739B6116J60433d0087r5655A07914a41546
16240a4613A66716b87277C60217i5296C63939B2382K64411e9474o792n3895a8952
16228I2961d3833F6304C1365R0601k735J28802c8551A24651C1224F032a68119
$$ plain form
16309 79984 297158 99417 157771 -57969 -86301 134473 449964 100285 -24070 378484 11548
16297 -18602 19592 234977 148128 173245 214726 278025 117714 216819 196914 -47228 -32309
16286 -32309 133470 30359 14902 -53193 194195 -58780 -27381 256188 258440 245449 6156
16274 -80358 33383 -108070 208842 92998 -32280 76306 -17122 200321 254654 99444 160151
16263 160151 218992 74273 66147 29594 82630 -33792 370278 -10389 276931 86747 88339
16252 88339 174950 -98902 -30854 9126 256865 26116 186549 -40087 -135742 107914 -141546
16240 -14613 166716 -287277 360217 -95296 363939 22382 286793 -59474 -66266 -120161 -18952
16228 92961 -43833 66304 31365 121966 119231 248033 -38551 124651 31224 6032 -168119
16216A6030J65263J44237a41901b2696j16616f7281A06921K38629j09706j07044
16206A28800E697R969K34142j16374K79400j39111a14897A67676q3474M426k5682
16195F2946k863a58666D9053j44i6351l1645R467m0687j69135P5028A47667k5329
16183A22338K39949b46445k4108R6583L4019R414G3614K2368B5940M02263C5388
16171d3814M700j61519A38627L54909a93971A95348k8855J29493m802j27378P8575
16160B42381I5303k832J23173r7841b09773J03978B80996j25293d6327B201b97790
16148a15781H827b6784l7965A06092J26098i8753D4541J68538I7887H563P8513
16137H7076R1202i0466a0916l00349i9781o7019B65537F4526N2428a59452A21946
$$ plain form
16216 16030 181293 325530 -141901 -22696 -139312 -67281 106921 345550 235844 128800
16206 128800 5697 15666 249808 133434 412834 273723 -114897 167676 84202 88628 62946
16195 62946 60083 -158666 49053 48909 -96351 -127996 -118529 -159216 -328351 -253323 147667 122338
16183 122338 362287 -246445 -270553 -173970 -139951 -130537 73614 95982 25940 428203 35388
16171 -43814 -39114 -200633 138627 493536 -193971 195348 166493 295986 291184 163806 242381
16160 242381 95303 92471 215644 117803 -209773 -105795 280996 155703 -46327 2201 -297790
16148 -115781 8827 -26784 -64749 106092 232190 -98753 44541 213079 97887 8563 87076
16137 87076 178278 -90466 -10916 -311265 -99781 -166800 265537 64526 116954 -159452 121946
16125F0054D18J95205J04934a81837A84678H2061b25567B0395a61200B9403M60070
16114D89473B31784a11314C20446j37672C954a6580j22790H6014m2519b03815
16103F4179J56834r4693a93658i5876C44250h8595q968A81402n7883C8074J64599
16092B02673F9484j4415J623a5947m65837a70122C2088N35697b23966k34905A42021
16080h1436l17968A13473b04177R7259b9836D9844Q1424c1810j75502Q8843e1081
16068a75950P5551o3105B9996e6671j10883l7189b0916k64216B97022h2915p1892
16057a54807B97044g9085c8332j98104A01840c5562I362b9328B2367b08361B0850
16045a17089k77438A67874L5670q158D7512J6772b01499G3020K8970m5923a66985
$$ plain form
16125 60054 418 195623 300557 -181837 184678 82061 -225567 20395 -161200 29403 489473
16114 489473 231784 -111314 320446 182774 3954 -16580 -139370 86014 43495 -203815
16103 64179 221013 126320 -193658 -95876 344250 -88595 -97563 181402 123519 38074 202673
16092 202673 69484 55069 56692 -15947 -481784 -170122 32088 567785 -223966 -458871 142021
16080 -81436 -399404 113473 -204177 -106918 -29836 49844 131268 -31810 -207312 -118469 -51081
16068 -175950 -100399 -163504 29996 -56671 -167554 -204743 -20916 -285132 297022 -82915 -154807
16057 -154807 297044 -79085 -38332 -236436 101840 -35562 9362 -29328 22367 -208361 20850
16045 -117089 -394527 167874 203544 195386 47512 64284 -201499 73020 101990 56067 -166985
16033B341K28417J659G8626Q7886D5856J83298r0772a51896A55513a31309j67425
16022b98734f9590A39948m0993c4030B6326R9250a77911Q3462A94335a2079B04797
16010a65550I3811J99552g1054j81643D22918a097j08708a6131J091B501J74446
15999A76947n1027c87941A83683a60348E4897J46315F9619B1989K7148d0736G7937
15987a25609e4742I839b87542b2246r305B70747J52455j85410p6582P8574a14794
15975C5230J34951a00682A22244N7018l5579a7677H1241b53554A82202b46706
15964c02336a26504j79152H3243l3504e9374B2071b8538j28512N8078o2770I7055
15952a45287f9690k23404B77011f2737j0838B10760a23608j38792L1533c0260
$$ plain form
16033 2341 230758 232417 78626 166512 45856 229154 138382 -151896 155513 -131309 -298734
16022 -298734 -69590 139948 98955 -34030 26326 125576 -177911 -94449 194335 -12079 204797
16010 -165550 93811 293363 -71054 -252697 422918 -1097 -109805 -16131 -15040 2501 176947
15999 176947 125920 -387941 183683 -160348 54897 201212 69619 21989 49137 -40736 77937
15987 -125609 -54742 9839 -287542 -22246 -31551 270747 423202 237792 161210 239784 -114794
15975 35230 170181 -100682 122244 179262 143683 -17677 81241 -253554 182202 -246706
15964 -302336 -126504 -305656 83243 49739 -59374 22071 -28538 -157050 -98972 -161742 97055
15952 -145287 -69690 -293094 277011 -62737 -73575 210760 -123608 -262400 -230867 -30260
15941H0361b90519e8703m56762A95352b13505A05730a53792C5289g8842b0107
15930b8709j00556J9168K9834A64767l6443f6494p6590l2175l1573N8987A65780
15918A16019a50644c7959j64651A74245J48155e9732j2991a8162r356p9073A59297
15906c1322a4994k50350g2920K3982A88348r0533M0608n1479c0386q8287N6975
15895f1698B4905Q7113a57869A20676D6131a18997M7762j797L5570B5854J05080
15884A30934A4510a35764o6755C9461a49484A78150a05946q076j68771A3761d3192
15872h3119b0861m32067C5915c15662P3525m6633i3711k14149F7714a34835H2190
15860h8203j27478e9529K8046k36965D8615J14565o0151C9449c48632B69099a33474
$$ plain form
15941 80361 -290519 -58703 -515465 195352 -213505 105730 -153792 35289 -78842 -20107
15930 -28709 -129265 -110097 -80263 164767 128324 -66494 -143084 -175259 -206832 -147845 165780
15918 116019 -150644 -37959 -202610 174245 322400 -59732 -72723 -18162 -27518 -106591 159297
15906 -31322 -14994 -265344 -72920 -48938 188348 97815 138423 86944 -30386 -118673 -61698
15895 -61698 24905 112018 -157869 120676 46131 -118997 -71235 -73032 -37462 25854 130934
15884 130934 14510 -135764 -202519 39461 -149484 178150 -105946 -114022 -282793 13761 -43192
15872 -83119 -20861 -452928 35915 -315662 -242137 -288770 -93711 -307860 67714 -134835 82190
15860 -88203 -215681 -59529 -31483 -268448 48615 163180 103029 39449 -348632 269099 -133474
15848b10512A59578E7675J19295a04451B985P628c26437a07779j70051H1092k9503
15837E1589P7355b27111J13384B44406d8656l2642H220J59553r77p3995l9372
15826E3429K00988A03935f2751F2492e4113M003j46393C8879c23377J28345A20096
15814B24270g9066C6033Q4618a33861e3064l06154A58378j7877l1803f1189k45993
15803c07182C34059g4391A17250a04261b4663r0460e1709A28435A0530b09332
15792A30682b99931E2837h6137K570A47201c00121K4263C46672C9812R2464b13661
15780g7320k6041B11935g5767F6610d2654D10233A4259N6884a26822B53278a57294
15768d64114I9346b5504q7656E8936d44180H3188c84230A59879Q360g5224B89195
$$ plain form
15848 -210512 159578 57675 176970 -104451 2985 10613 -326437 -107779 -277830 81092 51589
15837 51589 128944 -227111 -113727 244406 -48656 -81298 8220 167773 166796 92801 53429
15826 53429 254417 103935 -62751 62492 -54113 -50110 -196503 38879 -323377 -195032 120096
15814 224270 -79066 36033 120651 -133861 -53064 -359218 158378 140501 108698 -61189 -307182
15803 -307182 334059 -74391 117250 -104261 -24663 -115123 -51709 128435 10530 -209332
15792 130682 -299931 52837 -86137 -83567 147201 -300121 -275858 346672 39812 132276 -213661
15780 -77320 -103361 211935 -75767 66610 -42654 410233 14259 71143 -126822 253278 -157294
15768 -464114 99346 -25504 -113160 58936 -444180 83188 -384230 159879 168239 -75224 289195
15756c07774a20112A6172O0126K80867f2172E5910a74627A94277a41280j92295
15746c33575A79047g8234B14143E2807M9651i904j35643A38467d6218A92777b06128
15734a30266j7159C9911a23023L2784A47920l7441N8177e4927q7663O4510A07015
15722A04372J57384a86954Q5711H4261b28587R644a08393G2686a025A0432a51976
15710a79960B44662l0450e5814B87930h9938B00686C810c10323h4490q2602h1236
15698c15466B65232b31621d112l7893B6019L0404J94977a36591d5047E64179g9867
15686A85058b54763h6785j92161a26785a4085I3334c49523R3189R8122c2653I779
15674a00619j01050D9669K65515m7317G4988M46765c56297a54317O7822j1272
$$ plain form
15756 -307774 -120112 16172 76298 357165 -62172 55910 -174627 194277 -141280 -333575
15746 -333575 179047 -78234 214143 52807 102458 -9904 -145547 138467 -46218 192777 -206128
15734 -130266 -147425 39911 -123023 -90239 147920 110479 168656 -54927 -142590 -78080 107015
15722 104372 261756 -186954 -101243 84261 -228587 -218943 -108393 72686 -1025 10432 -151976
15710 -179960 244662 214212 -55814 287930 -89938 200686 3810 -310323 -84490 -167092 -81236
15698 -315466 265232 -231621 -4112 -42005 26019 56423 251400 -136591 -45047 564179 -79867
15686 185058 -254763 -86785 -278946 -126785 -14085 93334 -349523 -256334 -158212 -32653 9779
15674 -100619 -201669 49669 315184 267867 74988 521753 -356297 -154317 -86495 -97767
15664i7767b7392j69369G724c5346q5721A25569D7624K962b11053c5472o9472
15653a04944j16948E5947k3864e12D7203i8674B772J46784o1400J0491a80425
15641b4900j23806L2907q7640O3181A02938b88308b4636j46055O9825j39750j10172
15630c50788i3327j07676c5057B88220a46560I5404c50426B37911h0543B8590
15619b21169j34804A17659b033F5384k8984c3471G0515M3013K64157a11602F5434
15607d7047n7440k76855A19061a29349I5372c22991a43235I7329m7350O6668J25941
15596B42588A6861a52241A76546c22989a4713A27456c49271F3257j1997a20727
15585a53626A91412a18149B2678J03766G896c88727G6792b26963k02230J44260
$$ plain form
15664 -97767 -27392 -196761 7724 -35346 -121067 125569 47624 50586 -211053 -35472 -104944
15653 -104944 -221892 55947 32083 -512 47203 -98674 2772 149556 88156 98647 -180425
15641 -24900 -148706 -115799 -203439 -140258 102938 -288308 -24636 -170691 -100866 -240616 -350788
15630 -350788 -93327 -201003 -35057 288220 -146560 95404 -350426 237911 -80543 28590
15619 -221169 -355973 117659 -2033 65384 36400 -33471 70515 113528 377685 -111602 65434
15607 -47047 -104487 -381342 119061 -129349 95372 -322991 -143235 97329 49979 116647 242588
15596 242588 16861 -152241 176546 -322989 -14713 127456 -349271 63257 51260 -120727
15585 -153626 191412 -118149 22678 126444 7896 -388727 76792 -226963 -429193 -284933
15575b84933M0553b6445I3461a27228d9532A94996E6147b09883A43177a01324
15564A74089K21853h7308m2941A27823i7338G8181b0797D7516c5934j7361A58145
15552B01550b08182K4922G1006a20692B7253L5151a08536k06009A8593K22544
15542B41137b921q7867A8894c00590C65365a16399G8446i915k13865A0468a36901
15530B3402J2108h8729H2493e8842j18705d550H8342K21611c6062m0642A87645
15518A65537k9577d9587m24611d9806C8866b3065A78399G5282B8349a93892B66901
15506I0638b66553A70164b45315J22648p5256A28135J53041j24180b8149H6586
15495b19058R7560A86256a73809N4689A67245i5033I3918b0741A5100f7399G6341
$$ plain form
15575 -284933 -244380 -26445 93461 -127228 -49532 194996 56147 -209883 143177 -101324
15564 174089 395942 -87308 -130249 127823 -97338 78181 -20797 47516 -35934 -53295 158145
15552 201550 -208182 -183260 71006 -120692 27253 62404 -108536 -314545 18593 241137
15542 241137 -2921 -90788 18894 -300590 365365 -116399 78446 -9915 -223780 10468 -136901
15530 23402 35510 -88729 82493 -58842 -177547 -4550 88342 309953 -36062 -76704 187645
15518 165537 135960 -49587 -474198 -49806 38866 -23065 178399 75282 28349 -193892 266901
15506 90638 -266553 170164 -245315 -122667 -197923 128135 281176 156996 -28149 86586
15495 -219058 -121498 186256 -173809 -119120 167245 -95033 93918 -20741 15100 -67399 76341
15483a84210e3050K0073j1818r4030L2157H6117K41431A13185b41546a1888r709
15472b1597B09606L2351e3052k34321J12172K8692A42102C8030K12679a24179
15461a61626A39375J905a41290A60654i3851A11358J7959b28184G5784a64388
15450a30222C7208P4154H137O1228a42920R340A52452G2593a27928J715A42564
15438g5672B41251H1102g583k5774I9084b10601i5241J7475c4989I5682J89244
15427B84926a30349M8637I5498a56103B63021C690K05950j01743a4537j26941
15417a41478b6277A28121E5062i0746L9884A64054g9856r3660C90314I2244g9358
15405B91142j45551R2847G205b85893h5222j01681B06242b6883j29067e7375n9587
$$ plain form
15483 -184210 -53050 -32977 -44795 -138825 -106668 86117 327548 113185 -241546 -11888 -21597
15472 -21597 209606 241957 -53052 -287373 -175201 -146509 142102 38030 250709 -124179
15461 -161626 139375 141280 -141290 160654 -93851 111358 129317 -228184 75784 -164388
15450 -130222 37208 111362 8137 69365 -142920 -133580 152452 72593 -127928 -126213 142564
15438 -75672 241251 81102 -7583 -33357 99084 -210601 -95241 -77766 -34989 95682 284926
15427 284926 -130349 -81712 95498 -156103 263021 3690 209640 107897 -14537 -141478
15417 -141478 -26277 128121 55062 -90746 -50862 164054 -79856 -173516 390314 92244 -79358
15405 291142 145591 238438 7205 -285893 -85222 -186903 206242 -26883 -155950 -57375 -116962
15394a16962j57924J29265d0665O445l8580B57998A2076K17945r5988n7724e8369
15382A26797L34506I3038b04078K3112A44060C516a53026A0298J23659E4128a75645
15370A45203p2101K17853D9647b00927A11140a26895o9130A2256b6959M469j90444
15359b12934M6687A54941i4333C02374b45236A17359e5723B52665K27459D4729
15348e8958E8863K62847h5312F1523a52318f1227o9966f5581D1048d07518a00445
15336b71506e4327j02882C25784G6916L4637f2124A1600J59583B0202a34533C9443
15324a78802D2036O2505P0860f1299b7995A77655b05808h7742B3917a42130b1734
15312a3076p4097q6844E1344L2876l7707j8955b77859g6702F0J84219F6007h4989
$$ plain form
15394 -116962 -274886 -145621 -40665 -34220 -72800 257998 12076 230021 134033 76309 -58369
15382 126797 461303 93038 -204078 -180966 144060 3516 -153026 10298 133957 54128 -175645
15370 145203 73102 290955 49647 -200927 111140 -126895 -196025 12256 -26959 -22490 -212934
15359 -212934 -166247 154941 -94333 302374 -245236 117359 -55723 252665 480124 44729
15348 -58958 58863 321710 -85312 61523 -152318 -61227 -131193 -65581 41048 -407518 -100445
15336 -271506 -54327 -157209 325784 76916 111553 -62124 11600 171183 20202 -134533 39443
15324 -178802 42036 104541 175401 -61299 -27995 177655 -205808 -87742 23917 -142130 -21734
15312 -13076 -87173 -174017 51344 84220 46513 27558 -277859 -76702 60 184279 66007 -84989
15299d70350a11658D3079K03831A8801b56041A55216Q9356D4135J1720J04710
15289A60565m7328m3792K02068G0692P2902J52719D8942j9739O001J57325a46151
15277a97609B97307E3121J82624p7280a7094A94792N2837g9590k8176K1605B11934
15265C19039c3936i082A70731f2844K7516C2337Q7597f4307A00878N9065p6795
15254H3148L44028A72972Q3636E0892M16896B4719M93847P04303J07662k88262
15244A042269O31642p08139B70756A20135l5725M5280p679C3088K87272A45295
15233f4134j3842A9523Q6390E1353d4943B24770p1797l9929J50701r3567o4567
15222A05611B0129J2046K06603a10542c426o121A08176B5982b02054C1563G928
$$ plain form
15299 -470350 -111658 43079 246910 18801 -256041 155216 244572 44135 55855 160565
15289 160565 113237 69445 271513 70692 143594 296313 48942 29203 35204 192529 -146151
15277 -197609 297307 53121 235745 158465 -17094 194792 247629 -79590 -107766 -86161 211934
15265 319039 -33936 -9082 170731 -62844 -35328 32337 119934 -64307 100878 159943 83148
15254 83148 427176 172972 256608 50892 467788 24719 518566 1222869 1330531 1042269
15244 1042269 1673911 965772 270756 120135 84410 129690 122011 33088 320360 145295
15233 -64134 -77976 19523 105913 51353 -44943 224770 152973 113044 263745 170178 105611
15222 105611 20129 32175 238778 -110542 -3426 -9547 108176 25982 -202054 31563 7928
15210a97052e5216C00731k9073i728j69647B42421g0152F5892b14008A87916P995
15199A95911n4827c3261C6128f5564k65539A5394J0076N2861i8247A1167h4018
15187f8847D9537a80015F3502J22480p5369C4950i8494B24012a34575a1783G7369
15175A60088k1293d1842B61471a16736c5553q9357a2217A92360H3648c27561E18979
15163A34945K73369j93669J0834F6733A4490J17597K23543a50475c5045j12905
15153a47950B2622b4388B3796J18369e9430B00980A0576a89792C28652D3535J7602
15142F1137J27966o2052d0593B68694A0122a81297L5567D05645a54142C44347
15131b15798A76149o7001J563k0397J85289j22264J22436G0180C393J74233a06492
$$ plain form
15210 -197052 -55216 300731 271658 -9728 -179375 242421 -70152 65892 -214008 187916 195911
15199 195911 141084 -33261 36128 -65564 -331103 15394 25470 78331 -98247 11167 -84018
15187 -68847 49537 -180015 63502 185982 110613 34950 -98494 224012 -134575 -11783 77369
15175 160088 138795 -41842 261471 -116736 -35553 -124910 -12217 192360 83648 -327561 518979
15163 134945 408314 214645 225479 66733 14490 132087 355630 -150475 -35045 -147950
15153 -147950 22622 -24388 23796 142165 -59430 200980 10576 -189792 328652 43535 61137
15142 61137 189103 127051 -40593 268694 10122 -181297 -145730 405645 -154142 344347
15131 -215798 176149 109148 110711 90314 275603 153339 275775 70180 3393 177626 -106492
15119B20698a3287A22679c44530e0112A70523a57759B96504A35882J40477A26853
15108d0930E1362d5054A71401F2727e7865I5245c0257D01214A04989j2462K67773
15097C60300j14824J86110a16054q5614C3660E049K07806N3305K67367B49196
15086a20129A20304m3494J25565a31213C38517a79585A26854k4899K63046A51127
15075c4240A41708P5773B5407J97362o3019c9291E40604B35622o5692P3812j16635
15064A27107K08780A04943K28765A01090K4651B4914g8629A0845N7831K80671
15054C49347G7157R6136R7639B895a18159A77819N5092o6332J36700b1640C93729
15042B48975O9160M3243b16407B43372q7870K27944F9260L49933C4066J5026K18135
$$ plain form
15119 220698 -13287 122679 -344530 -50112 170523 -157759 296504 135882 276359 126853
15108 -40930 51362 -45054 171401 62727 -57865 95245 -30257 401214 104989 92527 360300
15097 360300 245476 431586 -116054 -201668 33660 5049 212855 266160 533527 249196
15086 -120129 120304 76810 202375 -131213 338517 -179585 126854 101955 365001 151127
15075 -34240 141708 217481 25407 222769 159750 -39291 540604 235622 169930 243742 127107
15064 127107 335887 104943 333708 101090 125741 24914 -78629 10845 68676 349347
15054 349347 77157 173293 270932 2895 -118159 177819 232911 166579 303279 -21640 393729
15042 248975 318135 361378 -216407 243372 155502 383446 69260 419193 34066 49092 267227
15031B67227f222o6677D52794r8518j16424b5486A25414h2849C74284A9535M26662
15020D46197o0069D2563M3317O1655J57911r3128K79811C9958K60048F9628O8054
15009A37682J32575B7361j2606J13557a49248B95928J11983A88769M3758C0426
14998b01286B12458K78561j67163N9450A28865J73221p1316N3035Q767j02052
14988A90520K48356j20079J63808k00595a60006A42207F9118b6348A24926J12208
14978B37134r3021L585K5191J8847C2693L98752K5017B21174R7185C4808J0869
14967D5677O3099L16323A05953K57954P0688k09677P273K03026a05497B89601
14956A07771A9998K15688A04954O2960j1522L61898B01971L51582H6593K38971
$$ plain form
15031 267227 -6222 -72899 452794 354276 237852 -25486 125414 -82849 374284 19535 446197
15020 446197 386128 42563 85880 147535 305446 212318 492129 39958 300006 69628 137682
15009 137682 270257 27361 14755 128312 -149248 295928 407911 188769 232527 30426
14998 -201286 212458 491019 323856 383306 128865 302086 230770 283805 292572 190520
14988 190520 438876 318797 482605 282010 -160006 142207 69118 -26348 124926 237134
14978 237134 144113 147698 172889 191736 32693 431445 456462 221174 318359 34808 45677
14967 45677 108776 425099 105953 363907 434595 224918 232191 435217 -105497 289601
14956 107771 19998 235686 104954 167914 156392 518290 201971 553553 86593 325564
14946C25564E7240L51022j14765r3378K11209j19446p9881K52286j42784O6116
14936C87619a2517F51633k03496B12690I9299b5430D7763J71148Q2427D5025J89174
14925B34199K19120A95380J02642b8774B31857K24857Q6585A17031M5885M13726
14915E76642B0924M23392G522N34511L0217j35764k057J68769f6081E39344m5683
14904D93661j63232A59445L3508J01983J39462K91012A74167l6037R6619Q5447
14894C20196p1373K54192B38695r5468J0128l9741J66323J58240j46716O4884
14884C56345a76849F05078B47168J23805P2521g5302D91498E1970L38116k1158
14874C68928m3129A12499N6139M84996A66476M3932N23311k73170a44H4476J33049
$$ plain form
14946 325564 57240 408262 293497 200119 411328 291882 212001 464287 321503 387619
14936 387619 -12517 651633 448137 212690 99299 -25430 47763 218911 301338 45025 234199
14925 234199 453319 195380 298022 -28774 231857 456714 543299 117031 162916 576642
14915 576642 20924 444316 7522 542033 572250 436486 434429 603198 -66081 539344 493661
14904 493661 330429 159445 192953 294936 434398 725410 174167 138130 234749 320196
14894 320196 248823 503015 238695 143227 153355 113614 279937 438177 291461 356345
14884 356345 -176849 605078 247168 370973 443494 -75302 491498 51970 390086 368928
14874 368928 325799 112499 168638 653634 166476 210408 733719 460549 -144 84476 217525
14863B17525I3832K80687A75085J18365K21051k17748J8855p4031O7730p3870
14853B35437K40000L0194K72461k59824k12919q319O8665k3143J02474j92832
14843B52194K75166k27392J01856q385I7641O04800l00823k0954p2084j31923
14833A76657J72767j56800J83336K31916B15210K99444L27824j68449j43469n8434
14823D72126j65033K60015k67998j13650L00812A85900L69889k22217M04489k18756
14813E19305K05684j89879J19372k56232M4422L2468J49970B10759M50296k67105
14803C93950M59538C81842J17777J22013k58586A27863K19866j2910P4948G6595
14792B48790L79104j69854J70988n2631J8706j15471N078I0097N80980j27264
$$ plain form
14863 217525 93832 374519 175085 293450 514501 296753 315608 241577 309307 235437
14853 235437 475437 505631 778092 518268 305349 297030 365695 342552 445026 252194
14843 252194 527360 299968 401824 393439 97641 702441 401618 380664 308580 176657
14833 176657 349424 192624 375960 607876 215210 514654 842478 674029 530560 472126
14823 472126 307093 567108 299110 185460 486272 185900 555789 333572 738061 519305
14813 519305 724989 535110 654482 398250 442672 475140 625110 210759 661055 393950
14803 393950 853488 381842 499619 621632 363046 127863 347729 334819 409767 76595
14792 248790 627894 458040 629028 576397 595103 479632 484710 90097 671077 543813
14782E43813K81756j81379o9271k7353j11891O3561J79285k35921k5169J44528
14772E61959L16363A98477L14085N0087p7863j6943J49014J86498l74368J23499
14762E52486K5814k01707J96369J68450k24874J09438M0585j48141J51449K4668
14752F94537k08458J11333P1281R3672j15892O2868R4538O7713j16693l64726
14742C90173M12130j79649l6630K21961j35667J22502l16082M75022m6863l47917
14732E58980L51839j90160P0090q7587k71146N0447P4331p7106K32794M44307
14722A156789l77229r9073Q7765l04558N91831m56578K58739O8047k03359j59673
14712E62701L90270k39923J80314k01285j82959Q4408R6591K3216J96680m06212
$$ plain form
14782 543813 825569 644190 574919 547566 435675 499236 678521 442600 417431 561959
14772 561959 878322 198477 512562 562649 484786 467843 616857 803355 428987 552486
14762 552486 578300 376593 572962 741412 516538 625976 666561 518420 669869 694537
14752 694537 486079 597412 668693 762365 646473 709341 803879 871592 754899 390173
14742 390173 802303 622654 586024 807985 672318 794820 478738 953760 906897 558980
14732 558980 910819 720659 790749 703162 432016 482463 556794 479688 712482 1156789
14722 1156789 779560 680487 768252 463694 1055525 598947 857686 925733 722374 562701
14712 562701 952971 713048 893362 692077 509118 593526 690117 713333 910013 503801
14702E03801M33523j95616J50009j98403K49225j85666J89292m2546J18559k22617
14692G99561r0950J6844J89617m5242j66432L1832K76594K93782k39141j70226
14682H96239M718l1653J19328K4668m9732O687j63532J08182j87991J99760M2198
14671I68872k42029J42341K37020J49416k07441j08904J17712J4437J16687r6643
14661A091468K960k763l77049M86753l44523K89495l10261K1188J52874L1704
14651A041846j8913l17980N96849l49931j12290K51571j88871K98504k17053J5957
14641I99689J29949M61608n03259j46810L32391j90396J44040L65024n02875k39517
14631H49844N95914k64528L16253j86079Q1078k20543M0099M71741n32421K26680
$$ plain form
14702 503801 937324 741708 891717 693314 942539 756873 946165 903619 1022178 799561
14692 799561 708611 725455 915072 869830 703398 735230 1011824 1305606 1066465 896239
14682 896239 900957 869304 988632 1013300 963568 970255 806723 914905 726914 926674 968872
14671 968872 726843 869184 1106204 1255620 1048179 939275 1056987 1071424 1188111 1091468
14661 1091468 1094428 1091665 714616 1201369 856846 1146341 836080 857268 1010142 1041846
14651 1041846 1022933 704953 1301802 951871 839581 1091152 902281 1200785 983732 999689
14641 999689 1129638 1591246 1087987 941177 1273568 1083172 1227212 1592236 1089361 849844
14631 849844 1445758 1181230 1497483 1311404 1392482 1171939 1212038 1683779 1151358 1378038
14621A378038J23445K20267m39655K44046j38482K49519j81182k48225K53081
14612A460852K11818n36689K69244M42413m20565J67744r2372K26289k64686j47
14602A463901k56195K10922j1942J63992q7013K07229o6647J11085k78975J65113
14592A621470J63884k10182Q2104J24074j31932J51364j94890O2287q8121M50209
14582B030267o8448J8633r9558j00753J29111L37511l04355R2124K1393k85895
14572A770030M02152J22152n08040N35886K07103l76187J77404N53620l77662
14563B506458j03222K08528j33181k6425K19219K1975R2740l907J80224M42939
14553C405348m6817O99409J13864J231370J746736M068891P923307J8982154p76173
$$ plain form
14621 1378038 1501483 1721750 1282095 1526141 1387659 1637178 1455996 1207771 1460852
14612 1460852 1672670 1135981 1405225 1847638 1427073 1594817 1502445 1728734 1464048 1463901
14602 1463901 1207706 1418628 1406686 1570678 1483665 1690894 1624247 1735332 1456357 1621470
14592 1621470 1785354 1575172 1657276 1781350 1649418 1800782 1605892 1668179 1580058 2030267
14582 2030267 1961819 1980452 1880894 1780141 1909252 2246763 1942408 2034532 2055925 1770030
14572 1770030 2172182 2294334 1786294 2322180 2529283 2153096 2330500 2884120 2506458
14563 2506458 2403236 2611764 2478583 2452158 2671377 2693352 2786092 2782185 2962409 3405348
14553 3405348 3358531 4057940 4171804 5403174 7149910 11218801 19142108 38124262 37348089
14544C7348089A8268276o275852n006991k250165p36643o32190k75215k47605
14536B843615m19356k42280j9015j37488L74710j47575m68830L22472q4171L60171
14526B382253n31750J68220J82946L70938k34069n17798K80464J84093J08369
14517B393666O8616R2898M4607j31485o036r4589L06657J21669l19254P900J39742
14506B624391K49800p5276j22194Q2016L54930k5908p8695K58515r2873k16635
14496B958071J08628J72349j75532K95654k1451j31626L6353l18051L48371J04383
14486C377149J07507j25406O50605j99467J83007n87911L84225j22478J73941
14477C841172K70638k36441J32577R8473J38531o4472q9767n7645j49102K14995
$$ plain form
14544 37348089 18268276 11992424 6985433 4735268 3998625 3366435 3091220 2843615
14536 2843615 2424259 2181979 2162964 2025476 2400186 2252611 1783781 2106253 2022082 2382253
14526 2382253 1850503 2018723 2201669 2572607 2338538 1820740 2101204 2285297 2393666
14517 2393666 2462282 2555180 2599787 2468302 2462266 2367677 2674334 2796003 2476749 2484649 2624391
14506 2624391 2874191 2798915 2676721 2758737 3113667 3087759 3009064 3267579 3174706 2958071
14496 2958071 3066699 3239048 3063516 3359170 3337719 3206093 3242446 2924395 3272766 3377149
14486 3377149 3484656 3359250 4009855 3810388 3993395 3405484 3789709 3667231 3841172
14477 3841172 4111810 3875369 4007946 4106419 4244950 4180478 4090711 4033066 3883964 4098959
14467D098959R2083j15675L11462K01165j65183L02554l4820o4342J9996J28520
14457D774719L31421n90245J67768N65525l71906j71768K19719L96944j70612
14448E151565M16881m35323O8021K69536J7909J87504k15753L62124K49955m90149
14438E582270N36547N9782L9739J24973q7067J71190n9347L57151L7418k45950
14428F516706O81991o9629o3514o9908q307K74333p3141M98677k95825L52767
14418G744150J25214M02017l37178N2324M89244j07794j46618L43809o9100M36835
14408H932903L2855M362L54520j02565M22327J8281r2471N71707o0924L81651
14398A0462646J5511m663K03060M60728j01658N07448q455J74632O7302O31303
$$ plain form
14467 4098959 4191042 4075367 4386829 4587994 4422811 4725365 4690545 4626203 4646199 4774719
14457 4774719 5106140 4515895 4683663 5249188 4877282 4705514 4925233 5322177 5151565
14448 5151565 5568446 5133123 5201144 5470680 5488589 5676093 5460340 5822464 6072419 5582270
14438 5582270 6118817 6178599 6218338 6343311 6256244 6427434 6368087 6725238 6762656 6516706
14428 6516706 7198697 7129068 7065554 6995646 6987339 7261672 7188531 7687208 7391383 7744150
14418 7744150 7869364 8271381 7934203 7986527 8475771 8367977 8221359 8565168 8496068 8932903
14408 8932903 8965758 8970120 9324640 9222075 9644402 9662683 9570212 10141919 10080995 10462646
14398 10462646 10478157 10473494 10676554 11137282 11035624 11543072 11534617 11709249 11776551 12407854
14388A2407854j22354L31501o6569N52018j3718K80401L92737R9488Q4768K43901
14378A4190027K92284N63110O0727M13502L21910O83014O4651K02804K32072O68236
14368A7692337L34092K24675L66525M32533K75274L88511N44958L96030N15631
14359B1170566L40111N41441P25549K50364P31937L35786M75870Q38473O03364
14350B6013461M72073O85491P15826Q06480Q01154M58256P72458R74034O23801
14341C2323034J137097O50296J103543Q59680R83944J244823R39150J173733J317939
14332D1733239J127780Q59302J664652J337744J661740J536150J185264K136616
14324E3242487J284431K081838K004382K056652K136567K069396K626321K040005
$$ plain form
14388 12407854 12285500 12617001 12550432 13102450 13088732 13369133 13761870 13861358 13946126 14190027
14378 14190027 14482311 15045421 15106148 15519650 15841560 16524574 16589225 16792029 17024101 17692337
14368 17692337 18026429 18251104 18617629 19050162 19325436 19713947 20258905 20654935 21170566
14359 21170566 21510677 22052118 22777667 23028031 23759968 24095754 24571624 25410097 26013461
14350 26013461 26485534 27171025 27886851 28693331 29494485 29952741 30725199 31699233 32323034
14341 32323034 33460131 34110427 35213970 36073650 37057594 38302417 39241567 40415300 41733239
14332 41733239 42861019 43720321 45384973 46722717 48384457 49920607 51105871 53242487
14324 53242487 54526918 56608756 58613138 60669790 62806357 64875753 67502074 69542079
14316F9542079L158988K005044L021258L402301K996695L055786L560683M145225
14308I4888059L807169M007785M501422M543119M878313M960166N717684N585948
14300A32889665O457809O706394P224658O978678P975852Q168721Q865315R461240
14292A94728332R657035J0660090J1094403J1746948J1891257J2794615J3537423
14285B76110103J3806964J4450838J5025860J5148987J5232596J5631904J5033691
14278C80440943J4750220J4182775J3105506J1579677Q301572M119716K017598
14271D48498007P07971J175352j842809o670442q900294r145585q961598r322213
14263D05538389r931150j0990130j0630995j0215401j0151460j2805613j4192089
$$ plain form
14316 69542079 72701067 74706111 77727369 81129670 84126365 87182151 90742834 94888059
14308 94888059 98695228 102703013 107204435 111747554 116625867 121586033 127303717 132889665
14300 132889665 139347474 146053868 153278526 160257204 168233056 176401777 185267092 194728332
14292 194728332 204385367 215045457 226139860 237886808 249778065 262572680 276110103
14285 276110103 289917067 304367905 319393765 334542752 349775348 365407252 380440943
14278 380440943 395191163 409373938 422479444 434059121 442360693 446480409 448498007
14271 448498007 449205978 450381330 448538521 441868079 432967785 423822200 414860602 405538389
14263 405538389 395607239 384617109 373986114 363770713 353619253 340813640 326621551
14256C26621551j5243685j4965126j4528153j3647338j3839707j2994288j2455032
14249B28948222j1921682j1012930j0581400r937996q933041q634906q374812
14242A59551455p336987p513638p015969o291724n522925n631013n338833m929186
14234A09971180n122119m420070m123080l663511l930893l438698l633696k790387
14226G8848726l423270k720571k554938k982116k057034k443952k058865j784881
14218E8823099k206564j515314k129883j408487j716685j704097j356168j257987
14210D5527914j645802j546222o47379p53395j342074j471354j145425j062135
14202C5914128r36952o72003n11134j416791o22211j026290q12079m66033j060866
$$ plain form
14256 326621551 311377866 296412740 281884587 268237249 254397542 241403254 228948222
14249 228948222 217026540 206013610 195432210 185494214 176561173 167926267 159551455
14242 159551455 152214468 144700830 137684861 131393137 125870212 120239199 114900366 109971180
14234 109971180 104849061 100428991 96305911 92642400 88711507 85272809 81639113 78848726
14226 78848726 75425456 72704885 70149947 67167831 65110797 62666845 60607980 58823099
14218 58823099 56616535 55101221 52971338 51562851 49846166 48142069 46785901 45527914
14210 45527914 43882112 42335890 41688511 40935116 39593042 38121688 36976263 35914128
14202 35914128 34977176 34305173 33794039 32377248 31755037 30728747 29916668 29450635 28389769
14193B8389769n76521q88113p05868l95312p32800o36064p63539k90815r68156
14184B2432581R8472o79730k13551p27138n50292k62247l46093k88483q15981
14175A8647538l36477l80544r6224m95202J69519o60609n07090l11936l43047
14166A5685928O6097m78563p12883J0000K7161l96086l91212m70308R6237n8744
14156A3377627n27282m5136m41232J03449k05878m47276M4237l87400k33229P0381
14146A1308261l41432j81093k53135k16908J12636l35892l35452J84665j96859
14137I744791o6938j95706k20631L8727m47811p567p2261l12659J79681l60837
14127H278789O4621j29265L24890n37690o9245j78896l71526j20485L97911l61070
$$ plain form
14193 28389769 27813248 26925135 26219267 25823955 25091155 24455091 23691552 23400737 22432581
14184 22432581 22531053 21851323 21637772 20910634 20360342 20098095 19752002 19463519 18647538
14175 18647538 18311061 17930517 17834293 17339091 17508610 16848001 16340911 16028975 15685928
14166 15685928 15752025 15273462 14560579 14570579 14597740 14201654 13810442 13340134 13436371 13377627
14156 13377627 12850345 12805209 12363977 12467426 12261548 11814272 11858509 11471109 11237880 11308261
14146 11308261 10966829 10785736 10532601 10315693 10428329 10092437 9756985 9941650 9744791
14137 9744791 9677853 9482147 9261516 9300243 8852432 8844865 8772604 8459945 8639626 8278789
14127 8278789 8343410 8214145 8539035 8001345 7932100 7753204 7381678 7261193 7659104 7298034
14117G298034n7126P0264K0096j50667o14456K77485k85849L6740k23153M38170
14107F809538l05220j34112j39978j98337k05351K9669J39502k95683j01530K28474
14097E826972j37971l35996R5623J33334m15695K35715k66992L9330k24898J39085
14087E088507r1608j82005l23716M30992J22354k93291L8936l14983L55367m55110
14077D375443K93196j57682N9302l78067L11999l71547P7843m95296N66528j11568
14067D170151m0550R5839j15745l16816j96922J45413n3735M70382n04372J85464
14057C839109m1746M8874j19207j15481n5208N6171J56683l08779L6161l60407
14047C136170l9503K03467P6095k37189J66921n824l70348K80770k03798L46761
$$ plain form
14117 7298034 7240908 7311172 7331268 7180601 6566145 6843630 6557781 6594521 6371368 6809538
14107 6809538 6504318 6370206 6230228 6031891 5826540 5856209 5995711 5700028 5598498 5826972
14097 5826972 5689001 5353005 5448628 5581962 5166267 5401982 5134990 5174320 4949422 5088507
14087 5088507 4996899 4814894 4491178 4922170 5044524 4751233 4790169 4475186 4830553 4375443
14077 4375443 4668639 4510957 4570259 4192192 4504191 4132644 4210487 3715191 4281719 4170151
14067 4170151 4129601 4225440 4109695 3792879 3595957 3741370 3687635 4158017 3653645 3839109
14057 3839109 3797363 3846237 3727030 3611549 3556341 3612512 3769195 3460416 3496577 3136170
14047 3136170 3096667 3300134 3376229 3139040 3305961 3300137 2929789 3210559 3006761 3353522
14037C353522J39592l77489k50553P167k55274N19153M4407l88786J07456K62821
14027C162016j25272k79462j3055p8411J06820k16257J80283k78864j16290J02212
14017B443720l4975K01350m67359N23612j64621k44524L91240O3651j25303l96391
14007B190400K03979j05230l07417N61290k92939l0394k83165j13075l3921J24321
13997A913849L94639j82587j25063m1544J01548j81639q0060P45188J033568K854271
13987F432170O359455J8560167Q961083j8127719r188465l798928k386433j085582
13979E725748o66170o48718o87363J10597p51500l448j11390k05633m46174R3271
13969B409220L0673q2045O9607l62952q1798J51454J97856k04918j41890J20179
$$ plain form
14037 3353522 3493114 3115625 2865072 2872239 2616965 3136118 3180525 2791739 2899195 3162016
14027 3162016 3036744 2757282 2744227 2665816 2772636 2556379 2736662 2457798 2341508 2443720
14017 2443720 2408745 2610095 2142736 2666348 2501727 2257203 2648443 2712094 2586791 2190400
14007 2190400 2394379 2289149 1981732 2543022 2250083 2219689 1936524 1823449 1789528 1913849
13997 1913849 2308488 2125901 2000838 1959294 2060842 1879203 1799143 2544331 3577899 6432170
13987 6432170 12791625 31351792 40312875 22185156 12996691 9197763 6811330 5725748
13979 5725748 5059578 4410860 3723497 3834094 3082594 3079146 2967756 2762123 2315949 2409220
13969 2409220 2439893 2357848 2427455 2064503 1982705 2134159 2332015 2127097 1985207 2105386
13959B105386j38867N9015J72656j44280j50493K22317k43605O0874L8686j98622
13949A783067j41297J49835J3776P647r3380J66827k33413K47004j45241J61459
13939A916284k76716j31006J58381j83064L19027P2279k01301N8983j10180J04318
13929A727005j8312l9433j87445J82732o346J73180r8996p3732k90537Q6720p2215
13918A382621J3922K23634m9864j8200k78613J87287j21855Q8674l44173L46267
13908A429700j15520K98808l62536m1121O4764M12866m41250q150L75572l25853
13898A287280J97242j43435K69819n81791N8656L01275l46240j18369L04574J9753
13888A248764j45619P0368P9398K99878r0975l11177J72096m35227N71839k85424
$$ plain form
13959 2105386 1966519 2025534 2198190 2053910 1903417 2125734 1882129 1943003 1981689 1783067
13949 1783067 1641770 1791605 1805381 1813028 1719648 1886475 1653062 1900066 1754825 1916284
13939 1916284 1639568 1508562 1666943 1483879 1802906 1875185 1673884 1732867 1622687 1727005
13929 1727005 1708693 1669260 1481815 1664547 1658201 1831381 1732385 1658653 1368116 1454836 1382621
13918 1382621 1396543 1620177 1570313 1552113 1273500 1460787 1338932 1427606 1083433 1429700
13908 1429700 1314180 1612988 1250452 1209331 1274095 1686961 1245711 1237561 1613133 1287280
13898 1287280 1484522 1341087 1610906 1029115 1087771 1389046 1042806 924437 1229011 1248764
13888 1248764 1103145 1173513 1252911 1552789 1461814 1150637 1322733 887506 1459345 1173921
13878A173921J07168j96156q711K74049l38037J06946J04246p8029J36461j55181
13868A126677j47249M23635j18940o8274n36721L54161j79290J89690J86451J48291
13858A378431l03266k16169J82367l19121N44089m09024L33851q1597l37660J59289
13848I31190n9189k53306N89857k83163O5986k70925K81053J05142q5770m23868
13838E97007J45354n5762l3074R7623M86072m76111j65140L15787Q4832D92749
13827A016230L7985k40082L3360J78619k67132K14414k48131j08508J96007j07595
13817G05167L34928m60852J82366K60894j83814N26539n71369K6080k10454N24773
13807A134258l53434J16997m0310k5952k06829N071l7947K59195p5153N8220P2425
$$ plain form
13878 1173921 1281089 1084933 1076222 1350271 1012234 1119180 1223426 1145397 1281858 1126677
13868 1126677 979428 1403063 1284123 1215849 679128 1033289 853999 1043689 1230140 1378431
13858 1378431 1075165 858996 1041363 722242 1266331 857307 1191158 1109561 771901 931190
13848 931190 872001 618695 1208552 925389 991375 720450 1001503 1106645 1020875 597007
13838 597007 742361 686599 653525 751148 1237220 761109 595969 911756 996588 492749
13827 1016230 1054215 814133 847493 1026112 758980 973394 725263 616755 812762 705167
13817 705167 1040095 579243 761609 1022503 838689 1365228 793859 819939 609485 1134258
13807 1134258 780824 897821 857511 831559 624730 629801 591854 851049 775896 834116 906541
13796I06541J86472n31488K34866O4799k6650J86707J3026D13349K57627k80734
13786C90242K32755k89463L54305q6841L5909L1097l03839M12367L1375o7213
13776G40694L28643k83368l28537J53582L3837n8638M7782J73447l27456J02254
13766E82240l7405N3256J359J85616J10165D08545k0243K18993L7731k01910J78684
13755F21800l1534B02139K46905J71450k22941J60660J97256r1809m4182j89514
13745D29964K93426j77437q2476q3832K35588Q4092n3475k98869K07435J58203
13735G12619L9119k37091J97537m3959k56339K0051K00106J36845J8169l35988
13725D51069N16151l77920L32162l11833k00766J17603J58418J57679D09961j49821
$$ plain form
13796 906541 1093013 561525 796391 861190 834540 1021247 1034273 413349 670976 390242
13786 390242 622997 333534 687839 600998 636907 668004 364165 776532 807907 740694
13776 740694 1069337 785969 457432 611014 644851 586213 633995 807442 479986 582240
13766 582240 544835 598091 599450 785066 895231 408545 388302 607295 645026 443116 621800
13755 621800 590266 202139 449044 620494 397553 558213 755469 663660 619478 429964
13745 429964 723390 545953 463477 379645 615233 699325 645850 346981 554416 712619
13735 712619 751738 514647 712184 668225 411886 431937 632043 768888 787057 451069
13725 451069 967220 589300 921462 609629 408863 526466 684884 842563 409961 260140
13715B60140L23500k3530k33591M7935J83582j66601J03970l9101j69881K49635
13705E36058L0872j79953L01022K9040l27471K43296B31177K39111J52254J94476
13695H17018k29107J2082O9180k94185M01183k09810B41504R8788J88702B50088
13684C13708J44886k3002Q1501m4199J72006k81440l9957R3737K16992H4549N47965
13673F32514j27379K23191B99915P4530R0652J31959m0923j43876N5393M26478
13663H94128D03913I1672J69602r4911L07880j06420L35136B08428J35542K9150
13653C73120K55448j07209l3849A37262J84035j15903O6946M1432K22761j03026
13643D33507n794q8600J25985j04180L04504A42915K55345K30719B89347J75387
$$ plain form
13715 260140 583640 560110 326519 374454 558036 391435 495405 456304 286423 536058
13705 536058 566930 386977 687999 717039 389568 632864 231177 470288 622542 817018
13695 817018 587911 599993 669173 374988 776171 566361 241504 340292 528994 250088
13684 313708 458594 435592 517093 472894 644900 363460 323503 417240 634232 84549 632514
13673 632514 505135 728326 299915 374445 465097 597056 556133 412257 467650 894128
13663 894128 403913 91672 261274 166363 474243 367823 702959 208428 343970 373120
13653 373120 628568 521359 487510 137262 321297 205394 272340 313772 536533 433507
13643 433507 427713 339113 465098 360918 665422 142915 398260 628979 289347 464734
13633D64734j37798J64359P9071B37950l9473n3089J96838L31526g2455B56349
13622D62389j00174M9121j48249k9694L03694j42275j32134I0586L08153J15036
13612E13775r9146R400J96986B57807J01289Q0325D4593L37749K53293B99749
13601G10521c3932B03521J58441K36153B05631J8304K52920k17861J47141d2636
13590A27047l935P7832M68972A2310L03388K02315j60187p0910J444J43138l2349
13579C99149l4501F3855J50442G7665M59187j42448j07412l0080L56170k91789
13569C21293q6384K34571j57736F8348L68388j17815R2469L3465o3557j6842j8368
13558C46088G4464K87191j62532a0665C25005J23332A73500o6813J19213J16971
$$ plain form
13633 464734 326936 491295 570366 237950 198477 145388 342226 673752 -72455 256349
13622 462389 362215 411336 263087 233393 537087 394812 262678 90586 398739 513775
13612 513775 414629 424029 621015 257807 359096 439421 44593 382342 635635 299749
13601 710521 -33932 203521 361962 598115 205631 223935 476855 258994 406135 -42636
13590 127047 123112 200944 669916 12310 315698 518013 357826 286916 288360 431498 399149
13579 399149 364648 63855 214297 77665 536852 394404 286992 256912 613082 321293
13569 321293 234909 469480 311744 68348 436736 318921 411390 444855 381298 364456 346088
13558 346088 74464 361655 199123 -10665 325005 448337 173500 106687 225900 342871
13548C42871A20322K55694K5232j35477m3537m2202J55174L8207j76541p0635
13538A26237d577D6869b2179E14406p7246j03218Q4742j44822j7242A18302J62927
13527B81229h3610H6738h1085B68863L22363A19789K38623j10135r5858j8239
13517A34180A7723M24875j18845j43989K38807A92073M38867j49513j03884P3056
13507D50599j37854j39565M5226J96983a04145D97966j98507j7689J882j12639
13497A71013K82998j03600j5193b732C25096C8826J00173J72760b4601D63939
13486C97467A95992M0899J53934P8561k23466J62520A53205K49196a42722D16594
13475B65459n0262E208J14460J07172J97739m3412q8641K737j5901A29572J2420
$$ plain form
13548 342871 120322 376016 401248 265771 222234 180032 335206 373413 196872 126237
13538 126237 -4577 46869 -22179 514406 437160 333942 418684 273862 256620 118302 281229
13527 281229 -83610 86738 -81085 268863 591226 119789 358412 248277 152419 134180
13517 134180 17723 442598 323753 179764 418571 192073 630940 481427 377543 450599
13507 450599 312745 173180 218406 415389 -104145 497966 299459 281770 283652 171013
13497 171013 454011 350411 335218 -2732 325096 38826 138999 311759 -24601 463939
13486 397467 195992 236891 390825 469386 245920 408440 153205 402401 -142722 416594
13475 265459 215197 5208 119668 226840 424579 381167 292526 295263 279362 129572 141992
13464A41992J97217f4448B85730a2373D2828L5089l225M35247M9827B78097A24781
13452C02504b13038B19314j1089q1236J24176K726J26249j70320m2979P6062n39
13441B42364Q7987j9746j11425d799D4940J04111R2173o3362j4699m8282j0926
13430A03955K16311A8744N1438M07355G0747L29579j7893A08807L89064j11568
13420C86303A93012J50941H9300N5213D7902J27540A2951K51233F1419J57206
13410B18625o5143K23431r1268m5933Q2608A8531d8125D16900b7416B71779b08182
13398I2007K69810j56531D4019K23662j18300N0015n0135a06305A81182B2778
13387I7866D3384J42798P6612J64257I3514D0218K23942K82934B31950o7100J33713
$$ plain form
13464 141992 339209 -64448 285730 -12373 42828 77917 74692 509939 559766 278097 124781
13452 302504 -213038 219314 208225 126989 251165 253891 380140 209820 166841 242903 242364
13441 242364 330351 310605 199180 -4799 44940 149051 241224 177862 163163 114881 103955
13430 103955 320266 18744 70182 477537 70747 400326 382433 108807 497871 386303
13420 386303 193012 343953 89300 144513 47902 175442 12951 264184 61419 218625
13410 218625 153482 376913 285645 239712 322320 18531 -48125 416900 -27416 271779 -208182
13398 92007 361817 205286 44019 267681 149381 199396 149261 -106305 181182 22778
13387 97866 43384 186182 262794 427051 93514 40218 264160 547094 231950 164850 298563
13376B98563c3089B24440k6141q1282g6492C07440g1148B97515A05036J926K76708
13365C83670o0182b05597G1169M22643K2938j17106a46820A53813J45617G5655
13354A10953m2270C3509M5878i996D25799j55511m0707q053G6536L17441J05002
13343D98979A23789n9490K13151m141L8665n8145q7785O0949N0274A35050K27873
13332C62923d027B87540j6232A01298K27384A23678R5824G5439e2935C32166q7605
13321B44561j9119M17363B47220M3129o1694J48518l875j64068h8922B67392m824
13310B62568J50970A57522J19395A05242a49792B7623J32373J12535n0249H2653
13299B51758r0292J91121b7970F1253J82125p8983J79776A0942J16093g9862A85625
$$ plain form
13376 298563 -33089 224440 198299 117017 -76492 307440 -71148 297515 105036 106962 383670
13365 383670 323488 -205597 71169 493812 516750 399644 -146820 153813 299430 75655
13354 110953 68683 33509 79387 -9996 425799 270288 229581 221528 76536 393977 498979
13343 498979 123789 64299 277450 273309 311974 253829 166044 226993 277267 135050 362923
13332 362923 -4027 287540 271308 101298 328682 123678 219502 75439 -52935 332166 244561
13321 244561 225442 642805 247220 290349 228655 377173 373298 209230 -88922 267392 262568
13310 262568 413538 157522 276917 105242 -149792 27623 159996 272531 222282 82653
13299 251758 161466 352587 -27970 61253 243378 164395 344171 10942 127035 -79862 185625
13287A26151N6785c50591b4814A79841P1120H614K8329Q9796M7942q0014j3936
13276H0731N0692J943D1279K74281A50457m953K5026m5907J97458N0468G5104
13264C58654A29410E2349c0438A57891K43695I5054K91981j14626b03614B77304
13253F1518O2978b47489A97745f7084A3453i3067k38660I2733O8993R5685K67322
13242E24733k38868K08522A52000J82220j08914E5184a71684D0001J06245J10373
13232B56619q7691l6282a04274j4471b4217d580B85936a34597B57429C115P5115
13221G8230j1866g7609B0964L97950D549J87612J71448A30316J72821N168g2821
13209e9248B14868m4328n865F4238K3380Q7549F6414N71185A69695a13016A24454
$$ plain form
13287 126151 182936 -350591 -24814 179841 250961 8614 36943 126739 174681 94667 80731
13276 80731 131423 133366 41279 315560 150457 145504 170530 124623 322081 372549 75104
13264 358654 129410 52349 -30438 157891 401586 95054 387035 272409 -203614 277304
13253 61518 124496 -247489 197745 -67084 13453 -93067 -331727 92733 161726 257411 524733
13242 524733 285865 494387 152000 334220 225306 55184 -171684 40001 146246 256619
13232 256619 168928 132646 -104274 -118745 -24217 -4580 285936 -134597 257429 3115 78230
13221 78230 66364 -77609 20964 418914 4549 192161 363609 130316 303137 308305 -72821
13209 -59248 214868 170540 164675 64238 87618 175167 66414 637599 169695 -113016 124454
13197G828O0315J14498J17701e3464E916L03311p0284h8682D0521J50280M4881
13186B35682r2899f2521C20604h0514A85054D093J09211K481J87444j33051h2513
13174C53385h3350E10261B01457a858A30309L903P1889O442J03698d9626B78351
13162h067A32807l9356J65623k0800j05513f0290F00548A90051A9571a5181l5473
13151e0654B71283A00159a38564A22090N3021b20050R6986B03734D4669A1434
13140I1872b151B1109L1853i9137A12951g2976A89624D0300c7153A45903Q4134
13129B30037E3334a49842D6424c2670j39948A00178B8697Q2278J15804b70430
13118A02466R8256b54104A29579Q0509e1975D7586n50K07424n282e46073a2352
$$ plain form
13197 7828 68143 182641 300342 -53464 5916 309227 238943 -88682 40521 190801 235682
13186 235682 142783 -62521 320604 -80514 185054 4093 113304 115785 303229 170178 -82513
13174 353385 -83350 510261 201457 -1858 130309 134212 206101 212543 316241 -49626 278351
13162 -8067 132807 93451 259074 238274 132761 -60290 600548 190051 19571 -15181 -50654
13151 -50654 271283 100159 -138564 122090 175111 -220050 -123064 203734 44669 11434
13140 91872 -2151 21109 52962 -99137 112951 -72976 189624 40300 -37153 145903 230037
13129 230037 53334 -149842 46424 -32670 -172618 100178 28697 110975 226779 -270430
13118 102466 200722 -254104 129579 210088 -51975 47586 47036 254460 249178 -546073 -12352
13106a21458L0451A53905b12958A61039B5443J35810D8318N4988a56537C83929
13095h3667e099C6909K89938J29083A71299d4254k84115C41567r4236a11363C29539
13083f2374j06600e8867D1170e9545B43552i1145b7177E7003J32888a024G7053
13071a08103G7250K50494q4844A7298J20268a70311A64739J42544O5980j06272
13061B66991A32109J24663h1558n8874H2171R1126Q8304A07569A7217C494e2917
13049A18719K3171m890a75161E47574j20459M261B13817D9273O655N8749J2594
13038A27271K84183j95670N4896j00861e9272A08450J15073j3147J16816A30794
13027A28315e3563D40926E7475f5329A66487N0924L23077b57295A75381F4398
$$ plain form
13106 -121458 -91007 153905 -212958 161039 25443 161253 48318 103306 -156537 383929
13095 -83667 -5099 36909 326847 455930 171299 -44254 -328369 341567 247331 -111363 329539
13083 -62374 -168974 -58867 41170 -59545 243552 -91145 -27177 57003 189891 -1024 77053
13071 -108103 77250 327744 242900 17298 137566 -170311 164739 307283 373263 266991
13061 266991 132109 256772 -81558 -140432 82171 173297 261601 107569 17217 3494 -52917
13049 118719 141890 137000 -175161 547574 427115 431376 213817 49273 55928 114677 127271
13038 127271 411454 215784 270680 169819 -59272 108450 223523 210376 327192 130794
13027 128315 -53563 440926 57475 -65329 166487 217411 540488 -257295 175381 64398
13016b2315D01020j81500q9366K39123A70317l0986a36289A32397a04459m3695
13006a48154c1557D98309k45157b5599B10438q8657j247L385e5474L017A96895
12994A07529P9104D2332J22374c23763A01620J39807K55396j34300h758k00859
12984b09617E9076J74878o7919g4613A68501b41641a08202B06376b558j32910
12974a35468c0826A73801l0650e0558A47149A8603K59215L2281Q1900j880a11063
12962a72789C67992E2224K12958I1272g4878H8662a88834k0667B43014F608a95458
12950A82131b05277d0932j77819B26239H7812P7354J21563F5333i3901D8111b0347
12938E1231J66526j07520e0286I1890D609J37779D1933a5726A42285a75213e6594
$$ plain form
13016 -22315 401020 219520 130154 369277 170317 139331 -136289 132397 -104459 -148154
13006 -148154 -31557 498309 253152 -25599 210438 121781 120534 123919 -55474 -52457 196895
12994 107529 186633 42332 164706 -323763 101620 241427 496823 362523 -8758 -209617
12984 -209617 59076 233954 166035 -74613 168501 -241641 -108202 206376 -2558 -135468
12974 -135468 -30826 173801 143151 -50558 147149 18603 277818 310099 391999 390119 -111063
12962 -172789 367992 52224 265182 91272 -74878 88662 -188834 -209501 243014 6608 -195458
12950 182131 -205277 -40932 -218751 226239 87812 165166 286729 65333 -93901 48111 -20347
12938 51231 217757 110237 -50286 91890 4609 142388 41933 -15726 142285 -175213 -56594
12926A44733c96687C96750j5552E5223P1304J02173m1004b375B60977j10294P1551
12915B22234a15470p1469d1541B87826h6049A1501a53240B2089P1365K6139i4698
12903A61448a32887O3265I6003C6963g5746C0574d2339k05711P7926m6205A05365
12891A89201J77909i0045l9636o8637A54687a67947A43216J92487a24140D8176
12880C12154f5571F4356B4747O1123K50858A41590b4589r9217D5931b55389e3194
12868A98262H6228a59667O3823j71352g446k87645A5593a00758F6822J09323a04606
12856B05418b58429L9054E5688O6481J58480a07417M4292j21506L0426B4204c16941
12844A15626j4651P9823p6187l7088i4029C83268a33587G5429I620J64090E5175
$$ plain form
12926 144733 -396687 396750 381198 55223 126527 228700 187696 -2375 260977 150683 222234
12915 222234 -115470 -186939 -41541 287826 -86049 11501 -153240 22089 93454 119593 -94698
12903 161448 -132887 -69622 96003 36963 -75746 30574 -42339 -248050 -170124 -216329 105365
12891 189201 367110 -90045 -129681 -198318 154687 -167947 143216 335703 -124140 48176
12880 312154 -65571 64356 24747 85870 336728 141590 -24589 -123806 45931 -255389 -53194
12868 198262 86228 -159667 -95844 -267196 -7446 -295091 15593 -100758 66822 176145 -104606
12856 205418 -258429 -219375 55688 122169 280649 -107417 -63125 -184631 -154205 24204 -316941
12844 115626 100975 180798 104611 67523 -94029 383268 -133587 75429 9620 173710 55175
12832A89482L8071a65613j73031A77482a8558A21050R7646k6394o2677l9241b7905
12820d2502m8371G7465b6416k02264F1520i7814A34200n1684a01188D3551k0322
12809B3229g8116A7153K6326O5180a28833A22090b87231j10475a74748Q4500b4527
12797B80870e0569A22057l0034g2348A69177c4053k40861r6379A68921k8592o9225
12786G1104B5011b42803A06140b51j98749A6158J5703a46632A41397J0464b52919
12774b20447B7586b06791P0250B72012J31585F6541L1127l9380J77380r9646J49800
12763B85822i5442B8338h9462A1309a76390d448j67931j8333a0105C19369a63337
12751i1514H9188a65280K7948A5155b7130D1340P4369D3928K0887k5585J8411
$$ plain form
12832 189482 227553 -165613 -338644 177482 -18558 121050 218696 192302 129625 90384 -27905
12820 -42502 -90873 77465 -26416 -228680 61520 -97814 134200 82516 -101188 43551 23229
12809 23229 -78116 17153 43479 108659 -128833 122090 -287231 -397706 -174748 -90248 -24527
12797 280870 -50569 122057 92023 -72348 169177 -34053 -274914 -371293 168921 140329 71104
12786 71104 25011 -242803 106140 -251 -199000 16158 31861 -146632 141397 151861 -252919
12774 -220447 27586 -206791 -136541 272012 403597 66541 97668 58288 235668 136022 285822
12763 285822 -95442 28338 -89462 11309 -176390 -4448 -172379 -190712 -10105 319369 -163337
12751 -91514 89188 -165280 -137332 15155 -27130 41340 115709 43928 64815 39230 57641
12740E7641K11606I7521J45068L82863A50804m4991K34355E0116f439A84763A9456
12728a66691g656k79448A16628N20799B7712J43463d2479B27889b03868d51C9914
12716B50464n5434p4937a71271M1854G6249N5690J56376o405j26766J04010J25439
12705C84593R393j32589J65266a3668A74783J09715J84615F0540J41376r4397
12695A07519g6576A1372K5458L06194j37217F4919e5302j68630A39237A4930J05628
12684A20558h069F1818J34936L2917F5880c52569B21211i33G299K78874g2179
12672e8558A07704a17985A56756n6375g4154B19839i032A4097J56444O5113A08326
12660B81675b3342A03263j2731g596j78677D34531F0482O1883M51435I0567l1654
$$ plain form
12740 57641 269247 97521 242589 625452 150804 105813 340168 50116 -6439 184763 19456
12728 -166691 -7656 -287104 116628 637427 27712 171175 -42479 227889 -203868 -451 39914
12716 250464 195030 120093 -171271 -129417 76249 131939 288315 281910 155144 259154 384593
12705 384593 393986 261397 426663 -13668 174783 284498 469113 60540 201916 107519
12695 107519 -76576 11372 36830 343024 205807 64919 -55302 -223932 139237 14930 120558
12684 120558 -8069 61818 196754 229671 65880 -352569 221211 -933 7299 286173 -72179
12672 -58558 107704 -117985 156756 100381 -74154 219839 -9032 14097 170541 235654 108326
12660 281675 -23342 103263 90532 -7596 -186273 434531 60482 122365 573800 90567 58913
12649E8913J37956a93858q1118D1836H00J68847a14943B64655i6355A63833G0598
12637A55551i347k8293A27358m8173J26674J73579j69511K1230E6358d3049B57262
12625C6244J69134L7766N7380o673I8115A4225d8346b4168C937R1394J21536a03785
12612C93754j30377g84p7316A82067C686b4131j52110M0253A57516Q4639b0147
12600C05861l0746K32800A86598c620C32869b02106A30225m9828k4241Q1560F6142
12588D2224J86079r4996J11898A13195Q6242D8036b67445c7434j03128A58944
12577c7527N165A15612i187E2529M20209A00530C5521Q8322h4887A98508A0023
12565g6263A98348c6155C42791j08260J15254b18113b314j26739e6673F4825o002
$$ plain form
12649 58913 196869 -193858 -274976 41836 800 169647 -114943 264655 -96355 163833 70598
12637 155551 -9347 -37640 127358 79185 205859 379438 209927 231157 56358 -43049 257262
12625 36244 205378 243144 300524 293851 98115 14225 -48346 -24168 3937 95331 216867 -103785
12612 393754 263377 -784 -78100 182067 3686 -24131 -176241 -135988 157516 242155 -20147
12600 305861 275115 507915 186598 -3620 332869 -202106 130225 80397 56156 137716 66142
12588 42224 228303 133307 245205 113195 199437 48036 -267445 -37434 -140562 158944
12577 -37527 -32362 115612 -9187 52529 472738 100530 35521 123843 -84887 198508 10023
12565 -76263 198348 -36155 342791 234531 349785 -218113 -2314 -129053 -56673 64825 58823
12554E8823P061a73744M6539G4347b74282B75833a15315a788j18480e1851p1406
12543a23257M4035k13235J36397f0097l99357B01782b45932C38224C6014H903
12532C08628a46502k4435g5490a9897j1480j63838c450k54867J16606O3543A81772
12520b26202b4553n3747C0277i2053A26331e3273B26864e192p5475j38063g6714
12508b33406C5603P5972D8459a11705a6058j87077a5634j59550B18724Q1222A15208
12496c66354G9748L3219a50035c8344k48963B4533J55168L6240q4987A6777J72383
12485A89160G5303R3M1300L2412E1883b42939B44866c39340J45562a3228A62000
12473a07608d0012i543A96a0356m14953C0940N9559L01496e9685A25585Q6874
$$ plain form
12554 58823 65884 -173744 -127205 74347 -274282 275833 -115315 -1788 -120268 -51851 -123257
12543 -123257 -79222 -292457 -156060 -60097 -459454 201782 -245932 338224 36014 8903
12532 308628 -146502 -170937 -75490 -19897 -31377 -195215 -3450 -258317 -141711 -78168 181772
12520 -226202 -24553 -78300 30277 -92053 126331 -53273 226864 -5192 -80667 -218730 -76714
12508 -233406 35603 111575 48459 -111705 -16058 -203135 -15634 -175184 218724 299946 115208
12496 -366354 79748 112967 -150035 -38344 -287307 24533 179701 215941 130954 16777 189160
12485 189160 75303 75396 116696 149108 51883 -242939 244866 -339340 -193778 -13228 162000
12473 -107608 -40012 -9543 196 -10356 -425309 30940 90499 391995 -59685 125585 212459
12462B12459A7759b67210L4050B09763n9066a98145A85635a14781B96598b36430
12451F1475a6300D4633b160I5766J98891F6347a53806B39435i8682o9118N4150
12440a13650A05741a38898F9212K9291b9757j41289A92569l1110C1927A0568J26410
12429A36978d1633q2050F6536d04388A9842J38096a62028k32723F6654b22614
12418H3391g5302K1352B43211c5294I5947b13180h7864k85826A77576A8180J59641
12407A77821c41937L8361F775b26726C3789J87373b63826E5360a30446p3136K0408
12396a83174A85670a4502A7198i6396j40413B04477a35443j01400A79176o5134
12386A14042a95891P3258M3472l472B9889b4957A1623K1111k5J4858m56k0465
$$ plain form
12462 212459 17759 -267210 -233160 209763 150697 -198145 185635 -114781 296598 -236430
12451 61475 -16300 44633 -2160 95766 294657 66347 -153806 239435 -98682 -167800 -113650
12440 -113650 105741 -138898 69212 98503 -29757 -171046 192569 161459 31927 10568 136978
12429 136978 -41633 -123683 66536 -404388 19842 157938 -162028 -394751 66654 -222614
12418 83391 -75302 -53950 243211 -35294 95947 -213180 -87864 -373690 177576 18180 177821
12407 177821 -341937 -303576 6775 -226726 33789 221162 -263826 55360 -130446 -203582 -183174
12396 -183174 185670 -14502 17198 -96396 -236809 204477 -135443 -236843 179176 114042
12386 114042 -195891 -122633 -79161 -82633 29889 -24957 11623 32734 32709 47567 47111 26646
12374B6646d8566m4268j25181d0837A9236b5765D9573O6122P5745a20516A60197
12362g3513B10730H3305a0489j05248l7076A08614Q6544F0917O7803a99171i366
12350a01648A08265J31493J45639D5024A9930J15747J21117I4812Q2461a60619
12339B29067D8712b6645I468b97605c1205F3835b15356K7429e693r4361d3974
12327D23975C8591J9622b82860I4893B1681c6829j9153N163j17276C36344A05802
12315b95486A8158g0905A43020A9359a0945B06022a75715E5398Q516q667A1301
12303g4577B24106a48414P1859a5900B7926N4683K00195n5848C1237J5083Q5537
12292A31857a75951c0177a2942C48101a5485H111K48334A1750K66371R4671r316
$$ plain form
12374 26646 -48566 -92834 -218015 -40837 19236 -25765 49573 115695 191440 -120516 160197
12362 -73513 210730 83305 -10489 -115737 -152813 108614 195158 60917 128720 -199171 -9366
12350 -101648 108265 239758 385397 45024 19930 135677 256794 94812 177273 -160619
12339 229067 48712 -26645 9468 -297605 -31205 63835 -215356 -187927 -5693 -100054 -43974
12327 423975 38591 58213 -282860 94893 21681 -36829 -55982 -50819 -168095 336344 105802
12315 -295486 18158 -70905 143020 19359 -10945 206022 -175715 55398 63914 55247 11301
12303 -74577 224106 -148414 -76555 -15900 27926 82609 282804 226956 31237 46320 131857
12292 131857 -175951 -30177 -12942 348101 -15485 8111 256445 11750 278121 372792 363476
12281C63476i6595k32761f4227E910a03835D48235A49858M8751K61689B08477
12270A42736a33952B69951c6779o3359n2988B05015J26776j33111j0918a15136
12259g4811B91760A4735a90399B71777A4117K26537A5442f1446m7744E7297k0212
12248C7085K94159k1545a9242B59213G8356K08336C9848K627J1017L4489d9159
12236B34698A2177Q5347K2833R263j9269J12515C7398K2513K42963Q5784m38A79007
12223A13191N2368F0242K45627a38837B38341q9945J31669R0294j72330k0057
12213A77972K07559l3949A9289a06115C16867n5071G4950C2424J52760K54122
12203D39306B00393o9752N0338E8212J67093E7288c0665B54363A04696L54590
$$ plain form
12281 363476 -96595 -329356 -64227 5910 -103835 448235 149858 198609 460298 208477
12270 142736 -133952 269951 -36779 -100138 -153126 205015 331791 198680 187762 -115136
12259 -74811 291760 14735 -190399 271777 14117 240654 15442 -61446 -109190 57297 37085
12248 37085 331244 309699 -19242 259213 78356 286692 39848 42475 53492 87981 -49159
12236 234698 12177 97524 120357 129620 110351 222866 37398 59911 302874 388658 388220 179007
12223 113191 165559 60242 305869 -138837 238341 148396 280065 370359 198029 177972
12213 177972 385531 351582 19289 -106115 316867 261796 74950 32424 185184 439306
12203 439306 200393 130641 180979 58212 225305 57288 -30665 254363 104696 459286
12193D59286A11970O5410m3916d4140A50086o4603N0853d9580A64722J30125F0281
12181b6604A92006b44724A44588J9195J44756m170A32143J34610E6064A70M51943
12170D52113k20383q7209B0888J22347n3992J16748J6507K7068b84680B01676
12159A92422l3883E0352M0151L3390K23389A29996J82985g3870b4131a0277I4662
12147C6131a12021A23309M2687g4422J6617C6803N3190j9208J10514i0572m873
12136i5445D3620f2420q1248k09704F2013a65350D8415J04090B4064b55224A62827
12124A90215f6552A26416C5010a03206A43344b42084d0253j73653e4770B7399
12113I5283F617J04668J02566J57539j10585A7715b4569F8022b34824B29432B1280
$$ plain form
12193 459286 111970 177380 133464 -44140 150086 85483 136336 -49580 164722 294847 60281
12181 -26604 192006 -244724 144588 163783 308539 304369 132143 266753 56064 170 452113
12170 452113 231730 144521 20888 143235 89243 205991 222498 249566 -284680 201676
12159 192422 158539 50352 90503 123893 347282 129996 312981 -73870 -24131 -10277 94662
12147 36131 -112021 123309 165996 -74422 -57805 36803 89993 70785 181299 -90572 -95445
12136 -95445 43620 -62420 -143668 -353372 62013 -165350 48415 152505 24064 -255224 162827
12124 190215 -66552 126416 35010 -103206 143344 -242084 -40253 -213906 -54770 27399
12113 95283 6617 111285 213851 371390 260805 17715 -24569 68022 -234824 229432 21280
12101A03113a48504A56628k5783a8164j18896A95245a08119B8341K0338j4781
12091C3898a2353A27910h32E4722N9131H635a06341B7852K10620e2390k69184
12080c21574A77984a7288C08004J57049N83676P03545G05040B53664c2184B4543
12069f329B02740D8361J88887c6708j26457K1777A733J42203g3762A76305K15635
12058C91940j63527E5917j6263c49629H0019b83828C6652d8159l8604j79155A83499
12046b6940C4712a90611i3931d0217o4148H410e0983B35662f2664E0164Q7203
12035A37367K5971c59229i1751c8271k07338a01742o6414B2100J8229h5301B31822
12023A9008c22184i7413A05202b43193N0062d2575F5259a50971m6802k536P4367
$$ plain form
12101 103113 -148504 156628 130845 -18164 -137060 195245 -108119 28341 48679 33898
12091 33898 -12353 127910 -832 54722 113853 8635 -106341 27852 238472 -52390 -321574
12080 -321574 177984 -17288 308004 465053 1048729 1752274 705040 253664 -32184 24543
12069 -6329 202740 48361 237248 -36708 -163165 -141388 1733 143936 -73762 176305 391940
12058 391940 228413 55917 39654 -349629 80019 -283828 36652 -48159 -86763 -265918 183499
12046 -26940 34712 -190611 -93931 -40217 -104365 8410 -50983 235662 -62664 50164 137367
12035 137367 163338 -359229 -91751 -38271 -245609 -101742 -168156 22100 40329 -85301 231822
12023 19008 -322184 -97413 105202 -243193 -193131 -42575 65259 -150971 -197773 -200309 -125942
12012a25942o2807I492Q295N3713A5099a35205A9575J61764D0392b705j28357
12001a31062B34860a47357A38996a01488q2806G5966b57469j67155d133q4520
11991h8653g552l30850g620A55512c1668j95862f921l2442G5640J98544E1626
11979a55811M710B1002c35422A8507e1283j71900h053J115j3102B28120b58152
11967a73733k115C4833c17564B87769a31093a3867H5739a0466A3470O8670m0400
11956D1740d79626h4952L7587k33040a21373K8834A16462J14833D711g7977B06443
11944A10479J45968l8210a32365J8933C06225a73052j88126B13630g8683m5982
11934a24665C38134b66624A87227a2400D69372A96627c0696n0885A62164L07349
$$ plain form
12012 -125942 -188749 9492 17787 71500 15099 -135205 19575 181339 40392 -2705 -131062
12001 -131062 234860 -147357 138996 -101488 -184294 75966 -257469 -424624 -4133 -88653
11991 -88653 -7552 -338402 -7620 155512 -31668 -227530 -6921 -39363 75640 274184 51626
11979 -155811 -151101 21002 -335422 18507 -51283 -223183 -8053 -6938 -20040 228120 -258152
11967 -173733 -175848 34833 -317564 287769 -131093 -13867 85739 -10466 13470 82140 41740
11956 41740 -479626 -84952 -47365 -280405 -121373 -92539 116462 231295 4711 -77977 206443
11944 110479 256447 218237 -132365 -113432 306225 -173052 -361178 213630 -78683 -124665
11934 -124665 338134 -266624 187227 -12400 469372 196627 -30696 -81581 162164 469513
11924D69513g4314A04647b68977B89636c3910n3306B2593a4573m8679J4499A76732
11912G4774B1355J29743M8314a38912A64912i7321E7608J23312E1847J05436l7925
11901A19358J04632e4796B77333d0054k64866A57984E7345J95781A511J18104
11891A19615Q5581M1670C3853d8823D0271J21889A8210a27230k298e2122A57031
11879D3579O7901b92280b2741l2055b0243C7758c14349a30903k8538F5252l0826
11868C4426a77104C8816d60981a15170F2365b08981e4909J8866B88589A19102
11857A08805J377A214b89495e3861k1689F6225O4815b01523e6643C4059a99960
11845a21873A19941D6077K65L14906j37620j09656A7884h2961k59436A12910M0246
$$ plain form
11924 469513 -74314 104647 -268977 289636 -33910 -87216 22593 -14573 -63252 -48753 176732
11912 74774 21355 151098 199412 -138912 164912 -97321 57608 180920 51847 157283 119358
11901 119358 223990 -54796 277333 -40054 -304920 157984 57345 253126 1511 119615
11891 119615 205196 246866 33853 -48823 40271 162160 18210 -127230 -129528 -52122 157031
11879 43579 111480 -292280 -22741 -54796 -20243 37758 -314349 -130903 -159441 65252 34426
11868 34426 -177104 38816 -460981 -115170 62365 -208981 -54909 -36043 288589 119102
11857 108805 110182 1214 -289495 -53861 -75550 66225 131040 -201523 -56643 34059 -199960
11845 -121873 119941 46077 46342 361248 223628 113972 17884 -82961 -342397 112910 153156
11834A53156a42152A79047c41766a56200b6634n38667b25451q4422a22205k3242
11824a45447F986L955b976j32873j77845a21740C4245J32801G5155k0601K0017
11813G4571b34070D4868h4130n8231j07127a7217D7283b52406Q2744A93641A3366
11801A28064l3958J5244a77426D4608Q1639B535b93411a02508A33512J5061m8213
11790A00360C4676h202G0788a22410A1916b6249G6801e2609j69368j291i4090
11778D08824b10478P0532N1557B4588b24417h4336M716I627a10108H4053a41729
11766A02094J1375a04549M7732L395B85535a47919B8367i7479j9488A09900b836
11754H819b39015A02115a56450f578l37528c3418j32398F1431b90379F1333M2349
$$ plain form
11834 153156 -142152 179047 -341766 -156200 -26634 -565301 -225451 -309873 -122205 -145447
11824 -145447 6986 10941 -2976 -135849 -313694 -121740 34245 167046 75155 54554 74571
11813 74571 -234070 44868 -84130 -142361 -249488 -17217 47283 -252406 -169662 193641 13366
11801 128064 94106 109350 -177426 44608 126247 2535 -293411 -102508 133512 148573 100360
11790 100360 34676 -8202 70788 -122410 11916 -26249 76801 -52609 -221977 -223268 -94090
11778 408824 -210478 -139946 -88389 24588 -224417 -84336 -79620 9627 -110108 84053 -141729
11766 102094 113469 -104549 -56817 -53422 285535 -147919 28367 -97479 -116967 109900 -2836
11754 8819 -239015 102115 -156450 -6578 -344106 -33418 -165816 61431 -290379 61333 103682
11743A03682k3219J97339G4642i0985K2345H0801h3373B55805a85991g9687K1216
11732e8471k23326B11403b6928j54071H3690a8535r400A81557l7396i7976m2973
11721a40949j94063F0978i638B5480L3730N9253L5307m3882C5239a665D5333d660
11708b5236j16654B3888J02747l5412B3611h2315B30546A04207e7372B27177k977
11697B24200a78511d4544A54828b44692A14054J6694D7968i1705k50588E5050
11686B03167a28437j6849A96448b3742F4750e5949J7327q8262A78207J3641a45343
11674F7291P9107o140J05478a2177B66489f741j57017E0614J99991a85579F2494
11662A42715a58962e0168I4338K40956b2759m0289C04202B9297J0706b67952c4764
$$ plain form
11743 103682 80463 277802 74642 -90985 -68640 80801 -83373 255805 -185991 -79687 -58471
11732 -58471 -281797 211403 -26928 -180999 83690 -18535 -27935 181557 144161 -97976 -140949
11721 -140949 -335012 60978 -9638 25480 59210 118463 153770 109888 35239 -1665 45333 -4660
11708 -25236 -141890 23888 126635 91223 23611 -82315 230546 104207 -57372 227177 224200
11697 224200 -178511 -44544 154828 -244692 114054 130748 47968 -91705 -342293 55050
11686 203167 -128437 -145286 196448 -23742 64750 -55949 -38622 -126884 178207 191848 -145343
11674 67291 146398 140258 245736 -12177 266489 -6741 -163758 50614 250605 -185579 62494
11662 142715 -158962 -50168 94338 335294 -22759 -63048 304202 29297 40003 -267952 -34764
11650a39610g514j1986m7081C3118J9027j5774P5017e379A93694p7434a16256
11638f993A58614K0449g6185C4795J35299c47518a04953d005G6290J58215K18081
11627D52586a60029A32029a08846C54049a25706B4821L15685g9470A98795c4921
11616b38106b0288M187A04877a60803A56028R8766b05392R0092K408o623E20926
11604a71198K158A26113k168a08226B34485J11844C7484F93c5259A43329D7599
11592a56094A65089a06527D29099E7533J62027C0476N533c15645i6273F3460R5703
11581A59163b167j42526o3132A78861J16042b11993R8257A47039m8456a1488B71455
11569B03349e8469B78198c5050A06503a6252A1857J41561c49413B85335q0000
$$ plain form
11650 -139610 -7514 -19500 -66581 33118 52145 36371 111388 -5379 193694 116260 -116256
11638 -6993 158614 179063 -76185 34795 170094 -347518 -104953 -4005 76290 234505 452586
11627 452586 -160029 132029 -108846 354049 -125706 24821 340506 -79470 198795 -34921
11616 -238106 -20288 -16101 104877 -160803 156028 254794 -205392 -115300 -112892 -119515 520926
11604 -171198 -169040 126113 123945 -108226 234485 346329 37484 693 -35259 143329 47599
11592 -156094 165089 -106527 429099 57533 219560 30476 36009 -315645 -96273 63460 159163
11581 159163 -2167 -144693 -207825 178861 294903 -211993 -113736 147039 98583 -11488 271455
11569 203349 -58469 278198 -35050 106503 -16252 11857 153418 -349413 285335 205335
11559B05335K738a19081B51613b58688G2601K11359A33601a269j79528I8074J17170
11548B15244o7026c16665J09982i4726G2541b55160B27510G0395L27938C8686
11537B54197c1786A64161K6467l3081C1358J24831K69301j72006b32779f00k23878
11526b24478j12804a24652e9027B25778J32181d3495B27920A02876a4200j58715
11516a72915e1865m474D14181I1542J35427L736C6977K08263J15039B8174a58436
11504A90103P0276A1202c19698A78282k6745J04945a67802B72421E8932j1520
11494D7412J59742J21571H1118e3806r2202B80763F8190K03634N5699j06654B9623
11482C62099R0759j84171D6393L47766d9256B8665J93419L7544H5779K54384L7006
$$ plain form
11559 205335 208073 -119081 251613 -258688 72601 283960 133601 -1269 -180797 98074 215244
11548 215244 148218 -316665 -206683 -94726 72541 -255160 227510 70395 398333 38686
11537 254197 -31786 164161 190628 157547 31358 156189 425490 253484 -232779 -600 -224478
11526 -224478 -337282 -124652 -59027 225778 357959 -43495 227920 102876 -14200 -172915
11516 -172915 -51865 -56339 414181 91542 226969 230705 36977 245240 360279 28174 -158436
11504 190103 260379 11202 -319698 178282 151537 256482 -167802 272421 58932 47412
11494 47412 207154 328725 81118 -53806 -146008 280763 68190 271824 327523 220869 29623
11482 362099 452858 268687 46393 394159 -49256 28665 222084 259628 85779 340163 377169
11471C77169a40912B94855j3089J92314A47273c39300C69685D5853H375M9785
11461E8160K6908m913j653c1187D7604a29407A28398m0766M63733A91403i0251
11449C4143a21469e3069H2100g699A24390a9214E7392J39722j9390J56579N2194
11438C86497h2985E823K00716h8726A10305J3705O7352G1006a1356D1481J6397
11427E7878b84263I263J78900f5786J508a7724C31415d7482j799B04191c39840
11415B02792a377k94093C16725a99840A20341K0503A3246a15905B2529b51929
11404b03781h686k2141E3548c53378i069A7275K9829K65280b4598m7226D67192
11392A55836k1895l9311d3590j23685A56897f7j47096A9801P0250g9587B2766
$$ plain form
11471 377169 -140912 294855 281766 474080 147273 -339300 369685 45853 8375 58160
11461 58160 85068 80155 78502 -31187 47604 -129407 128398 87632 551365 191403 -90251
11449 34143 -121469 -53069 82100 -7699 124390 -19214 57392 197114 177724 334303 386497
11438 386497 -82985 5823 206539 -88726 110305 124010 191362 71006 -11356 41481 57878
11427 57878 -284263 9263 188163 -65786 -64278 -17724 331415 -47482 -49281 204191 -339840
11415 202792 -1377 -295470 316725 -199840 120341 140844 13246 -115905 22529 -251929
11404 -203781 -8686 -30827 53548 -353378 -9069 17275 47104 312384 -24598 -71824 467192
11392 155836 133941 94630 -43590 -167275 156897 -67 -147163 19801 90051 -79587 22766
11380c8247k33950A92409Q9204f4234B79210J0414a39765A86314R8509d3060C18048
11368a76365B05476L3605a3052C30126a14197I173a10098m3514l37413J94908
11358b96117I0256a38547m9610h8824A17243L7252B4045a66358k9959E7730P0702
11347A28432C72P9861K41896a3789B44126a79991C15726b01185A24804b04930
11336B9823i8699J0841o8815Q095P1219I7155O3314c32258a43087j09918B0709
11324e73465b01110c3516k28357C7572f9218A74585c97479A02290c11714H6813
11313B71066C1014G825L2644a07176E5759H080Q1904a64827A84406c8976O041
11302c2935p2417k7178A99251a69656G7887o848a43214j37989K9683A9267a28992
$$ plain form
11380 -38247 -272197 192409 281613 -64234 279210 289624 -139765 186314 284823 -43060 318048
11368 -176365 205476 239081 -13052 330126 -114197 9173 -110098 -153612 -491025 -296117
11358 -296117 90256 -138547 -188157 -88824 117243 154495 24045 -166358 -196317 57730 128432
11347 128432 372 80233 322129 -13789 244126 -179991 315726 -201185 124804 -204930
11336 29823 -98699 -87858 -156673 -148578 -77359 97155 160469 -332258 -143087 -253005 20709
11324 -573465 -201110 -33516 -261873 37572 -69218 174585 -397479 102290 -311714 86813
11313 271066 31014 7825 40469 -107176 55759 8080 89984 -164827 184406 -38976 -32935
11302 -32935 -105352 -132530 199251 -169656 77887 71039 -143214 -281203 -251520 19267 -128992
11290b89974A93153h054k27214B23559a59681j80637p206A99038k7855c04646
11279A04866a91230N8059A37911N3004j8953a20885m3059k40689h7418k15896
11269c03314A87707c7786c212l49290B17414n871c54847J41307h2477A07112b48046
11257c2503J5439m47384A82901e9660E6773a74961a9682n7975j58777A29813a05604
11245A34209b02773c9743k24154B63564c5843k23235K3946q5628i8838D1090b76552
11233A39241b13622o1735F1643c67420a44764b7806A6729c00071H1013f7722F1186
11221i735C5118K48999I345a47901c468o516A8275a3501q2844d3037o9269A54471
11208A7831a12324R435c1075k89031a59599C5069a36855l5961E381L3482a76599
$$ plain form
11290 -289974 193153 -8054 -235268 223559 -159681 -340318 -347524 199038 171183 -304646
11279 104866 -191230 -133171 137911 190915 171962 -120885 -163944 -404633 -87418 -303314
11269 -303314 187707 -37786 -3212 -352502 217414 211543 -354847 -213540 -82477 107112 -248046
11257 -32503 -17064 -464448 182901 -59660 56773 -174961 -19682 -77657 -236434 129813 -105604
11245 134209 -202773 -39743 -263897 263564 -35843 -259078 -235132 -320760 -98838 41090 -276552
11233 139241 -213622 -275357 61643 -367420 -144764 -27806 16729 -300071 81013 -67722 61186
11221 -9735 35118 284117 9345 -147901 -3468 -9984 18275 -13501 -96345 -43037 -112306 154471
11208 17831 -112324 -102889 -31075 -320106 -159599 35069 -136855 -172816 5381 38863 -176599
11196a48880B34697b9080B20353Q0447A37499n371a3037p4251j33479A51812p0562
11185H1250K88093b1173j21862c2727B23077C4140a64857j79314D0171a0449j29950
11174a40399N1584L941I5009i7581k44415a54296r6953a22186A61380c09259F7633
11162I917K2915a39248b1552j48868O8413c3715B59524k4858d3531G5829B1640
11150d8727K3031p5961H8040g7534p0078D04786B2346i3980A0637J47085O4205
11139B21927E7424c7085A58571m5971N5432J2079H8709J71890H019g0190E1182
11127H637d109j4218B10887N7549A15707R0421L4978a18669D32213g7500A0677
11115G7600c11305E84103a30709D45956I0233K6931Q352n6348M3659M07482A92224
$$ plain form
11196 -148880 234697 -29080 220353 300800 137499 132128 -13037 -87288 -220767 151812 81250
11185 81250 369343 -21173 -143035 -32727 223077 34140 -164857 -344171 40171 -10449 -140399
11174 -140399 -88815 -84874 95009 -97581 -341996 -154296 -251249 -122186 161380 -309259 67633
11162 9917 32832 -139248 -21552 -170420 -102007 -33715 259524 234666 -43531 75829 21640
11150 -48727 -25696 -101657 88040 -77534 -147612 404786 22346 -93980 10637 157722 221927
11139 221927 57424 -37085 158571 112600 168032 180111 88709 260599 8019 -70190 51182
11127 8637 -4109 -18327 210887 268436 115707 206128 241106 -118669 432213 -77500 10677
11115 77600 -311305 584103 -130709 445956 90233 117164 125516 69168 112827 520309 192224
11103B55995J91280j70498j35638P3189L9160b9410F0532J08410J15213A06931
11092A94218D0145O596J50977J0244K55411j97255r7998J15746H0555L07466A21093
11080b24068E84366o7031P3925B90547J1494a44319C79245j23410M1719M6105
11070C43659r0928J22537o9390a3845G3300h905D63688A86620J07955K2422J99321
11059E16318j76422L7847N9869J14633k16758L61769j70146J0972L65320J11988
11049A015390D33155L27016M4045j95274J39171O1027J89817k74601J83328k28029
11039F79655K8528L16531m33892j32852L51252j42158N6271j62549M28016m10247
11029E78555J25916j14714L42584k19087j36242K71013r3135k23376K53511l82484
$$ plain form
11103 255995 447275 276777 141139 214328 253488 -29410 60532 168942 284155 106931
11092 194218 40145 46741 197718 207962 463373 266118 168120 283866 80555 388021 121093
11080 -224068 584366 517335 591260 290547 302041 -144319 379245 255835 297554 343659
11070 343659 252731 375268 305878 -13845 73300 -8905 463688 186620 294575 316997 516318
11059 516318 339896 377743 437612 552245 335487 697256 527110 538082 903402 1015390
11049 1015390 433155 760171 804216 608942 748113 809140 998957 724356 907684 679655
11039 679655 708183 1024714 590822 457970 809222 667064 723335 560786 988802 578555
11029 578555 704471 589757 932341 713254 577012 848025 754890 531514 785025 402541
11019D02541L28121K01888k48146l18049L01865K0098J18177l68666M1876K51710
11009G31415j07878Q9381J72556l61707J11557k21368K80410k93874J71180n392
10999E66280N1243N03814l11389p5200N2868l18151K72028K48745m42564R2077
10989F39751L9144M2073K6634J85206j67030P1373K08834J45464n210k38214J28739
10978A076764L28718L94956j47238L63893J16878L87556j1126k03846L89238P1544
10968B767337k24952P8289n99744M760l49885N5871N2471j91341L17774J5649
10958A926229j40986M8858j4433p9349k22202l1603j10226J9623l58136l01145
10948G36630R1C00885K73832J40835A60119m0985J38248F5207J33455R7177J57507
$$ plain form
11019 402541 730662 932550 684404 366355 668220 688318 806495 437829 479705 731415
11009 731415 623537 712918 885474 523767 635324 413956 694366 400492 571672 566280
10999 566280 617523 1121337 809948 734748 787616 469465 741493 990238 547674 639751
10989 639751 678895 720968 747602 932808 765778 837151 1045985 1191449 1186239 948025 1076764
10978 1076764 1405482 1800438 1653200 2017093 2133971 2521527 2510401 2306555 2695793 2767337
10968 2767337 2542385 2620674 2020930 2025690 1675805 1731676 1784147 1592806 1910580 1926229
10958 1926229 1785243 1834101 1819668 1740319 1518117 1486514 1376288 1395911 1037775 736630
10948 736630 736721 300885 574717 715552 160119 119134 257382 65207 198662 295839 453346
10937D53346q4506j28284H0435c90358G8980J82824E5763J69501F3914a10096
10926D2413J89704m9882i056k69828d0935o4755l1741B49670B2599J68557a69320
10914b23173F9389k5506a69415g460n3971l5990j35924N4900j38989H2457a95639
10902G678i949j95033c6701F6849b46126C857a01446H0565C1663M30253a67815
10890D9080a62314A84792b00675A87494l1387K35028A4135a46401A39385P6098
10880B15483j2223B6684d1225A45328C0189L8935a50728c7247k02698E3007a95496
10868B12335E8347b3101E1969K36834a97072L7724D3004a12492B13687F4729J05815
10857A70544L6298E3842A0654J16628a85427J0289j635A11275M0709C0919b77237
$$ plain form
10937 453346 368840 240556 80435 -390358 78980 261804 55763 225264 63914 -110096
10926 42413 232117 182235 -9056 -278884 -40935 -105690 -137431 249670 22599 191156 -169320
10914 -223173 69389 43883 -169415 -7460 -61431 -97421 -233345 -178445 -317434 82457 -195639
10902 7678 -9949 -204982 -36701 66849 -246126 3857 -101446 80565 31663 461916 -167815
10890 49080 -162314 184792 -200675 187494 156107 391135 14135 -146401 139385 215483
10880 215483 203260 26684 -41225 145328 30189 69124 -150728 -37247 -239945 53007 -195496
10868 212335 58347 -23101 51969 288803 -197072 -159348 43004 -112492 213687 64729 170544
10857 170544 206842 53842 10654 127282 -185427 -175138 -176773 111275 151984 30919 -277237
10845a16867a9227C65931a21710A39844b54697a22326b3925A41221a80328r03
10835a81231A3830K17888P7565G7921e15201b06346M7511M2056A76249a24851
10824b340l40124B3343N6814h5365L7511A35193c6480B57762c1127F4820a34669
10812i3897j59303e8528m02505B68488d524B5237a24397b2217j83060F4165a59382
10800a10964B3846L9374c06891b364o8650B55163D7167c9801I9352D5369L61411
10789D06780D4822c93888a32090G1609c8431D91802a11658M9994l5981j71772
10779b69417B27197E1556l819N113P6249n1699d2895B15688b42235A3569J66477
10768A80046b34694i3455J2703R436k70109O2361a31589i338A26900a89140M8058
$$ plain form
10845 -116867 -19227 365931 -121710 139844 -254697 -122326 -23925 141221 -180328 -181231
10835 -181231 13830 231718 309283 77921 -515201 -206346 -158835 -116779 176249 -124851
10824 -2340 -342464 23343 80157 -85365 -47854 135193 -36480 257762 -31127 64820 -134669
10812 -93897 -253200 -58528 -461033 268488 -4524 25237 -124397 -22217 -205277 64165 -159382
10800 -110964 23846 63220 -306891 -2364 -71014 255163 47167 -39801 99352 45369 406780
10789 406780 44822 -393888 -132090 71609 -38431 491802 -111658 -61664 -97645 -269417
10779 -269417 227197 51556 47737 52850 129099 77400 -42895 215688 -242235 13569 180046
10768 180046 -234694 -93455 -80752 -71316 -341425 -279064 -131589 -9338 126900 -189140 -141082
10757a41082f0077A84793a72098b2588o5420B50822b60413R3605M0087L2279n709
10746a00151A47352a7309A2309K3149K03949b42710H391P4125a74050K3999b5906
10734b40820A98826A792a98816f9932A26550m9282R1088B3478a82873k21077A28283
10722B44159a20978e3788c953A32810b7926A21254f7186m667r3584K6950k41682
10711c80169i7885B3663N10J28513o1697d22002a37186A03388a71793d290o0595
10700f4885F3391a243D50729b40215h2911j70783R4891d5545A04360f4573j22965
10689a87538j65889a63008d9376o7410q3817f4863j59802B89435a04470j03115
10679b07585K797k64604i6018A07117l0759J44534Q2833F2711a52550A97636A238
$$ plain form
10757 -141082 -60077 184793 -172098 -22588 -88008 250822 -260413 -166808 -126721 -94442 -100151
10746 -100151 147352 -17309 12309 35458 239407 -242710 8391 82516 -174050 -150051 -25906
10734 -240820 198826 1792 -198816 -69932 126550 77268 168356 23478 -182873 -403950 128283
10722 244159 -120978 -53788 -3953 132810 -27926 121254 -67186 -71853 -165437 -138487 -380169
10711 -380169 -97885 23663 24173 152686 90989 -422002 -137186 103388 -171793 -4290 -64885
10700 -64885 63391 -1243 450729 -240215 -82911 -253694 -158803 -45545 104360 -64573 -187538
10689 -187538 -353427 -163008 -49376 -116786 -200603 -64863 -224665 289435 -104470 -207585
10679 -207585 -204788 -469392 -96018 107117 76358 220892 303725 62711 -152550 197636 1238
10667H9988J55893A0596h5470m2461N5170a0531l75087a64260I9692a62387k8165
10656a90552C8303j6960b12197L3207j36261f7968D9856b23351A19142h8610A35670
10644C14910c5900l9168r1937O5752L686F3247d8614E6033M2853N4596a63206
10632H8434a98601B26c25464J56238H7356A274a74517P218n1730f109m7441j14784
10620a68334L6412j74465d475n9670j78040f6495B6401a87792A53312f1024j2194
10609g3218b2168j8842I5942a19436p4692M9111a6559A3961k004d56694e9896
10597A00110b08640Q7545j5112k5105c0559k28101A14438h2858B6280h2202j71346
10586b53548o435a6454A46589a40561j67796a14023a9128j37098F2207K7433h2008
$$ plain form
10667 89988 245881 10596 -85470 -127931 -72761 -10531 -385618 -164260 99692 -162387 -190552
10656 -190552 38303 21343 -212197 -178990 -315251 -67968 49856 -223351 119142 -88610 135670
10644 314910 -35900 -75068 -167005 -101253 -97567 63247 -48614 56033 98886 153482 -163206
10632 88434 -198601 226 -325464 -169226 87356 1274 -174517 -167299 -219029 -6109 -53550 -168334
10620 -168334 -131922 -306387 -4475 -64145 -242185 -66495 26401 -187792 153312 -61024 -73218
10609 -73218 -22168 -41010 95942 -119436 -194128 -145017 -16559 13961 11957 -456694 -59896
10597 100110 -208640 -121095 -136207 -161312 -30559 -258660 114438 -82858 26280 -82202 -253548
10586 -253548 -259983 -16454 146589 -140561 -308357 -114023 -19128 -156226 62207 89640 -82008
10574b15774B52172o9423p2775b81570O4413k8360R0324G7898a39821j19667A03193
10562C80421c59800B19414D7081N8869B1125d0692m4074G9680a38978j91422g284
10550b67805A34630b44548Q4413O2733k8774o3955f1389G9804L39285j89824b29141
10538D46739e3578A01605b00599j16780A60979C9914a9118E8985H616a28021d0351
10526b18043f7351A5374P0898C4664E949a62348P9480a5344n3592c3105l7064
10515g0169k4740B30589k544j00936l5543k9215J66670e48735A72898b48925A80403
10503i2459J3598j17204j89518D6418J50956b9237B20072G1311J25038H9102M6738
10492A35840j8392Q2346q1651J9191K67346A22909d18821a7381e625A67001j6075
$$ plain form
10574 -215774 252172 182749 109974 -281570 -217157 -245517 -155193 77898 -139821 -259488 103193
10562 380421 -359800 219414 47081 105950 21125 -40692 -84766 79680 -138978 -330400 -7284
10550 -267805 134630 -244548 -160135 -97402 -126176 -190131 -61389 79804 419089 229265 -229141
10538 446739 -53578 101605 -200599 -317379 160979 39914 -19118 58985 8616 -128021 -40351
10526 -218043 -67351 15374 86272 34664 5949 -162348 -82868 -15344 -68936 -33105 -70169
10515 -70169 -94909 230589 228045 127109 91566 62351 229021 -548735 172898 -248925 180403
10503 -92459 -78861 -196065 -385583 46418 197374 -29237 220072 71311 196349 89102 135840
10492 135840 117448 199794 118143 137334 404680 122909 -418821 -17381 -5625 167001 150926
10481A50926J14285K39257j24787K59199k36907a12963C47513A63197l6111K08495
10471C35581O8054a77353L7137I5057C8800a84469A25534a17088m8929B2556a76920
10459G0422a80119g7368j58737a7486k20315A18893a13928A63494J37562b33628
10448g3432q5371e4884l1063H5304b4948C64788c23482g2534A76427b09819g7895
10436H4589e7194C8675c87980b9699l70A15894d314j66774f6884m6610k0995O6039
10424f8450L0761G5869J30269d4303n4182G949J72189a58959L7531B40163b95694
10412C03544h7151b8621A33671J8991d1486A6516R778K49349l7096b33717F5506
10400b61992a99C73786A04035B4328P1163a03593k2061b8276A49268n9400b67902
$$ plain form
10481 150926 265211 504468 379681 638880 401973 -112963 347513 163197 127086 335581
10471 335581 403635 -177353 -140216 95057 38800 -184469 125534 -117088 -166017 22556 -176920
10459 70422 -180119 -77368 -236105 -17486 -237801 118893 -113928 163494 301056 -233628
10448 -73432 -158803 -54884 -85947 85304 -24948 364788 -323482 -72534 176427 -209819 -77895
10436 84589 -57194 38675 -387980 -29699 -30069 115894 -4314 -171088 -66884 -113494 -134489 -68450
10424 -68450 -37689 75869 206138 -44303 -98485 7949 180138 -158959 -121428 240163 -295694
10412 303544 -87151 -28621 133671 152662 -41486 16516 26294 275643 238547 -233717 65506
10400 -261992 -199 373786 104035 24328 95491 -103593 -125654 -28276 149268 89868 -267902
10388a99656i6558C5371a03698L2589L1608C13649A40437g728A16554d49C30347
10376D0815h827A90085P9436A15542J07552m7300D120K50107F8030J47531R4349
10365C09910j0763B2950M7081L20442C4420J94503J63658M6403H8073J74202K08509
10354D70784A77105E4512J49885K29531j616L50138l65952k06204P1751L07191
10344E89236k77257K91779B83638J910K8282C6930J02179B8787J27797R7001j03974
10333A49611d51605B36317g955j36505K1504I3006J55182A02741h963A22086J56484
10322B78570J50984A98540n0547P6693b04807D0028J04582a4167A48026g478l32521
10311c39999a30793l22439K05117j8415j15381a58847B42640A17726e1880r9346
$$ plain form
10388 -199656 -96558 35371 -103698 -71109 -39501 313649 140437 -7728 116554 -449 330347
10376 40815 -8827 190085 269521 115542 223094 175794 4120 254227 68030 215561 309910
10365 309910 299147 22950 70031 390473 34420 228923 392581 438984 88073 262275 470784
10354 470784 177105 54512 204397 433928 432312 782450 416498 210294 282045 589236
10344 589236 311979 603758 283638 285548 313830 36930 139109 28787 156584 253585 149611
10333 149611 -451605 236317 -7955 -144460 -122956 93006 248188 102741 -8963 122086 278570
10322 278570 429554 198540 147993 224686 -204807 40028 144610 -14167 148026 -7478 -339999
10311 -339999 -130793 -453232 -248115 -266530 -381911 -158847 242640 117726 -51880 -151226
10301a51226j33723J06961L0191q3583C01365Q6030a43411r6869A42165a4792
10290i98r2209G8092P5333J37013b16239A18995e8655n7675j96927c0963F2857
10278c61787A62073f0403o8829e7501n6926A1007c06361a38827H0147b48736d4026
10266i3216A20059r766H329K31992a8383A82095K7751J23951j7790K85779b83098
10254D56984F9688J00302a00188A61616l9785a21498a9881A93299j7806G4745
10243C12327a28330j1788p6673A21334B5712a86531q101O3680N0952k72238a61512
10231b0724p159A49287B3822O7100N7734J5877E7156A7686e8315A73742m6043
10220A27699h0597B9696A0993M2449a91315f7041j9371J911a5538A05186Q0277
$$ plain form
10301 -151226 -284949 -177988 -147797 -231380 301365 387395 -143411 -240280 142165 -14792
10290 -998 -93207 78092 153425 290438 -216239 118995 -58655 -116330 -313257 -30963 62857
10278 -361787 162073 -60403 -129232 -57501 -114427 11007 -306361 -138827 80147 -248736 -44026
10266 -93216 120059 110293 8329 240321 -18383 182095 209846 333797 316007 601786 -283098
10254 456984 69688 169990 -100188 161616 121831 -121498 -19881 193299 175493 74745
10243 312327 -128330 -140118 -216791 121334 25712 -186531 -194632 -130952 -80000 -352238 -161512
10231 -20724 -27883 149287 23822 90922 148656 164533 57156 17686 -58315 173742 127699
10220 127699 -80597 29696 10993 53442 -191315 -67041 -86412 -84501 -15538 105186 185463
10209A85463b8307D47247A51226E4613B7084d54944J90463L9562c4158k5718j48492
10198b08368O9788q227d8516a1639A56282J86075A25873J07956a12644k92590
10188d05234i0023A1486C301c23644I7818b81136B63763b13275M1454j71314C1200
10176b9565j58731f1416A19311e5907A7726c16900H029J64229M4715a34124A3011
10164a38585I6340N0057c113D7438A0152a34237d9543j70936F4002j9974a8349
10152A52740a57072A67882a34096o5193k22675I7270a60342F9127e6100o0183
10142a16283j05422I5246a30782N7707o3619n6707N0520j91071g1019j18140b2205
10130b53626B4510b24817q6938C11083f52963B58818c07288c7641A83858a05344
$$ plain form
10209 185463 -28307 447247 151226 54613 27084 -454944 -264481 -224919 -34158 -59876 -208368
10198 -208368 -138580 -146807 -48516 -11639 156282 342357 125873 233829 -112644 -405234
10188 -405234 -90023 11486 3301 -323644 97818 -281136 263763 -213275 -171821 -343135 31200
10176 -29565 -188296 -61416 119311 -55907 17726 -316900 8029 172258 216973 -134124 13011
10164 -138585 96340 146397 -3113 47438 10152 -134237 -49543 -220479 64002 44028 -18349
10152 152740 -157072 167882 -134096 -199289 -421964 97270 -160342 69127 -56100 -116283
10142 -116283 -221705 95246 -130782 -73075 -136694 -193401 -142881 -333952 -71019 -189159 -22205
10130 -253626 24510 -224817 -311755 311083 -652963 258818 -307288 -37641 183858 -105344
10119A40443e1564j88570R721B97255E7150a07847a0772C13225C5132d5050m7758
10108i2808D3384a81533B62346E0295N9989h4634C34493b04830j72022A03128
10097a17835d9517J782A889f3658A52598d84E875d8028l8968k8477F5648M6615
10085A12263a9787k18743d3580j10521A62578a43604H1758d4629G3606a87518
10074b12805L1493q0602n6009e2772L131k3424o1833A19819D8494R5002d50516
10062a81287a6996j03370E733d5450M33j36139G2643M8605b68339A11835h1409
10050A8696b04770P9420B8045i5017k64952A52174b13148L3049g1338c805n2566
10039e6371J9665E2756a10353j4858l9806J1057j41569C1554b44949A56644d98185
$$ plain form
10119 140443 -51564 -240134 -230413 297255 57150 -107847 -10772 313225 35132 -45050 -92808
10108 -92808 43384 -181533 262346 50295 110284 -84634 334493 -204830 -376852 103128
10097 -117835 -49517 -47735 1889 -63658 152598 -484 5875 -48028 -86996 -115473 65648 112263
10085 112263 -19787 -238530 -43580 -154101 162578 -143604 81758 -44629 73606 -187518
10074 -212805 -181312 -261914 -317923 -52772 -49641 -73065 -134898 119819 48494 143496 -450516
10062 -181287 -16996 -120366 5733 -45450 -45017 -181156 72643 121248 -268339 111835 -81409
10050 18696 -204770 -125350 28045 -95017 -359969 152174 -213148 -180099 -71338 -3805 -56371
10039 -56371 -36706 52756 -110353 -125211 -165017 -153960 -295529 31554 -244949 156644 -498185
10027i7115C6452f1044I5554h0349j93757j1562L4426B00820a02511K4590B4173
10015A96365a24386m60792A26722k8323c52451A33067a56111l16378K25909a16315
10004f4098n8889K2264c635j83321l7291C7809b05821j0544B2799a02579C64033
9992g1180A6721b01393m3921J15284j70461a48631g2255C2317a59265H0963f7380
9980b04745f0434P151D7051d8256G852J13163D9219a9213j45813C3729P2480h2081
9967h3330o1970j49525J19705g0772B47280b27442K0800d8522B05278a31321p4340
9956b05661N1480E5167M9987e7672C02550e7418A5265c65705A23264A7820h6989
9944c55376e9845j82778A38574a84209K8644K174n5429L0728L9466J8978k50851
$$ plain form
10027 -97115 36452 -61044 95554 -80349 -274106 -285668 -251242 200820 -102511 -77921 24173
10015 196365 -124386 -585178 126722 98399 -352451 133067 -156111 -472489 -246580 -116315
10004 -64098 -122987 -100723 -3635 -186956 -224247 37809 -205821 -216365 22799 -102579 364033
9992 -71180 16721 -201393 -245314 -130030 -300491 -148631 -72255 32317 -159265 80963 -67380
9980 -204745 -60434 -53283 47051 -48256 7852 121015 49219 -19213 -165026 33729 106209 -82081
9967 -83330 -145300 -294825 -175120 -70772 247280 -227442 -206642 -48522 205278 -131321 -205661
9956 -205661 -154181 55167 105154 -57672 302550 -57418 15265 -365705 123264 17820 -86989
9944 -355376 -59845 -242623 138574 -184209 -155565 -153391 -208820 -178092 -138626 -119648 -370499
9933c70499B0516a44442f9852l3423r0689A9615L6874a62208j28085h7897k37931
9922c25828a34246A19714l1679a95351e7267C9090a52524b020F226b54184J2121
9911b42063M4144A85161f2798j45641N5720D07N0078A9341J22087J26715B2127
9899G8034b45385A27189a44938a9055j54055C4460h4622J0389N182A80668c89296
9887f2066B60677a50423B6997c0173l0475j19034Q7075A28673i1418j60237p5668
9876c27323f8313L0572g705j77103i0570k87305a56091g349A06596b5900B6287
9864a93706K4117D806h0755c0841B12206C9097J46504M0631g9928B4841b31312
9852F8594a39302q6281A59557d91293H3470i9983M4337H821O8081g2990j22830
$$ plain form
9933 -370499 20516 -144442 -69852 -103275 -193964 19615 56489 -162208 -290293 -87897 -325828
9922 -325828 -134246 119714 88035 -195351 -57267 39090 -152524 -2020 6226 -254184 -242063
9911 -242063 -197919 185161 -62798 -208439 -152719 407 50485 19341 141428 268143 22127
9899 78034 -245385 127189 -144938 -19055 -173110 34460 -84622 -74233 -69051 180668 -389296
9887 -62066 260677 -150423 26997 -30173 -60648 -179682 -92607 128673 -91418 -251655 -327323
9876 -327323 -68313 -37741 -7705 -184808 -90570 -377875 -156091 -7349 106596 -25900 26287
9864 -193706 -169589 4806 -80755 -30841 212206 39097 185601 226232 -79928 24841 -231312
9852 68594 -139302 -225583 159557 -491293 83470 -99983 -55646 8821 76902 -72990 -195820
9841a95820A28109a04805A20681L8125F7961g9228j98176J36512k69421f7193
9830E9764a78595n6024f6939a5000A41134B7041a22051O0476n8025k11204B1699
9818b17325f6672A05941C6578e3886o8819A71125a79476f942A22087b30042A20471
9806b41384r1283A68662g1165j8225A65165F8327a91809C63790q8567b30831N5790
9795a75041P2250l642A85197c40323B56247e1490j67555E6468N6823c78142J48741
9784b29401n2097i1002A99807b84382A12438m3680b86960B8035b15545O1873G8998
9772a8085B59870a60351l1103l12974E2076b8184c025m21393b9881E7731P7114
9761A34845a89140M9386f2907F1238B2958b27893F5511c48600i6911k13617A90864
$$ plain form
9841 -195820 128109 -104805 120681 158806 67961 -79228 -277404 -140892 -410313 -67193
9830 59764 -178595 -234619 -66939 -15000 141134 27041 -122051 -61575 -119600 -330804 21699
9818 -217325 -66672 105941 36578 -53886 -122705 171125 -179476 -6942 122087 -230042 120471
9806 -241384 -332667 168662 -71165 -89390 165165 68327 -191809 363790 275223 -230831 -175041
9795 -175041 -102791 -106433 185197 -340323 256247 -51490 -219045 56468 113291 -378142 -229401
9784 -229401 -281498 -91002 199807 -284382 112438 68758 -286960 28035 -215545 -153672 78998
9772 -18085 259870 -160351 -191454 -504428 52076 -28184 -3025 -424418 -29881 57731 134845
9761 134845 -189140 -139754 -62907 61238 22958 -227893 65511 -348600 -96911 -310528 190864
9749a16653d1687B6179b11410A76597b54456a0318l19186a3474l298A58581F9189
9737h4250k81188A70091b3769j05877M7819H8644a35162j65732J45176m3421k69881
9726d69020e5347q2224N8218m5712N4673k48096h1858m9674m171I0160d38G733
9713I8389e2094A39201a68567j01586P0194c5722k2300k42361O3754A07293a07770
9701I5915c93171A71120d46224a42121N5228B15849c08131d2073A36207a41874
9690b73296J34214C00065e8575k10703C7227L2869a61235p4463R7259C74723A47466
9678a70656P2737C4493h0286k05767R1712h6309o7574q5226c9267k06789j9106
9667b65162f4496j6195A68110F6476O2990a70994l62168d0204A84807L708b024
$$ plain form
9749 -116653 -41687 26179 -211410 176597 -254456 -10318 -329504 -13474 -16772 158581 69189
9737 -84250 -365438 170091 -23769 -129646 -81827 88644 -135162 -300894 -155718 -199139 -469020
9726 -469020 -55347 -137571 -79353 -125065 -70392 -318488 -81858 -131532 -135703 90160 -438 7733
9713 98389 -52094 139201 -168567 -270153 -199959 -35722 -58022 -300383 -236629 107293 -107770
9701 95915 -393171 171120 -446224 -142121 -86893 215849 -308131 -42073 136207 -141874
9690 -273296 -139082 300065 -58575 -269278 37227 70096 -161235 -235698 -138439 374723 147466
9678 -170656 -97919 34493 -80286 -286053 -194341 -86309 -153883 -239109 -39267 -246056 -265162
9667 -265162 -64496 -80691 168110 66476 129466 -170994 -533162 -40204 184807 188515 -2024
9655a16363e7409k01058A79949b15535B15373J22240A7556N8252f0033n328l52821
9644d18182b08716R6519A36161a88494B0579a40344A67145a1453B46446a39565
9633B5333J65503I2720a89818c4411H1529m0609c3444k33130e3769A89138B0043
9621c57782b282k12403B18120m3446a45071j13511g2015n8236C715b2576j936
9610b4512j08492N8527B17937c9481J1462r2292k572K7595j07544A98277f9464
9598I1705b0153D7213P6023b79859M2264g0040A96660a10173H4557a87866O5981
9587a21885k15154g8635j06941A22554a53212j45820H6115b62514a27697o9017
9577a96714Q9617j98617B13368l1880b35487a7281m4824F6126a89243O1577K1877
$$ plain form
9655 -116363 -57409 -258467 179949 -215535 215373 337613 17556 75808 -60033 -65361 -418182
9644 -418182 -208716 -112197 136161 -188494 20579 -140344 167145 -11453 246446 -139565
9633 25333 190836 92720 -189818 -34411 81529 40920 -33444 -266574 -53769 189138 20043
9621 -357782 -2282 -214685 218120 174674 -145071 -258582 -72015 -130251 3715 -22576 -24512
9610 -24512 -133004 -74477 217937 -39481 -28019 -120311 -122883 -95288 -202832 198277 -69464
9598 91705 -20153 47213 123236 -279859 -237595 -70040 196660 -110173 84557 -187866 -121885
9587 -121885 -337039 -78635 -185576 122554 -153212 -299032 86115 -262514 -127697 -196714
9577 -196714 -107097 -305714 213368 181488 -235487 -17281 -62105 66126 -189243 -127666 -105789
9566a05789A60584k1575B6009f6919p0043E6240J80844h2130B1349a25395m7985
9555a73380N6761l5738a4497k57963l9819Q7206K2847i825j51503c3013C58851
9543a54656m904m6946N568d9572p457k52527a32118j1892D9123K16096b98107
9531A65501a94947G8321K8126b31743j48894d2521j0241A59465c14467c3010B49445
9519A18750b9030j44202B63721C7690a11725j45275j16734a82961g9706j42867
9509b22573F932J94531d7370k35461g4099b7700k23515f3411l28511e7261j43943
9498b01204F9466R6572J79419b54496I6273K33913b70205D3826J2567b9973D0658
9486B60265b62468o428J19495D52092H5403a99533j38283E5618Q18B3396O1210
$$ plain form
9566 -105789 160584 139009 26009 -66919 -136962 56240 237084 -82130 21349 -125395 -173380
9555 -173380 -116619 -152357 -14497 -272460 -312279 -225073 -202226 -9825 -161328 -33013 358851
9543 -154656 -159560 -206506 -200938 -49572 -57029 -309556 -132118 -144010 49123 265219 -298107
9531 165501 -194947 78321 106447 -231743 -380637 -42521 -52762 159465 -314467 -33010 249445
9519 118750 -29030 -173232 263721 37690 -111725 -257000 -373734 -182961 -79706 -222573
9509 -222573 6932 201463 -47370 -282831 -74099 -27700 -251215 -63411 -391922 -57261 -201204
9498 -201204 69466 166038 345457 -254496 96273 330186 -270205 43826 56393 -29973 40658
9486 260265 -262468 -268896 -149401 452092 85403 -199533 -337816 55618 56436 23396 84606
9475H4606a35803n1124B10736J3999c54482J60195B855J70555d9159D7716b00990
9463a79567N8570A36642J87998h0405q236b5323B61503A08327O6640d9727D64326
9451a05470f450A14407f0656E30i7039A00371b0386A55157d0949j40089J8293
9440a62745A40626a18032k08484g7531q1119j94634N3306d4448j14038M6060B3575
9428h0156J8195k8211q0823K7982B77116I5595a45196o6389R4075A6604Q6034
9417A02638b16587J00908C2482e4547k0523l66431a51081M2858I6978b0578B15729
9405A27495A4485M5662B1686e1736H2139d19850d9059j49871A35270J59563a68937
9393b70556A35066C1601J01569b08010A34058f8910B11512b9948B09058b28399
$$ plain form
9475 84606 -135803 -186927 210736 224735 -354482 -194287 2855 173410 -49159 47716 -200990
9463 -179567 -120997 136642 324640 -80405 -88641 -25323 261503 108327 174967 -49727 464326
9451 -105470 -6450 114407 -60656 530 -97039 100371 -20386 155157 -40949 -181038 -162745
9440 -162745 140626 -118032 -326516 -77531 -158650 -353284 -299978 -44448 -158486 -112426 23575
9428 -80156 -61961 -90172 -170995 -143013 277116 95595 -145196 -211585 -117510 16604 102638
9417 102638 -216587 -115679 32482 -54547 -75070 -441501 -151081 -108223 96978 -20578 215729
9405 127495 14485 60147 21686 -51736 82139 -419850 -49059 -198930 135270 294833 -168937
9393 -270556 135066 31601 133170 -208010 134058 -68910 211512 -29948 209058 -228399
9382A96788a29410A0320b43219e6405C780e7604H3422d862H9460a11923L915j99277
9370c07285a30529K4060B70429a77143E8490d159k9224j0452j9968K5893p4725
9359a12635j2830A77399p4426f2039D416i1161L6367j27633a0064A07202b57225
9347a45422A43429f6425B33852q7637O870f7065B8922e5801n1755l08876J63291
9336b53141f628B67243c04187J29980A06600a63612L2607d3115n6598j5570j08863
9325b24146M674N4176d0866J645n7129B5396K6382b52273A91389C8848a07706
9313G8363f8959K0752a4694j20592L3231r1827B02832a96009F3489K52410a36488
9301d08057A00389A4841b5558k20177h1821J6283j25541Q4506b846j13191B08806
$$ plain form
9382 196788 -129410 10320 -243219 -56405 3780 -57604 83422 -4862 89460 -111923 -108008 -307285
9370 -307285 -130529 -106469 270429 -177143 58490 -4159 -33383 -43835 -63803 -37910 -112635
9359 -112635 -125465 177399 102973 -62039 4416 -91161 -54794 -182427 -10064 107202 -257225
9347 -145422 143429 -66425 233852 146215 153085 -67065 28922 -55801 -107556 -416432 -253141
9336 -253141 -6628 267243 -304187 -174207 106600 -163612 -131005 -43115 -99713 -115283 -224146
9325 -224146 -219472 -165296 -40866 -39221 -96350 25396 51778 -252273 191389 38848 -107706
9313 78363 -68959 -48207 -14694 -135286 -102055 -193882 202832 -196009 63489 315899 -136488
9301 -408057 100389 14841 -25558 -245735 -81821 -65538 -191079 -106573 -2846 -116037 208806
9289b73039C84272b17411c5296E4672a45229g2485k28991b9387k3406l9134m810
9278i6737a4253A47155l5785D3269b70238A55005J3344a85389B9959b63520b1329
9266g2576m7572o2457c6066k00712A34953b15463i7407D8352i4273q0366d7336
9254a12912j53330k9482A47567n5667e9182k49315A09798J21394b7653m685R877
9243b2461H1899a5992E9328i3559a9839D8169L0651a96179B4550Q4262g2768b5585
9230b4883n1525j14577K9794A35461c3131A32874C2002m878d02846a08092C1898
9218f3749m7228A79237Q6202A15606R413h2812I9246a32278L4540k04692M2771
9207b59659l4943d6823l90409l4211f0578j82853L5312A53J64432a10862H6768
$$ plain form
9289 -273039 384272 -217411 -35296 54672 -145229 -72485 -301476 -29387 -52793 -91927 -96737
9278 -96737 -14253 147155 111370 43269 -270238 155005 168349 -185389 29959 -263520 -21329
9266 -72576 -120148 -182605 -36066 -236778 134953 -215463 -97407 48352 -94273 -174639 -47336
9254 -112912 -266242 -295724 147567 91900 -59182 -308497 109798 231192 -27653 -32338 -22461
9243 -22461 81899 -15992 59328 -93559 -19839 48169 78820 -196179 24550 108812 -72768 -25585
9230 -24883 -76408 -190985 -161191 135461 -33131 132874 32002 27124 -402846 -108092 31898
9218 -63749 -110977 179237 265439 115606 125019 -82812 99246 -132278 -97738 -302430 -259659
9207 -259659 -294602 -46823 -437232 -471443 -60578 -243431 -208119 153 164585 -110862 86768
9195a53119k7936A17374a14148A69987c43034K5213q51i607A67714n4499a64822
9183c41035A10497a98738Q753i388A21073a90649N2708B71116j1864a6378j7451
9172c3829j90259H4069i3323A64744b28763C7151a58654K4765B22253a21046j84953
9161c05999J37837K0636f3157k17501A71158h1566q5509k5108C44169c23904C8740
9149a11535B1350N4396a90637K988C439Q1819b08419A67330a44369b8824j0343
9138c9167D698N9440a61762E2588a29692A21333D1025K0233I325a47468B65297
9126b03405P9225k95618a6292k46820A37850K15463a18386k37347E7978a42248
9115C38870j17220b10274Q1683l5730m274A28390K30924j35072b79630A89201
$$ plain form
9195 -153119 -181055 117374 -114148 169987 -343034 -317821 -318672 -9607 167714 113215 -164822
9183 -341035 110497 -198738 -189985 -9388 121073 -190649 -137941 271116 259252 -16378 -33829
9172 -33829 -224088 84069 -93323 164744 -228763 37151 -158654 -133889 222253 -121046 -305999
9161 -305999 -168162 -147526 -63157 -280658 171158 -81566 -167075 -192183 344169 -323904 38740
9149 -111535 21350 75746 -190637 -187649 3439 85258 -208419 167330 -144369 -28824 -39167
9138 -39167 4698 64138 -161762 52588 -129692 121333 41025 61258 9325 -147468 265297
9126 -203405 -124180 -419798 -16292 -263112 137850 353313 -118386 -355733 57978 -142248
9115 338870 221650 -210274 -128591 -164321 -168595 128390 359314 224242 -279630 189201
9104b36465j7405F2658A9080F616g6120H7420J88979a45735L0296C6693J49927
9093A86620a28377o4803A96247h5485K6298J9014j28520A21675b07482J01307
9083a06175F0861a44438n1342a5677l12733A6489a81758l4392j37119a52885j03160
9072b56045F3326J9966P7965m1089g0026A78575f6485G1059b82974c0545A48618
9060b10878B3464a66907D11828f5186a0208B98618b6251l7527A01407d4960E8711
9048f0476k41171Q7565j6044A00338c6233m75565J37719A38261C9071G552K0437
9037B7989J71941D1212K713O0760d2695C0729J64512N09a97497c9980k72495L8983
9025b73492a04083A51989a9766G1093K1521b10390C0387b939B15558B6359a32815
$$ plain form
9104 -236465 -253870 62658 19080 6616 -76120 87420 276399 -145735 -115439 36693 186620
9093 186620 -128377 -193180 196247 -85485 -59187 -40173 -168693 121675 -207482 -106175
9083 -106175 60861 -144438 -195780 -15677 -328410 16489 -181758 -216150 -353269 -152885 -256045
9072 -256045 63326 83292 161257 120168 -70026 178575 -66485 71059 -282974 -30545 148618
9060 -210878 23464 -166907 411828 -65186 -10208 298618 -26251 -63778 101407 -44960 58711
9048 -60476 -301647 -214082 -230126 100338 -36233 -511798 -374079 138261 39071 7552 27989
9037 27989 199930 41212 43925 104685 -42695 30729 195241 195750 -197497 -39980 -312475 -273492
9025 -273492 -104083 151989 -19766 71093 92614 -210390 30387 -2939 215558 26359 -132815
9013a84143Q9413D01109b87661E0931c87567I31c21938a49834p1905P6773A55401
9001h3437j17272P6182L4567a4960A37103i7161N625m4523k52397i0183j46360
8990b36543B6565a31742I7079a76722r5982F4673R6478b43689i5515B9981a91255
8978a61679j53627J23805A71074m9958J50936a54570L2453l04031h5038B4273
8967I850e7114q0742j94291a05447d1709k3244f825j64649O7906r4811E1187a33186
8954A55023o0220b53896A03796b15861C3591K55587a03896j03115b7973k27948
8944b55921E2162a03472R287k42G1396i741A51532b45990A89912J09324b5273
8932I045a70731D66764a291k9605j08854f1756C78327C1164O11334R12546L999255
$$ plain form
9013 -184143 -94730 401109 -287661 50931 -387567 931 -321938 -149834 -221739 -144966 155401
9001 -83437 -200709 -124527 -89960 -14960 137103 -97161 -91536 -136059 -388456 -90183 -236543
8990 -236543 26565 -131742 97079 -176722 -272704 64673 161151 -243689 -95515 29981 -191255
8978 -161679 -315306 -191501 171074 121116 272052 -154570 -122117 -426148 -85038 24273
8967 9850 -57114 -137856 -332147 -105447 -41709 -64953 -6825 -171474 -103568 -198379 51187 -133186
8954 155023 94803 -253896 103796 -215861 33591 289178 -103896 -207011 -27973 -255921
8944 -255921 52162 -103472 -94185 -94427 71396 -9741 151532 -245990 189912 299236 -25273
8932 9045 -170731 466764 -1291 -30896 -139750 -61756 378327 31164 642498 1555044 5554299
8921E554299m92652A694417G21307k01738J81756B05888K81282h0077C60414A12436
8910a56975h066D4363K63065a32366l8401B34862r910D0350a65521l18415K30721
8899b53215g6694A31490j1201A2629b76524B32871A7983K0461a33435c7801I4708
8887A41531e5099D62115C0487a1192p9467M4125B6568h7836E7174K03840b6692
8875B9489K13542b96282D8289K66998f9918l9845k11043C4184b99343h8363j17978
$$ plain form
8921 5554299 5061647 1694417 721307 519569 701325 205888 487170 -80077 360414 112436
8910 -156975 -8066 44363 307428 -132366 -170767 234862 224952 40350 -165521 -483936 -253215
8899 -253215 -76694 131490 120289 12629 -276524 232871 17983 38444 -133435 -37801 94708
8887 141531 -55099 462115 30487 -11192 -90659 -46534 26568 -87836 57174 261014 -26692
8875 29489 243031 -296282 48289 315287 -69918 -109763 -320806 34184 -299343 -88363 -206341
$$ [...]
##END NTUPLES=NMR SPECTRUM
##END=
