##TITLE=AC1654_NARAH14390_8531325_FUju9iZESU
##JCAMPDX= 6.0         $$ Bruker NMR JCAMP-DX V2.0
##DATA TYPE= NMR SPECTRUM
##DATA CLASS= NTUPLES
##ORIGIN= BRUKER
##OWNER= Administrator
$$ 1.72 TOPSPIN		Version 2.1
$$ 2014-03-14 19:52:11.814 -0800  Administrator@X
$$ Compression mode = diff/dup
##.OBSERVE FREQUENCY= 400.02188249412
##.OBSERVE NUCLEUS= ^1H
##.ACQUISITION MODE= SIMULTANEOUS (DQD)
##.ACQUISITION SCHEME= undefined
##.AVERAGES= 64
##.DIGITISER RES= 22
##SPECTROMETER/DATA SYSTEM= spect
##.PULSE SEQUENCE= noesygpps1d.comp
##.SOLVENT NAME= COFFEE_meoh
##.SHIFT REFERENCE= INTERNAL, COFFEE_meoh, 1, 14.96082
##AUDIT TRAIL= $$ (NUMBER, WHEN, WHO, WHERE, PROCESS, VERSION, WHAT)
$$ ##TITLE= Audit trail, TOPSPIN		Version 2.1
$$ ##JCAMPDX= 5.01
$$ ##ORIGIN= Bruker BioSpin GmbH
$$ ##OWNER= Administrator
$$ $$ E:\/data/COFFEE/nmr/AC1654_NARAH14390_8531325_FUju9iZESU/12/pdata/1/auditp.txt
$$ ##AUDIT TRAIL=  $$ (NUMBER, WHEN, WHO, WHERE, PROCESS, VERSION, WHAT)
(   1,<2014-03-14 19:52:06.908 -0800>,<Administrator>,<X>,<go>,<TOPSPIN 2.1>,
      <created by zg
	started at 2014-03-14 19:40:37.080 -0800,
	POWCHK enabled, PULCHK disabled,
       configuration hash MD5:
       C8 4E 4E 5D D3 5C D8 9E 9F 52 82 E0 59 8A DE 15
       data hash MD5: 64K
       07 A8 D0 3D 61 0C D0 CD DC 4C D5 27 AC D2 FB 26>)
(   2,<2014-03-14 19:52:09.798 -0800>,<Administrator>,<X>,<proc1d>,<TOPSPIN 2.1>,
      <Start of raw data processing
       efp LB = 0.3 FT_mod = 6 PKNL = 1 PHC0 = 0 PHC1 = 0 SI = 128K 
       data hash MD5: 128K
       90 7C F4 BE A5 57 1A 05 B0 BC 5B 73 A5 68 23 76>)
(   3,<2014-03-14 19:52:10.767 -0800>,<Administrator>,<X>,<proc1d>,<TOPSPIN 2.1>,
      <pk PHC0 = -82.70508 PHC1 = 0 
       data hash MD5: 128K
       63 4D 22 AB 1C 0A 41 38 1E A6 21 FF 31 3A 7E AD>)
(   4,<2014-03-14 19:52:11.189 -0800>,<Administrator>,<X>,<proc1d>,<TOPSPIN 2.1>,
      <abs ABSG = 1 
       data hash MD5: 128K
       95 A5 6F D5 3A F0 74 0E 2D 7F F0 BC 4D 99 41 1C>)
(   5,<2014-03-14 19:52:11.298 -0800>,<Administrator>,<X>,<proc1d>,<TOPSPIN 2.1>,
      <abs ABSG = 2 
       data hash MD5: 128K
       E7 D4 F4 9C C0 94 4D 04 67 B7 F2 F8 71 D4 7C 7E>)
(   6,<2014-03-14 19:52:11.392 -0800>,<Administrator>,<X>,<proc1d>,<TOPSPIN 2.1>,
      <abs ABSG = 3 
       data hash MD5: 128K
       12 B5 08 5D A7 CA DB 7A AB B8 1F 80 34 16 F5 89>)
(   7,<2014-03-14 19:52:11.501 -0800>,<Administrator>,<X>,<proc1d>,<TOPSPIN 2.1>,
      <abs ABSG = 4 
       data hash MD5: 128K
       E4 B0 FB 82 50 B1 0B 21 27 0A B0 AB A1 E5 1F 0A>)
(   8,<2014-03-14 19:52:11.611 -0800>,<Administrator>,<X>,<proc1d>,<TOPSPIN 2.1>,
      <abs ABSG = 5 
       data hash MD5: 128K
       79 72 A9 84 37 8B CE 9C 70 A1 5F 3C A3 5F 22 96>)
$$ ##END=
$$ 
$$ $$ hash MD5
$$ $$ 84 DD EA 6E 60 FB 16 CB 49 F7 1E FA CE B6 47 73
##$RELAX= 
##$RELAX= 
##$RELAX= 
##$RELAX= 
##$RELAX= 
##$RELAX= 
##$RELAX= 
##$RELAX= 
$$ Bruker specific parameters
$$ --------------------------
##$DU= <E:\>
##$EXPNO= 12
$$ [...]
##$TP07= 0
##$TPNAME0= <>
##$TPNAME1= <>
##$TPNAME2= <>
##$TPNAME3= <>
##$TPNAME4= <>
##$TPNAME5= <>
##$TPNAME6= <>
##$TPNAME7= <>
##$TPOAL= (0..7)
0.5 0.5 0.5 0.5 0.5 0.5 0.5 0.5
##$TPOFFS= (0..7)
0 0 0 0 0 0 0 0
##$TUNHIN= 0
##$TUNHOUT= 0
##$TUNXOUT= 0
##$USERA1= <user>
##$USERA2= <user>
##$USERA3= <user>
##$USERA4= <user>
##$USERA5= <user>
##$V9= 5
##$VALIST= <valist>
##$VCLIST= <CCCCCCCCCCCCCCC>
##$VD= 0
##$VDLIST= <DDDDDDDDDDDDDDD>
##$VPLIST= <PPPPPPPPPPPPPPP>
##$VTLIST= <TTTTTTTTTTTTTTT>
##$WBST= 1024
##$WBSW= 4
##$XGAIN= (0..3)
0 0 0 0
##$XL= 0
##$YL= 0
##$YMAX_a= 6239143
##$YMIN_a= -13306230
##$ZGOPTNS= <>
##$ZL1= 120
##$ZL2= 120
##$ZL3= 120
##$ZL4= 120
##$ABSF1= 14.96082
##$ABSF2= -5.597362
##$ABSG= 5
##$ABSL= 3
##$ALPHA= 0
##$AQORDER= 0
##$ASSFAC= 0
##$ASSFACI= 0
##$ASSFACX= 0
##$ASSWID= 0
##$AUNMP= <proc_prof1d_extract.lims>
##$AXLEFT= 0
##$AXNAME= <>
##$AXNUC= <1H>
##$AXRIGHT= 0
##$AXTYPE= 0
##$AXUNIT= <>
##$AZFE= 0.1
##$AZFW= 0.1
##$BCFW= 0
##$BC_mod= 0
##$BYTORDP= 0
##$COROFFS= 0
##$CY= 15
##$DATMOD= 1
##$DC= 0
##$DFILT= <>
##$DTYPP= 0
##$F1P= 0
##$F2P= 0
##$FCOR= 0.5
##$FTSIZE= 131072
##$FT_mod= 6
##$GAMMA= 0
##$GB= 0
##$INTBC= 1
##$INTSCL= 1
##$ISEN= 128
##$LB= 0.3
##$LEV0= 0
##$LPBIN= 0
##$MAXI= 10000
##$MC2= 0
##$MEAN= 0
##$ME_mod= 0
##$MI= 0
##$NCOEF= 0
##$NC_proc= -2
##$NLEV= 6
##$NOISF1= 0
##$NOISF2= 0
##$NSP= 0
##$NTH_PI= 0
##$NZP= 0
##$OFFSET= 14.96082
##$PC= 1
##$PHC0= -82.70508
##$PHC1= 0
##$PH_mod= 1
##$PKNL= yes
##$PPARMOD= 0
##$PPDIAG= 0
##$PPIPTYP= 0
##$PPMPNUM= 2147483647
##$PPRESOL= 1
##$PSCAL= 4
##$PSIGN= 0
##$PYNMP= <proc.py>
##$REVERSE= no
##$SF= 400.020009708299
##$SI= 131072
##$SIGF1= 0
##$SIGF2= 0
##$SINO= 400
##$SIOLD= 131072
##$SPECTYP= <>
##$SREGLST= <1H.CDCl3>
##$SSB= 0
##$STSI= 131072
##$STSR= 0
##$SW_p= 8223.68421052631
##$SYMM= 0
##$S_DEV= 0
##$TDeff= 65536
##$TDoff= 0
##$TI= <>
##$TILT= no
##$TM1= 0
##$TM2= 0
##$TOPLEV= 0
##$USERP1= <user>
##$USERP2= <user>
##$USERP3= <user>
##$USERP4= <user>
##$USERP5= <user>
##$WDW= 1
##$XDIM= 131072
##$YMAX_p= 376324401
##$YMIN_p= -10537
##$CURPLOT= <Network HP LaserJet P1505>
##$CURPRIN= <$Network HP LaserJet P1505>
##$DFORMAT= <normdp>
##$LAYOUT= <+/1D_H.xwp>
##$LFORMAT= <normlp>
##$PFORMAT= <normpl>
##$SURQMSG= 1
$$ End of Bruker specific parameters
$$ ---------------------------------
##NTUPLES= NMR SPECTRUM
##VAR_NAME=  FREQUENCY,     SPECTRUM/REAL,   SPECTRUM/IMAG
##SYMBOL=    X,             R,               I
##VAR_TYPE=  INDEPENDENT,   DEPENDENT,       DEPENDENT
##VAR_FORM=  AFFN,          ASDF,            ASDF
##VAR_DIM=   131072,        131072,          131072
##UNITS=     HZ,            ARBITRARY UNITS, ARBITRARY UNITS
##FACTOR=    0.0627417313425164, 1,          1
##FIRST=     8223.62146879497, 908,          -63039
##LAST=      0,             3014,            -62695
##MIN=       0,             -10537,          0
##MAX=       8223.62146879497, 376324401,    0
$$ Real data points
##PAGE= N=1
##DATA TABLE= (X++(R..R)), XYDATA
$$ [...]
63905B008049j33195j20242j07948r6277q5570p6005o7438n9718n2891m7092m2386
63894A119287l8701l5853l3590l1652k9895k8412k7468k7056k6631k5579k3988
63883G90462k2556k1488k0053j7575j4445j1576r189o857m391j974N23L524O910
63870F71315R861J1744J2695J3270J4009J5355J7289J9000J9519J8897J8116J7692
63858H58762J7026J5376J2841J0061P494N286L394J537n57k748m744o745r132
63845I07851j1582j3405j4826j6829j9411k1271k1836k2328k3930k5918k6788
63834F89727k6368k5626k5004k4196k3159k2127k0921j9324j7859j7112j6557
63823D51474j5249j3401j2120j1603j0903r592q367p759p355o738o196n965n651
$$ plain form
63905 2008049 1874854 1754612 1646664 1550387 1464817 1388812 1321374 1261656 1208765 1161673 1119287
63894 1119287 1080586 1044733 1011143 979491 949596 921184 893716 866660 840029 814450 790462
63883 790462 767906 746418 726365 708790 694345 682769 673580 666723 662332 660358 660881 664405 671315
63870 671315 681176 692920 705615 718885 732894 748249 765538 784538 804057 822954 841070 858762
63858 858762 875788 891164 904005 914066 921560 926846 930240 931777 931220 928472 923728 916983 907851
63845 907851 896269 882864 868038 851209 831798 810527 788691 766363 742433 716515 689727
63834 689727 663359 637733 612729 588533 565374 543247 522326 503002 485143 468031 451474
63823 451474 436225 422824 410704 399101 388198 378606 370239 362480 355125 348387 342191 336226 330575
63810C30575m893l966l272k807k454k255k154j988j957k397k992k925k115j484
63796B92916j679k239k481k448k456k411k153k007k330k920l321l358l018k265
63782B57830j363q74r30r98p39n69q00r15l89L27M15j40o64q49q87q83p86p30
63764B46056p47m09N31J419J425Q13N01N28k0j344k297j906p10J01K11J98M24
63747B44774O45O50O04O99Q36Q20P01P65J230K014K771L209L281L100K746K335
63731B71180K069K019J970J773J722K210L058L597L475L024K779K992L699M762
63717C10329N627N539M302K580J100p5j142j844j754j158r32j411j962j865j216
63702C16118o02k34J56P09J187J375J460J824K653L733M610M832M302L376K530
$$ plain form
63810 330575 325682 321716 318444 315637 313183 310928 308774 306786 304829 302432 299440 296515 294400 292916
63796 292916 291237 288998 286517 284069 281613 279202 277049 275042 272712 269792 266471 263113 260095 257830
63782 257830 256467 255593 254663 253665 252926 252357 251557 250642 250253 250580 250995 250855 250191 249342 248455 247572 246786 246056
63764 246056 245309 244900 245431 246850 248275 249088 249589 250117 250097 248753 246456 244550 243840 243941 244152 244350 244774
63747 244774 245419 246069 246673 247372 248208 249028 249729 250494 251724 253738 256509 259718 262999 266099 268845 271180
63731 271180 273249 275268 277238 279011 280733 282943 286001 289598 293073 296097 298876 301868 305567 310329
63717 310329 315956 321495 325797 328377 329477 329402 328260 326416 324662 323504 322572 321161 319199 317334 316118
63702 316118 315516 315282 315438 316147 317334 318709 320169 321993 324646 328379 332989 337821 342123 345499 348029
63687C48029J856J127L55o6K5J50j73o11m97K2J9q00j490j129j56K78j22n74m25
63668C45818J86Q74J497J896J796J196M30l47j264k177k637k692l050m010m799
63653C32717m609l801l321l345l283k867k392j901j075l1N66M44J00QQ3K68Q97
63636C08458K046L069L374L231L304L779M392M996N555N902O006O213O767P396
63622C74488P834Q376R292J0128J0369J0497J1490J3369J5204J6553J7913J9582
63610E25095K1100K2250K3651K5710K7739K8809K8843K8150K6429K3192J8869
63599G99837J4548J0653O641K167k112n176o659p062p214p700q551r431j0235
63586G69706j1391j3387j6050j8600k0372k1186k1139k0353j9006j7313j5409
$$ plain form
63687 348029 349885 351012 351367 351301 351326 351476 351303 350692 350195 350217 350236 349436 347946 346817 346661 346939 346817 346243 345818
63668 345818 346004 346878 348375 350271 352067 353263 353693 353346 352082 349905 347268 344576 341526 337516 332717
63653 332717 328108 324307 320986 317641 314358 311491 309099 307198 306123 306092 306658 307102 307202 307210 307293 307561 308458
63636 308458 310504 313573 316947 320178 323482 327261 331653 336649 342204 348106 354112 360325 367092 374488
63622 374488 382322 390698 399990 410118 420487 430984 442474 455843 471047 487600 505513 525095
63610 525095 546195 568445 592096 617806 645545 674354 703197 731347 757776 780968 799837
63599 799837 814385 825038 831679 833846 831734 826558 819899 812837 805623 797923 789372 779941 769706
63586 769706 758315 744928 728878 710278 689906 668720 647581 627228 608222 590909 575500
63575E75500j3425j1612j0101q669p018n253l704k290n59J513L178L678L130K356
63561E26724K070K459L406M725O148P378Q393R642J1679J4479J7258J9198K0423
63548F53982K1967K4639K8127L1406L3820L5414L6171L5360L1819K5016J5847
63537I73568O410j246o358r437j1125j1439j0430r004q405q909r779j0644j2274
63524H70928j5490j9783k3637k6187k7907k9540l0791l0663k8918k6577k4680
63513E86755k3006k0679j7792j5586j4814j4690j3977j2542j1070r787q298o654
63501D17860n573n395n561n398m859m155l249k194j523j702k403k758k327j470
63487C69293p70l81MP30J776K705K999K518J665J119J369K366L468L882L324K231
$$ plain form
63575 575500 562075 550463 540362 531693 524675 519422 515718 513428 512869 514382 517560 521238 524368 526724
63561 526724 528794 531253 534659 539384 545532 552910 561303 570945 582624 597103 614361 633559 653982
63548 653982 675949 700588 728715 760121 793941 829355 865526 900886 932705 957721 973568
63537 973568 979978 978732 972374 962937 951812 940373 929943 920939 912534 903625 893846 883202 870928
63524 870928 855438 835655 812018 785831 757924 728384 697593 666930 638012 611435 586755
63513 586755 563749 543070 525278 509692 494878 480188 466211 453669 442599 432812 424514 417860
63501 417860 412287 406892 401331 395933 391074 386919 383670 381476 379953 378251 375848 373090 370763 369293
63487 369293 368523 368142 368146 368876 370652 373357 376356 378874 380539 381658 383027 385393 388861 392743 396067 398298
63471C98298J224M58k63r95j623k169k756l252l363l055k537j933j359j133j362
63456C74180j415n73P91J466J093P17J320K554L519M074M659N371O052O855P918
63441D18581Q781Q991R111J0194J2320J4505J6162J7802K0030K2549K4596K5701
63429F09323K5613K3997K0812J6755J2874R872Q046P679Q930J1416J4332J7161
63417G86810K0026K3269K6826L0140L2507L3387L2446K9521K4727J8547J1743
63406A069949N085q30n516q599r985j0066r681r730j0730j2650j5145j7962k1041
63393I43099k4271k7305k9773l1521l2432l2203l0658k8200k5571k3194k1069
63382F36902j9275j7983j6833j4959j1993q619n724l457j481K44J563K674M025
$$ plain form
63471 398298 399522 399980 399717 398722 397099 394930 392174 388922 385559 382504 379967 378034 376675 375542 374180
63456 374180 372765 372192 372983 374449 375542 376259 377579 380133 383652 387726 392385 397756 403808 410663 418581
63441 418581 427362 436353 445464 455658 467978 482483 498645 516447 536477 559026 583622 609323
63429 609323 634936 658933 679745 696500 709374 719246 727292 734971 743901 755317 769649 786810
63417 786810 806836 830105 856931 887071 919578 952965 985411 1014932 1039659 1058206 1069949
63406 1069949 1075034 1074204 1068688 1060089 1050104 1040038 1030357 1020627 1009897 997247 982102 964140 943099
63393 943099 918828 891523 861750 830229 797797 765594 734936 706736 681165 657971 636902
63382 636902 617627 599644 582811 567852 555859 547240 541516 538059 536578 536822 538385 541059 545084
63369E45084N722P569R477J1371J2889J3784J4496J5724J7487J9255K0974K3175
63357G17007K5968K8665L0673L2071L2995L3092L2103L0341K7986K4365J8710
63346A033976J1471M183j885o435r516j1003j0964j0146r599r968j1337j3592
63334I55185j6626k0151k3594k6323k8029k8825k8972k8553k7384k5282k2412
63323F79034j9366j6730j4467j1895q495m820k272j914l726p056j1238j5342j7975
63310E43738j8221j6819j5535j5144j4706j3159j0883r032p895o766n286m007
63298D06285l487l450l272k881k715k892k932k410j711j735k817m165m689m238
63284C62891l602l307k982k231j522j572k140k187j235N8Q38R82Q69P45O36N82
$$ plain form
63369 545084 550806 558375 567852 579223 592112 605896 620392 636116 653603 672858 693832 717007
63357 717007 742975 771640 802313 834384 867379 900471 932574 962915 990901 1015266 1033976
63346 1033976 1045447 1049630 1047745 1041310 1031794 1020791 1009827 999681 990082 980114 968777 955185
63334 955185 938559 918408 894814 868491 840462 811637 782665 754112 726728 701446 679034
63323 679034 659668 642938 628471 616576 608081 603261 600989 599075 595349 588293 577055 561713 543738
63310 543738 525517 508698 493163 478019 463313 450154 439271 430239 422344 415578 410292 406285
63298 406285 402798 399348 396076 393195 390480 387588 384656 382246 380535 378800 375983 371818 367129 362891
63284 362891 359289 355982 353000 350769 349247 347675 345535 343348 342113 342171 343009 343991 344860 345605 346241 346823
63268C46823N85N36L92K45J23L7L12J345K786L542L163K631L110M265M781M321
63252C78997L934M383N091N210M896M863N336O106P218Q783J0377J1409J1965
63239D68568J2681J3747J4757J5506J6379J7749J9497K1354K3163K4664K5443
63228F73508K5425K5061K4781K4521K4089K3670K3619K3934K4214K4098K3576
63217I40496K2993K2818K3214K3677K3342K1805J9411J6603J3301R224M512l26
63205A141070n029r744j4573j9177k2927k5406k6767k7635k8408k8725k7808k5411
63193H79460k2079j8387j4461j0472p025m491k333K78L367O291Q793J1239J3828
63180H44008J6200J7952J9037J9554J9620J9544J9638J9718J9289J8357J7531
$$ plain form
63268 346823 347408 347944 348336 348581 348704 348741 349053 350398 353184 356726 359889 362520 365630 369895 374676 378997
63252 378997 382931 387314 392405 397615 402511 407374 412710 418816 426034 434817 445194 456603 468568
63239 468568 481249 494996 509753 525259 541638 559387 578884 600238 623401 648065 673508
63228 673508 698933 723994 748775 773296 797385 821055 844674 868608 892822 916920 940496
63217 940496 963489 986307 1009521 1033198 1056540 1078345 1097756 1114359 1127660 1136884 1141396 1141070
63205 1141070 1136041 1126297 1111724 1092547 1069620 1044214 1017447 989812 961404 932679 904871 879460
63193 879460 857381 838994 824533 814061 807036 802545 800212 800490 803857 810148 818941 830180 844008
63180 844008 860208 878160 897197 916751 936371 955915 975553 995271 1014560 1032917 1050448
63169A050448J7091J6497J5127J3071J0759Q238N235J696k169o243j0538j4981
63157A104231j9417k3678k7473l0402l2285l3257l3385l2572l1037k9432k8052
63146G83241k6331k3733k0776j8481j7033j5743j4258j2920j1776j0141p692n314
63134E99043m221m459m788m022k153k28O47L71n3M54J812K945L237L284L916N026
63118F00811N882O210O248N969N057L706K736K621K875K685J849Q63L49N94J339
63103F49794J845J473L82n84q77p73q13j082j370j661j955j865r37N33J488J197
63087F44795R1o64l54O20J329J372J206J415J962K467K959L802M891N629N841
63072F77361O131O973Q067R046J0196J1806J3311J3962J4050J4591J5901J7427
$$ plain form
63169 1050448 1067539 1084036 1099163 1112234 1122993 1131231 1136466 1138162 1135993 1129750 1119212 1104231
63157 1104231 1084814 1061136 1033663 1003261 970976 937719 904334 871762 840725 811293 783241
63146 783241 756910 733177 712401 693920 676887 661144 646886 633966 622190 612049 604357 599043
63134 599043 594822 590363 585575 581553 579400 579172 579819 580190 580137 580591 582403 585348 588585 591869 595785 600811
63118 600811 606693 612903 619151 625120 630177 633883 636619 639240 642115 644800 646649 647512 647861 648455 649794
63103 649794 651639 653112 653494 652910 652033 651260 650447 649365 647995 646334 644379 642514 641577 642110 643598 644795
63087 644795 644886 644222 643868 644488 645817 647189 648395 649810 651772 654239 657198 661000 665891 671520 677361
63072 677361 683492 690465 698532 707578 717774 729580 742891 756853 770903 785494 801395 818822
63060H18822J8940K0949K3693K6648K9410L2291L5598L8970M2010M4948M8107
63049A180386N1165N3601N5539N7460N9326O0565O0946O0905O0942O1055O0798
63038A822688N9751N7858N5536N3386N1730N0523M9605M8731M7281M4407L9734
63027B381230L3524K5963J6765N843o118j8261l0276m1892n2062n9534o4205o7150
63015B123827o9180o9953o8678o5189o0035n3918m7341m0562l3638k6549j9403
63004A569381j2439n862K58N931J1222J6145K0498K3975K6553K8603L0379L1669
62992A746313L2270L2527L2934L3358L3138L1985L0283K8423K6236K3286J9394
62981B070147J4692R263K981m354j2715k1677l0616l9077m6816n3443n8323o1110
$$ plain form
63060 818822 837762 858711 882404 909052 938462 970753 1006351 1045321 1087331 1132279 1180386
63049 1180386 1231551 1285152 1340691 1398151 1457477 1518042 1578988 1639893 1700835 1761890 1822688
63038 1822688 1882439 1940297 1995833 2049219 2100949 2151472 2201077 2249808 2297089 2341496 2381230
63027 2381230 2414754 2440717 2457482 2463325 2457207 2438946 2408670 2366778 2314716 2255182 2190977 2123827
63015 2123827 2054647 1984694 1916016 1850827 1790792 1736874 1689533 1648971 1615333 1588784 1569381
63004 1569381 1556942 1551080 1551338 1557269 1568491 1584636 1605134 1629109 1655662 1684265 1714644 1746313
62992 1746313 1778583 1811110 1844044 1877402 1910540 1942525 1972808 2001231 2027467 2050753 2070147
62981 2070147 2084839 2094102 2097083 2092729 2080014 2058337 2027721 1988644 1941828 1888385 1830062 1768952
62969A768952o2209o2430o2276o1692o0293n7692n3857m9410m5341m2115l9383
62958A172254l6743l4429l2848l1805l0752k9525k8294k7046k5652k4239k2955
62947H47966k1623k0164j9071j8738j8522j7395j5393j3624j2729j2196j1330
62936F67181j0132q984q111p625p507p355o685n610m630l772k632j369p98j163
62922E90808j680j692j528j771k324k798l163l509l623l393l167l259l468l502
62908E51931l453l478l475l445l626l897l676k846k160k074j907r02M17Q78K66
62893E18553n90j101j401j661j787j760j704j529j096o03l25r3M50J155J514J363
62877E09385Q97J88o98j318j310j053j138j327r14n0K69k94r23j002r67j290j469
$$ plain form
62969 1768952 1706743 1644313 1582037 1520345 1460052 1402360 1348503 1299093 1253752 1211637 1172254
62958 1172254 1135511 1101082 1068234 1036429 1005677 976152 947858 920812 895160 870921 847966
62947 847966 826343 806179 787108 768370 749848 732453 717060 703436 690707 678511 667181
62936 667181 657049 648065 639954 632329 624822 617467 610782 605172 600542 596770 594138 592769 591971 590808
62922 590808 589128 587436 585908 584137 581813 579015 575852 572343 568720 565327 562160 558901 555433 551931
62908 551931 548478 545000 541525 538080 534454 530557 526881 524035 521875 519801 517894 516992 517409 518287 518553
62893 518553 517963 516862 515461 513800 512013 510253 508549 507020 505924 505321 504996 504903 505353 506508 508022 509385
62877 509385 510282 510470 509772 508454 507144 506091 504953 503626 502712 502662 502931 502637 501714 500712 499745 498455 496986
62860D96986q34J81N63K37J99J047K101K322J633R49J005J555J806J407P44L13
62844E12214J14k46r76j879k576k794k475j833j226r12r01j077j242j115n54P4
62828D92596K37K6J44P72J102N63nP15K651M325M709M213L706L416L186L197L749
62811E29302M672N363N372M802M262M414N328O284O539O222O100O511P158P905
62797F10234R052J0557J1696J2010J2084J2922J4856J7501K0381K3226K5956K8873
62785H09348L2563L7184M2052M6411N0381N4739N9899O5635P1583P7484Q2976
62774A430255Q7591R1053R3191R3651R2108Q8642Q3384P5846O5368N2376L8495
62763B291960K4928J1248l593j9381l4420m7194n7591o6425p4196q0662q5271
$$ plain form
62860 496986 496152 496333 496896 497133 497332 498379 500480 502802 504435 505384 506389 507944 509750 511157 511901 512214
62844 512214 512328 512082 511106 509227 506651 503857 501382 499549 498323 497411 496510 495433 494191 493076 492522 492596
62828 492596 492833 492859 493003 493775 494877 495440 495435 496150 498801 503126 507835 512048 515754 519170 522356 525553 529302
62811 529302 533974 539337 544709 549511 553773 558187 563515 569799 576338 582560 588660 595171 602329 610234
62797 610234 619286 629843 641539 653549 665633 678555 693411 710912 731293 754519 780475 809348
62785 809348 841911 879095 921147 967558 1017939 1072678 1132577 1198212 1269795 1347279 1430255
62774 1430255 1517846 1608899 1702090 1795741 1887849 1976491 2059875 2135721 2201089 2253465 2291960
62763 2291960 2316888 2328136 2324543 2305162 2270742 2223548 2165957 2099532 2025336 1944674 1859403
62752A859403q7647q7737q5839q2559p8592p4405p0110o5668o1169n6907n3128
62741A055642m9690m6070m1830l7138l2670k8982k6075k3642k1562j9914j8607
62730G09462j7222j5325j2885j0368q411p304o685n906m761l706l116k535j104
62717F10134J318L851N558O434P202Q465J0280J2401J4634J6993J9614K2563K5680
62704G65127K8783L2009L5712L9945M4284M8376N2348N6467O0592O4308O7499
62693A295450P0439P3234P5395P6137P5011P2168O7936O2139N4008M3029K9802
62682A994748J5844K390j0377k2872l5150m6567n6209o3562o8805p2561p5151
62671A561728p6229p5340p2708o9160o5259o1109n6902n3075m9641m6043m2032
$$ plain form
62752 1859403 1771756 1684019 1598180 1515621 1437029 1362624 1292514 1226846 1165677 1108770 1055642
62741 1055642 1005952 959882 918052 880914 848244 819262 793187 769545 747983 728069 709462
62730 709462 692240 676915 664030 653662 645251 637947 631262 625356 620595 616889 613773 611238 610134
62717 610134 611452 615303 620861 627295 634497 642962 653242 665643 680277 697270 716884 739447 765127
62704 765127 793910 825919 861631 901576 945860 994236 1046584 1103051 1163643 1227951 1295450
62693 1295450 1365889 1439123 1514518 1590655 1665666 1737834 1805770 1867909 1921917 1964946 1994748
62682 1994748 2010592 2012982 2002605 1979733 1944583 1898016 1841807 1778245 1709440 1636879 1561728
62671 1561728 1485499 1410159 1337451 1268291 1203032 1141923 1085021 1031946 982305 936262 894230
62660H94230l8155l4944l2144k9299k6571k4384k2558k0519j8164j5955j4275
62649F17262j3201j2716j2611j2305j1355j0035q994q426q011p471o642n262l330
62636D96903j548p11p49r36r87j256j845k280k213j819j393j094j176j877k885
62621D74134l455l237k518j616n48O43J794K965M306N515O039N880N658N740N982
62606E07282O380P208Q326R247J0156J1949J4810J7615J9407K0728K2776K5781
62594F81665K9104L2362L5672L8894M1510M3241M4252M4662M4234M2488L9007
62583A117091L3819K7655K1451J5333Q560P52p345j4775k1382k7331l2186l5355
62571A086287l7095l8233l8960l8807l7718l6340l5066l3526l1299k8600k5973
$$ plain form
62660 894230 856075 821131 788987 759688 733117 708733 686175 665656 647492 631537 617262
62649 617262 604061 591345 578734 566429 555074 545039 536045 527619 519608 512137 505495 500233 496903
62636 496903 495355 494644 493895 492959 491972 490716 488871 486591 484378 482559 481166 480072 478896 477019 474134
62621 474134 470679 467442 464924 463308 462760 463403 465197 468162 472468 477983 484022 489902 495560 501300 507282
62606 507282 513662 520870 529196 538443 548599 560548 575358 592973 612380 633108 655884 681665
62594 681665 710769 743131 778803 817697 859207 902448 946700 991362 1035596 1078084 1117091
62583 1117091 1150910 1178565 1200016 1215349 1223909 1224661 1217316 1202541 1181159 1153828 1121642 1086287
62571 1086287 1049192 1010959 971999 933192 895474 859134 824068 790542 759243 730643 704670
62560G04670k3688k1614j9398j6712j3667j1035r652r490r643r321q476p458o492
62547E38024n700n187m827m200l095j897j229j252j481j313o73j05k13r32j489
62532E04431j203j82R37J823K703L850N214O622Q060R557J1017J2406J3998J6175
62518E95408J8917K1702K4030K6022K8284L1223L4616L7933M0888M3432M5429
62507I47884M6667M7134M6910M5819M3527M0040L5702L0679K4913J8664J2555
62496A340494O822J137m363q446r827q619o099l141M83N281J1103J7177K2674
62483A364676K7142L0750L4128L7782M1468M4247M5001M2838L7311K8813J8687
62472A752843Q511r13r792j8754k8358l8799m9491n8839o5161o8115o8908o8897
$$ plain form
62560 704670 680982 659368 639970 623258 609591 598556 588904 579414 569771 560450 551974 544516 538024
62547 538024 532324 527137 522310 518110 515015 513118 511889 510637 509156 507843 507170 507065 506852 505920 504431
62532 504431 503228 503046 503983 505806 508509 512359 517573 524195 532255 541812 552829 565235 579233 595408
62518 595408 614325 636027 660057 686079 714363 745586 780202 818135 859023 902455 947884
62507 947884 994551 1041685 1088595 1134414 1177941 1217981 1253683 1284362 1309275 1327939 1340494
62496 1340494 1347316 1348453 1344090 1335644 1325817 1317198 1311099 1307958 1308441 1313722 1324825 1342002 1364676
62483 1364676 1391818 1422568 1456696 1494478 1535946 1580193 1625194 1668032 1705343 1734156 1752843
62472 1752843 1761354 1760441 1750649 1731895 1703537 1664738 1615247 1556408 1491247 1423132 1354224 1285327
62460A285327o8367o6855o4180o0671n6555n1640m5786l9428l3476k8688k5141
62449G44540k2272j9393j6133j2577r135o362m557l397k139l90J429K641L071
62436F55326L058K880K620K441K470K333J248j137m205o877q549r452j0247j1335
62422F20574j2431j2802j2027j0486q952p836p098o739o901p367p439o676n504
62409E08316m792m889n342n459m902l747k305j050n45r97j867k164j438k78M33
62394D68974O94J266K419L378L373K724K328K457K692K854L226L814M132M039
62380E08370M187N169O601P547P659P472P660Q363R235R846J0013R923J0019J0654
62366F22718J1829J3392J5355J7905K1012K4297K7375L0197L2949L5728L8544
$$ plain form
62460 1285327 1216960 1150105 1085925 1025254 968699 917059 871273 831845 798369 769681 744540
62449 744540 722268 702875 686742 674165 665030 658668 654111 650714 648575 648185 649614 652255 655326
62436 655326 658384 661264 663884 666325 668795 671128 672376 671239 667034 660157 651608 642156 631909 620574
62422 620574 608143 595341 583314 572828 563876 556040 548942 542203 535302 527935 520496 513820 508316
62409 508316 503524 498635 493293 487834 482932 479185 476880 475830 475285 474288 472421 470257 468819 468541 468974
62394 468974 469668 470934 473353 476731 480104 482828 485156 487613 490305 493159 496385 500199 504331 508370
62380 508370 512557 517726 524327 531874 539533 547005 554665 563028 572263 582109 592122 602045 612064 622718
62366 622718 634547 647939 663294 681199 702211 726508 753883 784080 817029 852757 891301
62355H91301M1611M5272M9356N2809N4243N2999M9550M4842L9411L3145K5792
62344A380331J7613R537K525l310q763j4493k0070k4560k7805l0495l2901l4289
62332A213320l4053l2760l1406l0102k8204k5597k3082k1485k0872k0761k0662
62321I24336k0328j9889j9800k0338k1147k1611k1616k1488k1232k0396j8899
62310F97592j7372j6367j5658j4691j3414j2173j1048r742q112o396m818l305
62298E64496j771m37L72P29J146K060L355M601N615O607P745Q842R591R936J0037
62283F32924J0028R980R954R856R379Q356P112O252O047O170O024N317M321L680
62269G35400L859M713N666O346O934P904R605J2112J5203J8452K1586K4875K8819
$$ plain form
62355 891301 932912 978184 1027540 1080349 1134592 1187591 1237141 1281983 1321394 1354539 1380331
62344 1380331 1397944 1407481 1410006 1406696 1397933 1383440 1363370 1338810 1311005 1280510 1247609 1213320
62332 1213320 1179267 1146507 1115101 1084999 1056795 1031198 1008116 986631 965759 944998 924336
62321 924336 904008 884119 864319 843981 822834 801223 779607 758119 736887 716491 697592
62310 697592 680220 663853 648195 633504 620090 607917 596869 587127 579015 572619 567801 564496
62298 564496 562725 562288 562660 563389 564535 566595 569950 574551 580166 586773 594518 603360 612951 622887 632924
62283 632924 642952 652932 662886 672742 682121 690477 697589 703841 709888 716058 722082 727399 731720 735400
62269 735400 739259 743972 749638 755984 762918 770822 780427 792539 807742 826194 847780 872655 901474
62256I01474L3385L7982M2283M6552N0772N4047N5253N3977N0407M4839L7848
62245A408819L0374K2974J5354P265n85p430j3759k0701k8198l4981m0287m4524
62233A294321m7985n0111n0486m9540m7699m4727m0642l6505l3450l1348k9200
62222H32628k6485k3474k0509j7726j5338j3500j1977j0432r012q146p788p376
62210F60865o633n881n461n160m486l313j998r30j61M84J054J438J710K206L143
62195F36877M300N355O298P173P636P326O600O283O618P104P442Q051R240J0545
62181G36848J1289J1406J1185J0611R511Q127O940O142N660N650O474Q225J0629
62168H48697J3423J6503J9728K2934K6158K9629L3381L7039L9887M1167M0407
$$ plain form
62256 901474 934859 972841 1015124 1061676 1112448 1166495 1221748 1275725 1326132 1370971 1408819
62245 1408819 1439193 1462167 1477521 1484786 1484201 1476771 1463012 1442311 1414113 1379132 1338845 1294321
62233 1294321 1246336 1196225 1145739 1096199 1048500 1003773 963131 926626 893176 861828 832628
62222 832628 806143 782669 762160 744434 729096 715596 703619 693187 684175 676029 668241 660865
62210 660865 654232 648351 642890 637730 633244 629931 627933 627003 626842 627326 628380 629818 631528 633734 636877
62195 636877 641177 646532 652830 660003 667639 674965 681565 687848 694466 701570 709012 717063 726303 736848
62181 736848 748137 759543 770728 781339 790850 798977 805917 812059 817719 823369 829843 838068 848697
62168 848697 862120 878623 898351 921285 947443 977072 1010453 1047492 1087379 1128546 1168953
62157A168953L7692L3534K8375K2334J5535Q517K042l451q053j2113j5919j9540
62145A257906k2809k5475k7467k8947l0027l0499k9962k8192k5393k2172j9179
62134I67784j6583j3963j1045q413p082p252p989q255p893p307o688o003n414
62121H53897n127m919m256k916j200M49J804K801L387L509L141K273R11q86k934
62106H49934m774n770n608m745m023l757l554l140k916l413m523n586o061n754
62092G86310m677l038j301R2J089J931K793L686M577N408O077O584P142Q025R377
62077H34075J1200J3358J5466J7056J7966J8442J8772J9110J9649K0515K1330
62066A026939K1386K0614J9959K0297K1369K2341K3032K3803K4314K3348K0228
$$ plain form
62157 1168953 1206645 1240179 1268554 1290888 1306423 1314940 1316982 1313531 1305478 1293365 1277446 1257906
62145 1257906 1235097 1209622 1182155 1153208 1123181 1092682 1062720 1034528 1009135 986963 967784
62134 967784 951201 937238 926193 917780 910698 903446 895457 887202 879309 872002 865314 859311 853897
62121 853897 848770 843851 839595 836679 835479 835928 837732 840533 843920 847429 850570 852843 853754 852868 849934
62106 849934 845160 839390 833782 829037 825014 821257 817703 814563 811647 808234 803711 798125 792064 786310
62092 786310 781633 778595 777294 777386 778475 780406 783199 786885 791462 796870 802947 809531 816673 824698 834075
62077 834075 845275 858633 874099 891155 909121 927563 946335 965445 985094 1005609 1026939
62066 1026939 1048325 1068939 1088898 1109195 1130564 1152905 1175937 1199740 1224054 1247402 1267630
62055A267630J5735J1171O886K345k640p415j1372j4741j8156k1771k5281k8605
62043A173786l1970l5219l7652l8840l9172l9159l8649l7196l4894l2305k9740
62032G78990k7251k5048k3299k1598j9424j7050j5250j4117j2970j1549j0310
62021E81124r352q060o289m989m926n520n710n385n172n236n119m545l674k724
62007E04423j820j113o17n5P84J715K440K873L026K966L048L633M330M236L195
61992E33064K101J483P84l85j348j637k183l921n997o832o478o337o766o708n777
61977D83063n135n657o549o578n690m719m144l870l752l716l615l352l015k688
61963D20583k405k247k199j964j322n72j62J1L75R08J256J446J773K049J877J615
$$ plain form
62055 1267630 1283365 1294536 1301422 1303767 1301127 1293712 1282340 1267599 1249443 1227672 1202391 1173786
62043 1173786 1141816 1106597 1068945 1030105 990933 951774 913125 875929 841035 808730 778990
62032 778990 751739 726691 703392 681794 662370 645320 630070 615953 602983 591434 581124
62021 581124 571772 563712 557423 552434 547508 541988 536278 530893 525721 520485 515366 510821 507147 504423
62007 504423 502603 501490 500873 500818 501602 503317 505757 508630 511656 514622 517670 521303 525633 529869 533064
61992 533064 535165 536648 537432 537047 535699 534062 531879 527958 521961 515129 508651 502314 495548 488840 483063
61977 483063 477928 472271 465722 459144 453454 448735 444591 440721 436969 433253 429638 426286 423271 420583
61963 420583 418178 415931 413732 411768 410446 409874 409712 409723 410098 411006 412262 413708 415481 417530 419407 421022
61947D21022K087L229M076M379N215P367J0021J1770J2307J2398J2689J3205J3746
61934E33511J4158J4338J4293J4040J3276J1648R510P969P654P874P429N964M063
61921F65727K291O17j152k804l781l824l405l283l483l102j523N89K164L284M923
61906F53238P212Q979R349Q824Q321P896P031N512L425Q17k008m258n345n597
61892G03396n822o370p032p541p753p551o979o385o094o106o226o336o400o515
61878F10286o974p972r127r765r707r243q411o940n082l638k839k022q51O1K83
61863E28059N39J642L139L983M152M658O135Q227J0285J1922J3024J3824J4914
61850F24503J6629J8476J9659K0041K0080J9997J9589J8745J7565J5999J3892
$$ plain form
61947 421022 423109 426338 430414 434793 440008 447375 457396 469166 481473 493871 506560 519765 533511
61934 533511 547669 562007 576300 590340 603616 615264 624774 632743 640397 648271 655700 661664 665727
61921 665727 668018 668635 667483 664679 660898 657074 653669 650386 646903 643801 642278 642867 645031 648315 653238
61906 653238 660450 669429 678778 687602 695923 703819 710850 716362 719787 720604 718596 714338 708993 703396
61892 703396 697574 691204 684172 676631 668878 661327 654348 647963 641869 635763 629537 623201 616801 610286
61878 610286 603312 595340 586213 576448 566741 557498 549087 542147 537065 533427 530588 528566 527715 527776 528059
61863 528059 528598 530240 533379 537362 541514 546172 552307 560534 570819 582741 595765 609589 624503
61850 624503 641132 659608 679267 699308 719388 739385 758974 777719 795284 811283 825175
61839H25175J1296Q367N100J608j520l686m966n818o290o061n153l907k345j85
61825H11615K426M821O576P905R030R635R133P213M034J56l654o846r424j1678
61811H40942j3631j5025j5812j6326j6849j7229j7032j6026j4520j3213j2560
61800F72719j2221j1461j0175r079q661q453p815o921o381o223n943n412n004
61787E68970m845m622m179l821l780l907l911l637l068k379j960j984k053j678
61773E23146j027p28r91j417j676j802j752j207p8J193K031K266K198K295K818
61758E25269L544L923L772L557L667L722L074J821P07J32j65m77q30j306k101
61743E48309l158m146m850n140m781l844l120l296l809l432k080r86q63q91j33
$$ plain form
61839 825175 836471 844838 849938 851546 850026 846340 841374 835556 829266 823205 818052 814145 811800 811615
61825 811615 814041 818862 825438 833343 842373 852008 861141 868354 872388 872544 868890 862044 852620 840942
61811 840942 827311 812286 796474 780148 763299 746070 729038 713012 698492 685279 672719
61800 672719 660498 649037 638862 629783 621122 612669 604854 597933 591552 585329 579386 573974 568970
61787 568970 564125 559503 555324 551503 547723 543816 539905 536268 533200 530821 528861 526877 524824 523146
61773 523146 522119 521391 520400 518983 517307 515505 513753 512546 512468 513661 515692 517958 520156 522451 525269
61758 525269 528813 532736 536508 540065 543732 547454 550528 552349 553056 553188 553023 552546 551716 550410 548309
61743 548309 545151 541005 536155 531015 526234 522390 519270 515974 512165 508733 506653 505667 504804 503913 503780
61728E03780J044J669J618J505J578J527J218R17R16J345K149K904K934K087J097
61713E28288P48R84J213J134O77l84k029l421l619k875k426k889l592l741l600
61698E04468l968m966n871o043n541m844m252l716l101k519k332k819l822m774
61684D45900n094m617l708k963k717k752k591k076j566j436j622j702j416r25
61670D10715n77n36o41n87k59J40L41L80N28Q92J277J481J524J507J461J425J491
61653D20562J649J771J826J894J903J681J349J309J615J795J607J536K025K593
61639D45115K393J428M85p9o64j410j691j053%O79Q72Q99O83j05j334k483l331
61622D40404l996m320l972l136k490k259j960j281o20l58k73j52m48j599l119
$$ plain form
61728 503780 504824 506493 508111 509616 511194 512721 513939 514856 515772 517117 519266 522170 525104 527191 528288
61713 528288 529036 530020 531233 532367 533044 532660 530631 527210 523591 520716 518290 515401 511809 508068 504468
61698 504468 500500 495534 489663 483620 478079 473235 468983 465267 462166 459647 457315 454496 450674 445900
61684 445900 440806 436189 432481 429518 426801 424049 421458 419382 417816 416380 414758 413056 411640 410715
61670 410715 410138 409602 408961 408374 408115 408255 408596 408976 409504 410396 411673 413154 414678 416185 417646 419071 420562
61653 420562 422211 423982 425808 427702 429605 431286 432635 433944 435559 437354 438961 440497 442522 445115
61639 445115 447508 448936 449421 449342 448678 447268 445577 444524 444524 445203 446075 446974 447657 447552 446218 443735 440404
61622 440404 436408 432088 428116 424980 422490 420231 418271 416990 416370 416012 415739 415587 415139 413540 410421
61607D10421m088m343m434m567m413l930l568l484l311k949k877l308l704l579
61593C57866l238l232l513l631l374k772j834q06l02o09j166j267r70p91p80o38
61577C28943m86p33j303j652j575j241n65O59J937K282J574Q91J043J502J392
61562C32668R12R56J621J972J359K91k64n7L22L72L05O29J368K010K211K131J966
61545C50772J570Q77L26L21N34L53j08j25M83J041J086J012J370K056K581K740
61529C66889K581K052J122N5q29j438j809j922j900k081k595l024k806j894q26
61514C51575k43m19j036j343p83L60J215J259P16Pp35j365j540j155n89j61K54
61497C46017P16Q73O23O31J479K581K748J745N37J0P1K00K32L37N82R49J478K139
$$ plain form
61607 410421 406333 401990 397556 392989 388576 384646 381078 377594 374283 371334 368457 365149 361445 357866
61593 357866 354628 351396 347883 344252 340878 338106 336272 335466 335164 334555 333389 332122 331152 330361 329581 328943
61577 328943 328457 327724 326421 324769 323194 321953 321388 322047 323984 326266 327840 328731 329774 331276 332668
61562 332668 333580 334536 336157 338129 339488 339779 339515 339458 339780 340152 340457 341086 342454 344464 346675 348806 350772
61545 350772 352342 353219 353545 353866 354400 354753 354645 354520 355003 356044 357130 358142 359512 361568 364149 366889
61529 366889 369470 371522 372644 372699 371870 370432 368623 366701 364801 362720 360125 357101 354295 352401 351575
61514 351575 351332 350913 349877 348534 347751 348111 349326 350585 351301 351308 350573 349208 347668 346513 345924 345763 346017
61497 346017 346733 347606 348229 348860 350339 352920 355668 357413 357950 357960 358031 358231 358463 358800 359382 360331 361809 363948
61479C63948K697K879K655K249J989K050K277K258J756R53J63n52j230j556j030
61464C81506L11J650K009J175j33r15p94l07k87r57j698j756r46L76J689K524
61448C83447K546J812Q39K00J13M58R36J114O41k26o94l38K98L90j10n58n19p4
61430C90275N98J333J751J474O86J9j38J48P67J617K257K158J508J194J660K315
61414D09622K320J601P04L3l49m72m19m27o75j044j284j299j180j017q69p22m55
61397D04068m1K21ln12o70k73J83L00L60P03R97P55K88M25J330K182K180J419
61379D13912O70O47J566K968L940L907L359L366M183M774M132K608J465J323J611
61364D54431J540J070P25Q51J352J962K462K750K908L171L692M368N041N739O521
$$ plain form
61479 363948 366645 369524 372179 374428 376417 378467 380744 383002 384758 385711 385874 385322 384092 382536 381506
61464 381506 381817 383467 385476 386651 386518 385603 384809 384502 384215 383258 381560 379804 378858 379234 380923 383447
61448 383447 385993 387805 388644 388844 388957 389415 390351 391465 392106 391880 391186 390848 391146 391536 391426 390868 390349 390275
61430 390275 390873 392206 393957 395431 396117 396136 395998 396146 396913 398530 400787 402945 404453 405647 407307 409622
61414 409622 411942 413543 414247 414280 413931 413459 413040 412613 411938 410894 409610 408311 407131 406114 405245 404523 404068
61397 404068 404027 404248 404245 403733 403063 402790 402973 403273 403633 404336 405333 406088 406376 406801 408131 410313 412493 413912
61379 413912 414582 415229 416795 419763 423703 427610 430969 434335 438518 443292 447424 450032 451497 452820 454431
61364 454431 455971 457041 457766 458617 459969 461931 464393 467143 470051 473222 476914 481282 486323 492062 498583
61349D98583P146P222O713O060N582N060M145L018K256K007J708Q49l01r48p74
61334E48326k66q4l48p98j380k264l295l889l720l212k974k911k423j390m70j44
61318E18758rO95K091L662N029O246P428Q469R220R666R923J0271J1108J2502
61304F15059J3930J4763J4991J4941J4410J2725R872O818M322K052n70l177m886
61291G15250n607o079o693p144p362p924r114j0216j0316r433q325p451o632n625
61277F07329m532l553k734j947r98J91J319J799J438Q80R74J778K626L110L486
61262F11166M019M532M859N256N966O727P104P034O672N966M768L224J617N1j346
61247F77615k145k092j731j948k902l843m032l377k230j164q43j497k400k566
$$ plain form
61349 498583 505729 512951 519664 525724 531306 536366 540511 543529 545785 547792 549500 550349 550048 549100 548326
61334 548326 548060 547976 547628 546830 545450 543186 539891 536002 532282 529070 526096 523185 520762 519372 518902 518758
61318 518758 518749 519444 521535 525197 530226 536472 543900 552369 561589 571255 581178 591449 602557 615059
61304 615059 628989 643752 658743 673684 688094 700819 710691 717509 721831 723883 723313 720136 715250
61291 715250 709643 703564 696871 689727 682365 674441 665327 655111 644795 635362 627037 619586 612954 607329
61277 607329 602797 599244 596510 594563 593565 593756 595075 596874 598312 599192 600166 601944 604570 607680 611166
61262 611166 615185 619717 624576 629832 635798 642525 649629 656663 663335 669301 674069 677293 678910 678961 677615
61247 677615 675470 673378 671647 669699 666797 662954 658922 655545 653315 652151 651308 649811 647411 644845
61233F44845k011j638j631j026P16K652L709M258N281O627P271P102P110P768
61219F91033Q390Q418Q269Q488Q833Q811Q474Q102P609O810N881N053M217L343
61205G91731K870L131L667L739L416L531M657O544Q596J0450J2021J3435J4936
61192H82724J6514J7534J7073J4826J1480Q163N661M085K966J655r4j838l015
61179I77734l726m627n961p215p962q602r780j1290j2191j2031j1474j1473j2176
61166H59226j2974j3370j3443j3490j3642j3943j4413j4815j4563j3247j1168
61155G10158r098p529o379n364m280k989j455OQ82J049Q24K67j108l410n550o095
61139F59929m974l677l497m092m119k953j225J31Q90J534K641M489O869R139J0558
$$ plain form
61233 644845 642834 641196 639565 638539 639255 641907 645616 649874 655155 661782 669053 676155 683265 691033
61219 691033 699423 707841 716110 724598 733431 742242 750716 758818 766427 773237 779118 784171 788388 791731
61205 791731 794601 797732 801399 805138 808554 812085 816742 823286 831882 842332 854353 867788 882724
61192 882724 899238 916772 933845 948671 960151 968314 973975 978060 981026 982681 982587 980749 977734
61179 977734 974008 969381 963420 956205 948243 939641 929861 918571 906380 894349 882875 871402 859226
61166 859226 846252 832882 819439 805949 792307 778364 763951 749136 734573 721326 710158
61155 710158 701060 693531 687152 681788 677508 674519 673064 673070 673952 675001 675825 676092 674984 671574 666024 659929
61139 659929 654955 651278 647781 643689 639570 636617 635392 635523 636413 637947 640588 645077 651946 661085 671643
61124F71643J1031J1432J2861J5389J7863J9202J9694K0598K2547K4857K6412
61113H73529K6801K6393K5780K5505K5815K6216K5528K3114J9920J7621J6735
61102A132957J6136J4530J1705Q115L970o10n079q752j1580j3998j6208j8039
61090A113147j9474k0769k1861k2224k1552k0280j9081j8096j7014j5772j4725
61079I02299j4048j3287j1833r688p488n720m249k637p46J217L024M556N772O801
61065H53973P931R212J0279J0910J1571J2873J4614J5990J6785J7561J8624J9608
61053A019931K0497K2047K4530K6913K8239K9174L0999L3427L4897L5046L5408
61042A341108L7158L9371M0400M0081L9540L9371L9036L7971L6362L4740L3400
$$ plain form
61124 671643 682674 694106 706967 722356 740219 759421 779115 799713 822260 847117 873529
61113 873529 900330 926723 952503 978008 1003823 1030039 1055567 1078681 1098601 1116222 1132957
61102 1132957 1149093 1163623 1175328 1183443 1187413 1186803 1181724 1172972 1161392 1147394 1131186 1113147
61090 1113147 1093673 1072904 1051043 1028819 1007267 986987 967906 949810 932796 917024 902299
61079 902299 888251 874964 863131 853443 845955 840235 835986 833349 832603 833820 836844 841400 847172 853973
61065 853973 861904 871116 881395 892305 903876 916749 931363 947353 964138 981699 1000323 1019931
61053 1019931 1040428 1062475 1087005 1113918 1142157 1171331 1202330 1235757 1270654 1305700 1341108
61042 1341108 1378266 1417637 1458037 1498118 1537658 1577029 1616065 1654036 1690398 1725138 1758538
61031A758538L2454L1906L1491L0741K9512K8277K7707K8007K8727K9175K8930
61020B085465K8118K7341K7479K9346L3341L9349M7155N6948O9095Q3436R9232
61009B626305J16118J34789J56541J82755K15257K56265L07019L67048M36154
61000D798251N16739O12820P27258Q62041J020725J206487J414382J625703J809192
60991A4593598J923370J916972J740213J378253Q87410L91655K4256j43750j29096
60982B2582881m873J42813K30459J78214o7317m91257r96734j449307j748485
60973A8376394j867359j838129j713074j538199j347169j162187r94458q46915
60965G068904p19383o11266n20822m45142l82030l30643k89784k56996k29850
$$ plain form
61031 1758538 1790992 1822898 1854389 1885130 1914642 1942919 1970626 1998633 2027360 2056535 2085465
61020 2085465 2113583 2140924 2168403 2197749 2231090 2270439 2317594 2374542 2443637 2527073 2626305
61009 2626305 2742423 2877212 3033753 3216508 3431765 3688030 3995049 4362097 4798251
61000 4798251 5314990 5927810 6655068 7517109 8537834 9744321 11158703 12784406 14593598
60991 14593598 16516968 18433940 20174153 21552406 22439816 22831471 22855727 22711977 22582881
60982 22582881 22578008 22720821 22951280 23129494 23062177 22570920 21574186 20124879 18376394
60973 18376394 16509035 14670906 12957832 11419633 10072464 8910277 7915819 7068904
60965 7068904 6349521 5738255 5217433 4772291 4390261 4059618 3769834 3512838 3282988
60956C282988k07110j88035j71581j56748j43071j30356j18451j07491r7718q9011
60946A873416q1120p4399o9480o6250o3875o1885o0311n8797n6580n3553n0403
60935A176763m7392m3996m0073l6346l3333l0664k7953k5444k3305k1150j8839
60924H28268j6939j5726j4543j2796j0910r591q784q090p568p398p264o762o077
60911F95820n581n195m677m097l507k688j751j284j353j071L1J002P30m36j385
60896F64558j946k746l787m466m819n491o495p093p012o720o454n958n373n403
60882E90795o284p389q133q541q732q577q130p674p119n987m280k720j929j839
60868E03461k117k444k336j390p0N35J44k16M36J796K947L710M606N766O542O237
$$ plain form
60956 3282988 3075878 2887843 2716262 2559514 2416443 2286087 2167636 2060145 1962427 1873416
60946 1873416 1792296 1717897 1648417 1582167 1518292 1456407 1396096 1337299 1280719 1227166 1176763
60935 1176763 1129371 1085375 1045302 1008956 975623 944959 917006 891562 868257 847107 828268
60924 828268 811329 795603 781060 768264 757354 747763 738979 730889 723321 715923 708659 701897 695820
60911 695820 690239 685044 680367 676270 672763 670075 668324 667040 665687 664616 664647 665649 666379 665943 664558
60896 664558 662612 659866 656079 651613 646794 641303 634808 627715 620703 613983 607529 601571 596198 590795
60882 590795 584511 577122 568989 560448 551716 543139 535009 527335 520216 514229 509949 507229 505300 503461
60868 503461 501344 498900 496564 495174 495104 495639 495783 495567 496003 497799 500746 504456 509062 514828 521370 527607
60852E27607M867L201K225K352L033L330L034K840L310M013M034L031J392m12
60838E67857k214l987n586o724p116o738o031n593n596n632n375n033m933m852
60824D92447m270l211k383k250k371k037j410j444k588m062m837m928n062n322
60810D46272m993l872k839k704l156l436l475l682l979l833l057j962r03k34m39
60795D03708j608k866l067k065p27J93N15K01o23j190n68J072K455K766K548K631
60779D03375K903K688J863R83N16N13Q36J310J739J979K015J850J468J019Q20
60764D25877R83J184R34J02q73j295q56k3M29K97R6J75J87k38q34j227j585k112
60746D21221k328j725p52k64k66k41m27j561l381m646m909m961n230m985l740
$$ plain form
60852 527607 532474 535675 537900 540252 543285 546615 549649 552489 555799 559812 563846 566877 568269 567857
60838 567857 565643 561656 556070 549346 542230 535492 529461 523868 518272 512640 507265 502232 497299 492447
60824 492447 488177 484966 482583 480333 477962 475925 474515 473071 470483 466421 461584 456656 451594 446272
60810 446272 441279 437407 434568 431864 428708 425272 421797 418115 414136 410303 407246 405284 404381 404147 403708
60795 403708 402100 399234 396167 394102 393375 393568 394083 394284 393661 392471 391903 392975 395430 398196 400744 403375
60779 403375 406278 408966 410829 411812 412328 412841 413677 414987 416726 418705 420720 422570 424038 425057 425877
60764 425877 426860 428044 428978 429080 428207 426912 426056 426033 426462 426759 426855 427030 427217 426979 426145 424918 423333 421221
60746 421221 418893 417168 416416 416152 415886 415645 415218 413657 410276 405630 400721 395760 390530 385545 381805
60731C81805k274j484j165p87o29j197k137k598k265j399k96O53Q67K93k69j39
60715C66979M46J053J896L070L698K998J826J848L205M155L388J642O10Q81J628
60700C99323J872J491J053J001J181J114O00j09o85j014j002n07L28R23Q50L59
60684D06778J09M26J014J299R80M10L73J238K389K892K627K231J978J510P64K98
60668D27316L14K10m68j384k200l098l915l735k324j082j417k695l106k148r49
60653C99319k97K09R06J318J147J004J465K115K206J704J188R58Q16M73j72j095
60637D13264k193l190l686l396k474j553j201j300j193o02QK07K64N71Q82P21
60621C95129K73J60M58O11L53Q0J83M93N75K61k69o46n40Q2Q96J523J799J655
$$ plain form
60731 381805 379531 378047 376882 376095 375466 374269 372132 369534 367269 365870 365574 366227 367094 367387 367118 366979
60715 366979 367425 368478 370374 373444 377142 380140 381966 383814 387019 391174 394562 396204 396814 397695 399323
60700 399323 401195 402686 403739 404740 405921 407035 407635 407526 406841 405827 404825 404318 404646 405569 406419 406778
60684 406778 406887 407313 408327 409626 410606 411016 411389 412627 415016 417908 420535 422766 424744 426254 427018 427316
60668 427316 427630 427840 427372 425988 423788 420690 416775 413040 410716 409634 408217 405522 402416 400268 399319
60653 399319 399022 399231 400137 401455 402602 403606 405071 407186 409392 411096 412284 413242 414058 414531 414359 413264
60637 413264 411071 407881 404195 400799 398325 396772 395571 394271 393078 392476 392484 392691 392955 393526 394408 395129
60621 395129 395402 395562 396020 396631 396984 397064 397247 397740 398315 398576 398307 397661 397121 397203 398099 399622 401421 403076
60603D03076J081L74M6J79K01k38o34l66L25P46Q47J187J961K705K990K795K306
60586D19581J820J711K054K376K261J931J730J415O40j56k50K85Q59J560K967
60571D40784M800N877N774N497O097P442Q779R805J0590J1087J1212J0991J0232
60558E48967Q508N856L045P95r22k448l765m612m940m825m201k985j359L21J735
60543E39170K726L424M254N496O848P864Q721J0077J2103J4265J6127J7774J9216
60530F68065J9981J9595J7992J5263J1497P124K854j017m679p929r906j0206r652
60517G18982r368r459r251q441p383o381n354m183k925j625k55J189K793M814
60503F63153P364J0136J2701J5033J7459K0193K3232K6617L0490L4762L8918M2227
$$ plain form
60603 403076 404157 404531 404577 404756 404957 404719 404085 403719 404044 404790 405637 406824 408785 411490 414480 417275 419581
60586 419581 421401 423112 425166 427542 429803 431734 433464 434879 435519 435363 435113 435398 436257 437817 440784
60571 440784 445584 451461 457235 462732 468829 476271 485050 494855 505445 516532 527744 538735 548967
60558 548967 557475 563331 566376 567171 566249 563801 560036 555424 550484 545659 541458 538473 537114 537435 539170
60543 539170 541896 545320 549574 555070 561918 569782 578503 588580 600683 614948 631075 648849 668065
60530 668065 688046 707641 725633 740896 752393 759517 762371 761354 756675 748746 738840 728634 718982
60517 718982 709614 700155 690904 682463 675080 668699 663345 659162 656237 654612 654357 655546 658339 663153
60503 663153 670517 680653 693354 708387 725846 746039 769271 795888 826378 861140 900058 942285
60491I42285M4139M4512M3580M1660L8849L5008L0084K4373J8364J2358O252k52
60479A281212p261j4578k1947k9267l6355m2577m7105m9571n0169m9072m6306
60468H87004m2425l8630l5667l3021k9784k6003k2526j9855j7824j6262j5094
60457E89913j3902j2167j0135q745q452q691q599p880o822n921n509n371m808
60444D82911l510k230j920k473k989l170l466l896l740k689j335k15P60J565J630
60429D55233P37m28j109j305j341j281j185j324j608j476p52n2J61K65O95J155
60413D46385J232J152J236J205Q22O47J301K318K640K073J443J425J932K572L039
60398D71422L037K464J719J392J582J897K055K114K186K343K691L210L561L410
$$ plain form
60491 942285 986424 1030936 1074516 1116176 1155025 1190033 1220117 1244490 1262854 1275212 1281464 1281212
60479 1281212 1273951 1259373 1237426 1208159 1171804 1129227 1082122 1032551 982382 933310 887004
60468 887004 844579 805949 770282 737261 707477 681474 658948 639093 621269 605007 589913
60457 589913 576011 563844 553709 544964 536512 527821 519222 511342 504520 498599 493090 487719 482911
60444 482911 479401 477171 475251 472778 469789 466619 463153 459257 455517 452828 451493 451278 452038 453603 455233
60429 455233 455970 455542 454433 453128 451787 450506 449321 447997 446389 444913 444161 444109 444270 444535 445230 446385
60413 446385 447617 448769 450005 451210 452032 452679 453980 456298 458938 461011 462454 463879 465811 468383 471422
60398 471422 474459 476923 478642 480034 481616 483513 485568 487682 489868 492211 494902 498112 501673 505083
60384E05083K887K446K388K694L116L259K827K083J825K564L863M731M574L555
60370E47895K304J468J305J526J693J805K100K362K080J435J358K274L477M215
60356E77297M665N356O232O959P592Q266Q699Q683Q569Q661Q527P697O466N278
60342F78947L747J264j790m415o315p918r194r549q939q135p649p184o352n254
60328F01264m169l320l102l843n018n417m420k768j704j618j808j369j03J364
60314E63969K350K958L955N742P822R596J1157J2840J4394J5306J5641J5846J5890
60301F97466J5402J4448J3349J1743Q769M342m97m803q576j2143j5331j7673j8897
60288F87599j8774j7042j3926j0533q165p267p224p092o406n378m526m129m057
$$ plain form
60384 505083 507970 510416 512804 515498 518614 521873 524700 526783 528608 531172 535035 539766 544340 547895
60370 547895 550199 551667 552972 554498 556191 557996 560096 562458 564538 565973 567331 569605 573082 577297
60356 577297 581962 587318 593550 600509 608101 616367 625066 633749 642318 650979 659506 667203 673669 678947
60342 678947 682694 683958 682168 677753 671438 663520 654326 644777 635838 627703 620054 612870 606518 601264
60328 601264 597095 593775 590673 586830 581812 576395 571975 569207 567503 565885 564077 562708 562605 563969
60314 563969 566319 569277 573232 578974 586796 596392 607549 620389 634783 650089 665730 681576 697466
60301 697466 712868 727316 740665 752408 761177 765519 765022 760219 751643 739500 724169 706496 687599
60288 687599 668825 651783 637857 627324 619159 611892 604668 597576 591170 585792 581266 577137 573080
60275E73080m086m167m308m443m593m859n071m783l975l341l442l879l871l303
60261E14959k647k117j584j159j028q93l01M52O20J76j08J89O78J003J313J577
60245E11130J344N48r7J1O39J214J506J404O88m32j068o10M21J077J254J602K360
60228E22991K979L000K781L074M052N069N329M737L952L620L753L994M290M895
60214E78516N818O717P442Q230R173R841R737Q916P928P257P026P063P172P270
60200F88106P367P377P088O410N569M853M255L550K607J468K36r20j813k496l269
60185G30388m203m930n279n646o336o887o715o134n924o130o053n429m699m086
60171F51937l297k425k178k748l265k973k323k201k532k390j355j39J91o36j777
$$ plain form
60275 573080 568994 564827 560519 556076 551483 546624 541553 536770 532795 529454 526012 522133 518262 514959
60261 514959 512312 510195 508611 507452 506424 505531 505230 505682 506302 506478 506370 506559 507237 508240 509553 511130
60245 511130 512474 513022 512925 512936 513575 514789 516295 517699 518387 517955 516887 516277 516698 517775 519029 520631 522991
60228 522991 525970 528970 531751 534825 538877 543946 549275 554012 557964 561584 565337 569331 573621 578516
60214 578516 584334 591051 598493 606723 615896 625737 635474 644390 652318 659575 666601 673664 680836 688106
60200 688106 695473 702850 709938 716348 721917 726770 731025 734575 737182 738650 738886 737966 736153 733657 730388
60185 730388 726185 721255 715976 710330 703994 697107 690392 684258 678334 672204 666151 660722 656023 651937
60171 651937 648640 646215 644037 641289 638024 635051 632728 630527 627995 625605 624250 624111 624302 623666 621889
60156F21889k026j013L19P41K22p8O29J757K275K044J751J851K177K465K735L091
60140F40829L473L731L840M029M691N990P448Q205P880P031O550O708O966O627
60126G23998N495L987K716K050J936K089K240K274K331K760L748M847N225M536
60112G70232L264K022R29J2l72p8K53j76j338k667l935n144n837n577m958n053
60096G41577n801n974n011l709k811j939o27N42P25Q5m94o34o27p20q46r57j102
60079G11677j259j389j555j769j967k284l018m177n421o520p475q087q044p597
60065F51115p464p758p696o771n577m955m899m892m722m345l499k151r63n24m40
60050E84459J37J269K219K515K435K457K819L528M358M899M997N041N469O116
$$ plain form
60156 621889 619863 618850 619169 619910 620132 620054 620683 622440 624715 626759 628510 630361 632538 635003 637738 640829
60140 640829 644302 648033 651873 655902 660593 666583 674031 682236 690116 697147 703697 710405 717371 723998
60126 723998 729493 733480 736196 738246 740182 742271 744511 746785 749116 751876 755624 760471 765696 770232
60112 770232 773496 775518 776447 776459 776087 776009 776262 776086 774748 772081 768146 763002 757165 751588 746630 741577
60096 741577 735776 729802 724791 721082 718271 716332 715705 716247 716972 717057 716563 715929 715302 714582 713736 712779 711677
60079 711677 710418 709029 707474 705705 703738 701454 698436 694259 688838 682318 674843 666756 658712 651115
60065 651115 643651 635893 628197 621426 615849 610894 605995 601103 596381 592036 588537 586386 585423 584899 584459
60050 584459 584596 585865 588084 590599 593034 595491 598310 601838 606196 611095 616092 621133 626602 632718
60036F32718O422O053N024L506J886P32K13j71q92j744k366k987m059n405o492
60021F32438p298q203r112r430r037q539q426q469q169p399o440n703n407n280
60007E25526m678l330j910j370j761k207k078j603j195p80r7P04J175J109P91
59992E08296P38J295K363L451M122M371M463M516M428M186L917L652L223K453
59978E55474J286k22j883l336m259m613m584m333l899l319k612j807j016l77J49
59963E20649P44J393J840K059K414L088L657L648L273L101L140K781J726N00j34
59948E53879l4K03j27j136k172k444j910j381j526k066k277k086k046k303k212
59933E30362j276L6Q79J129J406K113K947L519L979M659N339N395M700L884L433
$$ plain form
60036 632718 639140 645193 650217 653723 655609 656341 656554 656383 655491 653747 651381 648394 644335 638930 632438
60021 632438 625140 616937 607825 598395 589358 580819 572393 563924 555755 548356 541916 536213 530806 525526
60007 525526 520848 517518 515608 514238 512477 510270 508192 506589 505394 504614 504517 505221 506396 507505 508296
59992 508296 509034 510329 512692 516143 520265 524636 529099 533615 538043 542229 546146 549798 553021 555474
59978 555474 556760 556538 554655 551319 547060 542447 537863 533530 529631 526312 523700 521893 520877 520500 520649
59963 520649 521393 522786 524626 526685 529099 532187 535844 539492 542765 545866 549006 551787 553513 554013 553879
59948 553879 553845 554048 553921 552785 550613 548169 546259 544878 543352 541286 539009 536923 534877 532574 530362
59933 530362 529086 529122 530001 531130 532536 534649 537596 541115 545094 549753 555092 560487 565187 569071 572504
59918E72504K987J910K99j083j611j146K64K270L901M167L252K470K716L474L722
59903F00096L245K524J851J181O20M14M90N51N47P10J134J735K548L666M833N574
59887F31719N822O142O979P984Q379Q028P673P883Q186P714O641O096O539O970
59873G32755O301M767L202J619l79k276l129l272m074n733o715n969m471l787
59859G08839m131m660m877m830m574m287m362m691m420l104j454k54Q11K365M129
59844F70500N457O500P669Q431P850O121M423L293K215Q81j35j85P29K223L846
59829G29818M969M939L543J177j472l646m861n418o218p580q704q854q498q472
59815F80723q585q051o909n931n327m653l915l716m162m612m583m197l644l005
$$ plain form
59918 572504 575491 577401 577700 576617 575006 573860 574124 576394 580295 584462 587714 590184 592900 596374 600096
59903 600096 603341 605865 607716 608897 609517 609931 610421 610972 611519 612229 613363 615098 617646 621312 626145 631719
59887 631719 637541 643683 650662 658646 667025 675053 682726 690609 698795 706509 713150 719246 725785 732755
59873 732755 739056 743823 747025 748644 748265 745989 742860 739588 735514 729781 723066 717097 712626 708839
59859 708839 704708 700048 695171 690341 685767 681480 677118 672427 668007 664903 663449 663195 664006 666371 670500
59844 670500 675957 682457 690126 698557 706407 712528 716951 720244 722459 723340 723205 723020 723749 725972 729818
59829 729818 734787 739726 743269 744446 742974 739328 734467 729049 722831 715251 706547 697693 689195 680723
59815 680723 672138 664087 657178 651247 645920 641267 637352 633636 629474 624862 620279 616082 612438 609433
59801F09433k617k723k851k330j489j359k120k762k569j996j800j970j929j273
59787E79645j23Q39P68l77j410j233l25l0n43p26M1J054J566J719J810J676J335
59770E85686J327J862K443K738L056L543L725L445L359L971M797N177N206N374
59756F35709N770O228O745P267P614P961Q769R828J0183R479Q661Q571Q661P926
59742G49372O542N584N406N265M491L260K167J547J313J091N37k65q73j026r40
59727G83471q63p98q08j100j523j516r91p35j399k539l261l388l366l275k764
59712G55145j899j328j451j882j985j632j185r29o88j14P96J605J989K118K292
59697G50852K432K348K309K792L652M174L979L381K737K010J079p5j594l442m857
$$ plain form
59801 609433 606816 604093 601242 598912 597423 596064 593944 591182 588613 586617 584817 582847 580918 579645
59787 579645 579522 580361 581129 580752 579342 578109 577784 577754 577211 576485 576526 577580 579146 580865 582675 584351 585686
59770 585686 587013 588875 591318 594056 597112 600655 604380 607825 611184 615155 619952 625129 630335 635709
59756 635709 641479 647707 654452 661719 669333 677294 686063 695891 706074 715553 724214 732785 741446 749372
59742 749372 755914 761498 766904 772169 776660 779920 782087 783634 784947 786038 786575 786310 785437 784411 783471
59727 783471 782608 781810 781002 779902 778379 776863 775872 775137 773738 771199 767938 764550 761184 757909 755145
59712 755145 753246 751918 750467 748585 746600 744968 743783 742854 742166 742052 742848 744453 746442 748560 750852
59697 750852 753284 755632 757941 760733 764385 768559 772538 775919 778656 780666 781745 781670 780076 776634 771777
59682G71777m839l512k270k167k885l637m386n500o825p782q032p586o564n332
59668G00460m462m120l843l281k719k505k466k273j931j408l91J133K512L248
59654F77954L714M446N191N360M960M408L717K622J279J38p91j893l294m759o090
59639F96962p112p487p078o385o073o143o072n658n134m563l707k574j620j328
59625F26028j808k847m070n053n515n393m739l773l017k960l428l704l502l258
59611E72961l193k765j565k03M34L93M46R51J549J765J406N99q2R2R92J441O91
59594E75912l35k63O68R68J97l44L96J651J925Q65o07j596j950j967j929j987
59578E71604k134k258k290k276k242k113j823j409r44m51J2K90J95k53p27q28
$$ plain form
59682 771777 766938 763426 761156 758989 756104 752467 748081 742581 735756 727974 719942 712356 705792 700460
59668 700460 695998 691878 688035 684754 682035 679530 677064 674791 672860 671452 671061 672194 674706 677954
59654 677954 681668 686114 691305 696665 701625 706033 709750 712372 713651 713789 712998 711105 707811 703052 696962
59639 696962 689850 682363 675285 668900 662827 656684 650612 644954 639820 635257 631550 628976 627356 626028
59625 626028 624220 621373 617303 612250 606735 601342 596603 592830 589813 586853 583425 579721 576219 572961
59611 572961 569768 567003 565438 565235 565669 566062 566508 567459 569008 570773 572179 572778 572696 572788 573780 575221 575912
59594 575912 575577 575314 575982 576950 577147 576803 577199 578850 580775 581640 581033 579437 577487 575520 573591 571604
59578 571604 569470 567212 564922 562646 560404 558291 556468 555059 554115 553664 553676 553966 554161 553908 553181 552353
59562E52353n31k39k54l56k30l6j40m15m43l18m27m67L64J900K752K113R38N97
59544E57161J177K012L096M891P109Q927J0262J1833J3998J6268J7839J7794J5082
59531F87449R454K507l203o281p085o382m524k107j70Q55J588K506L010K339P61
59516F80717p70j835k720l713m795n905o951p653p785p555p355p232o914o341
59502F03193n796n360m651l346j851j073j444k358k745k146r99kN60P56P16N79
59486E74033N67Q93J607K563L495M083M230M253M536N025N339N391N473N635N524
59471F32647M973M240L440K356J100L70N37J017J103Q73Q06R66J232J882L143
59456F60685M487N213N543O290P532Q457Q572Q299Q181Q094P543O273M374K069
$$ plain form
59562 552353 551822 551583 551329 550973 550743 550707 550567 550152 549709 549391 548964 548497 548861 550761 553513 555626 556564 557161
59544 557161 558338 560350 563446 568337 575446 584373 594635 606468 620466 636734 654573 672367 687449
59531 687449 696903 699410 696207 689926 682841 676459 671935 669828 669658 670513 672101 674607 677617 679956 680717
59516 680717 679947 678112 675392 671679 666884 660979 654028 646375 638590 631035 623680 616448 609534 603193
59502 603193 597397 592037 587386 584040 582189 581116 579672 577314 574569 572423 571424 571422 571982 572738 573454 574033
59486 574033 574600 575493 577100 579663 583158 587241 591471 595724 600260 605285 610624 616015 621488 627123 632647
59471 632647 637620 641860 645300 647656 648756 649126 649663 650680 651783 652656 653462 654428 655660 657542 660685
59456 660685 665172 670385 675928 682218 689750 698207 706779 715078 723259 731353 738896 745169 749543 751612
59442G51612l41k577m505o091p274p968q101p533o263m793l881l656l409k623
59428F82597j681j064m34P97K426L806M954O535Q824J1413J3818J5833J7367J8551
59414G83742J9886K1700K3615K5037K5761K5366K2462J5788O159l570j0722j4391
59402I40833j4897j2781q739l724J394N948R102R736P104J393o167j3491j8317
59389H97394j9633j8503j6860j5468j3649j0939q042n943m836m368m237m211l951
59376G66754l303k453j615q11j07L37M86M62L18J28J44M68P18N84N47J351K855
59359G66863M096M617M938N653O698P751Q715R613J0466J1448J2691J3909J4705
59346H82163J5224J5915J6676J6887J6355J5439J4313J2800J1053R437P667M909
$$ plain form
59442 751612 751271 748694 744189 738098 730824 722856 714755 707222 700959 696166 692285 688629 685220 682597
59428 682597 680916 679852 679418 680215 682641 686447 691401 697936 706760 718173 731991 747824 765191 783742
59414 783742 803628 825328 848943 873980 899741 925107 947569 963357 969516 965946 955224 940833
59402 940833 925936 913155 904416 900692 902086 908034 917136 926872 933976 935369 929202 915711 897394
59389 897394 877761 859258 842398 826930 813281 802342 794300 788357 783521 779153 774916 770705 766754
59376 766754 763451 760998 759383 758572 758465 758802 759288 759750 760068 760196 760340 760808 761526 762110 762657 764008 766863
59359 766863 770959 775576 780514 786167 792865 800616 809331 818944 829410 840858 853549 867458 882163
59346 882163 897387 913302 929978 946865 963220 978659 992972 1005772 1016825 1026262 1033929 1038838
59334A038838J110k634n450p672j0053j2667j5071j6864j7776j7773j7476j7748
59322H98764j8461j8328j6507j3772j1585j0587j0479j0756j0919j0462r386q391
59310G49131p987p721o951n907n348n289m887l611j894m46O05J638K907M344N862
59295G14446P540R328J0750J1179J0341Q239M668n05o291j0631j2199j1739j0847
59282G24279r889q093n345k613m74J579M003O360Q126R574J1249J3079J4523J5204
59268G81562J5089J4398J3583J2994J2440J1383R654P499M982J978j198l876n818
59255H74670p264q169q183p480o762o208n340m103l147k620j740p7J609K453K673
59240H20312K971L452L837M135M469M565M065L014J667J59j310k427l220m091
$$ plain form
59334 1038838 1039948 1037314 1031864 1024192 1014139 1001472 986401 969537 951761 933988 916512 898764
59322 898764 880303 861975 845468 831696 820111 809524 799045 788289 777370 766908 757522 749131
59310 749131 741144 733423 726472 720565 715217 709928 705041 701430 699536 699090 699695 701333 704240 708584 714446
59295 714446 721986 731314 742064 753243 763584 771823 776491 775986 769695 759064 746865 735126 724279
59282 724279 714390 706297 700952 698339 697865 699444 703447 709807 717933 727507 738756 751835 766358 781562
59268 781562 796651 811049 824632 837626 850066 861449 871103 878602 883584 885562 884364 880488 874670
59255 874670 867406 859237 851054 843574 836812 830604 825264 821161 818014 815394 813654 813577 815186 817639 820312
59240 820312 823283 826735 830572 834707 839176 843741 847806 850820 852487 852646 851336 848909 845689 841598
59226H41598n159o179p255q856j0763j1930j1864j1397j1382j1428j0685r230
59214G25470p880p059o559o095n491m615l640l093l160l308k947k048q14O85K167
59199F71613L029L071K786K592K369K107K234K860L380L404L355L614L840L764
59185G14018L810M222M376L812L153L124L350L142K719K594K354J363K12Q1Q07
59170G53137R61o3j187j241l79M81Q92J088J350J600J513Q77j70j397k826m572
59154G50064o316p486q079q691r519j0018r871r514r293q908q182p581p312o757
59140F32537n546m441m225m446m269l853l781l682k688r31M78R79R99J042J209
59125E99382J596K320L217M103N149O448P549Q139Q761J0010J1435J2122J2037
$$ plain form
59226 841598 836439 830260 823005 814149 803386 791456 779592 768195 756813 745385 734700 725470
59214 725470 717590 710531 703972 697877 692386 687771 684131 681038 677878 674570 671623 669575 668761 669446 671613
59199 671613 674642 677713 680499 683091 685460 687567 689801 692661 696041 699445 702800 706414 710254 714018
59185 714018 717828 722050 726426 730238 733391 736515 739865 743007 745726 748320 750674 752037 752249 752330 753137
59170 753137 754098 754035 752848 751607 751228 751709 752601 753689 755039 756639 758152 759029 758859 757462 754636 750064
59154 750064 743748 736262 728183 719492 709973 699955 690084 680570 671277 662369 654187 646606 639294 632537
59140 632537 626991 622550 618325 613879 609610 605757 601976 598294 595606 594675 595153 596132 597131 598173 599382
59125 599382 600978 603298 606515 610618 615767 622215 629764 637903 646664 656674 668109 680231 692268
59112F92268J1852J1693J1122J0201R565R309Q757P479N838M444L519K872K055
59099G90974O96r43k066k332k315k528k684k488k359k575k475j549o32p96j656
59084G64272k091k150k796m075n032n434o078p270q274q557q407q101p490o642
59070F81875n950n440m833m366m524m953m675l613k785k784l036k876k425k096
59056F27519j998k127k476k707k430j879j626j645j490j252j428j811j616q86
59042F02148o01j133j592j173j65Q10J655K439K868K741K395K247K350K653L288
59027F20930M369N931Q047J0517J2565J3524J3813J4370J5210J5357J4248J2268
59015G61149R802O771L398M91j500k974m367n465n820n329m155k676j527j104
$$ plain form
59112 692268 704120 715813 726935 737136 746701 756010 764767 772246 778084 782528 786047 788919 790974
59099 790974 791670 790727 788661 786329 784014 781486 778802 776314 773955 771380 768905 767356 766724 765928 764272
59084 764272 762181 760031 757235 753160 748128 742694 736616 729346 721072 712515 704108 696007 688517 681875
59070 681875 675925 670485 665652 661286 656762 651809 647134 643521 640736 637952 634916 632040 629615 627519
59056 627519 625521 623394 620918 618211 615781 613902 612276 610631 609141 607889 606461 604650 603034 602148
59042 602148 601547 600414 598822 597649 597484 598294 599949 602388 605256 607997 610392 612639 614989 617642 620930
59027 620930 625299 631230 639277 649794 662359 675883 689696 704066 719276 734633 748881 761149
59015 761149 770951 777722 781120 781611 780111 777137 772770 767305 761485 756156 752001 749325 747798 746694
59001G46694q82J04K017M032N376N874N575M662L681L082K495J330n1p23o87q41
58985G81738j465j874j708j422j156l41J187K755L928M985N992O535O821P923
58971H13898J0180J2393J3348J3323J3372J3735J3805J3147J1944J0669R741R192
58959I58747Q543P323N629L680J123k393o170r059j1069j3143j5414j6929j7285
58946H93583j7156j6890j6040j4612j3390j2474j0933q653o952o588o458n280
58934G58157l323j480Q8J325J535O12n5O61J834J798N08p86j608k475l448l943
58918G49400l828l525l077k220j341j201j670j699p11P56K012L038M171N495O865
58903G52465Q203R578J1057J2569J3889J4865J5573J6038J5975J5239J4352J3927
$$ plain form
59001 746694 745812 745916 747933 751965 757341 763215 768790 773452 777133 780215 782710 784040 783989 783266 782579 781738
58985 781738 780273 778399 776691 775269 774113 773772 774959 777714 781642 786627 792619 799154 805975 813898
58971 813898 824078 836471 849819 863142 876514 890249 904054 917201 929145 939814 949555 958747
58959 958747 967290 974613 980242 983922 985045 982652 976482 967423 956354 943211 927797 910868 893583
58946 893583 876427 859537 843497 828885 815495 803021 792088 783435 776483 769895 763437 758157
58934 758157 754834 753354 753442 754767 756302 756914 756859 757520 759354 761152 761660 760874 759266 756791 753343 749400
58918 749400 745572 742047 738970 736750 735409 734208 732538 730839 730128 730884 732896 735934 740105 745600 752465
58903 752465 760668 770246 781303 793872 807761 822626 838199 854237 870212 885451 899803 913730
58891I13730J3835J3643J3760J5054J7290J9155J9977K0226K0009J8499J5442
58880A100620J1928Q867N936K840L01j311l062n863q844j0677j1624j2691j3506
58867A062914j2810j0714q812q010p675p115o608o630p101p771q612r545j0314
58854I51197j0814j1172j1341j1141j0606j0033r610r298q966q513q084q256r488
58841H23875j1218j2172j1830j0949j0309r727q844q038p760p679p224o456n590
58828G06079m334k467o63K03J93K8Q3L46R39J881K726L157L583M378N029M776
58812G25937L758K744K080J628J364J251Q07l97k064l503m387m678m297l587l467
58797G13189m407n661o275o350o510o641o169n197m430m087l735l047k075r45
$$ plain form
58891 913730 927565 941208 954968 970022 987312 1006467 1026444 1046670 1066679 1085178 1100620
58880 1100620 1112548 1121415 1127351 1130191 1130492 1129181 1126119 1120256 1111412 1100735 1089111 1076420 1062914
58867 1062914 1050104 1039390 1030578 1022568 1014893 1007778 1001170 994540 987439 979668 971056 961511 951197
58854 951197 940383 929211 917870 906729 896123 886090 876480 867182 858216 849703 841619 833363 823875
58841 823875 812657 800485 788655 777706 767397 757670 748826 740788 733028 725349 718125 711669 706079
58828 706079 701745 699278 698615 698818 699011 699039 699122 699468 700407 702288 705014 708171 711754 716132 721161 725937
58812 725937 729695 732439 734519 736147 737511 738762 739569 739172 737108 733605 729218 724540 720243 716656 713189
58797 713189 708782 703121 696846 690496 683986 677345 671176 665979 661549 657462 653727 650680 648605 647660
58783F47660J42R21J566K719M425N646N573M836M606M931M843L718J691q81l480
58768F88916n340o070o143o102n790n029m459m729n386n458m746l673k368p95
58754F22828O09J399J807K144K052J244L99L07P36J143J867L331M739N011M576
58739F54192M813N969P067P653Q113Q345P676O288N326N325N670N843O032O279
58725G44591O125N474M831M383L744K885K461K878L770M628N328N869O212O465
58711H09644O674O416N204L198J019j082l238n440p564r699j1852j3636j4841
58698G64803j5935j7262j8233j8102j7099j5874j4380j2272j0008q441p629p071
58686F02497o761o932p123o683n850n303m920m210l513l504l799l407k337j397
$$ plain form
58783 647660 647802 648723 650289 653008 657433 663079 668652 673488 678094 683025 687868 691586 693277 692396 688916
58768 688916 683576 677506 671363 665261 659471 654442 649983 645254 639868 634410 629664 625991 623623 622828
58754 622828 623437 624836 626643 628787 630839 632083 632482 632789 633525 634668 636535 639866 644605 649616 654192
58739 654192 659005 664974 672041 679694 687807 696152 703828 710116 715442 720767 726437 732280 738312 744591
58725 744591 750716 756190 761021 765404 769148 772033 774494 777372 781142 785770 791098 796967 803179 809644
58711 809644 816318 822734 827938 831136 832155 831073 827835 822395 814831 805132 793280 779644 764803
58698 764803 748868 731606 713373 695271 678172 662298 647918 635646 625638 617197 609568 602497
58686 602497 595736 588804 581681 574998 569148 563845 558925 554715 551202 547698 543899 540492 538155 536758
58672E36758o18O05J943K326J893K159L955O339Q001Q645Q662Q424Q142P577N920
58657F10731K796o84k959l917m680n704o361o350o158o017n641n166n132n378
58643E49380n104m075k789j500k02N96M00j09J90J062J403J309J940L157L273
58628E48931J648k01q40p22q99j296j285r11o10l54J94J199K643M220N240N294
58612E62251N065N502O371O621O059N427M897L933K666J923J731J223K98q6L58
58597F14239O75K87k57n13p53r19l23J032K194K806L665N157O526P297Q151R721
58581F58985J1503J2652J2876J2221J0887R606R070Q844P950O698O540P906R694
58568G85432J1218J3083J5659J8305K0681K3305K6205K8447K9584L0152L0123
$$ plain form
58672 536758 536140 536745 538688 541014 542907 545066 549021 555360 563361 572006 580668 589092 597234 604811 610731
58657 610731 613527 612843 609884 605967 601287 595583 589222 582872 576714 570697 565056 559890 554758 549380
58643 549380 544276 540201 537412 535912 535710 536306 536706 536597 536787 537849 539252 540561 542501 545658 548931
58628 548931 550579 550378 549538 548816 547917 546621 545336 544425 543815 543461 543655 544854 547497 551717 556957 562251
58612 562251 567316 572818 579189 585810 591869 597296 602193 606126 608792 610715 612446 613669 613967 613881 614239
58597 614239 614914 615201 614944 614431 613678 612759 612436 613468 615662 618468 622133 627290 633816 641113 649264 658985
58581 658985 670488 683140 696016 708237 719124 728730 737800 746644 754594 761292 767832 775738 785432
58568 785432 796650 809733 825392 843697 864378 887683 913888 942335 971919 1002071 1032194
58557A032194K8431K4775K0400J6298J2043P163K250j991n490p891q412p434o767
58544A105569p388q292q440q468r537j1760j4711j8210k1692k4020k4832k4951
58532I23268k4770k3571k1168j8659j6675j4405j1392q808p688p250o301n127
58520G57454m686m863m800m216l461k895k918l715m537m262l127k588l002l001
58506G05383j833o46n57j054j257j239j127m40O35Q57r1p62j59P96J069J211J917
58489G02703K586K662K903L961N153O003P465J0178J2945J4496J5360J6527J7651
58476H20593J8055J8150J8194J6987J3507Q733M320O04k762n469p348r137j0958
58463H83469j1319r263o154l744j829N92L224N397P650J0530J3014J3981J4048
$$ plain form
58557 1032194 1060625 1085400 1105800 1122098 1134141 1141304 1143554 1141563 1136073 1128182 1119770 1112336 1105569
58544 1105569 1098181 1089889 1081449 1072981 1063444 1051684 1036973 1018763 997071 973051 948219 923268
58532 923268 898498 874927 853759 835100 818425 804020 792628 783820 776132 768882 762581 757454
58520 757454 752768 747905 743105 738889 735428 732533 729615 725900 721363 717101 713974 711386 708384 705383
58506 705383 703550 702904 702347 701293 700036 698797 697670 697230 697865 698722 698631 697869 697710 698506 699575 700786 702703
58489 702703 705289 707951 710854 714815 719968 725971 733436 743614 756559 771055 786415 802942 820593
58476 820593 838648 856798 874992 891979 905486 914219 918539 919143 916381 910912 903564 894427 883469
58463 883469 872150 862887 856733 852989 851160 851752 854976 860373 868023 878553 891567 905548 919596
58450I19596J4125J3388J0632O531K538j347n680r532j1522j2110j2788j3660
58438I00171j3674j2521j0589p837m466j900j296j734j505l61J035K804N283P699
58424H61109R158J0017J0766J0653R058O997N456L593M31k956n015o193p731r228
58410H96115r602r332r493r608q729p509o941o185m046j581o19o86J10J823K967
58395H26684L319L942N010N899O878Q412R488Q883P430O786O804O413O015O496
58381I18459O755M984J678j203l237n082n914m343j304Q79J885L145M745N525
58367I26972N802P059R085J0279J0621J1603J3388J4655J5117J5572J5709J4439
58355A070301J2214J0494R190P166M821L527K994J911P58J117K579L254L078L667
$$ plain form
58450 919596 933721 947109 957741 964272 966810 965463 959783 950251 938729 926619 913831 900171
58438 900171 886497 873976 863387 855550 851084 849184 847888 846154 844649 844288 845323 848127 853410 861109
58424 861109 870267 880284 891050 901703 910761 917758 923214 926807 927238 924282 919267 913074 905343 896115
58410 896115 886513 877181 867688 858080 849351 841842 834901 828716 824670 823089 822470 821784 821894 823717 826684
58395 826684 830003 833945 838955 844854 851732 860144 869632 878515 885945 892731 899535 905948 911963 918459
58381 918459 925214 930198 931876 930673 927436 922354 916440 912097 910793 911672 913557 916702 921447 926972
58367 926972 932774 939833 948918 959197 969818 981421 994809 1009464 1024581 1040153 1055862 1070301
58355 1070301 1082515 1093009 1102199 1109365 1114186 1117713 1120707 1122618 1123376 1124493 1127072 1130326 1133404 1137071
58341A137071N177O245O876Q418J0769J2415J3192J4257J5523J5830J5457J5730
58329A276960J6422J6209J5276J4729J4023J1850Q936O975N510L073O17L34J795
58316A392709K732L114M686P086Q294Q495R617J1405J1879J1384J2075J3619J3618
58303A510713J2284J2385J4348J5700J5633J5972J7249J7871J7629J8106J9304
58292A687194J9699J9740K1292K3655K4312K3594K4194K6141K6816K5984K6108
58281A948729K7477K7885K7426K8696L1838L4272L5713L8546M2894M6342M8884
58270B338702N2904N7932O0802O1426O2825O5088O5198O3388O3495O6153O7769
58259C025682O7233O7403O8848O8592O6379O5855O8006O9669O9882P1445P4889
$$ plain form
58341 1137071 1142248 1148493 1155369 1163787 1174556 1186971 1200163 1214420 1229943 1245773 1261230 1276960
58329 1276960 1293382 1309591 1324867 1339596 1353619 1365469 1374405 1381380 1386890 1389963 1390580 1390914 1392709
58316 1392709 1395441 1398555 1403241 1410327 1418621 1427116 1436733 1448138 1460017 1471401 1483476 1497095 1510713
58303 1510713 1522997 1535382 1549730 1565430 1581063 1597035 1614284 1632155 1649784 1667890 1687194
58292 1687194 1706893 1726633 1747925 1771580 1795892 1819486 1843680 1869821 1896637 1922621 1948729
58281 1948729 1976206 2004091 2031517 2060213 2092051 2126323 2162036 2200582 2243476 2289818 2338702
58270 2338702 2391606 2449538 2510340 2571766 2634591 2699679 2764877 2828265 2891760 2957913 3025682
58259 3025682 3092915 3160318 3229166 3297758 3364137 3429992 3497998 3567667 3637549 3708994 3783883
58248C783883P7459P9268Q3760R0888R6746J01042J07579J16280J22587J26080
58238D785572J31620J40457J48587J55436J65313J78509J90168J99880K12878
58229F308420K29730K44919K57887K74860K97171L18966L39371L65243L98558
58220I035125M33181M67836N09627N60779O15089O71818P39340Q20826R11210
58211A4764831J013089J139561J296188J477636J688112J946392K263886K637928
58203B8227623L074338L594716M213468M932053N764733O742640P884035R196033
58195G3629639J0720712J2542037J4730254J7320345K0349638K3821627K7545543
58188B00659795L1028143L3540022L4201359L1985981K5939888J5877567L091646
$$ plain form
58248 3783883 3861342 3940610 4024370 4115258 4212004 4313046 4420625 4536905 4659492 4785572
58238 4785572 4917192 5057649 5206236 5361672 5526985 5705494 5895662 6095542 6308420
58229 6308420 6538150 6783069 7040956 7315816 7612987 7931953 8271324 8636567 9035125
58220 9035125 9468306 9936142 10445769 11006548 11621637 12293455 13032795 13853621 14764831
58211 14764831 15777920 16917481 18213669 19691305 21379417 23325809 25589695 28227623
58203 28227623 31301961 34896677 39110145 44042198 49806931 56549571 64433606 73629639
58195 73629639 84350351 96892388 111622642 128942987 149292625 173114252 200659795
58188 200659795 231687938 265227960 299429319 331415300 357355188 373232755 376324401
58181C76324401r824495k0208334k6629345k9194094k8883722k6800366k3889639
58174B10894406k0941520j8506699j6754896j5503291j4434174j3312807j2070001
58167I9371018j0762401r484463q299639p228852o278393n454602m751964m150518
58159D2960186l634835l201524k843437k542771k286391k073235j900014j753506
58151B2724473j623571j510637j413565j322574j231046j142884j061396r81642
58143A2437158r00260q22589p53231o88704o25670n67690n17660m71800m27083
58134F662471l87089l54967l27775l02764k82077k66324k50646k32119k14369
58125D044341k00181j86283j70194j55485j45193j36261j25490j15188j07972
$$ plain form
58181 376324401 366499906 346291572 319662227 290468133 261584411 234784045 210894406
58174 210894406 189952886 171446187 154691291 139188000 124753826 111441019 99371018
58167 99371018 88608617 79124154 70824515 63595663 57317270 51862668 47110704 42960186
58159 42960186 39325351 36123827 33280390 30737619 28451228 26377993 24477979 22724473
58151 22724473 21100902 19590265 18176700 16854126 15623080 14480196 13418800 12437158
58143 12437158 11536898 10714309 9961078 9272374 8646704 8079014 7561354 7089554 6662471
58134 6662471 6275382 5920415 5592640 5289876 5007799 4741475 4490829 4258710 4044341
58125 4044341 3844160 3657877 3487683 3332198 3187005 3050744 2925254 2810066 2702094
58116B702094j01551r3594q6510q2543p9051p3346o7641o4688o2767n9418n5979
58105A875006n4237n2491m8935m5236m3099m0903l7205l3860l2376l0885k7994
58094A427785k5810k5964k6387k5246k4278k4930k5068k2845k0234j9403j9086
58083A168534j7840j7278j8753k0220j9757j8943j9456j9688j8045j6327j6432
58072I65795j6848j5772j4656j5240j5978j4961j3572j3709j4048j2563j0347
58061H08101r471r332q390p352p465p818p368p460r312j1186j1049r914r621r440
58047F82923p974o272n988o350n922n424n916o192m972l739m337n597n475m701
58033F04064n227o625p124o855p020p272o792o579p820r283r131q014p612p470
$$ plain form
58116 2702094 2600543 2506949 2420439 2337896 2258845 2185499 2117858 2053170 1990403 1930985 1875006
58105 1875006 1820769 1768278 1719343 1674107 1631008 1590105 1552900 1519040 1486664 1455779 1427785
58094 1427785 1401975 1376011 1349624 1324378 1300100 1275170 1250102 1227257 1207023 1187620 1168534
58083 1168534 1150694 1133416 1114663 1094443 1074686 1055743 1036287 1016599 998554 982227 965795
58072 965795 948947 933175 918519 903279 887301 872340 858768 845059 831011 818448 808101
58061 808101 798630 789298 780908 773556 766091 758273 750905 743445 734133 722947 711898 701984 692363 682923
58047 682923 674949 668677 662689 656339 650417 644993 639077 632885 627913 624174 619837 614240 608765 604064
58033 604064 598837 592212 585088 578233 571213 563941 557149 550570 542750 533467 524336 516322 508710 501240
58019E01240o185m482m105m679m492l544l083l020k360j513j633k388k612k432
58005D54712k628k794k248j713k027k372j802j336k223l458l416k758l194m505
57991D18238n240n443o095o733o062m338k818j598j21J004Q76J95J68L85j56r13
57975C81349p46j2L97R08K109K942K455J977L036M352L711J683N89O61L19m78
57959D05252k43J000J618J143N48oj126k233k177j532j782k574k351j277q41q49
57943C92570L20K518L814L750L885M846N601N972P116Q987R849R023P787O941
57929D72979N780M029K587J636J36k123l930m795n697p128q179q269p967p545
57915D31514o518n140m563m854m632l334k123j863j796j063PQ06J292J399R13
$$ plain form
58019 501240 495055 490573 486468 481789 477297 473753 470670 467650 465290 463777 462144 459756 457144 454712
58005 454712 452084 449290 447042 445329 443302 440930 439128 437792 435569 432111 428695 425937 422743 418238
57991 418238 412998 407555 401460 394727 388665 384327 381509 379911 379790 380794 381670 381865 382033 382418 382262 381349
57975 381349 380603 380591 380988 381896 384005 386947 389402 391379 394415 398767 402478 404161 404750 405411 405730 405252
57959 405252 405009 406009 407627 408770 409318 409312 408186 405953 403776 402244 400462 397888 395537 394260 393419 392570
57943 392570 392890 395408 399222 402972 406857 411703 417304 423276 430392 439379 449228 458251 466038 472979
57929 472979 478759 482788 485375 487011 487147 485024 481094 476299 470602 463474 455295 447026 439059 431514
57915 431514 424996 419856 415293 410439 405807 402473 400350 398487 396691 395628 395635 396441 397733 399132 400045
57900D00045L83P22J567J535M65j50N22J541J942K095K593L194L588L993M374
57885D28409M244L693L490L765L748L132K456J885R04m44j376j753k283l009l040
57870D43821k201j523j637j972k044k136k265j809p74q8n5K27J325K519L021L046
57854D37455L133L365L691M076M087L310K329K079K235J625L12l32R5L90j50o66
57838D67034l95J83N10P88R69M34n99q90j43L17k55o68K25J632K094J483M98p23
57820D72494k214l241l100k298j936k315k951l404l436k934k204j885k121k542
57806D35913l207m621o455p458p131o399o022n488m214k753j946j779j828j916
57792C74696j693n60J209K271J914J084R79J576K324L209M267M959N030N123N728
$$ plain form
57900 400045 400428 401150 402717 404252 404717 404567 405089 406630 408572 410667 413260 416454 420042 424035 428409
57885 428409 432653 436346 439836 443601 447349 450481 452937 454822 455726 455282 453906 452153 449870 446861 443821
57870 443821 441620 440097 438460 436488 434444 432308 430043 428234 427460 427372 427317 427544 428869 431388 434409 437455
57854 437455 440588 443953 447644 451720 455807 459117 461446 463525 465760 467385 467697 467365 467460 467850 467700 467034
57838 467034 466639 466822 467332 468120 469089 469523 468924 468034 467891 468208 467953 467285 467510 469142 471236 472719 473217 472494
57820 472494 470280 467039 463939 461641 459705 457390 454439 451035 447599 444665 442461 440576 438455 435913
57806 435913 432706 428085 421630 414172 407041 400642 394620 389132 384918 382165 380219 378440 376612 374696
57792 374696 373003 372443 373652 375923 377837 378921 379900 381476 383800 387009 391276 396235 401265 406388 412116
57777D12116O306O327O278O684P001O451N251M061K916J639N58j24q94j943k345
57762D60282j360R6M56m58j434j583j076m33R8N34J114K045K923K959K127J423
57746D67713J454J635J379J167J564K027J653N41n47j266j588j279m12J92ql22
57730D73903J28R59J178P65N73J012J771K530L015K687J442K36J07P65J114R10
57714D93095Q87J377J832J782J490J436J723K022J776O99o48j170n60K35L74K39
57698E06589N26Q77M62o10j454j714j739j694j426j133j284j902k525k753k325
57683D87895r77J101K986M031M853O589R391J2434J5150J7731K0658K4464K9690
57670F35996L6296M3334M9913N6069O1758O5295O3717N4713L7805J4510j1396
$$ plain form
57777 412116 418422 424749 431027 437711 444712 451163 456414 460475 463391 465030 465588 465464 464570 462627 460282
57762 460282 458922 459018 459474 459016 457582 455999 454923 454490 454588 455122 456236 458281 461204 464163 466290 467713
57746 467713 469167 470802 472181 473348 474912 476939 478592 479133 478586 477320 475732 474453 474041 474233 474225 473903
57730 473903 474031 474990 476168 476933 477506 478518 480289 482819 485834 488521 489963 490199 490306 491071 492185 493095
57714 493095 493982 495359 497191 498973 500463 501899 503622 505644 507420 508119 507471 506301 505741 505976 506350 506589
57698 506589 507115 507992 508454 507844 506390 504676 502937 501243 499817 498684 497400 495498 492973 490220 487895
57683 487895 486918 488019 491005 495036 499889 506478 515869 528303 543453 561184 581842 606306 635996
57670 635996 672292 715626 765539 821608 883366 948661 1012378 1067091 1104896 1119406 1108010
57659A108010l4350m9755n6868n8234n6286n1679m4847l7432l1179k6382k2318
57648F38680j8604j5378j2649j0245q224o745n646m563l419k501k064j940j657
57635E45045q73J82Q88Q96N29L29M11M72K84p6l70m43m03n81j087j484j333r87
57617E41399j165j638j319L3J190J199P43R11J436J424J095J478K538L075K479
57602E54878J472Q69O28M04K15J94L00M82O75N38j74r94j106m43K56N13O15R53
57584E60275J445J848K068K054J741J315J144J346J742K147K424K381K044J774
57570E85748J770J643J008K08j43qL03Q90J949K961L140K616K312K631L137L528
57554F13693L956M297M133L696L914N031O043O002N223M685M770N082N080M471
$$ plain form
57659 1108010 1073660 1023905 967037 908803 852517 800838 755991 718559 687380 660998 638680
57648 638680 620076 604698 592049 581804 573580 566835 561189 556626 553207 550706 548642 546702 545045
57635 545045 544172 544354 545242 546138 546667 546996 547407 547879 548163 548087 547717 547274 546871 546290 545203 543719 542386 541399
57617 541399 540234 538596 537277 537310 538500 539699 540442 541353 542789 544213 545308 546786 549324 552399 554878
57602 554878 556350 557219 557847 558251 558466 558660 558960 559442 560117 560655 560481 559487 558381 557938 558194 558707 559322 560275
57584 560275 561720 563568 565636 567690 569431 570746 571890 573236 574978 577125 579549 581930 583974 585748
57570 585748 587518 589161 590169 590377 590234 590226 590529 591419 593368 596329 599469 602085 604397 607028 610165 613693
57554 613693 617649 621946 626079 629775 633689 638720 644763 650765 655988 660673 665443 670525 675605 680076
57540F80076L353K301J987K465L105L392L394L363L382L562M054M592M560L827
57526G27413L077L006L577M304M923N405N727N922O095O120N647M659L782L696
57512G93353M417N297N669N371M846M767N385O209O530O163N408M484L452K594
57498H63945K295K433K509K486K927M085N300N737N322M616M084L803L719L823
57484I17084M176M815N665O426O804O812O664O406N951N473N346N587N731N415
57470I98355M902M704M976N406N622N565N501N738O287O894P381P853Q420Q937
57456A086541R202R199Q953Q389P573O877O610O660O784P007P437P962Q465R032
57442A196691R596R789R523R357R673R945R535Q828Q798R569J0284J0322R838
$$ plain form
57540 680076 683429 685730 687717 690182 693287 696679 700073 703436 706818 710380 714434 719026 723586 727413
57526 727413 730490 733496 737073 741377 746300 751705 757432 763354 769449 775569 781216 785875 789657 793353
57512 793353 797770 803067 808736 814107 818953 823720 829105 835314 841844 848007 853415 857899 861351 863945
57498 863945 866240 868673 871182 873668 876595 880680 885980 891717 897039 901655 905739 909542 913261 917084
57484 917084 921260 926075 931740 938166 944970 951782 958446 964852 970803 976276 981622 987209 992940 998355
57470 998355 1003257 1007961 1012937 1018343 1023965 1029530 1035031 1040769 1047056 1053950 1061331 1069184 1077604 1086541
57456 1086541 1095743 1104942 1113895 1122284 1129857 1136734 1143344 1150004 1156788 1163795 1171232 1179194 1187659 1196691
57442 1196691 1206287 1216076 1225599 1234956 1244629 1254574 1264109 1272937 1281735 1291304 1301588 1311910 1321748
57429A321748R204Q652Q562R251J0343J1062J1207J1169J0977J0240R184Q759
57417A440358R338J0057J0001R415R242R874J0926J1890J2534J2849J2942J2939
57405A572365J2863J2659J2342J1877J1137J0278R884J0263J0870J1060J1169
57394A696767J1988J3263J3778J3138J2422J2680J3610J4303J4531J4690J4970
57383A846140J5304J5793J6557J7307J7499J6897J5785J4754J4314J4491J4713
57372B019554J4415J3745J3342J3460J3785J4114J4612J5234J5536J5287J4872
57361B177956J4838J5377J6368J7484J8219J8313J8163J8402J8960J9189J8941
57350B372210J8793J9078J9389J9337J9167J9259J9567J9839J9983J9954J9745
$$ plain form
57429 1321748 1330952 1339604 1348166 1357417 1367760 1378822 1390029 1401198 1412175 1422415 1431599 1440358
57417 1440358 1449696 1459753 1469754 1479169 1488411 1498285 1509211 1521101 1533635 1546484 1559426 1572365
57405 1572365 1585228 1597887 1610229 1622106 1633243 1643521 1653405 1663668 1674538 1685598 1696767
57394 1696767 1708755 1722018 1735796 1748934 1761356 1774036 1787646 1801949 1816480 1831170 1846140
57383 1846140 1861444 1877237 1893794 1911101 1928600 1945497 1961282 1976036 1990350 2004841 2019554
57372 2019554 2033969 2047714 2061056 2074516 2088301 2102415 2117027 2132261 2147797 2163084 2177956
57361 2177956 2192794 2208171 2224539 2242023 2260242 2278555 2296718 2315120 2334080 2353269 2372210
57350 2372210 2391003 2410081 2429470 2448807 2467974 2487233 2506800 2526639 2546622 2566576 2586321
57339B586321J9619J9858K0219K0188J9808J9599J9603J9345J8872J8925J9772
57328B802129K0714K1169K1377K1618K1618K1231K0947K1086K1216K1023K1007
57317C035135K1614K2317K2365K1967K1933K2518K3270K3766K3893K3679K3346
57306C285803K3268K3512K3703K3687K3780K4057K3989K3298K2623K2692K3345
57295C543757K3935K4282K4582K4779K4728K4730K5241K6226K7186K7696K7560
57284C824702K6868K6136K6026K6533K6896K6606K6001K5507K5011K4434K4211
57273D108931K4638K5340K5907K6519K7251K7574K7171K6634K6548K6541K6092
57262D399146K5661K5993K6829K7249K6983K6419K5690K4732K3995K4067K4683
$$ plain form
57339 2586321 2605940 2625798 2646017 2666205 2686013 2705612 2725215 2744560 2763432 2782357 2802129
57328 2802129 2822843 2844012 2865389 2887007 2908625 2929856 2950803 2971889 2993105 3014128 3035135
57317 3035135 3056749 3079066 3101431 3123398 3145331 3167849 3191119 3214885 3238778 3262457 3285803
57306 3285803 3309071 3332583 3356286 3379973 3403753 3427810 3451799 3475097 3497720 3520412 3543757
57295 3543757 3567692 3591974 3616556 3641335 3666063 3690793 3716034 3742260 3769446 3797142 3824702
57284 3824702 3851570 3877706 3903732 3930265 3957161 3983767 4009768 4035275 4060286 4084720 4108931
57273 4108931 4133569 4158909 4184816 4211335 4238586 4266160 4293331 4319965 4346513 4373054 4399146
57262 4399146 4424807 4450800 4477629 4504878 4531861 4558280 4583970 4608702 4632697 4656764 4681447
57251D681447K4978K4622K3942K3203K2535K2295K2644K2930K2433K1449K0807
57240D933285K0491J9861J8964J8485J8371J7737J6358J5140J4768J4796J4536
57229E122792J4032J3664J3460J3269J3145J3179J3309J3518J3876J4277J4470
57218E272991J4457J4387J4149J3489J2597J1998J1817J1677J1291J0639R601
57207E409093Q030O242M788L638K194K43j698l217m523n945p475r048j0829j2817
57193E378676j4628j5919j6780j7513j8263j9010j9675k0122k0388k0785k1501
57182E174092k2182k2351k2177k2266k2715k2952k2652k2208k2080k2177k2189
57171D928143k2059k1902k1726k1509k1234k0736j9829j8746j8120j8284j8889
$$ plain form
57251 4681447 4706425 4731047 4754989 4778192 4800727 4823022 4845666 4868596 4891029 4912478 4933285
57240 4933285 4953776 4973637 4992601 5011086 5029457 5047194 5063552 5078692 5093460 5108256 5122792
57229 5122792 5136824 5150488 5163948 5177217 5190362 5203541 5216850 5230368 5244244 5258521 5272991
57218 5272991 5287448 5301835 5315984 5329473 5342070 5354068 5365885 5377562 5388853 5399492 5409093
57207 5409093 5417123 5423365 5428153 5431791 5433985 5434228 5432530 5429313 5424790 5418845 5411370 5402322 5391493 5378676
57193 5378676 5364048 5348129 5331349 5313836 5295573 5276563 5256888 5236766 5216378 5195593 5174092
57182 5174092 5151910 5129559 5107382 5085116 5062401 5039449 5016797 4994589 4972509 4950332 4928143
57171 4928143 4906084 4884182 4862456 4840947 4819713 4798977 4779148 4760402 4742282 4723998 4705109
57160D705109j9379j9604j9797k0179k0751k1337k1756k2117k2944k4698k7133
57149D465414k9449l1198l2721l4587l6920l9469m2121m5050m8415n2006n5238
57138D018240n7525n8803n9582o0360o0982o0712n8919n5640n1464m7003m2375
57127C404875l7234l1377k5378k0349j6932j4775j3175j1952j1419j1696j2348
57116C198240j2726j2342j0896q072l341L903J3848K5953L9424N4093P0618Q9946
57104C448648J12921J40676J75282K20058K79314L57551M58507N85040P39735
57095F517732R24745J140218J383215J648493J929186K215745K495013K750890
57087B1005237K963443L106091L149792L080978K920098K715925K511781K312651
$$ plain form
57160 4705109 4685730 4666126 4646329 4626150 4605399 4584062 4562306 4540189 4517245 4492547 4465414
57149 4465414 4435965 4404767 4372046 4337459 4300539 4261070 4218949 4173899 4125484 4073478 4018240
57138 4018240 3960715 3901912 3842330 3781970 3720988 3660276 3601357 3545717 3494253 3447250 3404875
57127 3404875 3367641 3336264 3310886 3290537 3273605 3258830 3245655 3233703 3222284 3210588 3198240
57116 3198240 3185514 3173172 3162276 3154204 3150863 3154766 3168614 3194567 3233991 3288084 3358702 3448648
57104 3448648 3561569 3702245 3877527 4097585 4376899 4734450 5192957 5777997 6517732
57095 6517732 7442477 8582695 9965910 11614403 13543589 15759334 18254347 21005237
57087 21005237 23968680 27074771 30224563 33305541 36225639 38941564 41453345 43765996
57079D3765996K084287J782853J386434R05637L73530j72254p02991j200944j651362
57070D6571186k034869k329817k521289k605935k589870k486452k316889k108411
57062B7577654j887411j673020j475846j299340j140794r93612q51941p13872
57054A7541818n80513m53964l37530k36478j56536j01389p1866o6782q4360j24128
57044A5328272j87828k76591l85599n02046o09292o92990p44280p60701p46869
57035A0422076p13247o71239o27882n85008n42233m99368m56459m13385l70284
57026E542971l28075k88387k53048k22954j96865j71830j46088j22018j05932
57017C707774j04000j17236j39369j59924j70671j70227j62667j52472j41569
$$ plain form
57079 43765996 45850283 47633136 49019570 49925207 50298737 50126483 49423492 48222548 46571186
57070 46571186 44536317 42206500 39685211 37079276 34489406 32002954 29686065 27577654
57062 27577654 25690243 24017223 22541377 21242037 20101243 19107631 18255690 17541818
57054 17541818 16961305 16507341 16169811 15933333 15776797 15675408 15603542 15536760 15452400 15328272
57044 15328272 15140444 14863853 14478254 13976208 13366916 12673926 11929646 11168945 10422076
57035 10422076 9708829 9037590 8409708 7824700 7282467 6783099 6326640 5913255 5542971
57026 5542971 5214896 4926509 4673461 4450507 4253642 4081812 3935724 3813706 3707774
57017 3707774 3603774 3486538 3347169 3187245 3016574 2846347 2683680 2531208 2389639
57008B389639j30349j19314j08842r8734q9023q0482p3642o8146o3619o0312n8225
56997A438951n6468n4248n1713m9132m6076m2158l7891l4049l0694k7426k3992
56986I85104k0196j5935j1862r268q797j0040j2748j7295k3293k8820l2064l2977
56974G61809l2514l1109k8820k6030k3007j9441j5350j1669q985o485l181N86
56962E55804L978P192J0903J4746J7694J9380J9780J7939J2554L889n959j4766
56950F63134k1361k5335k6694k5966k3978k1346j8465j5655j2827r467n531j875
56938D54634Q84L325O357R941J3509J7036K0711K3956K5629K4795K0627J2387
56926F33791P41j1435k0961k6876l0176l1559l0805k8141k4769k1766j9450j7816
$$ plain form
57008 2389639 2259290 2139976 2031134 1932400 1843377 1762895 1689253 1621107 1557488 1497176 1438951
56997 1438951 1382483 1328235 1276522 1227390 1181314 1139156 1101265 1067216 1036522 1009096 985104
56986 985104 964908 948973 937111 927843 919046 909006 896258 878963 855670 826850 794786 761809
56974 761809 729295 698186 669366 643336 620329 600888 585538 573869 564884 558399 555218 555804
56962 555804 559782 566974 577877 592623 610317 629697 649477 667416 679970 683859 677900 663134
56950 663134 641773 616438 589744 563778 539800 518454 499989 484334 471507 462040 456509 454634
56938 454634 455518 458843 465200 475141 488650 505686 526397 550353 575982 600777 621404 633791
56926 633791 634532 623097 602136 575260 545084 513525 482720 454579 429810 408044 388594 370778
56914C70778j6661j5281j3056j0435q445p257o152m897m090m060m296m246l923
56901B67979l442k670j544l08Q21J819K723L680M942O572Q338J0265J2769J5840
56887C27784J8645K0477K1383K1171J8665J3060N544j610p161j1127j3517j4135
56875C99179j3396j1970r668n891j075L494P268J0711J4116J7454K1348K6760
56863D58330L3419L9835M5180M9820N3473N4069M9204L8124K1984L247j4671k8325
56851H03689l5940l8066l6225l1499k4755j7327j0537m644J171P828J5588K4106
56839F53389L2972M2245N2379O3475P4670Q4344R0520R0718Q2004O2507L3502
56828A362725j73l2050n6778p1907p8049p7524p2581o4663n5001m4997l5505k6359
$$ plain form
56914 370778 354117 338836 325780 315345 306900 299643 293491 288594 284504 280444 276148 271902 267979
56901 267979 264537 261867 260323 260015 260836 262655 265378 269058 274000 280572 288910 299175 311944 327784
56887 327784 346429 366906 388289 409460 428125 441185 446729 445119 437958 426831 413314 399179
56875 399179 385783 373813 364145 358254 357179 360673 367941 378652 392768 410222 431570 458330
56863 458330 491749 531584 576764 626584 680057 734126 783330 821454 843438 846685 832014 803689
56851 803689 767749 729683 693458 661959 637204 619877 609340 604696 605867 613695 629283 653389
56839 653389 686361 728606 780985 844460 919130 1003474 1093994 1184712 1266716 1329223 1362725
56828 1362725 1362552 1330502 1273724 1201817 1123768 1046244 973663 909000 853999 809002 773497 747138
56816G47138j7161q106M89Q907J7652K6869L6628M6995N6925O3788O4803N8582
56804A103509M4820K3768k518k9261n1015o4814p0652o9902o4614n7557n0832
56793G10932m4372l7074k9204k2160j6227j0258l697K767Q655J4301J9712K4291
56781F17666K7779K9964K9306K3528J2257k120j6496k8784l7579m1973m2548m1249
56769E29751l9460l7086l3848l0304k6999k3738k0302j6995j4090j1573r721q973
56757B56662q951q658p858p195o791n996m784l986l829l547k843k439k642k754
56743A84389k433k336k787l158l176l488m228m317l136j692j173j377j434j167
56729A48487q97o72m91n24o17l04L20O32P05J324K466L019K480J695J352J086
$$ plain form
56816 747138 729977 721871 722360 731267 748919 775788 812416 859411 916336 980124 1044927 1103509
56804 1103509 1148329 1172097 1169579 1140318 1089303 1024489 953837 883935 819321 761764 710932
56793 710932 666560 629486 600282 578122 561895 551637 547940 550707 559362 573663 593375 617666
56781 617666 645445 675409 704715 728243 740500 738380 721884 693100 655521 613548 571000 529751
56769 529751 490291 453205 419357 389053 362054 338316 318014 301019 286929 275356 265635 256662
56757 256662 247711 239053 231195 224000 217209 211213 206429 202443 198614 195067 192224 189785 187143 184389
56743 184389 181956 179620 176833 173675 170499 167011 162783 158466 155330 153638 152465 151088 149654 148487
56729 148487 147590 146918 146427 145903 145286 144982 145302 145934 146639 147963 150429 153448 155928 157623 158975 160061
56713A60061N80K83L21J33k57kR14J342R94J070J985K308J198N4K55Q76M33o01
56695A71947q51m54m38o56k46N29P26M91O98J300J518J284J138J070Q29Q25J465
56678A81175K124K037J623J623J634R24O1Q3O36N46j32l71j39m17j245j469o08
56661A88085M63Q77O12r6r76j334n74Q00J670J732J471R89J28n18j69O38N07o46
56643A93659j316o64L09L88k47o86o64m88k59J51O33Q61O27m5q86j458j519j300
56625A87096j221j416j740k025k116j905j543j292j023l93L08K79m92r28m01L05
56609A71493L34Q4L28Q01P98M61L44L20M0p2M90J084P55r9j73P52J574J582J186
56590A82082Q83O00K92K17M13N58M97L56J59m8O4O77J242J086L93qL47J231K144
$$ plain form
56713 160061 160641 160924 161245 161378 161121 161119 162033 163375 164369 165439 167424 169732 170930 170984 171239 172115 172548 171947
56695 171947 171096 170642 170204 169548 169302 169831 170557 171048 171746 173046 174564 175848 176986 178056 178885 179710 181175
56678 181175 183299 185336 186959 188582 190216 191140 191201 191284 191920 192466 192334 191963 191824 191407 190162 188693 188085
56661 188085 188548 189425 190037 189941 188965 187631 187057 187857 189527 191259 192730 193719 193847 193329 193160 193798 194305 193659
56643 193659 192343 191679 191988 192376 192129 191443 190779 190291 190032 190183 190816 191677 192304 192259 191373 189915 188396 187096
56625 187096 185875 184459 182719 180694 178578 176673 175130 173838 172815 172422 172730 173009 172517 171589 171188 171493
56609 171493 171827 171911 172239 173040 173838 174299 174643 174963 175003 174931 175421 176505 177260 177161 176988 177740 179314 180896 182082
56590 182082 182965 183565 183857 184074 184487 185045 185542 185898 186057 186009 186073 186750 187992 189078 189471 189463 189810 191041 193185
56571A93185K560K216J631J859L208M767N719O365P205P949Q244Q559R350J0154
56557B72971J0417J0364R994Q296M729O24k300l927m923m996l759k414k580l837
56543B88659m371l691k876k510k252k272l104m132m087l124k566k549j862k82
56529B48981Q85R27O07M19k03j387k198k168j974k009j777j232j248k041k526
56514B33056j996j200j035j367j799k444l181l223k214q47J31P23R95O33l16j137
56498B14779j357j173p82k14l3r46k385k719j414J76P68O80P69R45O39q3p02r01
56480B06047n08N34J709K159J781J376J353J158M13k84k85J60M79O65J004J419
56464B19180J515J019nj104j590j291r12j090j394j045k95o9m08m54J46R09J505
$$ plain form
56571 193185 195745 197961 199592 201451 204659 209426 215145 221510 228715 236664 244908 253467 262817 272971
56557 272971 283388 293752 303746 312042 316771 317395 315095 311168 306245 301249 297490 295076 292496 288659
56543 288659 284288 280597 277721 275211 272959 270687 267583 263451 259364 256240 253674 251125 249263 248981
56529 248981 249866 250793 251400 251819 251616 250229 248031 245863 243889 241880 240103 238871 237623 235582 233056
56514 233056 231060 229860 228825 227458 225659 223215 220034 216811 214597 213750 213881 214604 215599 216232 215916 214779
56498 214779 213422 212249 211467 211253 211220 210274 207889 205170 203756 203932 204700 205380 206149 207094 207733 207650 206948 206047
56480 206047 205539 206073 207782 209941 211722 213098 214451 215609 216022 215738 215453 215613 216092 216757 217761 219180
56464 219180 220695 221714 221709 220605 219015 217724 216812 215722 214328 213283 212988 212919 212511 212057 212203 213112 214617
56447B14617J951J980J392R10J323K015J759Q41O72J313J299J67p22m88j0j64
56431B28855m75l68k83n69o17j8N84O63O37P84N30l17q13k75O08R43Q83Q86P75
56412B32413L98K64O61R78P18L13K29J47k07k86L76J287J688J476Q33j78j073
56395B40037r09N31K118K637K039J062L45L19J080K013K232J690J074O02o2o60
56379B56148m22N04J015P41M08K91j60q05n43P70J799J749J443J632J827J593
56363B67990J493J809J830J265R55J187R72n4o12J04Q79N03j30M92K091L167L141
56346B87082K440J395L51P3Q01J592J661J579K095K763K843K675K929L346L358
56331C16983L194L301L362K952K457K446K841L409M235N008M836L597K402J935
$$ plain form
56447 214617 216568 218548 219940 220850 222173 224188 225947 226788 227460 228773 230072 230239 229517 229029 229019 228855
56431 228855 228380 228012 227729 227160 226543 226525 227109 227772 228409 229193 229723 229406 228593 228318 228926 229869 230752 231638 232413
56412 232413 232811 233075 233736 234714 235432 235745 235974 236121 235914 235628 236004 237291 238979 240455 241288 241110 240037
56395 240037 239128 239659 241777 244414 246453 247515 247860 248179 249259 251272 253504 255194 256268 256870 256808 256148
56379 256148 255726 256230 257245 257986 258394 258685 258525 257720 257177 257947 259746 261495 262938 264570 266397 267990
56363 267990 269483 271292 273122 274387 275342 276529 277501 277447 276835 276939 277818 278321 278191 278683 280774 283941 287082
56346 287082 289522 290917 291268 291341 292142 293734 295395 296974 299069 301832 304675 307350 310279 313625 316983
56331 316983 320177 323478 326840 329792 332249 334695 337536 340945 345180 350188 355024 358621 361023 362958
56317C62958J477L91o51q92o84m38L23J710K552K020J079J029J678K161K517L195
56301C80425L999M692N733P177P924P228N914M982M160L051K456L126M265M789
56287D49921N101O136P581Q473Q833R354J0120J0835J1529J2061J1802J0875J0638
56274E73259J1863J3555J4614J5444J6759J8123J9025K0179K2314K4814K6943
56263G76892K9213L2284L5676L8936M2798M7847N3377N8959O5661P4227Q3559
56252A339429R2609J02240J13398J24968J35376J44928J54556J63557J70610J75768
56242B717439J79364J80139J76626J69204J58735J44286J24499J00249P3789M6168
56232D070498J7554j0899l7735o2837q6263j06449j21662j32464j40623j46536
$$ plain form
56317 362958 364435 364826 364175 363283 362599 362161 362484 364194 366746 368766 369845 370874 372552 374713 377230 380425
56301 380425 384424 389116 394849 402026 409950 417178 423092 428074 432234 435285 437741 440867 445132 449921
56287 449921 455022 461158 468739 477212 486045 495399 505519 516354 527883 539944 551746 562621 573259
56274 573259 585122 598677 613291 628735 645494 663617 682642 702821 725135 749949 776892
56263 776892 806105 838389 874065 913001 955799 1003646 1057023 1115982 1181643 1255870 1339429
56252 1339429 1432038 1534278 1647676 1772644 1908020 2052948 2207504 2371061 2541671 2717439
56242 2717439 2896803 3076942 3253568 3422772 3581507 3725793 3850292 3950541 4024330 4070498
56232 4070498 4088052 4077153 4039418 3976581 3890318 3783869 3662207 3529743 3389120 3242584
56222C242584j49689j50530j49685j46462j40511j33764j28322j23373j16798
56213B003450j08841j01486r5127q8610q1953p6223p1225o5894o0525n6157n2237
56202A145172m7485m2473l8760l6046l2836k9433k7435k6565k4855k1915j9294
56191G98075j7604j5890j3954j2830j2676j2316j1104r397p375n174l813m046
56179F71896m824m711m057l875l597k242p35n05q13j00J041J064O30J537L345
56164F54054M238M429N435O784O863O487P935J0867J2863J3738J5602J8629K0712
56151G88636K1620K3652K7559L1371L4101L7263M1981M7627N4035O1933P0414
56140A240192P6982Q0909Q3946Q7094Q9365Q9997Q9063Q5557P7962O7334N7056
$$ plain form
56222 3242584 3092895 2942365 2792680 2646218 2505707 2371943 2243621 2120248 2003450
56213 2003450 1894609 1793123 1697996 1609386 1527433 1451210 1379985 1314091 1253566 1197409 1145172
56202 1145172 1097687 1055214 1016454 980408 947572 918139 890704 864139 839284 817369 798075
56191 798075 780471 764581 750627 737797 725121 712805 701701 692304 684929 679755 675942 671896
56179 671896 667072 662361 658304 654429 650832 648590 647855 647350 646537 646437 647478 648542 649172 650709 654054
56164 654054 658292 662721 668156 674940 681803 688290 696225 707092 719955 733693 749295 767924 788636
56151 788636 810256 833908 861467 892838 926939 964202 1006183 1053810 1107845 1169778 1240192
56140 1240192 1317174 1398083 1482029 1569123 1658488 1748485 1837548 1923105 2001067 2068401 2125457
56129B125457M9113M3077L8732L6447L4705L0556K3210J4561N951k713j0699j6662
56117B371735k1456k7673l6109m5627n6230o8716q1262r0130r4178r5147r3470
56106A661737q7719p8631o9513o1811n4050m5822l8989l3980k8847k3038j8468
56095A120869j5855j3510j0645q378o724m183j074M45K91P25K158K676K249L138
56081A072182N417O481N945O535R036J0775J0418R931J0491J0778J0589J1827
56069A180405J4486J5934J5497J5532J6854J7436J6758J6825J7807J7418J5741
56058A360693J5631J7233J7364J5561J5232J7204J7926J6026J4908J6546J8328
56047A542652J8458J9004K1058K2283K1811K2283K4555K5768K4993K5299K7875
$$ plain form
56129 2125457 2174570 2217647 2256379 2292826 2327531 2358087 2381297 2395858 2401809 2399096 2388397 2371735
56117 2371735 2350279 2322606 2286497 2240870 2184640 2115924 2034662 1944532 1850354 1755207 1661737
56106 1661737 1574018 1495387 1425874 1364063 1310013 1264191 1225202 1191222 1162375 1139337 1120869
56095 1120869 1105014 1091504 1080859 1072481 1065757 1061574 1060500 1060945 1061236 1061961 1064119 1066795 1069044 1072182
56081 1072182 1077599 1084080 1090025 1096560 1105596 1116371 1126789 1136720 1147211 1157989 1168578 1180405
56069 1180405 1194891 1210825 1226322 1241854 1258708 1276144 1292902 1309727 1327534 1344952 1360693
56058 1360693 1376324 1393557 1410921 1426482 1441714 1458918 1476844 1492870 1507778 1524324 1542652
56047 1542652 1561110 1580114 1601172 1623455 1645266 1667549 1692104 1717872 1742865 1768164 1796039
56036A796039K9915L0639L3344L8864M3247M4746M6761N0877N3554N2971N2514
56025B273471N3999N4092N1166M9081N0260N1608N1235N2468N7019O0991O1997
56014B867387O3533O8006P2253P4303P7476Q3335Q7785Q8739R0373R5157R9358
56003C767705J01096J04797J12690J20129J24602J30733J41031J50652J57010
55994D910445J65174J77638J88675J95431K04432K19981K36449K49591K64792
55985F812608K86052L07948L27132L50513L82874M17960M51233M89472N37831
55976A0363623N90150O42733P04551P82720Q71811R69278J086717J233588J405905
55967A8651076J604521J847302K148625K505373K918965L411083M000926M690050
$$ plain form
56036 1796039 1825954 1856593 1889937 1928801 1972048 2016794 2063555 2114432 2167986 2220957 2273471
56025 2273471 2327470 2381562 2432728 2481809 2532069 2583677 2634912 2687380 2744399 2805390 2867387
56014 2867387 2930920 2998926 3071179 3145482 3222958 3306293 3394078 3482817 3573190 3668347 3767705
56003 3767705 3868801 3973598 4086288 4206417 4331019 4461752 4602783 4753435 4910445
55994 4910445 5075619 5253257 5441932 5637363 5841795 6061776 6298225 6547816 6812608
55985 6812608 7098660 7406608 7733740 8084253 8467127 8885087 9336320 9825792 10363623
55976 10363623 10953773 11596506 12301057 13083777 13955588 14924866 16011583 17245171 18651076
55967 18651076 20255597 22102899 24251524 26756897 29675862 33086945 37087871 41777921
55959D1777921N488386O429205P538011Q819184J0300646J2057477J4161224J6646113
55951A23218167J9551733K2915229K6616489L0235796L3095149L4348608L2956910
55944C22938081K7814079J8404223N652390q003038j9717996k7668722l1601152
55937B87817865l2312194l0858667k8156482k4918235k1634783j8564956j5814083
55930A15558465j3432414j1432012r770501q384148p231486o282424n491556m814430
55922D8719494m233400l742556l323029k954541k635137k368214k143202j946943
55914B5372472j780561j647572j537394j436668j345390j266655j191766j110734
55906A4055732j027604r51080q78932q05073p33349o70869o15098n59926n07689
$$ plain form
55959 41777921 47266307 53695512 61233523 70052707 80353353 92410830 106572054 123218167
55951 123218167 142769900 165685129 192301618 222537414 255632563 289981171 322938081
55944 322938081 350752160 369156383 374808773 366805735 347087739 319419017 287817865
55937 287817865 255505671 224647004 196490522 171572287 149937504 131372548 115558465
55930 115558465 102126051 90694039 80923538 72539390 65307904 59025480 53533924 48719494
55922 48719494 44486094 40743538 37420509 34465968 31830831 29462617 27319415 25372472
55914 25372472 23591911 21944339 20406945 18970277 17624887 16358232 15166466 14055732
55906 14055732 13028128 12077048 11198116 10393043 9659694 8988825 8373727 7813801 7306112
55897G306112m63728m25516l87988l53445l25893l01622k75339k49931k30539
55888D292111k14574j96823j79132j65877j54847j41497j27696j17643j09389
55879B884633r8626q7023p9082p4498p0762o9400p2467p6559p7269p6064p6290
55868B026593p6162p2328o6663o2880n9716n3972m7028m2141l8360l3255k8569
55857A445519k7164k7279k5660k3519k3744k5056k4639k3833k5503k8284k8986
55846A161852k8222k8379k8514k6515k3977k3585k3943k2121j9183j8085j8237
55835I01091j7138j5378j5097j5423j4231j2539j2512j2994j1671r761r935j1357
55823G43055j1350j0219j0041j0430r843r227j0082j0836r437p547p692q330o445
$$ plain form
55897 7306112 6842384 6416868 6028880 5675435 5349542 5047920 4772581 4522650 4292111
55888 4292111 4077537 3880714 3701582 3535705 3380858 3239361 3111665 2994022 2884633
55879 2884633 2786007 2698984 2619902 2545404 2474642 2405242 2332775 2256216 2178947 2102883 2026593
55868 2026593 1950431 1878103 1811440 1748560 1688844 1634872 1587844 1545703 1507343 1474088 1445519
55857 1445519 1418355 1391076 1365416 1341897 1318153 1293097 1268458 1244625 1219122 1190838 1161852
55846 1161852 1133630 1105251 1076737 1050222 1026245 1002660 978717 956596 937413 919328 901091
55835 901091 883953 868575 853478 838055 823824 811285 798773 785779 774108 764347 754412 743055
55823 743055 731705 721486 711445 701015 691172 681945 671863 661027 651590 644043 636351 628021 621576
55810F21576l171j886k354j744r0K29n31J62K441M211N204O624P550O045L168
55795F47434J663J282m76l609n756o584p925r875j0636r992r352q656o855m954
55781E65709n015o523p176o788o885p147n859l444j797n25K510P157J1013J3100
55767E48330J3963J2538O943j510q789j3041j5729j7867j8576j7764j6890j6447
55755D55161j5529j4257j3915j4416j4327j3539j3224j3244j2318j0681r706q955
55743C01050o657l149q19l28J01J372K338K408K508K864K398R08m68j348k463
55728C00715l685m024l697l955m668m460l359k888l398l606k907j892n48J597
55714B59225L562L723K642K595M144N667O303O652O418M343R67j300j659j960
$$ plain form
55810 621576 618405 616519 614165 612421 612331 612560 612029 612191 614632 618843 624047 630671 638221 644266 647434
55795 647434 649097 650379 649903 646294 640538 633954 626029 616154 605518 595526 586174 577518 570663 565709
55781 565709 560694 554171 546995 540207 533322 526175 520316 516872 515075 514550 517060 524217 535230 548330
55767 548330 562293 574831 581774 580264 571475 558434 542705 524838 506262 488498 471608 455161
55755 455161 439632 425375 411460 397044 382717 369178 355954 342710 330392 319711 310005 301050
55743 301050 294393 291244 290425 290097 290198 291570 293908 296316 298824 301688 304086 304994 304526 303178 300715
55728 300715 297030 293006 289309 285354 280686 276226 272867 269979 266581 262975 260068 258176 257628 259225
55714 259225 262787 266510 269152 271747 275891 281558 287861 294513 300931 305274 306241 304941 303282 301322
55700C01322l500n311o389p204q027p945o605n059m015l036k034j755k130j974
55686B36338r28Q8P65J863L418M377M474M580M829M302L082K479K675K196M67
55671B75005j107j376r65p57o33m67p19j235r83K42J262J295R68J017J310J570
55655B74427J853J981J732J669K358K916J918k55j815k200k449k995l164l089
55641B72887l841n298n991n576n394o019o400n966n586n645n242l988k781k089
55627B03071j372q07j457l001l467k169q27p37r74n78m23j332k199j764q03q72
55611A80289j965k911l203l117k814k397k196k190j874j301j191j561j423m59
55597A51687L23K62L0J98J63n65j267j162n80j60J33M08K96j99l41J64N73L71
$$ plain form
55700 301322 297822 292511 286122 278918 270891 262946 256341 251282 247267 244231 242197 240442 238312 236338
55686 236338 235410 235498 236263 238126 241544 245921 250395 254975 259804 264106 267188 269667 272342 274538 275005
55671 275005 273898 272522 271557 270800 270167 269700 268981 267746 266763 267005 268267 269562 270530 271547 272857 274427
55655 274427 276280 278261 279993 281662 284020 286936 288854 288599 286784 284584 282135 279140 275976 272887
55641 272887 269046 263748 257757 252181 246787 240768 234368 228402 222816 217171 211929 207941 205160 203071
55627 203071 201699 200892 199435 196434 192967 190798 189971 189234 188260 187682 187259 185927 183728 181964 181161 180289
55611 180289 178324 175413 172210 169093 166279 163882 161686 159496 157622 156321 155130 153569 152146 151687
55597 151687 152010 152272 152302 152500 152663 152098 150831 149669 149089 148929 149062 149470 149766 149567 149226 149390 149963 150334
55579A50334J00L88J057J693K174K260J737J282J955L494M434M274L974M001L503
55564A86660K110R21P86R75M30q92k547m204n156m593k994j879j690j405o53l89
55548A65480q74r76l00o3p72j060m0J096J247J224J804J900N40r35p74L66O31
55531A68494r4n27m18n71j012j068r32j406k344k836k703k511k363j984j606j598
55515A44521j591j146q33j412k364k457j559p42p17j209j661j678j051j17K28
55500A26212l85j148j175p11m82m54j77K38L62K73K65K41R3J02K88M5p68j231
55482A21588p46j98n91j299r36M88J637J725J189O77L94K92J30m94j495k073j763
55465A18525j203j104j119o02J37L91L19N16P23J41j138k033j848r29nM74M89
$$ plain form
55579 150334 150434 150822 151879 153572 155746 158006 159743 161025 162980 166474 170908 175182 179156 183157 186660
55564 186660 188770 189691 190477 191452 191882 190990 188443 184239 179083 174490 171496 169617 167927 166522 165869 165480
55548 165480 164606 163630 163330 163267 162495 161435 161395 162491 163738 164962 166766 168666 169206 168271 167497 167863 168494
55531 168494 168400 167873 167455 166884 165872 164804 163872 162466 160122 157286 154583 152072 149709 147725 146119 144521
55515 144521 142930 141784 140951 139539 137175 134718 133159 132417 131700 130491 128830 127152 126101 125984 126212
55500 126212 125827 124679 123504 122793 122311 121857 121680 121918 122280 122553 122818 123059 123152 123254 123542 123587 122819 121588
55482 121588 120842 120644 120053 118754 117818 118306 119943 121668 122857 123534 123928 124220 124350 123856 122361 120288 118525
55465 118525 117322 116218 115099 114497 114634 115025 115344 115860 116583 116724 115586 113553 111705 110776 110771 111245 111734
55448A11734M39P40J134Q69n5o01k04K92J4m92j91P57J391J434J252Q05j12r53
55430A18253r00j31M23M22L44M98P15Q85R72O75j49r38j007m94o4Q3J74J71j15
55411A19817m44m46k57k78n19p63j029j276j096l57K85K14k38m29m20n84o75k61
55393A11244L68N71L37R7r7m00n29j90K51K85J11J34J21k94o61l05M22N73Rn76
55373A11471q44j021j063o47QK43o4m18n20n02l75QM63O41O29Q36J380K028K540
55354A14793K612J882N54m19m35p4k00p43j094j210j363j286n68L79P36M00j88
55337A13776r41j843k197j312J72Q72M93L9J54L55J22k36j77L20R25J329J331
55320A13182R56N28K98J38m3J0L71N35K20L2N55J195R01l28j499j985j887j393
$$ plain form
55448 111734 112173 112913 114047 114916 114861 114260 114056 114348 114362 113870 113679 114436 115827 117261 118513 119318 119206 118253
55430 118253 117353 117222 117645 118067 118411 118909 119624 120509 121481 122156 122007 121069 120062 119568 119504 119587 119761 119932 119817
55411 119817 119373 118927 118670 118392 117873 117110 116081 114805 113709 113352 113637 113851 113613 113184 112764 112180 111505 111244
55393 111244 111612 112183 112520 112617 112520 112120 111591 111401 111652 111937 112048 112182 112303 112009 111348 111043 111465 112038 112047 111471
55373 111471 110627 109606 108543 107896 107904 108147 108083 107665 107145 106643 106268 106276 106739 107380 108009 108845 110225 112253 114793
55354 114793 117405 119287 119841 119422 118987 118913 118713 117970 116876 115666 114303 113017 112449 112828 113564 113964 113776
55337 113776 112835 110992 108795 107483 107655 108527 109020 109059 109213 109568 109690 109454 109277 109597 110522 111851 113182
55320 113182 114138 114666 114964 115102 115059 115069 115440 115975 116195 116227 116782 117977 118878 118550 117051 115066 113179 111786
55302A11786o76k69n57r76o39L14Q86O73K27L0k8q6l1J29K14J99J41l1j80J87
55282A11313J131J758J279J43o37q40q69p21j92L04K70J05M56Q99N15m77r72o82
55264A12783l66l43j51K60K79j66l62k0L04K79K90N55P68Q37J084J453J346N90
55246A19420k37o85r44j245j409j243p66q8N27N68n2m97K1J040J442J003L86o1
55228A17180m58n86j43K90k00j367j992j583p65r9L38K75n16j323j125j75L97
55211A08148N03J040J962K151J466J105J420J217l1j008o37J86R0p55j262j051
55195A14544m04M68J154R94J10l54J21N37K3p38p48l28k80l50J31Q21R11O08P84
55176A18004J391J531R14J44l54o89q26m96J35M84L67J50R6R4P8J65L53N18O39
$$ plain form
55302 111786 111110 110841 110284 109308 108669 108983 109869 110542 110769 110799 110771 110685 110654 110783 110997 111196 111337 111306 111126 111313
55282 111313 112444 114202 115481 115624 114987 114147 113278 112557 112365 112669 112939 113044 113500 114399 114914 114437 113465 112783
55264 112783 112417 112074 111923 112183 112462 112296 111934 111914 112218 112497 112787 113342 114110 114947 116031 117484 118830 119420
55246 119420 119183 118498 117554 116309 114900 113657 112891 112803 113330 113898 113846 113349 113370 114410 115852 116855 117241 117180
55228 117180 116722 116136 115993 116283 116083 114716 112724 111141 110376 110277 110615 110890 110374 109051 107926 107751 108148
55211 108148 108651 109691 111653 113804 115270 116375 117795 119012 118981 117973 117336 117522 117612 116857 115595 114544
55195 114544 114140 114608 115762 116756 116866 116512 116633 117170 117193 116455 115707 115379 115099 114749 114880 115701 116612 117220 118004
55176 118004 119395 120926 121840 121984 121630 120941 120115 119619 119754 120238 120605 120755 120851 120945 121023 121188 121541 122059 122698
55157A22698P74Q10N98K48Pm2LP4J33J48J49J96K39K02J80K23L6o50j487j847
55137A22692j646j275q11m6P48R22N00K34M05M36j6m67m48j76M4K14J32o25j705
55118A19112j886o39R99J746J540J102P39L71J03M4K0NK86P30O40q4m46K34J113
55099A25729R70l6p48o03nN67R09P81J48m22k93M13J113J545J711J374M01o36
55081A32918r33m65J11L39K74P8q4J07P64J402J400P63k7o73j126j184o34K73
55063A33303J001J316J258O91n68k116l000k553j087L37Q00K91l90n43k99j85
55047A28256k88l81o37j380k101j747k68J036J250R98J240J745J645Q30l1n10
55031A29657o06k70M50J056J055O08K26R7J67M94R23Q39j36j390j929j515o99
$$ plain form
55157 122698 123472 124282 124880 125128 125135 125093 125096 125170 125303 125451 125600 125796 126035 126237 126417 126640 126676 126026 124539 122692
55137 122692 121046 119771 118960 118914 119662 120584 121084 121318 121723 122159 122143 121676 121228 121052 121096 121310 121442 120817 119112
55118 119112 117226 116587 117586 119332 120872 121974 122713 123084 123187 123231 123251 123256 123542 124272 124912 124828 124382 124616 125729
55099 125729 126699 126663 125915 125312 125307 125874 126783 127564 127712 127290 126997 127410 128523 130068 131779 133153 133554 132918
55081 132918 131985 131520 131631 131970 132244 132322 132238 132345 133109 134511 135911 136674 136647 135974 134848 133664 133030 133303
55063 133303 134304 135620 136878 137569 137001 134885 131885 129332 128245 128582 129382 129673 129283 128740 128441 128256
55047 128256 127968 127587 126950 125570 123469 121722 121454 122490 123740 124738 125978 127723 129368 130198 130167 129657
55031 129657 129051 128781 129231 130287 131342 131950 132176 132273 132440 132934 133857 134696 134560 133170 131241 129726 129027
55014A29027KM16M78K60M5QPL7M40J249J788J478O62Q2j22k76n04p42j052j353
54994A31930j163l00O31R84R03Q51P15K09l41l71o4Pj52k9L98O28M98L98N73Q46
54974A37151R82Q96N47O9k11k30l45o12m40M47J284J300R56J153J596J137l34
54957A45346j566j612q47j43J33K8k72m04n5N11O63K81j49k84k20j7L95P72O66
54938A43226J78p1J08J60k45o12l04N36J246J565J882K645L719M386M004K802
54922A65225J895K324M122O368Q056Q627P982O391M406K555J018l09j615l072
54908B13973m652n941o402n992n217m476l798l316l332l647l477k486j346p72
54894A59119o70o96r13j261j104j75O68O19L22R42K297L061K714K171K420L475
$$ plain form
55014 129027 129029 129445 129923 130183 130228 130236 130243 130280 130720 131969 133757 135235 135897 135979 135857 135581 135077 134335 133283 131930
54994 131930 130767 130467 131098 132082 132985 133836 134551 134760 134419 134048 133984 133991 133839 133810 134208 134836 135334 135732 136305 137151
54974 137151 138133 139029 139576 139645 139434 139204 138859 138247 137807 138254 139538 140838 141794 142947 144543 145680 145346
54957 145346 143780 142168 141321 141178 141311 141339 141067 140663 140608 141119 141782 142063 141914 141630 141410 141393 141788 142560 143226
54938 143226 143404 143333 143441 143601 143356 142744 142440 142976 144222 145787 147669 150314 154033 158419 162423 165225
54922 165225 167120 169444 173566 179934 187990 196617 204599 210990 215396 217951 218969 218660 217045 213973
54908 213973 209321 203380 196978 190986 185769 181293 177495 174179 170847 167200 163723 161237 159891 159119
54894 159119 158449 157753 156840 155579 154475 154300 154968 155587 155909 156851 159148 162209 164923 167094 169514 172989
54878A72989M779N805O190N907N415N115M809M149L274K326Q10j661m340o039
54864B09528o578o594o253n289m114l564l565l312k839l033l866m016k826j324
54850A52355o56o28n95p52j538k397k313j271l01j40n12q05r08j169j750k238
54834A34382k007r70K34Q88Q64M63lj92J74Q09Q77J48m22jP52O22k96p65k98L27
54814A35586N08N36P28Q46O72L27j71q19j118n29M73Q79P09R67J785J937O85j008
54796A42993j735j197J7J259J906J469L35m05l12n3j17n6M48P70L64k47l37jL57
54777A45458Q58J654K264K292K222K634L237L510L708M370N259N746N884O178
54763A95274O566O501N891N181M567L774K507O76j672m114n814o289n975n614
$$ plain form
54878 172989 177768 183573 189763 195670 201085 206200 211009 215158 218432 220758 221568 219907 215567 209528
54864 209528 202950 196356 190103 184814 180700 177136 173571 170259 167420 164387 160521 156505 153679 152355
54850 152355 151699 151071 150476 149724 148186 145789 143476 142205 141904 141764 141252 140447 139539 138370 136620 134382
54834 134382 132375 131405 131639 132527 133391 133854 133851 133659 133833 134642 135519 135667 135245 135244 135996 136618 136322 135557 135259 135586
54814 135586 136094 136630 137358 138204 138876 139203 139032 138213 137095 136566 137039 137918 138627 139594 141379 143316 144001 142993
54796 142993 141258 140061 140078 141337 143243 144712 145047 144642 144330 144277 144160 144104 144552 145322 145686 145439 145102 145101 145458
54777 145458 146316 147970 150234 152526 154748 157382 160619 164129 167837 172207 177466 183212 189096 195274
54763 195274 201840 208341 214232 219413 223980 227754 230261 230937 229265 225151 219337 213048 207073 201459
54749B01459n422n260n147n057m569l472k270j537j149q32r10j670k365j979p83
54734A59037m7k18m25N0Q36J353J797K583L467L857L731L727M335N400O334O661
54718B02478O297N427M218K742J103n04j977l348m565n387n655n480n092m640
54704A85617m279m106l936l384k421j539j168j144j008o14k22k11q02j805k517
54689A56461k318j487j016j317j610r94K91J175J005N0r66j406j048l21m1m90
54673A45968r96p77K4O32O87N21N32P33Q99P16r4j434k610k863k139j075l31j03
54655A38290k26l53j69L47Q55J003Q13N66M77N94Q68J101J054O86K05k45o15p19
54637A44532l38K85N63K99r8k79l61m12j63M37Q94Q38M40r5q73j653j719r61l82
$$ plain form
54749 201459 196037 190777 185630 180573 176004 172532 170262 168725 167576 166744 165834 164164 161799 159820 159037
54734 159037 158990 158772 158347 158397 159233 160586 162383 164966 168433 172290 176021 179748 184083 189483 195817 202478
54718 202478 208775 214202 218420 221162 222265 221761 219784 216436 211871 206484 200829 195349 190257 185617
54704 185617 181338 177232 173296 169912 167491 165952 164784 163640 162632 162018 161796 161585 160783 158978 156461
54689 156461 154143 152656 151640 150323 148713 147719 148010 149185 150190 150240 149274 147868 146820 146499 146458 145968
54673 145968 144972 144195 144219 144851 145538 146059 146591 147324 148223 148939 148845 147411 144801 141938 139799 138724 138393 138290
54655 138290 138064 137711 137542 137889 138744 139747 140560 141126 141603 142197 143065 144166 145220 145906 146111 145866 145251 144532
54637 144532 144194 144479 145042 145341 145243 144964 144603 144191 144028 144465 145359 146197 146637 146542 145669 144016 142297 141336 140954
54618A40954o81j085n45N55J107J159J666K558K607J419J72j30M9j25n17n37k30
54601A48396j0J29L77M84J34l38l52K6K00pj64n3l6l97q10p87l86j50l52o30m91
54580A44783M8M60L85K1k11k28k36k32Q4P49J212R36J71k30Q8M81J60o62r78k92
54560A46509P76J345J296J040P36K54k70m70l16j29RL56R20J307J292J120J016
54543A56791Q28M31K0k08l61n51o31m67j82R3L73N62M03m8l08j25J07j10o75j081
54523A54861j055p58n47o64r23p31K36J390J825J512J213J125O26l78q99l70L50
54506A56813K78k08k57j40o66j507j546o93j8l9j44O5J04k72m08J53P43M96l98
54487A52356j004q42j77N72J150J414J394J299J190Q49K77L6O53J751K316J865
$$ plain form
54618 140954 140273 139188 138643 139198 140305 141464 143130 145688 148295 149714 149886 149756 149805 149680 149163 148626 148396
54601 148396 148386 148515 148892 149376 149510 149172 148820 148846 149046 149039 148875 148822 148786 148389 147579 146792 146406 146256 145904 145274 144783
54580 144783 144831 145291 145676 145697 145486 145258 145022 144790 144874 145623 146835 147771 147942 147712 147800 148281 148441 147779 146801 146509
54560 146509 147285 148630 149926 150966 151702 151956 151686 151216 150900 150771 150780 151136 152056 153363 154655 155775 156791
54543 156791 157619 158050 158070 157862 157501 156950 156319 155852 155670 155763 156136 156698 157101 157053 156745 156620 156727 156617 155942 154861
54523 154861 153806 153048 152501 151837 150914 150183 150419 151809 153634 155146 156359 157484 158110 157732 156833 156463 156813
54506 156813 157091 156883 156626 156486 155820 154313 152767 152074 152056 152017 151873 151938 152042 151770 151362 151515 152258 152754 152356
54487 152356 151352 150510 150333 150905 152055 153469 154863 156162 157352 158201 158478 158514 159167 160918 163234 165099
54471A65099J012O41Q27R66P48N63Q00J197J234R12P06Q97J333J733J802J180
54455A81650q5j142j135m01p8m75p41m50l65r98j493r35K6P7q09j456j314r62
54437A68914q54o90k61O1Pj32j07j29l86n87l51K33P07P72N57M38N98P79O87N34
54417A70790P63J146Q86j11q42o41j94l59p20l47N60R71O51L14K89K28O0J59M61
54398A74064M65J78J03K70K91L16Q55J539J399N52K56Q76J179L30o94o54J10M74
54380A81909K77J46J36k05p11o05L49J451J865J379M38j13M25J899L326L935L913
54363A99814L773L466K672J660J071R70O84k40j442k146k000j363r68j265j981
54348B02705k415k205j695j492j848k504k971k866k241j556j119o52J60Q82O97
$$ plain form
54471 165099 166111 166752 167579 168545 169293 169856 170656 171853 173087 173999 174705 175602 176935 178668 180470 181650
54455 181650 181565 180423 179288 178887 178809 178334 177593 177143 176778 175780 174287 173352 173378 173455 172646 171190 169876 168914
54437 168914 168060 167370 167109 167170 167177 167045 166938 166809 166423 165836 165485 165718 166425 167197 167754 168192 168790 169569 170256 170790
54417 170790 171553 172699 173585 173474 172632 171991 171797 171438 170718 170371 170931 171902 172553 172867 173156 173384 173444 173603 174064
54398 174064 174529 174707 174810 175080 175371 175687 176542 178081 179480 180032 180288 181164 182343 182673 181979 181325 181435 181909
54380 181909 182186 182332 182468 182263 181552 180947 181296 182747 184612 185991 186429 186316 186741 188640 191966 195901 199814
54363 199814 203587 207053 209725 211385 212456 213426 214110 213870 212428 210282 208282 206919 205951 204686 202705
54348 202705 200290 198085 196390 194898 193050 190546 187575 184709 182468 180912 179793 179141 179301 180183 180880
54333A80880l25j051o81K24N90J87k75j75M11R50R92N29Pj43J4Q2p4k13j54K3
54313A81798K25L39O3p00j376j256n50j90m84p71o10m10n41o91o14o67j064j299
54295A71202r88n29k67K76J447K435K190J049L47O69J333J507J049K72l58l34
54279A81300L66R29N02p41j868k374k441k162j402l93L06O46J186K119K895K997
54263A81865K567J921J054Jp56p54j85K91K61j14l67k10J44J47m38j028p59M26
54245A84066J607J952J583J091O12j32j059j579j393r76r33j196j170o23K1L37
54229A82208L82L79K31k23p49r44p49l51K32J021J619J530R56O42Q03Q12K22n59
54211A87462r56r65q20m66O9K92j51p63p86k55J60J42KOP6J87M49P25O44J69k53
$$ plain form
54333 180880 180555 179504 178823 179047 179637 179824 179549 179374 179785 180735 181727 182256 182263 182120 182134 182216 182142 181929 181775 181798
54313 181798 182023 182362 182425 181725 180349 179093 178543 178353 177869 177098 176488 176078 175537 174846 174232 173565 172501 171202
54295 171202 170214 169685 169418 169694 171141 173576 175766 176815 177162 177831 179164 180671 181720 181992 181634 181300
54279 181300 181666 182595 183097 182356 180488 178114 175673 173511 172109 171716 172022 172668 173854 175973 178868 181865
54263 181865 184432 186353 187407 187408 186652 185898 185713 186004 186265 186151 185784 185574 185718 185865 185427 184399 183640 184066
54245 184066 185673 187625 189208 190299 190911 190779 189720 188141 186748 185772 184839 183643 182473 181850 181871 182208
54229 182208 182590 182969 183200 182977 182228 181284 180535 180184 180416 181437 183056 184586 185542 186184 186987 187799 188021 187462
54211 187462 186506 185541 184721 184255 184324 184616 184465 183702 182916 182661 182821 182963 182965 182971 183047 183234 183683 184408 185052 185221 184968
54190A84968k22J82N93P02L93j72n34k81M51J022R25K82l35m42MO22R54Q37M56
54171A90405R7j5K73Q85J277P91m98j631j786j193o73n70n76m18k00n9N5J72K03
54152A86539J03l3q1K3K15K57r6o84j006r27r42j380j673j054K57J168J053L60
54134A82099j97m41n41n39m06k04J18Q21J882K662K442J295J46j94J73M84L02
54117A89902m3k0L79P40R42J264J779K109K078K107K541K957K744K085J751J964
54101B15279K192K103K079K397K594K120J227N85K34m29j619k729l096k728k010
54086B18199j080J2Q21Q61M24M50J278K085J979J224Q39J170J575J429Q97N21
54070B32684N21O89O55J03r72k125k841l033k885k373j412m59k60p93j133o82
$$ plain form
54190 184968 184746 184928 185521 186223 186616 186444 185910 185629 186080 187102 188027 188309 187974 187532 187536 188158 189112 189949 190405
54171 190405 190502 190487 190760 191645 192922 193713 193215 191584 189798 188605 187932 187362 186786 186368 186168 186109 186164 186336 186539
54152 186539 186642 186609 186528 186551 186766 187023 186927 186243 185237 184310 183368 181988 180315 179261 179518 180686 181739 182099
54134 182099 181902 181461 180920 180381 179975 179771 179889 180710 182592 185254 187696 188991 189137 188943 189116 189600 189902
54117 189902 189859 189839 190218 190958 191900 193164 194943 197052 199130 201237 203778 206735 209479 211564 213315 215279
54101 215279 217471 219574 221653 224050 226644 228764 229991 230576 230810 230381 228762 226033 222937 220209 218199
54086 218199 217119 217131 217952 218813 219237 219687 220965 223050 225029 226253 227092 228262 229837 231266 232163 232684
54070 232684 233205 233894 234549 234652 233680 231555 228714 225681 222796 220423 219011 218552 218292 217499 216366 215684
54054B15684RQ7m23p54l56P43K172L365L774L395K927K969L370L670L901M389
54038B48922N013N273N065M910N284O066O702O736O147N343M762M452M102L564
54024C22341L094K975L152L301L088K280J046J31K09R00J019Q6j122j814k303
54009C38383l244m384m897m654m371m632n298n806n664m828l923l720m085l956
53995B74921k861j785j841k613k804k144j544j576j827j858j817j897j909j709
53981B46736j425j118p07l68m22p50q08l56L07Q04R87Q19M60L46P34J254J488
53964B47981J787K815M397N639O212O718P687Q894R823J0049R063O521K938n02
53950C30022l106n018o324o598n750m510l590k846j799m73P50J747K635L438M061
$$ plain form
54054 215684 215693 215780 215357 214603 214247 214990 217162 220527 224301 227696 230623 233592 236962 240632 244533 248922
54038 248922 253935 259208 264273 269183 274467 280533 287235 293971 300118 305461 310223 314675 318777 322341
54024 322341 325435 328410 331562 334863 337951 340231 341277 341408 341617 342517 343536 343622 342500 340686 338383
54009 338383 335139 330755 325858 321204 316833 312201 306903 301097 295433 290605 286682 282962 278877 274921
53995 274921 272060 270275 268434 265821 263017 260873 259329 257753 255926 254068 252251 250354 248445 246736
53981 246736 245311 244193 243486 243118 242696 241946 241138 240782 241089 241893 242880 243699 244159 244505 245239 246493 247981
53964 247981 249768 252583 256980 262619 268831 275549 283236 292130 301953 312002 321065 327586 330524 330022
53950 330022 326916 321898 315574 308976 303226 298716 295126 292280 290481 290008 290758 292505 295140 298578 302639
53935C02639M394M222L385K198J350J124J134J057J182J939L210M423N120N215
53921C42592M986M967N498O190O258N620N242O040P689Q921Q847P710O491N898
53907D32949N812N658N239M936M827M149K182n04k487l113k988k825k633k340
53893D48862k385l216m655o206p531q377q499q001p381o924o432n798n367n437
53879C62653n771n960n863n475m812m188m088m440m526l966l342l393m018m527
53865B98284m512m043l357k780k635k824k840k520k340k588k742k302j704j680
53851B59417j999j721o82J30p4q82j324j115q16r50j329j369q58k04M6j69m84
53834B45617o20n77l71O8O47J041J072Q62O01M21N53J161J913K087J340J45p74
$$ plain form
53935 302639 307033 311255 314640 316838 318188 319312 320446 321503 322685 324624 327834 332257 337377 342592
53921 342592 347578 352545 358043 364233 370491 376111 381353 387393 395082 404003 412850 420560 427051 432949
53907 432949 438761 444419 449658 454594 459421 463570 465752 465248 462761 459648 456660 453835 451202 448862
53893 448862 446477 443261 438606 432400 424869 416492 407993 399992 392611 385687 379255 373457 368090 362653
53879 362653 356882 350922 345059 339584 334772 330584 326496 322056 317530 313564 310222 306829 302811 298284
53865 298284 293772 289729 286372 283592 280957 278133 275293 272773 270433 267845 265103 262801 261097 259417
53851 259417 257418 255697 255015 255145 255071 254189 252865 251750 250934 249984 248655 247286 246428 246224 246270 246101 245617
53834 245617 244997 244420 244049 244117 244764 245805 246877 247739 248340 248761 249314 250475 252388 254475 255815 255960 255186
53817B55186j112r27l13N49J247J408J102P61Q06J415K466L613M439M724M511
53802B79875M076L869M260N083N621N387M740M360M378M482M592M795M848M460
53788C44826L891L532L083K023P57K07K68j65j391k434k702k942l818m719m848
53773C35568m561m616m857m634l994l537l424l418l507l797m065m033l835l616
53759B79674l128k230j374r88r03q62j039j478j705j547j621k195k410j590n70
53744B56034n41j173j213n26j04k80m10k67l75p49n81L55J135J029N00L72P01
53727B53907R49Q10M44K80P66J907L012L350L005K606K288J620N37m08q03p47
53711B73523l48M37J363J945K171K553L286L899L922L379K546J703J242J444K090
$$ plain form
53817 255186 254074 253147 252834 253383 254630 256038 257140 257901 258707 260122 262588 266201 270640 275364 279875
53802 279875 283951 287820 292080 297163 302784 308171 312911 317271 321649 326131 330723 335518 340366 344826
53788 344826 348717 352249 355332 357355 358112 358319 358587 358422 357031 354597 351895 348953 345135 340416 335568
53773 335568 331007 326391 321534 316900 312906 309369 305945 302527 299020 295223 291158 287125 283290 279674
53759 279674 276546 274316 272942 271954 271051 270189 269150 267672 265967 264420 262799 260604 258194 256604 256034
53744 256034 255493 254320 253107 252581 252477 252197 251787 251520 251145 250396 249815 250170 251305 252334 252834 253206 253907
53727 253907 254856 255666 256110 256390 257156 259063 262075 265425 268430 271036 273324 274944 275481 275073 274270 273523
53711 273523 273175 273612 274975 276920 279091 281644 284930 288829 292751 296130 298676 300379 301621 303065 305155
53696C05155K759L451M317M943M643L516K429J817J337P33K03k63r48j588j420
53681C31084m31L50K77j53m24r35j972k722k288j091k61jL10P85Q73N21L93P25
53663C25040Q66L43l07l19J68L02l06j138j422r24J0R22J537J738J498R22L06
53646C29236K2L59J216J986J940J081M25R34K225K925K423J528J146J096Q60P44
53630C50146J354K379K957K966L032L312L374L223L412L909M001L623L782M967
53616C96437O072N710M064K598K282K746L086K892K484K452L056L939M480M401
53602D46699L866L120K386K037K266K533J963M94r31j528j453j248j063q05m96
53587D57840j28L37N30k07j869l388l744l086k326k007k004k053k046j924j694
$$ plain form
53696 305155 307914 311365 315682 320625 325268 328784 331213 333030 334367 335100 335303 335040 334092 332504 331084
53681 331084 330653 331003 331280 331127 330703 329768 327796 325074 322786 321695 321434 321433 321743 322528 323401 323922 324315 325040
53663 325040 325906 326249 325942 325623 325791 326093 325787 324649 323227 322303 322313 323235 324772 326510 328008 328930 329236
53646 329236 329258 329617 330833 332819 334759 335840 336265 337199 339424 342349 344772 346300 347446 348542 349402 350146
53630 350146 351500 353879 356836 359802 362834 366146 369520 372743 376155 380064 384065 387688 391470 396437
53616 396437 402509 408219 412283 414881 417163 419909 422995 425887 428371 430823 433879 437818 442298 446699
53602 446699 450565 453685 456071 458108 460374 462907 464870 465364 464433 462905 461452 460204 459141 458336 457840
53587 457840 457712 458049 458579 458372 456503 453115 449371 446285 443959 441952 439948 437895 435849 433925 432231
53572D32231j418j089o70m01o05j095j277j065j107j742k314k042j045NP81J270
53556D18417J338R26M37K58J95q4l00J11J071J905K188K037J739J573J879K702
53540D36392L504L654L199K728K704L266M404N781O674O723O554P024Q131R266
53526E10004J0280J1456J2555J2927J2613J2444J2801J3167J3187J3376J4296
53515F49106J5702J7025J8106J9040J9761K0379K1387K2961K4412K4931K4657
53504H77467K4421K4627K4927K4866K4315K3323K2085K1126K0930K1248K1200
53493A130535K0260J8864J7794J7329J7223J7264J7441J7715J7927J7921J7659
53482A327932J7180J6664J6425J6629J7017J7047J6377J5040J3192J0948Q529
$$ plain form
53572 432231 430813 429724 429054 428653 428048 426953 425676 424611 423504 421762 419448 417406 416361 416366 417147 418417
53556 418417 419755 420681 421118 421376 421571 421487 421187 421298 422369 424274 426462 428499 430238 431811 433690 436392
53540 436392 439896 443550 446749 449477 452181 455447 459851 465632 472306 479029 485583 492607 500738 510004
53526 510004 520284 531740 544295 557222 569835 582279 595080 608247 621434 634810 649106
53515 649106 664808 681833 699939 718979 738740 759119 780506 803467 827879 852810 877467
53504 877467 901888 926515 951442 976308 1000623 1023946 1046031 1067157 1088087 1109335 1130535
53493 1130535 1150795 1169659 1187453 1204782 1222005 1239269 1256710 1274425 1292352 1310273 1327932
53482 1327932 1345112 1361776 1378201 1394830 1411847 1428894 1445271 1460311 1473503 1484451 1492980
53471A492980O293M428K732Q61j329l775o349q803j0740j1950j2656j3227j3703
53458A424762j3910j3926j4142j4775j5695j6688j7655j8429j8756j8653j8514
53447A243619j8675j8981j8952j8299j7158j5874j4633j3269j1547r572p773o344
53435A072542n019l650k637k229j750l20J733L053L061K772L325M550N611O488
53421A087530P875R922J1957J3514J4881J6492J8316K0040K1573K3060K4601K6113
53409A295874K7414K8426K9350L0520L2020L3592L5066L6608L8378M0242M2065
53398A669555M4033M6277M8475N0194N1432N2372N2878N2748N2379N2482N3128
53387B225953N3603N3299N2308N0991M9523M7967M6246M3896M0404L6094L2133
$$ plain form
53471 1492980 1499273 1503701 1506433 1507294 1505965 1502190 1495841 1487038 1476298 1464348 1451692 1438465 1424762
53458 1424762 1410852 1396926 1382784 1368009 1352314 1335626 1317971 1299542 1280786 1262133 1243619
53447 1243619 1224944 1205963 1187011 1168712 1151554 1135680 1121047 1107778 1096231 1086659 1078886 1072542
53435 1072542 1067523 1063873 1061236 1059007 1057257 1056937 1058670 1061723 1064784 1067556 1070881 1075431 1081042 1087530
53421 1087530 1095405 1105327 1117284 1130798 1145679 1162171 1180487 1200527 1222100 1245160 1269761 1295874
53409 1295874 1323288 1351714 1381064 1411584 1443604 1477196 1512262 1548870 1587248 1627490 1669555
53398 1669555 1713588 1759865 1808340 1858534 1909966 1962338 2015216 2067964 2120343 2172825 2225953
53387 2225953 2279556 2332855 2385163 2436154 2485677 2533644 2579890 2623786 2664190 2700284 2732417
53376B732417K9182K6577K3238J9035J4585J0090N218j3n111j0051j5493k1667
53364B808007k7694l2617l6543m0116m3236m5170m5831m6057m6482m6875m6914
53353B350472m6799m6630m5833m3956m1632l9930l9040l8353l7718l7638l8130
53342A894813l8304l7509l6206l5153l4304l3047l1158k8911k6514k4072k1935
53331A547700k0500j9575j8504j7004j5549j4780j4819j5344j6044j6760j7333
53320A361488j7545j7239j6402j5149j3687j2281j1126j0180r154p806o261m852
53308A219806l638k346q17O94J935L063M353N762P209R016J1500J4201J6206J7320
53294A304264J8323J9843K1513K2590K2902K2870K2918K3157K3439K3375K2624
$$ plain form
53376 2732417 2761599 2788176 2811414 2830449 2845034 2855124 2860342 2860329 2855218 2845167 2829674 2808007
53364 2808007 2780313 2747696 2711153 2671037 2627801 2582631 2536800 2490743 2444261 2397386 2350472
53353 2350472 2303673 2257043 2211210 2167254 2125622 2085692 2046652 2008299 1970581 1932943 1894813
53342 1894813 1856509 1819000 1782794 1747641 1713337 1680290 1649132 1620221 1593707 1569635 1547700
53331 1547700 1527200 1507625 1489121 1472117 1456568 1441788 1426969 1411625 1395581 1378821 1361488
53320 1361488 1343943 1326704 1310302 1295153 1281466 1269185 1258059 1247879 1238725 1230919 1224658 1219806
53308 1219806 1216168 1213822 1213005 1213699 1215634 1218697 1223050 1228812 1236021 1245037 1256537 1270738 1286944 1304264
53294 1304264 1322587 1342430 1363943 1386533 1409435 1432305 1455223 1478380 1501819 1525194 1547818
53283A547818K1321J9959J8679J7073J4841J2166R219N844K171j052l340n239
53271A659460p571j0240j2490j4147j5801j7726j9436k0504k1276k2397k3968
53260A473904k5506k6492k6781k6558k6145k5805k5683k5818k6145k6424k6288
53249A186259k5515k4219k2787k1711k1380k1835k2676k3397k3759k3691k3008
53238I32281k1680k0182j9086j8263j7210j6069j5494j5308j4369j2243j0086
53227G52291r066q845q509q257q911j0280j1378j2064j3139j4680j5632j5367
53215F16163j4640j4374j4434j4157j3444j2627j1785j0857j0098r793r642q971
53203D71341p625o267n713o094o771p097p132p497q439r351r432q661p681o935
$$ plain form
53283 1547818 1569139 1589098 1607777 1624850 1639691 1651857 1661076 1666920 1669091 1668039 1664699 1659460
53271 1659460 1651889 1641649 1629159 1615012 1599211 1581485 1562049 1541545 1520269 1497872 1473904
53260 1473904 1448398 1421906 1395125 1368567 1342422 1316617 1290934 1265116 1238971 1212547 1186259
53249 1186259 1160744 1136525 1113738 1092027 1070647 1048812 1026136 1002739 978980 955289 932281
53238 932281 910601 890419 871333 853070 835860 819791 804297 788989 774620 762377 752291
53227 752291 743225 734380 725871 717614 708703 698423 687045 674981 661842 647162 631530 616163
53215 616163 601523 587149 572715 558558 545114 532487 520702 509845 499747 489954 480312 471341
53203 471341 463716 457449 451736 445642 438871 431774 424642 417145 408706 399355 389923 381262 373581 366646
53189C66646o355n840n527n405n078m201k944j932j712k295l050l203k611j895
53175C14598j648j764j831j812j903j914j467o85j45j32m31q96j540k064j871
53160B94495r17k9p9j052k147k581k158j287n91l41l05k03j75m80r82j311j417
53143B78440j513j517j091k05P23J351J679J778J661J424J190R28O56O31R87J361
53127B88483J325R61N12k10j304k016j456j4R52R53Q86J472K214K348J959J583
53111B98648J356J166J031Q80M80m7k11q7n05j775k914k883k024j479j582j622
53095B88432j035j18M24J86o22j283j208o58n01r85j336r33k80j76n67r29j286
53078B77125j917k316j552K89J904K205J383L25l90p31q83j029j194j156p25j24
$$ plain form
53189 366646 360291 354451 348924 343519 338441 334240 331296 329364 327652 325357 322307 319104 316493 314598
53175 314598 312950 311186 309355 307543 305640 303726 302259 301574 301429 301297 300866 299970 298430 296366 294495
53160 294495 293578 293549 293470 292418 290271 287690 285532 284245 283654 283313 283008 282805 282630 282150 281168 279857 278440
53143 278440 276927 275410 274319 274114 274837 276188 277867 279645 281306 282730 283920 284848 285504 286135 287122 288483
53127 288483 289808 290769 291281 291071 289767 287751 286295 286281 287233 288186 289072 290544 292758 295106 297065 298648
53111 298648 300004 301170 302201 303081 303561 303514 303303 303216 302711 300936 298022 295139 293115 291636 290054 288432
53095 288432 287397 287279 287703 287889 287267 285984 284776 284118 283617 282632 281296 280363 280083 279907 279340 278411 277125
53078 277125 275208 272892 271340 271629 273533 275738 277121 277446 277056 276325 275442 274413 273219 272063 271338 271214
53062B71214J55j19o60j016r45n50j54QN4K85O20O34K92K19P83J385J224M83K1
53043B73933P6oo32j335j471j015l63K21O94R86R72N45k78j212j682j337n99l09
53025B67188p17j147q19K54J341J780J476Q73N51P22J087J294J440J783K064J640
53009B80810N03m13l34L32O56N32O55J205J346M11j015j727j304l89K86O01P92
52992B82947J016J334J720J969J835J423J068Q94P88Q99J498K258K354J706J340
52977C05049J899K542K130R65K61K46M2o59j062o37J05N98R25J140Q51P2l93r7
52959C13977L47L05J49M02O44K29n04p96q22j412k605l520l631l236k617j672
52943B95238n61P1j17p52j369j835j979j421k15P83P57Ql43L14J246J185j70j640
$$ plain form
53062 271214 271369 271250 270590 269574 268629 268079 267925 267933 267987 268272 268892 269526 269818 270037 270820 272205 273429 273912 273933
53043 273933 274009 274003 273371 272036 270565 269550 269187 269408 270102 271088 272060 272605 272327 271115 269433 268096 267497 267188
53025 267188 266471 265324 264505 264759 266100 267880 269356 270229 270780 271502 272589 273883 275323 277106 279170 280810
53009 280810 281313 280900 280566 280898 281554 282086 282741 283946 285292 285703 284688 282961 281657 281268 281554 282155 282947
52992 282947 283963 285297 287017 288986 290821 292244 293312 294206 294994 295893 297391 299649 302003 303709 305049
52977 305049 306948 309490 311620 312585 312846 313092 313134 312475 311413 310776 310881 311479 312404 313544 314395 314467 314074 313977
52959 313977 314324 314629 314778 315180 315824 316053 315549 314753 313931 312519 309914 306394 302763 299527 296910 295238
52943 295238 294677 294748 294631 293879 292510 290675 288696 287275 287060 287843 288600 288608 288265 288579 289825 291010 290840 289200
52925B89200j777m86R05J191M93k79o25p22q24r45j016r56o47j91K5j72m09k76
52907B82489J5l9l79m51l2M89P48P90P08L46l39r29q57j12O55Q06M82M24R06J246
52887B86966P42j49l22L51Q52N85J66K02K66j57o06m55p1r5j39N91J768K355K301
52868B95151K505L108L171K370J643J692J933J583Q95N35N28M91L47R8o07j993
52852C13450l526m386m374l951l522l198l032l068l200l224k976k379j520p81
52838B70313n80q74j157j054p10l94j40J64N33Q77J041Q72M21J5j44l01o33p95
52820B67454m57j09m51j139j133l46J27k48n64R6J273J919J838J578J483J563
52804B72884J813J931J191n86k373l015k574j925j389p33j51k30r32j542j698
$$ plain form
52925 289200 287423 286937 287842 289033 289526 289247 288622 287900 287076 286131 285115 284159 283512 283321 283346 283174 282765 282489
52907 282489 282504 282465 282086 281635 281603 282092 282840 283630 284338 284684 284345 283416 282559 282447 283102 283908 284390 284814 285720 286966
52887 286966 287708 287559 287237 287588 288440 289025 289191 289393 289659 289502 288896 288441 288370 288275 288136 288727 290495 292850 295151
52868 295151 297656 300764 303935 306305 307948 309640 311573 313156 314051 314586 315114 315605 315952 316050 315443 313450
52852 313450 309924 305538 301164 297213 293691 290493 287461 284393 281193 277969 274993 272614 271094 270313
52838 270313 269733 268859 267702 266648 265938 265544 265404 265568 266101 266978 268019 268891 269312 269327 269183 268882 268249 267454
52820 267454 266997 266888 266437 265298 264165 263819 263946 263698 263134 263230 264503 266422 268260 269838 271321 272884
52804 272884 274697 276628 277819 277233 274860 271845 269271 267346 265957 265224 265073 264843 263911 262369 260671
52789B60671j693j668j319n94N7L75N80Q00Q54Q18J165J933K383J922R20J75l1
52772B67348Q4L70P17P57K02n84r34p63o52r43j240j116q00q47j245j324o15N41
52754B58956J348J395R65O47P79J263J797K202K519K824K997K785K125J306O96
52739B84604M74N88Q89J141J124R29R67J399J707J252J87n52l75L08O84N24K20
52722B96070P7r2o08j409k006j956j345p36n72p09o93l61P4L90M89K07n49j365
52704B84906j528q44L0M15M01N31R11J137R62N63J82j98n98q01n57L7N50O69N16
52685B87284M31M75L30j76p01p81n30n23j023j539j426o32K93P73O92L75K37M05
52667B83964O27O27L97Q1k64n26l74L04R81J013O16P14J646K650K943K667K414
$$ plain form
52789 260671 258978 257310 255991 255397 255454 255829 256409 257209 258063 258881 260046 261979 264362 266284 267204 267379 267348
52772 267348 267432 267802 268519 269276 269478 268894 267960 267197 266545 265602 264362 263246 262446 261599 260354 259030 258415 258956
52754 258956 260304 261699 262664 263311 264090 265353 267150 269352 271871 274695 277692 280477 282602 283908 284604
52739 284604 285078 285666 286555 287696 288820 289749 290716 292115 293822 295074 295261 294709 294334 294642 295326 295850 296070
52722 296070 296147 296055 295447 294038 292032 290076 288731 287995 287423 286714 286021 285660 285734 286124 286613 286820 286271 284906
52704 284906 283378 282534 282564 282979 283380 283911 284822 285959 286921 287484 287666 287468 286870 286069 285512 285549 286099 286768 287284
52685 287284 287715 288190 288520 288344 287643 286862 286332 285809 284786 283247 281821 281189 281482 282255 282947 283322 283559 283964
52667 283964 284591 285218 285615 285696 285432 284906 284532 284836 285817 286830 287446 288160 289806 292456 295399 298066 300480
52650C00480K326K194K013J799J187j27j649k485k425k099k016j991j664j069
52636B94474n02j28j5k00m85m41J08P74J077J107J500K578L786M079K905P30j342
52619C10005k451k504j963j303o92j25K77K69j42n19l96P9L02K1k85j56J58J17
52601C00692k79o11p54q83q51k92N99J073Q24L56J16j12n81r72q59m00OL56Q58
52582B98286J356J514J394J342J409J291Q21J77l73o65o46l78j5L24M43l1j206
52565C05043k329k309j120M0L55L99R17J405R43j57p08m09n2p9p2J48J01l52o03
52546C01161l78k48n47o50n7O25N46j13n84p26r26j114q21o3O79J314K103K775
52528C02976K566J362Nq45j370j738j407LJ661K272J666Q94Q24J329J923K432
$$ plain form
52650 300480 302806 305000 307013 308812 309999 309872 308223 305738 303313 301214 299198 297207 295543 294474
52636 294474 293972 293844 293829 293629 293144 292703 292811 293585 294662 295769 297269 299847 303633 307712 310617 311347 310005
52619 310005 307554 305050 303087 301784 301092 300967 301244 301513 301371 300852 300456 300535 300837 300858 300573 300417 300575 300692
52601 300692 300413 299802 299048 298165 297314 297022 297621 298694 299518 299874 299990 299878 299297 298325 297466 297066 297072 297428 298286
52582 298286 299642 301156 302550 303892 305301 306592 307413 307590 307217 306552 305906 305528 305513 305837 306280 306249 305043
52565 305043 302714 300405 299285 299325 299680 300079 300996 302401 303344 303187 302479 302070 302018 301939 301867 302015 302116 301764 301161
52546 301161 300783 300535 299988 299338 299281 299906 300452 300339 299755 299029 298103 296989 296168 296105 296784 298098 300201 302976
52528 302976 305542 306904 306909 306064 304694 302956 301549 301552 303213 305485 307151 308045 308869 310198 312121 314553
52512C14553K794K842K637K628L045L505L470K856J870O85m30j044j111j300k229
52497C34771l599m528m605m073l241k317j679j555j499q40K72R60Q25L73P2k52
52481C09085p90j201j120o71r8N69J196J438J362J539K149K590K431K124K197
52466C22800K340K029J535J571K259L107L696L763K976J435lo23q47j547k648
52451C41843l306l247l022k963k813k450k174k097j973j750j650j576j112k54
52437C11456M25N00O8o09j325j795j849j704j555j073n9P52M98l48m10N72J413
52420C04957J342R98J130J473J568J628J864J886J608J805K905L992M056L607
52406C34819L980N534P557R485J1126J1884J1007Q599N512K247j195m446o728
$$ plain form
52512 314553 317347 320189 322826 325454 328499 332004 335474 338330 340200 340885 340455 339411 338300 337000 334771
52497 334771 331172 326644 322039 317966 314725 312408 310729 309174 307675 306835 307107 308067 308892 309265 309337 309085
52481 309085 308295 307094 305974 305303 305205 305774 306970 308408 309770 311309 313458 316048 318479 320603 322800
52466 322800 325140 327169 328704 330275 332534 335641 339337 343100 346076 347511 347508 346885 346038 344491 341843
52451 341843 338537 335290 332268 329305 326492 324042 321868 319771 317798 316048 314398 312822 311710 311456
52437 311456 311881 312381 312449 311840 310515 308720 306871 305167 303612 302539 302480 303232 303730 303382 302972 303544 304957
52420 304957 306299 307297 308427 309900 311468 313096 314960 316846 318454 320259 323164 327156 331212 334819
52406 334819 338799 344333 351890 361375 372501 384385 395392 403991 409503 411750 410555 406109 399381
52393C99381p791q014p565o277m549l390l173l120k494j546q59m00J46N89N23
52378C51461J21M4O44J725K957M089M858N123N148N337N632N450M389K721J138
52363D00837R4m66q68j289j592j555j260j103j282j414r60J5Q37J088J112J422
52347C93616J950K216K097J968K127K455K755L023L272L431L576L921M437M851
52333D35695N216O076P679R434J0606J1233J1852J2534J2903J3020J3537J4804
52321E64589J6295J7184J7169J6547J5879J5648J5950J6407J6671J6965J7746
52310G47050J8861J9665J9984K0376K1144K1742K1598K0972K0494K0208J9627
52299I71721J8568J7416J6618J6210J5791J4699J2374Q900N127K016n1j292k103
$$ plain form
52393 399381 391590 383576 376011 369734 365185 361795 358622 355502 353008 351462 350603 350203 350349 350938 351461
52378 351461 351582 351626 352270 353995 356952 361041 365899 371022 376170 381507 387139 392589 396978 399699 400837
52363 400837 400931 400465 399597 398308 396716 395161 393901 392798 391516 390102 389142 389157 389994 391082 392194 393616
52347 393616 395566 397782 399879 401847 403974 406429 409184 412207 415479 418910 422486 426407 430844 435695
52333 435695 440911 446987 454666 464100 474706 485939 497791 510325 523228 536248 549785 564589
52321 564589 580884 598068 615237 631784 647663 663311 679261 695668 712339 729304 747050
52310 747050 765911 785576 805560 825936 847080 868822 890420 911392 931886 952094 971721
52299 971721 990289 1007705 1024323 1040533 1056324 1071023 1083397 1092297 1097424 1099440 1099389 1098097 1095994
52286A095994k853l835n026o037o509o480o169n720n259m933m534l534j858k65
52272A032982O13J293K742M809O224O317N992O549Q049R400R809R649R921J1159
52258A125508J3015J4666J5588J5930J6164J6483J6680J6593J6340J6012J5224
52247A298203J3407J0484P128M151J835o4j774l211m323n363o651q148r486j0388
52233A285800j0860j1016j0945j0775j0660j0592j0433j0187j0033j0080j0213
52222A170006j0248j0046r441q291o726n184m033l288k740k182j506o98J61J029
52208A106813J956K923L731M262M680N066N045M302L356L184L955M835N178N291
52194A164577N664O137O349O482O922P501P671P166O083M506K550N46j298l163
$$ plain form
52286 1095994 1093141 1089306 1084280 1078243 1071734 1065254 1059085 1053365 1048106 1043173 1038639 1035105 1033247 1032982
52272 1032982 1033595 1034888 1037630 1042439 1048663 1054980 1060972 1067521 1075570 1084970 1094779 1104428 1114349 1125508
52258 1125508 1138523 1153189 1168777 1184707 1200871 1217354 1234034 1250627 1266967 1282979 1298203
52247 1298203 1311610 1322094 1329222 1333373 1335208 1335144 1333370 1330159 1325836 1320473 1313822 1305674 1296188 1285800
52233 1285800 1274940 1263924 1252979 1242204 1231544 1220952 1210519 1200332 1190299 1180219 1170006
52222 1170006 1159758 1149712 1140271 1131980 1125254 1120070 1116037 1112749 1110009 1107827 1106321 1105623 1105784 1106813
52208 1106813 1108769 1111692 1115423 1119685 1124365 1129431 1134476 1138778 1142134 1145318 1149273 1154108 1159286 1164577
52194 1164577 1170241 1176378 1182727 1189209 1196131 1203632 1211303 1218469 1224552 1229058 1231608 1232154 1230856 1227693
52180A227693n118o681p407p747q563r883j0725j0248q624o732n387m873m776
52167A130929m293l037j484l17M70J399K561L489L910M046M017L532K389Q67n71
$$ plain form
52180 1227693 1222575 1215894 1208487 1200740 1192177 1182294 1171569 1161321 1152697 1145965 1140578 1135705 1130929
52167 1130929 1126636 1123599 1122115 1121798 1122268 1123667 1126228 1129717 1133627 1137673 1141690 1145222 1147611 1148478 1147907
$$ [...]
##END NTUPLES=NMR SPECTRUM
##END=
