##TITLE=AC1655_NARAH14391_8531735_tWAfFlMTDw
##JCAMPDX= 6.0         $$ Bruker NMR JCAMP-DX V2.0
##DATA TYPE= NMR SPECTRUM
##DATA CLASS= NTUPLES
##ORIGIN= BRUKER
##OWNER= Administrator
$$ 1.72 TOPSPIN		Version 2.1
$$ 2014-03-14 16:23:06.004 -0800  Administrator@X
$$ Compression mode = diff/dup
##.OBSERVE FREQUENCY= 400.02188249412
##.OBSERVE NUCLEUS= ^1H
##.ACQUISITION MODE= SIMULTANEOUS (DQD)
##.ACQUISITION SCHEME= undefined
##.AVERAGES= 8
##.DIGITISER RES= 22
##SPECTROMETER/DATA SYSTEM= spect
##.PULSE SEQUENCE= zg30
##.SOLVENT NAME= COFFEE_meoh
##.SHIFT REFERENCE= INTERNAL, COFFEE_meoh, 1, 14.98509
##AUDIT TRAIL= $$ (NUMBER, WHEN, WHO, WHERE, PROCESS, VERSION, WHAT)
$$ ##TITLE= Audit trail, TOPSPIN		Version 2.1
$$ ##JCAMPDX= 5.01
$$ ##ORIGIN= Bruker BioSpin GmbH
$$ ##OWNER= Administrator
$$ $$ E:\/data/COFFEE/nmr/AC1655_NARAH14391_8531735_tWAfFlMTDw/10/pdata/1/auditp.txt
$$ ##AUDIT TRAIL=  $$ (NUMBER, WHEN, WHO, WHERE, PROCESS, VERSION, WHAT)
(   1,<2014-03-14 16:22:59.907 -0800>,<Administrator>,<X>,<go>,<TOPSPIN 2.1>,
      <created by zg
	started at 2014-03-14 16:21:50.903 -0800,
	POWCHK enabled, PULCHK disabled,
       configuration hash MD5:
       C8 4E 4E 5D D3 5C D8 9E 9F 52 82 E0 59 8A DE 15
       data hash MD5: 64K
       8E 26 7A 17 3F 01 E6 15 F8 82 AE 50 C3 E7 77 4B>)
(   2,<2014-03-14 16:23:02.565 -0800>,<Administrator>,<X>,<proc1d>,<TOPSPIN 2.1>,
      <Start of raw data processing
       efp LB = 0 FT_mod = 6 PKNL = 1 PHC0 = 0 PHC1 = 0 SI = 32K 
       data hash MD5: 32K
       C0 B7 0F 5E 57 D1 35 2D BD 9B 00 C5 6C BB 10 F3>)
(   3,<2014-03-14 16:23:02.830 -0800>,<Administrator>,<X>,<proc1d>,<TOPSPIN 2.1>,
      <pk PHC0 = 95.85022 PHC1 = 0 
       data hash MD5: 32K
       F6 32 1E C0 92 11 57 8B 4E 1A EB 7D 6B 6F 05 9F>)
(   4,<2014-03-14 16:23:02.935 -0800>,<Administrator>,<X>,<proc1d>,<TOPSPIN 2.1>,
      <abs ABSG = 1 
       data hash MD5: 32K
       F1 C8 59 B2 C0 19 5E 4B 82 DA DA E6 3E 30 89 3A>)
(   5,<2014-03-14 16:23:02.988 -0800>,<Administrator>,<X>,<proc1d>,<TOPSPIN 2.1>,
      <abs ABSG = 2 
       data hash MD5: 32K
       2F AB A6 77 45 8A 82 5D 4A DA 65 4E A1 84 FE BB>)
(   6,<2014-03-14 16:23:03.054 -0800>,<Administrator>,<X>,<proc1d>,<TOPSPIN 2.1>,
      <abs ABSG = 3 
       data hash MD5: 32K
       05 09 FE 3E 9D A3 DA 9D 35 25 76 51 EB 67 CD 7F>)
(   7,<2014-03-14 16:23:03.147 -0800>,<Administrator>,<X>,<proc1d>,<TOPSPIN 2.1>,
      <abs ABSG = 4 
       data hash MD5: 32K
       3A C2 4E A1 B8 71 B2 BC 51 D0 3F 41 50 DA AD 32>)
(   8,<2014-03-14 16:23:03.226 -0800>,<Administrator>,<X>,<proc1d>,<TOPSPIN 2.1>,
      <abs ABSG = 5 
       data hash MD5: 32K
       6D 47 BA F7 AD 90 1A 4C E1 A3 AB 77 80 D9 67 0E>)
$$ ##END=
$$ 
$$ $$ hash MD5
$$ $$ 5A 09 34 2B 5F F0 D9 10 6E 03 67 9A 40 15 EA E9
##$RELAX= 
##$RELAX= 
##$RELAX= 
##$RELAX= 
##$RELAX= 
##$RELAX= 
##$RELAX= 
$$ Bruker specific parameters
$$ --------------------------
##$DU= <E:\>
##$EXPNO= 10
##$NAME= <AC1655_NARAH14391_8531735_tWAfFlMTDw>
$$ [...]
150 150 150 150 150 150 150 150
##$TP07= 0
##$TPNAME0= <>
##$TPNAME1= <>
##$TPNAME2= <>
##$TPNAME3= <>
##$TPNAME4= <>
##$TPNAME5= <>
##$TPNAME6= <>
##$TPNAME7= <>
##$TPOAL= (0..7)
0.5 0.5 0.5 0.5 0.5 0.5 0.5 0.5
##$TPOFFS= (0..7)
0 0 0 0 0 0 0 0
##$TUNHIN= 0
##$TUNHOUT= 0
##$TUNXOUT= 0
##$USERA1= <user>
##$USERA2= <user>
##$USERA3= <user>
##$USERA4= <user>
##$USERA5= <user>
##$V9= 5
##$VALIST= <valist>
##$VCLIST= <CCCCCCCCCCCCCCC>
##$VD= 0
##$VDLIST= <DDDDDDDDDDDDDDD>
##$VPLIST= <PPPPPPPPPPPPPPP>
##$VTLIST= <TTTTTTTTTTTTTTT>
##$WBST= 1024
##$WBSW= 4
##$XGAIN= (0..3)
0 0 0 0
##$XL= 0
##$YL= 0
##$YMAX_a= 619096
##$YMIN_a= -526592
##$ZGOPTNS= <>
##$ZL1= 120
##$ZL2= 120
##$ZL3= 120
##$ZL4= 120
##$ABSF1= 14.98509
##$ABSF2= -5.573092
##$ABSG= 5
##$ABSL= 3
##$ALPHA= 0
##$AQORDER= 0
##$ASSFAC= 0
##$ASSFACI= 0
##$ASSFACX= 0
##$ASSWID= 0
##$AUNMP= <proc_prof1d_extract_pilot.lims>
##$AXLEFT= 0
##$AXNAME= <>
##$AXNUC= <1H>
##$AXRIGHT= 0
##$AXTYPE= 0
##$AXUNIT= <>
##$AZFE= 0.1
##$AZFW= 0.1
##$BCFW= 0
##$BC_mod= 0
##$BYTORDP= 0
##$COROFFS= 0
##$CY= 15
##$DATMOD= 1
##$DC= 0
##$DFILT= <>
##$DTYPP= 0
##$F1P= 0
##$F2P= 0
##$FCOR= 0.5
##$FTSIZE= 32768
##$FT_mod= 6
##$GAMMA= 0
##$GB= 0
##$INTBC= 1
##$INTSCL= 1
##$ISEN= 128
##$LB= 0
##$LEV0= 0
##$LPBIN= 0
##$MAXI= 10000
##$MC2= 0
##$MEAN= 0
##$ME_mod= 0
##$MI= 0
##$NCOEF= 0
##$NC_proc= -8
##$NLEV= 6
##$NOISF1= 0
##$NOISF2= 0
##$NSP= 0
##$NTH_PI= 0
##$NZP= 0
##$OFFSET= 14.98509
##$PC= 1
##$PHC0= 95.85022
##$PHC1= 0
##$PH_mod= 1
##$PKNL= yes
##$PPARMOD= 0
##$PPDIAG= 0
##$PPIPTYP= 0
##$PPMPNUM= 2147483647
##$PPRESOL= 1
##$PSCAL= 4
##$PSIGN= 0
##$PYNMP= <proc.py>
##$REVERSE= no
##$SF= 400.02
##$SI= 32768
##$SIGF1= 0
##$SIGF2= 0
##$SINO= 400
##$SIOLD= 32768
##$SPECTYP= <>
##$SREGLST= <1H.CDCl3>
##$SSB= 0
##$STSI= 32768
##$STSR= 0
##$SW_p= 8223.68421052631
##$SYMM= 0
##$S_DEV= 0
##$TDeff= 65536
##$TDoff= 0
##$TI= <>
##$TILT= no
##$TM1= 0
##$TM2= 0
##$TOPLEV= 0
##$USERP1= <user>
##$USERP2= <user>
##$USERP3= <user>
##$USERP4= <user>
##$USERP5= <user>
##$WDW= 1
##$XDIM= 32768
##$YMAX_p= 448994442
##$YMIN_p= -766000
##$CURPLOT= <Network HP LaserJet P1505>
##$CURPRIN= <$Network HP LaserJet P1505>
##$DFORMAT= <normdp>
##$LAYOUT= <+/1D_H.xwp>
##$LFORMAT= <normlp>
##$PFORMAT= <normpl>
##$SURQMSG= 1
$$ End of Bruker specific parameters
$$ ---------------------------------
##NTUPLES= NMR SPECTRUM
##VAR_NAME=  FREQUENCY,     SPECTRUM/REAL,   SPECTRUM/IMAG
##SYMBOL=    X,             R,               I
##VAR_TYPE=  INDEPENDENT,   DEPENDENT,       DEPENDENT
##VAR_FORM=  AFFN,          ASDF,            ASDF
##VAR_DIM=   32768,         32768,           32768
##UNITS=     HZ,            ARBITRARY UNITS, ARBITRARY UNITS
##FACTOR=    0.250966925370066, 1,           1
##FIRST=     8223.43324360094, -70531,       -69371
##LAST=      0,             67329,           -357624
##MIN=       0,             -766000,         0
##MAX=       8223.43324360094, 448994442,    0
$$ Real data points
##PAGE= N=1
##DATA TABLE= (X++(R..R)), XYDATA
$$ [...]
19584c67222J24551G1066b6178l33213h5281A68087G145a2649l24127A3148b25204
$$ -367222 -242671 71066 -26178 -359391 -85281 168087 7145 -12649 -336776 13148 -225204
19572G7929c28261N0538C35830i4083j8288F9389c9473F1977K61499c2647R564
$$ 77929 -328261 -277723 335830 -94083 -112371 69389 -39473 61977 323476 -32647 -23083
19561b3083j14792j39350i5536l8895k5361p2050A17698g1881r2621p1830A48065
$$ -23083 -137875 -277225 -95536 -134431 -159792 -231842 117698 -71881 -164502 -236332 148065
19549A80963H2365C5843c957j09741K5444b08k14006d9457l81178I0352a97374
$$ 180963 82365 35843 -3957 -113698 -88254 -208 -214214 -49457 -430635 90352 -197374
19537a20226c4487n9723M374A94558a11198l9279m3740c774j407H3733C6707a53976
$$ -120226 -34487 -94210 -89836 194558 -111198 -150477 -194217 -3774 -5181 83733 36707 -153976
19524B51726b17348A67517a35439k54768g4385k1569A37813d68820E9190d4141
$$ 251726 -217348 167517 -135439 -390207 -74385 -95954 137813 -468820 59190 -44141
19513A34854g8224j227k34035a45251j62268c2662k1170m1704m6766j66907F7101
$$ 134854 -78224 -79451 -313486 -145251 -307519 -32662 -53832 -95536 -142302 -309209 67101
19501a99584B58093a73707j06678H1143a49538F6269A702J33214J44882e22341
$$ -199584 258093 -173707 -280385 81143 -149538 66269 1702 134916 279798 -522341
19490b5299G4577i8204c4346j36427l2614E0112p70O1456b36724i5827D5804h9341
$$ -25299 74577 -98204 -34346 -170773 -203387 50112 49342 110798 -236724 -95827 45804 -89341
19477f6905j81158j9083c4513F4005L894f7183B41422F9956O9187O2993k4052
$$ -66905 -248063 -267146 -34513 64005 67899 -67183 241422 69956 139143 202136 178084
19466A78084a54613q9684g1282L1497k6887j69787M5229l07718I6347h4233d0374
$$ 178084 -154613 -244297 -71282 -39785 -66672 -236459 -191230 -498948 96347 -84233 -40374
19454h7327a0162p2522k76972a16245D4295a28280L3345k22847B2182K85601a70410
$$ -87327 -10162 -82684 -359656 -116245 44295 -128280 -94935 -317782 22182 307783 -170410
19442a32315A27362M6804D363e4993k9502b0901j54424A54813C689b45091D6218
$$ -132315 127362 174166 4363 -54993 -84495 -20901 -175325 154813 3689 -245091 46218
19430G8189c17375R0630B25098c32836J59429L2957b1071l13126J49789d6518
$$ 78189 -317375 -226745 225098 -332836 -173407 -140450 -21071 -334197 -184408 -46518
19419A59698c9461A5864n05N1853K4908k91i8998j70593A1758b21974o5967a8913
$$ 159698 -39461 15864 15359 67212 92120 91829 -98998 -269591 11758 -221974 -287941 -18913
19406a56357P6072q4711H1801f4018n7400L6640M1649k46963J20120n7380P043
$$ -156357 -80285 -164996 81801 -64018 -121418 -84778 -43129 -290092 -169972 -227352 -220309
19395b20309Q2265F3413c2238A16473m9694K03385i2587I750Q5675a70971c9234
$$ -220309 -138044 63413 -32238 116473 66779 270164 -92587 9750 95425 -170971 -39234
19383d07698A16616d4749j64971A60866b28310A87530f3735L560j28964A54617
$$ -407698 116616 -44749 -209720 160866 -228310 187530 -63735 -60175 -189139 154617
19372f8689n7800A18299K43642a69510g3859E8645M563e9022A02053B0075a42973
$$ -68689 -126489 118299 361941 -169510 -73859 58645 63208 -59022 102053 20075 -142973
19360h1792B0606K15262c37895C439b04309P1220B69021I5970c83232A82737e653
$$ -81792 20606 235868 -337895 3439 -204309 -133089 269021 95970 -383232 182737 -5653
19348a1246l760E0250a06530k53098A13672a86107A3652J9009b42484G1113a41923
$$ -11246 -15006 50250 -106530 -359628 113672 -186107 13652 32661 -242484 71113 -141923
19336a1655A02265b91364i2757q7501e1560H3254b70635A12385O1919c77403a1071
$$ -11655 102265 -291364 -92757 -180258 -51560 83254 -270635 112385 174304 -377403 -11071
19324i8413L4109H2023c24571A53848n0741c8324A84249k9390n6503b03984A32620
$$ -98413 -64304 82023 -324571 153848 103107 -38324 184249 154859 98356 -203984 132620
19312b24691b0417r4672j27876J12566K5783E5965K60495a34101A71879l0565
$$ -224691 -20417 -115089 -242965 -130399 -104616 55965 316460 -134101 171879 141314
19302A41314k7725J47032e5859r5643O840A15803b61776M1599P7654K4230m9698
$$ 141314 113589 260621 -55859 -151502 -144662 115803 -261776 -220177 -142523 -118293 -167991
19291a67991j59093O3140b5361D3744a77460f9040c132k25l6179j9456r9040p7729
$$ -167991 -327084 -263944 -25361 43744 -177460 -69040 -3132 -3357 -39536 -58992 -158032 -235761
19279b35761A78395G4143b70260P571a11344a6158n1350l72912K05250O4440G8970
$$ -235761 178395 74143 -270260 -262689 -111344 -16158 -67508 -440420 -235170 -170730 78970
19267f7820B94296c61334d8780C0464J60306C0299J87997a85637E730J15326f9422
$$ -67820 294296 -361334 -48780 30464 190770 30299 218296 -185637 5730 121056 -69422
19255c1473k29984a22083j71321i0441J9942A470b93835B21974i4617b3959I7868
$$ -31473 -261457 -122083 -293404 -90441 -70499 1470 -293835 221974 -94617 -23959 97868
19243a41724I8491J63291a81490l8152d8484r2740l1249A033h8137q0949f080
$$ -141724 98491 261782 -181490 -219642 -48484 -141224 -172473 1033 -88137 -169086 -6080
19231a31604c7968C6082f0964r9200m1859A09195a08379k22252h3675C13881E881
$$ -131604 -37968 36082 -60964 -160164 -202023 109195 -108379 -330631 -83675 313881 5881
19219a29114M5892A96221a47198E5394a94130B43494C9686a5263k04245Q2178
$$ -129114 -83222 196221 -147198 55394 -194130 243494 39686 -15263 -219508 -137330
19209a37330A59092l0230J8845N8524a60528K1493k91599F532a63556k1000N0957
$$ -137330 159092 128862 147707 206231 -160528 -139035 -430634 6532 -163556 -184556 -133599
19198a33599b5996m56395H4022f6219H7588k661c57130R3605J25720F3955J08496
$$ -133599 -25996 -482391 84022 -66219 87588 84927 -357130 -263525 -137805 63955 172451
19187A72451B4565K12315D3908f8582C4428a88768C39577a45574l01350A44085
$$ 172451 24565 236880 43908 -68582 34428 -188768 339577 -145574 -446924 144085
19176b18190I6103C9488a30787B93544F1689K40396B5198J94971d22967O9490
$$ -218190 96103 39488 -130787 293544 61689 302085 25198 220169 -422967 -353477
19166c53477a18015F6315P0666F2401A7380b09664h6300k9548a3375H8513k5986
$$ -353477 -118015 66315 136981 62401 17380 -209664 -86300 -115848 -13375 88513 62527
19155F2527c6484H4608b04956M9478l6944K6457A75236d0451j59646a142k78142
$$ 62527 -36484 84608 -204956 -155478 -192422 -165965 175236 -40451 -200097 -1142 -279284
19144b79284E5298a09369F5192c8394Q558j07144b7066k79421g0859C392f5000
$$ -279284 55298 -109369 65192 -38394 -29836 -136980 -27066 -306487 -70859 3392 -65000
19132A8830a24708I246i0598A72537n9125a52760q47D219b55888L298a6696H421
$$ 18830 -124708 9246 -90598 172537 113412 -152760 -153607 4219 -255888 -252590 -16696 8421
19119B4015c96423J31084h9051E399L29216a29873L6021p5936Q4439j38642m3795
$$ 24015 -396423 -265339 -89051 5399 334615 -129873 -93852 -169788 -85349 -223991 -267786
19108b67786b6077B59254j25893J22284A8710L16229f7460J4965I8442P5157G1122
$$ -267786 -26077 259254 133361 255645 18710 334939 -67460 -52495 98442 173599 71122
19096a03653B2503J27498d04895c3148J2576j12904L4183j74077i6j69030p9243
$$ -103653 22503 150001 -404895 -33148 -20572 -133476 -99293 -273370 -96 -169126 -248369
19085b48369l8026B27407F9210k3589e4867I0040a32261m2221d3819G7029g5559
$$ -248369 -286395 227407 69210 45621 -54867 90040 -132261 -174482 -43819 77029 -75559
19073c7860j04750k4529J8261B3905b96263l10621K29633A40996e8886J1420H4310
$$ -37860 -142610 -167139 -148878 23905 -296263 -606884 -377251 140996 -58886 -47466 84310
19061B38722a0202n16838A09711P8737g6888j67376C7148L91708e37931i5762
$$ 238722 -10202 -527040 109711 188448 -76888 -244264 37148 428856 -537931 -95762
19050A15593a88239m7593h7570j67851J20850A04583a12764j25067e2734o1758
$$ 115593 -188239 -235832 -87570 -255421 -134571 104583 -112764 -237831 -52734 -114492
19040a14492m1002B91435B6438a74130B082J9190O4918b37879A35495o0967c8982
$$ -114492 -155494 291435 26438 -174130 2082 21272 86190 -237879 135495 74528 -38982
19028B01312r6093m62a2451B11748i4227e992j45264D38661C7739J1834a09165
$$ 201312 105219 104757 -12451 211748 -94227 -5992 -151256 438661 37739 49573 -109165
19016a03938H6050a88525A06086A2706a26381M1002j11638M1202j35058I6175
$$ -103938 86050 -188525 106086 12706 -126381 -85379 -197017 -155815 -290873 96175
19005a04709p6531o9876j6926e7831N834C2897g8398D9925O5278b75870J30110
$$ -104709 -181240 -251116 -268042 -57831 -51997 32897 -78398 49925 115203 -275870 -145760
18994a45760A61133a12361c9177j35106D6375P2185R8324a3712j90820E8004h2120
$$ -145760 161133 -112361 -39177 -174283 46375 118560 216884 -13712 -204532 58004 -82120
18982a82992B89621a42490N2527A6310a09600r8425I5019c11825j40174i1081
$$ -182992 289621 -142490 -89963 16310 -109600 -208025 95019 -311825 -451999 -91081
18971b217j25564A38401C8171d2675B90138a78610m8381R6518a370j09399G8734
$$ -2217 -127781 138401 38171 -42675 290138 -178610 -226991 -130473 -1370 -110769 78734
18959C34137b66892c3550j85106f7136J8490j93350B88650h1962J0869B0110N6541
$$ 334137 -266892 -33550 -218656 -67136 -48646 -241996 288650 -81962 -71093 20110 76651
18948G6651g0864m7622d0626B28226J31104q8146a25486A09190J56118j09372
$$ 76651 -70864 -118486 -40626 228226 359330 271184 -125486 109190 265308 155936
18938A55936O073j4126l8332a65903A99625n7896J29653g871q5401A05766D0359
$$ 155936 162009 147883 109551 -165903 199625 141729 271382 -7871 -93272 105766 40359
18926a15091A31912B9017N4134j0601a6251m7966K0362j76760d8955A63391a58938
$$ -115091 131912 29017 83151 72550 -16251 -64217 -43855 -220615 -48955 163391 -158938
18914b03389D9239b88718a05647B1229a38266a7338A1927h0487K990j17510M0255
$$ -203389 49239 -288718 -105647 21229 -138266 -17338 11927 -80487 -77497 -195007 -154752
18903a54752e712A49463C4088g6207j76457A08709E1727d64421a8994j74205f0672
$$ -154752 -5712 149463 34088 -76207 -252664 108709 51727 -464421 -18994 -193199 -60672
18891I2670C0106a73842A34068b30946B28216b7607D7075f7223A69864a99221
$$ 92670 30106 -173842 134068 -230946 228216 -27607 47075 -67223 169864 -199221
18880b9505j31934j697A99689c4407k87899B67822A0272J05337A5993d68397h5537
$$ -29505 -161439 -163136 199689 -34407 -322306 267822 10272 115609 15993 -468397 -85537
18868E7696k2145a20621q6966A04339e9998A09415i6318o3884G5688a10751A26889
$$ 57696 35551 -120621 -207587 104339 -59998 109415 -96318 -160202 75688 -110751 126889
18856g104l6203B16499K8225d33878C20094i8728h009G2860l805a92687k6940
$$ -7104 -43307 216499 244724 -433878 320094 -98728 -8009 72860 69055 -192687 -219627
18845b19627A06285a07103H1055a75553C07845a9807A15164R665i1536m6806j07289
$$ -219627 106285 -107103 81055 -175553 307845 -19807 115164 124829 -91536 -138342 -245631
18834b45631P1264A50062l4506a64614g5654j98543H9926c05650a00894A50559
$$ -245631 -174367 150062 115556 -164614 -75654 -274197 89926 -305650 -100894 150559
18823b11790d6355k01853B45897h3625p6369B19806c1733A60026b32539B96440
$$ -211790 -46355 -248208 245897 -83625 -159994 219806 -31733 160026 -232539 296440
18812A9999b79182B83217J05445A3420Q0050a33945E6035d0586H0435c1332l300
$$ 19999 -279182 283217 388662 13420 93470 -133945 56035 -40586 80435 -31332 -34632
18801c4632A20949a24606C6075Q8482N0115e1226m24686J55751L4947b644m7257
$$ -34632 120949 -124606 36075 124557 174672 -51226 -475912 -320161 -285214 -2644 -49901
18790d9901k94110J05515k7326B54433j09327a76208O0848q4234l0935j96042
$$ -49901 -344011 -238496 -265822 254433 145106 -176208 -115360 -199594 -230529 -426571
18780d26571K10628I660c18350J06806B8042K45725f3391H0699d14753a60723
$$ -426571 -215943 9660 -318350 -211544 28042 273767 -63391 80699 -414753 -160723
18769h8368B31378j08506d0582k63518e7355e580B25639A6189a00733A61465K5081
$$ -88368 231378 122872 -40582 -304100 -57355 -5580 225639 16189 -100733 161465 186546
18758A86546C5008M7367c10524R7956j39653h6259B4253j1455c34191b256o0122
$$ 186546 35008 82375 -310524 -212568 -352221 -86259 24253 12798 -334191 -2256 -62378
18747f2378M958G3118N8314K2255n9324C0845a01139J144d5835C2105a93728C18716
$$ -62378 -57420 73118 131432 153687 94363 30845 -101139 -99995 -45835 32105 -193728 318716
18734a6890B2882i830A44527b53576c7899o5960O91k16581C00493I9789g5797
$$ -16890 22882 -9830 144527 -253576 -37899 -103859 -103168 -319749 300493 99789 -75797
18722d204m1153D5425a46761k28618a85782n3694L1543O2025C2582a94843p6385
$$ -4204 -45357 45425 -146761 -375379 -185782 -239476 -207933 -145908 32582 -194843 -271228
18711b71228B7218b76247b1146k76068A90175c31107A7965b15281k5012B51456
$$ -271228 27218 -276247 -21146 -297214 190175 -331107 17965 -215281 -240293 251456
18700c51504E3388f7052A19309J01917l5687a25567J82F3678b12906I5259b08905
$$ -351504 53388 -67052 119309 221226 185539 -125567 -125385 63678 -212906 95259 -208905
18688h5301C6685a66137g1141r6590d6763C7408A1870a62216g4016j49523g7845
$$ -85301 36685 -166137 -71141 -167731 -46763 37408 11870 -162216 -74016 -223539 -77845
18676h9327L9920B6260a43646E6545K06560b09430E6968a43576d1575q4720L0084
$$ -89327 -49407 26260 -143646 56545 263105 -209430 56968 -143576 -41575 -126295 -96211
18665i6211B50089a33162c012A05454b66035L5403B41362b98674a08143B5008
$$ -96211 250089 -133162 -3012 105454 -266035 -230632 241362 -298674 -108143 25008
18654a82062A2819K1246b85689j16061B9978a37662A72688g9295j96555B30721
$$ -182062 12819 34065 -285689 -401750 29978 -137662 172688 -79295 -275850 230721
18643D4211o2d58632C3626a35959j48193b6157C24378a50247a3999k94035f1131
$$ 44211 44149 -458632 33626 -135959 -284152 -26157 324378 -150247 -13999 -308034 -61131
18631e4903H3637Q3355k606e6730A32667a08666j50983A07528K62783a95500O0206
$$ -54903 83637 166992 164386 -56730 132667 -108666 -259649 107528 370311 -195500 -135294
18620a35294o7578A10180a18667k3439a9240l60094e726k84821A69352a24006
$$ -135294 -202872 110180 -118667 -142106 -19240 -379334 -5726 -290547 169352 -124006
18609B58755a51879N3949k36662Q3151J24008E0116d2566J7473A2970h647k03035
$$ 258755 -151879 -97930 -334592 -251441 -127433 50116 -42566 -25093 12970 -8647 -211682
18598b11682P6715J773j8673N3490G7654a75277r2340O5243P3656c9021A82192
$$ -211682 -134967 -133194 -151867 -98377 77654 -175277 -267617 -202374 -128718 -39021 182192
18586H4822m982K8224c16168Q3011c3263l21127E4515b74668b7650k2305G9259
$$ 84822 79840 108064 -316168 -233157 -33263 -354390 54515 -274668 -27650 -49955 79259
18574B58755A8237a67037A12477C0826P0771R4419G7385a5845k00476m1655I0759
$$ 258755 18237 -167037 112477 30826 101597 196016 77385 -15845 -216321 -257976 90759
18562D5121L3838d27903h4986l7901A18196b94658H32c29367a13261l77537B31438
$$ 45121 78959 -427903 -84986 -122887 118196 -294658 832 -329367 -113261 -490798 231438
18550b70121a24420m3948A68351c4330E1288a34644d2141C53884b15406K3065
$$ -270121 -124420 -168368 168351 -34330 51288 -134644 -42141 353884 -215406 -192341
18540a92341A391b00272j74701B2988d0730j76717f9108H3166a6609k3660A90168
$$ -192341 1391 -200272 -374973 22988 -40730 -217447 -69108 83166 -16609 -40269 190168
18528E99P5334e4187A80503E7144h2040B2609M9229K05220I003Q8831e6398m5981
$$ 599 75933 -54187 180503 57144 -82040 22609 71838 277058 9003 97834 -56398 -102379
18516a02379B67809c8973m3978E6556a08677B31832D7229L8678J18823q8692a6697
$$ -102379 267809 -38973 -82951 56556 -108677 231832 47229 85907 204730 116038 -16697
18504A7894K58688E9970f3160A06162a79943g01m36500D9276a85194A75585c28325
$$ 17894 276582 59970 -63160 106162 -179943 -701 -437201 49276 -185194 175585 -328325
18492d55579J49874b4227B8962J30994E4544G203a49047C41613a5946l371j11394
$$ -455579 -305705 -24227 28962 159956 54544 7203 -149047 341613 -15946 -19317 -130711
18481a30711M1874c0038r6318n4785K0939j73538i979F942a74244F5730P3742
$$ -130711 -88837 -30038 -126356 -181141 -160202 -333740 -9979 6942 -174244 65730 139472
18470A39472a09972j93174P7562f43D06115F958P8626D838P4875l1785b78326
$$ 139472 -109972 -303146 -225584 -643 406115 6958 85584 4838 79713 47928 -278326
18458b80920B6406J4817b0501E6078a09372C5196h9223H9114a37618j02414g2368
$$ -280920 26406 41223 -20501 56078 -109372 35196 -89223 89114 -137618 -240032 -72368
18446i132C4217a24074J316j4923a789F4077e9523m9106E9728k7717b4264E2743
$$ -9132 34217 -124074 -122758 -137681 -1789 64077 -59523 -108629 59728 32011 -24264 52743
18433D10775c76097J87822C000c92321E7428K22636G3980a32183A45229f8104
$$ 410775 -376097 -188275 3000 -392321 57428 280064 73980 -132183 145229 -68104
18422a88969P9525r1697c2330I8418c0717C73411e2439l74856c3371E1266f6624
$$ -188969 -109444 -201141 -32330 98418 -30717 373411 -52439 -427295 -33371 51266 -66624
18410b79889b3265A2969f5540A57555d4993F9350F189J59324n4981a38117a489
$$ -279889 -23265 12969 -65540 157555 -44993 69350 6189 165513 110532 -138117 -1489
18398F6441C2191b66307H0318d22874C2902b22788d6735H3555a01263K5969c5222
$$ 66441 32191 -266307 80318 -422874 32902 -222788 -46735 83555 -101263 -75294 -35222
18386a92805M5168k00179b9881n5331A72793a58444G173a46981I6701C0587a58013
$$ -192805 -147637 -347816 -29881 -85212 172793 -158444 7173 -146981 96701 30587 -158013
18374g5843p3825C45150c1390F4014a22468A41992k7410a26133A81b25230Q2250
$$ -75843 -149668 345150 -31390 64014 -122468 141992 114582 -126133 181 -225230 -142980
18363a42980A38345J33782h9665B23840a75866K9664A41563a73790A07908f5413
$$ -142980 138345 272127 -89665 223840 -175866 -146202 141563 -173790 107908 -65413
18352C57582c7928j0857q7688k6381j88962a35974D0607a4070j6391o5431b2754
$$ 357582 -37928 -48785 -136473 -162854 -351816 -135974 40607 -14070 -30461 -95892 -22754
18340a49271F9409a67023l2998A08912D1864J10154h6115j22448B4468K31004
$$ -149271 69409 -167023 -200021 108912 41864 152018 -86115 -208563 24468 255472
18330B55472c6789a1638G8275e8807j01753p0552A64637o8342a11451B40158J12632
$$ 255472 -36789 -11638 78275 -58807 -160560 -231112 164637 96295 -111451 240158 352790
18319C52790a18794F2887O8140d1600D611N3424K9652a7430A50009D8484a67909
$$ 352790 -118794 62887 131027 -41600 4611 58035 87687 -17430 150009 48484 -167909
18307a10145A00836i6815B83480b41219M0014A93309G1616o553g1516L5571A07057
$$ -110145 100836 -96815 283480 -241219 -201205 193309 71616 65063 -71516 -35945 107057
18295b9025A23581b69356a27255b3203k75301g5033q3070j11631A29306a45694
$$ -29025 123581 -269356 -127255 -23203 -298504 -75033 -158103 -269734 129306 -145694
18284A54666b44274j77015L6372g4490C0871e0836A03200b0417J0118m50211J99044
$$ 154666 -244274 -421289 -384917 -74490 30871 -50836 103200 -20417 -10299 -460510 -261466
18273b61466A17218d53849b5008B14442I2223a04392L96j99090b7800j57362g4866
$$ -261466 117218 -453849 -25008 214442 92223 -104392 -103996 -303086 -27800 -185162 -74866
18261D3689b52177B19062b25893N2140G8594a41973i189C988a2189n8973A57069
$$ 43689 -252177 219062 -225893 -173753 78594 -141973 -9189 3988 -12189 -71162 157069
18249B49577a69857e4662A57437b88366k3718J21581G8614a4954q2540B9571a4303
$$ 249577 -169857 -54662 157437 -288366 -312084 -190503 78614 -14954 -97494 29571 -14303
18237b221j42174N805A09841e1338r1275C1375a21444K4025j438B1635J43051
$$ -2221 -144395 -138590 109841 -51338 -142613 31375 -121444 -97419 -98857 21635 164686
18226A64686n3064g0903A6165d4642n3608E3667d4799A1157a18630A48583H061
$$ 164686 111622 -70903 16165 -44642 -98250 53667 -44799 11157 -118630 148583 8061
18214C6151a99536e6654j30520A37298a69103d9956k30663a683A22022e03251
$$ 36151 -199536 -56654 -187174 137298 -169103 -49956 -280619 -1683 122022 -503251
18203D5894b05398A22149g7614r0706A31745e39680A61673h8117r683b1976A27432
$$ 45894 -205398 122149 -77614 -168320 131745 -539680 161673 -88117 -97800 -21976 127432
18191b34988A87440g8031B7788c7199B30847b08501C9558a2175l83833C20031
$$ -234988 187440 -78031 27788 -37199 230847 -208501 39558 -12175 -396008 320031
18180a5671l76019E347Q1859k6817a16736A48023d1059k48475J09574A74457A6352
$$ -15671 -391690 5347 87206 60389 -116736 148023 -41059 -289534 -179960 174457 16352
18168d2047A37709h5405L6237l10319a05927M5391A90921n3811F7110d2792j51218
$$ -42047 137709 -85405 -49168 -359487 -105927 -60536 190921 137110 67110 -42792 -194010
18157a94010I0140b61798a11807d14j47179I0998c30472f2926A44383b74555M5316
$$ -194010 90140 -261798 -111807 -414 -147593 90998 -330472 -62926 144383 -274555 -229239
18146b29239M911A46471a55487K2430m8578C43281a08027L4916a8652l03198D8658
$$ -229239 -224328 146471 -155487 -133057 -181635 343281 -108027 -73111 -18652 -321850 48658
18134C21462I1527a93931p7084d8846l9567A25716a13804j90055g7266c4095B15097
$$ 321462 91527 -193931 -271015 -48846 -88413 125716 -113804 -303859 -77266 -34095 215097
18122a5701B7916a1608r8315r2779M6978A53246a27358B00354k1633b12772f8973
$$ -15701 27916 -11608 -109923 -202702 -155724 153246 -127358 200354 178721 -212772 -68973
18110a03261C069J93982b68F2284C0631a6898B75514a5719A09704b8587M174k43119
$$ -103261 3069 197051 -268 62284 30631 -16898 275514 -15719 109704 -28587 -24413 -267532
18098b67532J30024H0757J510c01304I6055b4692E7412J02421i7702o0867H2903
$$ -267532 -137508 80757 82267 -301304 96055 -24692 57412 159833 -97702 -158569 82903
18086A30811A0596L27262B5840a87922A01686a74433a9740H8497c35832C00771
$$ 130811 10596 337858 25840 -187922 101686 -174433 -19740 88497 -335832 300771
18075B55278a15611A86085c42786G1995D250b13115j00789a11216J355A25544
$$ 255278 -115611 186085 -342786 71995 4250 -213115 -313904 -111216 -109861 125544
18064A8189a20842E0601a55229J9437J1607M7062A49474a98265C32283a76980
$$ 18189 -120842 50601 -155229 -135792 -124185 -77123 149474 -198265 332283 -176980
18053I0209a53547J4345G6573J40766d6781I0301L8756J14166b52748A47426J2387
$$ 90209 -153547 -139202 76573 217339 -46781 90301 129057 243223 -252748 147426 159813
18042A59813a50351D3422e7965B20676q7193i0382o658B66255d6290H4034m1375
$$ 159813 -150351 43422 -57965 220676 133483 -90382 -97040 266255 -46290 84034 42659
18031D2659J7686b93142A31964b6830l2553j37036A19600N227o1522a80422h1414
$$ 42659 60345 -293142 131964 -26830 -59383 -196419 119600 124827 63305 -180422 -81414
18019c74142A5197d16809I731P6345d0371A69651a38427j47563A48127h6167c6068
$$ -374142 15197 -416809 9731 86076 -40371 169651 -138427 -285990 148127 -86167 -36068
18007B85136I1124A4458b32793A65481J1855a72914p052P5677k16874H0258F635
$$ 285136 91124 14458 -232793 165481 177336 -172914 -179966 -104289 -321163 80258 6635
17995b01572c4328A01947b97013b2465B8921J38176e5757j79139B02200a8772
$$ -201572 -34328 101947 -297013 -22465 28921 167097 -55757 -234896 202200 -18772
17984a51090p3118i9175H3890P3135c09980e751j58217b4812C9117a63063A5211
$$ -151090 -224208 -99175 83890 157025 -309980 -5751 -163968 -24812 39117 -163063 15211
17972a3227j87243A30280d0211m7326K9394J3692A35011b14950J3132j3962j24671
$$ -13227 -200470 130280 -40211 -87537 -58143 -44451 135011 -214950 -201818 -215780 -340451
17961c40451l092a65131A29065J8912a31965b2465l2282q761A53939a82556A81251
$$ -340451 -343543 -165131 129065 147977 -131965 -22465 -54747 -63508 153939 -182556 181251
17949E2052J07700b6785K164j91132A14673a78700D1399J131O1280Q3238a95491
$$ 52052 159752 -26785 -24621 -215753 114673 -178700 41399 42530 103810 187048 -195491
17937i5976A59897m8715B7424a29103A0784i9515m1488K6631A61266c1651C5076
$$ -95976 159897 111182 27424 -129103 10784 -99515 -141003 -114372 161266 -31651 35076
17925c58985f9819J0666A57536d7141B03909c11898b1685k13734H0293a10561
$$ -358985 -69819 -59153 157536 -47141 203909 -311898 -21685 -235419 80293 -110561
17914e4404j25279K2403n0662Q5394J4917i542B40687a6560E3403J10095m6595
$$ -54404 -179683 -157280 -207942 -122548 -107631 -9542 240687 -16560 53403 163498 116903
17903A16903c29617A70192O4392a43635A66334D5540b29530e0818G8290f4266
$$ 116903 -329617 170192 234584 -143635 166334 45540 -229530 -50818 78290 -64266
17892a74751A4529b91610A76269B9290c0639A67305J10877i4903j57879i1357
$$ -174751 14529 -291610 176269 29290 -30639 167305 278182 -94903 -252782 -91357
17881A14322a50426A53883H521b36068B43488b23512d7615j8186j0108C8851q982
$$ 114322 -150426 153883 8521 -236068 243488 -223512 -47615 -65801 -75909 38851 29869
17870B9869a11689K4220a0449k03331r8553l05601C4817R0675J48343a90483M8847
$$ 29869 -111689 -87469 -10449 -213780 -312333 -617934 34817 125492 273835 -190483 -141636
17859a41636f3656b1237j45206j02030B0267L8779b00778B60072A6819M7580a22011
$$ -141636 -63656 -21237 -166443 -268473 20267 59046 -200778 260072 16819 64399 -122011
17847A52663e6381A32074c2996j17616A27032a03448A72955C5895b15358B51059
$$ 152663 -56381 132074 -32996 -150612 127032 -103448 172955 35895 -215358 251059
17836A24813m7643a01217B8809a16775A25078h2020j13813G2440N6827D9114J34877
$$ 124813 77170 -101217 28809 -116775 125078 -82020 -195833 72440 129267 49114 183991
17825A83991P3831p9685b24064f8022j19900B22901d760j72845b8249q1194e2166
$$ 183991 257822 178137 -224064 -68022 -187922 222901 -4760 -177605 -28249 -109443 -52166
17813H3493b21275A44695b24561J11874r7641E6376d4653G677a58828C02099G2389
$$ 83493 -221275 144695 -224561 -112687 -210328 56376 -44653 7677 -158828 302099 72389
17801I3986c2315B0055b2937C39505G1773J90163A6537P3586a15781k02831H4921
$$ 93986 -32315 20055 -22937 339505 71773 261936 16537 90123 -115781 -318612 84921
17789a6753j52553b3769G3892a6744o8520A15765b21478Q6537F4803c4175A3823
$$ -16753 -169306 -23769 73892 -16744 -85264 115765 -221478 -134941 64803 -34175 13823
17777a80439B30406b44036B47502c18013a07219A71709N7924h9996j83379E4949
$$ -180439 230406 -244036 247502 -318013 -107219 171709 229633 -89996 -273375 54949
17766A794K83900G3152f9215A10217a28406f3015k6366M1848j13068f2045j25342
$$ 1794 285694 73152 -69215 110217 -128406 -63015 -89381 -47533 -160601 -62045 -187387
17755a87387C07182h0211B0801b38322A07506K49946e2413A12786K8665f3133
$$ -187387 307182 -80211 20801 -238322 107506 357452 -52413 112786 141451 -63133
17744f7780k3927L2314m3850C82846a77351A59489a42191A12397a5232A00028
$$ -67780 -91707 -59393 -103243 382846 -177351 159489 -142191 112397 -15232 100028
17733B16824k3487c39589A90497a57284C5138m146a52657A84665a51112D7272
$$ 216824 193337 -339589 190497 -157284 35138 30992 -152657 184665 -151112 47272
17722g6300j28744K7208B9659K36570c46060G9672l1034k0043Q4924B6307a72865
$$ -76300 -205044 -177836 29659 266229 -346060 79672 48638 28595 113519 26307 -172865
17710B66891D3400J06165K44028I3825J07772j910b67133B05465a57225i05H4275
$$ 266891 43400 149565 393593 93825 201597 199687 -267133 205465 -157225 -905 84275
17698C19073A42952k4719b06402D415a27911r1025A04457h7125j06760J7475B59890
$$ 319073 142952 118233 -206402 4415 -127911 -218936 104457 -87125 -193885 -176410 259890
17686H7984b5586D90265b07856O4702n694m2651j22058B15481a09136j69546h6247
$$ 87984 -25586 490265 -207856 -143154 -148848 -191499 -313557 215481 -109136 -278682 -86247
17674c3110l03944A55527A4187Q9103n975e6199a1887j66268K9988A01203m460
$$ -33110 -337054 155527 14187 103290 97315 -56199 -11887 -178155 -148167 101203 96743
17663I6743f4157O531b8592j94512g9968B07591n7047K723c02142B61746A26434
$$ 96743 -64157 -57626 -28592 -223104 -79968 207591 150544 153267 -302142 261746 126434
17651a86008c341j01639B71053a53351e6230j50702F1079d8480C19358i1664B33464
$$ -186008 -3341 -104980 271053 -153351 -56230 -206932 61079 -48480 319358 -91664 233464
17639c79549J39893A3144c57748g2910G9491l8250e0717O544G1841a6959B69257
$$ -379549 -239656 13144 -357748 -72910 79491 41241 -50717 -44173 71841 -16959 269257
17627A73295L4688d3382n340A5874K49167F0688g253H4853P2682h1082p9045B01817
$$ 173295 207983 -43382 -48722 15874 265041 60688 -7253 84853 157535 -81082 -160127 201817
17614d3127F4548K3710a38929m7639e5639A28655b9111B54605Q1213I5975i5994
$$ -43127 64548 88258 -138929 -186568 -55639 128655 -29111 254605 335818 95975 -95994
17602a74996A54441n9816b9927B64194h1799A68157B8989L76132D8455M51444
$$ -174996 154441 94625 -29927 264194 -81799 168157 28989 405121 48455 499899
17592D99899d8449D17439k1551b42517D5558b11456j74029a8961B25992G0186
$$ 499899 -48449 417439 395888 -242517 45558 -211456 -385485 -18961 225992 70186
17581A97288o5997B2484J521b9100B5298b95646E4972d6959j08910a7144O374
$$ 197288 131291 22484 24005 -29100 25298 -295646 54972 -46959 -155869 -17144 -10770
17570a0770j42084m3334J1357E0356e936j46046O6745A06753a73922H6826J46772
$$ -10770 -152854 -196188 -184831 50356 -5936 -151982 -85237 106753 -173922 86826 233598
17559B33598A90K36307b03789A62623E5363c0429J3044A69247d961A03228f5159
$$ 233598 190 236497 -203789 162623 55363 -30429 -17385 169247 -4961 103228 -65159
17547B3804J71494a16092C7312h3473A67830J64415b61586J29244B11216j5103
$$ 23804 195298 -116092 37312 -83473 167830 332245 -261586 -132342 211216 196113
17537A96113H1779h8000A70213G0866c42958A48586K38072A05321k1294g9600
$$ 196113 81779 -88000 170213 70866 -342958 148586 386658 105321 84027 -79600
17526b85465a14651b0392j9883H2919M372c0489k5514A21428a75119A35902K84735
$$ -285465 -114651 -20392 -40275 82919 87291 -30489 -56003 121428 -175119 135902 420637
17515D20637N1129a37918B40963a52150i776E13089A64533k3509b7578m45905
$$ 420637 471766 -137918 240963 -152150 -9776 513089 164533 141024 -27578 -473483
17505d73483p549a11753l7189g466k27990C2175b25216E651a0242p3036D6407
$$ -473483 -481032 -111753 -148942 -7466 -235456 32175 -225216 5651 -10242 -83278 46407
17493A44881d1641a8964D9654J70838c165l58550B68314j21089K60641C6807J91198
$$ 144881 -41641 -18964 49654 220492 -3165 -361715 268314 147225 407866 36807 228005
17482B28005p1503R1472a2450B28348J77592a3452j11916m1531B74760I3520C826
$$ 228005 156502 247974 -12450 228348 405940 -13452 -125368 -166899 274760 93520 3826
17470B76237h2266F2710L26309J02913e8627B45508j22691N6902H6023J58053
$$ 276237 -82266 62710 389019 491932 -58627 245508 122817 179719 86023 244076
17460B44076B3163R3049L1914k3843n341B079K86163l795G3125J27687q639J91309
$$ 244076 23163 116212 148126 124283 118942 2079 288242 284447 73125 200812 192173 383482
17448C83482m2141H3575L98238A10156L28669A7393M32983A00673l926K25230
$$ 383482 341341 83575 481813 110156 438825 17393 450376 100673 96747 321977
17438C21977b17514B03794J30309o0450I0756q837K28816l6180j845p2316J47263
$$ 321977 -217514 203794 334103 273653 90756 81919 310735 274555 272710 200394 347657
17427C47657A45635N1859H7416f5621B89719n7810k2037j03242J31270j18404
$$ 347657 145635 197494 87416 -65621 289719 231909 209872 106630 237900 119496
17417A19496K56227I3668J37122E4856c1198B55159j1728K0379j08494P2039g7982
$$ 119496 375723 93668 230790 54856 -31198 255159 243431 263810 155316 227355 -77982
17405E03329A18539K66074j46720A0771K86546p6213a3786B51221i700B01510
$$ 503329 118539 384613 237893 10771 297317 221104 -13786 251221 -9700 201510
17394b02121I0889B548L90456a19903A41205R7774l1569h3066B84216Q9976m9359
$$ -202121 90889 2548 393004 -119903 141205 238979 207410 -83066 284216 374192 324833
17383C24833E4757L8747J89682d3381b0329B43484a88963C13254a79354A46737
$$ 324833 54757 93504 283186 -43381 -20329 243484 -188963 313254 -179354 146737
17372g6914j98368I3068a55800C31572A03553K60467a01912r718C7856K69529
$$ -76914 -275282 93068 -155800 331572 103553 364020 -101912 -111630 37856 307385
17362C07385b78714D52987h229n8935G0420h9983j56463B30855g0899I0659J98763
$$ 307385 -278714 452987 -8229 -67164 70420 -89983 -246446 230855 -70899 90659 289422
17351B89422F1677h4245D0292f9162B5226L5086c6456B46382K720E9628N2074
$$ 289422 61677 -84245 40292 -69162 25226 60312 -36456 246382 249102 59628 111702
17340A11702J29534A3358a9488B87674d9291A74118J56773A8854K04847J00664
$$ 111702 241236 13358 -19488 287674 -49291 174118 330891 18854 223701 324365
17330C24365J73123b23205C4755K59539N5716I9573C2586O6201a10616C20437
$$ 324365 497488 -223205 34755 294294 350010 99573 32586 98787 -110616 320437
17319C35151j10111D0370J779k78c388A64278P0512j11760P0959F6275J23329
$$ 335151 225040 40370 42149 41871 -3388 164278 234790 123030 193989 66275 189604
17308A89604D8178K86778j18035m72N7763j11017J39967m1057a58961A11487j1437
$$ 189604 48178 334956 216921 216449 274212 163195 303162 262105 -158961 111487 100050
17297A00050Q3413L5671q6386L98219A08402J62460a58036I1045J01580J98622
$$ 100050 183463 219134 132748 530967 108402 270862 -158036 91045 192625 391247
17287C91247A03899N5037K64493f181C74376A82114l7403J00529l8405p1224o359
$$ 391247 103899 158936 423429 -6181 374376 182114 144711 245240 206835 135611 129252
17276A29252a0588B73722A05644P5111a07839C03710j38082c8905n4837k0193
$$ 129252 -10588 273722 105644 180755 -107839 303710 165628 -38905 -93742 -113935
17266a13935D239J98342J11356q2879G2947J94561D8212J44314G1841d4331C73605
$$ -113935 4239 202581 313937 231058 72947 267508 48212 192526 71841 -44331 373605
17254C04726C476L7998J54211I0814K04655A38022E9314i5766b54p8033F8388
$$ 304726 3476 41474 195685 90814 295469 138022 59314 -95766 -254 -78287 68388
17242E11473p9070A1936L83955j72144P1194C7980L5844i5457a0741D63281B19278
$$ 511473 432403 11936 395891 223747 294941 37980 73824 -95457 -10741 463281 219278
17230E9120K39933n2187f1450B48354a54611B05406P721p7688K48887a27216c8749
$$ 59120 299053 246866 -61450 248354 -154611 205406 213127 135439 384326 -127216 -38749
17218B05927J28367A51224a44144B93843N8505G1124g1448k3426B12225p0511
$$ 205927 334294 151224 -144144 293843 352348 71124 -71448 -94874 212225 141714
17208A41714n0115M10258j48645J21066A17532J93433E2480J02763B461M29239
$$ 141714 91599 501857 353212 474278 117532 310965 52480 155243 2461 431700
17198D31700p4024o7857k3030N5480A07004N00992B27312K0491J59957q4609B0075
$$ 431700 357676 289819 266789 322269 107004 607996 227312 247803 407760 323151 20075
17186D05992n2687D6258R902O4290O6337p0960A2J10624J34484Q9236J42855B16936
$$ 405992 353305 46258 56160 120450 186787 115827 12 110636 245120 334356 477211 216936
17173A63872K57585j88817j1871J29928j05831M7608F0542J57424J45133r9539
$$ 163872 421457 232640 220769 350697 244866 292474 60542 217966 363099 263560
17163B63560H6515L0265K34595j52645Q3909A40929J59801d2559E43540k37500
$$ 263560 86515 116780 351375 198730 282639 140929 300730 -42559 543540 306040
17153C06040n8709J94452j56595F5771L02741j48323k7635q7912K62561M8040
$$ 306040 247331 441783 285188 65771 368512 220189 192554 104642 367203 415243
17143D15243l2488A90491M1762K86722j04633j43274J08224j028J28381B45528
$$ 415243 382755 190491 232253 518975 414342 271068 379292 378264 506645 245528
17132A78116J41574j664B2901K28776f6030B13698J92219O2717L424j6186B13304
$$ 178116 319690 318026 22901 251677 -66030 213698 405917 468634 472058 455872 213304
17120C15374j07064K8597j01275N6923J83799o9583J86250B26619M86973B6481
$$ 315374 208310 236907 135632 192555 376354 306771 493021 226619 713592 26481
17109A81595l9699K41306A85966J69277J11286A23436l018m17K35302J25030j98794
$$ 181595 141896 383202 185966 355243 466529 123436 120418 120001 355303 480333 281539
17098B81539P5216j38977J35093l9167J59926H9346L56021L3002J09821B79682
$$ 281539 356755 217778 352871 313704 473630 89346 445367 478369 588190 279682
17087C39022j31033K28735k7185A29321j9896N73850b6023C96603R4917K54044
$$ 339022 207989 436724 409539 129321 109425 683275 -26023 396603 491520 745564
17077G45564C22425A18860N08701A99136J43165J89925B34656K57693Q365J1783
$$ 745564 322425 118860 627561 199136 342301 532226 234656 492349 500714 512497
17067E12497k05992R2897L28703B72797Q9123J50686B44591K42607B13289J58777
$$ 512497 306505 399402 728105 272797 361920 512606 244591 487198 213289 372066
17057C72066J81741q7054m3229M7579j61298K29530j54353j81265N30934k5185
$$ 372066 553807 466753 423524 471103 309805 539335 384982 203717 734651 709466
17047G09466C35300J64353J6482Q4289r8025k03857L74040r354B68798P2603K40458
$$ 709466 335300 499653 516135 600424 502399 298542 672582 663228 268798 341401 581859
17036E81859k7346M2891o5314M6957j49819R2689J06747M8997O3289K7799j00020
$$ 581859 554513 597404 532090 579047 429228 521917 628664 677661 740950 768749 668729
17025F68729j82062K24391L1524k28193n4085K97584j49459Q039j70635L21358
$$ 668729 486667 711058 742582 514389 460304 757888 608429 616468 445833 767191
17015G67191l65210L72284K43510C42594L53231j86501J09696K69319p2352l47664
$$ 767191 401981 774265 1017775 342594 695825 509324 619020 888339 815987 468323
17005D68323M9494L02578k35659K24270J85032l46301K26241J00013D65247M21059
$$ 468323 517817 820395 584736 809006 994038 647737 873978 973991 465247 886306
16995H86306k63717j18358J86031j95630L48949q7305J00917k45206q3130L47970
$$ 886306 622589 504231 690262 494632 843581 756276 857193 611987 528857 876827
16985H76827k70812k846K72688l57408M23003m0046k8168l12398L86490D61692
$$ 876827 606015 603169 875857 518449 941452 901406 873238 560840 947330 461692
16974A043014j15688l26185j49813K35948M92852l06745j39675K09366l3616J11390
$$ 1043014 927326 601141 451328 687276 1180128 873383 733708 943074 909458 1020848
16964A020848k60071K45879j12755R4283k94228N98336k44450k09564r5515K74690
$$ 1020848 760777 1006656 893901 988184 693956 1292292 1047842 838278 742763 1017453
16954A017453J45186j19179L7754k53673j22957M72375n09192K01158L8027J03295
$$ 1017453 1162639 1043460 1081214 827541 704584 1176959 667767 868925 906952 1010247
16944A010247J81134k12305L96645o16249N25303j50352n2375k4785P0008Q557
$$ 1010247 1191381 979076 1375721 759472 1284775 1134423 1082048 1057263 1127271 1135828
16934A135828P029J15930k27132p760J85202K7809J21234l77907M21326k25527
$$ 1135828 1142857 1258787 1031655 1023895 1209097 1236906 1358140 980233 1401559 1176032
16924A176032J59677j55070K02908P3412j76113L05570m17648o1394J10914J12142
$$ 1176032 1335709 1180639 1383547 1456959 1280846 1586416 1168768 1107374 1218288 1330430
16914A330430J94248j53770j8004M6001P1388L6231j04601K47796L4609r7237
$$ 1330430 1524678 1370908 1352904 1398905 1470293 1506524 1401923 1649719 1684328 1587091
16904A587091K63322l37952j03428L55769l35122M65900p3853J0168k58597L86949
$$ 1587091 1850413 1512461 1409033 1764802 1429680 1895580 1821727 1831895 1573298 1960247
16894A960247o11012M67933q3346l7410K30695M687j04069L69832k12660L8010
$$ 1960247 1349235 1817168 1733822 1696412 1927107 1931794 1827725 2197557 1984897 2022907
16884B022907O9907l87443K85021J01873J21318k52476L6916R3192K34868n16666
$$ 2022907 2092814 1705371 1990392 2092265 2213583 1961107 1998023 2091215 2326083 1809417
16874A809417N46424m9652j45087J39138j78233K54338J26180j12802L3657J48898
$$ 1809417 2355841 2306189 2161102 2300240 2122007 2376345 2502525 2389723 2423380 2572278
16864B572278j10774L9476j75127L30973m4588M2566m4437K5054K47724k51999
$$ 2572278 2461504 2500980 2325853 2656826 2612238 2654804 2610367 2635421 2883145 2631146
16854B631146M08944K7511k23758L93632j33908m83439J07699K15721M02841j74788
$$ 2631146 3040090 3067601 2843843 3237475 3103567 2620128 2727827 2943548 3346389 3171601
16844C171601J71318j72970O96857n38883j13965J68929L85567j97754J51211
$$ 3171601 3342919 3169949 3866806 3327923 3213958 3382887 3768454 3570700 3721911
16835C721911J77077l5962K60780k14729L00991m4348J29851j91848J36510J8118
$$ 3721911 3898988 3863026 4123806 3909077 4210068 4165720 4295571 4103723 4240233 4258351
16825D258351M27447k13483R0708N9177L18318j39457J94406J45500N5784J1533
$$ 4258351 4685798 4472315 4563023 4622200 4940518 4801061 4995467 5140967 5196751 5208284
16815E208284K20900J62222k8762J02077K54969p7700N10967j26169j43339J82646
$$ 5208284 5429184 5591406 5562644 5664721 5919690 5841990 6352957 6226788 6083449 6266095
16805F266095K77476K33975m434O22235k13415K50570J396L55779L32438J82307
$$ 6266095 6543571 6777546 6773112 7395347 7181932 7432502 7433898 7789677 8122115 8304422
16795H304422K1495J91689k099O43242J41296J10494M47195L31822K7861O11413
$$ 8304422 8325917 8517606 8515507 9158749 9300045 9410539 9857734 10189556 10217417 10828830
16785A0828830J07881K12200N50949n193O97606L38975k0281L66352L12779Q37162
$$ 10828830 10936711 11148911 11699860 11694667 12392273 12731248 12710967 13077319 13390098 14227260
16775A4227260M4006O70357N15555P24939L07881M59264P52414Q10285K39305
$$ 14227260 14271266 14941623 15457178 16182117 16489998 16949262 17701676 18511961 18751266
16766A8751266R24842J019325L69070R03283J020982P68405J012533J179274Q68970
$$ 18751266 19676108 20695433 21064503 21967786 22988768 23757173 24769706 25948980 26817950
16757B6817950Q96831J284082J241951J353616J449685J478049J647808J748034
$$ 26817950 27714781 28998863 30240814 31594430 33044115 34522164 36169972 37918006
16749C7918006J539082J834317K552151J987855K454108K157502K764239K766444
$$ 37918006 39457088 41291405 43843556 45831411 48285519 50443021 53207260 55973704
16741E5973704L539177L421392L278551L938924M177653M455688M635298N079792
$$ 55973704 59512881 62934273 66212824 70151748 74329401 78785089 83420387 88500179
16733H8500179N188205N834717O279154O073632O906134O846755P392038P320466
$$ 88500179 93688384 99523101 105802255 111875887 118782021 125628776 133020814 140341280
16725A40341280P237496P860760P133761O880457O405242N538460M512336L472304
$$ 140341280 147578776 155439536 162573297 169453754 175858996 181397456 185909792 189382096
16717A89382096K551375R81227q24147j731678l377616m306696n582003o572464
$$ 189382096 191933471 192914698 192090551 190358873 186981257 182674561 177092558 170520094
16709A70520094o849528p789764p994512p823742p338045q063639p230791p263606
$$ 170520094 163670566 155880802 147886290 140062548 132724503 124660864 117430073 110166467
16701A10166467o661039o434423n901052n729581n358406m624078m597682m330089
$$ 110166467 103505428 97071005 91169953 85440372 80081966 75457888 70860206 66530117
16693F6530117l876662l710187l191883l097139k936316k737942k568837k239389
$$ 66530117 62653455 58943268 55751385 52654246 49717930 46979988 44411151 42171762
16685D2171762k323712j800468j447591k150027j856780j630667j556126j074522
$$ 42171762 39848050 38047582 36599991 34449964 32593184 30962517 29406391 28331869
16677B8331869j368920q79312j145907j274815q58862j032095r15829q96429l61681
$$ 28331869 26962949 26083637 24937730 23662915 22804053 21771958 20856129 19959700 19598019
16668A9598019j126889o73187q85380m24964l81372j072244l46183l53878k73471
$$ 19598019 18471130 17797943 16912563 16487599 16106227 15033983 14687800 14333922 14060451
16659A4060451o06175o58798j75751n16802l94962j46697o42608k20479o35546
$$ 14060451 13454276 12795478 12619727 12102925 11707963 11561266 10918658 10698179 10062633
16650A0062633k93513j87755m89303j47120r968l46559j38564m84874K6570m8620
$$ 10062633 9769120 9581365 9092062 8944942 8934974 8588415 8449851 7964977 7991547 7942927
16640G942927m03252j42916l39448k98308L95928n74252k94511j55851k9468P01
$$ 7942927 7539675 7396759 7057311 6759003 7154931 6580679 6286168 6130317 6100849 6101550
16630F101550l43924R0848J31245o63943P0984j73899k31619q2385K01401m17063
$$ 6101550 5757626 5848474 5979719 5315776 5386760 5212861 4981242 4898857 5100258 4683195
16620D683195M1868j79471j29643K1900N663r965M0096l38217k74534j13547J58469
$$ 4683195 4725063 4545592 4415949 4437849 4443512 4433547 4473643 4135426 3860892 3747345 3905814
16609C905814r1372j14326J44204j25729J5136j75696l35945L4384Q7241J9889
$$ 3905814 3814442 3700116 3844320 3718591 3733727 3558031 3222086 3256470 3343711 3363600
16599C363600k01863j72346j70639R1191K7019k31145L62647l11419J08619j62159
$$ 3363600 3161737 2989391 2818752 2909943 2936962 2705817 3068464 2757045 2865664 2703505
16589B703505l53083M39545k80915q9626r3675J63569m41738J47203j4835J66846
$$ 2703505 2350422 2789967 2509052 2419426 2325751 2489320 2047582 2194785 2179950 2346796
16579B346796M2449j74631k16254K03303k01416L4672l3372j59871K00360j85391
$$ 2346796 2389245 2214614 1998360 2201663 2000247 2034919 2001547 1841676 2042036 1856645
16569A856645J37264l5933k33332O8241O563k6229M0863j25941Q0542j82974J4219
$$ 1856645 1993909 1957976 1724644 1792885 1799448 1773219 1814082 1688141 1768683 1585709 1599928
16558A599928k57407J75006j94715L196L37708K93224m57027n6623J62855k19503
$$ 1599928 1342521 1517527 1322812 1326008 1663716 1956940 1499913 1443290 1606145 1386642
16548A386642K9153j7189J97810l74424p1448K25410m38964L21541J21826m1645
$$ 1386642 1415795 1398606 1596416 1221992 1150544 1375954 936990 1258531 1380357 1338712
16538A338712j22865P0252j87871p8907o8209J9172J79170k30770L17651j81296
$$ 1338712 1215847 1286099 1098228 1019321 951112 970284 1149454 918684 1236335 1055039
16528A055039q8723M37395n90950K02070N7040J23392j25646l41202J73579K61617
$$ 1055039 966316 1403711 812761 1014831 1071871 1195263 1069617 728415 901994 1163611
16518A163611m20306L08164l63116M32456l84405m5109J85609K1750N4118q4991
$$ 1163611 743305 1051469 688353 1120809 736404 691295 876904 898654 952772 867781
16508H67781p8503j19573K41509p1350K45496m54254K02302k09257J05904j05469
$$ 867781 789278 669705 911214 839864 1085360 631106 833408 624151 730055 624586
16498F24586j60182O55711m78648k05798L88837l23835J59403B50122L36638J69298
$$ 624586 464404 1120115 641467 435669 824506 500671 660074 250122 586760 756058
16488G56058J28722K0617j92537N7062j57357r0810K39297l7691p2298k07993
$$ 756058 884780 905397 712860 769922 612565 521755 761052 723361 651063 443070
16478D43070K79980n1560L0898O912o0154K0619k29799O67965E01003P7119r6817
$$ 443070 723050 671490 702388 709300 649146 669765 439966 1107931 501003 578122 481305
16467D81305J51049j39106k46177M72667j89840j76054N121J98412j57706A32813
$$ 481305 632354 493248 247071 719738 529898 353844 358965 557377 399671 132813
16456F27609J56070A01491K87301P6140J45205k60965L79363j69818J92045k22474
$$ 627609 783679 101491 388792 464932 610137 349172 728535 558717 750762 528288
16446E28288k37431N1974L5693J54971n6142K28981B59786J01016Q1564J24496
$$ 528288 290857 342831 378524 533495 477353 706334 259786 360802 442366 566862
16436E66862E9997m383M12263n9933j45818n1443K27211O0368l2157b4883E80828
$$ 566862 59997 55614 467877 407944 262126 210683 437894 498262 466105 -24883 580828
16424D95393k10555G4298J12941L15133k23479K27869r8808J06156A16778L36493
$$ 495393 284838 74298 187239 502372 278893 506762 407954 514110 116778 453271
16414D53271k2663A01501N02330A23912J97392P9740O2265j15088o4206k7959
$$ 453271 430608 101501 603831 123912 321304 401044 463309 348221 284015 256056
16404B56056O0077m8295n5076R2358R0174q259j69879D9920L43602C7118K44419
$$ 256056 316133 267838 212762 305120 395294 387035 217156 49920 393522 37118 281537
16393B81537F9411J96050I7221K14687b4455B15672F4009K51815Q2130n6048A51774
$$ 281537 69411 265461 97221 311908 -24455 215672 64009 315824 397954 341906 151774
16381B55671n5645J5041J28019M3245J41558k2087e6528k3591D23025k06081K35697
$$ 255671 200026 215067 343086 386331 527889 505802 -56528 -80119 423025 216944 452641
16370D52641j75545j29079C0248J98023K7142L4657C4747K76767J45618m0786
$$ 452641 277096 148017 30248 228271 255413 290070 34747 311514 457132 416346
16360D16346j40617J38729k8135P7403A96357a48876C05514j50033K08246J14068
$$ 416346 275729 414458 386323 463726 196357 -148876 305514 155481 363727 477795
16350D77795r7970F5435K0610d215C12557b5376F4187J32371h356H4294J6411
$$ 477795 379825 65435 86045 -4215 312557 -25376 64187 196558 -8356 84294 100705
16339A00705L40466j92637j6927A6870L26560c2550j44174E75506k61507b9346
$$ 100705 441171 248534 231607 16870 343430 -32550 -176724 575506 313999 -29346
16328A52091k8147K2711J17377G0202L2363a3361B13805q8799i5046C66514N3841
$$ 152091 123944 146655 264032 70202 102565 -13361 213805 125006 -95046 366514 420355
16317D20355j32405j40140C6359J09460k4576a67068I1468H220P2907J12348c9057
$$ 420355 287950 147810 36359 145819 121243 -167068 91468 8220 81127 193475 -39057
16305B24667d3632A54749J86826H9939J6554B4333g4246A61693a96977B2087L32730
$$ 224667 -43632 154749 341575 89939 106493 24333 -74246 161693 -196977 22087 354817
16294C54817d5101A44471L12154B0069R1077a88615B24437a00497a9722C4986
$$ 354817 -45101 144471 456625 20069 111146 -188615 224437 -100497 -19722 34986
16283D5216Q8895k5347B6851J52119P6740h9073L4361C7179D713R4667d6577C76807
$$ 45216 134111 108764 26851 178970 255710 -89073 -54712 37179 4713 99380 -46577 376807
16270a74580B50519B4922e9944A74478q0555b14647A07888L9395c1462A58a80011
$$ -174580 250519 24922 -59944 174478 93923 -214647 107888 147283 -31462 158 -180011
16258g2452A07934J88485I9403D8330K3912J22699n6700M6647a39859A39225J39166
$$ -72452 107934 296419 99403 48330 72242 194941 138241 184888 -139859 139225 278391
16247B78391J8214m4243C0387J36071M5349c035B51700h9750B9336M7710a08858
$$ 278391 296605 252362 30387 166458 211807 -3035 251700 -89750 29336 77046 -108858
16235E291f0126r021A94237o9140C1453J26173b10695M2048A02813a22925e3875
$$ 5291 -60126 -69147 194237 125097 31453 157626 -210695 -168647 102813 -122925 -53875
16223B7117a68069A61248a15203A854g0480C23820j51629m9225l3007j4505i8637
$$ 27117 -168069 161248 -115203 1854 -70480 323820 172191 122966 89959 75454 -98637
16211i6191Q435j05228C09499J9496A901J86637b11092A79925c20729H9555a2663
$$ -96191 -87756 -192984 309499 328995 1901 188538 -211092 179925 -320729 89555 -12663
16199a24172B58917e4439b859l4614B18010H5993a14992B6519e2624H6323a10966
$$ -124172 258917 -54439 -2859 -37473 218010 85993 -114992 26519 -52624 86323 -110966
16187B06400c4607C19998E6098b73346J17593B0917K74283b33705r268J07629
$$ 206400 -34607 319998 56098 -273346 -155753 20917 295200 -233705 -242973 -135344
16177a35344c3381k42813R0450G0571a20268H6609O9566c79307a74642j33586
$$ -135344 -33381 -276194 -185744 70571 -120268 86609 156175 -379307 -174642 -308228
16167c08228G8707A7455a4607A85350p7758l7668a57366a233q7289o3723g811
$$ -308228 78707 17455 -14607 185350 107592 69924 -157366 -1233 -88522 -152245 -7811
16155a74799n984B64171c49997D82558b67883E4802J47589p9217J27197a86933
$$ -174799 -180783 264171 -349997 482558 -267883 54802 202391 123174 250371 -186933
16144A03431g9795k41489G1172K32228E5463B7251b35202A73998a45808j09807
$$ 103431 -79795 -321284 71172 303400 55463 27251 -235202 173998 -145808 -255615
16134b55615j82618B06776b7967B00730a8727B26488r9998a67897j17304B24959
$$ -255615 -438233 206776 -27967 200730 -18727 226488 126490 -167897 -285201 224959
16123D5185L1652M2382f5282l9578D15264e3085B2343K52511b6436P673j43448
$$ 45185 76837 119219 -65282 -104860 415264 -53085 22343 274854 -26436 -18763 -162211
16112a62211d6583k24683A67459G2507A4613Q8247J03312q0090e4898D3905J11097
$$ -162211 -46583 -271266 167459 72507 14613 102860 206172 126082 -54898 43905 155002
16101A55002N9696o0707J0049C4951J35009a4840j20579c2012a4205E243J26952
$$ 155002 214698 153991 164040 34951 169960 -14840 -135419 -32012 -14205 5243 132195
16090A32195a59311B3670a34168b1425n9109B16878f7845D6160A8112f2966k16569
$$ 132195 -159311 23670 -134168 -21425 -80534 216878 -67845 46160 18112 -62966 -279535
16079b79535a20675j27581c7377p1718k6762j58171C26372a4106n10960f3013
$$ -279535 -120675 -248256 -37377 -109095 -135857 -294028 326372 -14106 -525066 -63013
16068e877l09614a00335F4449N8899f1338D42K8094J77686C1234A4571R9861b46009
$$ -5877 -315491 -100335 64449 123348 -61338 442 28536 206222 31234 14571 114432 -246009
16055C4859b92647a25549A38024b43274G6284a22466C7909A6032J04440b1246
$$ 34859 -292647 -125549 138024 -243274 76284 -122466 37909 16032 120472 -21246
16044B03347a02737D2469f6959q6004d1792k54015C12693g0549a4186j75110e8386
$$ 203347 -102737 42469 -66959 -152963 -41792 -295807 312693 -70549 -14186 -189296 -58386
16032f0408G3916i6870d2966n37983d4409C7583M55515a55370k6563P6114B3531
$$ -60408 73916 -96870 -42966 -580949 -44409 37583 493098 -155370 -181933 -105819 23531
16020E0728a32589j6719M9049o1535a5810f496A2985A390a6156A08513P5283a59752
$$ 50728 -132589 -149308 -100259 -161794 -15810 -6496 12985 1390 -16156 108513 183796 -159752
16007F118a32049B2626K5127c9605j19639j51024i5063l2558r9718g3549A13204
$$ 6118 -132049 22626 47753 -39605 -159244 -310268 -95063 -127621 -227339 -73549 113204
15995c52276B35897a60173A17491a3671m09857b541q6834A05957Q264f5370B92430
$$ -352276 235897 -160173 117491 -13671 -423528 -2541 -89375 105957 114221 -65370 292430
15983d1234A39658N06953B32060A0907g4937I8579j3408J59917b26594J12818
$$ -41234 139658 646611 232060 10907 -74937 98579 85171 245088 -226594 -113776
15973a13776c150G885b72029A51067J07069b52667E971b3094k39314a24828H0895
$$ -113776 -3150 7885 -272029 151067 258136 -252667 5971 -23094 -262408 -124828 80895
15961a63144M2468A13663K72456A23244c66498a25021e927k10506C2350J39218
$$ -163144 -120676 113663 386119 123244 -366498 -125021 -5927 -216433 32350 171568
15951A71568F4918P149b61215B67478c427j67042B0160K05770c00763l4490a26896
$$ 171568 64918 72067 -261215 267478 -3427 -170469 20160 225930 -300763 -335253 -126896
15939B7736e6511D32316c6676A36446b7567k98577E8871b88582n44H3625d0699
$$ 27736 -56511 432316 -36676 136446 -27567 -326144 58871 -288582 -289126 83625 -40699
15927c21017B43124M8551b26199I8013a35095A67362a94564e893J429k5426A61341
$$ -321017 243124 291675 -226199 98013 -135095 167362 -194564 -5893 -4464 -29890 161341
15915b22477E1069b3168m5651a3916D06362B1296c05486B32616o3854g1852l9690
$$ -222477 51069 -23168 -68819 -13916 406362 21296 -305486 232616 168762 -71852 -111542
15904a11542A04012L5039i7584b2599o5584A21763A0279b89671e5263o784b3072
$$ -111542 104012 139051 -97584 -22599 -88183 121763 10279 -289671 -55263 -62047 -23072
15892a67035D8800K8166J15443d6071k50581B49941D373a00417l19117B80782
$$ -167035 48800 76966 192409 -46071 -296652 249941 4373 -100417 -419534 280782
15881e04514a02908k53474F920a36042B19754a82112j11115J15148g7465A72531
$$ -504514 -102908 -356382 6920 -136042 219754 -182112 -293227 -178079 -77465 172531
15870a66051D9849A1314a05922B73532a51607C29366r609c37399a02127a1503
$$ -166051 49849 11314 -105922 273532 -151607 329366 319757 -337399 -102127 -11503
15859b02984m1141A3345e920A70059e4033K3688m54692e2628p2479A21094d7996
$$ -202984 -244125 13345 -5920 170059 -54033 -30345 -485037 -52628 -125107 121094 -47996
15847b5277C0562a35736C3510i0870B75776k3463a03360n4368P5395k09140Q9366
$$ -25277 30562 -135736 33510 -90870 275776 252313 -103360 -157728 -82333 -291473 -202107
15836b02107i5339j40452J08387B78610r7593E3439B5450O3930f0543m00606A65665
$$ -202107 -95339 -235791 -127404 278610 181017 53439 25450 89380 -60543 -461149 165665
15824F316b75424C4131J80838b3140B7516a12365A42276E0813o781d3723B38809
$$ 6316 -275424 34131 214969 -23140 27516 -112365 142276 50813 44032 -43723 238809
15812d10460c6046j04301f5124o072e704B71475a59131B11868H6229b88415B80124
$$ -410460 -36046 -140347 -65124 -71196 -5704 271475 -159131 211868 86229 -288415 280124
15800b8321k7576m49149d5731h488G5045d62594a19887B39641l6141p5747D0643
$$ -28321 -55897 -505046 -45731 -8488 75045 -462594 -119887 239641 203500 127753 40643
15788A70348K20230i11A42502l2121Q8134C5541P851b36610j6770f7984k1874
$$ 170348 390578 -911 142502 110381 198515 35541 43392 -236610 -253380 -67984 -89858
15777h9858B64205A18058b33421A43587L4893b81193G3592b35892R7548p4119
$$ -89858 264205 118058 -233421 143587 178480 -281193 73592 -235892 -138344 -212463
15767b12463d7287k16182i9935M8196E04257D8926J2192c23084C02594h3512o0058
$$ -212463 -47287 -263469 -99935 -51739 504257 48926 61118 -323084 302594 -83512 -143570
15756a43570e2154C8833L031K2160J2865J54982P8298a21676j21486A37027a9713
$$ -143570 -52154 38833 41864 64024 76889 231871 310169 -121676 -243162 137027 -19713
15744C43978K9790h0588a1119j59992A93325a52629B26925A307K03452d2535q3400
$$ 343978 373768 -80588 -11119 -171111 193325 -152629 226925 1307 204759 -42535 -125935
15733a25935l8561b5123A09873c13702G3612e4331q7339R260l4344l6721B08470
$$ -125935 -164496 -25123 109873 -313702 73612 -54331 -141670 -132410 -166754 -203475 208470
15721e408m5536J046A1510h5954R55D4823c95451a18984H3554a31052Q986l4355
$$ -5408 -50944 -49898 11510 -85954 -84999 44823 -395451 -118984 83554 -131052 -122066 -156421
15709a56421F528a48880B80700a7429A18170m8889b35328p158C21730j38036a3459
$$ -156421 6528 -148880 280700 -17429 118170 69281 -235328 -242486 321730 183694 -13459
15697A7987P6371f5443l183B02094M4966B1096g302B112K10833e3154Q561A44347
$$ 17987 94358 -65443 -68626 202094 247060 21096 -7302 2112 212945 -53154 -44593 144347
15684B10209J8964H8175J36234b8978A05465e5109j3981G130a02146G6395b551
$$ 210209 229173 88175 224409 -28978 105465 -55109 -69090 7130 -102146 76395 -2551
15672b8836j48508A03022J90a10287d1822E1351A6140g8358k66657I2282C6450
$$ -28836 -177344 103022 103212 -110287 -41822 51351 16140 -78358 -345015 92282 36450
15660c89293a1970l33918A90338h7087A51351b98987c0734j59205L1546l909b8124
$$ -389293 -11970 -345888 190338 -87087 151351 -298987 -30734 -189939 -158393 -162302 -28124
15648G9045J32012c3064m8918A29559e1724B63665j24867b6762J2644A4525d04879
$$ 79045 211057 -33064 -81982 129559 -51724 263665 138798 -26762 -14118 14525 -404879
15636b33821a09802n2897C1801A885Q7449f2791J1075q9390C35636a03394d2973
$$ -233821 -109802 -162699 31801 1885 89334 -62791 -51716 -141106 335636 -103394 -42973
15624D8784b13208A18835c18142f2752D8981J86103a34251G7539h025j43620j58160
$$ 48784 -213208 118835 -318142 -62752 48981 235084 -134251 77539 -8025 -151645 -309805
15613c09805B34219b79453j08149F6711h4771p3362e4876I1893a62368B1544a48902
$$ -309805 234219 -279453 -387602 66711 -84771 -158133 -54876 91893 -162368 21544 -148902
15601a63627L8263F080b8601m29863C01781i3680n8547A43006d6678E2752a07115
$$ -163627 -125364 6080 -28601 -458464 301781 -93680 -152227 143006 -46678 52752 -107115
15589a61879j7809I2925b20059D5324K38629A21187J75501G1242F037J32708b41133
$$ -161879 -179688 92925 -220059 45324 283953 121187 296688 71242 6037 138745 -241133
15577A26875a17159C2209K6169K2251c26822P8170E4166j0306b55130Q2336f1584
$$ 126875 -117159 32209 58378 80629 -326822 -248652 54166 43860 -255130 -172794 -61584
15565f0974m8661n6116E5017a08917H2521A9597J76103J8020a29067r1436f4321
$$ -60974 -109635 -165751 55017 -108917 82521 19597 195700 213720 -129067 -220503 -64321
15553c41067a02720B8121h999B19400i1106j31708g6458L4518A15910a25695o4831
$$ -341067 -102720 28121 -8999 219400 -91106 -222814 -76458 -41940 115910 -125695 -190526
15542a90526A00680J02989j3179h3950l24809d2935B7225K19196A17073e3642
$$ -190526 100680 203669 190490 -83950 -408759 -42935 27225 246421 117073 -53642
15531a70341e1567A32284c67731A34925b53811B42192N1149H7688R6514L498g9712
$$ -170341 -51567 132284 -367731 134925 -253811 242192 293341 87688 184202 187700 -79712
15519e49r8377M0481N534A22184l1043a52768B8164K7308b29289G1624h3323A09918
$$ -549 -98926 -58445 -52911 122184 91141 -152768 28164 55472 -229289 71624 -83323 109918
15506a3297j52156f1408C46490c38384A05159k1020l4435d1789k2961J5647k17380
$$ -13297 -165453 -61408 346490 -338384 105159 84139 49704 -41789 -64750 -49103 -266483
15495b66483b728A38228b7237A01204b27155b722H442g3703B34925r8382a01234
$$ -266483 -2728 138228 -27237 101204 -227155 -2722 8442 -73703 234925 136543 -101234
15483a42948J4399r6067N0021j10022A37271e8466q5100k1098r3445f0465q2907
$$ -142948 -128549 -224616 -174595 -284617 137271 -58466 -143566 -164664 -258109 -60465 -143372
15472a43372a9054e309G6600a6301o1381I716J03773c1408B62442A28599O3792
$$ -143372 -19054 -5309 76600 -16301 -77682 9716 113489 -31408 262442 128599 192391
15461A92391j1376B2438K12442M657f4821o0139G1332L05619F9225b2890P759
$$ 192391 181015 22438 234880 239537 -64821 -124960 71332 376951 69225 -22890 -15131
15450a5131j40907C7655R2043P75a41128G8282C7975K41952j29090P4921c243
$$ -15131 -156038 37655 129698 130473 -141128 78282 37975 279927 150837 225758 -3243
15438C9581N9949L5722a81459B42300i7983A46026c7653a6009k6907p9974e0742
$$ 39581 99530 135252 -181459 242300 -97983 146026 -37653 -16009 -42916 -122890 -50742
15426a784A5210J33332a95679k21085B9443b03450E8666K24780A37300J2541K55197
$$ -1784 15210 148542 -195679 -416764 29443 -203450 58666 283446 137300 149841 405038
15415D05038g143m3046j45320I1978k8732M02509b8480J4094j65879I5617b79642
$$ 405038 -7143 -50189 -195509 91978 63246 465755 -28480 -14386 -180265 95617 -279642
15403a67669E3289e0493k179j47614B7740a908k4635A23579a95789E5592c72995
$$ -167669 53289 -50493 -52672 -200286 27740 -1908 -26543 123579 -195789 55592 -372995
15391B04876a38146A61341b2094A33242A0342J2791b9345Q681A32171D7715a61801
$$ 204876 -138146 161341 -22094 133242 10342 23133 -29345 -20664 132171 47715 -161801
15379B36912c7823C36692a17298A49999i704l11684I0894j4819a7208A7400a36218
$$ 236912 -37823 336692 -117298 149999 -9704 -321388 90894 76075 -17208 17400 -136218
15367G1165b33919B23719b60445i6364C5358J17264l4142a27228A15287j0739
$$ 71165 -233919 223719 -260445 -96364 35358 152622 118480 -127228 115287 104548
15357A04548a8779Q027l18873N4692O3294A79309G6131a9098G3185d32424a97645
$$ 104548 -18779 -10752 -329625 -274933 -211639 179309 76131 -19098 73185 -432424 -197645
15345f0811C47742p9653e5701B00241E2228a02590p3929a4290j26950A56011a03921
$$ -60811 347742 268089 -55701 200241 52228 -102590 -176519 -14290 -141240 156011 -103921
15333b06655j01150A42263h5475k8845C6232a42071d5525A91278a52875D6662
$$ -206655 -307805 142263 -85475 -114320 36232 -142071 -45525 191278 -152875 46662
15322F7756a37079C3456a43651B9191a69551A17929K07093i592A69004A7740J33021
$$ 67756 -137079 33456 -143651 29191 -169551 117929 325022 -9592 169004 17740 150761
15311A50761d5892A22379b42543C00152A44137P2663A07300Q8592o3346c71818
$$ 150761 -45892 122379 -242543 300152 144137 216800 107300 195892 132546 -371818
15300b8345B17870k5484b5804A56868J69009F5551b5045A77511C469O3872g0440
$$ -28345 217870 192386 -25804 156868 325877 65551 -25045 177511 3469 67341 -70440
15288c1094A41972a4214E859a11550G6873l7490i9928E1797K41752E5858a02523
$$ -31094 141972 -14214 5859 -111550 76873 39383 -99928 51797 293549 55858 -102523
15276b51464g0249B47210l3618c49254B22811H8226l6642g2949K3228C09010e0659
$$ -251464 -70249 247210 213592 -349254 222811 88226 51584 -72949 -49721 309010 -50659
15264a69422A0297a29684A00646e7731a3071C02275A16517l3092C499K43406j18140
$$ -169422 10297 -129684 100646 -57731 -13071 302275 116517 83425 3499 246905 128765
15253A28765K7799D29L27616J21379J32708K75344P35760k63612O2886N107F31067
$$ 128765 156564 429 328045 449424 582132 857476 1593236 1329624 1392510 1397617 631067
15241a0483k21739M6589B74448j23665K38455b03774A82968j0996C2641M375J56919
$$ -10483 -232222 -185633 274448 150783 389238 -203774 182968 171972 32641 37016 193935
15230A93935P7675M2518j23843f8023A57914m6465e0935A8878K29452d08050A07295
$$ 193935 271610 314128 190285 -68023 157914 111449 -50935 18878 248330 -408050 107295
15218B2453a31090r8318H4212a56379f8731B81051j04706B5168I976a44035n1171
$$ 22453 -131090 -229408 84212 -156379 -68731 281051 176345 25168 9976 -144035 -195206
15207a95206A3303R0820f9850A53304L55884b83595d7602j37347B00689H1985
$$ -195206 13303 104123 -69850 153304 509188 -283595 -47602 -184949 200689 81985
15196G2105i4742r597A47628F1029M8699E0014h3252D7059N0674h1782A19624
$$ 72105 -94742 -104339 147628 61029 109728 50014 -83252 47059 97733 -81782 119624
15184a28936k9250b320k00859i5156A18224a897A87262J70531c48143A14111n2399
$$ -128936 -158186 -2320 -203179 -95156 118224 -1897 187262 357793 -348143 114111 61712
15173F1712N8995Q877a95415B64346j7849c8541H8935J80902J13362B5729O20142
$$ 61712 120707 129584 -195415 264346 246497 -38541 88935 269837 383199 25729 645871
15162F45871D8796J92402a56866d7039A4064P3101a15770C61839m1432D6565e1370
$$ 645871 48796 241198 -156866 -47039 14064 87165 -115770 361839 320407 46565 -51370
15150B13669J7643b83575B81137r2495b50390C0425f7187o7145A47972N3814c55078
$$ 213669 231312 -283575 281137 188642 -250390 30425 -67187 -134332 147972 201786 -355078
15138d6545C09494b9871j72734C24157D8052J65310F8990L11612A1103a19789
$$ -46545 309494 -29871 -202605 324157 48052 213362 68990 380602 11103 -119789
15127c18197d4890B18495A5845R8192M5906k4555R7303r3330g8083D52385A72691
$$ -318197 -44890 218495 15845 114037 159943 135388 232691 139361 -78083 452385 172691
15115C849J61656O1825A09306M02452k04293A48063J72836b4275B15650H7996
$$ 3849 165505 227330 109306 511758 307465 148063 320899 -24275 215650 87996
15104A03310Q0796f3031I9742N2646m1019R9137h7128k61950H065a19503D44207
$$ 103310 184106 -63031 99742 152388 111369 210506 -87128 -349078 8065 -119503 444207
15092B02056f2112j83537A85326B2947Q2758L63736A97292K24889F2506K8463
$$ 202056 -62112 -245649 185326 22947 105705 469441 197292 422181 62506 90969
15082I0969i593I942K23530F0972A2652k120a9563D28698j65670J7805A31828
$$ 90969 -9593 9942 233472 60972 12652 10532 -19563 428698 263028 280833 131828
15070C6113R6607d32217D09383a23845C26855a79994A52475K58664p1170E6150
$$ 36113 132720 -432217 409383 -123845 326855 -179994 152475 411139 339969 56150
15059A30609f0116G1471J87722j16463D7084A8834J36179J08560o5574a07163
$$ 130609 -60116 71471 259193 142730 47084 18834 155013 263573 197999 -107163
15048G2820j6139J45757d3581c079C37337c00739A76678K10680A23214K20296
$$ 72820 56681 202438 -43581 -3079 337337 -300739 176678 387358 123214 343510
15038C43510A3487J86248a94263b4089j07885C2965N1178j8734M51807h295G3667
$$ 343510 13487 199735 -194263 -24089 -131974 32965 84143 65409 517216 -8295 73667
15026b05010B05103m2462O3790O2280g5551A72403q1070J42447H6029d2118G2635
$$ -205010 205103 162641 226431 288711 -75551 172403 91333 233780 86029 -42118 72635
15014A58812m5978a89325B10987J61287j73977E001L58510j68528q9750L60053
$$ 158812 112834 -189325 210987 372274 198297 5001 363511 194983 105233 465286
15004D65286c6833A99589n1601R4939K15484k06278K14185h2450A78815a29247
$$ 465286 -36833 199589 147988 242927 458411 252133 466318 -82450 178815 -129247
14993D9530a58155D74763a23530I774K58563o5139h5352D6597J97507J58125A59883
$$ 49530 -158155 474763 -123530 9774 268337 203198 -85352 46597 244104 402229 159883
14981C37114J9400j49566n242J39576e2345C81336o8216J10905n2507H6756K00721
$$ 337114 356514 206948 201706 341282 -52345 381336 313120 424025 371518 86756 287477
14970B87477A4952O2148J85434l7508K25425Q6868j92112L6475j02737N7645r6291
$$ 287477 14952 77100 262534 225026 450451 537319 345207 381682 278945 336590 240299
14959B40299o1481q1415J37896J15865n3079L87243B79806J5674J89668A02961
$$ 240299 178818 97403 235299 351164 298085 685328 279806 295480 485148 102961
14948C01121K35263k45397P2439B2991N45837A0087L3555M8087J94839m8537a31931
$$ 301121 536384 290987 363426 22991 568828 10087 43642 91729 286568 238031 -131931
14936a29530B44520J33658A85553J29490n6758A23573A3556R6927c827B20529
$$ -129530 244520 378178 185553 315043 258285 123573 13556 110483 -3827 220529
14925D16780h7250C69952m2840J02557j20063K66250j41284l0996j42589j25996
$$ 416780 -87250 369952 327112 429669 309606 575856 434572 403576 260987 134991
14915A34991O4923r9595L20703k6329j49046L7233K45025j83148m6699F8638L57168
$$ 134991 199914 100319 421022 394693 245647 282880 527905 344757 298058 68638 425806
14904D25806j12639r131J67786A18504L75921k13759l4181j17656J74604q2404
$$ 425806 313167 304036 471822 118504 494425 280666 246485 128829 303433 221029
14894B21029Q8317J03569i9171D66025r8981h361F2362M67919A63040J26247A7310
$$ 221029 309346 412915 -99171 466025 367044 -8361 62362 530281 163040 289287 17310
14882D49657k08841q7170K73386O0722A83007G2424P6627J9134K13783O1320k7064
$$ 449657 240816 153646 427032 487754 183007 72424 149051 168185 381968 443288 416224
14871D16224j40468J62087j14414O0110k8273j42851K96918j84863O66K69003
$$ 416224 275756 437843 323429 383539 355266 212415 509333 324470 325136 594139
14861E94139B00726L91932j32292K08469l14810A13749N24048k36011I6406L39458
$$ 594139 200726 592658 460366 668835 354025 113749 637797 401786 96406 435864
14851D35864N7547L4340k27798K41255A25939O5186K67342k219l2054N0334J61370
$$ 435864 493411 527751 299953 541208 125939 191125 458467 456248 424194 474528 635898
14840F35898j46907j61457Q3761P9557j26458K42991p354k83068A37494L91258
$$ 635898 488991 327534 411295 490852 364394 607385 600031 316963 137494 528752
14830E28752B08744J5680J07750j23386J80554L18993j96775j28952j59468K74254
$$ 528752 208744 224424 332174 208788 389342 708335 511560 382608 223140 497394
14820D97394K8879K59775l26973j10780J48911J4595j97852N71194C31778L52847
$$ 497394 526273 786048 459075 348295 497206 511801 313949 885143 331778 684625
14810F84625B58465Q4954K87412A72530J24281o5175K4434K53240M042j20261
$$ 684625 258465 343419 630831 172530 296811 231636 256070 509310 513352 393091
14800C93091L8115J79386j23193j89921R4469Q0146P2390j50536J97258j89282
$$ 393091 431206 610592 487399 297478 391947 472093 544483 393947 591205 401923
14790D01923o7141J81511j07277J90951j42500M0413q8274Q9580K85417C02599
$$ 401923 334782 516293 409016 599967 457467 497880 409606 499186 784603 302599
14779C34416N112L17837B77847L72781m7838k32783L4730k1760Q9795J43754k26057
$$ 334416 339528 657365 277847 650628 602790 370007 404737 382977 472772 616526 390469
14768C90469N01404l21328k1107J83890l45931J22404r7436R7585R9433L5283
$$ 390469 891873 570545 549438 733328 387397 509801 412365 509950 609383 644666
14758F44666J55959A10576M18473q2109K41264j76538L70132l97547J98586L2445
$$ 644666 800625 110576 529049 446940 688204 511666 881798 484251 682837 715282
14748G15282l20352j3208K33783o2627R4844J16933K1143C58781M31916M0293
$$ 715282 394930 381722 615505 552878 647722 764655 785798 358781 790697 830990
14738H30990j7774j17839L52939m59501j16102L93185n242k20303J24115j73256
$$ 830990 813216 695377 1048316 588815 472713 865898 860656 640353 764468 591212
14728E91212K37605j05486j80336J60809k23935K4259K24455J42546k14066M1046
$$ 591212 828817 723331 542995 703804 479869 504128 728583 871129 657063 698109
14718F98109m5875J08076p818J26279k49556J49715K08573k11210J71071m04527
$$ 698109 652234 760310 752492 878771 629215 778930 987503 776293 947364 542837
14708E42837O1661L29188p8837J65602J0803j22707k56486J22714L8255l43383
$$ 542837 604498 933686 854849 1020451 1031254 908547 652061 774775 813030 469647
14698D69647L87329k54228J46406l8536J30378J88237o0170j25080J95516l80905
$$ 469647 856976 602748 749154 710618 840996 1029233 969063 843983 1039499 658594
14688F58594J64649J25213l06029K61120j3282p5895o808J10242N4910M1618l5880
$$ 658594 823243 948456 642427 903547 890265 814370 807562 917804 972714 1014332 978452
14677I78452J5335r408q4352j15413J25263n7350O2248L0825J16123l77465J35451
$$ 978452 993787 984379 900027 784614 909877 852527 914775 945600 1061723 684258 819709
14666H19709K94383j70749K68942l79453J46834j02293K7501K042K18888j22438
$$ 819709 1114092 943343 1212285 832832 979666 877373 904874 906916 1125804 1003366
14656A003366L89994o27636L55684r3958n7389L29136n3913k43585L44799n71106
$$ 1003366 1393360 765724 1121408 1027450 970061 1299197 1245284 1001699 1346498 775392
14646G75392K58545M7948M0215p1569J12812j54980J37701J1222J7354P7781j13982
$$ 775392 1033937 1081885 1122100 1050531 1163343 1008363 1146064 1157286 1174640 1252421 1138439
14635A138439p4573q5895K39510j17891J21998N3539k62501j0105K43268j57737
$$ 1138439 1063866 977971 1217481 1099590 1221588 1275127 1012626 1002521 1245789 1088052
14625A088052J58427J90826m48772N82821o40722K65851L6788K15135k68515L45763
$$ 1088052 1246479 1437305 988533 1571354 930632 1196483 1233271 1448406 1179891 1525654
14615A525654m41741L19040j8444j8958J45222K7596l5740J08452L1324N4367
$$ 1525654 1083913 1402953 1384509 1365551 1510773 1538369 1502629 1611081 1642405 1696772
14605A696772k05755L31404j73553j98899K53713k63113J24961M4240K41033k95037
$$ 1696772 1491017 1822421 1648868 1449969 1703682 1440569 1565530 1609770 1850803 1555766
14595A555766J82815k24847L15948k84434J15581J75877k37279j73142L51178
$$ 1555766 1738581 1513734 1829682 1545248 1660829 1836706 1599427 1426285 1777463
14586A777463k39823N90824p51133N78468j17470k15451L80207k63828L14056
$$ 1777463 1537640 2128464 1377331 1955799 1838329 1622878 2003085 1739257 2053313
14577B053313R0223k57805j47460M80595m43643J89439J47664R5445l63887J80703
$$ 2053313 2143536 1885731 1738271 2218866 1775223 1964662 2112326 2207771 1843884 2024587
14567B024587J66051P232J18008K39950k45904K94127j44827J63086K26619l0572
$$ 2024587 2190638 2197870 2315878 2555828 2309924 2604051 2459224 2622310 2848929 2818357
14557B818357K85149J36394o3692L03232J55733K62766J025367K92437K097938
$$ 2818357 3103506 3239900 3176208 3479440 3635173 3897939 4923306 5215743 7313681
14548G313681L933345R244503K0162266M658A8242290p896167E126732k207190
$$ 7313681 11247026 20491529 40653795 40658453 18242290 10346123 5126732 2919542
14540B919542p73154m13851J51051l89021J62968M18931O0828l22643J62758K19185
$$ 2919542 2146388 1732537 1883588 1494567 1657535 2076466 2137294 1814651 1977409 2196594
14530B196594j73260l17578M96028j37159M8265P2218l3788j97993K78843J28046
$$ 2196594 2023334 1705756 2201784 2064625 2112890 2185108 2151320 1953327 2232170 2360216
14520B360216n7407j6353q6950L51249o8341J90237l89879J96105J71537k5207
$$ 2360216 2302809 2286456 2199506 2550755 2482414 2672651 2282772 2478877 2650414 2625207
14510B625207J85069k15366P083L13822Q3496j95973L27819l48954q0430L42504
$$ 2625207 2810276 2594910 2601993 2915815 2999311 2803338 3131157 2782203 2701773 3044277
14500C044277J89518m79650K29446l3467R5934Q7218o8123K40842j22114K75962
$$ 3044277 3233795 2754145 2983591 2950124 3046058 3133276 3065153 3305995 3183881 3459843
14490C459843j40611K74004j86979O2795j00362R2803q3606j03926L75759j62875
$$ 3459843 3319232 3593236 3406257 3469052 3368690 3461493 3377887 3273961 3649720 3486845
14480C486845J14782J32230P880K64039m14983K41064J42365j31050K07184L59671
$$ 3486845 3601627 3733857 3741737 4005776 3590793 3831857 3974222 3843172 4050356 4410027
14470D410027l38292K29341n6245j35019L76154m53744K55763J8354J9438J58543
$$ 4410027 4071735 4301076 4244831 4109812 4485966 4032222 4287985 4306339 4325777 4484320
14460D484320j26487K29879J69089K08220k04169n4988k3403L88255j65959K53036
$$ 4484320 4357833 4587712 4756801 4965021 4760852 4705864 4682461 5070716 4904757 5157793
14450E157793P8634n074J54515j72124J31802J8132L4115j36400L86218k35407
$$ 5157793 5236427 5231353 5385868 5213744 5345546 5363678 5397793 5261393 5647611 5412204
14440E412204N94649j08561J14663P8474N7742m38282L87156J25687R7877K36610
$$ 5412204 6006853 5898292 6012955 6091429 6149171 5710889 6098045 6223732 6321609 6558219
14430F558219l09602L84716j25130K27350K71414r9722J31375K89725J00267k2161
$$ 6558219 6248617 6633333 6508203 6735553 7006967 6907245 7038620 7328345 7428612 7406451
14420G406451l74605L90410M85098l43320L99387m4455J33319N60710k27734l21006
$$ 7406451 7031846 7422256 7907354 7564034 7963421 7918966 8052285 8612995 8385261 8064255
14410H064255N15505K89795R3886L82092l4624K19615j31897K54385K9415M88313
$$ 8064255 8579760 8869555 8963441 9345533 9310909 9530524 9398627 9653012 9682427 10170740
14400A0170740o5546J87776J38909J51980K22078p339M78897J15547o8867K32768
$$ 10170740 10105194 10292970 10431879 10583859 10805937 10798598 11277495 11393042 11324175 11556943
14390A1556943K40728J69691K76419J74820m7434O31745j7349K01701P09629k25045
$$ 11556943 11797671 11967362 12243781 12418601 12371167 13002912 12985563 13187264 13896893 13671848
14380A3671848L86874K13121N67568J66097n3765L78357L02685N47571K06271
$$ 13671848 14058722 14271843 14839411 15005508 14951743 15330100 15632785 16180356 16386627
14371A6386627J66806L06132M23598N45263J98350J38769M10495Q49086J63548
$$ 16386627 16553433 16859565 17283163 17828426 18026776 18165545 18576040 19425126 19588674
14362A9588674M39489L94959L70698M35127O34002L00729K77940P18939R66899
$$ 19588674 20028163 20423122 20793820 21228947 21862949 22163678 22441618 23160557 24127456
14353B4127456P46614N47423L88270R86311L84636P18376Q03327N02876P99371
$$ 24127456 24874070 25421493 25809763 26796074 27180710 27899086 28702413 29205289 30004660
14344C0004660P35552J080179R19625J029811K56548R70021J369893Q57003J018816
$$ 30004660 30740212 31820391 32740016 33769827 34026375 34996396 36366289 37223292 38242108
14335C8242108J222538J017135J504701J352822J003046J407884J753742J347779
$$ 38242108 39464646 40481781 41986482 43339304 44342350 45750234 47503976 48851755
14327D8851755J843465J222909K054769J836802J710236K250517K267868K024035
$$ 48851755 50695220 51918129 53972898 55809700 57519936 59770453 62038321 64062356
14319F4062356K082790L000842K090799K923616K815355K808453L069152L516063
$$ 64062356 66145146 69145988 71236787 74160403 76975758 79784211 82853363 86369426
14311H6369426L543277L292094L801583L828904M463225M276476M788403N466722
$$ 86369426 89912703 93204797 97006380 100835284 105298509 109574985 114363388 119830110
14303A19830110N057030O071886N881589O225930O893503P021855P261953Q233896
$$ 119830110 124887140 130959026 136840615 143066545 149960048 156981903 164243856 172477752
14295A72477752Q125718Q786774R383243R553881J0220209J0826300J1447127
$$ 172477752 180603470 189390244 198773487 208327368 218547577 229373877 240821004
14288B40821004J1744076J2737144J2762783J3083518J3952970J3753461J4290330
$$ 240821004 252565080 265302224 278065007 291148525 305101495 318854956 333145286
14281C33145286J4442135J4466968J4115940J3648017J3524640J2157612J1090581
$$ 333145286 347587421 362054389 376170329 389818346 403342986 415500598 426591179
14274D26591179R417520P405530M475360R19078J85775l66542l313401k953591
$$ 426591179 436008699 443414229 447889589 448808667 448994442 448627900 445314499 442360908
14266D42360908n390806q498372j0954149j2360397j3909958j5023413j5415679
$$ 442360908 436970102 428471730 417517581 405157184 391247226 376223813 360808134
14259C60808134j5522320j5729058j5506430j5401959j4858968j3552430j2855779
$$ 360808134 345285814 329556756 314050326 298648367 283789399 270236969 257381190
14252B57381190j2862683j2717681j1503344j1432098j0572721r665541r741571
$$ 257381190 244518507 231800826 220297482 208865384 198292663 188627122 178885551
14245A78885551q414752p742317q127477p124760p136839o625590n745409n533106
$$ 178885551 170470799 162728482 154601005 147476245 140339406 133713816 127968407 122435301
14237A22435301n339756n307497n100244m592350m184992l987109l189911l905747
$$ 122435301 117095545 111788048 106687804 102095454 97910462 93923353 90733442 86827695
14229H6827695l660566k810805l383093k822320k992344k340887k951360j864010
$$ 86827695 83167129 80356324 76973231 74150911 71158567 68817680 65866320 64002310
14221F4002310k694871j634604k154232k083970j606199j942059j652900j311366
$$ 64002310 61307439 59672835 57518603 55434633 53828434 51886375 50233475 48922109
14213D8922109j581462j311271j278972j672623j489139j008306J7557j674047
$$ 48922109 47340647 46029376 44750404 43077781 41588642 40580336 40597893 38923846
14205C8923846j443528j272371r23730o99685j096656m05517j204446j071178
$$ 38923846 37480318 36207947 35284217 34584532 33487876 33082359 31877913 30806735
14197C0806735l85773j310680n11515n55431m91596o68233r31328n63857q64533
$$ 30806735 30420962 29110282 28598767 28043336 27551740 26883507 25952179 25388322 24523789
14188B4523789j67370o23817l81196o39588l74351o31282k78818n01378p06896
$$ 24523789 24356419 23732602 23351406 22711818 22337467 21706185 21427367 20925989 20219093
14179B0219093l97134j14041l95358n92944m23293m86723j32225o18317k14545
$$ 20219093 19821959 19707918 19312560 18719616 18296323 17809600 17677375 17059058 16844513
14170A6844513n35263L6681l81131l14127j85599k23955m25821p7019p55312K51118
$$ 16844513 16309250 16345931 15964800 15650673 15465074 15241119 14815298 14738279 13982967 14234085
14160A4234085j71978m00211m57310m6955j24459n02819j03272j74466l34737
$$ 14234085 14062107 13661896 13204586 13157631 13033172 12530353 12427081 12252615 11917878
14151A1917878r2577l53162j19454m279l22175j07557j35136j93839J15078l09952
$$ 11917878 11825301 11472139 11352685 11348406 11026231 10918674 10783538 10589699 10704777 10394825
14141A0394825k53097l23655J27369k59587j24641j18935k88964J49306j82035
$$ 10394825 10141728 9818073 9945442 9685855 9561214 9442279 9153315 9302621 9120586
14132I120586l03837P483n2170l67337R3957j63545j6897k86184j26563J09112
$$ 9120586 8816749 8824232 8772062 8404725 8498682 8335137 8318240 8032056 7905493 8014605
14122H014605o93671K5843j8433K18896o1739n83926M05168k72853O625k45832
$$ 8014605 7320934 7346777 7328344 7547240 7485501 6901575 7306743 7033890 7040515 6794683
14112F794683q5653q2403k13318j10998N6512N384P8339k48431k34655L2908j53849
$$ 6794683 6709030 6626627 6413309 6302311 6358823 6364207 6442546 6194115 5959460 5992368 5838519
14101E838519J59400k97147l37016J77549J74392o19696M50770m10780n0758R4984
$$ 5838519 5997919 5700772 5363756 5541305 5715697 5096001 5546771 5135991 5085233 5180217
14091E180217r1366K38697j99888k85039K00688K95487n60915J54932j03463k63690
$$ 5180217 5088851 5327548 5127660 4842621 5043309 5338796 4777881 4932813 4829350 4565660
14081D565660J70449K4730k84307K58930j34410k53123J62634k82591K83695r1713
$$ 4565660 4736109 4760839 4476532 4735462 4601052 4347929 4510563 4227972 4511667 4419954
14071D419954j85667l81189K59245L10623k82673j19693k19906j24492L01188
$$ 4419954 4234287 3853098 4112343 4422966 4140293 4020600 3800694 3676202 3977390
14062C977390k21806J35598P1944P329j98619J42048j85498K03055k08586n1343
$$ 3977390 3755584 3891182 3963126 3970455 3771836 3913884 3728386 3931441 3722855 3671512
14052C671512k37647K93578k95413j30408J29676n8137j02071Q8756O1685j24095
$$ 3671512 3433865 3727443 3432030 3301622 3431298 3373161 3271090 3359846 3421531 3297436
14042C297436j63349j29279J17789Q4152k10891j17407k7511J46396j38087J13645
$$ 3297436 3134087 3004808 3122597 3206749 2995858 2878451 2850940 2997336 2859249 2972894
14032B972894j80227K62917K14990l29587l94796K33024k36611J70146J39647
$$ 2972894 2792667 3055584 3270574 2940987 2546191 2779215 2542604 2712750 2852397
14023B852397l15458j09421N20605l89001J22855l6065k46897J5457N8980L31145
$$ 2852397 2536939 2427518 2948123 2559122 2681977 2645912 2399015 2414472 2473452 2804597
14013B804597l49392m4138j65155j2626q458K95709m53680L35241k28732K41542
$$ 2804597 2455205 2411067 2245912 2233286 2224828 2520537 2066857 2402098 2173366 2414908
14003B414908j39862R212j7947k88367J33276Q0845j54714j12058K7542K27820
$$ 2414908 2275046 2284258 2266311 1977944 2111220 2192065 2037351 1925293 1952835 2180655
13993B180655N7009j02257L03636J47472J091322K254666P708981K0709183J0197181
$$ 2180655 2237664 2135407 2439043 2586515 3677837 5932503 13641484 34350667 44547848
13984D4547848k1132641j1375450m638967j891878r86025p50215l46300j59590
$$ 44547848 23415207 12039757 7400790 5508912 4522887 3772672 3426372 3266782
13976C266782k87574K693l88122n7535j91279R689M97253m91705k34481J96818
$$ 3266782 2979208 2981901 2593779 2536244 2344965 2354654 2851907 2360202 2125721 2322539
13966B322539k02048L50286o65854N15110l08660N8064n8744j07464J23912J3531
$$ 2322539 2120491 2470777 1804923 2320033 2011373 2069437 2010693 1903229 2027141 2040672
13956B040672p4497j80730L17932K2634k97884k79917M93297k35393k07203L21974
$$ 2040672 1966175 1785445 2103377 2126011 1828127 1548210 2041507 1806114 1598911 1920885
13946A920885n36856N13213J30374n80291M28123J9074q4296j58801j41731Q4545
$$ 1920885 1384029 1897242 2027616 1447325 1875448 1894522 1810226 1651425 1509694 1594239
13936A594239O3345q730K42882m21903J4683J06850j97891K42174j6869j56671
$$ 1594239 1657584 1648854 1891736 1469833 1484516 1591366 1393475 1635649 1618780 1462109
13926A462109J74736j52317L49679k50861L0232N0328o25803N88543n5288k07105
$$ 1462109 1636845 1484528 1834207 1583346 1613578 1663906 1038103 1626646 1571358 1364253
13916A364253j83555K28233k38237L96151K29885n89966J56835P5238q7825q3484
$$ 1364253 1180698 1408931 1170694 1566845 1796730 1206764 1363599 1438837 1351012 1267528
13906A267528J39816L7009r370m4011k78245K35215j27345O6593J44111q7904
$$ 1267528 1407344 1444353 1434983 1390972 1112727 1347942 1220597 1287190 1431301 1343397
13896A343397K2868k37375L38850K160L2999n2325j32790l0811k02068K35452
$$ 1343397 1366265 1128890 1467740 1469900 1502899 1450574 1317784 1286973 1084905 1320357
13886A320357P2956m34661L77732p9629j62064j55871L13652r9783n7971L6337
$$ 1320357 1393313 958652 1336384 1256755 1094691 938820 1252472 1152689 1094718 1131055
13876A131055k82158N10343k20062J06560k95772K04127k2282J69564k58541j93650
$$ 1131055 848897 1359240 1139178 1245738 949966 1154093 1131811 1301375 1042834 849184
13866H49184L80868j60612n6216J67122j02840p4641J17886j86729J93342m86848
$$ 849184 1230052 1069440 1013224 1180346 1077506 1002865 1120751 934022 1127364 640516
13856F40516O25179j09865l77024M654K150M81929J7865E68018M67219m8637P451
$$ 640516 1265695 1155830 778806 783460 785610 1267539 1285404 568018 1035237 986600 994051
13845I94051K43870l35846P174o271J44863K48518k24458j28986j76884m2152
$$ 994051 1237921 902075 909249 902978 1047841 1296359 1071901 942915 766031 723879
13835G23879J65183J25876j25833k51469L63572J50575l29488O7141l44351K13079
$$ 723879 889062 1014938 889105 637636 1001208 1151783 822295 889436 545085 758164
13825G58164j46765N12805m95365L39610k52515J16249J55865l36073K80352j14606
$$ 758164 611399 1124204 628839 968449 715934 832183 988048 651975 932327 817721
13815H17721O94K24255K5110j85704r5499l11283O40545m43379O0344L30415k17712
$$ 817721 818415 1042670 1067780 882076 786577 475294 1115839 672460 732804 1063219 845507
13804H45507J2403j16906P2120J84385m7319k85546O6166j27434J57252L43040
$$ 845507 857910 741004 813124 997509 950190 664644 730810 603376 760628 1103668
13794A103668r9944k57985j90518K8812K29732K64203E24988K45966k86549K24716
$$ 1103668 1003724 745739 555221 584033 813765 1077968 524988 770954 484405 709121
13784G09121K64390j35394k65488K97735j91761k28495K53714p7237l852J26867
$$ 709121 973511 838117 572629 870364 678603 450108 703822 626585 622733 749600
13774G49600k62553k8033K54015j05085J33807l65571K56025k2308P8746J04937
$$ 749600 487047 459014 713029 607944 741751 376180 632205 609897 688643 793580
13764G93580l07259K55331l22412K32624j51813J26340j62974K6608L9006j84200
$$ 793580 486321 741652 419240 651864 500051 626391 463417 490025 529031 344831
13754C44831L15040l13476M52764j71192q128L19507k46260n412j36225L2962
$$ 344831 659871 346395 799159 627967 619839 939346 693086 687674 551449 584411
13744E84411o4912O76828m67851j26153K25695j54020j51004L31148l97841k2368
$$ 584411 519499 1196327 728476 602323 828018 673998 522994 854142 456301 433933
13734D33933P3676j51990N8518L54878j06014o0626J47177j37968J07506l20755
$$ 433933 507609 355619 414137 769015 663001 602375 749552 611584 719090 398335
13724C98335M52469N6962l82349n6379J12067r2073K81423k08971J4939j34212
$$ 398335 850804 907766 525417 469038 581105 489032 770455 561484 576423 442211
13714D42211K09982J87772B67377K58674q7087B02741N48164k32801q4036A48429
$$ 442211 652193 839965 267377 526051 438964 202741 750905 518104 434068 148429
13703G38246C26818L54347j44350M48835m23106j41586J58687n3552p1091M06075
$$ 738246 326818 681165 536815 985650 562544 420958 579645 526093 455002 861077
13693H61077l91757M52769A85468E4275M72719A74295P8722L57082p365B57137
$$ 861077 469320 922089 185468 54275 526994 174295 253017 610099 602734 257137
13682F05868p4816J7800k70574K71464K9078k54290A56570N57528A93410P8151
$$ 605868 531052 548852 278278 549742 578820 324530 156570 714098 193410 271561
13672B71561K27267N4837j16420l1620j13147K42229P910k30635K27324m5426
$$ 271561 498828 553665 437245 405625 292478 534707 542617 311982 539306 493880
13662D93880J46418j24402q9962K6018L11983k43279j52665j13688K57514l2937
$$ 493880 640298 515896 425934 451952 763935 520656 367991 254303 511817 478880
13652D78880j63891Q3741N0611J57145B97473C5055J63556K84453K4891k6147
$$ 478880 314989 398730 449341 606486 297473 35055 198611 483064 507955 481808
13642D81808j75679J9220J4936L18696K2580k7208k62379R1774J77324A01552
$$ 481808 306129 325349 340285 658981 681561 654353 391974 483748 661072 101552
13631C50925n4460R1644n6150j51409O6532J50009j24719J73604j26706k7991
$$ 350925 296465 388109 331959 180550 247082 397091 272372 445976 319270 291279
13621B91279Q7626G4968K79925K34422f642D19483A85738L70495l1387l8959A35811
$$ 291279 378905 74968 354893 589315 -6642 419483 185738 556233 524846 485887 135811
13609C29984M5864Q7814q6186r9514n8513J02169M7560m6656F0435M24023A70993
$$ 329984 375848 463662 377476 277962 219449 321618 369178 322522 60435 484458 170993
13597C91369j49580N0951K11315j258A82562J39626J37477A44270K50216j16244
$$ 391369 241789 292740 504055 502797 182562 322188 459665 144270 394486 278242
13587B78242j09703J67548p6576K56312j34405A10953L7428M25298k51600m156
$$ 278242 168539 336087 259511 515823 381418 110953 148381 573679 322079 317923
13577C17923J4937L64589l10031q9766L35125I1726K53658f8948B87871K03791
$$ 317923 332860 697449 387418 297652 632777 91726 345384 -68948 287871 491662
13567D91662j25433L19306A48867J93749A09349l261K27641K61578A60448F3212
$$ 491662 366229 685535 148867 342616 109349 106088 333729 595307 160448 63212
13556D71909J19292k56323K76992k75949A06404M97124A04166J25773M60855k32724
$$ 471909 591201 334878 611870 335921 106404 603528 104166 229939 690794 458070
13546D58070j1967G9736K24063J81156A35253O338M86773B31955K65773B35805
$$ 458070 446103 79736 303799 484955 135253 141591 628364 231955 497728 235805
13535F06989A74521K3466J20526M0641K72958j73290j25678C5711N9682L4134
$$ 606989 174521 197987 318513 359154 632112 458822 333144 35711 95393 129527
13525A29527k347P7279K67174n5680j18800m1825A5652L75172J22727j45964j08466
$$ 129527 127180 204459 471633 415953 297153 255328 15652 390824 513551 367587 259121
13514B59121r381J1219K30219e904A0263L15823j44442Q6029a54997A58936O3136
$$ 259121 249740 260959 491178 -5904 10263 326086 181644 267673 -154997 158936 222072
13503B22072J11086O5528c01698B74080L3980r2431K42223a37398B29483M2925
$$ 222072 333158 398686 -301698 274080 308060 215629 457852 -137398 229483 272408
13493B72408J16134A41801e9296B77899K54025A19593J79090j24394P1008d8202
$$ 272408 388542 141801 -59296 277899 531924 119593 298683 174289 245297 -48202
13482a3539B28795m1142J01179L15608A94802O4001g8059o2837O1440C90538j71267
$$ -13539 228795 187653 288832 604440 194802 258803 -78059 -140896 -79456 390538 219271
13471B19271G5766M52138A17848L8540K3037m8362J17554C1766K54260A22654
$$ 219271 75766 527904 117848 156388 179425 131063 248617 31766 286026 122654
13460C56690K3296K47636k86156A57900l1438Q3785K90480j18851G1121L30006
$$ 356690 379986 627622 341466 157900 126462 210247 500727 381876 71121 401127
13450D01127E6563J7185K70637A57632K69382j85233J16670G9855J54845N49866
$$ 401127 56563 73748 344385 157632 427014 241781 358451 79855 234700 784566
13440G84566B80226j01615P1447q464a95035B59195D6776M8661M33095A96705
$$ 784566 280226 178611 250058 241594 -195035 259195 46776 95437 528532 196705
13429B14716j0436I0859J39711L2035K46170p7154B14014k1233J04337J71880
$$ 214716 204280 90859 230570 262605 508775 431621 214014 192781 297118 468998
13419D68998m1761j35822I8425K82307e1743A46102K40654J06680k28764A901
$$ 468998 427237 291415 98425 380732 -51743 146102 386756 493436 264672 1901
13408E2978K41700n8373R0438A21831D8973a70343A92646R2002N2336k5308A09544
$$ 52978 294678 236305 326743 121831 48973 -170343 192646 284648 336984 311676 109544
13396D26910a242F1992c403D09498Q8916c9929B53879a5258A77144R0430I1058
$$ 426910 -1242 61992 -3403 409498 498414 -39929 253879 -15258 177144 267574 91058
13384B05790m6215J04306G8965g9065D26718G6267A8944O9771K20096j23139J01605
$$ 205790 159575 263881 78965 -79065 426718 76267 18944 88715 308811 185672 287277
13373B87277P0643K57439B05909f0282A52552n1513b13053A22775B8580K28654
$$ 287277 357920 615359 205909 -60282 152552 101039 -213053 122775 28580 257234
13363B57234B6542K07615n8828D3421J92680J24911b05839A50623K89581G9123
$$ 257234 26542 234157 175329 43421 236101 361012 -205839 150623 440204 79123
13352A04932E0231K85114J78147D1860J88498d1942B74013p5294c1351D28856
$$ 104932 50231 335345 513492 41860 230358 -41942 274013 198719 -31351 428856
13341A23287n3235J56751a52358A69707P4007j12006J97812a1343C21129H9378
$$ 123287 70052 226803 -152358 169707 243714 131708 329520 -11343 321129 89378
13330D36254k11024l5198L4435q75p6060J15667K87380B72110E3068J77495J17485
$$ 436254 225230 190032 224467 223592 147532 263199 550579 272110 53068 230563 348048
13319C48048A35097L65622C1191N8362K0063J41680n5657I0474a17580A61483
$$ 348048 135097 500719 31191 89553 109616 251296 195639 90474 -117580 161483
13308b4656E5398K6886R8631D4236L1289J48290q2162L43201a29721B54042F6289
$$ -24656 55398 82284 180915 44236 75525 223815 141653 484854 -129721 254042 66289
13296B18982G8346K99818A67613K62316A16895L1668L2949J42277p7320F3751
$$ 218982 78346 378164 167613 429929 116895 148563 181512 323789 246469 63751
13285C23877b02610B68818q0560a02710H8482J88568a9622C41812j09657c7152
$$ 323877 -202610 268818 188258 -102710 88482 277050 -19622 341812 232155 -37152
13274b00667A44488J1648J57818p2630j07824J65963G7652b0360o4872G500K15207
$$ -200667 144488 156136 313954 241324 133500 299463 77652 -20360 -85232 7500 222707
13263B22707p1490J29223n627C9124R0480c7492A1029K28032A14039K54840A17830
$$ 222707 151217 280440 274813 39124 129604 -37492 11029 239061 114039 368879 117830
13251A86149l2087K32325m4132K26110e5957A71475E1020b4605o0331A38383J67702
$$ 186149 154062 386387 342255 568365 -55957 171475 51020 -24605 -84936 138383 306085
13240C06085B306J71779L4977I4056L8243l2579c1030A16390e7842A26828P4977
$$ 306085 2306 174085 209062 94056 132299 99720 -31030 116390 -57842 126828 201805
13229B01805K72125C1054b48557A92503A7980K83003b14696E0321L65480A74681
$$ 201805 473930 31054 -248557 192503 17980 300983 -214696 50321 415801 174681
13218G755A178K63191p3226a03585F1057K71626B8163K57715G190L12849A15034
$$ 7755 1178 264369 191143 -103585 61057 332683 28163 285878 7190 320039 115034
13206G8176R9707F7690K00139B9854J9118g7700l3779A35610D9903n168Q8039
$$ 78176 177883 67690 267829 29854 48972 -77700 -111479 135610 49903 44735 132774
13195A32774k1647J72826D0711j8418a42927C44874g3616C26718Q7060D9969j6370
$$ 132774 111127 283953 40711 22293 -142927 344874 -73616 326718 413778 49969 33599
13184C3599K77146b06084C24253E8773O6455a12020H469a3645A86963f32A67685
$$ 33599 310745 -206084 324253 58773 125228 -112020 8469 -13645 186963 -632 167685
13172A08355K31170d23957C02176m2087j08624a13369j48998A91559C9870o078
$$ 108355 339525 -423957 302176 260089 151465 -113369 -262367 191559 39870 33792
13162C3792J31009M181n7672l6111J37163M3351a51423O096O0520A5874J92695
$$ 33792 164801 168982 111310 75199 212362 255713 -151423 -145327 -84807 15874 208569
13151B08569a00584d236E082e9857C68275A17184P611M16332B40929J9420j15930
$$ 208569 -100584 -4236 5082 -59857 368275 117184 124795 541127 240929 260349 144419
13140A44419C3508K0798J06432b7534A68909D02J33228I696R6114K83735f0848
$$ 144419 33508 54306 160738 -27534 168909 402 133630 9696 105810 389545 -60848
13128C51400i3035E4746J22907a04191C05920A6249M88613a15482B01436L8070
$$ 351400 -93035 54746 177653 -104191 305920 16249 504862 -115482 201436 239506
13118B39506G0732C3786Q0917a95428A5148N6669a64533F0893J26046g260q9473
$$ 239506 70732 33786 114703 -195428 15148 71817 -164533 60893 186939 -7260 -96733
13107i6733K0459C7455J05933A4061J05480a37093j90644D86072a83043a9684
$$ -96733 -76274 37455 143388 14061 119541 -137093 -327737 486072 -183043 -19684
13096A09989e3795B01991F3494b3608k24493B9035K9156L29913b78524A01749
$$ 109989 -53795 201991 63494 -23608 -248101 29035 58191 388104 -278524 101749
13085D34294e5428q1005G964Q8591I11K82112a37404k421M0963B53686A21156
$$ 434294 -55428 -136433 7964 96555 911 283023 -137404 -139825 -98862 253686 121156
13073C9793K56622L6967H3781a25780C03194A23084g746A57394d6969a9179j22509
$$ 39793 296415 333382 83781 -125780 303194 123084 -7746 157394 -46969 -19179 -141688
13062a41688A66151a12259A27673c65419a48848I9719J76155F4093J15796a12844
$$ -141688 166151 -112259 127673 -365419 -148848 99719 275874 64093 179889 -112844
13051C3064J53510a3378C18497G9892Q9548J1594F8453a55707C69946I2832K77746
$$ 33064 186574 -13378 318497 79892 169440 181034 68453 -155707 369946 92832 370578
13040C70578F2401L0011a6714H5219Q9363L65756G7011K1388d4306F0248K23297
$$ 370578 62401 92412 -16714 85219 174582 540338 77011 98399 -44306 60248 283545
13029B83545a32015l9049D5952R6295K32735A76424b8744C0391J85155G6473a90241
$$ 283545 -132015 -171064 45952 142247 374982 176424 -28744 30391 215546 76473 -190241
13017A61444K6598o8905J33102r288n0956r3603K24111a21157E68733k55381A15717
$$ 161444 188042 119137 252239 242951 191995 98392 322503 -121157 568733 313352 115717
13005A356a27978a6351A96220o4710J024i6090A43228i8078J1141A65672k1442
$$ 1356 -127978 -16351 196220 131510 132534 -96090 143228 -98078 -86937 165672 144230
12994A44230m3572e035A07042J13556G7221d6266E229K21889K7536c4340j9075
$$ 144230 100658 -5035 107042 220598 77221 -46266 5229 227118 254654 -34340 -53415
12983e3415C5505a29892A98041D6552O9901b60146f2346B31357D0835M70367A91116
$$ -53415 35505 -129892 198041 46552 116453 -260146 -62346 231357 40835 511202 191116
12971i3203j90203H5752L00776k2596b3538A70374l1498J4837E7435j8290c83708
$$ -93203 -283406 85752 386528 363932 -23538 170374 138876 153713 57435 39145 -383708
12959A78453e8257c290B01034K376m2025L5636G6962b15694A16338B430M3448
$$ 178453 -58257 -3290 201034 203410 161385 197021 76962 -215694 116338 2430 45878
12948D5878J82757l64a01211E2323L41087b30721d8952B2555h1394B9750P0918
$$ 45878 228635 228271 -101211 52323 393410 -230721 -48952 22555 -81394 29750 100668
12937A00668c10298H8641A5928a65558j08144g023m8513J4558G3736a24468H4981
$$ 100668 -310298 88641 15928 -165558 -273702 -7023 -55536 -40978 73736 -124468 84981
12925B85065j41028R7217g2006F3899j2448a09059B02896a06341C6053f7584C694
$$ 285065 144037 241254 -72006 63899 51451 -109059 202896 -106341 36053 -67584 3694
12913B6869K58629k3142J02602I955K09592C1945A3384P6292c26306R1198a2842
$$ 26869 285498 262356 364958 9955 219547 31945 13384 89676 -326306 -235108 -12842
12901a2293l40003B66226j20794h3159D531c9635B7655a00273E4026L09163A45651
$$ -12293 -352296 266226 145432 -83159 4531 -39635 27655 -100273 54026 363189 145651
12889A37881P0175I0647a82583f2828a5858k69883B24787G5290J0380c15653A44991
$$ 137881 208056 90647 -182583 -62828 -15858 -285741 224787 75290 85670 -315653 144991
12877a90915B76801b18371A88698b33909a2927B59909A8489h6422D46709b36964
$$ -190915 276801 -218371 188698 -233909 -12927 259909 18489 -86422 446709 -236964
12866D2534J29962b03275R0305I3562J74483E071a93915A05318Q2546p3810L3432
$$ 42534 172496 -203275 -112970 93562 268045 5071 -193915 105318 187864 114054 147486
12855A47486P5162B7686b9216r9691N9298d700E7261a26945K6307A61750E9371
$$ 147486 222648 27686 -29216 -128907 -69609 -4700 57261 -126945 -100638 161750 59371
12843b0575B4173J80248b98344N0390A60783b3850E599J71470G7906L7071b9561
$$ -20575 24173 204421 -298344 -247954 160783 -23850 5599 177069 77906 114977 -29561
12831G6328f8920H0875B3401a72689B81391j08763R8487p6552J15375I3918A6273
$$ 76328 -68920 80875 23401 -172689 281391 172628 271115 194563 309938 93918 16273
12819F61379b20551H5349J07048m4097j5551M2178a84698A71312h9559A36644
$$ 661379 -220551 85349 192397 148300 132749 174927 -184698 171312 -89559 136644
12808g47A82653J07722j06554g3583L686A77581K218E7231R1469C3574L11690
$$ -747 182653 290375 183821 -73583 -69897 177581 179799 57231 148700 33574 345264
12797C45264G8004b40275l6313a10005C74086a80197F2243g2146k69806O2444
$$ 345264 78004 -240275 -276588 -110005 374086 -180197 62243 -72146 -341952 -279508
12787b79508i401r6587j73675C2126L98809c9214A41390C9069J01872a59066A8600
$$ -279508 -9401 -105988 -279663 32126 430935 -39214 141390 39069 140941 -159066 18600
12775b88666a39512d863A25846j0459b54437r3521i5631c2743A47185O8220O2459
$$ -288666 -139512 -4863 125846 115387 -254437 -347958 -95631 -32743 147185 215405 277864
12764B77864A20122d7998A53519a83523E3126a55266D8484f6167H9272a09642
$$ 277864 120122 -47998 153519 -183523 53126 -155266 48484 -66167 89272 -109642
12753A5054J36753J04685i1520j73858A87448C4535J1857d7192B90043e4654j8484
$$ 15054 151807 256492 -91520 -265378 187448 34535 46392 -47192 290043 -54654 -73138
12742g3138B54530p2993g0602A42589L3698F8210a4004A07197E624d6525A16102
$$ -73138 254530 181537 -70602 142589 176287 68210 -14004 107197 5624 -46525 116102
12730C12008b9061A89502a15858J2028A37700J48758j1444p4765o2086K37414
$$ 312008 -29061 189502 -115858 -103830 137700 286458 275014 200249 138163 375577
12720C75577j79869e2956B18194p7229J84727l2757e9976m2979A93503j5260j3335
$$ 375577 195708 -52956 218194 140965 325692 292935 -59976 -102955 193503 178243 164908
12709A64908Q9790B8093J51548O9311Q8553E0454K66642p3532j4876C6384a23468
$$ 164908 254698 28093 179641 248952 337505 50454 317096 243564 228688 36384 -123468
12697b11934A39120j3171B1361a1974I53a30398k91367C55393M5925H9339Q9587
$$ -211934 139120 125949 21361 -11974 953 -130398 -421765 355393 401318 89339 178926
12686A78926M4738q7660b24885A79326O1562a77369C32200r4232a9574k94049
$$ 178926 223664 136004 -224885 179326 240888 -177369 332200 237968 -19574 -313623
12676c13623I0577c25827f4735A05889f1593A77257a31628A22449j4622J00665
$$ -313623 90577 -325827 -64735 105889 -61593 177257 -131628 122449 107827 208492
12666B08492a6982n731p378j37287A30073E2389K9866a67670B17244J07024G8136
$$ 208492 -16982 -22713 -30091 -167378 130073 52389 82255 -167670 217244 324268 78136
12654A38343i8139A16724J1925J00804C3747L04672j31440a57329B51585F1608
$$ 138343 -98139 116724 128649 229453 33747 338419 206979 -157329 251585 61608
12643A77728A6296K19312c03049a07092B1066b12368J02689j25526C10994f1691
$$ 177728 16296 235608 -303049 -107092 21066 -212368 -109679 -235205 310994 -61691
12632a10069l6581C41860A9061f8118C42242J0906Q246a31393E6756K65841H1631
$$ -110069 -146650 341860 19061 -68118 342242 353148 361394 -131393 56756 322597 81631
12620C70488b68163A96702D7617D318e7719L182b3781l52801G118b3215k78939
$$ 370488 -268163 196702 47617 4318 -57719 -54537 -23781 -376582 7118 -23215 -302154
12609c02154d0190A12185a40474B35782p9196C1829H854a76520A73478q5845R5267
$$ -302154 -40190 112185 -140474 235782 156586 31829 8854 -176520 173478 87633 182900
12598A82900K09516A04767M3934R4744a3976C71994A58521J33841i2873I2306
$$ 182900 392416 104767 148701 243445 -13976 371994 158521 292362 -92873 92306
12587F8441g8413A64022E4714a1626E144i9291H6275J14221E09g8354j50247d3107
$$ 68441 -78413 164022 54714 -11626 5144 -99291 86275 200496 509 -78354 -228601 -43107
12574c4448p8286B05705D7913F273K0268Q367f3546B1250L5392d4468G6763c1852
$$ -34448 -112734 205705 47913 6273 26541 34908 -63546 21250 56642 -44468 76763 -31852
12561D0010a83858j8139B30635h3234p4277f4143K5261A14930J65979b39963g6028
$$ 40010 -183858 -201997 230635 -83234 -157511 -64143 -38882 114930 280909 -239963 -76028
12549H923J45365C8126b77487A80824o4473e8558K0856j0339A91273H1953b87755
$$ 8923 154288 38126 -277487 180824 116351 -58558 -37702 -48041 191273 81953 -287755
12537B37342J51952a9862C43652j26207C1951b7294B08830M4160n9776a46658
$$ 237342 389294 -19862 343652 217445 31951 -27294 208830 252990 193214 -146658
12526H6344c072C5610J02131a39920b3947A30247f7309E8207M0994a39472A07431
$$ 86344 -3072 35610 137741 -139920 -23947 130247 -67309 58207 99201 -139472 107431
12514d5542J6436D0670R9919c6966I776L69721j21087b05693A36073K10045a1692
$$ -45542 -29106 40670 140589 -36966 9776 379497 258410 -205693 136073 346118 -11692
12502D8924a88308C52718E8421J74532l8189a64450c8542r0689B29804e6531A48726
$$ 48924 -188308 352718 58421 232953 194764 -164450 -38542 -129231 229804 -56531 148726
12490c18984a30583A44341p0053m093a14784E8936b86333J10699r932R270B9560
$$ -318984 -130583 144341 74288 70195 -114784 58936 -286333 -175634 -185566 -176296 29560
12478a03629A19291a20361e6250K0268j76595I3675C2445M6617C5124M03604i7328
$$ -103629 119291 -120361 -56250 -35982 -212577 93675 32445 79062 35124 438728 -97328
12466a75320K5265K7777M3526A8238J7439J57051g310k60071B61336C6408h7290
$$ -175320 -150055 -122278 -78752 18238 35677 192728 -7310 -267381 261336 36408 -87290
12454A49279F8229a06730j24722c384A47188g5043p3590F305K4234a11661L1971
$$ 149279 68229 -106730 -231452 -3384 147188 -75043 -148633 6305 30539 -111661 -79690
12443g9690o0241n5986A32971A400a41676b6915I1211O302B7138a24360A68708
$$ -79690 -139931 -195917 132971 1400 -141676 -26915 91211 97513 27138 -124360 168708
12431a63221A52432h8722j05710h799j03882p5973K4529b5775j40194B44460A11224
$$ -163221 152432 -88722 -194432 -8799 -112681 -188654 -164125 -25775 -165969 244460 111224
12419g2054b4021C23272G1127L9738E2788G685K5399g93m0810A23885R7739c6589
$$ -72054 -24021 323272 71127 110865 52788 7685 33084 -793 -41603 123885 221624 -36589
12406g9913A93210C193d2226o0429I9161J85710b7410q8a852B9791d4413A01847
$$ -79913 193210 3193 -42226 -102655 99161 284871 -27410 -27498 -1852 29791 -44413 101847
12393f1771m12400K08289B40685b4009B6497c82279J72136l10785D3165j2227
$$ -61771 -474171 -265882 240685 -24009 26497 -382279 -210143 -520928 43165 30938
12383C0938a1694L557p3395q8631B7330h6890k4456F436P438e2926D9399R8458
$$ 30938 -11694 -8137 -81532 -170163 27330 -86890 -111346 6436 13874 -52926 49399 147857
12371A47857j9782B5920J99871a66556B28817I1199e5405j69201A01422J58363
$$ 147857 128075 25920 225791 -166556 228817 91199 -55405 -224606 101422 259785
12361B59785a6738B60350c19721a22781C5498K77022A22121e721k20041g5925
$$ 259785 -16738 260350 -319721 -122781 35498 312520 122121 -5721 -225762 -75925
12350A86722C6103K88325B4272J8681g9491C89161g5630l4029a6036C38257j62038
$$ 186722 36103 324428 24272 42953 -79491 389161 -75630 -109659 -16036 338257 176219
12339A76219a33485n3991e8567a2745m9250B58860A15627A3354J49414d8903B8549
$$ 176219 -133485 -187476 -58567 -12745 -61995 258860 115627 13354 162768 -48903 28549
12327F2648a7984B87283F9029J9137C3693h4928r2169k06418A70717M8575J43389
$$ 62648 -17984 287283 69029 88166 33693 -84928 -177097 -383515 170717 219292 362681
12316C62681j68474k7144m603i7344B1693e9750r7252g3737B5877L8248e5653
$$ 362681 194207 167063 162460 -97344 21693 -59750 -157002 -73737 25877 64125 -55653
12304B52840r5605b95476h3434B8497J64091b46693c496j5138A99104a45141k12641
$$ 252840 157235 -295476 -83434 28497 192588 -246693 -3496 -18634 199104 -145141 -357782
12293c57782e0278B70775A07586k2374J47084b8717A39961J77555A13532a05512
$$ -357782 -50278 270775 107586 85212 232296 -28717 139961 317516 113532 -105512
12282A85485B7814L72941h3631L3429G3348O3545J69273A35706J48321B8038b4040
$$ 185485 27814 400755 -83631 -50202 73348 136893 306166 135706 284027 28038 -24040
12270a28474a0285A88408J4787N7128a45566a7274H2171A4243J77900c0766m6603
$$ -128474 -10285 188408 203195 260323 -145566 -17274 82171 14243 192143 -30766 -77369
12259g7369A11842D6822f5346A45025b63221P259A53648b1755E4031L17991b30333
$$ -77369 111842 46822 -65346 145025 -263221 -255962 153648 -21755 54031 372022 -230333
12247a63386A05079J8214J78479I608J59020C7492K58907K1796j26190d2731H744
$$ -163386 105079 123293 301772 9608 168628 37492 296399 318195 192005 -42731 8744
12235A56956J4900i4587C07653j42236n3961a44290C70277K2147j59089B4050
$$ 156956 171856 -94587 307653 165417 111456 -144290 370277 392424 233335 24050
12224C74362l9970j51115F7294K59833q7913j11133n6645o996R6509J9252Q3650
$$ 374362 334392 183277 67294 327127 239214 128081 71436 64440 160949 180201 263851
12213B63851j4613l8273C2007J00218f694k25140A98452R1031A41181l0475j9739
$$ 263851 249238 210965 32007 132225 -6694 -231834 198452 289483 141181 110706 90967
12202I0967a66462C63097B4759K09516E9198L75997r2312A15124l4788K9867f5273
$$ 90967 -166462 363097 24759 234275 59198 435195 342883 115124 80336 110203 -65273
12190B30489M0483G3565J15499b95945D9562J86667P4k3453p2931c0738A08571
$$ 230489 270972 73565 189064 -295945 49562 236229 236303 212850 139919 -30738 108571
12178A40403C9893K17417i0789A80987J15621H27f512C14794G9942J0358J13666
$$ 140403 39893 257310 -90789 180987 296608 827 -6512 314794 79942 90300 203966
12167B03966m3163o5448K03173l7882a12315J6485B03580j7566o1018p659a70445
$$ 203966 160803 95355 298528 260646 -112315 -95830 203580 186014 124996 117337 -170445
12155E2024O9508a32956j62324A50772F4121a89626d581B18311q2868P1703K1754
$$ 52024 121532 -132956 -295280 150772 64121 -189626 -4581 218311 135443 207146 228900
12144B28900E1591a42429I9368K10057a38334A03414b20283A08726a53199A90896
$$ 228900 51591 -142429 99368 309425 -138334 103414 -220283 108726 -153199 190896
12133D3951J23253j3803L55590C5362f9519A91756b95100e0654n3524o0434e0514
$$ 43951 167204 153401 508991 35362 -69519 191756 -295100 -50654 -104178 -164612 -50514
12121A09932b47082D0533f2604n7330A58526c32204C476K40252a93401E2678p421
$$ 109932 -247082 40533 -62604 -119934 158526 -332204 3476 243728 -193401 52678 45257
12110D5257M6904O2872C4836J66887J58605g7200m396D6354J64016b38326J08207
$$ 45257 92161 155033 34836 201723 360328 -77200 -81596 46354 210370 -238326 -130119
12099a30119B57143a473k0058o01848A7570K01075C4075J30998b52573F035J31438
$$ -130119 257143 -1473 -21531 -623379 17570 218645 34075 165073 -252573 6035 137473
12088A37473b41788d0669B95149f3966B12257J29166P1978A1941f1975A30585
$$ 137473 -241788 -40669 295149 -63966 212257 341423 413401 11941 -61975 130585
12077B76261P73369J116841j024874C88913B6628J51229j2793K63755A9970g6637
$$ 276261 1049630 2166471 1141597 388913 26628 177857 165064 428819 19970 -76637
12066f2991C3049J92017A6548L9876b9186A41435Q3405e9113B87245a4618j08554
$$ -62991 33049 225066 16548 56424 -29186 141435 224840 -59113 287245 -14618 -123172
12055a23172C4861a22199C68279d7065B9777a1326o364N255I0560K6897m5864
$$ -123172 34861 -122199 368279 -47065 29777 -11326 -17690 -12435 90560 117457 71593
12044G1593f6189B2125a32102j30251b336B24587i739l10605B48025C9388e9906
$$ 71593 -66189 22125 -132102 -262353 -2336 224587 -9739 -320344 248025 39388 -59906
12032C02970b70015N3833h8380n807o2270j041k8069C26798A11532b94796J41478
$$ 302970 -270015 -216182 -88380 -94187 -156457 -157498 -185567 326798 111532 -294796 -153318
12021a53318c7075A21792g1010C9606J35244i5403J9294D21998H2216B6404a31888
$$ -153318 -37075 121792 -71010 39606 174850 -95403 -76109 421998 82216 26404 -131888
12009a81907B09951e4507g541j87424a6039k6434J6471q2507j55018g809I2257
$$ -181907 209951 -54507 -7541 -194965 -16039 -42473 -26002 -108509 -263527 -7809 92257
11997a2166q9948C2728O2810a38171p8825A08118a04490j04433I4130m3110g3375
$$ -12166 -102114 32728 95538 -138171 -216996 108118 -104490 -208923 94130 51020 -73375
11985a20338B74895b5740G1790a32353o1100I8486a16626F1119b04750a4732H1879
$$ -120338 274895 -25740 71790 -132353 -193453 98486 -116626 61119 -204750 -14732 81879
11973A98963n853g2668q5528L1135A09592b02734D8056a15244B01078a1559j2352
$$ 198963 193110 -72668 -158196 -127061 109592 -202734 48056 -115244 201078 -11559 -23911
11962b3911C9605K5637b51728A71749a28903A85217q6442b1769l1415A03086N2956
$$ -23911 39605 65242 -251728 171749 -128903 185217 98775 -21769 -53184 103086 156042
11951A56042a58736l92614F1454d8843j96494A26411C5990a25244d0557A46657
$$ 156042 -158736 -551350 61454 -48843 -245337 126411 35990 -125244 -40557 146657
11940C07174j43402d4094A89128r3630b8504j25654A21566d0938j35960g7023
$$ 307174 163772 -44094 189128 95498 -28504 -154158 121566 -40938 -176898 -77023
11929G7280K1722a18607A938L20819g5684k09679D2173a18799A89690i9951G7585
$$ 77280 99002 -118607 1938 322757 -75684 -285363 42173 -118799 189690 -99951 77585
11917A31102b6541l753q5947A10549a91826p9394D615K33415A7005P5616B3265
$$ 131102 -26541 -30294 -116241 110549 -191826 -271220 4615 238030 17005 92621 23265
11905C02490e8364d848A01326K30744j21216b0824p214E399K6109a5152j50664
$$ 302490 -58364 -4848 101326 332070 210854 -20824 -28038 5399 31508 -15152 -165816
11894a65816P6944A69093f8090G7569p082b64284G175a04563K204A73968b4722
$$ -165816 -88872 169093 -68090 77569 70487 -264284 7175 -104563 -102359 173968 -24722
11882a05532D3728A9380J11504a67741J3746H711h9779H2611a84675j9024c2901
$$ -105532 43728 19380 130884 -167741 -153995 8711 -89779 82611 -184675 -203699 -32901
11870a91760b6457o0881j13966K3813A87556a86554B3861i7449q4917o0550k17862
$$ -191760 -26457 -87338 -201304 -177491 187556 -186554 23861 -97449 -182366 -242916 -460778
11859d60778K18731d1553E3334e324n5158j10713Q0599c2038F4181a67921k5720
$$ -460778 -242047 -41553 53334 -5324 -60482 -171195 -90596 -32038 64181 -167921 -193641
11848a93641C06863A14067l7097b08988K904I4591a86170g703B33224d12890J52499
$$ -193641 306863 114067 76970 -208988 -206084 94591 -186170 -7703 233224 -412890 -260391
11837b60391D8686k0898f1390G6575a50062A9380J35524a44617r8348p3142a04750
$$ -260391 48686 27788 -61390 76575 -150062 19380 154904 -144617 -242965 -316107 -104750
11825B06640M1979c25618J07558e1646J6737A86276J9400d0540j68872c52l54535
$$ 206640 248619 -325618 -218060 -51646 -34909 186276 205676 -40540 -209412 -352 -354887
11814c54887b2556G3844f8927j0033C34225F6130d98432b10970a6253B19317o8539
$$ -354887 -22556 73844 -68927 -78960 334225 66130 -498432 -210970 -16253 219317 150778
11803A50778o1486l1235b77927A24371A0829a40707j73215k2947J01232A56517
$$ 150778 89292 58057 -277927 124371 10829 -140707 -313922 -336869 -235637 156517
11792A44424i7894K3743j72810J11780A94531C986M4365a51510A98261d3189l7704
$$ 144424 -97894 -74151 -246961 -135181 194531 3986 48351 -151510 198261 -43189 -80893
11781h0893C8269a25662D8394P7558l1166b05375f0412m8485r7659B9538K16264
$$ -80893 38269 -125662 48394 125952 94786 -205375 -60412 -108897 -206556 29538 245802
11770B45802m0052o7432a78450j32430c5833o1382B59177j4723a09656j00367
$$ 245802 205750 138318 -178450 -310880 -35833 -97215 259177 244454 -109656 -210023
11760b10023f5275k5833G0579b06905A25099j7652c4504B71022A6151K0177M7771
$$ -210023 -65275 -91108 70579 -206905 125099 107447 -34504 271022 16151 36328 84099
11749H4099K74017g6741j31349A09956b89367A42507e10559G1564a07028F0009
$$ 84099 358116 -76741 -208090 109956 -289367 142507 -510559 71564 -107028 60009
11738a92658M1910A32123K0656a02289J2415j40118A31091f8528A39386a04835
$$ -192658 -150748 132123 152779 -102289 -89874 -229992 131091 -68528 139386 -104835
11727B16545I4856J48043a43349B6503a41083G6432J3551J98683a4414C1883E67
$$ 216545 94856 242899 -143349 26503 -141083 76432 89983 288666 -14414 31883 567
11715G70c79913B87806j18396a47640N4946A32J80465a42462A21737b3389A6164
$$ 770 -379913 287806 169410 -147640 -92694 132 180597 -142462 121737 -23389 16164
11703i0412A35447a94954B34561n1603P9956D5152h9052j10103B56534C9317a28380
$$ -90412 135447 -194954 234561 182958 262914 45152 -89052 -199155 256534 39317 -128380
11691a16786A60089l2414K86344k3174j68841g565m1205l2562p1860B14993L0009
$$ -116786 160089 127675 414019 390845 222004 -7565 -48770 -81332 -153192 214993 245002
11680B45002A10488g4071C2866f577j51088D2034Q2447l6739L11883a97049A52704
$$ 245002 110488 -74071 32866 -6577 -157665 42034 124481 87742 399625 -197049 152704
11668f2719Q572m0987A10717J6610c5410B92710G3941R2472D8647i0624B79858
$$ -62719 -54147 -95134 110717 127327 -35410 292710 73941 166413 48647 -90624 279858
11656c0415A02015o836q637J34598A09258a75357B11149b3048D1734K994O548
$$ -30415 102015 95179 86542 221140 109258 -175357 211149 -23048 41734 44728 51276
11645E1276K04422c941C69025D6316a95964A30415J35449h6590k22044h8941C09826
$$ 51276 255698 -3941 369025 46316 -195964 130415 265864 -86590 -308634 -88941 309826
11633d2534G5153c4000F35P7883J0415f3401D76994f8108a2452A71649a84378
$$ -42534 75153 -34000 635 78518 88933 -63401 476994 -68108 -12452 171649 -184378
11621a15964A55075h2131A77762d8727C1167g03A17633k5723J7136L5601l7244
$$ -115964 155075 -82131 177762 -48727 31167 -703 117633 91910 109046 144647 107403
11610A07403b92071A09759a29787h420D24468a27501m2084B16470i1764B12045
$$ 107403 -292071 109759 -129787 -8420 424468 -127501 -169585 216470 -91764 212045
11599e0519A43824E7295J4152c6024m42482a1420D0463J56454q9063b30819G9805
$$ -50519 143824 57295 71447 -36024 -478506 -11420 40463 196917 107854 -230819 79805
11587E2605d4032B22622p6538l7068n2546a30682B38163Q8943i2710B40661a01131
$$ 52605 -44032 222622 146084 109016 56470 -130682 238163 327106 -92710 240661 -101131
11575B63685f0313J3589B1280K06321J04392A39259J51790p3962N495H1643K35719
$$ 263685 -60313 -46724 21280 227601 331993 139259 291049 217087 222582 81643 317362
11564C17362A44867g1245A60219J56502q0410g3666B40159G8518j7707c58183
$$ 317362 144867 -71245 160219 316721 236311 -73666 240159 78518 60811 -358183
11553b5875A77338B7923c5904k3712o0715B2538A0369J75280g2632c1707B63665
$$ -25875 177338 27923 -35904 -59616 -120331 22538 10369 185649 -72632 -31707 263665
11541A16746k7899a59861H328J12735i5259B40667A07222a05097L3015A22395
$$ 116746 88847 -159861 8328 121063 -95259 240667 107222 -105097 -72082 122395
11530D95807B01744D120d8297l43029G4L03586A5905J49889l1916J09362B8041
$$ 495807 201744 4120 -48297 -391326 74 303660 15905 165794 133878 243240 28041
11518A20658k9708J15330b9137B0459R1296a07664I3323P7712J67408b2316C20543
$$ 120658 90950 206280 -29137 20459 111755 -107664 93323 171035 338443 -22316 320543
11506B49591K5171A36108o5486Q6424a9586F5320a42950O963B06679A00269C2374
$$ 249591 274762 136108 70622 157046 -19586 65320 -142950 -135987 206679 100269 32374
11494A14678f8324F4064J45384K7510E8643J83339a08721I4104K9580E200K6946
$$ 114678 -68324 64064 209448 236958 58643 241982 -108721 94104 123684 5200 32146
11483C2146O3849N669m5409a95423A29161i2882H615K73379J07442G1223i2893
$$ 32146 95995 101664 56255 -195423 129161 -92882 8615 281994 389436 71223 -92893
11471a46417B06863a54603A36943J52035n0698a10836B14578a62202A59886j7201
$$ -146417 206863 -154603 136943 288978 238280 -110836 214578 -162202 159886 142685
11461A42685L12721N605j63207a46091H5713J61658G35a34844C371K47553J68803
$$ 142685 455406 461011 297804 -146091 85713 247371 735 -134844 3371 250924 419727
11450D19727i9737c6646B94225a30531C10929c0567C2187b68639F4515j8213K69580
$$ 419727 -99737 -36646 294225 -130531 310929 -30567 32187 -268639 64515 46302 315882
11439C15882r8956k7540n557a44931A2160a1096B3075b5378B71661C714a35723
$$ 315882 216926 189386 183829 -144931 12160 -11096 23075 -25378 271661 3714 -135723
11427B11865b06925G6239K1222c13305h747C8139b25685B29532A00317C9351K21346
$$ 211865 -206925 76239 97461 -313305 -8747 38139 -225685 229532 100317 39351 260697
11416B60697q3005a61388C55891A51569a07120n3136B1147K55343F839c0406B50045
$$ 260697 177692 -161388 355891 151569 -107120 -160256 21147 276490 6839 -30406 250045
11404c00289H2502a1714p6616A41270b46948A91058D6817L79727b56457B71476
$$ -300289 82502 -11714 -88330 141270 -246948 191058 46817 426544 -256457 271476
11393b01013A40166a1119B64132h3387K0770K9473j32122A97900E8558R6216i8777
$$ -201013 140166 -11119 264132 -83387 -62617 -33144 -165266 197900 58558 154774 -98777
11381A97294a44107j3156A18766g2309B05300i2023K8261j33811d4696C26427
$$ 197294 -144107 -157263 118766 -72309 205300 -92023 -63762 -197573 -44696 326427
11370B3235b20310A05125Q011c95910F2268O853k5383N5574d18209B35168a71746
$$ 23235 -220310 105125 113136 -395910 62268 69121 43738 99312 -418209 235168 -171746
11358A64984N9494K3853a94271A43999c37807a64381B02728d8678o5633A5568
$$ 164984 224478 248331 -194271 143999 -337807 -164381 202728 -48678 -114311 15568
11347d6091A51908a18051k64605C0852a4838A58757i8505n1042d1684G7157M49342
$$ -46091 151908 -118051 -382656 30852 -14838 158757 -98505 -149547 -41684 77157 526499
11336E26499E3829i9033C26046C2268h671E1714a10204C2036R840Q7057b06901
$$ 526499 53829 -99033 326046 32268 -8671 51714 -110204 32036 41876 128933 -206901
11324g9094j88461B04742B3623J04037C6671J33844b06576n5928A53284f3040
$$ -79094 -267555 204742 23623 127660 36671 170515 -206576 -262504 153284 -63040
11313F6321K7901a10113A80505o3455E6362A0874K8932L9546P8735a09021n5698
$$ 66321 94222 -110113 180505 117050 56362 10874 39806 79352 158087 -109021 -164719
11302a64719d0782k78774J27096A18989a40751g303k08439B2832J5176J6874e6147
$$ -164719 -40782 -319556 -192460 118989 -140751 -7303 -215742 22832 38008 54882 -56147
11290f3849B75009B5387b34772c1175l2795j3099k49492g7895j79658A02309a452
$$ -63849 275009 25387 -234772 -31175 -63970 -77069 -326561 -77895 -257553 102309 -1452
11278b78234A7432N0185d3071D195K16864b23544J01281b8141k13259a16491j11526
$$ -278234 17432 67617 -43071 4195 221059 -223544 -122263 -28141 -241400 -116491 -228017
11267b28017j17006a20843A56731a56120C6243f411B33784E509a57745L4779a4805
$$ -228017 -345023 -120843 156731 -156120 36243 -6411 233784 5509 -157745 -122966 -14805
11255a83288e1896a2183B6444L8039a10204j05731c3419k25979a07632A10856
$$ -183288 -51896 -12183 26444 64483 -110204 -215935 -33419 -259398 -107632 110856
11244F687b97585d8561H0627a59131c75j12406c1532B53242A7991a53911F3609
$$ 6687 -297585 -48561 80627 -159131 -375 -112781 -31532 253242 17991 -153911 63609
11232A17521a83564O5346H6209j1863a58179g1554q8704A11654a878j93407m5124
$$ 117521 -183564 -118218 86209 74346 -158179 -71554 -160258 111654 -1878 -195285 -240409
11221b40409G9688C6047h7007j72106A20603i0590j84865b7137k49367d6342I866
$$ -240409 79688 36047 -87007 -259113 120603 -90590 -275455 -27137 -276504 -46342 9866
11209E754a12009j95409B23307F1498g3126a0156A72705q4621a741A47470a39262
$$ 5754 -112009 -307418 223307 61498 -73126 -10156 172705 88084 -1741 147470 -139262
11197E2179K0562e374j90703N605B37783h8098c3961c633k01442A56603F0425
$$ 52179 72741 -5374 -196077 -190472 237783 -88098 -33961 -3633 -205075 156603 60425
11185h0508A77d45017C3756a38139k67317H5579K2787l2204R3269b42409B65551
$$ -80508 177 -445017 33756 -138139 -405456 85579 108366 76162 169431 -242409 265551
11173F543a18436q4976Q1483A04033J56355a39919j93658C5852j0343J6842Q6244
$$ 6543 -118436 -203412 -121929 104033 260388 -139919 -333577 35852 25509 42351 128595
11162A28595a88876A64027h9044m5278A37673a61151C3598J70766h3189n9890
$$ 128595 -188876 164027 -89044 -134322 137673 -161151 33598 204364 -83189 -143079
11152a43079A17364K90049A65205b4017F8836R0351F2596e8163G1359j4755F387
$$ -143079 117364 407413 165205 -24017 68836 159187 62596 -58163 71359 56604 6387
11140c26891g2696J9179n6011j9489N9954n261A30126l7500c7982H0842J80598
$$ -326891 -72696 -53517 -109528 -129017 -69063 -74324 130126 92626 -37982 80842 261440
11129B61440b0597l3094B0876b30465A05360c83558C74733f2679j8498o7732a3460
$$ 261440 -20597 -53691 20876 -230465 105360 -383558 374733 -62679 -81177 -148909 -13460
11117F5807e9640A34206b92648f2594A03224r165J7673b70247B15338J06294B2492
$$ 65807 -59640 134206 -292648 -62594 103224 94059 111732 -270247 215338 321632 22492
11105A65949B8282K78091o4369B7576J21789K77204l0716I3311L05566F1676J39438
$$ 165949 28282 306373 242004 27576 149365 426569 395853 93311 398877 61676 201114
11094B01114K5733a10815F02667A95618J67644J1174m8395D6791J34055a43211
$$ 201114 226847 -110815 602667 195618 363262 374436 326041 46791 180846 -143211
11083H3641J60035j1975L050N1735C412a13126C00874r1760m4361L6343k358J50
$$ 83641 243676 231701 234751 286486 3412 -113126 300874 209114 164753 201096 198738 198888
11071A98888F3437J64382n1425K77191j7793m1543K5646o8861m391K1404j68771
$$ 198888 63437 227819 176394 453585 435792 394249 419895 351034 346643 368047 199276
11060A99276K72274K6481J04487J29258k54913J58240J52942n2824J03411l30329
$$ 199276 471550 498031 602518 731776 476863 635103 788045 735221 838632 508303
11050E08303L15636D10040N41821k65828K06844j04465k07634R7581K15561k86346
$$ 508303 823939 410040 951861 686033 892877 788412 580778 678359 893920 607574
11040F07574P7970K13062j68203j97271j2044M02065C06091L23191j7604L6804
$$ 607574 685544 898606 730403 533132 521088 923153 306091 629282 611678 648482
11030F48482j03553B35056M69436K07896k24240O3596o9526L4479j52240q3421
$$ 648482 544929 235056 704492 912388 688148 751744 682218 716697 564457 481036
11020D81036J28861j76973K25880J15118j13515J6579j00036k27598J44796O8147
$$ 481036 609897 432924 658804 773922 660407 676986 576950 349352 494148 562295
11010E62295N3101j7988j0796l9804K71255m3620j24283r6655p4564K63955k06447
$$ 562295 615396 597408 586612 546808 818063 774443 650160 553505 478941 742896 536449
10999E36449K60671l4580P8059k60254K12896C94109L16696o821O5191l34880
$$ 536449 797120 762540 840599 580345 793241 394109 710805 703984 769175 434295
10989D34295L31451P8613O7188q2897N6862N8941N45843l59185n7877K14641J17999
$$ 434295 765746 844359 911547 828650 885512 944453 1490296 1131111 1073234 1287875 1405874
10978A405874j47584L65428L63214J34530j66556Q73928j59068K46518l36965
$$ 1405874 1258290 1623718 1986932 2121462 1954906 2828834 2669766 2916284 2579319
10969B579319k01634L14826k91092p55348J85484k66556K04140l61141J66465
$$ 2579319 2377685 2692511 2401419 1646071 1831555 1564999 1769139 1407998 1574463
10960A574463p5253L91685l86933K52532o2542j85443J07329j36004o21875j9149
$$ 1574463 1499210 1890895 1503962 1756494 1693952 1508509 1615838 1479834 857959 838810
10950H38810j1847k79935j32546j3200p5971J91021A38079L1690G0956b6113A59017
$$ 838810 826963 547028 414482 401282 325311 516332 138079 169769 70956 -26113 159017
10938a91754B56044b6231B26954b4092B32393K3272r3804R4582b5162I5726H451
$$ -191754 256044 -26231 226954 -24092 232393 255665 161861 256443 -25162 95726 8451
10926A29409K5027n51A0664k016h18j97068B56842b9814A84509d6606j96016c6642
$$ 129409 154436 153885 10664 8648 -818 -197886 256842 -29814 184509 -46606 -242622 -36642
10913a89390c0700A47954G2817i4793A04463m9779M2245k7280f5056A61789c41758
$$ -189390 -30700 147954 72817 -94793 104463 54684 96929 69649 -65056 161789 -341758
10901d3586O949a4959A76425i0268C2600d08089d0395C19443a96988c6089n4174
$$ -43586 -36637 -14959 176425 -90268 32600 -408089 -40395 319443 -196988 -36089 -90263
10890i0263J7250A93666C6701b41282C54930A0240J63857b65878i7972J7403b8167
$$ -90263 -73013 193666 36701 -241282 354930 10240 174097 -265878 -97972 -80569 -28167
10878a15369B23858H5812k6402N3659m8863j7197g8110H6276Q7899h3242G1050
$$ -115369 223858 85812 59410 113069 64206 47009 -78110 86276 174175 -83242 71050
10866E6405j8889J16273C0588b30155a941B03275D4213a27188P191c6271q5643
$$ 56405 37516 153789 30588 -230155 -1941 203275 44213 -127188 -119997 -36271 -121914
10855a21914R973d6934H0644a10077m7704a0281B25036a96328e757j90693A46531
$$ -121914 -111941 -46934 80644 -110077 -157781 -10281 225036 -196328 -5757 -196450 146531
10843C25558a34889A40054A8512J24159g4007k9605A9561g0728M462a2909A74581
$$ 325558 -134889 140054 18512 142671 -74007 -103612 19561 -70728 -66266 -12909 174581
10831G2717a92253j55130A67637D0131d7377j1911r6008B7636b18139f6216J5907
$$ 72717 -192253 -347383 167637 40131 -47377 -59288 -155296 27636 -218139 -66216 -50309
10820e0309j70462a05939k22866A4962K16088c05684e3895o4747p2548p3846p9404
$$ -50309 -220771 -105939 -328805 14962 231050 -305684 -53895 -118642 -191190 -265036 -344440
10809c44440A1868L39157d6388j66969a5191j93159e7268j6629A66163d2354F133
$$ -344440 11868 351025 -46388 -213357 -15191 -208350 -57268 -73897 166163 -42354 6133
10797a00463j05729B2897K67737j06933a04099H8693O3349f3058K6112r7493H958
$$ -100463 -206192 22897 290634 183701 -104099 88693 152042 -63058 -36946 -134439 8958
10785B28232c7554A66873h3446k54282A87998l8172e9428j7431B5038L25067a41286
$$ 228232 -37554 166873 -83446 -337728 187998 149826 -59428 -76859 25038 350105 -141286
10773A16559k8466a11545k25142A28303a88928D7271K06654B4929K03680a0254
$$ 116559 88093 -111545 -336687 128303 -188928 47271 253925 24929 228609 -10254
10762A78750C0049N2894J50288c86435a31855I8546Q2288e2890A11551b84141
$$ 178750 30049 82943 233231 -386435 -131855 98546 180834 -52890 111551 -284141
10751c19147A99716L5376a38332j81308J29336A13901a66955n2365A7373J80807
$$ -319147 199716 235092 -138332 -319640 -190304 113901 -166955 -219320 17373 198180
10741A98180i4629F8368b66861i6761a3232E3990A9429a19616j53420J24535N1692
$$ 198180 -94629 68368 -266861 -96761 -13232 53990 19429 -119616 -273036 -148501 -96809
10730i6809A67435f1749r2713j27214j0399A45562f5739J3789A09053a48753B48790
$$ -96809 167435 -61749 -154462 -281676 -292075 145562 -65739 -51950 109053 -148753 248790
10718a10716l997K2643D17773d4231j08531J9420A38792Q6260h7973r5400C1343
$$ -110716 -114713 -92070 417773 -44231 -152762 -133342 138792 225052 -87973 -183373 31343
10706a51846J142B59430a76946Q0870j73894J11217J3712p3704B44299a22812
$$ -151846 -150704 259430 -176946 -96076 -269970 -158753 -145041 -218745 244299 -122812
10695A53817D6048J26948a37045C37525A36886A969M8727b29613f504k37961C8893
$$ 153817 46048 172996 -137045 337525 136886 1969 50696 -229613 -6504 -244465 38893
10683a65521j4361A41857g8722A28503a30970A01875D1600K79552E0265b88735
$$ -165521 -179882 141857 -78722 128503 -130970 101875 41600 321152 50265 -288735
10672b50092d8600D7927K44998e06318A72888a57245G1756d076j5111A34626J00873
$$ -250092 -48600 47927 292925 -506318 172888 -157245 71756 -4076 -19187 134626 235499
10661B35499c12424e2382B13594b9083H3619a52634A1068P54J37299G3153b44889
$$ 235499 -312424 -52382 213594 -29083 83619 -152634 11068 11822 149121 73153 -244889
10649B23382b18313B02920c15020b6118C2432J60860a9111j54443j17947a8537
$$ 223382 -218313 202920 -315020 -26118 32432 193292 -19111 -173554 -291501 -18537
10638c4280a0477I3799g678A78030b12081A39093b36046J09695l7515B71230A00285
$$ -34280 -10477 93799 -7678 178030 -212081 139093 -236046 -126351 -163866 271230 100285
10626A01635e8124n578I1469J4021a94276j09161B46483a29391N0107b3021p1031
$$ 101635 -58124 -63702 91469 105490 -194276 -303437 246483 -129391 -79284 -23021 -94052
10615i4052A02484p188a08983G3567a54109f5383C06150i3996j61028C9510a61201
$$ -94052 102484 95296 -108983 73567 -154109 -65383 306150 -93996 -255024 39510 -161201
10603h4724j84369R4992q5846k20472a09072o8737h7954j53611A42281b22217
$$ -84724 -269093 -174101 -259947 -480419 -109072 -177809 -87954 -241565 142281 -222217
10592a16166I325f9454K7418p2050C45527A36599b7477m0478k42965J37170H6007
$$ -116166 9325 -69454 -42036 -114086 345527 136599 -27477 -67955 -310920 -173750 86007
10580A92277a2834j81960I9597b77911J33893k31563e1201g486B36935H2495P5507
$$ 192277 -12834 -194794 99597 -277911 -144018 -375581 -51201 -7486 236935 82495 158002
10569A58002a49210B12481H4694k9167c75183D3508M58085a2876k45893h1367
$$ 158002 -149210 212481 84694 55527 -375183 43508 501593 -12876 -258769 -81367
10558d64130A7406a43248B00135B2548c29906C34726e4596k34729C4819e899p8810
$$ -464130 17406 -143248 200135 22548 -329906 334726 -54596 -289325 34819 -5899 -84709
10547h4709j76588N0765h7221C99282A64242b87307C6116H47b34016A65394a85682
$$ -84709 -261297 -210532 -87221 399282 164242 -287307 36116 847 -234016 165394 -185682
10535B9530b45104A4845i2538J4912G2302a13401A93801a14392Q732A44183J0050
$$ 29530 -245104 14845 -92538 -77626 72302 -113401 193801 -114392 -105660 144183 154233
10524A54233h2478m6256C17102C9450a44265l58d4248F9078K00985j29835N6353
$$ 154233 -82478 -128734 317102 39450 -144265 -144623 -44248 69078 270063 140228 196581
10513A96581B3481b05100k20203A19666J93975j26278b30924A69580n9840J6888
$$ 196581 23481 -205100 -425303 119666 313641 187363 -230924 169580 109740 126628
10503A26628a05308k1838k88252f4480n005a5965j7368a1272r9877I7397c12574
$$ 126628 -105308 -127146 -415398 -64480 -69485 -15965 -33333 -11272 -111149 97397 -312574
10491a42457a1195k11071g0512j7650j10271k3942L6026A70729k1425F0102K78135
$$ -142457 -11195 -222266 -70512 -88162 -198433 -222375 -186349 170729 149304 60102 338237
10480C38237m93J66408A78003K59295A4821P9112K33882a04317p9794A84619j8796
$$ 338237 337744 504152 178003 437298 14821 93933 327815 -104317 -184111 184619 165823
10469A65823a76764d6701K808C0973J18468a27738j41830h9060n7224f5165J2499
$$ 165823 -176764 -46701 -43893 30973 149441 -127738 -269568 -89060 -146284 -65165 -52666
10458e2666C8786K06221j18779i025l08257D924K2026b5929j00698N3177j35670
$$ -52666 38786 245007 126228 -9025 -317282 4924 26950 -25929 -126627 -73450 -209120
10447b09120D46575A92845E5335O6128i8967A10555J61131a00521j24302M9273
$$ -209120 446575 192845 55335 121463 -98967 110555 271686 -100521 -224823 -175550
10437a75550M9607k03494a1047j00662A14101a0827k89164h5847B06011a20307
$$ -175550 -125943 -329437 -11047 -111709 114101 -10827 -299991 -85847 206011 -120307
10426f6021r977r8691b852l5875J7425q4625F2550O2808a06135K9004k24136F4474
$$ -66021 -75998 -174689 -2852 -38727 -21302 -105927 62550 125358 -106135 -77131 -301267 64474
10413a28624A1081Q9545B5970K49084D2546P9384b10748O9526m1782b6381B21508
$$ -128624 11081 100626 25970 275054 42546 121930 -210748 -141222 -183004 -26381 221508
10401A5358i7747A41997b48628e790a909B18853C1743M1522g2928m8179B93213
$$ 15358 -97747 141997 -248628 -5790 -1909 218853 31743 73265 -72928 -121107 293213
10389A19084m1137P6641d4579F2362g0955l0390k05620C25928G3176K67038a8161
$$ 119084 77947 154588 -44579 62362 -70955 -101345 -306965 325928 73176 340214 -18161
10377e709C01391m2334A19169K74539j54425m9925J41257A23957K55626p3263
$$ -5709 301391 259057 119169 393708 239283 189358 330615 123957 379583 306320
10367C06320L06961k12613J0752j01907J53568L3144A13288K44634r6247J28526
$$ 306320 613281 400668 411420 309513 463081 496225 113288 357922 261675 390201
10357C90201D4971L82093A34148m6248J15821N6917K73642L0890O4300B88052
$$ 390201 44971 427064 134148 87900 203721 260638 534280 565170 629470 288052
10346e7139D79333A50156J85810J49385A34668J00447b62152A72142l4524D7855
$$ -57139 479333 150156 335966 485351 134668 235115 -262152 172142 137618 47855
10335A05885L99059G9363K03318a1759D20591A62839J18419E8656b1037m8050
$$ 105885 504944 79363 282681 -11759 420591 162839 281258 58656 -21037 -69087
10325f9087A82197l6085N24395k03124p0002D9784K45233b5229j85590E6759L68146
$$ -69087 182197 146112 670507 467383 397381 49784 295017 -25229 -210819 56759 424905
10314D24905b0880D04248a29976B82949G8650h156A33370b90370A97337C0442
$$ 424905 -20880 404248 -129976 282949 78650 -8156 133370 -290370 197337 30442
10303A19846E8179a11319j8454k26036D7771b13943i195k0939B5482g9217k48598
$$ 119846 58179 -111319 -129773 -355809 47771 -213943 -9195 -30134 25482 -79217 -327815
10292c27815A70542f3956j03321c4870A33359E8126g3328D8506J26651A9495d420
$$ -327815 170542 -63956 -167277 -34870 133359 58126 -73328 48506 175157 19495 -4420
10280a82299H1451b2548o4173r0443G6507P3297c31688D32686A96645b43367D9262
$$ -182299 81451 -22548 -86721 -177164 76507 149804 -331688 432686 196645 -243367 49262
10268a65299e0114j59540B38154k0715a08929k7536A23571N756J35993H4311K81565
$$ -165299 -50114 -209654 238154 217439 -108929 -136465 123571 129327 265320 84311 365876
10257C65876I4248K24642J95634F3451a7377H9846J0002f5944l2353G7665k085
$$ 365876 94248 318890 514524 63451 -17377 89846 99848 -65944 -98297 77665 75580
10246G5580b8077D1616N5844b31648i1774B58853J8730a41626n9198R4575a8050
$$ 75580 -28077 41616 97460 -231648 -91774 258853 277583 -141626 -200824 -106249 -18050
10234A9895J08254b62919A81116a17689e1548A64759a65168O4078A54673B5418
$$ 19895 128149 -262919 181116 -117689 -51548 164759 -165168 -101090 154673 25418
10223e25k58284B6028M0855a92030A09954h9953A23776a62390r6396B2992c5230
$$ -525 -258809 26028 66883 -192030 109954 -89953 123776 -162390 -258786 22992 -35230
10211B10794b61255l1891l027H9077j2516a37477I9961c88983c1982A44530C1610
$$ 210794 -261255 -293146 -296173 89077 76561 -137477 99961 -388983 -31982 144530 31610
10199b78232a4035k24471A96261e4308j67311I2352R8825a23195q3461c1485j57604
$$ -278232 -14035 -238506 196261 -54308 -221619 92352 191177 -123195 -206656 -31485 -189089
10188a89089i050k06230o7905a8700r1140k08814E2064b08536p7476j90096b10139
$$ -189089 -9050 -215280 -283185 -18700 -109840 -318654 52064 -208536 -286012 -476108 -210139
10176A6889J64910b25110M7842B36272r8559b89499a27850l02350B16575F3947
$$ 16889 181799 -225110 -177268 236272 137713 -289499 -127850 -430200 216575 63947
10165c7746r6725j67326d348n3329B50212D8202K45299b5069l29402e3545j42271
$$ -37746 -134471 -301797 -4348 -57677 250212 48202 293501 -25069 -354471 -53545 -195816
10154a95816B04509I2483L7791b10526C2151c19516b3678k64162e1868H4578k527
$$ -195816 204509 92483 130274 -210526 32151 -319516 -23678 -287840 -51868 84578 82051
10143H2051m751J10298h272p7155A51168a6547j94021j00747c6867m8787l1803
$$ 82051 77300 187598 -8272 -85427 151168 -16547 -210568 -311315 -36867 -85654 -117457
10132a17457a5336A60123b54506J03343J8429J5198A42409c53564a8928l68714
$$ -117457 -15336 160123 -254506 -151163 -132734 -117536 142409 -353564 -18928 -387642
10122c87642a25618j16026k28427C06963F836e07725a70811I5315c93628i1171
$$ -387642 -125618 -241644 -470071 306963 6836 -507725 -170811 95315 -393628 -91171
10111b7354q8217B5749d8348A83870a57398L4766F8446f2919k8056E3673b74717
$$ -27354 -115571 25749 -48348 183870 -157398 -122632 68446 -62919 -90975 53673 -274717
10099b51526j55349a12760o5629c3253r6759B45813c8558o1874a7307p5955J8973
$$ -251526 -406875 -112760 -178389 -33253 -130012 245813 -38558 -100432 -17307 -93262 -74289
10088g4289B41753J1764c94562a05191B26078h2942r5012l0494B17937B3253b23709
$$ -74289 241753 253517 -394562 -105191 226078 -82942 -177954 -208448 217937 23253 -223709
10076F2039J13353a20088d1432m16608c085j27393I5342b48970J21769a5931H6430
$$ 62039 175392 -120088 -41432 -458040 -3085 -130478 95342 -248970 -127201 -15931 86430
10064a84951A15124P629m0959c53178b8967A15562B3790e05409J66402G7057a22609
$$ -184951 115124 122753 81794 -353178 -28967 115562 23790 -505409 -339007 77057 -122609
10052A94370h3369H9479c1724l17235J16000H2210j011P285Q4135f7456j31554
$$ 194370 -83369 89479 -31724 -348959 -232959 82210 81199 88484 172619 -67456 -199010
10041a99010B15391a73355A7718C052b24654M1370j45814j09105a17925N848j38125
$$ -199010 215391 -173355 17718 3052 -224654 -183284 -329098 -438203 -117925 -112077 -250202
10030b50202b5733k6350I4543a15764p7011N5232k3033a0984k9456a2721l42871
$$ -250202 -25733 -52083 94543 -115764 -192775 -137543 -160576 -10984 -40440 -12721 -355592
10019c55592C18584A13356K1804N188b33198P4259K3030I8733e4393F9921e301
$$ -355592 318584 113356 135160 140348 -233198 -158939 -135909 98733 -54393 69921 -5301
10007c16745a24645b8570H1631b08904r8905i5263k30227J11014o5786f2483j53861
$$ -316745 -124645 -28570 81631 -208904 -307809 -95263 -325490 -214476 -280262 -62483 -216344
9996b16344H578J57383k9869d35369F628L5189h6003A15918C0949C113K0277a73126
$$ -216344 8578 165961 136092 -435369 6628 41817 -86003 115918 30949 3113 23390 -173126
9983e5905j92205B5256c15910a6197j61265C68193h1870m2744B10124b76697J29948
$$ -55905 -248110 25256 -315910 -16197 -177462 368193 -81870 -124614 210124 -276697 -146749
9972a46749p608b5251c270B00907F6465d4982q7598G1678B3571a16820e6917j14217
$$ -146749 -154357 -25251 -3270 200907 66465 -44982 -132580 71678 23571 -116820 -56917 -171134
9960a71134Q5268b7491k74976d5058j12890r2096g880j03135k73573h2172k64054
$$ -171134 -85866 -27491 -302467 -45058 -157948 -250044 -7880 -111015 -384588 -82172 -346226
9949c46226H4336K1513a21016q4557k12207A0441P6399B1985J27879j6635E908
$$ -346226 84336 105849 -121016 -205573 -417780 10441 86840 21985 149864 133229 5908
9937c42020J27664A64677a99501K9227P9629E6823B4148b20435b3926H8753D676
$$ -342020 -214356 164677 -199501 -170274 -90645 56823 24148 -220435 -23926 88753 4676
9925C9658a38634b1582n6995B44658b55737r6758C30504i6890d0308m14023d2263
$$ 39658 -138634 -21582 -78577 244658 -255737 -352495 330504 -96890 -40308 -454331 -42263
9913A54688b18434A36042J01458f836k02237B75308g3375j52178A42720B2501
$$ 154688 -218434 136042 237500 -6836 -209073 275308 -73375 -225553 142720 22501
9902B85114a0486k60925B08766C2957h4152j1793o995A06818p307a75574F101
$$ 285114 -10486 -271411 208766 32957 -84152 -95945 -102940 106818 99511 -175574 6101
9890B23123j4372b28968A05970g3771k72545a65997d3334B06321H4947a90713
$$ 223123 208751 -228968 105970 -73771 -346316 -165997 -43334 206321 84947 -190713
9879b75251a35721c7197l3456n3553a4583j40344E2465n087M2268a247j25809
$$ -275251 -135721 -37197 -70653 -124206 -14583 -154927 52465 47378 89646 -1247 -127056
9868a27056H734O582Q2709c7406n1466F4386a18751A27987H797K07534a39373
$$ -127056 8734 15316 98025 -37406 -88872 64386 -118751 127987 8797 216331 -139373
9856h4832d0227B04275F46a1396C36904a31435j7359L6454A86026a72339h0004
$$ -84832 -40227 204275 646 -11396 336904 -131435 -148794 -112340 186026 -172339 -80004
9844B0535c88043A24126a30267j7950D3125J9787b60617g1424p1419e9097A22071
$$ 20535 -388043 124126 -130267 -148217 43125 62912 -260617 -71424 -142843 -59097 122071
9832a2907k20711F4134a30327a4760q3882h990m10777c2037h906k30935A03012
$$ -12907 -233618 64134 -130327 -14760 -98642 -8990 -419767 -32037 -8906 -239841 103012
9820A05577a55948k71695H871a66955e7321l15887A35694M9258c07051e0679m6502
$$ 105577 -155948 -427643 8871 -166955 -57321 -373208 135694 184952 -307051 -50679 -97181
9809i7181M3348I4596c98357i4927k35877r6954k02195a43896l44546A4640a87424
$$ -97181 -53833 94596 -398357 -94927 -330804 -427758 -629953 -143896 -488442 14640 -187424
9797b44041B6540N5698J29213d577A1305K7810i6204j2151A25106a10369Q647
$$ -244041 26540 82238 211451 -4577 11305 39115 -96204 -108355 125106 -110369 -101722
9786a01722A26938a01909M2341A0868g7644f813D781O1289b17960n1735h024B06495
$$ -101722 126938 -101909 -59568 10868 -77644 -6813 4781 66070 -217960 -269695 -8024 206495
9773A60690c81935a1136k1357l74539A54639h2647B2915L0968e1681G0230a3961
$$ 160690 -381935 -11136 -32493 -407032 154639 -82647 22915 53883 -51681 70230 -13961
9761a0494j14116B67369J77935c8218B65831k4157g58A37482b82084j5496a33520
$$ -10494 -124610 267369 445304 -38218 265831 241674 -758 137482 -282084 -297580 -133520
9749a84038Q8651d7219A12782J43767A16518h7962j40178C81607b42072a8920
$$ -184038 -95387 -47219 112782 256549 116518 -87962 -228140 381607 -242072 -18920
9738a83385m8217k1672p7654d6329A00379b62921A04973a78456k34372a00150
$$ -183385 -231602 -253274 -330928 -46329 100379 -262921 104973 -178456 -412828 -100150
9727b06741m7263B23793a21753B31984a02894k12383Q9045F0701a38603f5464
$$ -206741 -254004 223793 -121753 231984 -102894 -315277 -226232 60701 -138603 -65464
9716a50286j09749E3043K34271a6149j70676B22355b46685c1653B48749a26777
$$ -150286 -260035 53043 287314 -16149 -186825 222355 -246685 -31653 248749 -126777
9705A94032G3328K2391m5706b03666B26407a64127A98760D0384a52255k8156B361
$$ 194032 73328 95719 50013 -203666 226407 -164127 198760 40384 -152255 -180411 2361
9693D8882a72333C8269c159k47531J9309A97397h1750A30015d005n3878F0766
$$ 48882 -172333 38269 -3159 -250690 -231381 197397 -81750 130015 -4005 -57883 60766
9681c02464C68479a22144J4896C1577e062H4504M4657O6269a12733B53322b56792
$$ -302464 368479 -122144 -107248 31577 -5062 84504 129161 195430 -112733 253322 -256792
9669I3222a65389A21247i9829k49849J167E7760a67540k8106q7453D20781c6550
$$ 93222 -165389 121247 -99829 -349678 -348511 57760 -167540 -195646 -283099 420781 -36550
9657H0355b48873E228N6325g0861B2881o250J13632a54956d3035A97904a26371
$$ 80355 -248873 5228 61553 -70861 22881 16631 130263 -154956 -43035 197904 -126371
9645c09540C4131a90554P6406Q500q2445L5879A81406h8043A49489n2334A5560
$$ -309540 34131 -190554 -114148 -105648 -188093 -152214 181406 -88043 149489 97155 15560
9633a37803j57458f5186n0709d9055n8883j67581a5247A14232k8960d7445P739
$$ -137803 -295261 -65186 -115895 -49055 -107938 -275519 -15247 114232 85272 -47445 -39706
9622c9706j06349B13544a84043K8586L3414N0352A26267a4472B81537h8776k46934
$$ -39706 -146055 213544 -184043 -155457 -122043 -71691 126267 -14472 281537 -88776 -335710
9611c35710A86580c8835m3195c760m28416K06155R096A18863c1987B4931c44001
$$ -335710 186580 -38835 -82030 -3760 -432176 -226021 -216925 118863 -31987 24931 -344001
9599F5310a45081c3660l741B01733l4874D0478J6886J87204b88180a0976k13589
$$ 65310 -145081 -33660 -37401 201733 166859 40478 57364 244568 -288180 -10976 -224565
9588b24565A34962c16883O597R0674H8853b55760R5846A3063c95182B61118f5426
$$ -224565 134962 -316883 -310286 -219612 88853 -255760 -159914 13063 -395182 261118 -65426
9576C9975a82205m02749b22655B404b03445Q8025l60023C4347k469c66868C07249
$$ 39975 -182205 -584954 -222655 2404 -203445 -115420 -475443 34347 31878 -366868 307249
9564a85167l0070f2218k86450N5423c3319k60531i9775D5623A6400F186M6326
$$ -185167 -215237 -62218 -348668 -293245 -33319 -293850 -99775 45623 16400 6186 52512
9553E2512a14699G4563i3679o66c6231A51202n2855a43455J5202k51976q0128
$$ 52512 -114699 74563 -93679 -94345 -36231 151202 98347 -143455 -128253 -380229 -460357
9542d60357a03608D3227a83218e1273j84654M8424d5941A55589C2602b86746C14961
$$ -460357 -103608 43227 -183218 -51273 -235927 -187503 -45941 155589 32602 -286746 314961
9530a0428r388B32211A5415h6835A86922G0195a33871j56878G9994c01257b5404
$$ -10428 -19816 232211 15415 -86835 186922 70195 -133871 -290749 79994 -301257 -25404
9518g6518j78702L0438R9211B15458n5511p9123b03305a9340B27284b0513l7531
$$ -76518 -255220 -224782 -125571 215458 159947 80824 -203305 -19340 227284 -20513 -58044
9507e8044j93800B7700N7918d8533E9887j4406B2562d9050J3521A33753g588j43335
$$ -58044 -251844 27700 85618 -48533 59887 45481 22562 -49050 -35529 133753 -7588 -150923
9495a50923O731K9814a796m94697A16220a92917g9359b2330j71203A52246J91678
$$ -150923 -144192 -114378 -1796 -496493 116220 -192917 -79359 -22330 -193533 152246 343924
9484C43924c2393k55552b6512E0831h833A05789J06099J82986G776g9762B39340
$$ 343924 -32393 -287945 -26512 50831 -8833 105789 211888 394874 7776 -79762 239340
9472c48956c4975i370j66960O8612j75195i9625B25956e0234n9749K0826j09807
$$ -348956 -34975 -9370 -176330 -107718 -282913 -99625 225956 -50234 -109983 -89157 -198964
9461a98964A12596a97509O4113q3158a02075A50901b17682c9161j71469d276H6383
$$ -198964 112596 -197509 -133396 -216554 -102075 150901 -217682 -39161 -210630 -4276 86383
9449a9471k25749C6952c77078G3490c0190A00039c5301B5630e11926a78490A20332
$$ -19471 -245220 36952 -377078 73490 -30190 100039 -35301 25630 -511926 -178490 120332
9437a65955r551c727k32211C49661c03817A70628l5936K4989c7057a690n295A15727
$$ -165955 -175506 -3727 -235938 349661 -303817 170628 134692 159681 -37057 -1690 -6985 115727
9424a27807k43721a28870E3462J4767a56856d4520l2462j46899h4103b8945k08505
$$ -127807 -371528 -128870 53462 68229 -156856 -44520 -76982 -223881 -84103 -28945 -237450
9413b37450j2564A749J26026B5482a50476o9139G1021a2578j42921C40685j13778
$$ -237450 -250014 1749 127775 25482 -150476 -219615 71021 -12578 -155499 340685 226907
9402B26907b36521I5531C9549b49460F8679a10327C21269G8316a8284k081G2401
$$ 226907 -236521 95531 39549 -249460 68679 -110327 321269 78316 -18284 -20365 72401
9390B44728J36244b13696e7023A55277n8335a60764l7257H7275h8848M0298J3131
$$ 244728 380972 -213696 -57023 155277 96942 -160764 -198021 87275 -88848 -48550 -35419
9379c5419j83472B9622R614c04477M0730L0682H9104i5040B72404I0225a0076
$$ -35419 -218891 29622 39236 -304477 -263747 -233065 89104 -95040 272404 90225 -10076
9367a12960F6046d46451a75081a879j55094d2245n0178k19201L3363A68210a471
$$ -112960 66046 -446451 -175081 -1879 -156973 -42245 -92423 -311624 -278261 168210 -1471
9355b4950I2778c04312d0966q1002A20213f2239k3492R964B33852b0393m0964
$$ -24950 92778 -304312 -40966 -121968 120213 -62239 -85731 -75767 233852 -20393 -61357
9344f1357b9767l017C19118a86284A11999c07432D5886h9183j10891A41879a79573
$$ -61357 -29767 -32784 319118 -186284 111999 -307432 45886 -89183 -200074 141879 -179573
9332H7816a36119n3406k41274a32536e6131H6210K14517b9868k126o8316j45164
$$ 87816 -136119 -189525 -430799 -132536 -56131 86210 300727 -29868 -31994 -100310 -245474
9321b45474O2483E553O5432a38539A10994k2271f3963j46825C1991b21571A48682
$$ -245474 -182991 5553 70985 -138539 110994 88723 -63963 -210788 31991 -221571 148682
9309b77268J06295B6331h7586B42941b26921A87864g3822k25260C1000a36227
$$ -277268 -170973 26331 -87586 242941 -226921 187864 -73822 -299082 31000 -136227
9298c2038k21756h7018A6209a18993B5068N4023A8255g5084j19980n3256R3095
$$ -32038 -253794 -87018 16209 -118993 25068 79091 18255 -75084 -195064 -248320 -155225
9287a55225j64321B15298B0546a40026L1274a7377B2252c9710a2871A20346a47881
$$ -155225 -319546 215298 20546 -140026 -108752 -17377 22252 -39710 -12871 120346 -147881
9275a44246j68560a8008A27567b54684l4534A50142c19214J59078o8240A45727
$$ -144246 -312806 -18008 127567 -254684 -289218 150142 -319214 -160136 -228376 145727
9264a53349j24195H4780c6243q6485A79253b78413J35942A88056n7206b28648
$$ -153349 -277544 84780 -36243 -122728 179253 -278413 -142471 188056 130850 -228648
9253a36063N5145K1651j10806H3792a94008D7930b84229L065R3757k1849h3020
$$ -136063 -80918 -59267 -170073 83792 -194008 47930 -284229 -281164 -187407 -209256 -83020
9241a07248c6059j44060C9858e4376G9518L90015D3412a18628n0348n1391B2451
$$ -107248 -36059 -180119 39858 -54376 79518 469533 43412 -118628 -168976 -220367 22451
9229a90810E2595c44093J55805H007J9523a17066l1477F739L7188J36089e7786
$$ -190810 52595 -344093 -188288 8007 27530 -117066 -148543 6739 43927 180016 -57786
9217b82494A50046a48068k7111G4553J54847E9058J19467f5006C8285c8823A085
$$ -282494 150046 -148068 -175179 74553 229400 59058 178525 -65006 38285 -38823 1085
9205B88829b05285b776j07801k61956D7943Q6573c80870a33845r1951a06466M9681
$$ 288829 -205285 -2776 -110577 -372533 47943 134516 -380870 -133845 -225796 -106466 -56785
9194e6785j74965L0331B88951m2865b40440A3988d13541a17217h274j61373d6918
$$ -56785 -231750 -201419 288951 246086 -240440 13988 -413541 -117217 -8274 -169647 -46918
9182c45417E9620a27365m7131J9486C22027f8569j03885a6223l86227J85353q9987
$$ -345417 59620 -127365 -174496 -155010 322027 -68569 -172454 -16223 -402450 -217097 -307084
9171c07084a19737A20766a08063c1774k21892R4608B00227a10847A44996D1611
$$ -307084 -119737 120766 -108063 -31774 -253666 -159058 200227 -110847 144996 41611
9160a68828A53208a93964Q157j33591F448a16317a2275p3504J5147k54931a53462
$$ -168828 153208 -193964 -185807 -319398 6448 -116317 -12275 -85779 -70632 -325563 -153462
9148A29776A4891M5077K18209b82442a054A35750g4690A11668c34685B20453g5198
$$ 129776 14891 59968 278177 -282442 -1054 135750 -74690 111668 -334685 220453 -75198
9136E4389J50266a81885K7319j9449k31204a95219I7907c5440n440q7731B61769
$$ 54389 204655 -181885 -154566 -174015 -405219 -195219 97907 -35440 -40880 -128611 261769
9124c36325B63382A8512a84392j26754a23475A1823d8073q0337J4314F6265d5811
$$ -336325 263382 18512 -184392 -311146 -123475 11823 -48073 -128410 -114096 66265 -45811
9112A0100i2082A74500a55687j5835N2043K8554l26117H8588c93272C55713b35096
$$ 10100 -92082 174500 -155687 -171522 -119479 -90925 -417042 88588 -393272 355713 -235096
9100b49555f9811j03455O4013L0279G1401i1973A07502b75625b9631k03361F8085
$$ -249555 -69811 -173266 -109253 -78974 71401 -91973 107502 -275625 -29631 -232992 68085
9088d1787n245O166p6366k6987B52996E3704N8146a00188a5715C8179g0427J2815
$$ -41787 -47032 -40866 -117232 -144219 252996 53704 111850 -100188 -15715 38179 -70427 -57612
9076e7612j55719J00952p7942P7684E4839g1725B68456n7213A0183a69049K9025
$$ -57612 -213331 -112379 -190321 -112637 54839 -71725 268456 211243 10183 -169049 -140024
9065a40024l16210a18117j3952L670A3552a53939C59666e6828k01478a28378j46990
$$ -140024 -456234 -118117 -132069 -128399 13552 -153939 359666 -56828 -258306 -128378 -275368
9054b75368E5259J83957n3622a17369h72r7278m7034F9872P9893b7464r0698j36289
$$ -275368 55259 239216 185594 -117369 -872 -98150 -145184 69872 149765 -27464 -118162 -254451
9042b54451A54100a95424G0927b88753h6565H6091c30957B48703b00718e8832
$$ -254451 154100 -195424 70927 -288753 -86565 86091 -330957 248703 -200718 -58832
9031b17667C1698b79851a13114d7445l93662a36848D3817b32695B65780a60545
$$ -217667 31698 -279851 -113114 -47445 -441107 -136848 43817 -232695 265780 -160545
9020E654b03664G8723B3809c51911B1490R0839k731J70300G5408c275j42135F492
$$ 5654 -203664 78723 23809 -351911 21490 112329 109598 279898 75408 -3275 -145410 6492
9007b4970k65151A20769b206A08362i5601A21525g9307K7627A39198L4230j8095
$$ -24970 -290121 120769 -2206 108362 -95601 121525 -79307 -51680 139198 173428 155333
8996A55333p4587a98269k11247e2512k35949Q7145A81564A6000e96928d6194j98661
$$ 155333 80746 -198269 -409516 -52512 -288461 -201316 181564 16000 -596928 -46194 -244855
8985b44855J9104G2396a92208C2895J451a06094G2097a01467l5558B36489c11919
$$ -244855 -225751 72396 -192208 32895 34346 -106094 72097 -101467 -137025 236489 -311919
8973A64734L151B4179d85845B5542c84655a82419e3091C60946b12354f4915j8826
$$ 164734 167885 24179 -485845 25542 -384655 -182419 -53091 360946 -212354 -64915 -83741
8962h3741C23917a42413j00192H3433b45402g6662a288r2894l8042M5558j25011
$$ -83741 323917 -142413 -242605 83433 -245402 -76662 -1288 -94182 -132224 -86666 -211677
8951b11677f3512I0482a70542B75561A13536a61837E8528A0296R2184a79459O4500
$$ -211677 -63512 90482 -170542 275561 113536 -161837 58528 10296 102480 -179459 -114959
8940a14959m4499f0532a44l54220B30352e4936A85413N8990G418f8660B02132
$$ -114959 -159458 -60532 -144 -354364 230352 -54936 185413 244403 7418 -68660 202132
8928F578c11902A39231J77153L14930J2572J950680N762817k636409A378712B39480
$$ 6578 -311902 139231 316384 631314 643886 2594566 8357383 5720974 1378712 239480
8917A96928p7372a39391j78049d5199B22776g7012c558E4226J15000P738g2813
$$ 196928 119556 -139391 -317440 -45199 222776 -77012 -3558 54226 169226 176964 -72813
8905A36454a11172k35111F6177f3281A05788i2362k6929D10256c79036a40439
$$ 136454 -111172 -346283 66177 -63281 105788 -92362 -119291 410256 -379036 -140439
8894c13879d1086J7010A79420B4367J66536a39946j90145c5901A20842b16832
$$ -313879 -41086 -24076 179420 24367 190903 -139946 -330091 -35901 120842 -216832
8883a89563i0822m3263d2446C2633J20373a4433j09072j47342e160C0563a96675
$$ -189563 -90822 -134085 -42446 32633 153006 -14433 -123505 -270847 -5160 30563 -196675
8871i3895k44822A47249a13151q5311A55460a34588g138p2109q4955Q599D2502
$$ -93895 -338717 147249 -113151 -198462 155460 -134588 -7138 -79247 -164202 -155603 42502
8859e8208G51b78680H3532Q2849a9920j5707q7931L2142J708j2754b6008j43801
$$ -58208 751 -278680 83532 166381 -19920 -35627 -123558 -91416 -89708 -102462 -26008 -169809
$$ [...]
##END NTUPLES=NMR SPECTRUM
##END=
