##TITLE=AC1655_NARAH14391_8531735_tWAfFlMTDw
##JCAMPDX= 6.0         $$ Bruker NMR JCAMP-DX V2.0
##DATA TYPE= NMR SPECTRUM
##DATA CLASS= NTUPLES
##ORIGIN= BRUKER
##OWNER= Administrator
$$ 1.72 TOPSPIN		Version 2.1
$$ 2014-03-14 16:36:07.057 -0800  Administrator@X
$$ Compression mode = diff/dup
##.OBSERVE FREQUENCY= 400.02188249412
##.OBSERVE NUCLEUS= ^1H
##.ACQUISITION MODE= SIMULTANEOUS (DQD)
##.ACQUISITION SCHEME= undefined
##.AVERAGES= 64
##.DIGITISER RES= 22
##SPECTROMETER/DATA SYSTEM= spect
##.PULSE SEQUENCE= noesygpps1d.comp
##.SOLVENT NAME= COFFEE_meoh
##.SHIFT REFERENCE= INTERNAL, COFFEE_meoh, 1, 14.9608
##AUDIT TRAIL= $$ (NUMBER, WHEN, WHO, WHERE, PROCESS, VERSION, WHAT)
$$ ##TITLE= Audit trail, TOPSPIN		Version 2.1
$$ ##JCAMPDX= 5.01
$$ ##ORIGIN= Bruker BioSpin GmbH
$$ ##OWNER= Administrator
$$ $$ E:\/data/COFFEE/nmr/AC1655_NARAH14391_8531735_tWAfFlMTDw/12/pdata/1/auditp.txt
$$ ##AUDIT TRAIL=  $$ (NUMBER, WHEN, WHO, WHERE, PROCESS, VERSION, WHAT)
(   1,<2014-03-14 16:36:02.010 -0800>,<Administrator>,<X>,<go>,<TOPSPIN 2.1>,
      <created by zg
	started at 2014-03-14 16:24:31.765 -0800,
	POWCHK enabled, PULCHK disabled,
       configuration hash MD5:
       C8 4E 4E 5D D3 5C D8 9E 9F 52 82 E0 59 8A DE 15
       data hash MD5: 64K
       BF 8A A0 88 12 E9 83 06 12 84 4E A0 6A D7 CA 90>)
(   2,<2014-03-14 16:36:05.026 -0800>,<Administrator>,<X>,<proc1d>,<TOPSPIN 2.1>,
      <Start of raw data processing
       efp LB = 0.3 FT_mod = 6 PKNL = 1 PHC0 = 0 PHC1 = 0 SI = 128K 
       data hash MD5: 128K
       0B DB 3E 7E B5 8C 6F 27 A0 4C 19 69 0F 48 F3 CC>)
(   3,<2014-03-14 16:36:06.104 -0800>,<Administrator>,<X>,<proc1d>,<TOPSPIN 2.1>,
      <pk PHC0 = -82.08984 PHC1 = 0 
       data hash MD5: 128K
       60 39 B7 B1 86 E2 28 31 0D 80 3A 03 1E 65 29 44>)
(   4,<2014-03-14 16:36:06.463 -0800>,<Administrator>,<X>,<proc1d>,<TOPSPIN 2.1>,
      <abs ABSG = 1 
       data hash MD5: 128K
       CA 1F 2C 30 D2 87 81 1F E1 94 DA 9D 32 AC 34 2C>)
(   5,<2014-03-14 16:36:06.557 -0800>,<Administrator>,<X>,<proc1d>,<TOPSPIN 2.1>,
      <abs ABSG = 2 
       data hash MD5: 128K
       01 89 50 4F 42 6F 82 5E 36 5A 7A 5D 70 8B 12 15>)
(   6,<2014-03-14 16:36:06.651 -0800>,<Administrator>,<X>,<proc1d>,<TOPSPIN 2.1>,
      <abs ABSG = 3 
       data hash MD5: 128K
       A8 9E F9 BE BB F9 49 A4 E1 18 B8 99 BC FA 52 17>)
(   7,<2014-03-14 16:36:06.729 -0800>,<Administrator>,<X>,<proc1d>,<TOPSPIN 2.1>,
      <abs ABSG = 4 
       data hash MD5: 128K
       6C F7 F9 20 6D 8A 6D 84 50 25 7E 99 DD C6 BF 52>)
(   8,<2014-03-14 16:36:06.838 -0800>,<Administrator>,<X>,<proc1d>,<TOPSPIN 2.1>,
      <abs ABSG = 5 
       data hash MD5: 128K
       9D CA 48 25 A6 1F 2A 5F D7 D8 FA 9B 2E 7A 80 28>)
$$ ##END=
$$ 
$$ $$ hash MD5
$$ $$ 2E 83 A5 C4 F1 EB F2 77 FF DD 3F FB E4 C8 21 D6
##$RELAX= 
##$RELAX= 
##$RELAX= 
##$RELAX= 
##$RELAX= 
##$RELAX= 
##$RELAX= 
##$RELAX= 
$$ Bruker specific parameters
$$ --------------------------
##$DU= <E:\>
##$EXPNO= 12
$$ [...]
150 150 150 150 150 150 150 150
##$TP07= 0
##$TPNAME0= <>
##$TPNAME1= <>
##$TPNAME2= <>
##$TPNAME3= <>
##$TPNAME4= <>
##$TPNAME5= <>
##$TPNAME6= <>
##$TPNAME7= <>
##$TPOAL= (0..7)
0.5 0.5 0.5 0.5 0.5 0.5 0.5 0.5
##$TPOFFS= (0..7)
0 0 0 0 0 0 0 0
##$TUNHIN= 0
##$TUNHOUT= 0
##$TUNXOUT= 0
##$USERA1= <user>
##$USERA2= <user>
##$USERA3= <user>
##$USERA4= <user>
##$USERA5= <user>
##$V9= 5
##$VALIST= <valist>
##$VCLIST= <CCCCCCCCCCCCCCC>
##$VD= 0
##$VDLIST= <DDDDDDDDDDDDDDD>
##$VPLIST= <PPPPPPPPPPPPPPP>
##$VTLIST= <TTTTTTTTTTTTTTT>
##$WBST= 1024
##$WBSW= 4
##$XGAIN= (0..3)
0 0 0 0
##$XL= 0
##$YL= 0
##$YMAX_a= 5964293
##$YMIN_a= -13055599
##$ZGOPTNS= <>
##$ZL1= 120
##$ZL2= 120
##$ZL3= 120
##$ZL4= 120
##$ABSF1= 14.9608
##$ABSF2= -5.597382
##$ABSG= 5
##$ABSL= 3
##$ALPHA= 0
##$AQORDER= 0
##$ASSFAC= 0
##$ASSFACI= 0
##$ASSFACX= 0
##$ASSWID= 0
##$AUNMP= <proc_prof1d_extract.lims>
##$AXLEFT= 0
##$AXNAME= <>
##$AXNUC= <1H>
##$AXRIGHT= 0
##$AXTYPE= 0
##$AXUNIT= <>
##$AZFE= 0.1
##$AZFW= 0.1
##$BCFW= 0
##$BC_mod= 0
##$BYTORDP= 0
##$COROFFS= 0
##$CY= 15
##$DATMOD= 1
##$DC= 0
##$DFILT= <>
##$DTYPP= 0
##$F1P= 0
##$F2P= 0
##$FCOR= 0.5
##$FTSIZE= 131072
##$FT_mod= 6
##$GAMMA= 0
##$GB= 0
##$INTBC= 1
##$INTSCL= 1
##$ISEN= 128
##$LB= 0.3
##$LEV0= 0
##$LPBIN= 0
##$MAXI= 10000
##$MC2= 0
##$MEAN= 0
##$ME_mod= 0
##$MI= 0
##$NCOEF= 0
##$NC_proc= -2
##$NLEV= 6
##$NOISF1= 0
##$NOISF2= 0
##$NSP= 0
##$NTH_PI= 0
##$NZP= 0
##$OFFSET= 14.9608
##$PC= 1
##$PHC0= -82.08984
##$PHC1= 0
##$PH_mod= 1
##$PKNL= yes
##$PPARMOD= 0
##$PPDIAG= 0
##$PPIPTYP= 0
##$PPMPNUM= 2147483647
##$PPRESOL= 1
##$PSCAL= 4
##$PSIGN= 0
##$PYNMP= <proc.py>
##$REVERSE= no
##$SF= 400.020009716141
##$SI= 131072
##$SIGF1= 0
##$SIGF2= 0
##$SINO= 400
##$SIOLD= 131072
##$SPECTYP= <>
##$SREGLST= <1H.CDCl3>
##$SSB= 0
##$STSI= 131072
##$STSR= 0
##$SW_p= 8223.68421052631
##$SYMM= 0
##$S_DEV= 0
##$TDeff= 65536
##$TDoff= 0
##$TI= <>
##$TILT= no
##$TM1= 0
##$TM2= 0
##$TOPLEV= 0
##$USERP1= <user>
##$USERP2= <user>
##$USERP3= <user>
##$USERP4= <user>
##$USERP5= <user>
##$WDW= 1
##$XDIM= 131072
##$YMAX_p= 401483894
##$YMIN_p= -11293
##$CURPLOT= <Network HP LaserJet P1505>
##$CURPRIN= <$Network HP LaserJet P1505>
##$DFORMAT= <normdp>
##$LAYOUT= <+/1D_H.xwp>
##$LFORMAT= <normlp>
##$PFORMAT= <normpl>
##$SURQMSG= 1
$$ End of Bruker specific parameters
$$ ---------------------------------
##NTUPLES= NMR SPECTRUM
##VAR_NAME=  FREQUENCY,     SPECTRUM/REAL,   SPECTRUM/IMAG
##SYMBOL=    X,             R,               I
##VAR_TYPE=  INDEPENDENT,   DEPENDENT,       DEPENDENT
##VAR_FORM=  AFFN,          ASDF,            ASDF
##VAR_DIM=   131072,        131072,          131072
##UNITS=     HZ,            ARBITRARY UNITS, ARBITRARY UNITS
##FACTOR=    0.0627417313425164, 1,          1
##FIRST=     8223.62146879497, 376,          -57576
##LAST=      0,             1206,            -57937
##MIN=       0,             -11293,          0
##MAX=       8223.62146879497, 401483894,    0
$$ Real data points
##PAGE= N=1
##DATA TABLE= (X++(R..R)), XYDATA
$$ [...]
65100 253369 244866 237832 231410 224990 218747 213252 208568 204020 199074 194229 190720 189323 189692 190887
65086 190887 192260 193660 194999 196002 196462 196555 196640 196756 196531 195734 194692 193915 193461 193002 192460 192129 192154 192300
65068 192300 192426 192759 193465 194313 195014 195537 195831 195635 194882 193953 193144 192295 191352 190844 191180 191929 192473 193035 194143
65049 194143 195300 195244 193631 191469 189644 187956 186018 184241 183281 183099 183231 183543 184063 184375 183811 182130
65033 182130 179625 176748 173982 171802 170269 168815 166849 164426 161995 159754 157721 156191 155548 155637 155911
65018 155911 156205 156861 157988 159097 159729 160102 160852 162247 163866 164971 165221 165107 165738 167978 171691 175929
65002 175929 179842 183332 186848 190734 194789 198321 200676 201866 202627 203671 204965 205946 206403 206795 207657
64987 207657 208995 210458 211912 213631 216042 219372 223448 227634 231035 232983 233431 232873 231824 230437 228583
64972 228583 226228 223575 220782 217665 213908 209574 205164 201077 197231 193419 189856 187002 184862 182806
64958 182806 180221 177211 174503 172794 172203 172266 172291 171810 170766 169342 167645 165711 163828 162620 162551 163351
64942 163351 164141 164309 164118 164287 165025 165778 166019 165961 166203 166886 167638 168301 169197 170544 172021 173230 174195 175036
64924 175036 175448 174996 173846 172747 172266 172336 172599 172823 172893 172739 172429 172197 172241 172651 173564 175221 177761 181077
64906 181077 184925 189046 193187 197147 200888 204522 208241 212329 217139 222834 229205 235952 243018 250405
64892 250405 257787 264675 270917 276623 281594 285346 287843 289730 291604 293447 295025 296369 297394 297409 295582
64877 295582 291831 286878 281551 276350 271558 267239 263087 258691 254116 250006 247018 245242 244162 243056
64863 243056 241527 239791 238353 237295 236091 234287 232017 229469 226211 221672 216150 210676 205815 201266
64849 201266 196806 192970 190379 188882 187791 186706 185716 185073 185020 185673 186670 187156 186536 185181 184036 183592
64833 183592 183630 183859 184320 185009 185511 185314 184391 183311 182816 183357 184928 187178 189639 191980 194203 196691 199934
64816 199934 204066 208725 213554 218717 224639 231319 238343 245609 253585 262621 272467 282762 293436 304126
64802 304126 313576 320306 323754 324233 321994 317083 310100 302285 294509 286705 278600 270524 263130 256674
64788 256674 250958 245727 240801 236006 231411 227556 225142 224379 224720 225209 225153 224649 224593 226018 229303 234003
64772 234003 239341 244693 249795 254885 260626 267486 275129 282858 290637 299082 308218 316977 324393 330776
64758 330776 337079 343511 349456 354497 358776 362411 365261 367356 368948 369997 370128 369335 368234 367248 365854
64743 365854 362982 358047 351347 343552 335016 325628 315266 304351 293878 284842 277651 272119 267780
64730 267780 264127 260774 257737 255469 254300 253964 253917 254011 254466 255270 256082 256783 257800 259754 263024 267586
64714 267586 272919 278051 282140 285146 287652 290020 292041 293398 293930 293366 291341 287950 283731 278825 272626
64699 272626 264753 255991 247761 240844 235086 230108 225774 221992 218633 215766 213696 212588 212245 212343 212758
64684 212758 213630 215140 217257 219729 222415 225600 229759 235020 241102 247813 255278 263572 272636 282722
64670 282722 294334 307208 319777 330271 338221 344310 348877 351194 350305 346078 339327 331211 322610
64657 322610 313811 304776 295856 287950 281595 276227 271023 266285 263198 262180 262321 262697 263432 265039 267470
64642 267470 270443 274205 279261 285673 293259 302244 313075 325676 339436 353878 368821 383925 398552
64629 398552 412140 424344 434834 443276 449383 452611 452054 447358 439694 431029 422196 412432 401170
64616 401170 389493 379094 370368 362421 354725 347816 342213 337550 333224 329393 326703 325204 324005 322009
64602 322009 318771 314623 310203 305915 301711 297322 292717 288287 284432 281009 277348 272937 267977 263181
64588 263181 259087 255753 253077 251223 250472 250802 251916 253694 256398 260285 265260 271078 277651 284832 292076
64573 292076 298697 304463 309550 313846 316695 317529 316437 313932 310388 305966 300809 294965 288299 280796
64559 280796 272902 265267 258189 251573 245381 239867 235345 231956 229621 228012 226649 225302 224243 223818
64545 223818 223800 223560 222926 222482 222907 224336 226536 229325 232502 235563 237815 238774 238381 236949 234994 232878
64529 232878 230541 227764 224766 222261 220708 219817 219037 218280 217870 217969 218437 219133 220038 221112 222310 223718
64513 223718 225383 227080 228578 230170 232650 236605 241823 247476 252796 257607 262353 267698 274101 281718
64499 281718 290569 300543 311242 322106 332816 343204 352654 359990 364384 366095 365898 364015 360104
64486 360104 354123 346628 338289 329702 321716 315275 310617 307032 303686 300368 297223 294149 290799 286991
64472 286991 282833 278601 274697 271516 269126 267232 265633 264604 264607 265734 267621 269863 272337 275101 278042
64457 278042 280707 282621 283845 284990 286402 287569 287772 287220 287002 287833 289419 291242 293373 296167 299688
64442 299688 303865 308794 314339 319834 324874 330210 337141 345999 355851 365860 376378 388458 402715
64429 402715 419088 437554 458742 483718 513254 547440 586179 630110 680868 740275 809455
64418 809455 888872 978844 1079303 1188813 1304071 1420596 1534022 1641100 1740071 1830264
64408 1830264 1911036 1980748 2036694 2075944 2096258 2096583 2077401 2040940 1990610 1929536 1859194 1779308
64396 1779308 1689106 1588888 1480801 1368393 1255518 1145532 1041191 944665 857229 779035
64386 779035 709638 648828 596704 552968 516490 485733 459405 436591 416559 398762 383036
64375 383036 369582 358626 349980 342895 336418 330021 323826 318126 312824 307528 302086 296722 291639 286727
64361 286727 281739 276583 271512 267139 264190 262933 262914 263435 264234 265405 266897 268623 271050 275090 281174
64346 281174 288824 297216 305679 313522 319948 324517 327251 327947 325985 321377 315578 310480 306700 303445
64332 303445 299953 296427 293453 291153 289270 287788 287130 287770 289722 292360 294767 296380 297288 297805 297906
64317 297906 297276 295771 293610 291215 289066 287537 286550 285503 283846 281660 279397 277212 274929 272499 269906
64302 269906 266618 261797 255408 248678 243050 238867 235383 231926 228721 226617 226213 227307 229146 231180
64288 231180 233491 236437 240029 243870 247640 251347 255140 259197 263835 269434 276033 283247 290666 298151
64274 298151 305666 313099 320422 327839 335583 343567 351227 357614 361758 363309 362886 361531 359742 357380
64260 357380 354527 352001 350756 351053 352412 354067 355190 354957 352823 348808 343353 336947 329861 322024 313094
64245 313094 302950 292262 282307 274087 267918 263824 261771 261163 260717 259477 257713 256319 255561 254970 254295
64230 254295 253898 254136 254814 255458 255788 255852 255874 256054 256391 256748 257175 257917 258914 259598 259495 258752 257668 256043 253551
64211 253551 250559 247915 245996 244564 243468 242809 242356 241614 240685 240442 241461 243309 245234 247082 249147
64196 249147 251551 254233 257300 260957 265278 270364 276559 284241 293548 304504 317086 330906 345061
64183 345061 358710 371682 384200 396040 406180 413241 416149 414491 408490 398760 386178 372016
64171 372016 357865 344923 333279 322284 311701 302004 293504 285810 278516 271860 266224 261437 257142
64158 257142 253506 250907 249118 247451 245697 244350 243860 244167 245073 246636 249006 252183 256041 260397 265009
64143 265009 269731 274624 279658 284342 288031 290667 292875 295101 296875 297138 295307 291868 287976 284487
64129 284487 281489 278768 276502 275140 274657 274500 274550 275601 278427 282673 287271 291826 296988 303452 311081
64114 311081 319162 327163 335162 343828 354028 366109 379367 392391 403980 413651 421422 427408 431683
64101 431683 434335 435752 436938 439204 443211 448541 454601 461515 469506 477767 484929 490581 495299 498968
64087 498968 500154 497783 492603 486214 479246 471294 462196 452382 442119 431306 420160 409364 399340
64074 399340 389922 380996 372956 366149 360189 354281 348107 342154 337266 334103 332868 333142 333890 334031 333314
64059 333314 332531 332580 333422 334329 335034 336136 338187 340942 343906 347185 351221 355969 360995 366353 372721 380583
64043 380583 389820 400227 411850 424603 438056 451851 465919 480109 494053 507545 520411 531661
64031 531661 539504 542925 542915 541491 539693 537116 533226 528415 523632 519496 515930 512465 508757 504941 501379
64016 501379 497932 493737 487983 480685 472360 463234 453288 442950 433121 424451 417010 410709 405542 401276
64002 401276 397413 393687 390322 387594 385462 383785 382620 382109 382365 383682 386508 390870 396037 401127 405995
63987 405995 411198 417151 423638 430214 436731 443299 450017 457089 465055 474532 485579 497573 509897
63974 509897 522566 535977 550240 565158 580737 597319 615094 633923 653901 675765 700424
63963 700424 728203 758731 791388 825618 861048 897712 936221 977518 1022516 1072134 1127599
63952 1127599 1190505 1262636 1345917 1442410 1554067 1682457 1828813 1994161 2179114 2383546
63942 2383546 2606626 2847014 3102713 3370831 3647872 3930304 4214543 4496171 4769324
63933 4769324 5026908 5261475 5466251 5635923 5766881 5856788 5903990 5907398 5866790 5782962
63923 5782962 5657594 5493267 5293775 5064358 4811458 4542068 4262890 3979740 3697536
63914 3697536 3420730 3153455 2899136 2660246 2438617 2235701 2052219 1887847 1741671
63905 1741671 1612799 1500090 1401605 1315048 1238921 1172769 1116155 1067762 1025728 988549 955501
63894 955501 926363 900842 878083 856749 835753 814857 794281 774010 753971 734674 716968
63883 716968 701072 686497 673078 661365 651754 643972 637889 634160 633381 635114 638497 643533 650966
63870 650966 661015 673001 686291 700914 716987 734136 751797 769725 787812 805674 822781
63859 822781 838848 853742 867039 878098 886747 893609 899346 903600 905018 902600 896771 888806 879330
63846 879330 867776 853336 836031 816693 796215 775061 753271 730708 707373 683630 659947
63835 659947 636350 612444 588157 564150 541226 519604 499084 479736 461922 445670 430448
63824 430448 415695 401406 388136 376529 366792 358505 350975 343879 337414 331750 326563 321383 316167
63811 316167 311204 306642 302530 299266 297480 297300 298026 298698 298816 298447 297841 297067 295939 294284 292287 290411
63795 290411 288758 286708 283567 279486 275289 271443 267753 264187 261360 259786 259049 258245 257029 255698 254369
63780 254369 252654 250315 247880 246314 246132 246932 247744 247837 247269 246650 246341 246042 245283 244136 243171 242775 242828 242980
63762 242980 242926 242407 241370 240274 239850 240284 240881 240814 239988 238922 238098 237779 238181 239224 240276 240690 240673 241019
63744 241019 241893 242562 242651 243031 244869 248154 251802 255042 258065 261297 264674 267884 270950 274190 277666
63729 277666 280897 283255 284734 286263 288987 293140 297888 302420 306823 311562 316597 321539 326370 331268
63715 331268 335853 339376 341651 343098 343779 343185 341211 338526 335596 332090 327819 323593 320488 318697 317767
63700 317767 317547 318121 319154 320119 321121 322739 325073 327629 330152 332884 335898 338847 341607 344538 347764
63685 347764 350702 352661 353587 353898 353866 353475 352636 351314 349645 348115 347320 347334 347612 347832 348513 350372 353239
63668 353239 356112 358278 359929 361539 362975 363494 362549 360426 358038 356087 354420 352245 348977 344713 339853
63653 339853 334570 328993 323731 319650 316967 314964 312860 310656 308802 307366 306087 305164 305292 306648 308338
63638 308338 309354 309815 310804 313077 316376 319988 323585 327386 331817 337163 343325 349814 356147 362346 368844
63623 368844 375890 383375 391300 400075 410060 421109 432886 445502 459579 475687 493858 513605
63611 513605 534326 555810 578483 603040 629854 658846 689758 722075 754575 785445 813169
63600 813169 836973 856235 870047 877880 880348 878731 873991 866733 857837 848380 838880 829115 818585
63587 818585 806647 792396 775220 755554 734385 711882 687367 660991 634632 610440 588972
63576 588972 569447 551489 535820 523239 513632 506305 500883 497541 496494 497521 500089 503759 508304
63563 508304 513430 518684 523922 529663 536546 544449 552566 560493 568808 578376 589529 602306 617159
63550 617159 634889 655922 680112 707294 737745 771993 810311 852280 896395 939787 978557
63539 978557 1008871 1028329 1036730 1035773 1028007 1015964 1001975 988252 976433 966825 958395 949767 940096
63526 940096 928881 915254 897921 875835 848810 817544 783282 747438 711283 675829 641960
63515 641960 610517 582091 556732 533959 513185 494138 476975 461979 449103 437796 427448
63504 427448 418010 409979 403666 398631 394030 389345 384694 380558 377444 375677 375201 375504 375863 375771 375121 374086
63488 374086 372983 372221 372182 373010 374538 376439 378458 380524 382711 385160 388077 391744 396319 401460 406256
63473 406256 409778 411776 412709 413135 413178 412508 410625 407220 402552 397534 393170 389830 387236 385094 383379
63458 383379 382044 380969 380331 380553 381616 382907 384007 385222 386968 389211 391944 395667 400667 406254 411622
63443 411622 417249 424449 433554 443555 453833 465253 478958 494863 512096 530540 551207 575223
63431 575223 602821 633008 663617 691855 715451 733521 746380 754968 760889 766422 773578 783042
63419 783042 794696 809159 828040 852418 881746 914619 949916 986559 1022623 1055532 1083179
63408 1083179 1104389 1118483 1125152 1124977 1119537 1110617 1099485 1087041 1074145 1061325 1048200 1033630
63396 1033630 1016570 996643 973840 947935 918493 885593 850398 814771 780185 747043 715123
63385 715123 684465 655600 629093 605229 584200 566230 551392 539543 530584 524530 521188 520032
63373 520032 520592 522787 526696 532272 539481 548453 559180 571329 584705 599668 616646 635366 655051
63360 655051 675372 696772 719934 745405 773812 805826 841518 879955 919547 958603 995426
63349 995426 1028323 1055822 1076856 1090725 1097249 1097121 1091806 1082877 1071585 1059040 1046285 1033742
63337 1033742 1020785 1006168 988904 968646 945531 919888 891983 861905 829940 797168 765337
63326 765337 735801 708755 683774 660832 640525 623565 610492 601658 596942 595345 595078 594009 589927
63313 589927 580893 566195 547177 526656 507122 489507 473530 458734 445020 432580 421726 412769
63301 412769 405785 400501 396457 393257 390660 388485 386520 384494 382159 379423 376354 373021 369425 365620
63287 365620 361800 358118 354541 351016 347688 344799 342417 340445 338768 337268 335806 334444 333574 333562 334288
63272 334288 335238 336085 336959 338143 339736 341611 343535 345270 346707 347958 349235 350737 352700 355431 359074
63257 359074 363448 368308 373600 379155 384314 388352 391340 394198 397780 402236 407394 413362 420408 428514
63243 428514 437374 446842 457123 468465 480802 493829 507532 522568 539875 559705 581269 603615
63231 603615 626691 651093 676843 702985 728557 753464 778034 802156 825368 847589 869223
63220 869223 890516 911292 931498 951652 972513 994348 1016711 1038807 1059861 1079079 1095450
63209 1095450 1107872 1115518 1118003 1115127 1106681 1092662 1073615 1050521 1024306 995597 965008 933560
63197 933560 902732 874035 848426 825994 806318 789256 775261 764802 757640 753021 750562 750648 753943
63184 753943 760815 771243 784843 800752 817858 835507 853858 873305 893623 913979 933660 952488
63172 952488 970502 987607 1003749 1019270 1034654 1049775 1063568 1074715 1082628 1087461 1089101 1086561
63160 1086561 1078658 1065110 1046562 1023783 997265 967605 935727 902535 868682 834835 801848
63149 801848 770493 741242 714503 690735 670089 652125 636137 621659 608516 596659 586187
63138 586187 577327 570089 564050 558702 553958 550149 547595 546367 546348 547342 549161 551722 554970 558680 562518
63123 562518 566442 570811 575908 581527 587231 592767 597980 602604 606565 610298 614296 618430 622160 625379
63109 625379 628492 631567 634034 635532 636549 637711 638796 639055 638429 637803 637850 638107 637578 636003 634141 632867
63093 632867 632400 632498 633056 634142 635564 636735 637145 636821 636233 635818 635757 636211 637546 640117 643806 647948 651819
63076 651819 655218 658522 662343 667298 673961 682615 692906 703986 715222 726587 738290 750337 762790
63063 762790 776216 791434 808893 828669 850965 876114 904058 934310 966647 1001481 1039358
63052 1039358 1080450 1124771 1172496 1223747 1278226 1335383 1394755 1455767 1517354 1578184 1637421
63041 1637421 1695113 1751780 1807742 1862904 1917097 1970493 2023548 2076524 2129121 2180669 2230404
63030 2230404 2277314 2319836 2356124 2384633 2404152 2413305 2410585 2395094 2366989 2327135 2276785 2217693
63018 2217693 2151953 2081338 2007199 1931369 1856600 1785528 1719478 1658792 1603978 1555888 1515074
63007 1515074 1481753 1456381 1439467 1430687 1428797 1432699 1442136 1457120 1477192 1501489 1529155 1559300
62995 1559300 1590877 1622966 1655139 1687393 1719826 1752419 1784852 1816437 1846531 1875155 1902816
62984 1902816 1929376 1953338 1972561 1985496 1991464 1990008 1980547 1962664 1936249 1901204 1857462 1805707
62972 1805707 1747879 1686535 1623640 1560158 1496813 1434851 1375726 1320184 1267985 1218601 1171966
62961 1171966 1128473 1088448 1051825 1018253 987302 958527 931454 905632 880782 856917 834222
62950 834222 812727 792161 772283 753221 735270 718390 702247 686769 672308 659094 646852
62939 646852 635182 624087 613872 604752 596815 590178 584882 580665 577079 573789 570712 568027 566114
62926 566114 565187 564803 564011 562251 559861 557481 555322 553336 551656 550327 548844 546576 543603 540584 537818
62911 537818 534929 531544 527805 524116 520723 517644 514720 511650 508245 504711 501508 499002 497346 496446
62897 496446 495815 494787 493264 491909 491139 490418 489192 488096 488241 489514 490650 491005 491144 491514 491709 491532
62881 491532 491654 492527 493488 493760 493613 493718 493927 493589 492686 491828 491375 491220 491185 490941 489884 487855 485774 484776
62863 484776 484809 484794 484058 482910 481901 481301 481379 482387 484041 485612 486778 487927 489425 491072 492486 493574
62847 493574 494427 495039 495381 495511 495479 495299 494976 494375 493195 491389 489476 487988 486741 485241 483684 482935 483423
62830 483423 484723 486310 487983 489353 489767 489260 488889 489536 490891 492274 493925 496689 500674 505060 509227
62815 509227 513347 517774 522505 527408 532510 537798 543119 548452 553931 559432 564473 568802 572845 577388
62801 577388 582994 589844 597868 606791 616251 626135 636709 648300 661046 675168 691196 709563 730123
62788 730123 752501 776924 804327 835605 871148 911176 956057 1006065 1061226 1121759 1188298
62777 1188298 1261213 1339894 1423235 1510650 1601941 1696027 1790425 1882325 1969715 2051038 2124125
62766 2124125 2186164 2234841 2269124 2288774 2293395 2282189 2254630 2211317 2154167 2085864 2009095
62755 2009095 1926162 1838972 1749136 1658108 1567459 1478935 1393962 1313106 1236367 1164036 1096884
62744 1096884 1035465 979751 929589 884971 845454 809915 777478 748331 723009 701124 681459
62733 681459 663167 646209 630767 617023 605474 596577 589848 584029 578522 573990 571243 570170 570208
62720 570208 571120 572701 574352 575835 578173 582880 590362 599761 610347 622341 636248 652151 670015
62707 670015 690174 713085 738858 767332 798446 832409 869774 911475 958352 1010341 1066398
62696 1066398 1125602 1188110 1254610 1325033 1398241 1472904 1548064 1622565 1694339 1760652 1819043
62685 1819043 1867863 1906050 1932612 1946299 1945717 1929995 1899579 1856305 1802455 1739789 1669748 1594417
62673 1594417 1516712 1439287 1363439 1289335 1217136 1147689 1082257 1021907 967037 917178 871193
62662 871193 828002 787404 750193 717371 689200 664928 643320 623467 605182 588694 574031
62651 574031 560849 548802 537802 527762 518333 509249 500747 493247 486658 480370 474054 468151 463434
62638 463434 460296 458582 457888 457941 458808 460758 463673 466627 468363 468310 466884 464746 462222 459549 457153 455293
62622 455293 453792 452512 451767 451792 452141 452245 452454 453847 456965 461301 466224 471791 478353 485794 493599 501412
62606 501412 509205 517123 525557 535194 546523 559304 572964 587633 604440 624552 648172 674784
62594 674784 704179 736793 773001 812431 854254 897879 942990 988928 1034368 1077668 1117316
62583 1117316 1151981 1180410 1201493 1214353 1218382 1213442 1200203 1179980 1153959 1122708 1086682 1046987
62571 1046987 1005356 963414 922221 882360 844102 807539 772914 740780 711481 684540 659052
62560 659052 634835 612728 593655 577778 564677 553788 544311 535323 526616 519122 513822 510337 507195
62547 507195 503424 499286 495423 492037 489154 487048 485899 485430 485402 486217 488446 491820 495165 497442 498567
62532 498567 499179 499931 501157 502957 505380 508539 512639 517881 524446 532678 543093 555897 570561 586297
62518 586297 603062 621804 643541 668542 696584 727622 761784 798955 838850 881434 926766
62507 926766 974329 1022837 1070737 1116602 1159095 1197087 1230013 1257728 1279760 1295126 1303272 1304864
62495 1304864 1301218 1293219 1281423 1267202 1253119 1241880 1235165 1233595 1237366 1246553 1261075 1280888
62483 1280888 1306292 1337811 1375650 1419402 1468268 1521303 1577156 1633526 1686983 1733618 1770194
62472 1770194 1795039 1808126 1810369 1802576 1784642 1755452 1713669 1659021 1593153 1519329 1441257 1361904
62460 1361904 1283033 1205494 1129938 1057444 989597 927941 873325 825720 784529 748945 718192
62449 718192 691780 669700 652206 639263 630147 623665 618758 615034 612829 612712 614737 618221 622384
62436 622384 627162 633053 640086 647187 652777 655836 656229 654246 650142 644104 636376 627252 617016 605966
62422 605966 594504 583166 572486 562735 553767 545240 536992 529116 521678 514618 507996 502064 496939
62409 496939 492377 488068 483968 480149 476520 473028 469980 467805 466520 465772 465365 465414 465915 466571 467251 468336
62393 468336 470346 473304 476606 479452 481398 482657 483948 485839 488116 490019 491241 492465 494722 498432
62379 498432 503345 509175 515946 523794 532812 543094 554552 566616 578450 589686 600690 612026
62367 612026 623935 636548 650308 665819 683463 703534 726641 753499 784274 818572 856262
62356 856262 897917 944132 994684 1048595 1104746 1161944 1218571 1272665 1322433 1366319 1402632
62345 1402632 1429711 1446782 1454412 1453896 1446475 1433167 1414772 1391435 1362549 1327775 1288273 1246509
62333 1246509 1204770 1164141 1124845 1087063 1051230 1017914 987664 960786 937069 915834 896292
62322 896292 877690 859156 839824 819376 798254 777193 756653 736805 717687 699147 680870
62311 680870 662827 645545 629681 615389 602373 590502 580128 571837 566025 562630 561065 560500 560476
62298 560476 561214 563149 566236 569988 574214 579314 585691 593102 600906 608900 617651 627769 638963 650040
62284 650040 659919 668399 675785 682044 686809 690091 692420 694163 695233 695684 696012 696479 696634 696107 695546 696164
62268 696164 698533 702446 707786 714819 723613 733928 745913 760462 778702 801531 829652 863479
62256 863479 902766 946852 995471 1048852 1106727 1167663 1229594 1290503 1348290 1400575 1445266
62245 1445266 1481129 1507538 1524107 1531006 1529181 1519556 1502168 1476566 1442849 1401816 1354397 1301680
62233 1301680 1245455 1187984 1131056 1075670 1022676 973110 927670 886367 848965 815419 785698
62222 785698 759516 736556 716737 700003 686043 674365 664415 655495 646811 637937 629129 621102 614587
62209 614587 610059 607503 606175 604938 603204 601502 600885 601891 604291 607644 611671 616129 620747 625505
62195 625505 630739 636748 643389 650233 657066 664079 671588 679745 688554 698033 708217 719051 730416
62182 730416 742256 754563 767156 779568 791220 801635 810503 817745 823727 829308 835452 842744 851457
62169 851457 862033 875274 891971 912542 937196 966287 1000167 1038527 1080038 1122900 1165739
62158 1165739 1207732 1247672 1283210 1311589 1331303 1342809 1347502 1346351 1339776 1328329 1312769 1293389
62146 1293389 1269825 1241815 1209973 1175659 1140317 1105016 1070469 1037238 1005930 977181 951427
62135 951427 928748 909091 892516 879034 868267 859562 852400 846388 840894 835174 829033 823014 817631
62122 817631 812755 808068 803889 801119 800409 801680 804498 808640 814151 821012 828807 836678 843469 847984
62108 847984 849336 847389 843034 837835 833087 829176 825914 823236 821091 818774 815053 809358 802521 795971
62094 795971 790446 785771 781716 778571 776907 777083 779050 782434 786733 791499 796439 801457 806853 813463
62080 813463 822205 833236 845781 858914 872335 886190 900581 915647 931825 949502 968454 987981
62068 987981 1007535 1026915 1046052 1065093 1084672 1105595 1128201 1152305 1177616 1203691 1229469
62057 1229469 1253400 1274154 1290815 1302444 1308211 1308240 1303690 1295561 1283849 1268142 1248438 1224799
62045 1224799 1196791 1164070 1127344 1088004 1046914 1004314 960950 918463 878289 840739 805554
62034 805554 772909 743327 716838 692790 670556 650118 631880 616088 602594 591113 581593 574153
62022 574153 568523 563728 558711 553290 548102 543437 538569 532613 525722 518926 512996 508038 504074 501212
62008 501212 499015 496438 493035 489857 488531 489552 492029 494997 498380 502546 507501 512901 518507 524199
61994 524199 529660 534384 537978 540282 541257 540924 539378 536647 532557 526935 519997 512372 504616 496743 488338
61979 488338 479152 469571 460450 452457 445640 439690 434467 430079 426481 423369 420593 418396 416975 415966
61965 415966 414684 412800 410523 408161 405837 403673 401966 400985 400792 401402 402912 405212 407719 409701 411037
61950 411037 412474 415015 419124 424587 430998 438131 445826 453906 462518 472459 484713 499457 515689
61937 515689 532030 547839 563374 578999 594461 609029 622203 634144 645385 656143 666004 674367
61925 674367 681120 686658 691199 694277 695030 692801 687432 679331 669589 659808 651355 644709 639700 636338
61911 636338 635070 636280 639945 645913 654176 664611 676602 689177 701447 712806 722840 731212 737602
61898 737602 741638 742944 741349 737094 730783 723168 714925 706483 697928 689160 680233 671559 663663 656692
61884 656692 650242 643740 636987 630223 623598 616715 608881 599802 589795 579360 568809 558429 548672
61871 548672 539930 532337 526019 521277 518171 516182 514753 514063 514802 517215 520855 525294 530561 536810 544066
61856 544066 552588 562980 575622 590328 606799 625045 645077 666599 689345 713352 738446 763793
61844 763793 788462 812148 834748 855414 872675 885537 893918 898071 898214 894891 888979 881020 871077
61831 871077 859713 848647 839778 833723 829885 827885 828311 831890 838461 847191 857462 868994 881073
61818 881073 892096 900117 903664 901988 894973 883245 868175 851153 832673 812438 790480 767785
61806 767785 745656 724854 705656 688306 672879 658944 645933 633818 622939 613214 604072 595261
61794 595261 587145 579961 573282 566561 559843 553583 548010 543029 538521 534359 530334 526378 522790 519883
61780 519883 517536 515451 513715 512656 512146 511527 510361 508864 507433 506103 504738 503471 502633 502380 502677
61765 502677 503533 505004 507051 509671 513088 517500 522573 527498 531719 535435 539242 543379 547542 551336
61751 551336 554664 557535 559618 560231 558938 556091 552621 549155 545453 540843 535193 529243 523901 519434
61737 519434 515439 511467 507429 503464 499724 496483 494282 493688 494752 496804 498904 500585 502111 503973
61723 503973 506186 508273 509923 511462 513452 515964 518572 521015 523495 526142 528522 530030 530613 530684 530345
61708 530345 529204 527123 524666 522377 519878 516260 511314 505857 500723 495992 491520 487649 484770 482384
61694 482384 479326 475066 470229 465612 461151 456281 451004 446088 442222 439322 436750 433993 431041 428238
61680 428238 425852 423779 421723 419636 417843 416573 415530 414126 412136 409907 407956 406567 405791 405644 406146
61665 406146 407207 408560 409831 410749 411285 411578 411750 412019 412946 415201 418777 422739 426103 428846 431606 434535
61649 434535 436969 438351 438986 439626 440684 442176 444138 446677 449633 452490 454737 456223 457167 457852 458320
61634 458320 458353 457790 456722 455278 453391 451074 448789 447149 446195 445300 443861 441715 438854 435245 431202
61619 431202 427501 424767 422973 421767 420984 420514 420019 419207 418100 416620 414177 410244 405220 400128 395441
61604 395441 390677 385302 379584 374329 370037 366514 363188 359682 356138 353012 350506 348357 346298 344483
61590 344483 343138 342004 340548 338660 336774 335309 334347 333786 333350 332378 330188 326932 323787 321953 321621
61575 321621 322063 322479 322540 322311 321959 321572 321160 320807 320712 320967 321362 321674 322077 323024 324689 326781 328886 330747
61557 330747 332263 333596 335289 337792 340742 343122 344318 344662 344774 344858 344945 345318 346261 347636 349149 350742
61541 350742 352325 353381 353435 352858 352681 353577 355381 357621 360125 362883 365577 367481 367937 367008 365671 365085
61525 365085 365478 365956 365529 364003 361645 358520 354786 351307 349095 348115 347362 346260 345286 344939 344884 344592 344250
61508 344250 344349 344776 345019 345056 345344 345943 346388 346492 346684 347262 347822 347868 347624 347816 348794 350268 351801 353182 354339
61489 354339 355328 356566 358687 361840 365253 367813 369072 369496 369791 370249 370883 371885 373613 376151 379190
61474 379190 382439 385913 389554 392728 394469 394391 393178 391962 391375 391321 391504 391763 391849 391257 389584 386946 383857
61457 383857 380842 378322 376690 376110 376226 376363 376190 376019 376325 377091 377820 378130 378183 378409 378877 379116 378693 377914
61439 377914 377647 378376 379716 381057 382404 384215 386643 389399 392319 395462 398541 400775 401676 401658 401583 401953
61423 401953 402798 404058 405684 407462 409091 410454 411679 412980 414515 416270 417950 419180 419910 420340 420383
61408 420383 419615 418039 416441 415521 415005 414177 412993 412047 411542 411021 410143 409076 408021 406943 406015 405715 406167
61391 406167 406864 407370 407871 408665 409517 409995 410175 410580 411573 413165 415258 417673 420053 422090 423849 425631
61375 425631 427604 429800 432323 435291 438631 442182 445874 449612 453117 456165 458819 461166 463018 464298
61361 464298 465503 467302 469666 471918 473646 475158 476973 479379 482617 486950 492226 497777 503102 508352
61347 508352 513806 519143 523630 526846 528868 529932 530322 530520 531100 532443 534708 537905 541611 544769 546272
61332 546272 545910 544482 542890 541389 539743 537723 535292 532554 529789 527405 525678 524605 524064 523974 524248
61317 524248 524881 526252 529112 533972 540573 548149 556123 564370 572971 582076 592093 603715 617514 633431
61303 633431 650621 667788 683691 697501 708774 717186 722474 724643 724054 721166 716303 709782 702075
61290 702075 693607 684477 674642 664347 654122 644342 634993 625923 617099 608630 600798 594145 589215 586005
61276 586005 583848 582075 580691 580201 580829 582155 583596 585094 587151 590176 593869 597437 600457 603412 607186
61261 607186 612094 617669 623393 629339 635883 642977 649987 656252 661554 665976 669483 671856 673012 673203
61247 673203 672721 671534 669441 666594 663525 660513 657247 653443 649513 646181 643564 641184 638866 637026
61233 637026 635910 635210 634746 634940 636118 637810 639442 641476 645133 650962 658280 666047 673771 681407 689010
61218 689010 696782 705019 713570 721705 728935 735756 743098 751120 759044 766185 772626 778635 783802 787300
61204 787300 788986 789877 791446 794619 799503 805807 813299 821978 832022 843573 856479 870340 884826
61191 884826 899707 914403 927815 938960 947624 954006 958005 959416 958695 956802 954130 950259 945015
61178 945015 939087 933118 926797 919340 910468 900408 889498 878400 868244 859676 851910 843471 833750
61165 833750 823201 812215 800615 788294 775499 762364 748906 735604 723246 711965 701244
61154 701244 691153 682809 677091 673585 671382 670332 670766 672403 674271 675629 676264 675959 674260 670868 665940
61139 665940 659943 653527 647519 642663 639245 637061 635755 635109 635166 636279 638958 643489 649744 657459 666577
61124 666577 677237 689536 703441 718812 735502 753584 773473 795525 819471 844595 870555
61113 870555 897612 925847 954582 982863 1010164 1036359 1061392 1085381 1108650 1131182 1152237
61102 1152237 1170922 1186920 1200275 1210720 1217676 1220643 1219142 1212606 1201013 1185600 1168334 1150557
61090 1150557 1132486 1113873 1094674 1075139 1055792 1037383 1020466 1004996 990720 977753 966237
61079 966237 955659 945335 935696 928283 924134 922798 923235 925065 928472 933480 940021 948463 959394 972895
61065 972895 988434 1005464 1023778 1043313 1063941 1085566 1108253 1132163 1157422 1183989 1211636
61054 1211636 1240131 1269530 1300137 1332093 1365113 1398824 1433227 1468571 1504732 1540885 1575973
61043 1575973 1609467 1641532 1672491 1702308 1730720 1757577 1782724 1805704 1826160 1844615 1862288
61032 1862288 1879843 1896813 1912675 1928055 1944269 1962028 1981308 2002282 2025633 2051835 2080716
61021 2080716 2111892 2145139 2180363 2217815 2258621 2304787 2358500 2421653 2495895 2582598 2682610
61010 2682610 2796410 2924675 3068786 3231539 3418339 3637765 3900507 4218041 4602994
61001 4602994 5070214 5636412 6319663 7141644 8130484 9318804 10737223 12408816 14341595
60992 14341595 16505406 18793119 20999768 22863338 24166687 24837945 24977022 24796140
60984 24796140 24528774 24363784 24410083 24666082 24996119 25154323 24877718 24004536 22539236
60975 22539236 20627411 18475326 16275777 14171857 12251596 10556349 9094085 7853177
60967 7853177 6812183 5944934 5224350 4626152 4130101 3718506 3375206 3086368 2840916
60958 2840916 2629611 2444756 2281132 2135915 2006938 1891734 1788555 1697035 1616999 1547218
60948 1547218 1485879 1431500 1382816 1338451 1297253 1258425 1220893 1183252 1144876 1106527 1069342
60937 1069342 1033726 999618 967179 936684 908304 882419 859522 839336 820655 802626 785584
60926 785584 770147 756269 743779 733006 724002 715837 707663 699905 693366 687691 681852 675767 670224
60913 670224 665378 660584 655726 651511 648302 645736 643713 642658 642427 641995 640782 639340 638170 636702 634238
60898 634238 631210 628601 626499 624101 620887 616979 612398 606812 600248 593478 587302 581758 576261 570316
60884 570316 563846 556962 549724 542219 534645 527110 519402 511221 502805 495112 489102 484862 481658 478763
60870 478763 476025 473607 471547 469755 468250 467195 466802 467283 468871 471762 475998 481311 487042 492468 497445
60855 497445 502609 508559 514851 520146 523520 525391 527074 529658 533369 537686 541801 545110 547517 549259
60841 549259 550414 550721 549907 547925 544727 540112 534077 527195 520341 514098 508544 503477 498557 493359 487629
60826 487629 481618 475934 471012 466907 463551 460864 458424 455404 451236 446296 441570 437605 434029 430104
60812 430104 425464 420259 414937 410131 406375 403590 401015 398086 395193 393107 391782 390330 388217 385837
60798 385837 383674 381603 379471 377793 377114 377047 376723 376103 376060 377089 378663 380200 382027 384876 388709 392534
60782 392534 395363 397038 398197 399628 401660 404001 406106 407747 409133 410506 411742 412487 412645 412651 413188 414577
60766 414577 416343 417526 417604 417056 416829 417285 417882 417873 417056 415756 414351 412959 411411 409353 406507 403043 399652
60749 399652 397119 395807 395538 395868 396398 396950 397509 398011 398195 397755 396593 394793 392334 389040 384939 380525
60733 380525 376507 373298 370807 368705 366802 365167 363925 363000 362160 361306 360639 360515 361197 362732 364831 366818
60717 366818 367989 368284 368455 369322 370966 372856 374600 376187 377654 378982 380377 382260 384822 387803 390786
60702 390786 393461 395561 396835 397263 397138 396899 396958 397575 398587 399307 399066 397923 396532 395290 394028 392607
60686 392607 391333 390507 389907 389101 388076 387282 387183 387991 389687 391998 394411 396430 397892 399012 400179 401663
60670 401663 403397 404984 406064 406621 406795 406488 405381 403300 400359 396882 393475 390954 389693 389078 388117
60655 388117 386608 385174 384183 383421 382955 383508 385469 388264 391239 394594 398709 403012 406301 408043 408658
60640 408658 408568 407602 405435 402230 398715 395786 393894 392610 390964 388477 385610 382994 380633 378330 376541
60625 376541 376108 377188 378929 380247 380597 380095 379308 378906 379200 380006 381104 382553 384257 385645 386325 386788
60609 386788 387814 389274 390177 389929 389015 388355 388433 389108 389851 390109 389773 389345 389359 389819 390570 391938 394403 397732
60591 397732 401115 404120 406881 409386 411295 412631 413917 415342 416355 416424 415767 415075 414913 415603 417207 419346
60575 419346 421417 423289 425485 428528 432462 437143 442622 449010 456368 464887 474781 485820 497363 508980
60561 508980 520642 532106 542601 551280 557542 560793 560590 557362 552415 546791 540659 534121 527946 522876
60547 522876 518860 515745 514281 515461 519012 523419 527655 532299 538781 547928 559402 572255 585927
60534 585927 600850 617972 637462 657999 677683 695439 711198 724821 735396 741674 742886 739145
60522 739145 731481 721609 711227 701132 691066 680511 669605 659216 650277 643190 637857 634098 631787
60509 631787 630570 629781 629045 628906 630489 634468 640661 648710 658770 671442 687454 707557 732332 761775
60495 761775 795368 832751 873915 918437 964933 1011658 1057284 1100697 1140473 1175282 1204649
60484 1204649 1228690 1247030 1258411 1261423 1255270 1239831 1215361 1182321 1141430 1093986 1042154 988655
60472 988655 935761 884702 836148 790847 749424 711934 678181 648304 622541 600559 581539
60461 581539 564914 550545 538182 527217 517001 507114 497411 488223 480391 474558 470327 466485 462124
60448 462124 457263 452449 448196 444772 442158 440151 438711 438088 438275 438566 438174 437123 436053 435289 434645 433969
60432 433969 433162 431755 429295 426272 423910 422874 422871 423588 425073 426855 427697 426998 425783 425563 426607 428008
60416 428008 429113 430126 431490 433283 435212 436748 437355 437011 436452 436544 437475 438849 440423 442380 444928 447948
60400 447948 451005 453504 454990 455613 456192 457536 459750 462373 465042 467745 470591 473664 477077 480853 484742
60385 484742 488361 491497 494145 496358 498239 499982 501758 503642 505715 508082 510711 513464 516383 519533
60371 519533 522464 524331 525011 525640 527410 530095 532408 533712 534664 536162 538344 540839 543404 545983 548566
60356 548566 551307 554469 558014 561591 565249 569889 576578 585519 595907 606645 616880 625970 633362
60343 633362 638687 641811 642706 641364 637878 632511 625590 617417 608376 599147 590662 583626 577973 572935
60329 572935 567845 562838 558565 555243 552266 548885 545026 541201 537723 534387 531010 528010 526177 525944
60315 525944 527142 529552 533445 539305 547151 556460 566867 578655 592307 607698 623954 640090 655606
60302 655606 670483 684779 698262 710304 720058 726846 730340 730300 726269 717823 705225 689577 672170
60289 672170 653937 635715 618768 604484 593486 585340 579252 574738 571425 568651 565702 562408 559134
60276 559134 556139 553254 550131 546480 542007 536551 530536 524884 520137 515918 511608 507347 503895 501633
60262 501633 500144 498785 497230 495385 493230 490968 489036 487726 486929 486316 485624 484783 484056 484022 485030 486683
60246 486683 488292 489854 491935 494401 496032 495959 494928 494395 494774 495345 495669 496146 497165 498557 500204 502432
60230 502432 505368 508390 510741 512425 514136 516551 519947 524181 528600 532257 534716 536644 539251 543106
60216 543106 547829 552882 558327 564670 572236 580868 590127 599625 609152 618563 627613 636105 644218 652512
60202 652512 661360 670474 679200 687212 694691 701868 708654 714780 720009 724136 726982 728552 729042 728592 727121
60187 727121 724475 720598 715501 709306 702409 695383 688520 681627 674421 666928 659330 651666 644035 636894
60173 636894 630804 625907 621961 618774 616216 613920 611461 608888 606643 604884 603320 601828 600658 599792
60159 599792 598689 597081 595560 594786 594493 593882 592855 592205 592621 594055 596075 598347 600572 602411 603711
60144 603711 604644 605558 606876 609059 612319 616393 620916 625963 631931 638955 646871 655660 665314 675210 684240
60129 684240 691827 698274 703873 708277 711241 713414 715794 718672 721721 724862 728355 732121 735639 738745
60115 738745 741982 745906 750353 754629 758207 760967 762943 764103 764417 763922 762665 760612 757690 753909 749363
60100 749363 744065 737888 730850 723454 716522 710556 705385 700551 695939 691856 688570 685966 683760 681938
60086 681938 680801 680528 680778 680928 680674 680259 679999 679857 679609 679210 678704 677946 676707 674915 672473 669001 664124
60069 664124 657938 650822 642922 634310 625474 617072 609201 601570 594416 588481 583880 579749 575382 571041
60055 571041 567229 563820 560495 557541 555617 555085 556039 558503 562054 565754 569129 572891 578030 584493 591425
60040 591425 598381 605515 612832 620059 627142 634081 640291 644925 647905 649926 651367 651885 651168 649373 646625
60025 646625 642774 637914 632512 626668 619696 610815 599925 587559 574468 561507 549577 539338 530990
60012 530990 524272 518467 512661 506542 500871 496566 493394 490257 486804 483944 482495 482152 482190 482470 483173
59997 483173 484158 485236 486714 488976 491704 494060 495565 496458 497400 499170 502402 507179 512904 518787 524297
59982 524297 529019 532503 534660 536030 537159 537850 537418 535539 532448 528437 523651 518465 513653 509922 507335
59967 507335 505247 502907 500244 498056 497276 498111 500136 503035 506721 510761 514390 517342 520085 522871 525188
59952 525188 526548 527164 527285 526548 524784 522933 522213 522646 523351 524060 525231 526698 527411 526866 525807 524987 524034
59935 524034 522186 519538 516953 515180 514653 515691 518193 521346 524340 527305 531058 535995 541721 547658
59921 547658 553407 558392 561758 562939 562168 560245 558028 556248 555527 556230 558268 561108 563979 566194 567510
59906 567510 568226 568788 569318 569770 570458 571973 574413 577073 579185 580627 581659 582378 582953 584021 586130 588871
59890 588871 591320 593446 596359 600925 606865 613617 621271 629957 638900 647018 654238 661403 668978 676762
59876 676762 684844 693807 703479 712277 718440 721602 722658 722472 721271 719157 716493 713533 710007 705373
59862 705373 699563 693299 687570 682733 678315 673764 669128 664781 660755 656814 653047 649857 647382 645504
59848 645504 644525 645247 648137 652878 658957 666183 674325 682673 690315 696525 700658 702272 701816 700851 701023
59833 701023 702989 706559 711341 716676 721307 723927 724088 722225 718991 714998 710880 706886 702452 696756
59819 696756 689731 682026 674041 665687 657164 649311 642759 637177 631668 625722 619565 613826 609071 605461
59805 605461 602643 600050 597369 594610 591747 588593 585110 581562 578178 574842 571312 567707 564590 562467
59791 562467 561189 559960 558082 555722 553734 552637 552013 551089 549676 548304 547566 547643 548355 549410 550592 551875
59775 551875 553321 554782 555973 556988 558458 560927 564318 568325 572967 578309 583902 589092 593803 598445
59761 598445 603096 607385 611283 615455 620580 626609 632901 638847 644306 649657 655493 662081 669217 676709
59747 676709 684713 693183 701292 708052 713429 718238 722933 727181 730632 733407 735599 737001 737658 738102 738645
59732 738645 738922 738511 737584 736566 735619 734809 734388 734433 734571 734551 734797 735826 737280 738051 737381 735537 733447 731938
59714 731938 731210 730740 729729 727878 725647 723649 722019 720607 719563 719333 720128 721660 723375 724792 725718
59699 725718 726295 726798 727345 728032 729319 731908 735994 740975 746077 750882 755004 757761 758683 758022 756259 753461
59683 753461 749718 745901 743084 741181 738885 735208 730443 725395 720286 714822 708922 702770 696342 689390
59669 689390 681976 674725 668426 663483 659839 657316 655911 655662 656273 657063 657428 657299 657095 657406 658822 661758
59653 661758 666048 670767 674943 678503 682239 686751 691708 696183 699324 700523 699368 695906 690833 685082
59639 685082 679158 673026 666519 659648 652543 645397 638590 632732 628395 625690 624043 622437 620064 616802
59625 616802 612989 608734 603691 597681 591242 585298 580325 576083 572054 567852 563335 558656 554291 550700
59611 550700 547861 545476 543637 542931 543686 545523 547883 550628 553797 557102 560113 562658 564634 565677 565594
59596 565594 564909 564362 564052 563733 563747 564721 566274 567102 566733 566211 566441 566757 566009 564327 562790 561796 560861 559714
59578 559714 558497 556941 554452 551210 548225 546069 544301 542415 540533 538838 537094 535202 533617 532722
59564 532722 532295 532001 531917 532184 532613 533057 533671 534330 534294 533050 531145 529602 528798 528434 528397 529042 530752 533664
59546 533664 537654 542182 546337 549631 552750 557088 563510 571833 581441 592155 604634 620070 638981
59533 638981 659658 678028 689875 693620 690860 684503 676841 669224 662626 657905 655607 655684 657395 659634
59519 659634 661620 663262 664691 665651 665663 664545 662260 658406 652554 645103 637167 629437 621707 613763 606125
59504 606125 599425 593475 587489 581073 574550 568387 562719 557496 552828 549035 546415 544982 544419 544402 544972
59489 544972 546430 548813 551666 554501 557266 560155 563112 565906 568756 572439 577480 583325 588693 592853
59475 592853 596332 600169 604681 609252 613200 616428 619168 621541 623579 625389 626914 627812 627940 627852 628408
59460 628408 629926 631996 634177 636563 639639 643785 648978 654816 660822 666857 673188 680032 687172 694230
59446 694230 701086 707657 713357 717186 718386 716713 712189 705135 696528 687803 679938 672987 666655 660975
59432 660975 656148 652027 648202 644584 641643 640081 640383 642622 646542 651875 658637 667072 677300 689183
59418 689183 702603 717698 734718 753706 774371 796247 819045 842991 868589 895445 921047
59407 921047 941082 951603 951307 942063 927642 911952 897854 886871 879756 877331 880466 888811 899527
59394 899527 907820 909268 902104 887662 869018 849186 830071 812554 797148 784382 774567 767404
59382 767404 762105 758019 755014 753161 752088 750874 748722 745718 742784 740795 739787 739093 738138 736897 735648
59367 735648 734574 733868 733945 735154 737200 739228 740758 742388 745288 749988 755922 762171 768371 774800 781943
59352 781943 790284 800296 812152 825379 839158 853152 867806 883703 900835 918577 936192 953153
59340 953153 969189 984205 998091 1010435 1020474 1027345 1030344 1029062 1023605 1014773 1003655 990834
59328 990834 976189 959618 941624 922992 904240 885740 868015 851416 835638 820086 804715
59317 804715 790123 776862 764994 754341 744744 735987 727733 719681 711694 703845 696446 689853 684052
59304 684052 678692 673809 670237 668812 669447 671578 675346 681591 690639 701902 714823 729426 745258
59291 745258 760229 771120 775332 772125 762612 748931 733206 716945 701274 687496 676843 669598
59279 669598 665016 662512 662511 665691 671770 679621 688520 698748 710950 725273 741215 757997 774872
59266 774872 791168 806215 819388 830309 838912 845122 848551 848821 846250 841877 836620 830691 823920
59253 823920 816341 808225 799924 791983 785196 780156 776843 774826 773691 773116 772945 773581 775995 780809 787448
59238 787448 794595 801410 807817 813736 818699 822438 825318 827761 829453 829498 827294 823114 817760 811837 805282
59223 805282 797516 787992 776636 763884 750422 736924 723924 711764 700664 690861 682580 675743
59211 675743 669856 664436 659550 655726 653251 651759 650619 649585 648903 648823 649272 650024 651018 652330 653933 655663
59195 655663 657429 659296 661411 664037 667619 672441 678045 683366 687765 691760 696348 701792 707485 712840
59181 712840 717759 722134 725527 727703 729147 730649 732486 734209 735120 734821 733443 731574 729933 729015 729030
59166 729030 730056 731986 734354 736512 738095 739135 739669 739487 738389 736408 733663 730131 725627 719823 712372
59151 712372 703316 693385 683495 673900 664229 654439 645154 636843 629168 621564 614104 607387 601792 597210
59137 597210 593259 589465 585452 581295 577549 574643 572448 570669 569401 568986 569583 571163 573705 577113 581235
59122 581235 586291 592935 601417 610917 620232 628998 637829 647384 657784 668819 680224 691657 702788
59109 702788 713452 723496 732583 740508 747589 754373 760913 766705 771273 774534 776649 777889 778601 778950
59095 778950 778685 777488 775493 773187 770876 768606 766513 764812 763432 762104 760801 759670 758378 755987
59081 755987 751722 745671 738528 730817 722535 713469 703753 694029 684939 676516 668357 660520 653802 648786
59067 648786 644935 641068 636561 631643 626731 622066 617951 614743 612481 610840 609454 607984 606046 603542
59053 603542 600993 598975 597254 595008 591990 588970 586910 586151 586466 587445 588664 589846 590971 591912 592089
59038 592089 591035 589298 588131 588160 588903 589811 591128 593411 596742 600847 605590 610980 617052 624108 632762
59023 632762 643401 655750 669202 683374 698172 713513 729067 744016 757048 766964 773361 776367
59011 776367 775883 771808 765098 757690 750925 744701 738626 733317 729931 728961 730171 733326 738204 744139 750285
58996 750285 756304 762280 768098 773418 778085 782025 784848 786112 785973 785090 783894 782311 780095 777068 773200
58981 773200 768940 765359 763455 763351 764604 767194 771664 778274 786612 796147 806695 818154 830218 842586
58967 842586 855147 867813 880424 892912 905277 917285 928484 938586 947534 955084 960629 963609
58955 963609 963890 961607 956781 949193 938526 924636 907887 889258 869976 851007 832954 816195
58943 816195 800809 786505 773065 760869 750627 742616 736597 732427 730251 729944 730825 732168 733578
58930 733578 734729 735220 735060 734877 735216 735850 736153 735958 735617 735374 735040 734217 732515 729647 725743 721605 718322
58913 718322 716479 715893 716116 716989 718600 720939 723781 726967 730764 735879 742969 752111 762916 775149
58899 775149 788992 804556 821391 838699 855744 871820 886277 899150 911632 925288 940757
58888 940757 957673 975788 995376 1016282 1037304 1057066 1075117 1091619 1106339 1118558 1127765 1133805
58876 1133805 1136424 1135288 1130515 1122682 1112209 1099259 1084428 1068980 1054080 1040137 1027166 1015385
58864 1015385 1005043 995875 987205 978602 970102 961791 953400 944390 934346 923316 911831 900490 889422
58851 889422 878234 866620 854878 843686 833512 824327 815769 807409 798987 790550 782282 774082 765474
58838 765474 756150 746448 737078 728475 720618 713327 706510 700198 694607 690104 686841 684489 682576 681032
58824 681032 680165 680095 680538 681210 682286 684388 688151 693658 700114 706205 711033 714722 717980 721253 724553
58809 724553 727856 731149 734026 735711 735696 734166 731677 728645 725268 721740 718301 715007 711460 706861 700582
58794 700582 692839 684613 676777 669549 662935 657275 652849 649299 646101 643530 642514 643467 645828 648845
58780 648845 652293 656288 660874 666042 671731 677591 683056 687756 691443 693429 692630 688524 681765 673642
58766 673642 665236 657223 649972 643437 637217 631115 625474 620807 617309 614876 613324 612410 611960 612145 613347
58751 613347 615553 618212 620852 623501 626310 629132 631769 634358 637266 640853 645450 651209 657786 664533
58737 664533 671154 677789 684348 690402 696031 702092 709061 716130 722043 726515 730242 733856 737535 741410
58723 741410 745679 750378 755478 761105 767233 773386 779178 784946 791278 798054 804572 810528 816217 821712
58709 821712 826403 829542 830781 830065 827369 822710 816145 807627 797014 784186 769077 751868 733447
58696 733447 715293 698305 681921 665033 647707 631366 617230 605301 595029 586220 578842 572532
58684 572532 566854 561766 557322 553127 548562 543505 538445 533889 529982 526746 524370 523070 522764 523107 523881
58669 523881 525331 528036 532485 538738 546448 555222 564999 576052 588354 600819 611420 618457 621647
58656 621647 621816 619757 615896 610861 605528 600204 594317 587318 579506 571744 564835 559423 555863 553658
58642 553658 551521 548631 545556 543433 542635 542749 543482 544801 546466 548159 549984 552176 554396 555967 556733
58627 556733 557029 556932 556243 555180 554337 553826 553274 552806 553272 555127 557743 560357 563177 567078 572483 578991
58611 578991 585853 592442 598367 603534 608151 612523 616792 620855 624408 627118 628893 629991 630693 630971 630641
58596 630641 629695 628263 626399 624213 622135 620717 620252 620922 623142 627338 633407 640827 649299 658909 669684
58581 669684 681353 693556 705919 717930 729135 739483 749181 758291 766789 774961 783281 791971 801149
58568 801149 811377 823609 838460 855903 875691 897747 922190 949293 979259 1011514 1044299
58557 1044299 1075466 1103619 1128075 1147915 1161907 1169491 1171264 1168352 1161881 1153094 1143282 1133303 1123562
58544 1123562 1114529 1106615 1099382 1091418 1081298 1068207 1051645 1031268 1007513 981826 955769 930106
58532 930106 904918 880298 856687 834859 815742 799943 787336 777348 769609 763864 759386 755137
58520 755137 750709 746536 743014 739891 736698 733227 729470 725626 722275 719934 718287 716497 714379 712557
58506 712557 711325 710206 708993 708315 708622 709329 709672 709819 710411 711419 712111 711952 711085 710188 710182 711682 714447
58489 714447 717719 721371 726165 732610 740204 748331 757263 767684 779772 793462 809094 827029 846896
58476 846896 867926 889723 911903 933104 951150 964330 972067 974432 971623 964143 953111 940107
58464 940107 926668 913850 902222 892394 885388 882005 881841 883667 887101 893205 902887 915343 928777
58451 928777 942240 955898 969686 982500 992686 998717 999400 994218 983836 969916 954196 937821
58439 937821 921498 905925 891880 880066 870955 864664 860865 858883 858056 858193 859707 863149 868504 875188
58425 875188 882886 891981 902786 914708 926681 938074 948459 956755 961540 962329 959831 954905 947984
58412 947984 939495 929921 919334 907751 896067 885594 876435 867406 858022 849500 843194 839049 836283
58399 836283 834655 834190 834418 834860 835811 837924 841422 846199 852076 858347 863791 867879 871398 875221 879074
58384 879074 882237 884761 887257 890051 893354 897618 902837 908037 912416 916555 921671 928031 934989 942193
58370 942193 949895 958262 967186 976617 986521 996785 1007638 1019774 1033580 1048748 1065067 1082840
58358 1082840 1101798 1120405 1137096 1151640 1164421 1175128 1183127 1188590 1192164 1194034 1194364 1194223 1194936
58345 1194936 1196692 1198809 1201166 1204458 1209229 1215531 1223396 1232915 1243981 1256549 1270891 1287096 1304746
58332 1304746 1323553 1343638 1364600 1385105 1404177 1422110 1439225 1454619 1467199 1477179 1485412 1491987
58320 1491987 1496748 1500552 1504683 1509461 1514559 1520139 1526478 1533104 1539621 1546949 1556418 1568087 1581139
58307 1581139 1595441 1611489 1629280 1648457 1669054 1690848 1712646 1733510 1754075 1775289 1796646
58296 1796646 1817196 1837548 1859104 1881865 1904780 1927786 1951715 1976599 2001899 2028108 2056284
58285 2056284 2086239 2116971 2148656 2182395 2218268 2255444 2294045 2335057 2378461 2423245 2469197
58274 2469197 2517009 2566747 2617876 2670574 2725370 2781844 2839473 2899359 2963163 3030564 3099749
58263 3099749 3170087 3242392 3316873 3392975 3471032 3551954 3635318 3719663 3804363 3889417 3974055
58252 3974055 4057844 4142650 4231184 4324077 4420631 4521739 4629417 4744070 4864929 4992571
58242 4992571 5128268 5271661 5422044 5581111 5751180 5931590 6120482 6319323 6531742
58233 6531742 6758553 6998102 7251053 7520373 7806849 8109288 8429209 8770759 9136017
58224 9136017 9525170 9941361 10390338 10875160 11396491 11958408 12568563 13232408 13952991
58215 13952991 14736810 15593971 16532403 17558548 18684352 19927116 21302565 22825866
58207 22825866 24520457 26418918 28556250 30972614 33724456 36885298 40538375 44783012
58199 44783012 49751953 55614069 62565423 70837956 80721559 92565247 106762850 123758788
58191 123758788 144050265 168119811 196310193 228695031 264844778 303304836 340972002
58184 340972002 373093205 394475431 401483894 393524857 373025873 344143846 311241103
58177 311241103 277900475 246529696 218304605 193353763 171178138 151153654 132869116
58170 132869116 116190545 101145667 87782827 76090320 65983368 57328028 49967293
58163 49967293 43734873 38464773 34003680 30218860 26996456 24238652 21865703 19816033
58155 19816033 18039697 16492783 15137996 13945359 12888919 11945156 11095798 10328364
58147 10328364 9631828 8994806 8409268 7872137 7380938 6930822 6517542 6140004 5797528
58138 5797528 5487130 5205337 4950103 4718914 4507060 4309554 4123063 3945029 3773100
58129 3773100 3606755 3447488 3296299 3152739 3016949 2890274 2772879 2662927 2559002
58120 2559002 2461354 2370069 2284238 2203601 2128685 2058592 1991068 1925558 1863783 1806436 1751839
58109 1751839 1698896 1648753 1602265 1558244 1515668 1475385 1438099 1402724 1368217 1335084 1303599
58098 1303599 1272372 1240222 1207806 1176050 1144708 1113906 1085328 1060273 1037992 1017408 998967
58087 998967 983361 969834 957281 945641 934708 922869 908649 892505 875654 858157 839539
58076 839539 820327 801529 783401 765932 749708 735039 721046 706729 692250 678233 664677
58065 664677 651528 639423 628857 619451 610884 603495 597061 590209 582210 574283 567768 561935 554996
58052 554996 546501 537371 528262 519303 511007 504015 498146 492703 487494 482683 477990 472883 467247 461249
58038 461249 455023 449071 444261 440676 437169 432854 428259 424110 419728 413796 406216 398081 390166 382406
58024 382406 374619 366842 359156 351819 345331 339812 334754 329845 325470 321831 318363 314805 312056 310939
58010 310939 310677 309726 307770 305873 304896 304710 304793 304718 304128 303018 302070 302104 303160 304553 305598 305925 305372 304118
57992 304118 302736 301763 301393 301786 303180 305367 307560 309109 309961 310198 309785 309028 308471 307958 306636 304357
57976 304357 302119 300505 298716 295958 292852 290464 288802 287339 286268 286018 286130 285882 285551 285848 286466 286506
57960 286506 286125 286451 287847 289439 290467 291009 291175 290535 288733 285976 282677 279160 275850 273234 271497
57945 271497 270571 270480 271252 272670 274615 277476 281658 286900 292657 298977 306343 314780 323754 332877 342049
57930 342049 350860 358435 363988 367114 367645 365670 361722 356517 350508 343898 336883 329504 321501 312769
57916 312769 303812 295348 287673 280743 274591 269212 264343 259829 256020 253421 252213 252418 254039 256539
57902 256539 258653 259371 258840 257794 256527 255080 253971 253889 254880 256567 258988 262407 266463 270327 273770
57887 273770 277387 281699 286557 291529 296324 300752 304616 307751 310034 311549 312794 314308 315828 316359
57873 316359 315461 313932 312627 311267 309122 306369 303899 302120 300752 299521 298228 296415 293850 291195
57859 291195 289388 288530 288119 288213 289486 292203 295907 300064 304316 308194 311321 313878 316282 318493 320186
57844 320186 321348 322073 322049 320979 319238 317451 315725 314087 313145 313343 313952 313944 313625 314164 315737 317476 319192
57827 319192 321682 325112 328516 331296 333960 336823 339132 340099 339820 338565 336089 332328 327990 323781 319695
57812 319695 315622 311871 308452 304502 299146 292494 285197 277530 269513 261506 254001 247080 240563 234446
57798 234446 228790 223474 218474 214163 210944 208783 207362 206489 206143 206321 207037 208230 209633 211056 212828
57783 212828 215577 219486 224170 229284 234773 240492 246162 251849 257931 264388 270687 276534 282111 287312
57769 287312 291348 293514 293898 293054 291377 289139 286735 284488 282358 280053 277240 273751 269898 266543 264373
57754 264373 263157 262253 261782 262600 265064 268561 272349 276159 279834 283134 286124 289050 291606 293080 293495
57739 293495 293787 294549 295365 295725 295750 295594 294997 294031 293472 293706 293920 293135 291508 289965 289002 288464 288070 287538
57721 287538 286569 285298 284355 284037 283906 283666 283872 285103 286979 288624 289708 290350 290460 289946 289214 288706 288211
57704 288211 287342 286452 286322 287082 288131 288981 289639 290284 291159 292555 294327 295604 295611 294678 293821 293431 292935 291678
57686 291678 289538 286704 283451 280247 277646 276013 275590 276725 279714 284570 291345 300543 312920 329082
57672 329082 349705 375875 408675 448539 495411 549247 609488 673589 736074 789096 824289
57661 824289 835467 821073 784666 732833 672435 609450 549033 495009 448843 409817 376698
57650 376698 349042 326920 309949 296926 286250 276679 267870 260307 254587 250757 248330 246649 245150
57637 245150 243583 242282 241893 242570 243714 244695 245414 245825 245497 244272 242869 242090 241716 240949 239705 238615
57621 238615 237828 236709 234834 232555 230362 228350 226554 225238 224571 224414 224559 224826 224847 224306 223533 223338 224004
57604 224004 224902 225333 225307 225221 225174 225019 224753 224400 223625 221903 219121 215830 212825 210597 209095 207844 206212
57587 206212 203787 200765 197973 196264 195677 195417 194841 194203 194062 194252 194115 193665 193613 194035 193851 192167 189439
57570 189439 186761 184618 182984 181987 181567 180886 179091 176550 174571 173952 174529 175913 177826 179696 180819
57555 180819 181154 181395 182160 183622 185859 188917 192473 196046 199555 203077 206095 207719 207806 207184 206684 206624
57539 206624 207269 208932 211297 213337 214349 214572 214569 214564 214623 214871 215148 215007 214397 213921 214093 214806 215781 217062 218729
57520 218729 220615 222606 224800 227099 229178 231140 233688 237212 241193 244856 247953 250585 252810 254880
57506 254880 257271 259933 262023 263014 263565 264638 266143 267252 267641 267563 266921 265317 263066 261297 260737 261051
57490 261051 261601 262216 262884 263301 263270 263242 263999 265880 268559 271420 273935 275876 277458 279219 281513 284166
57474 284166 286794 289327 291902 294284 295778 295943 295189 294370 293924 293676 293431 293376 293758 294517 295484 296716 298334
57457 298334 300218 302176 304340 307007 310110 313169 315842 318263 320760 323468 326251 328858 331136 333270
57443 333270 335778 339051 342969 347148 351425 355725 359699 363029 366095 369737 374131 378478 382043 384966
57429 384966 387751 390488 393126 396084 399935 404544 409107 413016 416285 419162 421749 424160 426681 429572
57415 429572 432859 436437 440257 444307 448544 452931 457547 462555 468078 474070 480329 486607 492673 498218
57401 498218 502874 506526 509620 512969 517147 522195 527880 534005 540328 546464 552160 557678 563696 570743
57387 570743 578790 587410 596313 605616 615543 625962 636408 646545 656302 665450 673442 680005 685698
57374 685698 691452 697668 704123 710565 716904 722857 728021 732506 737042 742262 748226 754762 761799 769150
57360 769150 776429 783534 790916 799052 807966 817549 827972 839297 850947 862140 872775 883414 894377
57347 894377 905332 915870 926068 936225 946385 956427 966456 976728 987181 997425 1007403 1017841
57335 1017841 1029632 1042799 1056385 1069436 1081804 1093870 1105872 1117875 1130114 1142910 1156325
57324 1156325 1170243 1184673 1199641 1214948 1230462 1246538 1263618 1281438 1299169 1316400 1333477
57313 1333477 1350831 1368537 1386729 1405866 1426229 1447538 1469319 1491297 1513294 1535268 1557764
57302 1557764 1581827 1608039 1636039 1665332 1696052 1728410 1761856 1795567 1829647 1865223 1903338
57291 1903338 1944208 1987552 2033129 2080773 2130221 2181037 2232592 2284192 2335463 2386638 2438313
57280 2438313 2491043 2545368 2601937 2661090 2722220 2783921 2844981 2905134 2964869 3024716 3084806
57269 3084806 3144910 3204744 3264230 3323473 3382566 3441533 3500588 3560313 3621322 3683709 3746870
57258 3746870 3809939 3872416 3934399 3996180 4057573 4117725 4175739 4231409 4285229 4337815 4389585
57247 4389585 4440927 4492229 4543613 4594977 4646486 4698774 4752507 4807982 4865253 4924354 4985107
57236 4985107 5046951 5109212 5171423 5233250 5294361 5354589 5414023 5472732 5530587 5587646 5644602
57225 5644602 5702630 5762758 5825446 5890627 5957996 6027437 6099325 6174317 6252655 6333737 6416523
57214 6416523 6500347 6585308 6671871 6760052 6848986 6937408 7024629 7110818 7196127 7279976 7361666
57203 7361666 7441416 7520045 7597778 7674200 7749542 7825151 7902195 7980576 8059632 8139436 8220792
57192 8220792 8304253 8389652 8476500 8564465 8653647 8744566 8837559 8931878 9025624 9116722 9203707
57181 9203707 9285505 9361186 9430452 9493885 9552195 9605439 9653316 9695838 9733304 9766063 9794832
57170 9794832 9820902 9845464 9868922 9891185 9912215 9931728 9948719 9961826 9969902 9971780 9966028 9951710
57158 9951710 9929165 9899376 9862957 9820611 9774309 9726969 9680815 9636871 9596093 9560021 9529836
57147 9529836 9505351 9485241 9467748 9450924 9432705 9411291 9385304 9353549 9315067 9269765 9218660
57136 9218660 9163273 9105017 9045288 8985686 8927640 8871914 8818820 8768792 8722367 8679505 8639249
57125 8639249 8600418 8562601 8526196 8491350 8457283 8423111 8389251 8357543 8329938 8307564 8291282
57114 8291282 8282661 8283898 8296944 8322883 8361910 8413511 8476745 8550674 8634961 8730747 8841766
57103 8841766 8974831 9138926 9343701 9599177 9916872 10311052 10799433 11403649 12149002
57094 12149002 13062496 14169991 15494253 17053763 18861076 20921726 23235129 25795072
57086 25795072 28586502 31580908 34734289 37983125 41230534 44330869 47097069 49340850
57078 49340850 50920893 51764336 51856862 51226326 49936824 48083898 45778301 43125555 40217474
57069 40217474 37137733 33969552 30796725 27699141 24746628 21993146 19473452 17203978
57061 17203978 15186430 13411254 11860825 10513471 9347115 8340482 7472840 6724695
57053 6724695 6079118 5521659 5039108 4619229 4251615 3927995 3641584 3386640 3158453
57044 3158453 2953068 2766934 2597199 2442053 2300186 2170077 2050314 1940377 1840383 1750058
57034 1750058 1668433 1594484 1527645 1467816 1415366 1371033 1335385 1308462 1290259 1281395 1282906 1295532
57022 1295532 1319465 1354163 1397195 1442704 1481393 1502860 1499087 1467190 1410151 1335237 1251116
57011 1251116 1165416 1083713 1009459 944230 888307 841425 802977 771706 745925 724488 707135
57000 707135 693632 683042 674207 666507 659727 653622 648045 643061 638502 633822 628912 624594 621738 620250
56986 620250 619609 620071 622563 627408 633673 639661 643475 643326 638070 627759 613464 596613 578606 560738
56972 560738 543941 528689 515406 504668 496595 490443 485440 481840 480604 482189 486327 492852 502071
56959 502071 514242 529146 546147 564076 580866 593794 600335 598803 588641 570827 548044 523695
56947 523695 500266 478698 459188 442067 427820 416788 409146 404910 403770 405248 409208 416046 426246
56934 426246 440026 457565 479256 505180 534052 562644 586424 601130 604282 595769 577488 552571
56922 552571 524469 495960 468531 442756 419203 398650 381391 366860 354217 342944 332730
56911 332730 323346 315055 308590 304104 300494 296476 292165 288929 287641 287663 287668 287037 286304 286536 288439 291900
56895 291900 296412 302012 309599 320071 333379 348833 366200 386046 408963 434793 462482 490220
56883 490220 515533 535608 548003 551413 546159 534201 518467 501698 485616 471014 458319 447960
56871 447960 440464 436508 436788 441663 451187 465692 486073 513120 546720 586052 630532 680179 734587
56858 734587 791167 844144 885724 909288 912397 897115 867864 829357 786117 742469 701955 666875
56846 666875 638646 618123 605355 599763 601255 610798 629484 657588 695135 742882 801949 872721
56834 872721 954373 1044525 1137949 1225620 1296151 1339148 1348192 1322403 1266814 1191075 1106127 1020763
56822 1020763 940444 868173 805406 752474 709314 676191 653353 640407 636781 642649 658599 684527
56810 684527 719710 763887 817200 878542 944136 1007453 1059972 1092800 1099517 1078834 1034706 974006
56798 974006 904168 832015 762893 699967 644645 597774 559915 530678 508840 493496 484487 481641
56786 481641 484474 492950 507718 529163 556697 588999 624063 658480 687393 705905 710631 700298
56774 700298 675840 640396 598500 554477 511414 471202 434693 401725 371881 345627 324024
56763 324024 307045 292980 279993 267609 256303 246368 237828 230889 225721 222019 219208 216825 214453
56750 214453 211758 208926 206571 204809 202937 200527 198272 197150 197064 197049 196624 196303 196704 197645 198312 198109 197213
56733 197213 196257 195503 194591 193320 192354 192604 194042 195766 197224 198627 200134 201476 202689 204389 206784
56718 206784 209075 210409 210925 211322 211820 212102 211972 211544 210926 210103 209033 207744 206611 206517 208143 210894 213142
56701 213142 213885 213654 213471 213572 213558 213185 212413 211181 209717 208671 208395 208439 208249 207935 207857 207889 207777 207866 208827
56682 208827 210792 213260 215641 217514 218676 219429 220514 222255 224033 225057 225319 225292 225068 224444 223593 222999
56666 222999 222871 223187 224077 225521 226812 227048 226193 225107 224486 224227 223867 223176 222246 221422 221184 221770 222823
56649 222823 223648 223806 223323 222468 221559 220833 220285 219799 219587 220144 221427 222483 222376 221249 220073 219590 219922
56632 219922 220878 222101 223039 223316 223061 222485 221419 219732 217969 216884 216455 215995 215206 214493 214186 214037 213662
56615 213662 212945 211844 210263 208319 206382 204622 202842 200961 199385 198607 198582 198727 198532 198075 197897 198345
56599 198345 199123 199657 199868 200267 201186 202293 203106 203624 204083 204391 204306 204075 204415 205814 208116 210793 213382
56582 213382 215651 217580 219199 220422 221174 221683 222383 223353 224234 224884 225738 227169 228885 230464 232214 234959
56566 234959 239062 244127 249614 255393 261777 269415 279078 291093 304882 319199 332703 344127 352202
56553 352202 355990 355473 351618 345877 339671 334029 329351 325475 322103 318976 315643 311515 306498 301185
56539 301185 296135 291372 286968 283572 281681 280713 279507 277585 275265 272781 270116 267691 266293 265998 265793
56524 265793 264722 263017 261743 261549 262051 262298 261635 260115 258209 256213 254086 251852 249794 248044 246280
56509 246280 244197 242120 240761 240499 241153 242294 243368 243690 242823 241072 239244 237849 236752 235628 234496
56494 234496 233736 233743 234567 235812 236931 237634 237989 238230 238693 239787 241558 243275 244017 243788 243505 243736 244146 244403
56476 244403 244807 245533 246085 246211 246592 247781 249052 249299 248648 248170 248351 248880 249712 251150 252890 254075 254512
56459 254512 254883 255533 255958 255798 255485 255479 255585 255492 255382 255530 255758 255802 255910 256644 258190 260160 261969 263225 263883
56440 263883 264136 264132 263797 263035 261969 260815 259631 258403 257218 256140 255162 254542 254858 256292 258124 259398
56424 259398 259898 259991 259768 259010 257887 257088 257115 257846 258728 259100 258525 257300 256416 256494 256933 256700 255812 255347 256058
56405 256058 257649 259410 260881 261830 262234 262517 263288 264657 266205 267648 269062 270409 271365 271817 272125 272744
56389 272744 273841 275365 277176 279054 280772 282183 283111 283407 283311 283435 284060 284740 284962 284849 284859 285224 286141
56372 286141 287948 290443 292530 293306 293177 293195 293742 294626 295936 297737 299286 299764 299600 299950 300929 301575 301539
56355 301539 301633 302510 303927 305565 307520 309649 311377 312586 313857 315519 317291 319169 321766 325305 328994
56340 328994 331911 333961 335616 337295 339267 341682 344429 347361 350723 354845 359428 363774 367723 371724
56326 371724 376010 380415 384884 389317 392922 394661 394500 393415 392131 390747 389503 388835 388493 387693 386400
56311 386400 385478 385359 385623 386096 387252 389159 391171 393158 396008 400329 405565 410937 416348 421914 427456
56296 427456 432959 438690 444393 449298 453393 457771 463158 468985 474509 479978 486080 493042 500893 509803
56282 509803 519575 529490 539242 549345 560185 571467 583070 595563 609328 623988 639253 655526
56270 655526 673092 691561 710702 731065 753189 777020 802599 830503 861097 894228 930225
56259 930225 970250 1015156 1065042 1120471 1182921 1253311 1331304 1417086 1512653 1620131 1739684
56248 1739684 1870200 2011124 2162308 2322714 2490513 2663909 2840668 3017222 3189346
56239 3189346 3353465 3506381 3644242 3762740 3858112 3927240 3967422 3977179 3957101 3909172 3835575
56228 3835575 3738852 3622660 3491322 3348745 3198312 3043358 2886928 2731313 2578342 2429817
56218 2429817 2287174 2151229 2022705 1902401 1790412 1686002 1588863 1499689 1418840 1345272
56208 1345272 1277614 1215515 1159106 1107877 1061009 1018172 979161 943446 910859 881882 856397
56197 856397 833011 810663 790141 772822 758569 745889 733615 721463 709656 698995 690629 684663
56185 684663 679655 674459 669760 666620 664422 661698 658301 655254 652932 650897 649257 648718 649407 650759 652440
56170 652440 654359 656141 657675 659836 663592 668695 674323 680498 687745 695819 704087 712824 722860 734179
56156 734179 746137 758831 773029 788876 805869 824078 844355 867422 893713 923978 959123
56145 959123 999591 1045819 1099045 1160864 1232139 1312958 1403043 1501252 1605070 1711368 1817149
56134 1817149 1918848 2011929 2092698 2160314 2216325 2263014 2303115 2339897 2375376 2408409 2435677
56123 2435677 2454412 2463443 2462560 2452487 2435135 2412365 2384307 2349454 2305733 2250664 2181622 2097804
56111 2097804 2001878 1898792 1793377 1689726 1591585 1501730 1421405 1351306 1292111 1243090 1201709
56100 1201709 1166265 1137673 1116950 1102306 1090802 1081650 1075589 1072038 1069461 1067877 1068434 1070878 1073826
56087 1073826 1077201 1082050 1088198 1094422 1100764 1108364 1117106 1125687 1134018 1143362 1154076 1165314 1177006
56074 1177006 1190034 1204383 1219062 1233892 1249595 1266204 1283175 1300744 1319324 1338037 1355897
56063 1355897 1373964 1394102 1416041 1437995 1459693 1482244 1505345 1527325 1547861 1568124 1588258
56052 1588258 1607215 1625047 1642879 1660751 1678083 1696140 1717362 1742225 1769297 1798248 1830079
56041 1830079 1864473 1899868 1936201 1974798 2015521 2056818 2098554 2141857 2186233 2229898 2273000
56030 2273000 2317414 2363342 2409350 2455855 2505216 2558111 2613067 2669673 2728861 2789834 2850408
56019 2850408 2910815 2973749 3040375 3109731 3182107 3259117 3340235 3423304 3508907 3600197 3698057
56008 3698057 3800553 3907389 4020339 4138870 4260239 4384819 4516530 4656962 4803839
55999 4803839 4956415 5117505 5288899 5469574 5659753 5861995 6077015 6303197 6541328
55990 6541328 6794915 7065066 7350376 7652565 7976401 8323338 8691663 9083864 9507074
55981 9507074 9965032 10456904 10985579 11559542 12184854 12863212 13600046 14406424 15290929
55972 15290929 16258376 17318920 18489621 19785278 21218210 22810048 24593870 26603402
55964 26603402 28873379 31454640 34417654 37841308 41816929 46470618 51968836 58503227
55956 58503227 66294756 75621658 86824627 100284906 116427225 135738790 158719707
55949 158719707 185758463 217014165 252236802 290287847 328432307 362105046 385896759
55942 385896759 395541678 389645529 369994501 340452006 305408688 268673015 233016942
55935 233016942 200157400 170945222 145626245 124072875 105940214 90776851 78119832
55928 78119832 67553291 58717238 51300321 45044830 39748302 35247030 31401303 28097619
55920 28097619 25250446 22790024 20652543 18784942 17148909 15712512 14443541 13315166
55912 13315166 12310393 11415236 10613003 9889218 9235768 8645572 8108485 7616191 7165587
55903 7165587 6753424 6372764 6018293 5690032 5388132 5108721 4848332 4607600 4386908
55894 4386908 4182662 3991390 3813451 3649275 3495891 3350628 3214711 3089691 2973556
55885 2973556 2863620 2760359 2665336 2577988 2497243 2423755 2357977 2298299 2243138 2192176 2143511
55874 2143511 2092474 2035708 1974156 1910169 1844322 1777008 1710333 1646077 1584150 1525144 1471871
55863 1471871 1426217 1386716 1351218 1319653 1292145 1266771 1241531 1216631 1192862 1169634 1146453
55852 1146453 1124352 1103946 1083923 1063197 1042683 1023196 1003539 982430 960495 938705 916666
55841 916666 894136 872323 851983 832071 811897 792742 775649 759494 743017 726956 712441
55830 712441 699102 686529 675768 667442 660088 652223 644434 637592 630724 622632 613966 605643 596751
55817 596751 586153 574804 564411 555057 546177 538595 533376 529719 526179 523063 521546 521312 521204 521533
55803 521533 523662 527729 532623 537824 543595 549775 555882 561939 567781 572126 573761 573090 571128 567644
55789 567644 561812 554109 545994 538068 529955 521646 513635 505983 498337 490477 481915 471668 459601 447404
55775 447404 437059 428920 422384 417757 416097 417750 422286 429370 438376 447416 453929 456224 453902 447440
55761 447440 438148 427810 417356 406475 395155 384627 375780 367722 359116 350020 341193 332553 323784
55748 323784 315634 309059 303717 298747 294379 291300 289085 286789 284573 283147 282118 280601 279031 278587
55734 278587 278926 278262 275842 272872 270722 269460 268312 266451 263157 258296 252807 247927 243927 240363 237236
55719 237236 234887 233070 231307 230002 230062 231472 233382 235481 238207 241653 245410 249544 254541 260158 265279
55704 265279 269032 271151 271270 268933 264475 258953 252974 246377 239169 231969 225318 219222 213567 208432
55690 208432 203996 200567 198628 198306 199043 200300 202256 205175 208599 211943 215412 219388 223409 226774 229773
55675 229773 233051 236023 237267 236468 234679 232599 229854 226216 222378 219140 216832 215795 216471 218573 221015
55660 221015 223044 224805 226602 228313 229795 231159 232457 233714 235390 238018 241244 243904 245251 245478
55646 245478 244945 243659 241695 239374 236726 233398 229281 224705 219891 214808 209612 204575 199523 194059
55632 194059 188482 183764 180385 177819 175353 172792 170173 167450 164745 162407 160634 159468 159090 159542 160162
55617 160162 160020 158969 157607 156215 154572 152818 151496 150489 148899 146415 143939 142348 141420 140563 139815
55602 139815 139436 139034 137951 136231 134558 133422 132805 132545 132492 132356 131796 130715 129339 128070 127300 127203 127568
55585 127568 128019 128474 129218 130498 132181 133833 134993 135506 135799 136661 138478 140850 143275 145906 149173 153008
55569 153008 157102 161706 167305 173477 178876 182528 184478 185025 184144 182003 179324 176660 173707 169809 164854
55554 164854 159358 153911 148863 144374 140533 137540 135787 135484 136196 137120 137923 138943 140399 141816 142482
55539 142482 142283 141831 141854 142524 143332 143694 143677 143890 144534 144960 144561 143680 143054 142664 141860 140428 138739 136849
55521 136849 134276 130841 127088 123620 120597 118032 116044 114560 113233 111869 110573 109396 108230 107140
55507 107140 106312 105636 104826 103986 103545 103559 103624 103558 103588 103795 103985 104203 104694 105239 105223 104590 104027 103918 103832 103469 103425
55486 103425 104393 106056 107349 107588 106971 106216 106007 106497 107093 106932 105806 104379 103447 103282 103688 104182 104037
55469 104037 102772 100910 99752 100089 101503 103137 104631 106000 107113 107688 107575 106762 105394 103878 102598
55454 102598 101440 100053 98657 97994 98312 99040 99671 100205 100491 99997 98791 98018 98628 100133 101292 101588 101376
55437 101376 101016 100615 100351 100359 100413 100298 100305 100802 101506 101792 101591 101392 101429 101472 101436 101635 102270 103080 103668 103922 103982 103998
55415 103998 104013 104009 104075 104500 105525 106895 107895 108000 107348 106430 105564 104812 104110 103280 102178 101080 100622 101094
55397 101094 101991 102543 102449 101881 101090 100351 100046 100380 101112 101849 102479 103050 103437 103476 103275 103046 102713 102008 100965
55378 100965 100071 99866 100485 101571 102607 103401 104200 105222 106216 106757 106847 106780 106471 105464 103754 102029 100907
55361 100907 100388 100287 100622 101270 101737 101711 101468 101412 101624 102126 103057 104180 104796 104695 104637 105276 106117 106283 105916
55342 105916 105959 106728 107595 108029 108168 108220 108048 107612 107255 107238 107364 107275 106855 106126 105024 103517 101829 100471 99994
55323 99994 100607 101927 103218 104044 104493 104717 104579 104070 103728 104175 105324 106456 107033 107100 106940 106713 106512 106491
55305 106491 106772 107240 107521 107218 106363 105570 105434 105761 105763 105117 104328 103879 103582 103097 102590 102405 102469 102528 102602 102783
55285 102783 102941 103097 103674 104811 105834 106026 105588 105170 104801 104039 102963 102178 101934 102007 102420 103473 105015
55268 105015 106378 107171 107541 107607 107283 106719 106278 105981 105591 105275 105548 106430 107370 108132 109076 110344 111518 112323
55250 112323 112963 113393 113014 111614 109979 108954 108370 107513 106264 105162 104598 104537 104899 105640 106514 107162 107457
55233 107457 107449 107043 106031 104490 102918 101956 101987 102853 103879 104409 104480 104717 105398 105938 105619 104556 103603 103413
55215 103413 103932 104648 105034 104798 104062 103312 102981 103111 103570 104399 105659 107053 108054 108428 108318 107838 107010 106191
55197 106191 106108 107121 108668 109782 110075 109881 109542 109017 108324 107870 107953 108163 107770 106661 105454 104648 104121 103583
55179 103583 103069 102687 102317 101978 102153 103227 104796 106081 106980 108104 109716 111194 111758 111295 110242 109074
55163 109074 108252 108329 109625 111859 114325 116403 117757 118280 118127 117636 116945 115796 114053 112328 111641 112346
55147 112346 113692 114669 115012 115077 114965 114256 112727 110922 109678 109250 109185 108996 108696 108651 109142 110136 111333 112361
55129 112361 113024 113368 113428 113046 112174 111222 110751 110828 111067 111307 111801 112627 113404 113829 113979 113814 112909 111190 109493
55110 109493 108798 109164 109979 111012 112518 114362 115727 115918 115039 113765 112753 112327 112422 112784 113378 114456 115994
55093 115994 117307 117734 117518 117521 118147 119117 120193 121452 122819 124020 125192 126844 128898 130368 130438 129441 128375
55076 128375 127818 127724 127968 128544 129326 129972 130120 129563 128380 127008 126001 125561 125504 125743 126491 127777 129036 129485
55058 129485 128808 127347 125779 124716 124376 124460 124480 124300 124173 124204 124107 123596 122747 121810 120991 120591 121002 122202 123468
55039 123468 123924 123338 122244 121394 121207 121546 121895 121914 121882 122347 123331 124272 124894 125585 126594 127342 127119 126152 125372
55020 125372 125179 125074 124572 123947 123804 124228 124698 124757 124532 124488 124731 124719 123794 121996 120169 119235 119532 120801 122515
55001 122515 124053 124968 125350 125794 126704 127821 128656 129192 129810 130623 131211 131057 130060 128617 127394 126920 127179
54984 127179 127632 127778 127718 127957 128791 130102 131705 133590 135665 137500 138538 138624 138199 137867 137756 137410 136404
54967 136404 135001 133992 133937 134760 136023 137289 138188 138486 138312 138073 138022 138091 138200 138406 138602 138502 138168 138155 138727
54948 138727 139303 139127 138255 137311 136477 135361 133875 132612 132160 132501 133259 134107 134702 134629 133807 132718 131915 131465
54930 131465 131206 131441 132927 136071 140369 144833 148870 152632 156666 161374 166761 172482 178079 183340 188446
54915 188446 193592 198438 202165 204266 205016 204877 203713 201038 196905 191963 186628 180823 174777 169427 165518
54900 165518 162681 159987 157163 154693 152856 151279 149559 147867 146738 146543 147256 148514 149774 150679 151378
54885 151378 152289 153474 154513 155180 155985 157739 160666 164227 167871 171726 176363 182051 188494 195249 201997
54870 201997 208227 212958 215252 214926 212457 208241 202432 195543 188598 182330 176579 170895 165420 160716
54856 160716 156946 153729 150777 148216 146213 144667 143403 142356 141465 140557 139489 138278 137017 135787 134675
54841 134675 133737 132901 132005 130983 129957 129147 128691 128417 127799 126423 124668 123696 124408 126487 128710 130103
54825 130103 130523 130284 129720 129216 129185 129706 130381 130789 130924 131015 131080 130918 130565 130531 131379 133126 135149 136758 137768
54806 137768 138446 138971 139192 138936 138348 137769 137466 137551 138027 138729 139389 139904 140364 140698 140583 139986 139508 139806 140821
54787 140821 141967 142936 143837 144597 144784 144225 143382 142869 142864 143185 143679 144303 145042 145994 147388 149290 151404 153425
54769 153425 155576 158593 163058 168781 174894 180598 185826 191094 196712 202296 207177 211037 213859 215392
54755 215392 215098 212707 208500 202949 196399 189277 182286 176045 170682 166020 162087 159200 157542 156841 156502
54740 156502 155979 155062 153947 153094 152870 153249 153843 154234 154274 154121 154082 154471 155575 157554 160297 163481 166966
54723 166966 171079 176212 182094 187790 192645 196959 201416 206003 209852 212067 212336 210706 207232 202159
54709 202159 196171 190172 184768 180090 176027 172465 169279 166241 163091 159830 156911 154943 154066 153714 153147
54694 153147 152180 151185 150473 149882 149037 147812 146435 145245 144423 143924 143586 143268 142800 141873 140284 138408 137120
54677 137120 136942 137431 137796 137935 138412 139458 140494 140842 140470 139767 138953 138044 137188 136705 136765 137233 137811 138279
54659 138279 138602 138882 139142 139254 139167 139106 139267 139422 139153 138486 137883 137535 137177 136767 136813 137559 138320 138244 137472 136921
54639 136921 137001 137244 137263 137391 138017 138838 139240 139160 139100 139449 140141 140914 141553 141924 142086 142317 142718 142816 141992 140432
54619 140432 139251 139363 140492 141538 141705 140998 139900 138964 138633 138965 139508 139704 139467 139132 138945 138994 139486 140516
54601 140516 141479 141391 140130 138830 138571 139101 139345 138932 138559 138926 139865 140659 140837 140526 140235 140395 141011 141749
54583 141749 142413 143185 144319 145802 147423 148899 149770 149547 148302 146788 145570 144413 142981 141754 141555
54568 141555 142388 143504 144553 145833 147344 148417 148564 148040 147245 146171 144845 143813 143705 144595 146101 147770
54552 147770 149103 149593 149166 148413 148080 148444 149316 150318 151046 151313 151557 152632 154826 157263 158624 158361 157090
54535 157090 156016 156064 157252 158677 159321 159015 158298 157398 155945 153946 152314 151875 152313 152678 152558 152097 151239
54518 151239 149787 148150 147213 147276 147717 147918 148058 148672 149812 150966 151685 151999 152220 152427 152278 151399 149971
54501 149971 148732 148293 148572 149018 149183 148986 148631 148451 148637 148941 148818 148036 146961 146131 145852 146285 147449 148853
54483 148853 149657 149610 149437 149864 150755 151752 153208 155609 158398 160395 161297 161866 162508 162686 162035 161220 161076 161524
54465 161524 161911 162061 162417 163330 164658 166072 167467 168999 170721 172190 172671 172014 171127 171057 171672 171806 170748
54448 170748 169000 167391 166091 164783 163309 161765 160342 159373 159167 159551 159940 160096 160328 160730 160830 160460
54432 160460 160318 161047 162229 162995 163225 163368 163418 162951 162088 161493 161331 161080 160574 160478 161298 162606 163703 164584
54414 164584 165697 167044 168059 168317 168004 167663 167680 167977 168114 167786 167270 167178 167704 168360 168631 168620 168826 169468 170304
54395 170304 171029 171586 172146 172927 174046 175427 176856 178143 179121 179557 179313 178655 178080 177672 176949 175645 174319
54378 174319 173830 174439 175826 177766 180191 182668 184457 185322 185836 186677 187957 189443 190986 192522 193981
54363 193981 195521 197566 200250 203012 205067 206098 206214 205448 203794 201585 199400 197513 195772 194048 192440
54348 192440 190952 189299 187216 184748 182148 179699 177694 176307 175307 174155 172592 171008 169984 169565
54334 169565 169205 168383 167145 166035 165596 165916 166599 167161 167463 167739 168211 168821 169369 169809 170326 171140 172291 173548
54316 173548 174540 175038 175179 175327 175643 175799 175235 173740 171800 170248 169467 169074 168584 168269 168894 170467 171804
54299 171804 171790 170694 169682 169257 168893 168193 167573 167544 167904 168117 168111 168244 168696 169240 169503 169246 168509 167689 167309
54280 167309 167548 168133 168735 169195 169332 168909 168053 167340 167192 167490 167977 168722 169841 171167 172527 174071 175863
54263 175863 177432 178230 178443 178847 179947 181600 183418 185112 186442 187177 187213 186668 185899 185511 185981 187078 187976
54246 187976 188235 188243 188300 187813 186071 183493 181282 179973 179155 178557 178505 179066 179559 179417 178996 179135 180285 182311
54228 182311 184711 186761 187815 187876 187635 187734 188229 188898 189664 190433 190835 190514 189475 187902 185868 183481 181146
54211 181146 179381 178461 178315 178597 178729 178142 176750 175108 173965 173772 174559 176005 177503 178472 178832 179003 179313
54194 179313 179635 179720 179626 179628 179869 180285 180669 180754 180410 179938 179923 180675 181978 183389 184582 185350 185652 185748 185976 186334
54174 186334 186585 186779 187213 187753 187768 186956 185761 184658 183548 182291 181284 180933 180885 180398 179345 178302 177697
54157 177697 177310 176583 175168 173204 171280 169951 169121 168182 166999 166310 166733 167756 168287 167978 167424 167172 167138
54140 167138 167027 166803 166647 166787 167389 168385 169450 170409 171406 172447 173156 173466 174123 175760 177746 178869 179038
54123 179038 179362 180487 181853 182892 183935 185368 186709 187369 187825 189137 191508 194050 195965 197365 198836
54108 198836 200650 202614 204529 206596 209341 212967 216848 220001 222160 224037 226259 228452 229704 229551
54094 229551 228038 225150 220917 216067 211936 209443 208492 208477 209010 209991 211343 212927 214567 215954 216688 216647
54078 216647 216174 215738 215523 215460 215502 215660 215827 215777 215349 214585 213749 213241 213345 213860 214164 213928 213615 213917 214700 214935
54058 214935 213848 211776 209674 208176 207499 207874 209412 211608 213594 215104 216789 219404 222991 226981 230715
54043 230715 233695 235767 237429 239676 243123 247444 251918 256330 261008 266208 271909 278015 284368 290607
54029 290607 296481 302218 308164 314032 319029 322781 325666 328102 329990 331151 331892 332689 333517 333843 333222
54014 333222 331631 329311 326541 323502 320153 316237 311623 306643 301879 297564 293330 288690 283688 278915
54000 278915 274859 271397 268100 264909 262244 260366 258966 257592 256193 254926 253589 251756 249464 247357
53986 247357 245973 245159 244377 243376 242391 241735 241363 240846 239867 238704 238031 238091 238384 238505 238976 240642 243410
53969 243410 246278 248734 251399 255073 259799 265331 271875 279792 288887 298466 307769 315833 321368 323506
53955 323506 322515 319174 313677 305948 296975 288843 283030 279284 276584 274620 273747 273905 274375 274702 275382 277347
53939 277347 280909 285351 289531 292815 295424 297930 300543 303062 305338 307500 309675 311764 313664 315533
53925 315533 317690 320374 323755 328045 333342 339351 345394 350809 355440 359837 364999 371727 380044 389245
53911 389245 398540 407589 416355 424591 431751 437515 442267 446743 451086 454402 455575 454552 452529 450713
53897 450713 449189 447258 444548 441302 437724 433633 428794 423028 415942 407199 397354 387843 379643 372451
53883 372451 365617 359332 354089 349387 343974 337415 330505 323992 317790 311840 306809 303259 300610 297728
53869 297728 294194 290374 286479 282315 277898 273653 269890 266592 263778 261538 259552 257090 253782 250132
53855 250132 247041 245077 244314 244499 245109 245504 245338 244792 244238 243822 243428 242854 241903 240567 239194 238262 237823
53838 237823 237472 236987 236717 237094 238047 239155 240100 240659 240550 239755 238816 238423 238722 239357 240083 240944 241923 242839
53820 242839 243575 244124 244431 244516 244719 245429 246550 247592 248336 249066 250103 251458 253057 254963 257260 260001
53804 260001 263343 267394 271872 276305 280744 285878 292195 299308 306334 312710 318451 323842 329098 334133
53790 334133 338479 341707 344040 346264 348887 351686 354193 356179 357336 356978 354644 350744 346178 341472
53776 341472 336705 332051 327765 323720 319521 315146 310955 307035 303008 298704 294588 291223 288562 285950
53762 285950 282689 278494 273662 268976 265228 262647 260858 259412 258160 257001 255625 253817 251884 250481
53748 250481 249929 249882 249725 249203 248561 248110 247820 247430 246864 246311 245905 245556 245155 244674 243996 242969 241859 241411
53730 241411 242050 243265 244196 244629 244936 245262 245436 245665 246541 248164 249950 251640 253875 257239 261237 264838
53714 264838 267718 270312 272776 274643 275627 276242 277313 279107 281177 282964 284460 286283 289040 292576 296054
53699 296054 298892 301435 304440 308098 311917 315475 318838 322149 325199 327593 329162 330058 330568 330880 330973
53684 330973 330710 330121 329495 328991 328254 326769 324599 322506 321198 320680 320410 319908 319109 318315 317884 317803 317578 316792
53666 316792 315785 315435 316146 317361 318280 318718 318975 319195 319244 319073 318767 318272 317479 316569 316000 316057 316715 317923
53648 317923 319723 321906 323851 324950 325176 325113 325496 326748 328863 331580 334635 337869 341167 344384 347401
53633 347401 350214 352913 355619 358453 361471 364518 367351 370012 372923 376418 380349 384355 388321 392238
53619 392238 395827 398787 401384 404285 407671 410977 413680 415940 418183 420478 422680 424880 427315 430022
53605 430022 432954 436260 440061 444069 447754 450830 453245 454854 455515 455474 455231 454994 454618 454125 453817 453710
53589 453710 453264 452028 450288 448737 447563 446202 444035 441102 438014 435284 432911 430700 428777 427519
53575 427519 426893 426184 424604 422066 419134 416343 413901 411931 410623 409993 409827 409992 410578 411569 412544 412948
53559 412948 412640 412033 411695 411779 411880 411527 410833 410460 410823 411615 412385 413230 414446 415774 416737 417629 419392 422291
53541 422291 425500 428373 431406 435411 440337 445617 451238 457646 464773 471964 478883 485866 493330 501405
53527 501405 510258 520264 531591 543993 557119 570757 584772 599159 614209 630178 646757 663307
53515 663307 679777 696904 715308 734831 755076 776178 798591 822330 846888 871818 897067
53504 897067 922753 948848 975086 1000975 1025951 1049657 1072116 1093568 1114207 1134090 1153156
53493 1153156 1171285 1188476 1205112 1221896 1239371 1257568 1276154 1294742 1312989 1330630 1347640
53482 1347640 1364306 1381005 1397993 1415365 1432910 1449902 1465356 1478776 1490399 1500490 1508665
53471 1508665 1514293 1517288 1518002 1516433 1512104 1504782 1494924 1483253 1470247 1456172 1441301 1425902 1410169
53458 1410169 1394264 1378223 1361788 1344644 1326868 1308804 1290393 1271048 1250519 1229501 1208975
53447 1208975 1189167 1169612 1150093 1130994 1112767 1095610 1079853 1066158 1054997 1046209 1039383 1034391
53435 1034391 1031162 1029108 1027360 1025687 1024799 1025485 1027693 1030729 1034239 1038611 1044395 1051602 1059817 1068882
53421 1068882 1079196 1091272 1105221 1120846 1138112 1157237 1178235 1200663 1224094 1248727 1275187
53410 1275187 1303667 1333579 1364279 1395928 1429325 1464915 1502237 1540408 1579005 1618448 1659712
53399 1659712 1703701 1750681 1800066 1850817 1902234 1954338 2007474 2061679 2116665 2172246 2228415
53388 2228415 2284892 2340875 2395471 2448235 2499144 2548187 2595227 2640177 2682968 2723228 2760200
53377 2760200 2793187 2821998 2846835 2867833 2884815 2897374 2904992 2907083 2903140 2892919 2876390 2853568
53365 2853568 2824560 2789810 2750071 2706025 2658105 2606885 2553508 2499444 2445738 2392586 2339673
53354 2339673 2286816 2234370 2183132 2133919 2087071 2042331 1999210 1957408 1916744 1876748 1836674
53343 1836674 1796119 1755475 1715623 1677286 1640797 1606327 1574026 1543952 1516094 1490487 1467098
53332 1467098 1445597 1425597 1407259 1391307 1378035 1366395 1354512 1341230 1326879 1312446 1298310
53321 1298310 1284078 1269407 1254572 1240194 1226748 1214479 1203586 1194303 1186875 1181514 1178259 1176746
53309 1176746 1176286 1176359 1177047 1178847 1182070 1186589 1192194 1199014 1207435 1217636 1229377 1242311 1256420 1272026
53295 1272026 1289375 1308390 1328947 1351272 1375770 1402368 1430177 1457918 1484626 1509922 1533803
53284 1533803 1556392 1577817 1598053 1616727 1633220 1647089 1658377 1667360 1673951 1677429 1676918 1672140
53272 1672140 1663679 1652482 1639287 1624560 1608621 1591420 1572278 1550408 1525891 1499785 1473049
53261 1473049 1445700 1417338 1388190 1359128 1330759 1302895 1274982 1246734 1218375 1190550 1163927
53250 1163927 1138539 1113538 1088002 1061992 1036393 1011668 987312 962751 938254 914536 891836
53239 891836 869838 848210 826769 805366 784256 764546 747613 733821 722241 711859 702618 694919
53227 694919 688439 682043 674843 666826 658271 648967 638431 626688 614306 601592 588214 573885 559126
53214 559126 544903 531628 518951 506573 494768 483960 474138 465067 456773 449406 442663 435771 428170
53201 428170 420097 412377 405641 399699 393619 386576 378769 371345 365235 360183 355159 349604 343909 338716
53187 338716 334180 330089 326306 322727 319038 314964 310745 307083 304465 302718 301293 299838 298335 296871
53173 296871 295479 294229 293253 292563 291948 291167 290198 289190 288201 287108 285781 284233 282593 281048 279804 278907
53157 278907 278063 276874 275404 274282 273995 274230 274246 273860 273603 273847 274186 273999 273289 272576 272101 271629 271063 270756
53139 270756 270969 271344 271303 270791 270313 270323 270903 271993 273525 275248 276758 277919 278977 280087 281007 281522 281919
53122 281919 282676 283830 285012 286057 287194 288646 290351 292086 293553 294395 294468 294135 293936 293952 293898 293779 293882
53105 293882 293981 293283 291556 289715 288738 288489 288248 287959 288050 288228 287450 285343 282889 281242 280394 279429 277797
53088 277797 275851 274240 273158 272277 271292 270378 269931 269837 269349 268053 266637 266153 266621 267067 266947 266818 267338
53071 267338 268354 269361 270247 270950 270976 269970 268455 267200 266074 264282 261689 259177 257556 256812 256615 256924
53055 256924 257811 259196 261039 263287 265381 266406 266219 265920 266600 267988 268999 269277 269362 269332 268322 265764
53039 265764 262445 259719 258107 257246 256871 257090 257670 257845 257191 256304 256141 256864 257702 257951 257765 257918 258991
53022 258991 260903 263073 264916 266269 267448 268856 270442 271596 271722 270911 269964 269694 270233 270995 271261 270787
53006 270787 269955 269427 269640 270535 271678 272598 273033 272959 272521 272008 271814 272264 273397 274921 276407 277540 278236
52989 278236 278604 278840 279144 279652 280403 281408 282772 284726 287410 290560 293522 295712 297055 297868 298284 298086
52973 298086 297233 296306 296076 296622 297234 297276 296893 296678 296915 297393 297823 298178 298664 299572 301083 302957 304465 304888
52955 304888 304176 302915 301626 300259 298415 295915 293107 290652 288929 287574 285804 283464 281456 280707 280889
52940 280889 280820 280118 279673 280242 281344 282074 282363 282668 282878 282425 281348 280421 280109 280037 279655 278843 277678 276164
52922 276164 274503 273233 272744 272921 273430 274104 274855 275538 276103 276673 277267 277719 277986 278267 278590 278627 278145 277366
52904 277366 276605 275831 274874 273829 272932 272214 271608 271281 271517 272362 273534 274607 275132 274916 274438 274672 276056
52887 276056 277810 278748 278633 278237 278129 278014 277407 276492 276006 276491 277847 279443 280616 281242 281890 283230 285339
52870 285339 287774 290232 292748 295286 297645 299924 302560 305624 308465 310387 311352 311621 311056 309360 306887
52855 306887 304566 302833 301066 298296 294286 289691 285380 281769 278673 275590 272166 268562 265429 263389
52841 263389 262464 261996 261185 259763 258151 257052 256859 257431 258242 258651 258205 257006 255868 255837 257273 259470 261341
52824 261341 262398 262873 263019 262691 261752 260560 259742 259585 259876 260307 260752 261136 261305 261219 261167 261564 262560 263945
52806 263945 265433 266861 268104 268930 269127 268721 268027 267436 267126 266845 265958 263889 260733 257471 255353 254904
52790 254904 255460 255782 255181 254039 253201 252963 252844 252421 252111 252770 254501 256251 256821 256124 255252 255411 256941
52773 256941 259233 261294 262424 262585 262212 261627 260705 259264 257597 256292 255531 254944 254272 253801 253883 254299 254456
52756 254456 254163 253904 254282 255354 256595 257459 257919 258496 259727 261624 263705 265550 267155 268744 270409 272076
52740 272076 273667 275106 276259 277065 277702 278411 279198 279868 280379 280963 281818 282842 283773 284563 285440 286550 287610
52723 287610 288052 287558 286352 284827 283002 280647 277929 275558 274061 273233 272599 272156 272182 272502 272492 271893 271163
52706 271163 270824 270876 271029 271132 271054 270501 269369 268103 267331 267221 267486 267941 268682 269705 270703 271346 271593 271688 271946
52687 271946 272522 273215 273585 273473 273299 273572 274222 274736 274883 274814 274485 273545 272026 270631 269907 269520 268768 267572
52669 267572 266531 266172 266580 267599 268931 270090 270762 271253 272165 273555 274806 275467 275873 276721 278314 280395
52653 280395 282542 284621 286990 290230 294381 298383 300687 300629 298929 296688 294303 291602 288626 285811 283606
52638 283606 282318 282180 283130 284623 286022 287177 288321 289484 290403 290986 291497 292233 293307 294752 296477 298026
52622 298026 298768 298470 297478 296278 295093 293976 292916 291749 290291 288768 287822 287833 288441 288970 289133 289135 289246
52605 289246 289547 289978 290443 290938 291637 292666 293648 293791 292780 291376 290696 290923 291149 290581 289553 289146 289981
52588 289981 291621 293122 293951 294295 294577 294896 295116 295360 296064 297415 299039 300450 301611 302746 303757 304184
52572 304184 303771 302821 301902 301349 301048 300586 299672 298561 297936 298158 298744 298881 298412 297926 297846 297816 297176 295777 294113
52553 294113 292851 292429 292929 294045 295160 295597 294934 293199 290947 289086 288355 288757 289631 290349 290780 291001 290846
52536 290846 290069 288888 288045 288195 289353 291006 292710 294441 296315 298101 299290 299749 300106 301157 302970
52521 302970 304817 306027 306528 306580 306342 305994 305955 306693 308432 311238 315151 319931 324837 329025 332200 334671
52505 334671 336760 338361 339067 338540 336728 333785 329890 325170 319938 314936 311027 308507 306981 306046 305701
52490 305701 305862 305913 305304 304312 303628 303299 302678 301452 300091 299123 298552 298236 298319 298928 299811 300646 301402 302117 302627
52471 302627 302954 303705 305591 308609 312075 315444 318755 322312 326228 330352 334309 337557 339660 340702 341261
52456 341261 341808 342137 341525 339452 336098 332111 327974 323702 319166 314516 310108 306220 303055 300900 299895
52441 299895 299693 299735 299919 300569 301702 302834 303683 304424 304888 304176 301825 298884 297022 296717 297109 297521 298194
52424 298194 299338 300383 300692 300443 300343 300829 301969 303714 305800 307673 308945 309763 310443 311075 311857 313479
52408 313479 316600 321138 326578 332874 340470 349529 359722 370732 382212 392999 401091 404990 404812
52395 404812 401697 396465 389388 381003 372414 364594 357881 352362 348308 345849 344460 343273 341937 340844
52381 340844 340446 340679 341224 342080 343546 345702 348301 351215 354697 358946 363647 368249 372707 377590 383255
52366 383255 389111 393886 396614 397225 396281 394402 392018 389460 387063 385165 384028 383685 383789 383796 383489 383237
52350 383237 383608 384791 386581 388778 391219 393483 395012 395788 396530 397995 400325 403314 406995 411561 416928
52335 416928 422797 429042 435625 442308 448921 455912 464107 473883 484957 497018 509970 523493 537074
52322 537074 550807 565578 581883 598907 615350 630864 646131 661748 677746 694168 711388
52311 711388 729618 748536 767682 786957 806537 826503 846689 866711 886122 904744 922921
52300 922921 941169 959491 977288 994033 1009703 1024281 1037151 1047320 1054194 1057827 1058519 1056581
52288 1056581 1052566 1047347 1041619 1035430 1028467 1020759 1012862 1005296 998141 991337 985119 979834 975494 971951
52274 971951 969459 968599 969522 971692 974690 978944 985216 993506 1002822 1012023 1020698 1029291 1038657 1049389
52260 1049389 1061390 1074062 1087046 1100614 1115130 1130416 1145990 1161776 1178137 1195204 1212533
52249 1212533 1229401 1244934 1257959 1267322 1272731 1275011 1275273 1274013 1271175 1266727 1260853 1253754 1245633
52236 1245633 1236765 1227317 1217072 1205586 1192729 1179082 1165755 1153719 1143152 1133372 1123547 1113467
52224 1113467 1103538 1094152 1085327 1076910 1068786 1060825 1052998 1045757 1039921 1035952 1033531 1032101 1031557 1032110
52210 1032110 1033710 1036010 1038791 1042074 1045789 1049650 1053444 1057174 1060872 1064422 1067690 1070772 1074038 1077914
52196 1077914 1082509 1087464 1092303 1097044 1102286 1108513 1115486 1122503 1129110 1135246 1140781 1145302 1148501 1150512
52182 1150512 1151618 1151669 1149959 1145790 1139082 1130429 1120528 1109715 1098152 1086374 1075334 1065832 1058137
52169 1058137 1052267 1048346 1046373 1045839 1045937 1046194 1046653 1047521 1048883 1050855 1053705 1057553 1062002 1066245 1069617
52154 1069617 1071989 1073526 1074133 1073432 1071487 1069331 1068342 1069061 1070925 1073178 1075578 1078035 1080135 1081484 1082238
52139 1082238 1082825 1083335 1083638 1083914 1084553 1085603 1086813 1088245 1090380 1093644 1098287 1104809 1113950 1125978 1140397
52124 1140397 1156637 1174729 1195027 1217509 1241699 1267118 1293603 1321237 1350092 1379776 1409088
52113 1409088 1436357 1460535 1481947 1501807 1521022 1539561 1556777 1572041 1585118 1596223 1605948
52102 1605948 1615043 1624158 1633639 1643401 1652901 1661353 1668139 1673020 1675997 1677055 1676048 1672623 1666162 1655952
52088 1655952 1641697 1623892 1603661 1582204 1560423 1538889 1518057 1498455 1480697 1465222 1451966
52077 1451966 1440475 1430468 1422242 1416311 1412673 1410638 1409558 1409691 1412144 1417756 1426061 1435511 1444813 1453966
52063 1453966 1463962 1475686 1489254 1504121 1519447 1534426 1548684 1562472 1576201 1589754 1602558
52052 1602558 1614372 1625566 1636363 1646126 1653648 1657961 1658691 1655960 1650310 1642437 1632566 1620179 1604770
52039 1604770 1586846 1567769 1548616 1529604 1510632 1491941 1473960 1456869 1440628 1425254 1410786
52028 1410786 1396992 1383356 1369373 1354842 1340005 1325508 1312060 1299780 1287867 1275225 1261612
52017 1261612 1248020 1235704 1224899 1214714 1204303 1193811 1184026 1175293 1167066 1158414 1148648 1137403
52005 1137403 1124458 1109709 1093263 1075428 1056623 1037299 1017829 998400 979149 960436 942818
51994 942818 926679 912015 898599 886229 874739 863925 853553 843274 832589 821143 809087
51983 809087 796814 784202 770541 755435 739406 723265 707287 691403 675789 660720 646137
51972 646137 632095 619473 609436 602132 596662 592539 590406 591013 594217 599463 606559 615268 624665 633616
51958 633616 641669 648720 654056 656595 656144 653626 649832 644651 637924 630461 623646 618330 614647 612771
51944 612771 613307 616879 623686 633560 646162 661017 677621 695716 715457 737148 760852 786147
51932 786147 812030 836780 857976 873019 879999 878263 868264 851017 827764 800094 770030 739693
51920 739693 710583 683114 656908 631732 608147 587186 569340 554138 540839 529312 519926 512720
51908 512720 507168 502874 500133 499631 501798 506526 513158 520596 527793 534497 541206 548046 554024 557807
51894 557807 558916 557535 553450 546068 535645 523704 511840 500665 490290 481251 474320 469705 467034
51881 467034 466045 466830 469423 473574 478971 485470 493115 502042 512213 523019 533373 542449 550114 556300
51867 556300 560240 560930 558306 553504 547950 542520 537470 532619 527584 522376 517912 515421 515183 516341 518108
51852 518108 520572 524018 528027 531715 534435 535746 535039 531839 526351 519239 511011 502116 493486 486280
51838 486280 480874 476509 472129 467330 462400 457802 453913 451158 450119 451251 454334 458254 461583 463526
51824 463526 464115 463471 461357 457830 453896 450866 449140 448111 447149 446147 445120 443982 442973 442732 443608
51809 443608 445244 447087 448939 450737 452112 452633 452280 451352 450011 448230 446128 444123 442743 442358 442994
51794 442994 444236 445402 445963 445750 444816 443299 441496 439829 438568 437764 437527 438079 439372 440953 442390 443651
51778 443651 444851 445948 446960 448194 449853 451634 453210 455054 458244 463301 469596 476088 482391 488953
51764 488953 496393 504895 514073 523053 530557 535158 535855 532715 526898 519749 511758 502560 492019 480967
51750 480967 470628 461528 453318 445587 438503 432590 428205 425350 423781 423200 423441 424639 427143 431212
51736 431212 436723 443167 449944 456798 464038 472113 480752 488586 493926 496087 495944 495269 495550 497342 500402
51721 500402 504159 507945 510868 511846 510190 506214 501004 495515 490149 485281 481630 479648 478711 477400 474643
51706 474643 470447 465742 461830 459790 459872 461417 463601 466189 469207 472065 473650 473448 472100 470644 469530
51691 469530 468626 467833 467359 467483 468205 469007 468895 466876 462671 456928 450781 445321 441328 439132 438540 439138
51675 439138 440766 443495 447137 451148 455171 459312 463709 468180 472612 477477 483591 491458 500963 511371
51661 511371 521341 529218 533872 535315 534211 530841 524944 516651 507244 498700 492537 489212 488567 490642
51647 490642 495735 503518 512308 519627 523605 523717 520297 513913 505477 496439 488185 481255 475449 470587
51633 470587 466756 463864 461411 458888 456204 453600 451264 449050 446467 443093 439200 435755 433458 431796
51619 431796 429490 425953 421876 418228 415151 412194 409304 407030 405714 404924 403848 402068 399778 397364
51605 397364 395017 392820 391106 390518 391541 394004 397213 400679 404656 409829 416592 424764 434067 444594
51591 444594 456525 469279 481163 490107 494879 495628 493324 488879 482862 475937 469236 464097 461333 460878
51577 460878 462250 465414 471032 479800 491632 505657 520848 536478 552116 567681 583675 600976
51565 600976 620044 640374 660878 680689 699584 718058 737319 758965 784172 813049 844922
51554 844922 878909 913720 946964 975366 996089 1007784 1010406 1004508 990980 971029 945886 916516
51542 916516 883846 849180 814156 780334 748980 721035 696971 676699 659891 646335 635702
51531 635702 626956 618418 608652 597246 584726 571975 559761 548421 537687 527006 516363 506631
51519 506631 498727 492441 486494 479868 472787 466233 460736 455940 451213 446383 441891 438333 435918 434263
51505 434263 432705 430809 428553 426109 423706 421739 420664 420497 420647 420556 420358 420581 421423 422767 424820 428004
51489 428004 432006 435486 437206 437199 436487 435914 435612 435341 434845 433906 432519 431070 430014 429262 428212 426518 424544
51472 424544 422923 421846 420961 419689 417458 413803 408649 402547 396432 390987 386307 382218 378713 375990
51458 375990 374124 372957 372324 372206 372600 373412 374644 376582 379585 383666 388436 393467 398606 404004 410024
51443 410024 417124 425656 435721 447304 460402 474728 489289 502598 513506 521728 527610 531693
51431 531693 534539 536499 537388 536561 533492 528027 520057 509508 497057 484391 473094 463419 454614 446325
51417 446325 439070 433378 429074 425672 423024 421299 420580 420727 421501 422638 423924 425261 426601 427837 428909
51402 428909 430038 431640 433979 437023 440604 444562 448787 453342 458449 464113 469884 475410 481225 488516
51388 488516 498000 509370 522087 536295 552648 571552 593051 617454 645624 678449 716134 758129
51376 758129 803710 852507 904388 958792 1014050 1067157 1114061 1150563 1173687 1182692 1178698 1163208
51364 1163208 1137252 1101982 1059416 1011930 961342 909057 856807 806346 758505 713358 671480
51353 671480 634174 602101 574471 550078 528601 510373 495382 483072 472803 464008 456152 449007
51341 449007 442749 437465 432867 428856 425918 424397 423760 423204 422731 422921 423791 424616 424876 424705 424319 423608 422453
51324 422453 420860 418652 415571 411920 408533 405772 403053 399782 396374 393869 392731 392531 392708 393210 394344
51309 394344 396311 398991 401932 404468 405969 406175 405266 403664 401834 400295 399584 399921 400843 401365 400782 399279
51293 399279 397598 396155 394749 393157 391619 390534 390042 390244 391535 394207 397792 401271 404060 406538 409589
51278 409589 413914 419747 426781 434180 440900 446197 449723 451210 450532 448264 445779 444381 444398 445316 446610
51263 446610 448150 449871 451484 452681 453471 454030 454187 453291 450852 447273 443597 440343 436890 432382 427001
51248 427001 421843 417555 413646 409404 404978 401205 398625 397056 396045 395379 395159 395511 396285 397024 397430 397883
51232 397883 399153 401397 403767 405326 406053 406535 406898 406651 405542 403972 402418 400945 399583 398712 398664 399203
51216 399203 399794 400289 400950 401943 403140 404405 405675 406763 407462 407987 408961 410782 413252 416006 418994 422244
51200 422244 425441 428181 430521 432850 435223 437221 438536 439325 439851 440105 439981 439472 438466 436632 433897
51185 433897 430885 428543 427225 426393 425197 423269 421005 419246 418634 419150 420271 421611 423256 425370 427714
51170 427714 429780 431249 432069 432230 431767 430845 429567 427812 425678 423988 423794 425214 427213 428781 429955
51155 429955 431321 432870 433894 434011 433724 433703 433824 433288 431663 429480 427633 426471 425694 424954 424171 423309 422315
51138 422315 421438 421187 421655 422299 422724 423374 424896 427071 428974 430104 430744 431198 431367 431285 431451 432212 433282
51121 433282 434228 435122 436304 437776 439243 440613 442064 443717 445554 447616 449973 452511 454963 457170 459202
51106 459202 461244 463476 465997 468722 471383 473730 475741 477630 479733 482341 485407 488406 490685 491979
51092 491979 492390 491926 490495 488436 486588 485514 484999 484562 484129 483825 483530 483154 483065 483668 484662 485318 485495 485856
51074 485856 486895 488319 489599 490750 492218 494259 496822 499908 503788 508819 515300 523503 533702 546084
51060 546084 560718 577679 597167 619307 643646 668751 692434 712572 728057 739280 747914 756062
51048 756062 765157 775331 785629 794699 801361 804957 805590 803873 800020 793364 783353 771020 758762
51035 758762 748397 740028 732912 726490 719903 711401 699445 684320 667768 651142 634773 619074
51023 619074 605246 594433 586854 582163 580114 580461 582717 586545 592126 599761 609276 620138 631978
51010 631978 644681 658063 671655 684750 696566 706583 714921 722188 728763 734351 738358 740488 740804
50997 740804 739437 736543 732486 727831 723074 718500 714247 710416 707195 704961 704207 705319 708435 713541
50983 713541 720615 729700 740959 754713 771275 790650 812387 835654 859440 882901 905807 928609
50971 928609 951938 976208 1001933 1030168 1062087 1098214 1138498 1183121 1232509 1286467 1343979
50960 1343979 1404237 1467391 1533818 1603020 1673524 1743423 1810667 1873356 1930443 1981938 2027895
50949 2027895 2067511 2099822 2124960 2143929 2157256 2164807 2167172 2166392 2164803 2163597 2162784 2161916 2160193
50936 2160193 2156282 2148909 2137832 2123868 2107935 2090402 2071285 2050569 2028023 2002980 1974541 1941929
50924 1941929 1904609 1862383 1815623 1765243 1712145 1656793 1599603 1541564 1484029 1427922 1373661
50913 1373661 1321999 1274320 1231610 1193515 1158925 1127236 1098482 1072443 1048403 1025942 1005273
50902 1005273 986549 969350 953196 938155 924629 912877 903040 895246 889274 884453 880312 877082
50890 877082 875108 874062 873253 872572 872515 873334 874711 876355 878404 881092 884461 888534 893449 899224 905739
50875 905739 913130 921870 932289 944305 957761 972639 988625 1004868 1020769 1036914 1054804 1075611
50863 1075611 1099481 1125968 1154667 1185306 1217763 1252515 1290836 1334053 1382523 1435776 1493835
50852 1493835 1558088 1630546 1712420 1803721 1904035 2013206 2131150 2257471 2391531 2532669
50842 2532669 2680036 2832274 2987544 3143724 3298368 3448468 3590449 3720429 3834567
50833 3834567 3929618 4003661 4056467 4088984 4102489 4098435 4079034 4047533 4007626 3962692 3915843
50822 3915843 3870461 3830169 3797830 3774498 3759363 3750560 3745797 3742225 3736183 3723629 3701021 3665784
50810 3665784 3616204 3551327 3471165 3376726 3269646 3151770 3025078 2891747 2754125 2614779
50800 2614779 2476609 2342699 2215831 2098105 1990805 1894341 1808342 1732232 1665833 1609103
50790 1609103 1561287 1520905 1486859 1459060 1437610 1421860 1410713 1403351 1398988 1396275 1393768 1390964
50778 1390964 1388238 1385759 1383014 1379404 1374633 1368428 1360504 1351043 1340707 1329862 1318182 1305192 1290876
50765 1290876 1275523 1259392 1242820 1226298 1210067 1193838 1177263 1160601 1144680 1130246 1117503
50754 1117503 1106273 1096535 1088770 1083745 1081882 1083036 1087036 1094239 1105267 1120333 1139149 1161345 1186609
50741 1186609 1214671 1245743 1280858 1321078 1366340 1415707 1468783 1526079 1587741 1652801 1720190
50730 1720190 1789803 1861970 1936420 2012417 2089438 2167008 2244102 2319425 2392141 2461769 2527492
50719 2527492 2588130 2642568 2689468 2726499 2750585 2759347 2752306 2730834 2697433 2655162 2607371 2557507
50707 2557507 2508909 2464404 2425818 2394027 2369576 2352952 2343900 2340805 2341282 2343217 2344866 2344214 2338963
50694 2338963 2327075 2306774 2276085 2233319 2178480 2113732 2042126 1966175 1887864 1809467 1733669
50683 1733669 1662837 1598452 1541114 1490891 1447722 1411755 1383318 1362493 1348843 1341688 1340632 1345635
50671 1345635 1356587 1372882 1393404 1416867 1442126 1468236 1494376 1519881 1544325 1567373 1588525
50660 1588525 1607202 1623274 1637360 1650552 1663998 1678714 1695261 1713270 1731667 1749805 1768111
50649 1768111 1787235 1807021 1827061 1848047 1871571 1898421 1927945 1959439 1993435 2031019 2072456
50638 2072456 2117045 2163958 2212521 2261931 2311335 2360204 2408203 2454787 2499440 2542263 2583781
50627 2583781 2624174 2663245 2701231 2738690 2774678 2805095 2823639 2825046 2807866 2774746 2730873
50616 2730873 2682272 2634614 2592221 2557405 2530680 2511709 2499914 2494347 2493492 2495531 2498575 2500423
50604 2500423 2498484 2490468 2475006 2451238 2418074 2374551 2321027 2259426 2192063 2120616 2046474 1971447
50592 1971447 1897437 1825490 1755637 1687806 1622629 1561265 1504576 1452588 1404745 1360565 1319972
50581 1319972 1283074 1249910 1220622 1195595 1175069 1158643 1145514 1135247 1128062 1124383 1124417 1128064
50569 1128064 1134776 1143479 1153144 1163703 1175958 1190450 1206852 1224711 1244254 1266040 1290155 1316157
50557 1316157 1343518 1371697 1400104 1428466 1457029 1486048 1515313 1544576 1574092 1604169 1634369
50546 1634369 1663842 1692395 1720603 1748916 1777376 1806400 1837172 1870898 1908069 1948763 1993297
50535 1993297 2042300 2096403 2156117 2221719 2293007 2369408 2450680 2537298 2629929 2728733 2833441
50524 2833441 2943846 3059716 3180185 3303514 3427478 3549739 3667844 3779187 3881245
50515 3881245 3971818 4048979 4110807 4155263 4180422 4184969 4168610 4132131 4077123 4005737 3920592
50504 3920592 3824708 3721359 3614069 3506792 3403973 3310139 3229175 3163746 3115185 3083804
50494 3083804 3069382 3071399 3088806 3119538 3160274 3206651 3253583 3295467 3326499 3341313 3335695 3306899
50482 3306899 3253750 3176889 3079063 2964834 2839558 2708317 2575523 2444956 2319624 2201365
50472 2201365 2090859 1988264 1893827 1807755 1729663 1658486 1593065 1532778 1477577 1427656 1383194
50461 1383194 1344272 1310783 1282375 1258532 1238805 1223001 1211254 1203914 1201245 1203063 1208623 1216898
50449 1216898 1227037 1238677 1251961 1267307 1285079 1305418 1328405 1354277 1383247 1415012 1448362
50438 1448362 1481226 1511048 1535452 1553076 1564038 1569455 1570528 1568300 1564190 1560065 1557257 1555687 1554398
50425 1554398 1552873 1551576 1551415 1553107 1557127 1563847 1573550 1586459 1602861 1623089 1647427 1676165 1709697
50412 1709697 1748373 1792251 1841088 1894474 1951798 2012194 2074710 2138453 2202340 2264823 2324237
50401 2324237 2379414 2429739 2474636 2513262 2544646 2567768 2581432 2584336 2575404 2553979 2519860 2473495
50389 2473495 2416180 2349906 2277127 2200844 2124559 2051467 1983611 1922236 1868819 1825053 1791704
50378 1791704 1768245 1753897 1748386 1751213 1760820 1775193 1792867 1812513 1831617 1846346 1853056 1849725
50366 1849725 1835986 1812289 1779306 1737997 1689967 1637570 1583414 1529651 1477792 1429184 1385270
50355 1385270 1347130 1315000 1288436 1266686 1248582 1232323 1215798 1197164 1175070 1148759 1118497
50344 1118497 1085785 1052709 1021049 992184 967461 947881 933380 922971 915748 911317 909263 908822
50332 908822 909460 911379 915023 920281 926464 932932 939564 946703 954797 963943 973634 983106 992016 1000681
50318 1000681 1009569 1018748 1027890 1036564 1044347 1050873 1056039 1060134 1063629 1066890 1070161 1073635 1077378 1081313
50304 1081313 1085513 1090477 1096974 1105493 1115924 1127873 1141349 1157114 1176249 1199389 1226639 1258298
50292 1258298 1295274 1338455 1387805 1442207 1499224 1553839 1597680 1621450 1619860 1594530 1552042
50281 1552042 1499804 1443901 1389283 1339760 1297209 1261721 1233009 1211105 1195504 1184581 1176562
50270 1176562 1170786 1167556 1167078 1168973 1172586 1177308 1182817 1189348 1197603 1208002 1220166 1233491 1248035
50257 1248035 1264369 1282606 1301999 1321488 1340168 1357210 1371973 1384597 1396150 1407781 1419755
50246 1419755 1431394 1441683 1449649 1454394 1455218 1451765 1444013 1432250 1417232 1400179 1382317 1364548
50234 1364548 1347792 1333406 1322713 1315942 1311904 1308629 1303927 1295456 1281144 1260269 1233989 1204389
50222 1204389 1173082 1141002 1109156 1078813 1050798 1025060 1001223 979212 959129 940800 923851
50211 923851 908131 893780 880906 869451 859397 850826 843619 837282 831264 825453 820156 815591 811584
50198 811584 807842 804307 801045 797917 794654 791208 787758 784346 780821 777206 773765 770504 766978 762894
50184 762894 758645 754853 751599 748548 745680 743363 741696 740300 738871 737466 736082 734443 732535 730972
50170 730972 730455 731060 732381 734136 736312 738827 741437 743961 746415 748982 752063 756213 761767 768540 776079
50155 776079 784183 793057 803183 815224 829859 847349 867321 889286 913281 939666 968357 998783
50143 998783 1030752 1064909 1101973 1141678 1182708 1223597 1263508 1302301 1340157 1377286 1413868
50132 1413868 1450172 1486513 1522883 1558456 1591458 1619575 1640524 1652381 1653695 1643685 1622577
50121 1622577 1591750 1553373 1509675 1462515 1413611 1364917 1318334 1275003 1235216 1199185 1167408
50110 1167408 1139992 1116026 1094258 1074213 1056090 1039693 1024193 1009101 994801 981784 969869
50099 969869 958551 947707 937478 927706 917959 908013 898007 888253 879178 871288 864835 859646 855524
50086 855524 852673 851447 851820 853465 856195 859983 864621 869798 875432 881540 887797 893666 899029 904312
50072 904312 909930 915959 922372 929120 935793 941666 946305 949797 952274 953653 954119 954328 954622 954368 952650
50057 952650 949393 945278 940698 935528 929976 924935 921112 918263 915762 913675 912811 913754 916186 919253 922450
50042 922450 926144 931353 938966 949033 960799 973533 987172 1002059 1018182 1035031 1052227 1069919
50030 1069919 1088409 1107759 1128100 1150044 1174176 1200101 1226515 1252507 1278382 1304872 1331875
50019 1331875 1358439 1383785 1407694 1429880 1449557 1465946 1478743 1487793 1492756 1493645 1491420 1487366
50007 1487366 1481665 1472865 1458850 1438184 1410621 1376866 1338185 1296152 1252545 1209402 1168905 1132804
49995 1132804 1101731 1075272 1052786 1033935 1018311 1005003 992939 981560 970808 960560 950365
49984 950365 939722 928223 915395 900858 884837 868269 852079 836499 821335 806721 793293
49973 793293 781613 771737 763353 756061 749429 743086 737023 731625 727199 723547 720183 716847 713605 710574
49959 710574 707831 705526 703786 702528 701772 702203 704916 710335 717736 726164 735418 745632 756222 765955
49945 765955 774069 780696 786145 790449 793794 796694 799268 800920 801243 800753 800042 798591 795159 789113 780608
49930 780608 769604 755790 739759 723374 708423 695378 683886 673869 665595 659137 654430 651582
49918 651582 650545 650716 651455 652841 655286 658537 661750 664555 667394 670719 674507 678792 684039 690611 698252
49903 698252 706428 714867 723587 732775 742873 754294 766719 779054 790438 800855 810417 818516 824303
49890 824303 827627 828823 827812 824090 817581 808846 798420 786516 773471 759903 746303 732944 720319
49877 720319 709110 699421 690475 681452 672447 664406 658262 654213 651544 649148 646559 644552 644347 646135
49863 646135 648891 651822 655418 660702 667895 676305 685245 694634 704864 716469 729719 744146 758606
49850 758606 772091 784332 795323 804602 811468 815804 818221 819378 819444 818121 814876 809218 801065 790872
49836 790872 779274 766809 754125 742066 731179 721458 712976 706332 701918 699109 696943 695368 694986
49823 694986 695686 696509 697072 698231 701017 705693 712247 720957 731824 743885 755778 766728 776618 785444
49809 785444 793228 800219 806709 812728 818119 822703 826084 827634 827026 824588 820857 816079 810384 804082
49795 804082 797373 790031 781727 772393 762017 750510 738216 726129 715027 704726 694792 685686 678471
49782 678471 673553 670391 668349 667115 666309 665490 664719 664499 664999 665962 667522 670416 675011 680718 686806 693330
49766 693330 700748 708922 717038 724390 730858 736592 741529 745331 747747 749051 750010 751181 752223 752125 750066
49751 750066 745789 739287 730717 720751 710510 700827 691957 684168 678096 674114 671756 670283 669537 669776
49737 669776 670848 672059 672833 673139 673377 674247 676634 681134 687469 694631 701645 708032 713661 718565 723044
49722 723044 727713 733328 740669 750456 763012 777840 793767 809619 824616 838152 849518 858028
49710 858028 863171 864474 861516 854479 844641 833925 823816 814794 806864 800316 795756 793491 793152 793940
49696 793940 795037 795650 794877 791875 786333 778825 770734 763785 759328 757733 758309 760021 762401 765840 771079
49681 771079 778539 788110 799351 811868 825706 841514 860195 882198 907047 933358 959055 981516
49669 981516 997976 1006447 1006684 1000395 990477 979890 970895 964924 962728 964479 969789 977864 987553 996930
49655 996930 1002802 1001408 990444 970653 945141 917270 889414 863290 840361 821414 806211 794008
49643 794008 784126 775920 768795 762842 759077 758408 760453 763812 767310 770494 773063 774503 774479 773098 770522
49628 770522 766555 760901 753663 745451 737008 728794 720908 713438 706785 701468 697516 694319 691264 688380
49614 688380 686154 684863 684338 684256 684475 685107 686399 688373 690527 692173 693201 694183 695482 696728 697557 698392
49598 698392 699860 701717 703109 703778 704295 705108 706060 706958 707909 708959 710020 711351 713440 716083 718172 718842
49582 718842 718396 717743 717356 717240 717505 718469 720345 723104 726494 729985 733047 735838 739289 744210 750580 758013
49566 758013 766515 776356 787480 799481 811886 823950 834429 842182 846989 849372 849746 848171 844819
49553 844819 840131 834508 828293 822038 816320 811298 806984 803842 802515 802771 803411 803570 803673 804676 806718
49538 806718 808914 810285 810592 810491 811215 813872 818667 824874 831887 840165 850767 864073 879461 896316
49524 896316 914914 935968 959559 984774 1010135 1033946 1054321 1069545 1078957 1083477 1084993 1085266
49512 1085266 1085529 1086934 1090721 1097616 1107280 1118634 1130522 1141719 1150427 1154385 1151813 1142202 1126199
49499 1126199 1105040 1080281 1053757 1027355 1002590 980412 961252 945066 931410 919770 909939
49488 909939 901926 895449 889756 884212 878970 874804 872301 871464 872102 874180 877507 881325 884650 887022 888707
49473 888707 890220 891897 893862 896025 898062 899790 901622 904251 907753 911465 914975 918692 923003 927370
49459 927370 931008 934211 938138 943171 948141 951512 952779 952382 950728 947882 944003 939491 934733 930021
49445 930021 925804 922622 920618 919362 918364 917656 917677 918676 920484 922944 926283 930794 936283 942199 948382
49430 948382 955426 964134 974916 988008 1004066 1024008 1048134 1075606 1105012 1135462 1167131 1200672
49418 1200672 1235613 1268765 1294244 1305944 1301086 1282023 1254751 1225624 1198997 1177056 1160850
49407 1160850 1150960 1147404 1149441 1155893 1165715 1178133 1192333 1207317 1222251 1236825 1251077 1264909
49395 1264909 1277975 1290020 1301191 1311876 1322199 1331606 1339022 1343601 1345295 1344471 1341027 1334324 1324215
49382 1324215 1311665 1297978 1283764 1269119 1254391 1240184 1226811 1214486 1203964 1196208 1191365 1188736
49370 1188736 1187893 1189053 1192183 1196537 1201479 1206966 1212679 1217412 1220087 1220909 1220748 1219752 1217307 1213110 1207452
49355 1207452 1200572 1192557 1183974 1175906 1169145 1163771 1159553 1156231 1153368 1150497 1147615 1145116 1143092 1141094
49341 1141094 1138631 1135486 1131484 1126475 1120667 1114521 1108159 1101382 1094440 1088231 1083466 1080206 1078554 1079253
49327 1079253 1083132 1090406 1101009 1115189 1133131 1154170 1176869 1199562 1220227 1236198 1245044 1246091
49315 1246091 1240684 1230855 1218177 1203770 1188503 1172664 1155884 1137947 1119545 1101920 1085977 1072028
49303 1072028 1060220 1050715 1043436 1037971 1033932 1031356 1030693 1032438 1036708 1042987 1050245 1057350 1063517 1068467
49289 1068467 1072242 1074900 1076321 1076265 1074617 1071505 1067143 1061647 1055114 1047818 1040248 1033073 1027187 1023564
49275 1023564 1022628 1023726 1025602 1027521 1029688 1032511 1035882 1039415 1042935 1046326 1049123 1050714 1050888 1049906 1048193
49260 1048193 1046383 1045425 1046066 1048250 1051660 1057069 1066536 1081793 1102651 1127262 1153643 1180538 1206951
49247 1206951 1231294 1251182 1264058 1268249 1263711 1251838 1234546 1213579 1190556 1167148 1144896 1124956
49235 1124956 1108079 1094510 1083754 1075004 1068284 1064754 1065262 1068891 1073636 1078401 1083534 1089407 1095435
49222 1095435 1100900 1105973 1111314 1117081 1122982 1128994 1135487 1142739 1150801 1159707 1169351 1179222 1188698 1197686
49208 1197686 1206649 1216010 1225837 1236215 1247625 1260707 1275657 1291920 1308527 1324835 1340999 1357534
49196 1357534 1374367 1390567 1405184 1418106 1429827 1440633 1450356 1458797 1465993 1472169 1477719 1483231
49184 1483231 1489169 1495599 1502499 1510259 1519505 1530560 1543584 1559236 1578655 1602624 1631193 1664306
49172 1664306 1702359 1745849 1794810 1848739 1906468 1965474 2021412 2068969 2103678 2123362 2128565
49161 2128565 2122222 2108750 2092707 2077552 2065152 2056014 2049749 2045477 2042183 2038998 2035391 2031373 2027568
49148 2027568 2024907 2024072 2025270 2028471 2033580 2040351 2048499 2058096 2069547 2082920 2097541 2112594 2127955
49135 2127955 2144112 2161333 2179203 2196917 2213828 2229845 2245534 2261838 2279423 2298272 2318016
49124 2318016 2338445 2359545 2381274 2403734 2427441 2453018 2480635 2510101 2541591 2575949 2614270
49113 2614270 2657557 2706984 2764270 2831671 2911789 3007524 3121941 3257648 3415474 3592403
49103 3592403 3779880 3965111 4136964 4293175 4441540 4591084 4739019 4865482 4942717 4952383
49093 4952383 4896908 4796059 4672698 4539934 4398456 4243197 4071946 3889458 3705778 3531593
49083 3531593 3374447 3237817 3122263 3026621 2948356 2884056 2830720 2786724 2751223 2722855 2699476
49072 2699476 2679039 2660238 2642409 2625343 2609248 2594399 2580728 2568159 2557166 2548350 2541339 2534896
49060 2534896 2528379 2522432 2517803 2514117 2510399 2506380 2502629 2499673 2497626 2496508 2496351 2497070 2498700 2501620
49046 2501620 2506090 2511709 2517834 2524312 2531094 2537218 2541008 2541630 2539805 2536743 2532991 2528857 2525425 2524302
49032 2524302 2526279 2530766 2536637 2543293 2550665 2558421 2565482 2570476 2572617 2572162 2570087 2567406 2564769 2562461
49018 2562461 2560621 2559490 2559534 2561208 2564498 2568860 2573799 2579357 2585810 2593018 2600407 2607498 2614108 2620090
49004 2620090 2625342 2630169 2635274 2641162 2647732 2654513 2660998 2666651 2670968 2673781 2675341 2675890 2675327 2673404
48990 2673404 2670024 2665241 2659241 2652493 2645578 2638674 2631540 2624225 2617355 2611354 2605760 2599880 2593851 2588436
48976 2588436 2583890 2579638 2575065 2570032 2564550 2558620 2552610 2547140 2542245 2537180 2531493 2525880 2521455 2518562
48962 2518562 2516833 2516202 2517189 2520224 2525287 2532271 2541156 2551692 2563417 2576273 2590816 2607488 2626032
48949 2626032 2645962 2667380 2690910 2716873 2744780 2773613 2802334 2830264 2857280 2883772 2910286
48938 2910286 2937221 2964954 2994061 3025167 3058648 3094736 3133801 3176121 3221322 3268464 3316864
48927 3316864 3366626 3418265 3472128 3528344 3586895 3647387 3709001 3771120 3833920 3897994 3963428
48916 3963428 4029513 4095332 4160256 4223871 4285746 4345498 4402908 4457873 4510356 4560407 4608053
48905 4608053 4653095 4695169 4734120 4770288 4804350 4836943 4868285 4897946 4924976 4948462 4968097
48894 4968097 4984148 4996865 5006088 5011453 5012891 5010898 5006373 5000070 4992025 4981537 4967873 4950936 4931141
48881 4931141 4908862 4884384 4858208 4830822 4802085 4771363 4738429 4703666 4667026 4627359 4583403
48870 4583403 4535201 4483983 4430740 4375499 4318083 4259112 4200047 4142415 4087141 4034358 3983667
48859 3983667 3934645 3887260 3841946 3799342 3759883 3723417 3689217 3656654 3626008 3598262 3573874
48848 3573874 3552105 3531936 3513318 3497090 3483837 3473392 3465346 3459531 3456016 3455201 3457889 3464662 3474994
48835 3474994 3487540 3501484 3517080 3534595 3553359 3572384 3591484 3611226 3632028 3653810 3676345
48824 3676345 3699407 3722636 3745716 3768685 3791703 3814592 3837017 3859055 3881074 3903007 3924246
48813 3924246 3944445 3964055 3983778 4003810 4023881 4043790 4063613 4083620 4104294 4126268 4149806
48802 4149806 4174338 4198900 4223185 4247915 4273947 4301192 4328676 4355572 4381796 4407440 4431930
48791 4431930 4454106 4473166 4489268 4503187 4515629 4526951 4537196 4546007 4552674 4556600 4557722 4556155
48779 4556155 4551350 4541892 4526348 4504186 4475874 4442389 4404809 4364110 4320894 4275230 4226902 4175914
48767 4175914 4122710 4068017 4012639 3957326 3902557 3848334 3794357 3740571 3687416 3635478 3585004
48756 3585004 3535991 3488723 3443946 3402366 3364113 3328836 3296145 3265728 3237109 3209788 3183871
48745 3183871 3160304 3140088 3123282 3109090 3096970 3087307 3080841 3077697 3077202 3078432 3080641 3083258 3085871
48732 3085871 3088379 3091002 3094000 3097459 3101353 3105699 3110538 3115814 3121337 3126866 3132234 3137420 3142454 3147137
48718 3147137 3150902 3153158 3153886 3153790 3153738 3154069 3154513 3154719 3154773 3155193 3156483 3158721 3161582 3164721 3168060 3171648 3175320
48701 3175320 3178698 3181581 3184210 3187024 3190236 3193796 3197763 3202613 3209027 3217351 3227247 3237874 3248378
48688 3248378 3258172 3266822 3274012 3279843 3285059 3290614 3296922 3303737 3310763 3318055 3325679 3333310 3340467 3347008
48674 3347008 3353139 3358979 3364322 3368785 3372036 3373951 3374789 3375141 3375418 3375206 3373132 3367404 3356545 3339838
48660 3339838 3317252 3288991 3255174 3216092 3172673 3126215 3077449 3026292 2972987 2919259 2867791
48649 2867791 2820616 2778365 2740903 2708001 2679240 2653793 2630736 2609357 2589037 2569067 2548852
48638 2548852 2528166 2507137 2486056 2465153 2444406 2423637 2403028 2383312 2365056 2347841 2330631
48627 2330631 2312835 2294517 2275692 2256261 2236755 2218328 2201580 2186091 2171535 2158576 2148077
48616 2148077 2140026 2133905 2129631 2127340 2126634 2126814 2127674 2129365 2131658 2134060 2136505 2139145 2141462 2142340 2141226
48601 2141226 2138688 2135785 2133422 2132354 2133114 2135582 2138985 2142472 2145392 2147071 2146853 2144508 2140144 2133641
48587 2133641 2124644 2113265 2100282 2086421 2071790 2056248 2039930 2023208 2006428 1989863 1973727
48576 1973727 1958183 1943533 1930309 1918849 1908925 1900273 1893313 1888723 1886333 1885180 1884708 1885161 1886615
48563 1886615 1888491 1890278 1891819 1892359 1890222 1884261 1875017 1863639 1850181 1834009 1815642 1797174 1780703
48550 1780703 1766967 1755506 1745438 1735832 1725878 1715146 1703569 1691127 1677695 1663215 1647818 1631798
48538 1631798 1615659 1600100 1585698 1572550 1560353 1548855 1538226 1529122 1522454 1518832 1518135 1519828
48526 1519828 1523803 1530566 1540520 1553450 1568814 1585788 1602434 1615273 1620632 1616747 1604477 1586325
48514 1586325 1565149 1543478 1523223 1505624 1491514 1481518 1475819 1473960 1475305 1479750 1487716 1499469
48502 1499469 1514564 1531898 1550232 1568883 1587882 1607011 1624485 1637046 1641777 1637718 1625770 1607849
48490 1607849 1586500 1564420 1543245 1522902 1502710 1482717 1463431 1444818 1426548 1408968 1392883
48479 1392883 1378545 1365740 1354658 1345624 1337997 1330498 1322875 1316214 1311252 1307361 1303641 1300090 1297130
48466 1297130 1294749 1292823 1291687 1291663 1292463 1293747 1296003 1300189 1306531 1314048 1321236 1327022 1331288 1334654 1337609
48451 1337609 1339700 1339844 1337479 1333028 1327208 1320476 1313399 1306873 1301425 1296667 1291899 1286886 1281570 1275378
48437 1275378 1267492 1257718 1246633 1235024 1223629 1213221 1204215 1196064 1187665 1178707 1170210 1163342 1157908
48424 1157908 1152536 1146315 1139711 1133631 1128043 1122110 1115461 1108574 1101853 1095156 1088569 1082841 1078325 1074086
48410 1074086 1068908 1062831 1056814 1051247 1045832 1040776 1036894 1034333 1032280 1030306 1028953 1028500 1028091 1026752
48396 1026752 1024569 1022151 1019548 1016461 1013119 1010134 1007704 1005553 1003516 1001670 999998 998396 997015 996339
48382 996339 996878 998798 1001659 1004508 1006601 1008143 1009944 1012320 1014785 1016873 1018703 1020520 1022273 1023992
48368 1023992 1026113 1029235 1033919 1040803 1050319 1062114 1075418 1090178 1107199 1126986 1149161 1173146
48356 1173146 1198386 1223404 1245564 1262596 1273892 1280076 1282231 1282171 1282483 1285188 1290634 1298292 1308262
48343 1308262 1321422 1338536 1359733 1384628 1412727 1444128 1479853 1520903 1567122 1617922 1673976
48332 1673976 1736910 1807458 1885568 1972473 2070851 2182710 2309265 2453499 2620623 2815402
48322 2815402 3041749 3306259 3619924 3995680 4447720 4994785 5660927 6472228 7458023
48313 7458023 8657314 10116891 11877904 13967712 16397421 19128495 21992190 24631061
48305 24631061 26566243 27393613 26973004 25467276 23224868 20620318 17954844 15430243
48297 15430243 13159415 11187702 9517142 8126522 6982469 6046118 5280193 4653375
48289 4653375 4139217 3714396 3360368 3064729 2818574 2613285 2440813 2295220 2172025
48280 2172025 2066988 1976756 1899599 1834191 1778553 1731090 1691503 1659436 1633140 1610586 1591087
48269 1591087 1574807 1561436 1550410 1541739 1535506 1531038 1527493 1524876 1523736 1524311 1526579 1530633 1536291
48256 1536291 1542850 1549873 1557824 1567235 1577548 1587161 1594178 1596814 1593834 1585316 1572630 1557264 1540162
48243 1540162 1522432 1505727 1491126 1478282 1466394 1455443 1445775 1437168 1429234 1422259 1416685 1412084
48231 1412084 1407456 1402311 1396687 1390382 1383004 1374626 1365638 1356032 1345493 1334016 1321742 1308349 1293296
48218 1293296 1276585 1258587 1239264 1218308 1195947 1172870 1149342 1125115 1100280 1075450 1050984
48207 1050984 1026702 1002580 979102 956723 935507 915504 896914 879650 863331 847918 833847
48196 833847 821224 809462 798089 787388 777781 769015 760541 752433 745333 739602 734983 731005 727265
48183 727265 723377 719194 715130 711858 709516 707552 705450 703268 701256 699322 697217 695037 693140 691655
48169 691655 690461 689616 689421 689913 690618 691011 690984 690651 689926 688601 686804 685106 684133 684211 685263 686805 688063
48152 688063 688418 687912 687206 686994 687500 688485 689597 690677 691849 693288 694867 696092 696569 696447 696301 696656 697766
48135 697766 699567 701579 703046 703676 704168 705568 708109 711098 713927 716650 719484 722391 725398 728758 732369
48120 732369 735518 737695 739300 741056 743112 745327 748151 752431 758240 764594 770584 776343 782575 789452
48106 789452 796415 803004 809550 816916 825661 835591 846118 856957 868311 880460 893367 906820 920777
48093 920777 935462 951129 967758 984904 1001948 1018713 1035667 1053188 1070687 1087007 1101832
48082 1101832 1116055 1130410 1144334 1156816 1167922 1178677 1189578 1200061 1209524 1218189 1226652 1235186
48070 1235186 1243815 1252656 1261696 1270521 1278673 1286235 1293746 1301598 1309711 1317730 1325300 1332118 1337882 1342226
48056 1342226 1344716 1345103 1343750 1341646 1339549 1337050 1332772 1325798 1316611 1306381 1295522 1283524 1270207
48043 1270207 1256447 1243201 1230224 1216345 1200883 1184264 1167252 1150155 1132895 1115343 1097385
48032 1097385 1079031 1060666 1042864 1025813 1009248 992987 976979 960773 943657 925800 908535
48021 908535 892863 878187 863293 848154 833856 820952 808922 797341 786621 777235 768837 760594
48009 760594 751993 743062 734236 726229 719554 713893 708283 702213 696218 691126 687127 683895 681301 679574
47995 679574 678927 679291 680256 681094 681086 680137 678875 677905 677199 676505 676024 676160 676747 677061 676639 675690 674601 673466
47977 673466 672264 671128 670111 668945 667370 665630 664293 663532 662940 662134 661276 660716 660362 659805 659039 658587
47961 658587 658752 659095 658945 658195 657300 656660 656396 656641 657655 659539 662128 665245 668885 673067 677729 682822
47945 682822 688312 694035 699749 705454 711556 718631 727007 736514 746571 756541 766172 775650 785250 795061
47931 795061 805073 815138 824610 832427 838058 842147 845743 849022 851294 852070 851399 849241 845381 840204
47917 840204 834785 829774 824711 818811 811874 804042 795265 785631 775771 766344 757389 748698 740559 733552
47903 733552 727818 723146 719614 717551 716796 716539 716058 715356 715085 716037 718590 722313 726229 729754 733256 737406
47887 737406 742234 747255 752310 757729 763801 770574 778125 786431 794956 802959 810307 817441 824400 830431
47873 830431 834855 837888 840291 842556 844611 845999 846073 844333 840880 836338 831146 825135 817916 809417 799899
47858 799899 789803 779748 770225 760953 750936 739625 727820 716940 707588 699275 691471 684339 678286
47845 678286 673305 669072 665461 662638 660703 659523 658985 659263 660653 663141 666238 669350 672284 675374 679145
47830 679145 683886 689432 695159 700286 704466 708191 712435 717753 723802 729800 735308 740517 745938 751934
47816 751934 758511 765470 772742 780582 789470 799920 812440 827361 844397 862567 881121 900553
47804 900553 922173 946417 972000 996948 1020024 1040829 1059003 1074013 1085555 1093614 1098151 1099225
47792 1099225 1097346 1093136 1086583 1077226 1065291 1052125 1039069 1026375 1013721 1001478 990723 981897
47780 981897 974136 966334 958455 951343 945500 940668 936583 933434 931201 929033 925887 921598 916791 911782
47766 911782 906093 899147 890936 881811 872038 861848 851618 841680 832116 822925 814141 805705 797621 790536
47752 790536 785663 783572 783320 783320 782935 782697 783171 784330 786093 788694 792212 796343 801060 807063 815109 825121
47736 825121 836416 848600 861803 876112 891240 906897 923158 940178 957655 974779 990838
47725 990838 1005784 1020029 1033661 1046055 1056466 1064794 1071386 1076192 1078581 1078123 1075133 1070159 1063329
47712 1063329 1054519 1043902 1031896 1018727 1004450 989336 973841 958214 942477 926850 911837
47701 911837 897805 884824 873056 862983 855005 848954 844245 840485 837781 836526 836967 838922 841927
47688 841927 845737 850721 857548 866417 876820 888172 900453 913946 928578 943829 959233 974599
47676 974599 989746 1004361 1018242 1031410 1043855 1055398 1065931 1075505 1083962 1090731 1095324 1097830
47664 1097830 1098592 1097547 1094306 1088846 1081624 1072876 1062288 1049693 1035742 1021509 1007568 993846 980248
47651 980248 966973 954202 941904 930150 919359 909960 901952 895076 889316 884948 882030 880080 878503
47638 878503 877275 877006 878354 881611 886882 894251 903418 913431 923402 933610 945414 959861 976767
47625 976767 995382 1015453 1037130 1060218 1084118 1108342 1132473 1155680 1176982 1196041 1212988
47614 1212988 1227236 1237126 1241217 1239452 1232632 1221179 1204988 1184137 1159126 1130522 1098928 1065234
47602 1065234 1030352 994721 958603 922893 889000 857719 828741 801565 776472 754213 735129
47591 735129 719003 705513 694223 684272 674689 665228 656501 649095 642840 637180 631909 627196 623060
47578 623060 619282 615823 612920 610625 608594 606567 604810 603765 603377 603083 602391 601174 599405 596956 593830
47563 593830 590340 586889 583696 580859 578446 576357 574217 571643 568641 565562 562718 560129 557617 555052
47549 555052 552469 550035 547874 545934 544071 542280 540702 539348 537967 536295 534380 532590 531373 530977
47535 530977 531248 531606 531434 530595 529514 528695 528348 528477 529044 529874 530700 531486 532443 533556 534411 534807 535186 536074
47517 536074 537381 538751 540283 542296 544474 545917 546159 545577 544747 543906 543163 542656 542293 541823 541433 541759 543037
47500 543037 544678 546005 546983 547870 548608 549038 549363 549851 550330 550457 550308 550258 550433 550771 551424 552611 554129 555519
47482 555519 556718 558108 559959 562228 564882 567952 571223 574355 577434 580965 585131 589473 593430 596826
47468 596826 599686 602030 604111 606456 609296 612236 614812 617109 619375 621296 622182 621911 621270 621218 622039 623350
47452 623350 624697 625964 627265 628690 630307 632410 635588 640275 646308 653179 660821 669829 680782 693641
47438 693641 708098 724225 742335 762240 783059 803888 824455 845118 866337 888123 909676
47427 909676 929560 946484 959974 970178 977142 980650 980774 978069 973044 965849 956784 946681 936308
47414 936308 925582 913904 901199 888154 875399 862952 850633 838575 826970 815561 803789
47403 803789 791440 778925 766900 755813 745845 737121 729749 723592 718148 712962 708242 704762 702817
47390 702817 701506 699544 696849 694836 695009 697649 702079 707672 714142 721237 728740 736677 745052 753463
47376 753463 761391 768824 776144 783483 790566 797117 802893 807320 809726 810057 808807 806136 801686 795536
47362 795536 788581 781432 773442 763489 751401 737990 723961 709497 694834 680509 666918 654122
47350 654122 642207 631358 621436 611966 602776 594286 586935 580560 574585 568609 562669 557127 552428 548802
47336 548802 546050 543825 542095 541130 540972 541247 541662 542360 543594 545333 547476 550177 553602 557495 561316
47321 561316 564735 567692 570080 571765 572935 574066 575379 576564 577154 576989 576216 575092 574005 573443 573553
47306 573553 573753 573163 571581 569796 568736 568519 568638 568899 569745 571628 574508 578179 582684 588012 593649 598955
47290 598955 603980 609508 616183 623899 632142 640622 649426 658842 669270 681095 694429 709052 724781
47277 724781 741780 760430 781041 803714 828042 852523 874424 890818 900138 902723 899997 893404
47265 893404 884071 873057 861446 850141 839666 830127 821272 812663 803987 795267 786711 778363 770041
47252 770041 761674 753519 745859 738562 731215 723771 716820 710977 706150 701655 697053 692618 689013 686711
47238 686711 685742 685734 686042 686146 686194 687066 689628 693935 699265 704873 710556 716560 723193 730582 738657 747308
47222 747308 756586 766742 777896 789704 801495 812785 823505 833686 843115 851450 858498 864163
47210 864163 868207 870291 870295 868418 864898 859808 853173 845179 836158 826549 816988 808227 800643 793901 787399
47195 787399 781097 775645 771611 768902 767080 765993 765819 766725 768831 772437 777880 785065 793385 802280 811753
47180 811753 822255 834129 847290 861487 876799 893728 912663 933253 954505 975510 995876
47169 995876 1015381 1033588 1050113 1065024 1078577 1090651 1100817 1108936 1115319 1120227 1123531 1124933
47157 1124933 1124270 1121547 1116915 1110702 1103220 1094519 1084579 1073771 1062852 1052403 1042492 1032890 1023308
47144 1023308 1013463 1003362 993659 985313 978693 973362 968961 965850 964559 964982 966545 968896 971984 975667
47130 975667 979788 984583 990478 997380 1004483 1010926 1016352 1020728 1023906 1025567 1025440 1023336 1019039 1012373
47116 1012373 1003531 993219 982280 971090 959437 947079 934237 921401 908851 896663 885002
47105 885002 873962 863149 851926 840217 828679 817948 808138 799167 791029 783472 775997 768530 761669
47092 761669 755804 750519 745365 740768 737437 735219 733342 731675 730931 731630 733645 736912 741779 748234 755310
47077 755310 761729 766928 771180 775037 778874 782761 786488 789851 793044 796605 800795 805185 809000 811797
47063 811797 813700 815059 815971 816203 815640 814764 814428 815025 816202 817635 819661 822707 826436 830150 833890 838416
47047 838416 844073 850377 856872 863661 870858 878203 885614 893485 901898 910039 917035 923065 929073 935593
47033 935593 942441 949509 957170 965717 974787 983683 992138 1000604 1009729 1019597 1029508 1038565 1046396 1053127
47019 1053127 1058802 1063189 1066239 1068281 1069527 1069726 1068643 1066611 1064235 1061649 1058390 1053920 1048088 1041213
47005 1041213 1033991 1027195 1021103 1015214 1008871 1002205 996195 991701 988716 986698 985440 985312 986702 989486
46991 989486 993187 997463 1002173 1007064 1011787 1016418 1021644 1028071 1035476 1043086 1050614 1058664 1068077 1079147
46977 1079147 1091512 1104572 1117946 1131699 1146096 1160937 1175362 1188724 1201483 1214656 1228348
46966 1228348 1241478 1253094 1263366 1272935 1281865 1289666 1295952 1300638 1303817 1305822 1307106 1307748 1307448 1306338
46952 1306338 1305311 1305044 1305079 1304565 1303644 1303428 1304669 1307110 1310141 1313555 1317554 1322457 1328501 1335601 1343323
46937 1343323 1351350 1359849 1368982 1378268 1386967 1395052 1403220 1411901 1420912 1430185 1440192 1451246 1462796
46924 1462796 1473789 1483435 1491315 1497108 1500615 1501907 1501052 1497796 1491779 1483092 1472347 1460225 1447079
46911 1447079 1432966 1417879 1401893 1385246 1368413 1352062 1336863 1323232 1311287 1301072 1292847
46900 1292847 1287090 1284250 1284584 1288167 1294837 1304102 1315367 1328434 1343629 1361273 1381168 1402737 1425470
46887 1425470 1449053 1473215 1497653 1521965 1545564 1567862 1588712 1608416 1627020 1643877 1658173
46876 1658173 1669695 1678782 1685835 1691239 1695536 1699125 1701984 1704164 1706421 1709815 1714770 1721076 1728761 1738254
46862 1738254 1749495 1761533 1773434 1785236 1797687 1811319 1826067 1841610 1857715 1874218 1890740
46851 1890740 1906516 1920646 1932702 1942901 1951504 1958193 1962394 1963947 1963084 1959972 1954859 1948558 1942052
46838 1942052 1935452 1927982 1919198 1909684 1900405 1891951 1884660 1878849 1874487 1871199 1869075 1868993 1871608 1876409
46824 1876409 1882411 1889479 1898350 1909471 1922481 1936813 1952172 1968238 1984401 2000079 2015022 2029029
46812 2029029 2041601 2052066 2059975 2065141 2067382 2066500 2062635 2056506 2049132 2041263 2033072 2024225 2014035
46799 2014035 2001739 1987249 1971821 1957477 1945243 1934247 1923019 1911371 1900394 1890887 1882671 1875462
46787 1875462 1869480 1864865 1861175 1857977 1855455 1853950 1853286 1852966 1852827 1853139 1854234 1856219 1858838 1861570 1864146
46772 1864146 1866998 1870709 1875013 1878965 1882237 1885503 1889220 1892925 1896306 1900196 1905711 1912937 1921306 1930799
46758 1930799 1941854 1954394 1967835 1981948 1996856 2012278 2027636 2042985 2059010 2075975 2093323
46747 2093323 2110452 2127140 2142950 2156936 2168436 2177804 2185903 2193105 2199047 2203243 2205759 2207294 2208625
46734 2208625 2209902 2210717 2211015 2211643 2213540 2216615 2219978 2223145 2226408 2230043 2233889 2237935 2242748 2248948 2256504
46719 2256504 2264750 2272804 2279870 2285516 2289906 2293526 2296492 2298247 2297958 2295012 2289218 2280821 2270310 2257912
46705 2257912 2243326 2226262 2207041 2186290 2164196 2140633 2115908 2090703 2065285 2039382 2012873
46694 2012873 1985913 1958361 1929987 1901520 1874568 1850006 1827126 1804943 1783583 1763736 1745364
46683 1745364 1727804 1710792 1694557 1679151 1664411 1650508 1637856 1626538 1616328 1607166 1599075 1591742
46671 1591742 1584777 1578371 1573114 1569204 1566422 1564958 1565597 1568834 1574249 1581012 1588668 1597223 1606795 1617462
46657 1617462 1629249 1642040 1655580 1669600 1683757 1697438 1709860 1720486 1729176 1735951 1740836 1743987
46645 1743987 1745720 1746285 1745817 1744564 1742869 1740875 1738545 1736270 1735194 1736633 1741170 1748555 1758405 1770785
46631 1770785 1786058 1804374 1825398 1848418 1872556 1896947 1920967 1944432 1967440 1989740 2010200
46620 2010200 2027217 2039854 2048405 2053585 2055340 2052848 2045664 2034425 2020144 2003176 1983282 1960593
46608 1960593 1936104 1911011 1885851 1860547 1835158 1810218 1786294 1763525 1741869 1721563 1702999
46597 1702999 1686139 1670427 1655396 1641088 1627747 1615334 1603601 1592431 1581835 1571751 1562106
46586 1562106 1552997 1544505 1536286 1527675 1518275 1508298 1498257 1488469 1478976 1469806 1461091 1452930 1445267 1438011
46572 1438011 1431297 1425558 1421264 1418596 1417414 1417431 1418215 1419137 1419678 1419988 1420844 1422771 1425287 1427325 1428281 1428449
46556 1428449 1428548 1429167 1430635 1433039 1436173 1439741 1443791 1448797 1455125 1462488 1470082 1477310 1484356 1492052 1501139
46541 1501139 1511618 1522848 1534340 1546300 1559266 1573395 1588418 1604203 1620989 1638976 1658008
46530 1658008 1677838 1698487 1720196 1743230 1767892 1794410 1822481 1851117 1879319 1906968 1934847
46519 1934847 1963782 1993881 2024490 2054568 2083098 2109449 2133515 2155377 2174798 2191244 2204479
46508 2204479 2214835 2222785 2228479 2231872 2233171 2232815 2231140 2228305 2224524 2220114 2215305 2210249 2205213 2200416
46494 2200416 2195597 2190017 2183071 2174761 2165401 2155113 2143795 2131364 2117761 2102812 2086325 2068233
46482 2068233 2048429 2026565 2002282 1975576 1946799 1916416 1884992 1853148 1821152 1788695 1755567
$$ [...]
##END NTUPLES=NMR SPECTRUM
##END=
