##TITLE=AC1656_NARAH14392_8531089_1UiuotEwqt
##JCAMPDX= 6.0         $$ Bruker NMR JCAMP-DX V2.0
##DATA TYPE= NMR SPECTRUM
##DATA CLASS= NTUPLES
##ORIGIN= BRUKER
##OWNER= Administrator
$$ 1.72 TOPSPIN		Version 2.1
$$ 2014-03-14 22:23:28.970 -0800  Administrator@X
$$ Compression mode = diff/dup
##.OBSERVE FREQUENCY= 400.02188249412
##.OBSERVE NUCLEUS= ^1H
##.ACQUISITION MODE= SIMULTANEOUS (DQD)
##.ACQUISITION SCHEME= undefined
##.AVERAGES= 8
##.DIGITISER RES= 22
##SPECTROMETER/DATA SYSTEM= spect
##.PULSE SEQUENCE= zg30
##.SOLVENT NAME= COFFEE_meoh
##.SHIFT REFERENCE= INTERNAL, COFFEE_meoh, 1, 14.98509
##AUDIT TRAIL= $$ (NUMBER, WHEN, WHO, WHERE, PROCESS, VERSION, WHAT)
$$ ##TITLE= Audit trail, TOPSPIN		Version 2.1
$$ ##JCAMPDX= 5.01
$$ ##ORIGIN= Bruker BioSpin GmbH
$$ ##OWNER= Administrator
$$ $$ E:\/data/COFFEE/nmr/AC1656_NARAH14392_8531089_1UiuotEwqt/20/pdata/1/auditp.txt
$$ ##AUDIT TRAIL=  $$ (NUMBER, WHEN, WHO, WHERE, PROCESS, VERSION, WHAT)
(   1,<2014-03-14 22:23:22.223 -0800>,<Administrator>,<X>,<go>,<TOPSPIN 2.1>,
      <created by zg
	started at 2014-03-14 22:22:16.520 -0800,
	POWCHK enabled, PULCHK disabled,
       configuration hash MD5:
       C8 4E 4E 5D D3 5C D8 9E 9F 52 82 E0 59 8A DE 15
       data hash MD5: 64K
       4D E6 73 2C 08 2E 74 B6 DF 6E 57 BE 31 02 D9 C3>)
(   2,<2014-03-14 22:23:25.176 -0800>,<Administrator>,<X>,<proc1d>,<TOPSPIN 2.1>,
      <Start of raw data processing
       efp LB = 0 FT_mod = 6 PKNL = 1 PHC0 = 0 PHC1 = 0 SI = 32K 
       data hash MD5: 32K
       B9 DA FA 14 E1 E8 71 64 86 69 54 B3 EF 97 72 ED>)
(   3,<2014-03-14 22:23:25.488 -0800>,<Administrator>,<X>,<proc1d>,<TOPSPIN 2.1>,
      <pk PHC0 = 94.5813 PHC1 = 0 
       data hash MD5: 32K
       B7 B9 9D B2 F5 78 9B 0C D6 B0 97 FD F8 16 45 15>)
(   4,<2014-03-14 22:23:25.613 -0800>,<Administrator>,<X>,<proc1d>,<TOPSPIN 2.1>,
      <abs ABSG = 1 
       data hash MD5: 32K
       DC 7B 7C 1D D0 FE 2D BA E7 DA 50 0F B1 B0 79 24>)
(   5,<2014-03-14 22:23:25.692 -0800>,<Administrator>,<X>,<proc1d>,<TOPSPIN 2.1>,
      <abs ABSG = 2 
       data hash MD5: 32K
       52 56 AD 9A 54 9C A5 57 9E 72 51 BB 6E B9 B2 9D>)
(   6,<2014-03-14 22:23:25.754 -0800>,<Administrator>,<X>,<proc1d>,<TOPSPIN 2.1>,
      <abs ABSG = 3 
       data hash MD5: 32K
       0B FD 60 F6 E0 73 B6 8A 46 B9 08 04 95 EB 40 2E>)
(   7,<2014-03-14 22:23:25.817 -0800>,<Administrator>,<X>,<proc1d>,<TOPSPIN 2.1>,
      <abs ABSG = 4 
       data hash MD5: 32K
       07 74 4E 66 CE 5E 10 82 37 CA 00 29 BE 6B EF EB>)
(   8,<2014-03-14 22:23:25.863 -0800>,<Administrator>,<X>,<proc1d>,<TOPSPIN 2.1>,
      <abs ABSG = 5 
       data hash MD5: 32K
       79 F0 7F 87 7C 4B 99 24 DE EB D0 1B F0 E9 15 78>)
$$ ##END=
$$ 
$$ $$ hash MD5
$$ $$ B6 55 E8 6B D5 55 C5 2A 89 C9 FA 43 47 FE 1D 5E
##$RELAX= 
##$RELAX= 
##$RELAX= 
##$RELAX= 
##$RELAX= 
##$RELAX= 
##$RELAX= 
$$ Bruker specific parameters
$$ --------------------------
##$DU= <E:\>
##$EXPNO= 20
##$NAME= <AC1656_NARAH14392_8531089_1UiuotEwqt>
$$ [...]
150 150 150 150 150 150 150 150
##$TP07= 0
##$TPNAME0= <>
##$TPNAME1= <>
##$TPNAME2= <>
##$TPNAME3= <>
##$TPNAME4= <>
##$TPNAME5= <>
##$TPNAME6= <>
##$TPNAME7= <>
##$TPOAL= (0..7)
0.5 0.5 0.5 0.5 0.5 0.5 0.5 0.5
##$TPOFFS= (0..7)
0 0 0 0 0 0 0 0
##$TUNHIN= 0
##$TUNHOUT= 0
##$TUNXOUT= 0
##$USERA1= <user>
##$USERA2= <user>
##$USERA3= <user>
##$USERA4= <user>
##$USERA5= <user>
##$V9= 5
##$VALIST= <valist>
##$VCLIST= <CCCCCCCCCCCCCCC>
##$VD= 0
##$VDLIST= <DDDDDDDDDDDDDDD>
##$VPLIST= <PPPPPPPPPPPPPPP>
##$VTLIST= <TTTTTTTTTTTTTTT>
##$WBST= 1024
##$WBSW= 4
##$XGAIN= (0..3)
0 0 0 0
##$XL= 0
##$YL= 0
##$YMAX_a= 617795
##$YMIN_a= -523880
##$ZGOPTNS= <>
##$ZL1= 120
##$ZL2= 120
##$ZL3= 120
##$ZL4= 120
##$ABSF1= 14.98509
##$ABSF2= -5.573092
##$ABSG= 5
##$ABSL= 3
##$ALPHA= 0
##$AQORDER= 0
##$ASSFAC= 0
##$ASSFACI= 0
##$ASSFACX= 0
##$ASSWID= 0
##$AUNMP= <proc_prof1d_extract_pilot.lims>
##$AXLEFT= 0
##$AXNAME= <>
##$AXNUC= <1H>
##$AXRIGHT= 0
##$AXTYPE= 0
##$AXUNIT= <>
##$AZFE= 0.1
##$AZFW= 0.1
##$BCFW= 0
##$BC_mod= 0
##$BYTORDP= 0
##$COROFFS= 0
##$CY= 15
##$DATMOD= 1
##$DC= 0
##$DFILT= <>
##$DTYPP= 0
##$F1P= 0
##$F2P= 0
##$FCOR= 0.5
##$FTSIZE= 32768
##$FT_mod= 6
##$GAMMA= 0
##$GB= 0
##$INTBC= 1
##$INTSCL= 1
##$ISEN= 128
##$LB= 0
##$LEV0= 0
##$LPBIN= 0
##$MAXI= 10000
##$MC2= 0
##$MEAN= 0
##$ME_mod= 0
##$MI= 0
##$NCOEF= 0
##$NC_proc= -8
##$NLEV= 6
##$NOISF1= 0
##$NOISF2= 0
##$NSP= 0
##$NTH_PI= 0
##$NZP= 0
##$OFFSET= 14.98509
##$PC= 1
##$PHC0= 94.5813
##$PHC1= 0
##$PH_mod= 1
##$PKNL= yes
##$PPARMOD= 0
##$PPDIAG= 0
##$PPIPTYP= 0
##$PPMPNUM= 2147483647
##$PPRESOL= 1
##$PSCAL= 4
##$PSIGN= 0
##$PYNMP= <proc.py>
##$REVERSE= no
##$SF= 400.02
##$SI= 32768
##$SIGF1= 0
##$SIGF2= 0
##$SINO= 400
##$SIOLD= 32768
##$SPECTYP= <>
##$SREGLST= <1H.CDCl3>
##$SSB= 0
##$STSI= 32768
##$STSR= 0
##$SW_p= 8223.68421052631
##$SYMM= 0
##$S_DEV= 0
##$TDeff= 65536
##$TDoff= 0
##$TI= <>
##$TILT= no
##$TM1= 0
##$TM2= 0
##$TOPLEV= 0
##$USERP1= <user>
##$USERP2= <user>
##$USERP3= <user>
##$USERP4= <user>
##$USERP5= <user>
##$WDW= 1
##$XDIM= 32768
##$YMAX_p= 443545551
##$YMIN_p= -727501
##$CURPLOT= <Network HP LaserJet P1505>
##$CURPRIN= <$Network HP LaserJet P1505>
##$DFORMAT= <normdp>
##$LAYOUT= <+/1D_H.xwp>
##$LFORMAT= <normlp>
##$PFORMAT= <normpl>
##$SURQMSG= 1
$$ End of Bruker specific parameters
$$ ---------------------------------
##NTUPLES= NMR SPECTRUM
##VAR_NAME=  FREQUENCY,     SPECTRUM/REAL,   SPECTRUM/IMAG
##SYMBOL=    X,             R,               I
##VAR_TYPE=  INDEPENDENT,   DEPENDENT,       DEPENDENT
##VAR_FORM=  AFFN,          ASDF,            ASDF
##VAR_DIM=   32768,         32768,           32768
##UNITS=     HZ,            ARBITRARY UNITS, ARBITRARY UNITS
##FACTOR=    0.250966925370066, 1,           1
##FIRST=     8223.43324360094, -85888,       -324632
##LAST=      0,             56478,           -226959
##MIN=       0,             -727501,         0
##MAX=       8223.43324360094, 443545551,    0
$$ Real data points
##PAGE= N=1
##DATA TABLE= (X++(R..R)), XYDATA
$$ [...]
19556C88010b40887A11322a9895E0102j492e1165j8640k42532a06290j93402A61813
19544a49946L3212K9735k8362r0148g1852r5494c618R47A33460A3619c41965A13066
19531A42840b31625B2740a60058c4505j4794j66682B35611h5509R622a9892C04931
19519d98002b36840r875A05359a00235K8304A72468a82890A07878a2111j98418
19509b10529j59041b938F255J89081b4509l31037a9144q0357A83933a62113m0904
19498b03017A21584c27328A77276K8546E7766b79504I7283a80383I4345a03359
19487a30951j77682g6217j24733N2498G775d14383a28427A34657a69557G6201
19476d94960a51446f7750F7808a6858A60287C3564b93915b6066I7669a64023J3684
$$ plain form
19556 388010 -240887 111322 -19895 50102 48610 -51165 -69805 -312337 -106290 -299692 161813
19544 -149946 -116734 -86999 -115361 -205509 -71852 -167346 -3618 -2671 133460 13619 -341965 113066
19531 142840 -231625 22740 -160058 -34505 -49299 -215981 235611 -85509 -75887 -19892 304931
19519 -498002 -236840 -246715 105359 -100235 -71931 172468 -182890 107878 -12111 -210529
19509 -210529 -369570 -2938 6255 195336 -24509 -355546 -19144 -99501 183933 -162113 -203017
19498 -203017 121584 -327328 177276 205822 57766 -279504 97283 -180383 94345 -103359
19487 -130951 -308633 -76217 -200950 -148452 7775 -414383 -128427 134657 -169557 76201
19476 -494960 -151446 -67750 67808 -16858 160287 33564 -293915 -26066 97669 -164023 -150339
19465a50339J5723C6203b80270C00494b6212m4537K2028a2595I643O1850c52741
19453b66086D7519K8790J9648a42317l9954c612o6057D4474k1129a68523N8047
19442a10476C9550c3588I5781b74903d7665j56093j38301G7394J39302b85971
19431A51291d17335h4048j09820a1964A47338e7283B06425d9658j3843k5326F0665
19419B08021d1042A1115a28190e278A50346c02635K1769e6691p6158J933j81881
19408c12797J25767A32735n948a82078O6610M4418j20201b7387F5974R3224i03
19396g0595j82126O5657l8502m1329q1558C12398b161B30100c7412b049k31490
19385b33539C34816e1385E7660P018b39607j30765C31454c40945A59227a79769
$$ plain form
19465 -150339 -134616 36203 -280270 300494 -26212 -70749 -48721 -12595 9643 71493 -352741
19453 -266086 47519 76309 95957 -142317 -182271 -3612 -69669 44474 23345 -168523 -110476
19442 -110476 39550 -33588 95781 -274903 -47665 -203758 -342059 77394 216696 -285971
19431 151291 -417335 -84048 -193868 -11964 147338 -57283 206425 -49658 -63501 -88827 60665
19419 208021 -41042 11115 -128190 -5278 150346 -302635 -280866 -56691 -132849 -130916 -312797
19408 -312797 -187030 132735 126787 -182078 -115468 -71050 -191251 -27387 65974 159198 -903
19396 -70595 -252721 -187064 -225566 -266895 -348453 312398 -2161 230100 -37412 -2049 -233539
19385 -233539 334816 -51385 57660 64678 -239607 -370372 331454 -340945 159227 -179769
19374D1622b18686j3185Q4084l0167l2966b1603j06687i880k25873h3903l4566
19363a18469k5744c247A71369a00379k23429A54564b23812B962P9148a09504A04016
19351a80179e0285C1054d54798f3968l23812g1937b8060B02626a64366N1659F698
19339f7624A87950a77587H0926L4800a08603j46350C2042a49288A41141b21044
19328a90417p3969L1222d3710k45112D2436g5564O661B11417D3326K01182b12875
19316d1616B1135J53726L7337F0991H29a25760j14040J6698n2273j43358a39302
19304c48880E50292a1523l0343H6805K36f8588m3860j6387n8213k0870A96397
19292E2794d01107I5824a24062E4324a0877A4247e3920J4516E5506b33942J4127
$$ plain form
19374 41622 -218686 -231871 -147787 -177954 -210920 -21603 -128290 -9880 -235753 -83903 -118469
19363 -118469 -144213 -3247 171369 -100379 -323808 154564 -223812 2962 82110 -109504 104016
19351 -180179 -50285 31054 -454798 -63968 -387780 -71937 -28060 202626 -164366 -112707 6698
19339 -67624 187950 -177587 80926 115726 -108603 -254953 32042 -149288 141141 -221044
19328 -190417 -264386 -233164 -43710 -288822 42436 -75564 -68903 211417 43326 244508 -212875
19316 -41616 21135 174861 212198 60991 829 -125760 -239800 -223102 -275375 -418733 -139302
19304 -348880 550292 -11523 -41866 86805 87041 -68588 -112448 -128835 -187048 -207918 196397
19292 52794 -401107 95824 -124062 54324 -10877 14247 -53920 -39404 55506 -233942 -219815
19281b19815a01100B6129J36393L8185D4774L2636J70093a08585k41630A52493
19270C3819c2297k30784R0502k1296R5504A08328J4379a62793I4725a52538B998
19258b00923j71168g6790B82442a35658a5115k12426B03047f1186j60903r2785
19248c14874J14189c826D2569K80147g1526m5325B8178L85b63733q0180b3559
19236c09288Q9384J09357N4896L6l33841A05560c77039H471b89832A27814c25007
19224h9285n0898a9547j46465B09048b05454G0667a05262H183a33540k24599J54177
19213b03962M1444F4276a65890B53745f3651j26621K6241r8349O5851F17899B07199
19201b49000p037G6322K3209c85805a85897G3295h1780j51965O8126g8405A28037
$$ plain form
19281 -219815 -101100 26129 162522 200707 44774 77410 247503 -108585 -350215 152493
19270 33819 -32297 -263081 -172579 -193875 -98371 108328 122707 -162793 94725 -152538 2998
19258 -200923 -372091 -76790 282442 -135658 -15115 -227541 203047 -61186 -222089 -314874
19248 -314874 -200685 -3826 42569 322716 -71526 -116851 28178 28563 -263733 -343913 -23559
19236 -309288 -219904 -110547 -55651 -55615 -389456 105560 -377039 8471 -289832 127814 -325007
19224 -89285 -140183 -19547 -166012 209048 -205454 70667 -105262 8183 -133540 -358139 -203962
19213 -203962 -162518 64276 -165890 253745 -63651 -190272 -164031 -262380 -196529 617899 207199
19201 -249000 -256037 76322 99531 -385805 -185897 73295 -81780 -233745 -165619 -78405 128037
19189d1956A2809e8143K6546l05575G6802I986J16045c56860j441h3584r0702
19178a74286k08363e6322A4820c1407C89937b5623k41584G4470l0061J0894c16823
19166c18596P2931e4221D6474d8075B64725a15468P582A23974c49816O4400d0811
19154a86824E5010J05114c06061O2307A90528a38302D0010j6741L5932f2280n1579
19143a13859J3365B18634I1860a55100b7182j74792E6220P734b2034D9149b40989
19131A15385c8943j93129B91292e4694A20245a64254E3821f9947o5850F7121h320
19119H9933e1165k22972d1357C9508A7687K69008C3183K7184h768k79728g6360
19107c2269B05039h0927j73074E303c42997A90286r3345a77414d8082m846a8842
$$ plain form
19189 -41956 12809 -58143 -31597 -337172 76802 9986 126031 -356860 -358301 -83584 -174286
19178 -174286 -382649 -56322 14820 -31407 389937 -25623 -267207 74470 44409 55303 -316823
19166 -318596 -245665 -54221 46474 -48075 264725 -115468 -107886 123974 -349816 -285416 -40811
19154 -186824 55010 160124 -306061 -243754 190528 -138302 40010 23269 59201 -62280 -113859
19143 -113859 -100494 218634 91860 -155100 -27182 -201974 56220 63954 -22034 49149 -240989
19131 115385 -38943 -232072 291292 -54694 120245 -164254 53821 -69947 -135797 67121 -8320
19119 89933 -51165 -274137 -41357 39508 17687 286695 33183 60367 -8768 -288496 -76360
19107 -32269 205039 -80927 -254001 5303 -342997 190286 96941 -177414 -48082 -52928 -18842
19095A63899B2927i7691A54996d2797j55253Q1063J2287F4459a33977j5468a6326
19083A5029c81996a18791N2010A25643b12698R5778J8890c9656N724m1710A9386
19071c8110q5034l4530A11858c46985G806b5569o2669A17047R9075E2390b76624
19059d853k09745a03225B83695a88666C32866a03932G181a68992l2531A28556
19048b21995H996O8993J1996j9355c718j36784H9406G884J40700K530h1673c3380
19035A73942a59489E4118a07137L494o7187Q3236k27570B81473I6696K16022j6346
19024B96372a78289b6878B31910a04853j08623Q5547f704B55155B2542a63259
19013g098l07845J22520b6263A63196b24340M9043I4445b77984o1994H0182P200
$$ plain form
19095 163899 22927 -97691 154996 -42797 -198050 -116987 -104700 64459 -133977 -149445 -16326
19083 15029 -381996 -118791 -66781 125643 -212698 -116920 -98030 -39656 -33932 -75642 19386
19071 -38110 -123144 -157674 111858 -346985 7806 -25569 -88238 117047 216122 52390 -276624
19059 -4853 -214598 -103225 283695 -188666 332866 -103932 7181 -168992 -201523 128556
19048 -221995 8996 77989 89985 70630 -3718 -140502 89406 7884 148584 151114 -81673 -33380
19035 173942 -159489 54118 -107137 -103643 -170830 -87594 -315164 281473 96696 312718 296372
19024 296372 -178289 -26878 231910 -104853 -213476 -127929 -6704 255155 22542 -163259
19013 -7098 -314943 -192423 -26263 163196 -224340 -175297 94445 -277984 -339978 80182 87382
19002H7382a30698C46226d5568e625A50846G5233f502I0498b69756A84067g182
18990H575e7343k4108H5855b50653a02891k17485E7742d0629j46237K5854G4117
18978D6843H809b64073H8222i6954K5958B67154e0464E9730c03805A88138a8021
18966G8093a37738A57413a9943E727a23515A79697b2389j57172c3544A5874a31491
18954i3977J9236B32858k1351a69878B63121H7443A5935b36756O6818A7516D235
18942a68321A55270a74507f6383K915j38342g7631a8391p6796D777b03635D450
18930a74392O7249I2722f2626k31658c857A5602e7871A01383a38415k37691Q0448
18919b95658G0185j6081j9955J73937g7474B34019b41924m752g3838H4643o487
$$ plain form
19002 87382 -130698 346226 -45568 -5625 150846 75233 -6502 90498 -269756 184067 -7182
18990 8575 -57343 -81451 85855 -250653 -102891 -320376 57742 -40629 -186866 -161012 74117
18978 46843 8809 -264073 88222 -96954 -70996 267154 -50464 59730 -303805 188138 -18021
18966 78093 -137738 157413 -19943 5727 -123515 179697 -22389 -179561 -33544 15874 -131491
18954 -93977 -74741 232858 211507 -169878 263121 87443 15935 -236756 -169938 17516 4235
18942 -168321 155270 -174507 -66383 -63468 -201810 -77631 -18391 -95187 4777 -203635 4450
18930 -174392 -107143 92722 -62626 -294284 -3857 15602 -57871 101383 -138415 -376106 -295658
18919 -295658 70185 54104 34149 208086 -77474 234019 -241924 -246676 -73838 84643 78156
18908G8156g1615j7623o3776G1786K0962a62368b2121r4441A05597J3690d6103
18896c25774C7265Q0728d048j22208k83853l7927i696B03472F5535K4402d5693
18884H3536c54721J24891E0404K24483A12571a87523A8318N4578d0892j11558
18874a52450H2439Q617b08592k80543J69088J31444e0254k5304l53780J31499
18864b97839b9044E3426f8085E227b57573h9096A37145A8477d32019c4613C186
18852A41975Q4935G2498J68929D0986O644a49158A07493A3586c4975l3486N889
18841f2572A19092a86583o0466C8501a53965n2189c9598r6806b2310j39225k01178
18830c62713Q2164G3083J73150A18832d3474H6482f5035j21217F7658f2661I2508
$$ plain form
18908 78156 -71615 -89238 -153014 71786 92748 -162368 -22121 -116562 105597 119287 -46103
18896 -325774 37265 117993 -4048 -126256 -410109 -448036 -9696 203472 65535 89937 -45693
18884 83536 -354721 -229830 50404 274887 112571 -187523 18318 72896 -40892 -152450
18874 -152450 82439 91056 -208592 -489135 -320047 -188603 -50254 -75558 -429338 -297839
18864 -297839 -29044 53426 -68085 5227 -257573 -89096 137145 18477 -432019 -34613 3186
18852 141975 226910 72498 241427 40986 47630 -149158 107493 13586 -34975 -68461 -62572
18841 -62572 119092 -186583 -247049 38501 -153965 -206154 -39598 -136404 -22310 -161535 -362713
18830 -362713 -280549 73083 246233 118832 -43474 86482 -65035 -186252 67658 -62661 92508
18818a93067C61285A78052l4066J37641j14558D443N9441J47796a8728B51294
18807B29626r1706J74101C1472O6496N0398n6955a14737A03009b71221a14606
18796a46848o6678O2078r6784A8472b4880G9539c2118B56344r7582e9869J3668
18785d6201j81132J10616B2088a44719j79637a12495r5002R8783A55373b46296
18774A07126b83931a4341j79684H5632P9297h8983A15360c56200b6307I1528J30093
18763B21621c19659B88253H751f8185J5814a8823j69808e48p2212B7257a58017
18751a25655F4362h1332B01510c3405B04793f0249j8373A3967f1183l16750j64488
18740e42421d0357B38310N6276d26637a3013A7791a86373d3558R978A6315a17739
$$ plain form
18818 -193067 361285 178052 143986 281627 167069 4443 63884 211680 -18728 251294
18807 229626 137920 312021 31472 97968 148366 91411 -114737 103009 -271221 -114606
18796 -146848 -213526 -151448 -248232 18472 -24880 79539 -32118 256344 158762 -59869 -46201
18785 -46201 -227333 -116717 22088 -144719 -324356 -112495 -207497 -108714 155373 -246296
18774 107126 -283931 -14341 -194025 85632 164929 -88983 115360 -356200 -26307 91528 221621
18763 221621 -319659 288253 8751 -68185 -52371 -18823 -188631 -548 -72760 27257 -158017
18751 -125655 64362 -81332 201510 -33405 204793 -60249 -78622 13967 -61183 -377933 -542421
18740 -542421 -40357 238310 294586 -426637 -13013 17791 -186373 -43558 -33580 16315 -117739
18728B4195g5468B18638j04096a05136J537j93636R0662D6310b58363A04747a83624
18716g6211H3798J76103F9788N0114f548p0709A64346c5279j79515J8462A29509
18704D7917b38723j25512A59655a4761j38247l55102a24351C01477a77627J2236
18694a65391C9552a63828b6911H208h4077j12579B412c32554J51380h3874j6232
18683a00106k8671j89205A54562C4386f8219C9096a04541D4017K4242H570L27107
18672C35677f0310C39576b8428I8262d17323J46261d1502k09489L7543a8032D9467
18660c370B4809N2859J23910o9867Q5867I7851b76264G113a6269m3231k21280
18649b80780a36020n8338B03287e18023J17817d2483k43347a2605l03160J22362
$$ plain form
18728 24195 -75468 218638 114542 -105136 -103599 -297235 -206573 46310 -258363 104747 -183624
18716 -76211 83798 259901 69788 119902 -6548 -77257 164346 -35279 -214794 -196332 129509
18704 47917 -238723 -364235 159655 -14761 -153008 -508110 -124351 301477 -177627 -165391
18694 -165391 39552 -163828 -26911 8208 -84077 -196656 2412 -332554 -181174 -83874 -100106
18683 -100106 -128777 -317982 154562 34386 -68219 39096 -104541 44017 68259 8570 335677
18672 335677 -60310 339576 -28428 98262 -417323 -271062 -41502 -250991 -213448 -18032 49467
18660 -3370 24809 77668 201578 131711 217578 97851 -276264 7113 -16269 -59500 -280780
18649 -280780 -136020 -194358 203287 -518023 -400206 -42483 -285830 -12605 -315765 -193403
18639a93403n8526e053n2308C91604b69736a27872F4591g7719B54231a4220I8024
18627C06962D4453M7357a22395G5522j6771J96157f02831b6302A0360a02417A03264
18615A95929D0792c59345B92051b22119H2009a71345l3940C66635b20722a07001
18604a13917k39839a07349A71371l9871f2443k32741A31540a23613r1682I0367
18593E922d04211H0169a03122j79118n2425a43875A26149a00186j36808k80470
18583e17464A39505j4939a13039F851b67862E7979a63748E9771R5192a3141k23559
18572b36700B2493a04553o3157A35443e6584B39703b17133P3774n4343l9277A58052
18560a01786I8078J4459n4003d38606a47029A9124f4280H4987b73487A71359a34
$$ plain form
18639 -193403 -251929 -5053 -57361 391604 -269736 -127872 64591 -77719 254231 -14220 98024
18627 306962 44453 91810 -122395 75522 58751 254908 -602831 -26302 10360 -102417 103264
18615 195929 40792 -359345 292051 -222119 82009 -171345 -205285 366635 -220722 -107001
18604 -113917 -353756 -107349 171371 131500 -62443 -295184 131540 -123613 -215295 90367
18593 5922 -404211 80169 -103122 -282240 -334665 -143875 126149 -100186 -236994 -517464
18583 -517464 139505 124566 -113039 6851 -267862 57979 -163748 59771 154963 -13141 -236700
18572 -236700 22493 -104553 -167710 135443 -56584 239703 -217133 -143359 -197702 -236979 158052
18560 -101786 98078 112537 58534 -438606 -147029 19124 -64280 84987 -273487 171359 -134
18548f2289j14790k655N8908k4586B78764f9618j83012P6962j14044A24729f1698
18536A54595n3475i5098H0020c53409a45678h077A30245b4481k5911o9489l9182
18525a59063K9640B34163b51638C29634A49944b64001e5071k2137m2685E4725
18514g5811l20249C91841A45495A5991b00319K1199B47607i9104k19632b312A33191
18502b11241m9960C2824K58759f5874E0452i0857J4088l53964A89387A0165d8035
18490b7384k7004l2082B69447b2002j43858g5426j31837D2366g5622k15909a20378
18478F4610J59960b8057B7853c2548i144C04428b30245P1877C3302L61579a12411
18466I8235P1702c81911f4787H4229L2892f1214A5616K8546d3829j58319A23845
$$ plain form
18548 -62289 -177079 -179734 -120826 -145412 278764 -69618 -252630 -175668 -289712 124729 -61698
18536 154595 101120 -95098 80020 -353409 -145678 -8077 130245 -24481 -50392 -119881 -159063
18525 -159063 -129423 234163 -251638 329634 149944 -264001 -55071 -77208 -119893 54725
18514 -75811 -396060 391841 145495 15991 -200319 -179120 247607 -99104 -318736 -2312 133191
18502 -211241 -261201 32824 291583 -65874 50452 -90857 -76769 -430733 189387 10165 -48035
18490 -27384 -54388 -86470 269447 -22002 -165860 -75426 -207263 42366 -75622 -291531 -120378
18478 64610 224570 -28057 27853 -32548 -9144 304428 -230245 -158368 33302 394881 -112411
18466 98235 169937 -381911 -64787 84229 117121 -61214 15616 44162 -43829 -202148 123845
18454c20148e4969D6041K18408c44565F268P0434b45699K7510g7759n0256C3894
18442b6711j56296m4689B8392a49984E17395A86543f8185d824p9330B6951a44365
18430b46648O399B48418b24825A14664l6271J07620d6118E9469R3234a17954j9255
18419a37209j78117N3383A07758h8245A88970b604m9699m5978f133m7648K0281
18408c3500d195k31855a04755h764E228a62217O3045B9172Q4580K31831a89132
18396A04174a51602G8995J2293Q6291b5039B15195a21982o3474k24493J82380
18386b27569d3454j5708j95392I3964a60177j77693J54449j8886a1090k2968A87689
18374c40253C81918b54167B59471D275c1221G9533k9552c24659J22945a091B98540
$$ plain form
18454 -320148 -54969 46041 264449 -344565 6268 76702 -245699 -218189 -77759 -128015 33894
18442 -26711 -183007 -227696 28392 -149984 517395 186543 -68185 -4824 -84154 26951 -144365
18430 -246648 -240249 248418 -224825 114664 78393 186013 -46118 59469 152703 -117954 -137209
18419 -137209 -315326 -261943 107758 -88245 188970 -2604 -52303 -98281 -6133 -53781 -33500
18408 -33500 -4195 -236050 -104755 -8764 5228 -162217 -99172 29172 113752 345583 -189132
18396 104174 -151602 78995 91288 177579 -25039 215195 -121982 -185456 -409949 -227569
18386 -227569 -43454 -59162 -254554 93964 -160177 -337870 -183421 -202307 -11090 -34058 187689
18374 -340253 381918 -254167 259471 4275 -31221 79533 49981 -324659 -201714 -1091 298540
18362b55379e856j11167C04279A40135N5114a59624j82383h8344F6571a64170
18351g6759G4441a19999J2415A38899D8523b71285a08667L7486F2368J1967d83264
18339a3081j15047H4477A0491a09005F4366a81537A7407a5151F7736J77371a27803
18327I416i6449c2465A36760d18824J27660h1966p6778n2053q731E6742a75252
18315A76344a69009O8680r6239F7199d0207A7190R5984c0205j1351j13879O9110
18304h6325a0191j49464L828K3429f2993q2591j5100r8999B30995f4704H1690
18292G381h8814C8813c17894e2716j10573A31333a5976j02026p6974q5286h3641
18280a90343g5734k37710A39649K5735A3481e0943k93496A19251q489f2642k608
$$ plain form
18362 -255379 -5856 -117023 304279 140135 195249 -159624 -342007 -88344 66571 -164170
18351 -76759 74441 -119999 -107584 138899 48523 -271285 -108667 -71181 62368 74335 -483264
18339 -13081 -128128 84477 10491 -109005 64366 -181537 17407 -15151 67736 245107 -127803
18327 9416 -96449 -32465 136760 -418824 -291164 -81966 -158744 -210797 -219528 56742 -175252
18315 176344 -169009 -100329 -196568 67199 -40207 17190 113174 -30205 -41556 -155435 -86325
18304 -86325 -10191 -159655 -155827 -132398 -62993 -145584 -160684 -259683 230995 -64704 81690
18292 7381 -88814 38813 -317894 -52716 -163289 131333 -15976 -118002 -194976 -280262 -83641
18280 -190343 -75734 -313444 139649 165384 13481 -50943 -344439 119251 110762 -62642 -65250
18269f5250k8409J7668b3281A00757l3036k4148J96724g2927j26547A40312M5429
18258A85741a27725B17318J2213E5383C011f2491j48599o7711J3865J5479K5860
18247b23597P6509e5170A02858d52458a75605c3904E3017J12955b03383b0552
18236a65689n9137k7722O4552A54256a0791B0722a71207n2699f9398A11046d6062
18224a16411d3578C6604j3209a472F011a43049B3067J48025J15078b32058g273
18212b49048e8812M891A60500a4812k08727f4217A64590q0147i5570j53452J5673
18201b33349g1687B08967a78023m1775A32347c14393B5473J72646g9078B06319
18190f2708m42471C65983c50900e7869j58938A84625e2855l7149H3979a84333
$$ plain form
18269 -65250 -93659 -75991 -23281 100757 67721 43573 240297 -72927 -199474 140312 185741
18258 185741 -127725 217318 229531 55383 3011 -62491 -211090 -278801 -264936 -249457 -223597
18247 -223597 -147088 -55170 102858 -452458 -175605 -33904 53017 165972 -203383 -20552
18236 -165689 -224826 -252548 -187996 154256 -10791 20722 -171207 -223906 -69398 111046 -46062
18224 -116411 -43578 36604 23395 -1472 6011 -143049 23067 171092 286170 -232058 -7273
18212 -249048 -58812 -53921 160500 -14812 -223539 -64217 164590 84443 -95570 -249022 -233349
18201 -233349 -71687 208967 -178023 -219798 132347 -314393 25473 198119 -79078 206319
18190 -62708 -505179 365983 -350900 -57869 -216807 184625 -52855 -90004 83979 -184333
18179c19877A27303K30390A04679J8156g1908n3581E2886A3369i7083j6859I0185
18167C93515b63991E1920R6532e2366B7215K8155J7526d40158H0556a57551O7286
18156i0265l6209A99573c61718e6283k66149A91576a22067A40907i4360m724K9095
18145f9989k03421a663A50736F2829a19838k81057d3054D1042N1933a42054j46770
18134b88824h2695A88146e619j93684b3347k53420g3199j73377K5131A13131c22480
18122a45621N9706K6772j35149D427O5476a5861m04939a47070b0040k22793A5367
18110b92156A23243a71677B32169A02678k6047H095K00430e7154j72890B09463
18099a77469f8141l0018k02926d3821A15494f8165A60257B2314g1553C0412c17235
$$ plain form
18179 -319877 127303 357693 104679 122835 -71908 -125489 52886 13369 -97083 -113942 90185
18167 393515 -263991 51920 148452 -52366 27215 55370 72896 -440158 80556 -157551 -90265
18156 -90265 -126474 199573 -361718 -56283 -322432 191576 -122067 140907 -94360 -99084 -69989
18145 -69989 -273410 -1663 150736 62829 -119838 -400895 -43054 41042 92975 -142054 -288824
18134 -288824 -82695 188146 -5619 -199303 -23347 -276767 -73199 -246576 -221445 113131 -322480
18122 -145621 -85915 -59143 -194292 4427 69903 -15861 -420800 -147070 -20040 -242833 15367
18110 -292156 123243 -171677 232169 102678 76631 8095 208525 -57154 -230044 209463
18099 -177469 -68141 -98159 -301085 -43821 115494 -68165 160257 22314 -71553 30412 -317235
18087f9679I2898a84784B48889c0221A99381c01621E4587a71704L3166k59575
18077c98113e3850j39475c5970k2418p9337k41293a60584H8377J73985b9436j75070
18066b04506A48061K5512G3764k1103L8906K0678p610J26153b01778B15503b28447
18054A19673I027b19576i2108m7637B15199i0364A13338f6212j35688f7390J0429
18043e6961A94726a9732A06359b33690J08382C7485Q2303c04692h7447I5905e7285
18031b78356g8338F8127B5311N5468J24651o6327a16177C9960a18633C0206a03858
18019a64844C00483c47879C8604b6562l76430h2201k7231E2019J51683b53488
18008d4983B4830o770b24999a6604o2393n941B1218a97746A09944a77732B06185
$$ plain form
18087 -69679 92898 -184784 248889 -30221 199381 -301621 54587 -171704 -138538 -398113
18077 -398113 -53850 -193325 -35970 -58388 -137725 -379018 -160584 88377 262362 -29436 -204506
18066 -204506 148061 173573 73764 52661 91567 112245 104635 230788 -201778 215503 -228447
18054 119673 9027 -219576 -92108 -139745 215199 -90364 113338 -66212 -201900 -67390 -56961
18043 -56961 194726 -19732 106359 -233690 -125308 37485 119788 -304692 -87447 95905 -57285
18031 -278356 -78338 68127 25311 80779 205430 139103 -116177 39960 -118633 30206 -103858
18019 -164844 300483 -347879 38604 -26562 -402992 -82201 -109432 52019 203702 -253488
18008 -44983 24830 18060 -224999 -16604 -78997 -84938 21218 -197746 109944 -177732 206185
17996D4760b66119f3038j44995j66284B555a32762C5181Q747g2110k39365A04533
17984B52737a2829q9013B12466r0725n7310D6b0298B4306g9583A62943a57369
17972b6197I7327c33737a00758l0140c1818k08817i5630A41597B5899N0232H10
17960i654q4550m2714j18851R6015N625a5434C15953j31350b65023F457K24528
17949B30985c36285A67336R3132a42031A42462a865B26405D0265a69825C05562
17938b74154e850A08722P4244q2170E0207c98046A15948g366j33435B27953e0137
17926A10812f0822D7456J69433a51102o1761E7983N096a07743h308k12769c6069
17914d55034P8418J47525e5985a0799k51330c026k9399m1302E2645b80040h5407
$$ plain form
17996 44760 -266119 -63038 -208033 -374317 2555 -132762 35181 43928 -72110 -311475 104533
17984 252737 -12829 -101842 212466 121741 64431 46 -20298 24306 -79583 162943 -157369
17972 -26197 97327 -333737 -100758 -130898 -31818 -240635 -95630 141597 25899 76131 810
17960 -9654 -94204 -136918 -255769 -159754 -154129 -15434 315953 184603 -265023 6457 230985
17949 230985 -336285 167336 260468 -142031 142462 -1865 226405 40265 -169825 305562
17938 -274154 -5850 108722 182966 100796 50207 -398046 115948 -7366 -140801 227953 -50137
17926 110812 -60822 47456 216889 -151102 -212863 57983 63079 -107743 -8308 -221077 -36069
17914 -455034 -376616 -229091 -55985 -10799 -262129 -3026 -32425 -73727 52645 -280040 -85407
17902A66257l5269N0950i1237l19994c7154j9547j47006G104K8757g9440A35339
17890i9942A71289P8665I4052a89932E1192Q9214a64317B8757a72150p7459B06251
17878b25790n3763O7260d4535A37720e1964C0190a38657q212j10604I4478L7470
17867A31948a86404a5770F7314h6385C4657d05023A1054L1092o108c8499b18A28648
17854a48195j22511A17622b5092A90652c45238B01302a81363D2077J00245F70
17843e1197C6920J5158J4600a51542E79036d1115B24276a58205B0661P0836a67423
17831a88235c2102j57814j22638a45319b4648j86042O3125f7965C0016a80141
17820a83298A44122M8479a45450a6300k86835K9126J35904c1491a719A1563L68892
$$ plain form
17902 166257 130988 181938 -91237 -411231 -37154 -56701 -203707 7104 35861 -79440 135339
17890 -99942 171289 249954 94052 -189932 51192 140406 -164317 28757 -172150 -249609 206251
17878 -225790 -279553 -212293 -44535 137720 -51964 30190 -138657 -146869 -257473 94478 131948
17867 131948 -186404 -15770 67314 -86385 34657 -405023 11054 42146 36038 -38499 -218 128648
17854 -148195 -270706 117622 -25092 190652 -345238 201302 -181363 42077 142322 670
17843 -51197 36920 52078 66678 -151542 579036 -41115 224276 -158205 20661 91497 -167423
17831 -188235 -32102 -189916 -312554 -145319 -24648 -210690 -147565 -67965 30016 -180141
17820 -183298 144122 192601 -145450 -16300 -303135 -274009 -138105 -31491 -1719 11563 380455
17809C80455I1293h255j4047l9279E4551P9178a13940N1515m7104A8934a27490
17797f2932A69351a13528B49349o3467h3765p741q731l7915H8358f7658j9270
17786h6928A73084G5567g094B90843h0409B81219d6546L325A58559n7983g2418
17774e50113b17784D6487J25364a04435E7483P3369B0318d9785a2108j69811E0882
17762C22775h8174E0347e7402j83233B05874a28456A37416f9734l8510n4833A39349
17750A60793G0817B3443L03236b65619A56545P7980F6046b02107C79447a51089
17739A70760A2368a49207a6712j32657e2379B07621f7281p8476A70938a90507
17728E5532K4927a52512A70079a32174g305A04426i2987B42084h8658A4081a97432
$$ plain form
17809 380455 91293 -8255 -22302 -61581 54551 133729 -113940 -62425 -109529 18934 -127490
17797 -62932 169351 -113528 249349 185882 -83765 -91506 -100237 -138152 88358 -67658 -86928
17786 -86928 173084 75567 -7094 290843 -80409 281219 -46546 -43221 158559 100576 -72418
17774 -550113 -217784 46487 171851 -104435 57483 130852 20318 -49785 -12108 -181919 50882
17762 322775 -88174 50347 -57402 -240635 205874 -128456 137416 -69734 -108244 -163077 139349
17750 160793 70817 23443 326679 -265619 156545 234525 66046 -202107 379447 -151089
17739 170760 12368 -149207 -16712 -149369 -52379 207621 -67281 -145757 170938 -190507
17728 55532 80459 -152512 170079 -132174 -7305 104426 -92987 242084 -88658 14081 -197432
17716A40573c519A61N0027L9085e0277A56915J2835D3820b13904A86674D0907
17704a61103A39690e3946a1889B21862b52721F8000k4514M4866k7952b30176h917
17692b2273m26322a42117j8492H1719J668K01461I2252D3973L63956j80641h7065
17680I7191J07809o4163Q2167B0797L20109D099J07821K1136M5701N9474A9567
17668b7324G7565N0856J14415m6246a42807I9018C4328c2875k08532B8424N0619
17657G9043l2259J55427F9496L11869b54158E7949J68666j4192E0631M676P2851
17646A28158a82802H9977m353a12453d1864A65027a17692A89165I2922L15690
17636D08612a40369L7348c3810k14148B42099B6345a76318F2753J3163a27805
$$ plain form
17716 140573 -3519 161 50188 89273 -50277 156915 169750 43820 -213904 186674 40907
17704 -161103 139690 -53946 -11889 221862 -252721 68000 43486 88352 60400 -230176 -8917
17692 -22273 -448595 -142117 -160609 81719 83387 284848 92252 43973 407929 227288 -87065
17680 97191 205000 140837 223004 20797 340906 4099 111920 133056 178757 238231 19567
17668 -27324 77565 128421 242836 196590 -142807 99018 34328 -32875 -241407 28424 79043
17657 79043 46784 202211 69496 381365 -254158 57949 226615 212423 50631 55307 128158
17646 128158 -182802 89977 85624 -112453 -41864 165027 -117692 189165 92922 408612
17636 408612 -140369 -103021 -33810 -247958 242099 26345 -176318 62753 75916 -127805
17625b2357A5079a9242E7446J0242a71725G4029a41508C96805a5036D32352j37483
17614B94869G8434f515C5351A6656b8185A69313a83004r2753i8730k11878a03424
17602b82447a5601F8845a2038k2961q9895D0423K8791K74834A1636i2285A90560
17590a55853D3871i6437E3897Q3136a2930C3272a22619r487g188A25102J87098
17579C12200L0533j25461b29676Q5690A7129J08240R1988O9724j41179a34460
17568A47084D1440j0975g2738j9389F2391a3461j4801A78581h021j36129E1574
17556b73045I4172i1530J927A62916k7992A0753J68125R7930G9333K95283a67040
17544d2528l8596B97191a19848j78315c2808L797A89696h4303k2262g54A59782
$$ plain form
17625 -22357 15079 -19242 57446 67688 -171725 74029 -141508 396805 -15036 432352 294869
17614 294869 78434 -6515 35351 16656 -28185 169313 -183004 -275757 -98730 -310608 -103424
17602 -282447 -15601 68845 -12038 -34999 -124894 40423 69214 344048 11636 -92285 190560
17590 -155853 43871 -96437 53897 137033 -12930 33272 -122619 -132106 -7188 125102 312200
17579 312200 342733 217272 -229676 -143986 17129 125369 217357 287081 145902 -134460
17568 147084 41440 30465 -72738 -92127 62391 -13461 -28262 178581 -8021 -144150 51574
17556 -273045 94172 -91530 -89603 162916 134924 10753 178878 276808 79333 374616 -167040
17544 -42528 -81124 297191 -119848 -298163 -32808 -29011 189696 -84303 -106565 -754 159782
17532I3018K31223e4790m29496a30045A67129b5560j8172p6489B21128c00742
17521B17302i1103E35369g6062C19055F3337L18365j28530j02373J84590A49570
17510C59121A4979J3847K06075b57093f859C42281e4848B15459n4637C180K90970
17499B94150I5182D539f3032r1378A1953e622q0170A94727D690J5337N690K44974
17487B70691j09011b4229A51726J82386F6217c73069Q7594A47937o8556b09494
17476C31043a7125B66121b17883I7880E274O3164M1030d9004C1521J58181p708
17465A81994K76522A37219E8932J4182a92932b2443B22712J38949H0075f0075
17454B52743q1313K18455p5159k1624q9233K47007j3691A40190K91207B14529
$$ plain form
17532 93018 324241 -54790 -484286 -130045 167129 -25560 -43732 -120221 221128 -300742
17521 217302 -91103 535369 -76062 319055 63337 381702 253172 150799 335389 149570
17510 359121 14979 28826 234901 -257093 -6859 342281 -54848 215459 160822 3180 294150
17499 294150 95182 4539 -63032 -154410 11953 -5622 -85792 194727 4690 20027 25717 270691
17487 270691 161680 -24229 151726 334112 66217 -373069 -285475 147937 79381 -209494
17476 331043 -17125 266121 -217883 97880 5274 68438 109468 -49004 31521 189702 181994
17465 181994 458516 137219 58932 73114 -192932 -22443 222712 361661 80075 -60075
17454 252743 171430 389885 314726 293102 203869 450876 437185 140190 431397 214529
17443a2480G1101J4315O7937J50066q792I3331P0016L9131I3885O8000a50082
17431C42181c994B23858J31052j08411J76859o0193b58080A16323L25690n3920
17421C88093q6476K93889k27669j50773A06666K68885j41145J89543j87941J35721
17411C71729I3247g5618B78810J7521j32695a0090n7509A37584b4632A38700g3285
17399c0810D7065N1643a71734A43310E2462r399j1804J33076L5233D529L01227
17388C05756A50918m2530R8703r6968D854J30206K56302j54109A17845P7264h1170
17376d855B98914E6474N3758j5594K3491K19216A25364k1249K0737J69964j43243
17365A51573J88504B7906J40143n6189e0055A92884o1957a88145H0020c9155B65311
$$ plain form
17443 -12480 71101 85416 153353 303419 294627 93331 163347 202478 93885 161885 -150082
17431 342181 -3994 223858 354910 246499 423358 363165 -258080 116323 442013 388093
17421 388093 301617 595506 367837 217064 106666 375551 234406 423949 236008 371729
17411 371729 93247 -75618 278810 296331 163636 -10090 -67599 137584 -24632 138700 -73285
17399 -30810 47065 98708 -171734 143310 52462 43063 31259 164335 199568 4529 305756
17388 305756 150918 108388 207091 110123 4854 135060 391362 237253 117845 195109 -81170
17376 -4855 298914 56474 110232 94638 118129 337345 125364 104115 124852 294816 151573
17365 151573 340077 27906 168049 111860 -50055 192884 130927 -188145 80020 -39155 265311
17353C39529j62094e1103C68579c96118C95799h2690B97609b2596l5885B43951
17342A34462K56939K8540g6757D29370b32306B9787a5418j8859D1553a4882n3555
17331f8437A60599a85928D84447k17133J10431A4079K35578G1973j096Q1856a16083
17319I0308K5276j9566b27368A09788J01058r1044J23822k8957p8574m6015J6180
17308A06258a49097f581A38543f563D7597o139L7938K18147A40980K34506p2996
17297C02490g8819o2314h636p2094A69524C7983J86947k0031L0164g8997H7818
17285I8676J26271q056o725b68257A81444a62407B14176J38475j53446J48213
17275C47418j18817b09358B91349o8555j02643K1484a11077A29830J53883J08488
$$ plain form
17353 339529 177435 -51103 368579 -396118 395799 -82690 297609 -22596 -58481 243951
17342 134462 391401 419941 -76757 429370 -232306 29787 -15418 -34277 41553 -14882 -68437
17331 -68437 160599 -185928 484447 267314 377745 14079 249657 71973 70877 152733 -116083
17319 90308 115584 96018 -227368 109788 210846 119802 243624 214667 136093 90078 106258
17308 106258 -149097 -6581 138543 -6563 47597 41458 79396 297543 140980 375486 302490
17297 302490 -78819 -141133 -8636 -80730 169524 37983 224930 204899 235063 -78997 87818
17285 98676 224947 216891 210166 -268257 181444 -162407 214176 352651 199205 347418
17275 347418 228601 -209358 291349 222794 120151 141635 -111077 129830 283713 392201
17265C92201A11079D2017j4921b22211A71014K51310q9563c2903A04309J2951
17255A17260m4423J06969m0120f4396B03491d1236E50642k36918D9909P1359a24733
17243B68140J42730C9823J62936p3465D7963J00848L30314a22815B36017J2026
17233B48043l9015b57926C30246o112g7265B31136k1934J00892q1955r213K25894
17222D44820D9181K67352G5709J38570H2308J62942L14876B00677P0973J7820
17212B89470G2335K80258k2312A20097L26552j91660I236L39055E9714L03185
17202C62899A23843k7404O0012J27839j11685a28755A23438M5737q2469k3253
17192F3453K2780M5135E2325J98908a98976B83033A30889J1979K36367p2855h933
$$ plain form
17265 392201 111079 42017 27096 -222211 171014 422324 332761 -32903 104309 117260
17255 117260 72837 179806 139686 -64396 203491 -41236 550642 313724 49909 121268 -124733
17243 268140 410870 39823 202759 129294 47963 148811 479125 -122815 236017 248043
17233 248043 209028 -257926 330246 324134 -77265 231136 209202 310094 228139 218926 444820
17222 444820 49181 316533 75709 214279 82308 245250 560126 200677 271650 289470
17212 289470 72335 352593 330281 120097 446649 254989 9236 348291 59714 362899
17202 362899 123843 96439 156451 284290 172605 -128755 123438 169175 86706 63453
17192 63453 86233 131368 52325 251233 -198976 283033 130889 142868 379235 306380 -8933
17180d2869A75997L2612J13437G4976J96211r2004K38517E2085J63551A2718M59771
17169D72489j3042D5563N1974J33319q7603J80866L174P6438B8930J29580D8917
17157C47094A73314J76296H3534N03702B1844M07955k9783q9238H18J71712J40094
17146C12624R0809j69800J9061Q4653j37327K02314j01307A06641K24004A21165
17135D84604I5640J91450J82516j1924L60390C00519m2519P7411J48205A86932
17124E81923j50163j86116J41897N8377k3412A64031k3209K20564K87637k11132
17114D37891p6445P5514B13060K05057J62247A16719k3598L77116k26372K90804
17104E34669p1494j93376O1445n8898r8215L01791O0826M0944B56901j18577N8931
$$ plain form
17180 -42869 175997 208609 322046 74976 271187 179183 417700 52085 215636 12718 472489
17169 472489 459447 45563 97537 230856 143253 324119 327293 403731 28930 158510 48917
17157 347094 173314 349610 83534 587236 21844 429799 400016 310778 818 172530 312624
17146 312624 403433 233633 252694 337347 200020 402334 301027 106641 330645 121165
17135 484604 95640 287090 469606 457682 818072 300519 258000 335411 483616 186932
17124 581923 431760 245644 387541 445918 422506 164031 140822 361386 649023 437891
17114 437891 361446 436960 213060 418117 580364 116719 93121 470237 243865 534669
17104 534669 463175 269799 331244 272346 174131 475922 536748 577692 256901 138324 197255
17093A97255Q8395R2334J32237A88338L55067k33662K05288I4662J12486M82134
17083F89282j79437B50062N9490Q8352K5151J93629I9321P51394B87410N7759
17073C45169j66741M86530C04926l6228N5096K27760k24822K57279j34721N7792
17063E07082N7217r2584j67122L04031B61238O9566N3553K44102l07725L1621
17053C52355M96690m00764N6684B08952L49965j95183J08843B30115M99133l40425
17043C88823J63816q9899k5238J84622j72837j59932K69095j48545l1484L46965
17033G25386k61909p2400q978N6836M14598m15693M61182k47265Q7024C68979
17022I64022l35416L0143N2817k66731l734L31736r4401J25948K9600j07345k23835
$$ plain form
17093 197255 285650 377984 510221 188338 543405 309743 515031 94662 207148 689282
17083 689282 509845 250062 309552 397904 423055 616684 99321 850715 287410 345169
17073 345169 178428 664958 304926 268698 323794 551554 326732 584011 449290 507082
17063 507082 564299 471715 304593 608624 261238 330804 384357 628459 320734 352355
17053 352355 849045 448281 504965 208952 558917 363734 472577 230115 729248 388823
17043 388823 552639 462740 437502 622124 449287 289355 558450 409905 378421 725386
17033 725386 463477 391077 382099 438935 853533 437840 899022 651757 738781 368979
17022 964022 628606 658749 711566 444835 441101 772837 678436 804384 833984 726639 502804
17011E02804L34366C69149K99116J53679r5574j09780K28037k74394N9841J85058
17001H15132j12646q9383n1055L28033k6416k29293n7596L01367m2155j03634
16991G32354J96371j58441k94522M29092p374k58967K14196O6258K9390q2778
16981H65579J30915j33444k34509k82304M64396K06293q5941n4503l37587M88867
16971A027762j33978j02008R0540M1771j36676l5630j91131M41309J38713j11197
16961A029475l9904J03306k8776l10517M10442r7536j56656n4496J71639K6918
16951A053895r1871J37530l22760M9231J3424L18863J95431j37056L3834p3151
16941A177370m7102J20178l6321m2062M9463P2748k00033L13758m4455k07585
$$ plain form
17011 502804 837170 369149 668265 821944 726370 616590 844627 570233 630074 815132
17001 815132 702486 613103 562048 890081 863665 634372 576776 878143 835988 732354
16991 732354 928725 770284 475762 904854 897480 638513 852709 918967 948357 865579
16981 865579 996494 863050 628541 346237 810633 1016926 930985 876482 538895 1027762
16971 1027762 893784 791776 882316 924087 787411 751781 560650 1001959 1140672 1029475
16961 1029475 989571 1092877 1064101 753584 1164026 1066490 909834 855338 1026977 1053895
16951 1053895 962024 1099554 776794 826025 839449 1158312 1353743 1216687 1250521 1177370
16941 1177370 1130268 1250446 1214125 1172063 1221526 1294274 1094241 1407999 1363544 1155959
16931A155959J74625k27022M48796o09695M39259k05536k2429M55365m89462M35109
16921A554969k84917r1662K48530p5026k48622J49887P5810J10341j16074K49903
16911A573139j58327q5115J33639P5715j66887J19207J85120j38362Q8238j59330
16901A467037J04162L13437k19842L04317k15826l045K06097J4965l17831M3622
16891A697093j01246J69046K86291j59212m0216j58527K50108o8860L47501N0734
16881B272712k30967K44101k04520N8345j99358L26635k38898L13767P5810K0899
16871B438526l24459M28092k22173J22251j43107K64545L2905k1294O6096j70020
16861B471362K20201L24702j54316j13701p0017l70K74919k65721L37116j46835
$$ plain form
16931 1155959 1330584 1103562 1552358 942663 1381922 1176386 1153957 1609322 1119860 1554969
16921 1554969 1270052 1178390 1426920 1351894 1103272 1253159 1328969 1439310 1323236 1573139
16911 1573139 1414812 1329697 1463336 1539051 1372164 1491371 1676491 1538129 1626367 1467037
16901 1467037 1571199 1884636 1664794 1969111 1753285 1750240 1956337 1971302 1653471 1697093
16891 1697093 1595847 1764893 2051184 1891972 1851756 1693229 1943337 1874477 2221978 2272712
16881 2272712 2041745 2285846 2081326 2139671 1940313 2266948 2028050 2341817 2417627 2438526
16871 2438526 2114067 2542159 2319986 2442237 2299130 2563675 2596580 2575286 2641382 2471362
16861 2471362 2691563 3016265 2861949 2748248 2678231 2677861 2952780 2687059 3024175 2877340
16851B877340L77761N6523j17613J46626k73378K24710K3187J47193O9676N23479
16841D055504m64971K5090K55539k1801P151J40591j31226J62958k27893N40062
16831D341004k74561L62174m0100j73605J1894P65139j30598Q2794l9038K89808
16821E194911j71265J47956k7863N12568k86433J09561J09622l8597L78618o543
16811E922535K89855M4288k0350K77649K81015K45487j17831j1861L95150j09811
16801G196126j23971P12107J26752L48979J56301L4301L27302J40997K14796J29520
16791I263210J12805O92311j37989L87938K40567L98937L74282L05097J88493
16782A1825651M49743N92136K51753O47417J90411K00570P34073M43289M60631
$$ plain form
16851 2877340 3255101 3311624 3194011 3340637 3067259 3291969 3315156 3462349 3532025 4055504
16841 4055504 3590533 3615623 3871162 3849361 3856512 3997103 3865877 4028835 3800942 4341004
16831 4341004 4066443 4428617 4388517 4214912 4226806 4991945 4861347 4944141 4905103 5194911
16821 5194911 5023646 5171602 5143739 5656307 5369874 5479435 5589057 5550460 5929078 5922535
16811 5922535 6212390 6256678 6236328 6513977 6794992 7040479 6922648 6910787 7305937 7196126
16801 7196126 7072155 7784262 7911014 8259993 8416294 8450595 8777897 8918894 9133690 9263210
16791 9263210 9376015 10068326 9930337 10318275 10558842 10957779 11332061 11637158 11825651
16782 11825651 12275394 12867530 13119283 13766700 13957111 14157681 14891754 15335043 15795674
16773A5795674N30447K84098Q87702M91520O41749O57355O12698R25627M17531
16764B1244401J168050L96592R46804J038921J326613P47430J331275J098370
16756B9298456J654978J219177J170000J610811J645195J740334J884156J810350
16748D2033457K447587K210598K241026K804124K496285L221214L108554L244654
16740F3807499L564537M070215L846277M772091M690578N214312N600913N347357
16732A00913779O304354O267953O249938O771673O970849P288899O862174P245322
16724A54874941O722307N965682O074942M310752M245942K689680J725123N63130
16716A87172499o23460j894583l334921m166590m996311o123944o227358o796306
$$ plain form
16773 15795674 16326121 16610219 17497921 17989441 18631190 19288545 19901243 20826870 21244401
16764 21244401 22412451 22809043 23755847 24794768 26121381 26868811 28200086 29298456
16756 29298456 30953434 32172611 33342611 34953422 36598617 38338951 40223107 42033457
16748 42033457 44481044 46691642 48932668 51736792 54233077 57454291 60562845 63807499
16740 63807499 67372036 71442251 75288528 80060619 84751197 89965509 95566422 100913779
16732 100913779 107218133 113486086 119736024 126507697 133478546 140767445 147629619 154874941
16724 154874941 161597248 167562930 173637872 177948624 182194566 184884246 186609369 187172499
16716 187172499 186549039 184654456 181319535 177152945 172156634 166032690 159805332 153009026
16708A53009026p559192p087783p887904p053026p043350o573092o399176o409123
16700I6996380n869433n510293m941422m840695m568398m040537m033736l590680
16692E9601186l393918k765659l437747k741177k089483k407694k280602j836254
16684C8648652j895027j744323j777207j772506j409612r55995j664786q80921
16676B6548275j707174n34478j045601r73199j153365m20369r74143o03902r17739
16667A8218305l71938p73632r22557o25855k47649n61020l83467p03884k91162
16658A3337141m15473n67786m16139m8790o37987l15092l69334j60698l45524
16649A0060318l07195k92197K79084m35130p94628M2670k91142j61611k58133
$$ plain form
16708 153009026 145449834 138362051 130474147 123421121 116377771 109804679 103405503 96996380
16700 96996380 91126947 85616654 80675232 75834537 71266139 67225602 63191866 59601186
16692 59601186 56207268 53441609 50003862 47262685 45173202 42765508 40484906 38648652
16684 38648652 36753625 35009302 33232095 31459589 30049977 29093982 27429196 26548275
16676 26548275 24841101 24306623 23261022 22287823 21134458 20714089 19739946 19136044 18218305
16667 18218305 17846367 17072735 16150178 15524323 15276674 14715654 14332187 13628303 13337141
16658 13337141 12921668 12353882 11937743 11888953 11250966 10935874 10566540 10405842 10060318
16649 10060318 9753123 9460926 9740010 9304880 8510252 8552922 8261780 8100169 7842036
16640G842036k51437m19701R1519j73655L2163n03792j81194j29901r9690r5322
16630F111026p0510J17544m26913n5413k95385l01055j15581o5850J66273j24718
16620D939418k85812k0076k06484K26794k97760J5620k8032n77281J31984L87765
16610D286136o17995J75992J13688n38505K875J83280K0674l18952j89046j15154
16600C002993M10515j99653l44098M03237l04955N7639J06610j77221r0583j38222
16590B726262p1505J43644l38560m6828j34066Q0322k73546J32525l21948N64351
16580B460651j33873j71490p386o1720J47331n5137k90338K69113n5291j2416
16570B089444p8624r3563j62191l7484M5906K96714l1480m06405K30333l96458
$$ plain form
16640 7842036 7590599 7170898 7262417 7088762 7120925 6617133 6435939 6306038 6206348 6111026
16630 6111026 6040516 6158060 5731147 5675734 5380349 5079294 4963713 4897863 5064136 4939418
16620 4939418 4653606 4633530 4427046 4653840 4356080 4371700 4343668 3766387 3898371 4286136
16610 4286136 3668141 3844133 3957821 3419316 3422191 3605471 3626145 3307193 3118147 3002993
16600 3002993 3413508 3213855 2869757 3272994 2968039 3025678 3132288 2955067 2864484 2726262
16590 2726262 2654757 2798401 2459841 2413013 2278947 2359269 2085723 2218248 1896300 2460651
16580 2460651 2326778 2155288 2147902 2086182 2233513 2178376 1888038 2157151 2101860 2089444
16570 2089444 2010820 1917257 1755066 1717582 1763488 2060202 2028722 1622317 1852650 1456192
16560A456192K76671q0050O9377L61984o07452j18786R8782R4274N0182j59936
16550A441238J61488j15389j86983l5367O54497n03502K80807Q7632n65619N7060
16540A275862J42119m1039k7323k24676k1454K1504K69136q5639k18100K13053
16530A303443M0746j41259r4276K97460o79010O56316m07041R4399J37842m92235
16520G16385L21710k67L4564M2784K4818r637j54564n1647j70689n0417J27304
16509H30344j26885K93587k43844K55803k66439p0952K77705k40802K28745j4245
16499I23017p2391P7496q3570m6739C87041M43781N9318j57059j78659K98919
16489H53341m13338L22415M9491n9988K14266C90468M97238l09582J23833j36281
$$ plain form
16560 1456192 1732863 1652813 1722190 2084174 1476722 1357936 1456718 1550992 1601174 1441238
16550 1441238 1602726 1487337 1300354 1264987 1919484 1415982 1696789 1784421 1218802 1275862
16540 1275862 1417981 1376942 1349619 1124943 1103489 1124993 1394129 1308490 1090390 1303443
16530 1303443 1344189 1202930 1108654 1406114 727104 1383420 976379 1070778 1208620 716385
16520 716385 1038095 1037828 1072392 1115176 1139994 1130357 975793 924146 753457 703040 830344
16509 830344 703459 997046 753202 1009005 742566 671614 949319 708517 937262 923017
16499 923017 850626 928122 844552 797813 387041 830822 890140 733081 554422 853341
16489 853341 440003 762418 811909 751921 966187 390468 887706 578124 701957 565676
16479E65676K65683k79388k37686N76706q5007j20593J16325j47610J7726l7173
16469F34659L19721m03351r0313r8593K73154r2830k4405p332B50902L22977m7344
16458E26535J64786l26643l3688K44763P0319p6654n1812B24887M0998M2926N18866
16447H27677l29776k00904R3793j72641R6854J48746B07375J65648J24514J6181
16437E13718k52208k9965J07230J06344J00527A89784N4226M51512B92691K91801
16427E84492j48957P8107n8581R160K7204J83385k91460m3834K57381j62978r5170
16416C38749R7152K4058j4560m0477q4080M231K46058B64988k3715O6055K9258
16405C36586k0241j24395p00J48677N5959j50625J08738k5839m2985J25790j33837
$$ plain form
16479 565676 831359 551971 314285 890991 805984 685391 801716 654106 671832 634659
16469 634659 954380 551029 460716 362123 635277 542447 518042 510710 250902 573879 526535
16458 526535 691321 364678 330990 575753 646072 569418 517606 224887 265885 308811 827677
16447 827677 497901 296997 390790 218149 315003 463749 207375 373023 497537 513718
16437 513718 261510 231545 338775 445119 545646 189784 244010 695522 292691 584492
16427 584492 435535 513642 455061 464221 491425 674810 383350 339516 596897 433919 338749
16416 338749 435901 459959 445399 404922 320842 325073 571131 264988 241273 307328 336586
16405 336586 316345 191950 191250 339927 395886 245261 353999 328160 285175 410965 277128
16394B77128l4872K17700A96646K44186F2628L80673j1912j92977O4766A43047
16383H3529M12610j55650K87723A83277C7507M23201H6581K10200Q4326j73078
16373B08029H0764P8569m5295L07135a0962d863A58309M791K07317A30363Q7409
16362B17772B7529O9017c6592e646A39269K4132d4753B59215j28770J13401J89665
16351D33511G2753f8347A39292J41521J6803A27581L22967j60870l4816b5482
16340G15544A64468a53788C55173a8554D6554J23600M9439n7125J52471D4558
16329C32088o0569K60763A12188j56n1099J24387o8182J26300r7231M1570E1668
16317D15820j40496L47327C2587J64777R9653A10925a87152b9871a4344C65085
$$ plain form
16394 277128 242256 459956 196646 440832 62628 443301 431389 238412 303178 143047
16383 83529 496139 340489 628212 183277 37507 460708 86581 296781 381107 208029
16373 208029 80764 159333 114038 421173 -10962 -4863 158309 163100 370417 130363 217772
16362 217772 27529 96546 -36592 -5646 139269 163401 -44753 259215 130445 243846 433511
16351 433511 72753 -68347 139292 280813 297616 127581 450548 289678 254862 -25482
16340 715544 164468 -153788 355173 -18554 46554 170154 219593 162468 314939 44558
16329 332088 271519 532282 112188 112032 60933 185320 117138 243438 146207 187777 51668
16317 415820 275324 622651 32587 197364 297017 110925 -187152 -29871 -14344 365085
16306c2455E9109a54295A90196P5838o8066D4452R3480e9950A30573j9252B7798
16294D06658a65809J9333E8796I803J84458J0718J80717j61754l2821N7261G8031
16282A45222n7652K62040E3479M4712J56055B5833K70359B9251R8266B4242J26051
16271A50293O8308a74644A23868c3859p5549K3353H8257k1500J37020k4657K9380
16260B08500r3052M502q583K5793n9413A0447Q2155P9019M9048c1417A27090a41912
16247E80363F1803J16232Q918I803L00852B0716b07147B970L27609f927k59703
16236b66630n3516B42939C0799K26731c2614D58770j29042G0891c45489J69312
16226a76177A45900f2300A91362a5417A76891a00081B14098q5780B4562a80669
$$ plain form
16306 -32455 59109 -154295 190196 266034 197968 44452 137932 -59950 130573 111321 27798
16294 406658 -165809 -146476 58796 9803 194261 204979 385696 223942 191121 248382 78031
16282 145222 87570 349610 53479 98191 254246 25833 296192 29251 127517 24242 150293
16271 150293 218601 -174644 123868 -33859 -109408 -86055 88257 66757 203777 179120 208500
16260 208500 115448 119950 111367 137160 77747 10447 92602 171621 220669 -31417 127090 -141912
16247 580363 61803 178035 186953 9803 310655 20716 -207147 2970 330579 -6927 -266630
16236 -266630 -320146 242939 30799 257530 -32614 458770 329728 70891 -345489 -176177
16226 -176177 145900 -62300 191362 -15417 176891 -100081 214098 128318 24562 -180669
16215A29562A4507L529b40234b3723A42590b28716e2871J1869l6181q473b0089
16203a10216A65524i5310I5066a42862A72347G3368J32014A8767K00855J09488
16193C29110a43824B27993a12652j2346H5701a09393C29228o7093E3209a8166
16182A9337N9678O4915a30794E7521N7164B0928Q0294h2144E6735b59876e6079
16170E5890a41535N6613a6472k93133d009j58006c0731B74058c7002L567j5008
16159d8443D5363O434R575A6327Q3136e8808q309r32H9000J3394a01363j09941
16147b11304d1769k27713J01743A48759a85759C96318h0606k13155J37284a8740
16136A64441h233A99244J41239j58995l2367i049k3308j80225A27105R4805A02504
$$ plain form
16215 129562 14507 18036 -240234 -23723 142590 -228716 -52871 -41002 -77183 -85656 -20089
16203 -110216 165524 -95310 95066 -142862 172347 73368 205382 18767 219622 329110
16193 329110 -143824 227993 -112652 -124998 85701 -109393 329228 262135 53209 -18166
16182 19337 79015 143930 -130794 57521 114685 20928 101222 -82144 56735 -259876 -56079
16170 55890 -141535 -84922 -16472 -309605 -4009 -162015 -30731 274058 -37002 -33435 -48443
16159 -48443 45363 51797 61372 16327 99463 -58808 -67117 -68049 89000 102394 -101363 -211304
16147 -211304 -41769 -269482 -167739 148759 -185759 396318 -80606 -293761 -156477 -18740
16136 164441 -8233 199244 340483 181488 149121 -9049 -32357 -212582 127105 221910 102504
16124A63290Q5777b08095E1071d5327m6817p6554m3683J01759A54035J56698D6255
16112b16254g2349H2011c32232e1311B4224L9108a43803F2693J00236K789J75285
16101C41003M6185J523i3488c2776B4842Q807a51918j6920e8451l27266g7405
16089c1949j0165B82644a52734C68286i7897A50325l4091a82702G1275J60636
16079B31911a25388B03163n4525c4422r6406l2374j80115a0982B0068R8506i3091
16067D2371L8431b07529j2925d688B70336a3573n6274B30380q8411c8584p3008
16056a11592G749a79507N6344k18810J15724m4123c3329k1924A95892C5986J72488
16045B08474a53094F4662L00128h9222F9156b24654B20619n1033D1506A0697c60117
$$ plain form
16124 163290 249067 -208095 51071 -45327 -92144 -168698 -212381 -110622 154035 310733 46255
16112 -216254 -72349 82011 -332232 -51311 24224 63332 -143803 62693 162929 165718 341003
16101 341003 387188 388711 -93488 -32776 24842 33649 -151918 -168838 -58451 -385717 -77405
16089 -31949 -42114 282644 -152734 368286 -97897 150325 116234 -182702 71275 231911
16079 231911 -125388 203163 148638 -34422 -130828 -163202 -343317 -10982 20068 118574 -93091
16067 42371 80802 -207529 -220454 -4688 270336 -13573 -69847 230380 141969 -38584 -111592
16056 -111592 7749 -179507 -123163 -341973 -226249 -270372 -33329 -55253 195892 35986 208474
16045 208474 -153094 64662 364790 -89222 69156 -224654 220619 169586 41506 10697 -360117
16033F8300O4967a11804b0963j88594A23540a13873l8131l1480A33378d3565n2346
16022i5911j99978b5482h394A9097a04174E8430d3782r5590A44733a33463j16450
16011b49913B9296a62188m5594e8157A28797k6199L3616k3208l282k3151b89618
15999c18727B90961o2604c5564B47840n3337c19604a21571L8872O526A04793e4288
15987B58511r3479j5124f5143A11573L96659o5953j99707P6643C9121L39659d3365
15975B24957q8500k5894b80627E4999Q9892K6872n1838a63819r0312C34690j00952
15964B33738e13293a22904C1715c6648j94775J2427A46577j1727g9404l4701F0828
15952b63798a30897M2797k41526C07665E8027O5559a1432d623C41457b09106d1495
$$ plain form
16033 68300 133267 -111804 -20963 -209557 123540 -113873 -152004 -183484 133378 -43565 -95911
16022 -95911 -295889 -25482 -8394 19097 -104174 58430 -43782 -139372 144733 -133463 -249913
16011 -249913 29296 -162188 -207782 -58157 128797 102598 136214 113006 109724 86573 -289618
15999 -318727 290961 228357 -35564 247840 194503 -319604 -121571 -82699 -76173 104793 -54288
15987 258511 165032 149908 -65143 111573 508232 442279 242572 319215 39121 378780 -43365
15975 224957 136457 110563 -280627 54999 144891 171763 119925 -163819 -254131 334690 233738
15964 233738 -513293 -122904 31715 -36648 -231423 -218996 146577 134850 -79404 -114105 60828
15952 -263798 -130897 -88100 -329626 307665 58027 123586 -11432 -4623 341457 -209106 -41495
15940F2635A2838d8204j58220A58320D3923g3971A97098a78500G0567L5897h0437
15928a63160H3976j0669C4701J87118h0136J6764p8648d8484A43590B5510K99093
15917C24603a64033K7535a5849A01261b71475E8198d05054b6623k70948o9474
15907c67045B9662a72555p6646C5403c23850o858C6951Q262j1304b74252g3748
15895f7786A3733L1477K85104e659j52574p5384j049A35601L13139i3818m0581
15884a34399A38118D6469L5034J31072E4212c78116a80581k9426I954J48323J54242
15873C12519D8581a38143j69569A10696c9439G2440b96710J21591D9880a65590
15862a20730d758A12545d79092A97317g245k7028A6441a3368l2799j67039I1674
$$ plain form
15940 62635 12838 -48204 -206424 158320 43923 -73971 197098 -178500 70567 106464 -80437
15928 -163160 83976 73307 34701 221819 -80136 -63372 -142020 -48484 143590 25510 324603
15917 324603 -164033 -136498 -15849 101261 -271475 58198 -405054 -26623 -297571 -367045
15907 -367045 29662 -172555 -249201 35403 -323850 -330708 36951 45213 33909 -274252 -73748
15895 -67786 13733 45210 330314 -5659 -158233 -233617 -234666 135601 448740 -93818 -134399
15884 -134399 138118 46469 81503 212575 54212 -378116 -180581 -210007 9954 158277 312519
15873 312519 48581 -138143 -307712 110696 -39439 72440 -296710 -175119 49880 -165590
15862 -120730 -4758 112545 -479092 197317 -7245 -34273 16441 -13368 -46167 -213206 91674
15850F6247K56838O0968a82340k33412a15045r5263b4632C4957h1378A02923h0805
15838h0882B71880b01539I8530b85301A03940l463Q6963p9345h7629L3429r0086
15827a44286b034D8167b91350L9692C14308B3857b50504I4278B3927g9704E733
15815a31517D0753a38209e4587F4413g1100j03637j9122K1922P6617j5890A2379
15803b4424l42500E4784N4396c5879B20483a48146K874A0309e3583m9651o2069
15792a65303F3083b66908A69564h2449b6518A24120K2838c25863h7103B08951
15781d46916A43064h7462o0751A86040b6626D4885b1938k64859B31548c0178p752
15770c7930A6844E77K0924e0967j69337B91187A25361c604A33299L1595b63025
$$ plain form
15850 66247 323085 384053 -182340 -415752 -115045 -210308 -24632 34957 -81378 102923 -80805
15838 -80882 271880 -201539 98530 -285301 103940 100477 187440 108095 -87629 -54200 -144286
15827 -144286 -2034 48167 -291350 -251658 314308 23857 -250504 94278 23927 -79704 5733
15815 -131517 40753 -138209 -54587 64413 -71100 -174737 -193859 -171937 -95320 -111210 12379
15803 -24424 -366924 54784 109180 -35879 220483 -148146 -145272 10309 -53583 -103234 -165303
15792 -165303 63083 -266908 169564 -82449 -26518 124120 146958 -325863 -87103 208951
15781 -446916 143064 -87462 -148213 186040 -26626 44885 -21938 -286797 231548 -30178 -37930
15770 -37930 16844 577 21501 -50967 -220304 291187 125361 -3604 133299 164894 -263025
15758d7577j51209m0029A99654a63032d9107A67667c8795k51302A87671a69290
15747B48155d1323B08155l8630n5805a72108E5544K17543h1988c5838B4170l933
15736B0237g6654F2632b77198d6083j73379p5832G7486c51527A30869J14242R8743
15725C43854b02116j04811e9515r0791k10466a07370e0385B16106a90731e5133
15714i0525C8838D600a54877A4182b01267A30293m1603a26683A869a07712k63
15703a07975A61575f8690E2935J82472n8396c7939l02809A42929d2483F6678L38696
15692D05374F8433J15460l8630e9089B97427A10801K39285A37823i2980K9428
15682f3552P158k5032B3066d17239B13497b39349C32173D8372Q7416d9014m5292
$$ plain form
15758 -47577 -198786 -238815 199654 -163032 -49107 167667 -38795 -290097 187671 -169290
15747 248155 -41323 208155 169525 113720 -172108 55544 273087 -81988 -35838 24170 20237
15736 20237 -76654 62632 -277198 -46083 -219462 -295294 77486 -351527 130869 245111 343854
15725 343854 -202116 -306927 -59515 -150306 -360772 -107370 -50385 216106 -190731 -55133
15714 -90525 38838 4600 -154877 14182 -201267 130293 88690 -126683 1869 -107712 -107975
15703 -107975 161575 -68690 52935 235407 177011 -37939 -340748 142929 -42483 66678 405374
15692 405374 68433 183893 145263 -59089 297427 110801 350086 137823 -92980 -63552
15682 -63552 -56394 -81426 23066 -417239 213497 -239349 332173 48372 135788 -49014 -94306
15671i4306C1829J13308b45077Q1037r854I260K65346F9383L0735R8353a55504
15659i1854B1053a00620l9552j60282J45032l5136H1374h0162k3407C82N5348
15648E5730J7475B973c23075C9648L48719a22725G3374a04963G8319J184a37680
15636a77124P0375C2169K6130a7121o6532A79565P264C4909R906l271b9039A57531
15623A76819g2890H6692i5291M2637A52411P2016a62394A36999J96214c4860l9876
15612g4736K522D6907A1386K29124B1533b52865k19528h9355M0795j16540A29444
15600e8707C21227i2847c8983h580B4866b13302O7163e5919j77660M9114J2796
15589a71669P7870c7569A62580o0215J04133r7612a39803D4376a8971B04890r8199
$$ plain form
15671 -94306 31829 145137 -245077 -164040 -173894 9260 274606 69383 100118 198471 -155504
15659 -91854 21053 -100620 -140172 -300454 -155422 -190558 81374 -80162 -103569 382 55730
15648 55730 73205 2973 -323075 39648 388367 -122725 73374 -104963 78319 79503 -137680
15636 -177124 -106749 32169 58299 -17121 -83653 179565 186829 34909 44815 41544 -29039 157531
15623 176819 -72890 86692 -95291 -52654 152411 224427 -162394 136999 333213 -34860 -74736
15612 -74736 -72214 46907 11386 240510 21533 -252865 -472393 -89355 -48560 -165100 129444
15600 -58707 321227 -92847 -38983 -8580 24866 -213302 -146139 -55919 -233579 -184465 -171669
15589 -171669 -93799 -37569 162580 102365 206498 108886 -139803 44376 -18971 204890 106691
15578A06691M3315c5909k7372j57960A3437a99760E0120b80788D9g6486c5485
15566C41123I6507c58838a9218A54964D8518M0613a77775I7259J19311b59019
15555c0048D1951a68268F4469h3388G3945a60241F9287J31329r4157h4208j44307
15544b28515I696K00531a93857Q8364d5104D4728N0636L899b27068Q6716B45646
15532C1374A609a43641C2365a32755o2854B1701Q679d77541J41972A70572a08726
15520A16170a663n1415B58373E8541Q5468a83062A81510j8056g5635H2139J14654
15509A96793O0487b95599l126c8562j39248K6526A17800h5484j56977n1629A14497
15497B12865a0255C6424L8223a49533c3484a941o9203F1482K19158G5853j2682
$$ plain form
15578 106691 150006 -35909 -63281 -221241 13437 -199760 50120 -280788 49 -76486 -35485
15566 341123 96507 -358838 -19218 154964 48518 89131 -177775 97259 216570 -259019
15555 -30048 41951 -168268 64469 -83388 73945 -160241 69287 200616 106459 -84208 -228515
15544 -228515 9696 210227 -193857 -105493 -45104 44728 95364 99263 -227068 -140352 245646
15532 31374 1609 -143641 32365 -132755 -195609 21701 30380 -477541 -335569 170572 -108726
15520 116170 -1663 -53078 258373 58541 144009 -183062 181510 163454 -75635 82139 196793
15509 196793 257280 -295599 -298725 -38562 -177810 -151284 117800 -85484 -242461 -294090 114497
15497 212865 -10255 36424 74647 -149533 -33484 -1941 -71144 61482 280640 75853 63171
15486F3171K14749e1645j59946H2358b5876D8168K8752P3223b687A15229a75472
15474A48421b3475l6099B35959F2756a8861B4395i7793A26860E7953J42051J07210
15463C07214a28566A36739a41778j81251E8463a8332A91843n6758J08959g8139
15452a52746K5124B53730a08083p1432B7951O9977a88377Q9863k55568a71566
15441A10624J07948o5217b4379L119A09151h7413A88275a86539B06660f1414B53317
15429A55044J24212b04356A8638L1910b02944h1927d864A44535a06090c5122k67461
15418c02583i4636A08016b72993I4371h776A14244O0145a791j06066B25527b79039
15406b41438E6795j2445a42118k7170I0651C4614a18844C04889a41911j64348
$$ plain form
15486 63171 277920 -51645 -211591 82358 -25876 48168 76920 150143 -2687 115229 -175472
15474 148421 -23475 -59574 235959 62756 -18861 24395 -97793 126860 57953 200004 307214
15463 307214 -128566 136739 -141778 -323029 58463 -18332 191843 135085 244044 -78139
15452 -152746 -127622 253730 -108083 -179515 27951 97928 -188377 -98514 -354082 -171566
15441 110624 218572 153355 -24379 -21260 109151 -87413 188275 -186539 206660 -61414 253317
15429 155044 279256 -204356 18638 50548 -202944 -81927 -4864 144535 -106090 -35122 -302583
15418 -302583 -94636 108016 -272993 94371 -8776 114244 174389 -1791 -107857 225527 -279039
15406 -241438 56795 44350 -142118 -169288 90651 34614 -118844 304889 -141911 -306259
15396c06259C827K47934a05990A04658h4812A53596h8821A12409D9004a62724
15385a71527F7124J15988C313J92966c04745A25129m5008C9290A023M8304e2137
15373A46977e8637n557l34194H4472A3314M4430d8641j0733r4129D8144i8124
15361b46957a4289r72A32933g5745n3980b5492H8951c4690n6829f710K465B16694
15348a25942A72109K1837r3842b13704B9455b46768G9759k5775K0385h1958o8583
15337a50541j40082J37549C917a27220e3737G5208K16917F1237j3587q397b01523
15325D0760J17488D2762h967A56636F2877a83344D1044h1360A30362a21551O927
15314a14624g894B84794b5907A13442E0035a03078j68774c9988A59097b31801
$$ plain form
15396 -306259 3827 251761 -105990 104658 -84812 153596 -88821 112409 49004 -162724
15385 -171527 67124 183112 3313 196279 -304745 125129 80121 39290 1023 49327 -52137
15373 146977 -58637 -64194 -398388 84472 13314 57744 -48641 -59374 -153503 48144 -98124
15361 -246957 -14289 -15261 132933 -75745 -129725 -25492 88951 -34690 -91519 -6710 -4245 216694
15348 -125942 172109 193946 100104 -213704 29455 -246768 79759 53984 74369 -81958 -150541
15337 -150541 -290623 -153074 3917 -127220 -53737 75208 292125 61237 47650 39253 -201523
15325 40760 158248 42762 -8967 156636 62877 -183344 41044 -81360 130362 -121551 -114624
15314 -114624 -7894 284794 -25907 113442 50035 -103078 -271852 -39988 159097 -231801
15303g6085q4188B76405j12213n2167J22738a82356E0010a18288C8794K8792J40984
15292B08570b27534A43482n6135a77143A61389e8617B18429J63363C7414J13667
15282A51081m4539J2397m2709a9677A02137o577a68061A53383A9814J28334a09398
15270B65218F1363b3708k1201r1969J8172B40417H0581a37318J0891A84807a20645
15258A79827j6445m3520f0070b1333j04207a2000B62266J03005o4031r3418L85448
15247E93270J71643P98108Q1903m90234M95470F06911k05717M9645B18679J22183
15237C40862j03285d851D5466b94461A59871a43366G2251M3647Q9353C6682K95403
15226C32085A3761g0267E5746d7004B05066a8574k29723A28780L4401f0684l0142
$$ plain form
15303 -76085 -160273 276405 164192 112025 234763 -182356 50010 -118288 38794 67586 208570
15292 208570 -227534 143482 87347 -177143 161389 -58617 218429 381792 37414 151081
15282 151081 106542 118939 76230 -19677 102137 95560 -168061 153383 19814 148148 -109398
15270 265218 61363 -23708 -44909 -136878 -118706 240417 80581 -137318 -126427 184807 -120645
15258 179827 163382 119862 -60070 -21333 -125540 -12000 262266 365271 301240 207822 593270
15247 593270 764913 1563021 1644924 1154690 1650160 606911 401194 450839 218679 340862
15237 340862 237577 -4851 45466 -294461 159871 -143366 72251 115898 205251 36682 332085
15226 332085 13761 -70267 55746 -47004 205066 -18574 -248297 128780 163181 -60684 -90826
15215i0826I1283b45318i0937b6886A37929N5597r6205i8765C50044e3871n6983
15204a10854K3046B43258g6724I6455J17508i3110D23615b93538D50923k09071
15194B41852a86546L9219d9541D90745B37639E5267J11778A9021K21633r0038
15184A50616p76C8132K5091L1121N9892a8959j59674C60085o2849d2470j84373
15173b26843d583D5465J8915k6777a29979A51084i657C35154A2649L24565j05397
15162B31817a21617b9482B27309l8773r2293l2667a9251l5529j69289l7294J23775
15151a37588N6367N194F3628H615a99954F1634M7715a61786O4238F8986J60945
15140B29931l6207p6054M8909b89884A80964q6833g5835B11338m5248q0749J80791
$$ plain form
15215 -90826 91283 -245318 -90937 -26886 137929 193526 97321 -98765 350044 -53871 -110854
15204 -110854 -87808 243258 -76724 96455 213963 -93110 423615 -293538 450923 241852
15194 241852 -186546 -147327 -49541 490745 237639 55267 167045 19021 240654 150616
15184 150616 149840 38132 63223 94344 154236 -18959 -178633 360085 297236 -42470 -226843
15173 -226843 -4583 45465 64380 37603 -129979 151084 -9657 335154 12649 337214 231817
15162 231817 -121617 -29482 227309 188536 96243 63576 -19251 -54780 -224069 -261363 -137588
15151 -137588 -81221 -76027 63628 8615 -199954 61634 109349 -161786 -97548 68986 229931
15140 229931 193724 117670 166579 -289884 180964 94131 -75835 211338 166090 85341 266132
15129B66132A28955J9341R7257b85543C69635A02312P5840E21J04429L75237a3403
15117H2614L99345A86195a74436E337L186P6554J79886A2829e8697A69094p5520
15106I3574M2989o7692J68932E4749Q7103g9509A89768c0801A24502J15734R3428
15095C33664p5601i2952L7420B0727a52830B86470A22834F0098R401g4617j77563
15084b52180B14144N0724m7653J19407E0699f4863A78332H762P3352R1695q5745
15073H8064B7410J07042F4277K70397F821M20875C8562J2108L26710A44419q566
15062A35853l32A1785J40774J56412C383g531j03023A75739o3901K453a51359
15050B08736r6916P5780a02963A22130J64483A03044J83980l8382a12075F0937
$$ plain form
15129 266132 128955 148296 245553 -285543 369635 102312 178152 521 104950 480187 -13403
15117 82614 481959 186195 -174436 5337 8523 85077 264963 12829 -58697 169094 93574
15106 93574 136563 68871 237803 54749 141852 -79509 189768 -30801 124502 240236 333664
15095 333664 258063 -92952 -55532 20727 -152830 286470 122834 60098 69499 -74617 -252180
15084 -252180 214144 264868 217215 336622 50699 -64863 178332 8762 82114 173809 88064
15073 88064 27410 134452 64277 334674 6821 427696 38562 50670 377380 144419 135853
15062 135853 135521 11785 152559 308971 3383 -7531 -110554 175739 111838 114291 -151359
15050 208736 111820 187600 -102963 122130 286613 103044 287024 248642 -112075 60937
15039F013a0933C42573M6827a8161B17127f4596L1439C20280J36978D3091N15632
15028E58723b5755F8335J12509o9905J16422E0269b66765H7471b8315D6862L60103
15017D06965p6845j28101D7481c01768A55064P1479j03344d848B72582A09003
15006C44050j40847j5929J24096l0956m377A04809J3871n3944K58134M3224d3696
14994D14293k1899B6261K97587m1809d1607C07513j9876m9517K91241e9107B9515
14982b36995B99106F9227L55933A84159r0728a0440B37815k6982p6001M4672e4849
14970A25745E8546J62011M6543J07629H7825K84809r0174b6303C00379J71804
14960D72183j48688h566B88585B4888J23851E702M6830J17188J79938A46613O442
$$ plain form
15039 6013 -10933 342573 389400 -18161 217127 -64596 -33157 320280 457258 43091 558723
15028 558723 -25755 68335 180844 110939 227361 50269 -266765 87471 -28315 46862 406965
15017 406965 330120 202019 47481 -301768 155064 226543 123199 -4848 272582 109003
15006 344050 203203 187274 311370 280414 276037 104809 118680 64736 322870 366094 -43696
14994 414293 392394 26261 323848 282039 -41607 307513 287637 238120 529361 -59107 29515
14982 -236995 299106 69227 425160 184159 93431 -10440 237815 210833 134832 179504 -54849
14970 125745 58546 220557 267100 374729 87825 372634 282460 -26303 300379 472183
14960 472183 323495 -8566 288585 24888 148739 5702 52532 169720 349658 146613 153055
14949A53055n5921M42510k15876c136m3824C57444j39324j446J13561l2436c4955
14937B91917l6803l9373J02444E7904L31911r4724K43166B08679A03643J31176
14927B34819J2372O5737K22642B08924J065J98249j54424M6653O657n2384J03255
14916C57995J6802j04490J1358J67852j40203J5307J16798j01763o9268K8493
14906B98881d2816A99520J33663j4781A12923J06185L2922A23808K83147m2675
14896C64280L07086B20360J9347j1522a08631A22264L43241j93265K47721j17729
14886D02232p4095l924j13020J91811K1321n7486Q1750M6239j85066L06372B11660
14874D53705n4498l5818K9137D4752L93481H7817J08513J76518n2150A04837J26009
$$ plain form
14949 153055 97134 539644 323768 -3136 -46960 357444 218120 216674 330235 297799 -34955
14937 291917 255114 215741 318185 57904 389815 295091 538257 208679 103643 234819
14927 234819 247191 312928 535570 208924 209989 408238 253814 300467 307124 254740 357995
14916 357995 374797 270307 281665 449517 309314 324621 441419 339656 270388 298881
14906 298881 -42816 199520 333183 318402 112923 219108 252030 123808 406955 364280
14896 364280 671366 220360 239707 228185 -108631 122264 465505 272240 519961 402232
14886 402232 328137 324213 211193 403004 424325 366839 448589 494828 309762 616134 211660
14874 453705 399207 363389 392526 44752 438233 87817 196330 372848 320698 104837 230846
14863B30846L55588k68369K6976J15529M2231j62007J52974j62682N5652R1024
14853D77762K9709B37011K11094J81635k19598k01294L95355o8856o1042j88968
14843B85337A11550J22868J87605L1861K0390B14797K70535k14641E0064K25487
14833B75551L47500j12143A83850J0351M16163j51787O6827q4031B08450K86073
14823D94523P800k13955M58421l26515m6534J75886j93987o6142M0062J10163
14813D39722p1778K67387B64750J71907j11276Q0320r290L52316C07152O3486
14803C70638R3579M274k04911N19809j36627p0101J68235j91104j79411K44299
14793F18680o5930B01660K84514j51503J07516K55587o5966l9747j13810J5575
$$ plain form
14863 230846 586434 318065 345041 460570 502801 340794 493768 331086 386738 477762
14853 477762 507471 237011 448105 629740 410142 208848 604203 535347 474305 285337
14843 285337 111550 234418 422023 453884 474274 214797 485332 270691 50064 275551
14833 275551 623051 510908 183850 194201 610364 458577 525404 441373 208450 494523
14823 494523 502323 288368 746789 420274 373740 549626 355639 289497 329559 439722
14813 439722 367944 635331 264750 436657 325381 405701 396411 748727 307152 370638
14803 370638 464217 468491 263580 783389 646762 576661 744896 553792 374381 618680
14793 618680 552750 201660 486174 334671 442187 697774 631808 592061 478251 493826
14783D93826J60956k70995J61956K09499l8014C07661K24052P1979J81096j65810
14773F18978j08440k28429J90435m1478J08247J18994j254j01460J78637j92138
14763E42092l0199j04622J88498p8459j38180K91733k93151N56235l37363m209
14753E92375j17888J18318R7514q6604k3942N9351k28795L41604k04777K87327
14743H34483k33736M8577R4716O2271k60492K84011l86144L95078q2971l47205
14733D08588K26363J39329j55399K20956q02l82148J06904J59286J00078l06444
14723E16711j28718M4519j57191L80404L01755j19645j66478o6630M32360m90846
14713E46241J0602l0606Q0886L42770m55040M00496N6034j87022B30620M90267
$$ plain form
14783 493826 654782 383787 545743 755242 717228 307661 531713 603692 784788 618978
14773 618978 510538 282109 472544 431066 539313 658307 657053 555593 734230 542092
14763 542092 511893 407271 595769 517310 379130 670863 377712 933947 596584 592375
14753 592375 474487 592805 690319 603715 579773 639124 410329 751933 547156 834483
14743 834483 600747 649324 744040 806311 545819 829830 443686 838764 755793 408588
14733 408588 634951 774280 618881 839837 839035 456887 563791 723077 823155 516711
14723 516711 387993 432512 275321 655725 957480 837835 671357 604727 1037087 546241
14713 546241 556843 526237 607123 949893 494853 895349 951383 764361 230620 720887
14703G20887J58248n627k88329K02950J2133j8979J15195P7383j36023n5468K26917
14692A009287m84052L26083M3277k27745K45642j05676j47098K71407r3841K6993
14682H64277q6835K57354L8042j21314j8706k17595L25857j07306j58965O8793
14672H43602r0035J55309k0099j00936J45464L7577p0551J3041n4393N35767l74699
14661A020047J51724m3772k24708p4913q9943M59757m05286N176J11185p9023
14651H30244J51482L02268l82332o495J67281O8922Q6465j81814j56183K02595
14641A082433Q9199L95090j30152l84741j91727O40859k14858K80p0459p0633
14631A145291l0806K69096j71973Q7288n3251J42885j14192L78295m41727j16344
$$ plain form
14703 720887 879135 873508 585179 788129 800262 781283 896478 973861 837838 782370 1009287
14692 1009287 525235 851318 894595 666850 912492 806816 659718 931125 837284 864277
14682 864277 777442 1034796 1072838 951524 932818 715223 1041080 933774 774809 843602
14672 843602 753567 908876 888777 787841 933305 970882 900331 913372 858979 1394746 1020047
14661 1020047 1171771 1127999 903291 828378 738435 1198192 792906 798082 909267 830244
14651 830244 981726 1283994 901662 895167 1062448 1131370 1217835 1036021 879838 1082433
14641 1082433 1171632 1566722 1436570 1051829 860102 1500961 1286103 1286383 1215924 1145291
14631 1145291 1114485 1383581 1211608 1298896 1245645 1388530 1274338 1652633 1210906 1094562
14621A094562k137M00507k55528L83479j3196m2617k33366o5242q5406j47514
14611A033542M14323N3697l99929K26398K42465k50504M26390k8350j11292M0891
14601A647631j03684j43084P4476K6401R4505k12922K16709J35948l84570K4575
14591A375985P5841L87056k0426j08705j39570j06610K55974j71742L37184K23523
14581B108510l34797k11660L17265j79012L4051K77839J5286m39173M45533j22987
14571A910855o2048m73L47539j12174j0261J70401R9749n6944J35912m8326K6770
14560B401000P2894K44735J54237j0087m1369J33776L22378M64320M75832Q32036
14550E049752J091564K728930N038715R215522J0096802L907966j7895722q894910
$$ plain form
14621 1094562 1092425 1492932 1237404 1620883 1607687 1565070 1331704 1266462 1181056 1033542
14611 1033542 1447865 1501562 1101633 1328031 1570496 1319992 1746382 1718032 1606740 1647631
14601 1647631 1543947 1400863 1475339 1501740 1596245 1383323 1600032 1735980 1351410 1375985
14591 1375985 1451826 1838882 1818456 1709751 1570181 1463571 1719545 1547803 1884987 2108510
14581 2108510 1773713 1562053 1879318 1700306 1734357 2012196 2027482 1588309 2033842 1910855
14571 1910855 1848807 1848334 2195873 2083699 2073438 2243839 2343588 2286644 2422556 2374230 2401000
14560 2401000 2473894 2718629 2872866 2862779 2821410 2955186 3277564 3741884 4217716 5049752
14550 5049752 6141316 8870246 13908961 23124483 33221285 37129251 19233529 10338619
14542A0338619l600039k301829j648179p24220m8919j68048K56178l30430R1660
14533A864793k8429K59111J7483j86376k45392O37772o3333j46033M22422l50857
14523B181161r6746K2476K23820l7054r3558o5736R5041L27855j58737J70943
14513B569465j28078K19153j16224O1870k44096J92002J5006N4884J35981L9348
14503B799311L03625j83955L2409N0984p6414L18729l94562p9846M90646k81411
14493B979516L89974j83271j30061J42239R386j30684O30627l05717k51749J15408
14483C265668R6934J09155K05854P8974r0406j80256O4404j0029K97715q8106
14473C749907J3112L67311L2421m2709j33276L02959n6434K2315Q9933P8371p3708
$$ plain form
14542 10338619 6738580 4436751 2788572 2064352 2015433 1847385 2103563 1773133 1864793
14533 1864793 1836364 2095475 2112958 1926582 1681190 2318962 2255629 2109596 2532018 2181161
14523 2181161 2084415 2106891 2330711 2293657 2200099 2134363 2229404 2557259 2398522 2569465
14513 2569465 2441387 2660540 2544316 2606186 2362090 2554092 2569098 2623982 2759963 2799311
14503 2799311 3102936 2918981 2951390 3002374 2925960 3244689 2850127 2770281 3260927 2979516
14493 2979516 3369490 3186219 3056158 3198397 3207783 3077099 3707726 3402009 3150260 3265668
14483 3265668 3362602 3471757 3677611 3756585 3666179 3485923 3550327 3540298 3838013 3749907
14473 3749907 3763019 4130330 4162751 4120042 3986766 4289725 4233291 4255606 4345539 4423910 4350202
14462D350202J99795P0313J41866q2142J44954k18369l0216L36913j71651J26535
14452D868200l5012L17148k61765J00311J71288K00916k29402L05175j96913K42780
14442E482726K2269p4233L43840K14261N1038j83606q7725J05130j2903L50117
14432F210914J28790K27408L6224j60222J12202L62073l22105L89875j00304Q8353
14422F973208L67118j59851J50901M29820j48283L07377p5362J17624J88396R520
14412H160468J58601J24609J62146L10180q7768o9983M39753j32716L02118M02444
14402I769852m7342p4328J43650N42172J28434R466M823L35093J85168K36009
14392A1232997K14086N4052K45660K29565J07955K67840K64566K89425P7265K75392
$$ plain form
14462 4350202 4549997 4620310 4762176 4680034 4824988 4606619 4576403 4913316 4741665 4868200
14452 4868200 4833188 5150336 4888571 4988882 5160170 5361086 5131684 5436859 5239946 5482726
14442 5482726 5504995 5430762 5774602 5988863 6039901 5856295 5768570 5873700 5860797 6210914
14432 6210914 6339704 6567112 6603336 6443114 6555316 6917389 6595284 6985159 6884855 6973208
14422 6973208 7340326 7180475 7331376 7761196 7612913 7920290 7844928 7962552 8150948 8160468
14412 8160468 8319069 8443678 8605824 8916004 8828236 8758253 9198006 9065290 9367408 9769852
14402 9769852 9722510 9648182 9791832 10334004 10462438 10471904 10476727 10811820 10996988 11232997
14392 11232997 11447083 11501135 11746795 11976360 12084315 12352155 12616721 12906146 12983411 13258803
14382A3258803K34268O76646k25886L77094Q0541L41233J4989L94951L78494O21071
14372A6152204n638O26620J84507K87901L04505M81391K92229N59250K13387L84191
14362A9480547N11067J65823R21757K08967O89220J29266P46669K92496R77392
14353B4123204L48429Q03570O57809L23124O26993P25208Q22558Q85012O70363
14344B9986270N47476J026927R88161M62807J128478R88849Q80790J175764J060009
14335C8245531Q82404J339943J240494J124301J325294J137256J647200J518876
14327D8461299K040598R94304J802805J855185J966457K313131J773084K268673
14319F3475536K232960K753485K350179K733282K631223L087211L523274L424347
$$ plain form
14382 13258803 13493071 14169717 13943831 14320925 14401466 14742699 14757688 15152639 15531133 16152204
14372 16152204 16146566 16773186 16957693 17245594 17550099 18031490 18323719 18882969 19096356 19480547
14362 19480547 19991614 20157437 21079194 21288161 21977381 22106647 22853316 23145812 24123204
14353 24123204 24471633 25275203 25933012 26256136 26883129 27608337 28430895 29315907 29986270
14344 29986270 30533746 31560673 32548834 33011641 34140119 35128968 36009758 37185522 38245531
14335 38245531 39127935 40467878 41708372 42832673 44157967 45295223 46942423 48461299
14327 48461299 50501897 51496201 53299006 55154191 57120648 59433779 61206863 63475536
14319 63475536 65708496 68461981 70812160 73545442 76176665 79263876 82787150 86211497
14311H6211497L170219L758351L681231M316890M300308M845537M955630N296881
14303A20536544N413857N902374O166530O885366P206870P214815P739206Q323123
14295A75388685Q826356R579823R376161J0433438J0835761J1316474J2231868
14288B47988566J2166910J2940218J3192465J4106352J4066317J4240554J4948854
14281C43650236J4575178J4425169J4068727J3181729J2692471J1519635R812911
14274D33926056O495449K765068L58978k999528L76227K269978k151429m014747
14266D37026052k990850q001586j1668303j3421718j4206422j4985127j5711372
14259C56040674j5450764j5627168j5379582j4996110j5025797j3568823j3395028
$$ plain form
14311 86211497 89381716 93140067 96821298 101138188 105438496 110284033 115239663 120536544
14303 120536544 125950401 131852775 138019305 144904671 152111541 159326356 167065562 175388685
14295 175388685 184215041 193794864 203171025 213604463 224440224 235756698 247988566
14288 247988566 260155476 273095694 286288159 300394511 314460828 328701382 343650236
14281 343650236 358225414 372650583 386719310 399901039 412593510 424113145 433926056
14274 433926056 440421505 443186573 443545551 440546023 440922250 443192228 441040799 437026052
14266 437026052 434035202 426033616 414365313 400943595 386737173 371752046 356040674
14259 356040674 340589910 324962742 309583160 294587050 279561253 265992430 252597402
14252B52597402j1756931j2578127j1454373j0877387j0416055j0034876r042920
14245A76436733q640241p866260p808710p005769o766493o551623o091485n210953
14237A20495199n265321m972576m988486m464633m426881l821229l140479m026506
14229H5389088l515763k993224k972378l073623k465794k834739k377724k107820
14221F3048023k282583j947695j856743j900235k059504j845790j077452j721656
14213D8356365j226701j420091j585128j368923j363723p30533j208582n70926
14205C8881758j229745j771509q29167j031649p73203n59178j047351o13540j018201
14196C0008215n42387j200641l87087o32457o60091p77098n10997p42812l57478
$$ plain form
14252 252597402 240840471 228262344 216807971 205930584 195514529 185479653 176436733
14245 176436733 167796492 159930232 152121522 145115753 138349260 131797637 125706152 120495199
14237 120495199 115229878 110257302 105268816 100804183 96377302 92556073 89415594 85389088
14229 85389088 81873325 78880101 75907723 72834100 70368306 67533567 65155843 63048023
14221 63048023 60765440 58817745 56961002 55060767 53001263 51155473 50078021 48356365
14213 48356365 47129664 45709573 44124445 42755522 41391799 40661266 39452684 38881758
14205 38881758 37652013 35880504 35051337 34019688 33246485 32687307 31639956 31026416 30008215
14196 30008215 29465828 28265187 27878100 27245643 26585552 25808454 25297457 24554645 24197167
14187B4197167m66251n83660k94271p96395k97400o12196o06782k54067k64539
14178B0021606o04683k76247o41929l85048l39139j69691n38402p1374l75123
14169A6619970m76035k80705j91883m59434l39549m0716m81434L1245k85431k82007
14159A3814021j94315j62587n95856r6926k5316l27252l9606o48531Q9661j77762
14149A1635531n30318K12049j71113k55571j71205K5366o84406J29040r0935j30384
14139I968054j19045l25283l96499J05738M3996q3351k47271j27650j67689k910
14129H648090l50016q9371k06935L77640l94199k0465k83491J51224l51522k72192
14119G208763L50394l68691j08876R3048k75236P8532J7082l50604p7443j62217
$$ plain form
14187 24197167 23730916 23147256 22852985 22056590 21759190 21146994 20540212 20286145 20021606
14178 20021606 19416923 19140676 18498747 18113699 17774560 17604869 17066467 16995093 16619970
14169 16619970 16143935 15863230 15671347 15211913 14872364 14831648 14350214 14381459 14096028 13814021
14159 13814021 13619706 13457119 12861263 12764337 12739021 12411769 12372163 11723632 11813293 11635531
14149 11635531 11105213 11317262 11146149 10890578 10719373 10744739 10060333 10189373 10098438 9968054
14139 9968054 9849009 9523726 9127227 9232965 9276961 9193610 8946339 8818689 8651000 8648090
14129 8648090 8298074 8208703 8001768 8379408 7985209 7964744 7681253 7832477 7480955 7208763
14119 7208763 7559157 7190466 7081590 7174638 6899402 6977934 6995016 6644412 6566969 6404752
14109F404752J0845J9131j46678j31220J78244q2856k10994j04687K5198r6180
14099E865555K6093M6646k28544j10202j85449J42313r6475k35012M1529l35715
14089D930739K66342k14768L4702k6094m8353k52635N0680J03905J32031m96495
14079D480054M08669n48907K57043j83893N0058k20265K58991j45033j4859j65718
14069D176140j16828N9941J52086l27896K02260O8364l28247J44553j46729R9971
14059C983615l8532R1941J83151l02607l1159l21187Q3554l5535p0141J270j80604
14048C363766J63843m29870j09258J37123K17010k03434M27591l52005j39244
14039C075522L97628m49497j1586J87061p4362n1732p76r4675N408L8972p1943
$$ plain form
14109 6404752 6415597 6434728 6288050 6156830 6335074 6252218 6041224 5936537 5961735 5865555
14099 5865555 5891648 5938294 5709750 5599548 5414099 5556412 5459937 5224925 5266454 4930739
14089 4930739 5197081 4982313 5017015 4990921 4942568 4689933 4740613 4844518 4976549 4480054
14079 4480054 4888723 4339816 4596859 4412966 4463024 4242759 4501750 4356717 4341858 4176140
14069 4176140 4059312 4119253 4271339 3943443 4145703 4214067 3885820 4030373 3883644 3983615
14059 3983615 3945083 4037024 4220175 3917568 3886409 3565222 3648776 3613241 3543100 3544370 3363766
14048 3363766 3527609 3097739 2988481 3125604 3342614 3139180 3566771 3214766 3075522
14039 3075522 3473150 3023653 3012067 3199128 3124766 3073034 3072258 2977583 2982991 3021963 2950020
14028B950020K28883o0471l76626Q317j20710P0878L68569n58456K011K4245n3712
14017B482948M9235o9126R7995l29942M9815M2210J05174l23908M13402n8561
14007B459242p9360j96258N2593j64921L78618o1225j35876J64650k25432K12114
13997B404145j14867j75340P7279k23846P5058K20883P4058R38916J626010M317886
13987I220182Q773099J0920807R558011j4507476j0759277n056720k872783p21024
13979D554819n46944n23715n75766J02986r6530p7381m88317J96133l01153K13791
13969B457923j05150p2845o8968K88143o0038l5923n4053j664k18919j70693L74304
13958B332117k95135R7018n5969l11058L71058j66868p4216o5467J39732n8725
$$ plain form
14028 2950020 3178903 3118432 2741806 2750123 2629413 2700291 3068860 2510404 2512415 2536660 2482948
14017 2482948 2532183 2463057 2561052 2231110 2280925 2323135 2428309 2104401 2517803 2459242
14007 2459242 2379882 2183624 2236217 2071296 2449914 2388689 2252813 2417463 2192031 2404145
13997 2404145 2289278 2113938 2191217 1967371 2042429 2263312 2337370 3276286 4902296 9220182
13987 9220182 17993281 28914088 38472099 23964623 13205346 8148626 5275843 4554819
13979 4554819 4007875 3484160 2908394 3011380 2914850 2837469 2349152 2545285 2244132 2457923
13969 2457923 2352773 2279928 2210960 2499103 2439065 2403142 2349089 2347425 2128506 1957813 2332117
13958 2332117 2036982 2134000 2078031 1766973 2138031 1971163 1896947 1831480 1971212 1912487
13948A912487J09893k34859p3045J88261l7127k90075M9335J15924r0025J15051
13938A765820j05411O2830N9499l78026L11119j6391r8275k1006l33320M95675
13928A742514k80036K70247j14878m0053J07576Q8502l27826Q8218j99433m0204
13918A294627O0834L14060j20027k77705P5102m4150K5885L00599k44204k08226
13908A176795J8588M21920l56135k4687K85805k27563J01515o8298K48763j97486
13898A379217m0444o4453l4337k84322K02166O5964o0956J43605K46339m61891
13888A090888Q5771J39310j33306L3862J53463n1648j48775J36503p67j68850
13878A136451j69465J68265M0197p6302n5106K88802k29343r4422r4666K82305
$$ plain form
13948 1912487 2022380 1787521 1714476 1902737 1865610 1575535 1624870 1740794 1650769 1765820
13938 1765820 1660409 1723239 1782738 1404712 1715831 1699440 1601165 1580159 1246839 1742514
13928 1742514 1462478 1732725 1617847 1577794 1685370 1773872 1446046 1534264 1334831 1294627
13918 1294627 1355461 1669521 1549494 1271789 1346891 1302741 1328626 1629225 1385021 1176795
13908 1176795 1195383 1617303 1261168 1236481 1522286 1294723 1396238 1327940 1576703 1379217
13898 1379217 1338773 1274320 1239983 955661 1157827 1223791 1162835 1306440 1552779 1090888
13888 1090888 1176659 1315969 1182663 1216525 1369988 1318340 1169565 1306068 1305301 1136451
13878 1136451 966986 1135251 1175448 1099146 1044040 1332842 1103499 1009077 914411 1196716
13868A196716j06426k6551L81819F51477J90592M84828j93814l74456J52868o4927
13858H46568Q1080K87022k07103J62769j20406j22147J72943M4211r0043o5198
13848I89696q6407Q3121m1651Q934K25363l10053P785Q1111K54769k52497k59458
13837G00713K89882J50901J63567n64955N26267m33592K05646o1223M8610k9422
13827I96394j63077p5611L20968k56594L37503m5048n04151M11347j71030L2595
13817H83296j7363O3045K3756j52851R0518J2119O2573k53624j27701K53347P4162
13806I11277D06999L47023J46501J15656m86673M7525N0253L90140j47954J90888
13796A060358D99803L07078O2575j17814J47973l85556J90083j20561J79184k36552
$$ plain form
13868 1196716 1090290 1063739 1445558 651477 842069 1326897 1133083 758627 911495 846568
13858 846568 927648 1214670 1007567 1170336 1049930 927783 1100726 1144937 1054894 989696
13848 989696 903289 986410 944759 953693 1179056 869003 876788 957899 1212668 960171 700713
13837 700713 990595 1141496 1305063 740108 1266375 832783 1038429 977206 1025816 996394
13827 996394 833317 757706 1078674 822080 1159583 1114535 610384 1021731 850701 883296
13817 883296 865933 928978 952734 799883 890401 902520 965093 711469 583768 837115 911277
13806 911277 406999 754022 900523 1016179 529506 577031 627284 1017424 869470 1060358
13796 1060358 499803 806881 869456 751642 899615 514059 704142 583581 762765 526213
13786E26213J09110K81834k4392J56686k24375j20866J8247J42007k67931l5392
13776E61141K57623k44340j41448L09040l01486L06908q1939j19568L27717j07311
13766G66337k04779O9087K79613j73814p0340j34767K75330j71892k13316j4129
13756D07330L17008p8222j45285L51702m24939p6620L17312q8657k51554J52168
13746D80243N3282K74799l02722J63168j75059L72754j5287l3177m06455K80752
13736F92298j52605J23017k33440K10829Q5136k89928k4684L40909l52008Q3272
13726D82796N1834k8238j1515N4612K56120l51898q9305J58962K02166k13789
13716E11745J95119K2778k05501O1675q0491A32447N84859j60056j56381L0494
$$ plain form
13786 526213 635323 917157 892765 1049451 825076 704210 722457 864464 596533 561141
13776 561141 818764 574424 432976 742016 440530 747438 665499 545931 873648 766337
13766 766337 561558 630645 910258 736444 666104 531337 806667 634775 421459 407330
13756 407330 724338 646116 500831 852533 427594 350974 668286 579629 328075 480243
13746 480243 533525 808324 505602 668770 493711 866465 851178 818001 411546 692298
13736 692298 539693 662710 429270 640099 725235 435307 410623 751532 399524 482796
13726 482796 534630 506392 494877 549489 805609 453711 364406 523368 725534 511745
13716 511745 706864 729642 524141 585816 505325 132447 717306 557250 400869 431363
13706D31363q1054j08278Q2648K13954j14533K19689n1493M1829j50136J99957
13696F83946l11127P1389L84504C86454J03318j16176p3796K48637K31962O4081
13686H44480m08586J29568j22174L9274j46465L40997k22562M2659k00633j3645
13676B82913J31532J19235p8413j19372K32516K7576j75608J13121G2945N85858
13666F58803k07753q23A41646O00341l53359A70503Q6555N19386C17912K57514
13656E75426j2352J31400q7113A3971L34671n124J69549a653C79002N9531O7857
13645E06390j19231E7366K38269M48589B86249N22912B09468J40059j7355O1044
13635C93216o7364k0926K79990m2951c0074B86016K94543q638p4831q2575N9577
$$ plain form
13706 431363 350309 242031 324679 538633 424100 643789 592296 634125 483989 683946
13696 683946 372819 444208 828712 386454 489772 373596 299800 548437 780399 844480
13686 844480 435894 565462 443288 482562 336097 677094 454532 497191 296558 282913
13676 282913 414445 533680 455267 335895 568411 595987 420379 533500 72945 658803
13666 658803 451050 450227 141646 741987 388628 170503 257058 776444 317912 575426
13656 575426 563074 694474 607361 13971 348642 343518 513067 -1653 379002 438533 506390
13645 506390 387159 57366 295635 744224 286249 809161 209468 349527 332172 393216
13635 393216 325852 304926 584916 541965 -30074 286016 580559 571921 497090 414515 474092
13624D74092q9650j07078K59104j27008N7572j14108L5896A46165L06592A44662
13613B59726q0435K12804p704j58999M6235J35240J43435B18698M00962k26853
13603C92807l6183j50799J78605m1662j47757K16986K8157Q575B15322N1381H9861
13591B82903J09845J64898k63683L3585M4495m6838N5016m3571J42492K68940
13581G48082C22113l1337J49366A63698J94274O9787p8342k6625j2233J96358
13571E06917A96531J55596J72021F6830K96887k9407Q0459A78230K94257n773
13561D66714J26336A90073B6686G262J2225M65114A55010K43069j61504N82373
13551H18948C25649A55286J38455N7168K54176k12278A39704n5420P2962O8813
$$ plain form
13624 474092 384442 277364 536468 409460 467032 352924 388820 146165 452757 144662
13613 259726 179291 392095 384391 225392 271627 406867 550302 218698 619660 392807
13603 392807 356624 205825 384430 342768 195011 411997 440154 448729 215322 266703 89861
13591 282903 392748 557646 293963 327548 372043 325205 380221 336650 479142 748082
13581 748082 322113 290776 440142 163698 357972 427759 349417 322792 310559 506917
13571 506917 196531 352127 524148 66830 363717 334310 414769 178230 472487 466714
13561 466714 593050 190073 26686 7262 19487 484601 155010 398079 236575 818948
13551 818948 325649 155286 293741 350909 605085 392807 139704 84284 157246 226059
13541B26059o6678J99673J8964j16037J51220M9305A51197K30186A44757J78321
13531C23078B8615K62986J38369J17906j09969b368B17114K39648A75407n438
13521A69969L12758A35378J72954l4781j33619K61320k4638j10720J45273G4191
13510B56151M4552G2312J3508K81882j40704J80198r0918P101Q1174j29939J12001
13499C86615A81152K42223j34202K8611k420O1618j86460K45250j90108j19375
13489A26289J72233J40320o2121A67281j3917J65322J10407a6406A31849L92933
13479E24782B58019Q2073K20875I8320K31196m4489K60753B14123E5950K75806
13469C31756A14833K15389D7195a97935b6763A66232H0404j5649M8271O9874o246
$$ plain form
13541 226059 159381 359054 378018 261981 413201 462506 151197 381383 144757 323078
13531 323078 28615 291601 429970 547876 437907 -2368 217114 456762 175407 169969
13521 169969 482727 135378 308332 273551 139932 401252 376614 265894 411167 74191
13510 256151 300703 72312 85820 367702 226998 407196 316278 323379 404553 274614 386615
13499 386615 181152 423375 289173 317784 315364 376982 190522 435772 245664 126289
13489 126289 298522 438842 376721 167281 153364 318686 429093 -16406 131849 524782
13479 524782 258019 340092 560967 98320 329516 285027 545780 214123 55950 331756
13469 331756 114833 330222 47195 -197935 -26763 166232 80404 64755 113026 182900 176654
13458A76654J4891l2591o0267J0371K4167L6607j6695K7841m8721M03925E1367
13446E22757B13119G1488O4168a42852B68676l163q3884J01982A05796N6522M0447
13435B02765a0300A16753f642B26130L81500B43305B2343K31051o3433J4531o4677
13424A39815K78847E7302N91543A44528K96533G7056O3813K92156A12252k8857
13414H3395M44583k31448e0494G3550Q1052J256K69792a2797B22240J39768G8503
13402C91458A51850K03556n5815A43723O5665l9575A5836M38099B14203E6809
13391D08941l3719j50762n1741q5918M56238a19154C74242j69416L77482k31595
13381C50713j66693H9087L93943E2718L57677a83672A0862O7414J51019h2463
$$ plain form
13458 176654 191545 158954 98687 109058 133225 169832 153137 180978 132257 536182 51367
13446 522757 213119 71488 135656 -142852 268676 265513 181629 283611 105796 162318 202765
13435 202765 -10300 116753 -6642 226130 607630 243305 22343 253394 189961 204492 139815
13424 139815 418662 57302 648845 144528 441061 77056 140869 433025 112252 83395
13414 83395 527978 296530 -50494 73550 154602 155858 425650 -12797 222240 362008 78503
13402 391458 151850 355406 299591 143723 209388 169813 15836 453935 214203 56809
13391 408941 375222 224460 172719 86801 543039 -119154 374242 204826 582308 350713
13381 350713 184020 89087 483030 52718 410395 -183672 10862 78276 229295 -82463
13370A24548m5623L7504L57727r5505J13159E5389J98443J37496A08345m4527
13360F3818L34817j19755E9604P6995L6038C4898J75642F3340J81883b68760D29081
13348A01385K25789J44723A2353O19850k57880j02810K15211B28603J88768j87808
13338B29563J8481b41106B67148K10945E530J53169p3228R9350D3755N3483C8209
13326B53095D6983L11590j20208p8226e2606A8972N99098E0803O0427L84620A64833
13314b8203k2514D68412a16134B7822L45287C1832K38719A29067P2978J81524
13304C83569l2543A02435b8527I8042b1025C86705B5968L76233h6686B1225a00749
13292d8080I3564J28362g6839F8649g5872B04987K7779h0122A78690m9074O9788
$$ plain form
13370 124548 78925 116429 474156 378651 491810 55389 253832 391328 108345 63818
13360 63818 398635 278880 59604 136599 172637 34898 210540 63340 245223 -268760 429081
13348 101385 327174 471897 12353 632203 374323 271513 486724 228603 417371 229563
13338 229563 248044 -241106 267148 478093 5530 158699 85471 184821 43755 97238 38209
13326 253095 46983 358573 238365 160139 -52606 18972 618070 50803 111230 495850 164833
13314 -28203 -50717 468412 -116134 27822 373109 31832 270551 129067 202045 383569
13304 383569 351026 102435 -28527 98042 -21025 386705 25968 402201 -86686 21225 -100749
13292 -48080 93564 221926 -76839 68649 -75872 204987 232766 -80122 178690 129616 199404
13281A99404I6665F472K9573a56616C5346M4251a98444d538k0302n3276A74686
13269c6935C07823A30710N6964J53925j23958N3178D5612b30442D5522b12697
13258D7083J2575K70454A08622D2951K99575B3641J97385D5733J26208Q4180a07468
13246D56241j54127m7933j07568g4551D059e4998A23662I701i4279C03131b674
13234H7454K8850J18156c66022B82033b39302J04538A6465K87383A11100a59895
13223i1000B22467b65279K0328C35458m8457a29291B34885e7342j2146D05018
13212B73313a16586A28038b22528R8353B79009M40K9776r8919G0567a18997A12397
13200B85776C8578J20066j8729n2711Q8526Q9311J39731C1142J7760J13670J54197
$$ plain form
13281 199404 96665 6472 36045 -156616 35346 79597 -198444 -4538 -24840 -78116 174686
13269 -36935 307823 130710 187674 341599 217641 270819 45612 -230442 45522 -212697
13258 47083 59658 330112 108622 42951 342526 23641 221026 45733 171941 256121 -107468
13246 456241 302114 254181 146613 -74551 4059 -54998 123662 9701 -94279 303131 -2674
13234 87454 116304 234460 -366022 282033 -239302 -134764 16465 303848 111100 -159895
13223 -91000 222467 -265279 -244951 335458 287001 -129291 234885 -57342 -69488 405018
13212 273313 -116586 128038 -222528 -124175 279009 279449 309225 210306 70567 -118997 112397
13200 285776 38578 158644 139915 87204 175730 265041 404772 31142 48902 162572 316769
13189C16769b1207C56680A50569K33670k1583b796B54028c5355E28970a5164C17845
13177E0374K23575I0436J91119A20820c3434H1540a024A78430a85627B87348j3735
13166B73613b2932A65329i0300H7316h7722b4076l599q587F69J56266a16338B00391
13153B56997F363J86754c4814C56974a05351B71163k4041N5293o9200r4805I701
13141I4742K22387i0518A10852l029L8507d1154C21319p8090D7785M041j0860
13130D0966n783a25294C4005J10462E3782M9614J13316G1843J95308A32351a30035
13118F1843M86596B49641a25240B15596q3759J73587q1863a24792D9544e4079
13107A18938a612k2476D23593c7921A16681j396b24631A14796e4156B72383o8139
$$ plain form
13189 316769 -21207 356680 150569 384239 362656 -2796 254028 -35355 528970 -15164 317845
13177 50374 273949 90436 281555 120820 -33434 81540 -1024 178430 -185627 287348 273613
13166 273613 -22932 165329 -90300 87316 -87722 -24076 -27675 -36262 669 156935 -116338 200391
13153 256997 6363 193117 -34814 356974 -105351 271163 247122 302415 233215 138410 9701
13141 94742 317129 -90518 110852 107823 146330 -41154 321319 243229 47785 51826 40966
13130 40966 35183 -125294 34005 144467 53782 103396 216712 71843 267151 132351 -130035
13118 61843 548439 249641 -125240 215596 131837 305424 223561 -124792 49544 -54079
13107 118938 -1612 -24088 423593 -37921 116681 115285 -224631 114796 -54156 272383 204244
13096B04244h2715A8217i3099j34126J09655A87981J7994c7657A51519L0725p3504
13085A08740L7913a17751A63609F9731e9707n0823j14255f1681A08447a90729
13074A28645N5674Q1848A20429J90797D3684Q397M6808K2957L37959A29215J80379
13063C09594C584M1352R3735L72989E1148b26827J1411H8647c9496A05207l426
13052A01781m6817J17606a63093A88719P1968A26318N6230b6243m8759G1247J0392
13041H1639J96616l201o7224c72344i6001p9591F383Q852J92197a41119A69128
13029a35533E5667b0714B57726j04835l78Q0806r3470o5954Q6373K93807A58691
13017a24394A31979L0611C4736h9285B78498a75228B2356K77696N5421e5069C16358
$$ plain form
13096 204244 -82715 18217 -93099 -227225 -117570 187981 205975 -37657 151519 182244 108740
13085 108740 146653 -117751 163609 69731 -59707 -110530 -224785 -61681 108447 -190729
13074 128645 184319 266167 120429 311226 43684 52081 98889 121846 459805 129215 309594
13063 309594 3584 44936 138671 511660 51148 -226827 -215416 88647 -39496 105207 101781
13052 101781 54964 172570 -163093 188719 260687 126318 182548 -26243 -75002 71247 81639
13041 81639 278255 275054 207830 -372344 -96001 -175592 6383 15235 207432 -141119 169128
13029 -135533 55667 -20714 257726 152891 152513 233319 139849 73895 160268 454075 158691
13017 -124394 131979 162590 34736 -89285 278498 -175228 22356 300052 355473 -55069 316358
13005E28855A82013J02583O6473A45442K60074D0979a04300f053A3314d0063k19475
12994b59538E5624k7155l510e1025G9574a86206A85501b48009C13169a3853l48132
12983c61985B23805q2003j0425c08713C27485H9245e257r5932B07539G8609K25664
12972C04273D6008a24232d9276C64327d014m9109P822B507M5377d6505A74090
12960D4466J27769F7849a78362K4477C47069A73099G7965b20847H7348h166p3640
12949h1806m2435A68113p8608b30450d9247l3730a27k35822A10107D7351R8545
12938A45896E0926O6383a850m2135B38192h6426o5211B12993I3667b9491B51858
12926G1585J99155j03752k5346K20731a5918A40857J34903a7861k3719A0317K91194
$$ plain form
13005 528855 182013 284596 351069 145442 405516 40979 -104300 -6053 13314 -40063 -259538
12994 -259538 55624 28469 24959 -51025 79574 -186206 185501 -248009 313169 -13853 -361985
12983 -361985 223805 141802 131377 -308713 327485 89245 -5257 -101189 207539 78609 304273
12972 304273 46008 -124232 -49276 364327 -4014 -53123 -45301 2507 47884 -46505 174090
12960 44466 172235 67849 -178362 -153885 347069 173099 77965 -220847 87348 -8166 -81806
12949 -81806 -124241 168113 89505 -230450 -49247 -82977 -127 -235949 110107 47351 145896
12938 145896 50926 117309 -1850 -43985 238192 -86426 -151637 212993 93667 -29491 251858
12926 71585 270740 166988 141642 362373 -15918 140857 275760 -17861 -41580 10317 301511
12915C01511E5220a15981j33809f9550A67558D638P2357K85768a0079j38193d6082
12903A46105L4539g0432q8665L344B02598a7504A01966L6891F6169A5799l997
12892A1802Q8368j2656b5822A08809c3126m6935A33304F0510A7162J74376o9368
12881A22170B8128c0282B14346C414J00405J9122l5853a42690C8536a55886B32028
12869A15983b92931B9179a65997r2687Q9639m4058A62992C7111a70176B01125
12858G7308L9132l0248P6133N8814J2308a57903O1667c0257I7520B860J15407
12847A18267n2432a40814k17856F3022p983c4004B58086i9263A8177K7974a18729
12835d1911a5983r4781L9174k22662A61658b80862e0276q9307A70435a53285D16665
$$ plain form
12915 301511 55220 -115981 -249790 -69550 167558 4638 76995 362763 -10079 -148272 -46082
12903 146105 180644 -70432 -159097 -155753 202598 -17504 101966 138857 66169 15799 11802
12892 11802 100170 87514 -25822 108809 -33126 -80061 133304 60510 17162 191538 122170
12881 122170 28128 -30282 214346 3414 103819 122941 87088 -142690 38536 -155886 232028
12869 115983 -292931 29179 -165997 -258684 -169045 -213103 162992 37111 -170176 201125
12858 77308 116440 86192 162325 221139 233447 -157903 -96236 -30257 97520 2860 118267
12847 118267 65835 -140814 -358670 63022 55039 -34004 258086 -99263 18177 46151 -118729
12835 -41911 -15983 -110764 -71590 -294252 161658 -280862 -50276 -139583 170435 -153285 416665
12823A69246a77749G468J47958F771a72327F6221B1139a44545G547J03618J66161
12812B77326H3883H873b86264A69724D1553b258B71686H488K10490A06258a25792
12800B98904D5753a12430a8736A46654Q6529A01874C4190b48759h4213j70819
12790b55032K6913D1386f2769j95149F5518J13906j7894g6401H4678f8175j26645
12779a94820A49646a55832P3024q1053g5714k46391D699L5151P145A2056O6858
12768G8914p908a58861r599A18983L3399A7415h0351G4912a4359C31035a2943
12756B14766b47787F4362e5684B90503b28135K6741N5150B28719H1093J3192b0705
12744c4065A52168R6748q4854N2181A06696m5389M66411B01340F8676J55809J50101
$$ plain form
12823 169246 -177749 7468 155426 6771 -172327 66221 21139 -144545 7547 111165 277326
12812 277326 83883 8873 -286264 169724 41553 -2258 271686 8488 218978 106258 -125792
12800 298904 45753 -112430 -18736 146654 233183 101874 34190 -248759 -84213 -255032
12790 -255032 -228119 41386 -62769 -257918 65518 179424 161530 -76401 84678 -68175 -194820
12779 -194820 149646 -155832 -82808 -163861 -75714 -322105 4699 39850 46995 12056 78914
12768 78914 71006 -158861 -168460 118983 152382 17415 -80351 74912 -14359 331035 -12943
12756 214766 -247787 64362 -55684 290503 -228135 -201394 -146244 228719 81093 94285 -20705
12744 -34065 152168 248916 164062 216243 106696 61307 527718 201340 68676 224485 374586
12733C74586A71825L754k1499K76815A47456k769A2833O7299J52973B7468b07814
12721F1627J40028a13489I0427K2306B6881a57662P6479B46541A15427a0215A8126
12709B97355g2286B39859M4998r6499o696O7841j23829L1620j6116F541K58062
12698B64603j23522j7413P937Q4002E1030a31115f908G3594J20091D7593a01172
12686I3532f7334k27667B5729b23942A94900O571p5048J36807j24977J24683j07890
12675A55046j4740C3731L5279K5513L3599c129I4339Q2714a14961H9575P8234
12664A67809g8141B05025E3972E427J30725L2373E8907a59643A43223d0073k56518
12653b96591B44414k1087m3774c7148C1531a02636j71196a21485c7707e537A16133
$$ plain form
12733 374586 171825 175579 154080 430895 147456 144687 12833 80132 233105 27468 -207814
12721 61627 201655 -113489 90427 112733 26881 -157662 -81183 246541 115427 -10215 18126
12709 297355 -72286 239859 284857 188358 181662 249503 125674 157294 141178 6541 264603
12698 264603 141081 123668 131605 215607 51030 -131115 -6908 73594 193685 47593 -101172
12686 93532 -67334 -295001 25729 -223942 194900 201471 126423 263230 138253 262936 155046
12675 155046 140306 33731 69010 94523 128122 -3129 94339 177053 -114961 89575 167809
12664 167809 -78141 205025 53972 5427 136152 168525 58907 -159643 143223 -40073 -296591
12653 -296591 244414 223327 179553 -37148 31531 -102636 -273832 -121485 -37707 -5537 116133
12641a1785B77986r5706g1294G8684O4246J16521h0795K2486A0798b57118i0239
12629B05269E0800Q0711O1321J71787i41C7040J66559j401r8010M02899a75552
12617F0434M23273j81051A9625J18164J58174I6412a80110C185M7465k0167A853
12605a13960j012B14996k138a42692B52807j14596L360J42120E135K11610B7449
12593B70453a26550J5695n3613r9634b2578A07315b02675G8516K7406C9157c87109
12581B74875e6073j25809O1855C4193a58651C7936b77702i2083I0583O2453o7536
12570H5500f2164B10924B9008e0516j6226B7152N56076A78597J27500A41509M3284
12559A84793A6048Q8840a01606A15486j4440h9258A99929b00293E6253J64670
$$ plain form
12641 -11785 277986 182280 -71294 78684 142930 259451 -80795 -58309 10798 -257118 -90239
12629 205269 50800 131511 192832 364619 -941 37040 203599 202198 104188 507087 -175552
12617 60434 483707 302656 19625 137789 295963 96412 -180110 3185 50650 30483 1853
12605 -113960 -114972 214996 212858 -142692 252807 138211 141571 283691 5135 216745 27449
12593 270453 -126550 -110855 -164468 -264102 -22578 107315 -202675 78516 105922 39157 -387109
12581 274875 -56073 -181882 -120027 34193 -158651 37936 -277702 -92083 90583 153036 85500
12570 85500 -62164 210924 29008 -50516 -66742 27152 583228 178597 306097 141509 184793
12559 184793 16048 104888 -101606 115486 101046 -89258 199929 -200293 56253 220923
12549B20923d7961B41680a02377F5435J6405a2366A95259b9502n8664j64510f4278
12537H6104K32338j50572M9541d4807A43565a32712a1545G8816N4856l7735j1814
12526H4123J84405E6702N617L26302a47871k8896c7709A41999B3719f5026J4209
12515e0817B6630N4634k895M3441A4306c853o1792j54216B1607a73610A61192
12503a1983B52392P7327g6433j3676C06906D1194b26125b0021F8895a2013k0626
12492c2639A60175G6225a8174j17366q5245C35492m9235a30278O2347J0001A7748
12480A56329a14125n4172K0324G1582a14359E0557K3439K38162n7036R4848c45943
12468A1972N7016a99726A7050J05067h623A52669F0466a2006C58094c288A47992
$$ plain form
12549 220923 -47961 241680 -102377 65435 81840 -12366 195259 -29502 -88166 -252676 -64278
12537 86104 318442 167870 217411 -44807 143565 -132712 -11545 78816 133672 95937 84123
12526 84123 268528 56702 62319 388621 -147871 -176767 -37709 141999 23719 -65026 -50817
12515 -50817 26630 81264 78369 121810 14306 -3853 -65645 -219861 21607 -173610 161192
12503 -11983 252392 329719 -76433 -90109 306906 41194 -226125 -20021 68895 -12013 -32639
12492 -32639 160175 76225 -18174 -135540 -220785 335492 286257 -130278 -67931 -57930 17748
12480 156329 -114125 -168297 -147973 71582 -114359 50557 73996 312158 255122 349970 -345943
12468 11972 68988 -199726 17050 122117 -8623 152669 60466 -12006 358094 -3288 147992
12456a84305i0500d2436A509R5384a48221b0783n4079A33520O0815a6413B29948
12444a5968m6570l9839A63430o168L0321q0888J26358m9154k4935a49373k20806
12433c70179B6998i4162k97128e0036j25573A66301C3750J45834h6245p7408A13615
12421c12915j41285K21200d6909r7170A56355j6731P3238M6757b2325l7746A53761
12409C3127b68060A19651a21555o4607A49070r307a60933O7056G0178J63240p9233
12398A54185q825L0362b17814C006K36331f790A25442O4609h784j25343H1913
12386B8258K3220d08214a74866e1431C60358g1269B02033o5267g2925l7447a6112
12374b05899P8317l13748E3637i4952B09671m1394E6870K15327j14914E3826J51078
$$ plain form
12456 -184305 -90500 -42436 1509 96893 -148221 -20783 -74862 133520 194335 -16413 229948
12444 -15968 -62538 -102377 163430 157262 187583 106695 233053 183899 158964 -149373 -370179
12433 -370179 26998 -94162 -391290 -50036 -175609 166301 33750 179584 -86245 -163653 113615
12421 -312915 -454200 -233000 -46909 -144079 156355 139624 212862 259619 -22325 -60071 153761
12409 33127 -268060 119651 -121555 -186162 149070 139763 -160933 -93877 70178 233418 154185
12398 154185 145360 175722 -217814 3006 239337 -6790 125442 190051 -8784 -134127 81913
12386 28258 51478 -408214 -174866 -51431 360358 -71269 202033 136766 -72925 -110372 -16112
12374 -205899 -127582 -441330 53637 -94952 209671 168277 56870 272197 157283 53826 204904
12363B04904F0461a40894a6816C8631J96582D6402O7973J17480D3937j4124g3947
12351b00057p109A71264b85646e6280B70152f0570A36794a60037A88520a6895
12340E91253A20874A863L3226h3312B35447J1310n9981J21902A03425h5468F325
12328F2463i1170a5883G5610b75978A55256E2510b03502B01243m4956a07010n8507
12317a65517I9512c26736j10596E0049F560K00802q3789b81548H0878b24619I8995
12305A47303b16915c0105j62352O1814A88500l0281E206M8642L8409a13203B36356
12293e7715p874r1434a0997B70845j01416c33334J60814E00118a16266I4758k2010
12282G2748B6186K46055A11631L25313A89072N4356P0027r4486K45411J15353
$$ plain form
12363 204904 60461 -140894 -16816 38631 235213 46402 114375 231855 43937 29813 -73947
12351 -200057 -207166 171264 -285646 -56280 270152 -60570 136794 -160037 188520 -16895
12340 591253 120874 1863 35089 -83312 235447 246757 186776 308678 103425 -85468 6325
12328 62463 -91170 -15883 75610 -275978 155256 52510 -203502 201243 156287 -107010 -165517
12317 -165517 99512 -326736 -437332 50049 6560 207362 123573 -281548 80878 -224619 98995
12305 147303 -216915 -30105 -192457 -130643 188500 158219 5206 53848 92257 -113203 236356
12293 -57715 -65589 -157023 -10997 270845 169429 -333334 -172520 500118 -116266 94758 72748
12282 72748 26186 272241 111631 436944 189072 243428 313455 218969 464380 579733
12272E79733A27292P1691l4040O6061g3230A18445C2450L28295A44129R0390J5082
12261B49601n5530I3980j4774J4759D1607O315R494L9198J67339q27A31539L25239
12249D56778b15531j28039B71495a42593A43458o6422c3723p6229n8605A71189
12238A17731O9566a21707K2804b2922P859I8106b71860A92019I1655O8208Q3927
12227B43790J05924Q2484A98516Q9419p7777b143A09595K44361l5715B9806K90823
12216C20629A35743Q6246J1337l6522k0825K8166C0252L8516j6585K13429i3881
12204A40119J98529A31505e742A16336k9213k1935L33182A21102K10752E0856
12193B03825r9707a3739B54558K04869K94A33065J03205b33156d1321A33056m0664
$$ plain form
12272 579733 127292 198983 164943 231004 -73230 118445 32450 360745 144129 234519 249601
12261 249601 194071 93980 79206 93965 41607 47922 57416 96614 263953 263126 131539 456778
12249 456778 -215531 -343570 271495 -142593 143458 77036 -33723 -109952 -168557 171189
12238 117731 187297 -121707 -98903 -22922 -15063 98106 -271860 192019 91655 159863 243790
12227 243790 349714 432198 198516 287935 210158 -2143 109595 353956 318241 29806 320629
12216 320629 135743 221989 233326 196804 175979 204145 30252 68768 52183 265612 -93881
12204 140119 338648 131505 -5742 116336 87123 65188 398370 121102 331854 50856
12193 203825 104118 -13739 254558 459427 459721 133065 236270 -233156 -41321 133056 92392
12182I2392h2648k9282C07545A28854J33473j4804E7697j5668J91516O1675r857
12171B85363q2277L39723A96822E9844c8243A03074l012J45446q4183g7606I8634
12159A13720i5612e068C09722j35871O062c0393B10886F1295K87806q2372c403
12147A81820B5536c0997E6424J57616e5439B5148c1751h644o174E2110a14187
12135a14562B59296e8583C01679K96r7842B9693a46247B23506o6740a02108j01918
12124b04026c4188B32043J4024F1458J75472b76703i1474L6271n6608A93785O2608
12113B56393f2902j70245A77964d02583a98025j8483e2973A9579c9933B41343
12102a36359a1723m69136F3775a08174m2322E9676c10833J48493B3233J07645
$$ plain form
12182 92392 -82648 -111930 307545 128854 262327 247523 57697 42029 233545 295220 285363
12171 285363 203086 542809 196822 59844 -38243 103074 100062 245508 161325 -77606 98634
12159 113720 -95612 -5068 309722 173851 179913 -30393 210886 61295 349101 266729 -3403
12147 181820 25536 -30997 56424 214040 -55439 25148 -31751 -8644 -14818 52110 -114187
12135 -114562 259296 -58583 301679 301975 204133 29693 -146247 223506 156766 -102108 -204026
12124 -204026 -34188 232043 246067 61458 236930 -276703 -91474 -55203 -111811 193785 256393
12113 256393 -62902 -233147 177964 -402583 -198025 -216508 -52973 19579 -39933 241343
12102 -136359 -11723 -480859 63775 -108174 -150496 59676 -310833 -162340 23233 130878
12092A30878i3251a1020C16215A33235i8224n2356A70882a03930M9403D9459O0382
12081A09841b06828A4927a4006E70J66981J66725L103J011109M73620n08096l93113
12070I20899I3464g3070D6748e5556A09744a50431K3045J4445D6932c6044A40831
12058b1121l5906B55301c692A57539b22255B49008p1351J22719B6152a61349A68278
12046d8911j7670F7760c06936a41509p5468B7451J80390e8207B16117b46541A59215
12034C9658f9868L2865r3991A88809c66566B03252B5641J70158p2327k4582g5202
12022B6761J53955f0802A40507E0434L42774a87028h7348c8255B03935H5837c4419
12010A89126Q010a66356d2590A7992d48A6333b49747Q2334B66088a09746A60328
$$ plain form
12092 130878 -93251 -11020 316215 133235 -98224 -150580 170882 -103930 -54527 49459 109841
12081 109841 -206828 14927 -14006 570 167551 334276 337379 1348488 1822108 1314012 920899
12070 920899 93464 -73070 46748 -55556 109744 -150431 -127386 -112941 46932 -36044 140831
12058 -21121 -57027 255301 -3692 157539 -222255 249008 177657 300376 26152 -161349 168278
12046 -48911 -66581 67760 -306936 -141509 -216977 27451 207841 -58207 216117 -246541 159215
12034 39658 -69868 -37003 -130994 188809 -366566 203252 25641 195799 123472 98890 -75202
12022 26761 180716 -60802 140507 50434 393208 -187028 -87348 -38255 203935 85837 -34419
12010 189126 197136 -166356 -42590 17992 -448 16333 -249747 -167413 266088 -109746 160328
11998c15929I1115O6961n3060a37153E426J39432a10977A04852C0628i5489a9780
11986A22589l465h734r8793j34881E7365g724j58953D60365A26200e4140A2611
11974A231c40811J40684h3012b1661H8852a17018A19978a01885n0738K471P0205
11963g9947j15841d2345j27821i793D143a8185j32352A21719N3439a24132C4158
11951e699j4933B09973m2978a54956f6720j74621P0598D2662b85010h0715m0958
11940a21673B82102a63986n448Q3430C08878a66821I2223A376J17142a44858e0332
11928E8003m712N13518e5590m0527B5072b17736A00974a09128n8277C96093A04822
11916C70398b80376g7106j95596A51085C7871O1359c3370i169A15769a37459n549
$$ plain form
11998 -315929 91115 158076 105016 -137153 5426 144858 -110977 104852 30628 -95489 -19780
11986 122589 119124 -8734 -107527 -242408 57365 -7724 -166677 460365 126200 -54140 12611
11974 1231 -340811 -200127 -83012 -21661 88852 -117018 119978 -101885 -152623 -150152 -79947
11963 -79947 -195788 -42345 -170166 -9793 4143 -18185 -150537 121719 175158 -124132 34158
11951 -5699 -20632 209973 166995 -154956 -66720 -241341 -170743 42662 -285010 -80715 -121673
11940 -121673 282102 -163986 -169434 -86004 308878 -166821 92223 1376 118518 -144858 -50332
11928 58003 53291 566809 -55590 -96117 25072 -217736 100974 -109128 -167405 396093 104822
11916 370398 -280376 -77106 -272702 151085 37871 99230 -33370 -9169 115769 -137459 -143008
11905a43008k1563G3595e2196A22439B6654O0406e3670B12763r4718n5389k1117
11894D1539A7a91016j83074i3534A55152J1904G479J77524d7107H6377L4949K08655
11882C29981A2911J12433f7036j63702B92348b1813j78906F3184b16049d4016
11871d1182H6942a7994B50165a28901B49339D4967J13846a05404d4287m5106r3404
11860a82797c9886k22124a20173j74246g328k34829B75424b18316D8266a42392
11849a77774g4803o9476O3331r7496C05899a20585A46733b43055j77525A49563
11838b66840a29600K5516G1413d28916A32766B3228c62302B34239a84136a9232
11827b60236B78779b51815P5551A87408e4118B04237L5309i0706l93313E9279
$$ plain form
11905 -143008 -164571 73595 -52196 122439 26654 87060 -53670 212763 118045 62656 41539
11894 41539 17 -191016 -374090 -93534 155152 167056 7479 185003 -47107 86377 121326 329981
11882 329981 12911 125344 -67036 -230738 292348 -21813 -200719 63184 -216049 -44016
11871 -41182 86942 -17994 250165 -128901 249339 44967 158813 -105404 -44287 -89393 -182797
11860 -182797 -39886 -262010 -120173 -294419 -7328 -242157 275424 -218316 48266 -142392
11849 -177774 -74803 -144279 -80948 -178444 305899 -120585 146733 -243055 -420580 149563
11838 -266840 -129600 -104084 71413 -428916 132766 23228 -362302 234239 -184136 -19232
11827 -260236 278779 -251815 -176264 187408 -54118 204237 239546 -90706 -484019 59279
11816b52330c7235B77515A01962l0007d9371k5472j37709A66334a03513E7221
11805A35035G985a51574A00465J2399J79356i4609k93599A10115b37319A06881
11794a76711B13516r5546b3406B91519a06935d5679C29155I1964b9763F5297c6540
11782B98117b26152A40980g286A56118k6128a65286a834j26269N3200H3494b65981
11770F1895k8079O4035a45292e3084A64256E5098b76678R2706I2996m5720M35790
11759D83066A43582c3647G3751A1766O571J03669O1449a06764h329B24306o6594
11748A57712a76095E8301a46263N6541K8522G720J53095b01963K2673g095B51616
11736G6183K55630F2934L7831J7878N3748d3961A45516J54591G824d6975J0568
$$ plain form
11816 -252330 -37235 277515 101962 71955 -49371 -74843 -212552 166334 -103513 57221
11805 135035 7985 -151574 100465 112864 292220 -94609 -388208 110115 -237319 106881
11794 -176711 213516 117970 -23406 291519 -106935 -45679 329155 91964 -29763 65297 -36540
11782 298117 -226152 140980 -7286 156118 129990 -165286 -1834 -128103 -74903 83494 -265981
11770 61895 33816 97851 -145292 -53084 164256 55098 -276678 -183972 92996 47276 483066
11759 483066 143582 -33647 73751 11766 18337 122006 183455 -106764 -8329 224306 157712
11748 157712 -176095 58301 -146263 -89722 -61200 7720 160815 -201963 -179290 -7095 251616
11736 76183 331813 62934 100765 118643 172391 -43961 145516 300107 7824 -46975 -36407
11725c6407j97282H199B783J11616f1363A61886a23303C64h0640j68496B94134
11713b30927B8494a28058B08606n3794a57328A2464f8975B24492C7123L13365
11703C50488A11973J82669A3318c0148A2557c7900B05728a31369G5342J80346
11693B55688a64187B67994B9914i0206q1810D20624C3750J9131O1213h191j79043
11682a87234O2229d9109H4433a04B62272A996e8344A36437F7163a65471P7054
11671h8417c1386A62353g330j41067A26330a75526J8102J4015B15090F0633a49092
11659A10785h506B9099a2846j86153E6911B1281f1511G3283a16622A54146c4715
11647i7864e138j86424A63584C5619a11478j50896k7197B04625p8782E5733b1174
$$ plain form
11725 -36407 -233689 8199 2783 114399 -61363 161886 -123303 364 -80640 -249136 294134
11713 -230927 28494 -128058 208606 154812 -157328 12464 -68975 224492 37123 350488
11703 350488 111973 294642 13318 -30148 12557 -37900 205728 -131369 75342 255688
11693 255688 -164187 267994 29914 -90206 -172016 420624 33750 52881 114094 -8191 -187234
11682 -187234 -125005 -49109 84433 -104 262272 1996 -58344 136437 67163 -165471 -88417
11671 -88417 -31386 162353 -7330 -148397 126330 -175526 -157424 -143409 215090 60633 -149092
11659 110785 -8506 29099 -12846 -198999 56911 21281 -61511 73283 -116622 154146 -34715
11647 -97864 -5138 -191562 163584 35619 -111478 -262374 -289571 204625 125843 55733 -21174
11635B19861c0607A38856n8693p925b69732A84646F1396d3018E4464g9164B10149
11623B73837q8527a03153A41883j7486p276k3776h9314j5421j55833m4998G187
11611a34549b9906A0648K14693N3101B6583K26837A02998m6095f5620C15469k8366
11600B87103H257K39664J38321A52605O770o9806J88244d3151D6602N7158K25085
11589C28845j11862P425a78957C27373A7260M59455c11584C30976A25656K35046
11579C60702A32421P7541I5010A8481K44546h8083j9386I5319J27597C2440j2400
11568B0040A055d5386B87981m1567j07450e1071I5010L68974A05392K1035i5606
11556D47651i4149A04506b98522i9623A98288K6127A10874J29308p1824a3774
$$ plain form
11635 219861 -30607 138856 80163 72238 -269732 184646 61396 -43018 54464 -79164 210149
11623 273837 185310 -103153 141883 124397 117121 93345 -89314 -104735 -260568 -305566 7187
11611 -134549 -29906 10648 225341 278442 26583 253420 102998 56903 -65620 315469 287103
11600 287103 8257 247921 386242 152605 159375 89569 277813 -43151 46602 103760 328845
11589 328845 216983 224408 -178957 327373 17260 476715 -311584 330976 125656 360702
11579 360702 132421 209962 95010 18481 263027 -88083 -107469 95319 222916 32440 20040
11568 20040 1055 -45386 287981 246414 138964 -51071 95010 463984 105392 126427 -95606
11556 447651 -94149 104506 -298522 -99623 198288 224415 110874 240182 168358 -13774
11545E28926B60341K40143a27823B75934C504Q3114J50401e5210J2230B05600
11534C7038j3130J03476L52935C6016J35393d3105A19778J62875F2795J65870
11524B28665m2400o7259a08049B94939a08174J8667H2879A7252J29766l7591b9698
11512A03472a11839B48929J69945A21074j8694a80273A02598J08358a04221M5692
11502e8529A51884o7811i2714C42595q2672A18485D915J29395J76357K00588H313
11490B71580a1096D67741A99473E1454a27216D34286A92623D9001Q7723J63569
11480C00293A6733K10622a2091C02904L55802l06444O1741j99374F5319b66844
11469f3092A18615K4945Q5173J14729E7685K30087O1074A9847a385C63638L8035
$$ plain form
11545 528926 260341 500484 -127823 275934 3504 86618 237019 -55210 -42980 205600
11534 37038 23908 127384 480319 36016 171409 -43105 119778 282653 62795 228665
11524 228665 186265 119006 -108049 294939 -108174 -89507 82879 17252 147018 109427 -29698
11512 103472 -111839 248929 418874 121074 102380 -180273 102598 210956 -104221 -58529
11502 -58529 151884 84073 -92714 342595 259923 118485 4915 134310 310667 511255 8313
11490 271580 -11096 467741 199473 51454 -127216 434286 192623 49001 136724 300293
11480 300293 16733 227355 -12091 302904 658706 352262 414003 214629 65319 -266844
11469 -63092 118615 143560 228733 343462 57685 287772 348846 19847 -1385 363638 401673
11458D01673F1137J23104A416K2467a50676g0854C1558d14572A5855P9878K35034
11447C30767A59079l6573a0599B54484n9142E8198J15385K77460E8057A1226b91952
11435B76241c06374E2850M00579e3064j18684A92021a47045l76j14339E3569J79320
11424B32889k7722c1538p489C72101a34873J4016F494e0043j25077a7913q0245
11413i8158c6313J072i198C98411A90902a05107F2299a72891A91134P5053q8828
11402A77359D1226h599I1055m5515J34296c02609B7493d2051l2422B10463b812
11390F3359A3577a50369L4722A90238C1322a0888j40492l01987B84206A32858
11379a15006p0379A6258J17725b28975G5142J47589a9566C4559d8291j26772A40426
$$ plain form
11458 401673 61137 184241 1416 23883 -150676 -70854 31558 -414572 15855 95733 330767
11447 330767 159079 122506 -10599 254484 195342 58198 173583 451043 58057 11226 -291952
11435 276241 -306374 52850 453429 -53064 -171748 192021 -147045 -147421 -261760 53569 232889
11424 232889 205167 -31538 -39027 372101 -134873 -120857 6494 -50043 -175120 -17913 -98158
11413 -98158 -36313 -35241 -9198 398411 190902 -105107 62299 -172891 191134 266187 177359
11402 177359 41226 -8599 91055 45540 179836 -302609 27493 -42051 -74473 210463 -2812
11390 63359 13577 -150369 -115647 190238 31322 -10888 -151380 -453367 284206 132858
11379 -115006 -185385 16258 133983 -228975 75142 222731 -19566 34559 -48291 -175063 140426
11367B35854f5162C16781b9185C937O5789j493a96825Q3722A8885b2313k11838
11356b34151D65456a81602A5930a26208j19760R7888d7731q7531m4542A78288
11345a72937E9251c04193d448A15233J84448n8189a53003A13743d8077A0734M9655
11334F0389a3079C47c20l40161J01733A240J19457P1435f3181n1969k40290B42126
11321a28986C05862r1462a4947A4953N3593d0397A5946J41621g8599j1732B37904
11309E1501d9907A37901J07701J02740b67353B44079C5091Q3819b21088A51598
11298i6002j02556B98078A7807R454a87505A1187a74235A71471b1151B27241f1114
11286A06130m4608k3241O67A2587J56520J61623A41293j955a26296D4095a56140
$$ plain form
11367 235854 -65162 316781 -29185 3937 69726 68233 -196825 -113103 18885 -22313 -234151
11356 -234151 465456 -181602 15930 -126208 -245968 -148080 -47731 -135262 -179804 178288
11345 -172937 59251 -304193 -4448 115233 299681 241492 -153003 113743 -48077 10734 60389
11334 60389 -13079 347 -320 -340481 -238748 1240 120697 192132 -63181 -115150 -355440 242126
11321 -128986 305862 214400 -14947 14953 68546 -40397 15946 157567 -78599 -90331 237904
11309 51501 -49907 137901 245602 348342 -267353 244079 35091 118910 -221088 151598
11298 -96002 -198558 298078 17807 27261 -187505 11187 -174235 171471 -21151 227241 -61114
11286 106130 61522 38281 38948 12587 169107 330730 141293 139338 -126296 44095 -156140
11274h6521B41302d13607h0705j1165c1802J1285l9311a9223r8056N1434C89224
11262a31948k93064A68388g9334I9818e2205o30226a36688e0887r8559A44896
11251A60122J2633d076B18643g4804j29430E9600a37604M1324J3727B7245c3334
11239A18450c0868I282i6147o0490d3183A57426h1042m5498B8629N5206g3041
11227C18388a25173A72385p4362J24369d5510K1324k50747f6418I6834a3226k57395
11216b70621A7742a62101O2066j73568a18360H2692B3732a00151k843E8817h7383
11204a5235G1412b03433A89263b04548A10257a75004M5828j73131A34228b5730
11193c87945i5388r7369C7109a69960A0310a02201r5728H389A917Q0544a8832
$$ plain form
11274 -86521 241302 -413607 -80705 -91870 -31802 -20517 -59828 -19223 -117279 -65845 389224
11262 -131948 -425012 168388 -79334 99818 -52205 -682431 -136688 -50887 -149446 144896
11251 160122 172755 -4076 218643 -74804 -204234 59600 -137604 -96280 -82553 27245 -33334
11239 118450 -30868 9282 -96147 -156637 -43183 157426 -81042 -126540 28629 83835 -73041
11227 318388 -125173 172385 98023 222392 -45510 -24186 -274933 -66418 96834 -13226 -270621
11216 -270621 17742 -162101 -100035 -273603 -118360 82692 23732 -100151 -102994 58817 -87383
11204 -15235 71412 -203433 189263 -204548 110257 -175004 -129176 -302307 134228 -25730
11193 -387945 -95388 -192757 37109 -169960 10310 -102201 -197929 8389 1917 82461 -18832
11181a5022B5805a15512a909B26235D6398a58329A43448b48036A64360a39870
11170C07490A28391o2748j8638b1604j41839N3408A2230K333b60423o3184B01517
11158F4693J0217k9561a7840M060F2215c10052J38404e5138F5221B3690c39205
11146a20543A70402G5292g4393k35486A29490P3616b59347c2138l0180A47110
11135B17732a34278b5685A88805F4531e4516m1230d4946B58451A2252J59796o2790
11124A09258g4585j81936C5700a90107A09520e3600A42797G122K40942a89585
11113A14581L33239e9708A30354g0531C79006j29123b23304A08813O3242n8293
11103A13762E1179A8789K85282h4146D53635r4777G0994P412C8636a1230C04534
$$ plain form
11181 -15022 25805 -115512 -1909 226235 46398 -158329 143448 -248036 164360 -139870
11170 307490 128391 65643 47005 -21604 -163443 -110035 12230 14563 -260423 -323607 201517
11158 64693 74910 45349 -17840 -13780 62215 -310052 -171648 -55138 65221 23690 -339205
11146 -120543 170402 75292 -74393 -309879 129490 203106 -259347 -32138 -62318 147110
11135 217732 -134278 -25685 188805 64531 -54516 -95746 -44946 258451 12252 172048 109258
11124 109258 -74585 -256521 35700 -190107 109520 -53600 142797 7122 248064 -189585
11113 114581 447820 -59708 130354 -70531 379006 249883 -223304 108813 172055 113762
11103 113762 51179 18789 304071 -84146 453635 358858 70994 78406 38636 -11230 304534
11091A42158G358J96835R7521I1574J36654E3983P7266N6996m7521o9297M10992
11080D82419B04487m0086M6393J34810j29521J37k9377k172k311Q6445K82785
11069E51590k72392K0512K74515n3818j46569J83484J49547O537k96826L5442
11059D52022p806J49909k81771L09747K37626l75241J85752k57099M17541j92270
11049F38410P6890J2934j86375K27074J54289m6328j87924J51892o0885O6834
11039H46811k52846L352L40564q8628n7587R9082l51256L12388q2427q7425j07889
11028E74139K18435k98361K94693j60481M17542k94364J7082l1820N3470j17065
11018F73270k899N4087O7686k8365j41783J62804m3656N9700j79958K925K08832
$$ plain form
11091 142158 7358 204193 301714 91574 228228 53983 131249 188245 140724 71427 482419
11080 482419 204487 164401 210794 345604 216083 216220 186843 184671 182360 268805 551590
11069 551590 279198 299710 574225 520407 373838 557322 706869 713406 416580 452022
11059 452022 444216 594125 312354 622101 859727 484486 670238 413139 830680 638410
11049 638410 715300 728234 541859 768933 923222 876894 688970 840862 779977 846811
11039 846811 593965 597317 937881 849253 791666 890748 539492 851880 769453 682028 574139
11028 574139 792574 494213 788906 628425 1045967 751603 768685 736865 790335 673270
11018 673270 670371 724458 792144 763779 621996 784800 741144 800844 620886 623811 832643
11007H32643k52075J06656r7460K94823m20533K09670o4420J2007K09823Q4854
10997I15988j13139k1520j20353Q8379P9731J56731j24844J72298J7402k86328
10987G64345K24374J50609J33952j32483K0074L0275L51571j22373j09782p644
10977A302918p89Q65704o4028K89877K83874O0775K81647m17711M47781j28496
10967B921552j41985l11090n52166M59886o18231R3482j3217K12069L60639k42160
10957B168779L0703J33945k61311n29567J77677j64086j10280o11096K21356p3481
10947I82639m42981J53166K0426k07379n4040j58041R5321o7941b5398C26217
10936B15638p7275J00655J75854b3346C507N9779K4827J233b8014A83660b64089
$$ plain form
11007 832643 580568 687224 589764 884587 464054 673724 609304 621311 831134 915988
10997 915988 802849 781329 660976 749355 829086 985817 860973 1033271 1050673 764345
10987 764345 988719 1139328 1273280 1140797 1160871 1191146 1542717 1420344 1310562 1302918
10977 1302918 1302129 2167833 2103805 2393682 2677556 2738331 3019978 2602267 3050048 2921552
10967 2921552 2779567 2468477 1916311 2376197 1757966 1851448 1838231 2050300 2410939 2168779
10957 2168779 2199482 2333427 2072116 1542549 1720226 1556140 1445860 834764 1056120 982639
10947 982639 539658 692824 713250 505871 451831 293790 389111 321170 -25398 326217
10936 215638 138363 239018 414872 -23346 3507 63286 88113 89346 -28014 183660 -264089
10924a61225C9451L11867a01660n3034D977i5636n6011E3590P6693j928a71803
10912E6685d7093I1692L35862D3657M0358F26e3894k08551A19829O9141k9291
10901A59679c0735r7571j17648f2830C19585d0606b859j95403A43358E9080N5773
10890A14853n979B610a49842A98407L535a36541d0412F4433h0728I0545A2597
10878A55373b6661j07298N0791A10671a18412e1931A61185l3146c57812A44362
10867F3815b48474F8909k8373a71417E5120b7890l3065F0073j2310b8527A43670
10855C98471j46446o6816h137B45336c8454A04496O7917b266C4475M2138J24352
10844B00965d6692k6122a167I1350K41122F4880a86518f0304B52074b55742e3319
$$ plain form
10924 -161225 39451 351318 -101660 -154694 4977 -95636 -151647 53590 130283 128355 -171803
10912 56685 -47093 91692 427554 43657 84015 626 -53894 -262445 119829 188970 159679
10901 159679 -30735 -128306 -245954 -62830 319585 -40606 -2859 -198262 143358 59080 114853
10890 114853 108874 2610 -149842 198407 201942 -136541 -40412 64433 -80728 90545 12597
10878 155373 -26661 -133959 -83168 110671 -118412 -51931 161185 128039 -357812 144362
10867 63815 -248474 68909 40536 -171417 55120 -27890 -60955 60073 47763 -28527 143670
10855 398471 252025 185209 -8137 245336 -38454 104496 172413 -2266 34475 76613 200965
10844 200965 -46692 -72814 -1167 91350 332472 64880 -186518 -60304 252074 -255742 -53319
10832g9642j23306R6693A73623m9665E899J46201m5013k6527J1091f9681l4890
10821a04571b6244A42703J26699b19247j33317A03446b80377c7466k92395N6191
10811b73670M2455i3435j35819c6072j25881P8657B45927a86315d2110C9281a89389
10799C89486e5567H6348f2570D0820a11621I4639R2104J2793h6676j48200b9109
10787H6656e7700j10240J1264A12463J41805b12909j22538a05625j52919g1479
10776C6271a72097D0437K36799a09861l15958i9526B49842a20320j30592A00261
10765a16356e5398k7525E5367a5911C7360j3717J37973b21924N7100j40535D6465
10753h1066i397l3679j07290K6433R229N5299J2310j60317Q0073P685K8074M1732
$$ plain form
10832 -79642 -202948 -106255 173623 123958 5899 152100 107087 80560 91651 -69681 -104571
10821 -104571 -26244 142703 269402 -219247 -352564 103446 -280377 -37466 -329861 -273670
10811 -273670 -231215 -93435 -229254 -36072 -161953 -83296 245927 -186315 -42110 39281 -189389
10799 389486 -55567 86348 -62570 40820 -111621 94639 186743 199536 -86676 -234876 -29109
10787 86656 -57700 -167940 -156676 112463 254268 -212909 -335447 -105625 -258544 -71479
10776 36271 -172097 40437 277236 -109861 -425819 -99526 249842 -120320 -250912 100261
10765 -116356 -55398 -82923 55367 -15911 37360 23643 161616 -221924 -164824 -305359 46465
10753 -81066 -9397 -43076 -150366 -123933 -114704 -59405 -47095 -207412 -127339 -119654 -91580 -49848
10741d9848a252n0648k00892M2794A51038a84574M6370f3161B35079b92561Q5661
10730b06900D6310K33070G3756a83622F8681i7753K9319F940b66704d9098q4194
10719a33292D9609J5979g2143A06614J9064Q33e6122j4221B14461a00969n3521
10708a54490f2897C3021A2956O9012A2371b01761E4093b26419B1812b0069j83313
10697b03382A44671a54275d399A05591D9571K9734g3974A7395a65032c2844B6136
10685a26252K7175o0971A79409b6210F768a30118k4803L3293G4499k0456A2729
10673A16828J92484c12516A17099b42870E0425J80952b39757E4920a93451o070
10663a99521E818h8005m0022c3024G7601b5949D3795A3808a28070C1362a00818
$$ plain form
10741 -49848 -1252 -51900 -252792 -209998 151038 -184574 -138204 -63161 235079 -292561 -206900
10730 -206900 46310 279380 73756 -183622 68681 -97753 -68434 6940 -266704 -49098 -133292
10719 -133292 49609 65588 -72143 106614 125678 126511 -56122 -70343 214461 -100969 -154490
10708 -154490 -62897 33021 12956 81968 12371 -201761 54093 -226419 21812 -20069 -203382
10697 -203382 144671 -154275 -4399 105591 49571 79305 -73974 17395 -165032 -32844 26136
10685 -126252 -99077 -160048 179409 -26210 6768 -130118 -154921 -121628 74499 54043 12729
10673 116828 309312 -312516 117099 -242870 50425 231377 -239757 54920 -193451 -199521
10663 -199521 5818 -88005 -128027 -33024 77601 -25949 43795 13808 -128070 31362 -100818
10651H0058a52857k05012J43708R6461r8943g6143A23828J10837i3286p0151N9771
10640a03666a7437D0746d3404A82798b18392g065j09719b3147j47721b1645k79249
10629c00894B3298i4339B6441p819a29836I6290a57104m6047A41081a51971g2889
10617e476r7296J0700m5757k46870G9486a30638c6595j26802g1234j25558Q1101
10606a15691e3536j38861H0804h9115k2177J8834A73723E3279m202c58260J77939
10595a80321C7916a78076b6850D5081c70650Q0896A33760J12681b0588C7421a29247
10583a03515N0444b5658H2213a74281A36127c53794F2534M7397E4889A7782J5651
10572C3433a56134a3669q62k49132J09739a5396p0831H1317L0944m6735a76010
$$ plain form
10651 80058 -152857 -357869 -214161 -117700 -216643 -76143 123828 234665 -93286 -163437 -103666
10640 -103666 -17437 40746 -43404 182798 -218392 -7065 -116784 -23147 -170868 -21645 -300894
10629 -300894 23298 -94339 26441 18622 -129836 96290 -157104 -203151 141081 -151971 -72889
10617 -5476 -102772 -92072 -137829 -384699 79486 -130638 -36595 -163397 -71234 -196792 -115691
10606 -115691 -53536 -192397 80804 -89115 -111292 -92458 173723 53279 49077 -358260 -180321
10595 -180321 37916 -178076 -26850 45081 -370650 -289754 133760 246441 -20588 37421 -129247
10583 -103515 -53071 -25658 82213 -174281 136127 -353794 62534 109931 54889 17782 33433
10572 33433 -156134 -13669 -14531 -263663 -153924 -15396 -86227 81317 112261 65526 -176010
10560A82743n0621b80679c2975m6437k5452I4239b17682A10982f73r9407I9780
10548B46435g9291G5460R488A3269P4321b69008H4222b65788J02A33219C4489
10536A90137C8965J17605A3399a72252F8693a35088L1032M1239D15375a48154
10525C87369o3458a67598j00683h9655B28399a30936A080K04175D0750a26366
10514C0588b10328A17795d5700A8951c16869A5209a64455D1479d9222j05867G8492
10502a28478m3345C65501C5504b13056d817A7829K61114j04097b87243a02733
10491A30399L6499l0074D7411l411J36209p9281a35508A49136R6447N8570Q9624
10480C93777j96168N10080m5222A44978k1632h0244C36336I5718a35500C28836
$$ plain form
10560 182743 132122 -280679 -32975 -79412 -104864 94239 -217682 110982 -673 -100080 99780
10548 246435 -79291 75460 84948 13269 87590 -269008 84222 -265788 -265686 133219 34489
10536 190137 38965 156570 13399 -172252 68693 -135088 -104056 -62817 415375 -148154
10525 387369 323911 -167598 -268281 -89655 228399 -130936 1080 205255 40750 -126366
10514 30588 -210328 117795 -45700 18951 -316869 15209 -164455 41479 -49222 -155089 78492
10502 -128478 -171823 365501 35504 -213056 -4817 17829 278943 174846 -287243 -102733
10491 130399 166898 136824 47411 44000 180209 100928 -135508 149136 245583 304153 393777
10480 393777 197609 707689 662467 144978 123346 -80244 336336 95718 -135500 328836
10469B3780b40028B55952D7812R3823e9374B06893a20277B04220F3947e6788j95549
10458b52337B83980r7544a95531A9653a28050C2162I938a15071H6607M9294b40101
10446F2094c6445j31148D1052b25374Q1996a4694q9436A56795b2737C11616a12379
10434B67080c40959d1839B89649c40596F657Q2050e6988j40827d2380G5952J8370
10423I4322j5367J74660d92972A06672O4793H4376a51400B78993F575d0366d898
10411G7831k3624c7084A90596b4723B95381b94280A37482a6889D2789L1276K95183
10400C69248a30460d8783G619K15196P907K5371L24496A78899H791K4683G633
10388b15775A69705l4138b5402o5270C26408G0507M01089h0576E6895K60412j34199
$$ plain form
10469 23780 -240028 255952 47812 141635 -59374 206893 -120277 204220 63947 -56788 -252337
10458 -252337 283980 186436 -195531 19653 -128050 32162 9938 -115071 86607 135901 -240101
10446 62094 -36445 -167593 41052 -225374 -143378 -14694 -104130 156795 -22737 311616 -112379
10434 267080 -340959 -41839 289649 -340596 6657 88707 -56988 -197815 -42380 75952 94322
10423 94322 78955 253615 -492972 106672 171465 84376 -151400 278993 6575 -40366 -4898
10411 77831 54207 -37084 190596 -24723 295381 -294280 137482 -16889 42789 74065 369248
10400 369248 -130460 -48783 7619 222815 230722 256093 580589 178899 8791 33474 7633
10388 -215775 169705 135567 -25402 -90672 326408 70507 471596 -80576 56895 317307 183108
10377A83108J57659A68009J7887L21927b05891B46757J93708J15276B44042r6019
10367A48023K97825K46276B80094M09980A59336Q6144N6404r0788G3466K37153
10357C10619D9833J79158p1261K6781K65808j91014E9329L76686o0141l2902A26556
10345E52486r253p1130J123A88337O0721j5246J1861r2482M9635e5836C0391L0897
10333F1288R9618Q1587a44378I5903Q7751p6930M77681E8832K03844J09575G2519
10321A56608M6064F6358H215b5006A76243l2509M675a42236A32609a49061q0218
10310b29279h6389j1005j45273L4482j1008B0631K9495J70794J34100b28740b9373
10298E7255h0758A11133b9354A89877p6970Q1316B8153b93357G3982a19281G7630
$$ plain form
10377 183108 340767 168009 185896 507823 -205891 246757 440465 555741 244042 148023
10367 148023 445848 692124 280094 690074 159336 245480 301884 211096 73466 310619
10357 310619 49833 228991 157730 184511 450319 259305 59329 436015 375874 342972 126556
10345 552486 543233 472103 473226 188337 249058 233812 245673 153191 202826 -55836 30391 61288
10333 61288 160906 242493 -144378 95903 183654 106724 584405 58832 262676 372251 72519
10321 156608 202672 66358 8215 -25006 176243 143734 148409 -142236 132609 -149061 -229279
10310 -229279 -86389 -97394 -242667 -208185 -219193 20631 50126 220920 355020 -228740 -29373
10298 57255 -80758 111133 -29354 189877 112907 194223 28153 -293357 73982 -119281 77630
10286b1970C5429a58461A1265K87060a73634E080b3148k75301A96073a24927n0757
10275a75684c311l2885A97694n4621i6194A29022h3292k1812l7334n3492c4873
10263A03619a94565B59323o6114O0897O78l7976K40234j35255M7006E8948L11024
10252C69972q8541j18549J721a93451b6926A23753b4330j34858F9908M3699c04389
10240A68761D2279c1484k04370A12992E5631b46814a7651q0855B59869b9681B92451
10228g6102m595k29387J24579A30090h3602A5373d21612J23395F0475h8142A73449
10216a45235l7694A49073d229A5395a01764A38413F7466c34271e3245E6473a02984
10204C1907M9528J19805j6858C802c45257A087a22693m8279A21565a73460B6293
$$ plain form
10286 -21970 35429 -158461 11265 298325 -173634 5080 -23148 -298449 196073 -124927 -175684
10275 -175684 -3311 -36196 197694 143073 -96194 129022 -83292 -105104 -142438 -195930 -34873
10263 103619 -194565 259323 193209 254106 254784 216808 457042 321787 368793 58948 369972
10252 369972 281431 162882 164603 -193451 -26926 123753 -24330 -159188 69908 113607 -304389
10240 168761 42279 -31484 -235854 112992 55631 -246814 -17651 -98506 259869 -29681 292451
10228 -76102 -80697 -310084 -185505 130090 -83602 15373 -421612 -298217 60475 -88142 173449
10216 -145235 -182929 149073 -4229 15395 -101764 138413 67466 -334271 -53245 56473 -102984
10204 31907 81435 201240 184382 3802 -345257 1087 -122693 -170972 121565 -173460 26293
10192a4038j22367e657m49231i9254a9782j74368A25561F0059J3572b37875M0780
10181a97095C8711J41061g1586H4710P6270G7826d2591N630o2893F6810M4015
10170A10825g6668G154f602k26164e1601E1436a48138c1035k732A61425p0177
10159I1248k5059O8716a88474P6267j9420J7511F6757f0643n3141B64480j24875
10148A39605b24374r803B4976K21532b28678f2227H5798a15877A87172b92859
10137a4596k55828J9537D7211a43468j61100B162c5525j30205J5416M9438j57998
10126b58874B34365I3767P334a5135o1341a9164k62676A3332C337b07383e1758
10114d153k1356j13733c6461j77248C6720b15555B3235J55537k1308o1621b38234
$$ plain form
10192 -14038 -136405 -5657 -454888 -99254 -19782 -194150 125561 60059 73631 -237875 -197095
10181 -197095 38711 179772 -71586 84710 160980 77826 -42591 -36961 -99854 66810 110825
10170 110825 -76668 7154 -6602 -232766 -51601 51436 -148138 -31035 -33767 161425 91248
10159 91248 66189 134905 -188474 -112207 -131627 -114116 66757 -60643 -113784 264480 139605
10148 139605 -224374 -234177 24976 246508 -228678 -62227 85798 -115877 187172 -292859
10137 -14596 -270424 -250887 47211 -143468 -304568 2162 -35525 -165730 -150314 -100876 -258874
10126 -258874 234365 93767 101101 -15135 -76476 -19164 -281840 13332 3337 -207383 -51758
10114 -4153 -25509 -139242 -36461 -213709 36720 -215555 23235 178772 157464 95843 -238234
10102a48340d4855j46381k00886a9035j26990j05758G7251b8907j75074P6713
10092a27268m2481d0840k81129A35460J3484P190A8917M0568f8634F3712a3391
10080b96838D13675g5049j25467g0708b808l42376B97768A40621l1966b22830
10069a36118A1969a27450O2367G6706J8228k2883a10349A64609Q0422l4582g6741
10057C0602b45503P3739K2407b5387k20846M3765M4080N3308k25586a06587b885
10045a20747D1851g1762j93660a19926a2500I8298C1190K70933a71687D1697A217
10033B06496H3467a64089A3329Q4710a33503B6990c41340D2723a83687j72107
10023c55794i2734j6833M8436l2455R786b288A15059d1731j42259J5834e1753
$$ plain form
10102 -148340 -44855 -191236 -392122 -19035 -146025 -251783 77251 -28907 -203981 -127268
10092 -127268 -169749 -40840 -321969 135460 148944 156134 18917 59485 -68634 63712 -13391
10080 -296838 413675 -75049 -200516 -70708 -2808 -345184 297768 140621 108655 -222830
10069 -136118 11969 -127450 -65083 76706 94934 72051 -110349 164609 245031 210449 -76741
10057 30602 -245503 -171764 -149357 -25387 -246233 -202468 -158388 -105080 -330666 -106587 -2885
10045 -120747 41851 -71762 -265422 -119926 -12500 98298 31190 302123 -171687 41697 1217
10033 206496 83467 -164089 13329 98039 -133503 26990 -341340 42723 -183687 -355794
10023 -355794 -92734 -109567 -61131 -93586 -83800 -2288 115059 -41731 -183990 -168156 -51753
10011a59122P0687o1150G5824c56657B52461i3334j34651B73020b16484R5360
10001a21124j12128h8560E6209A4080b23832A21239L8105g9678F5228b1751i893
9989b3376o0090A6308K72386b20367g3651a2672p5866k09507A71228g4196l0494
9978a04690A4913K8720a28391c741j93821A65960a88355I5745b63400A02344a09059
9966a74757k1870B09213a4521B43862a04996j08624J00492A54686K0031c89333
9955c8412I0309c06289D9519c03627o334a01547k6755b1648o2840k4476l26466
9944d35430A73302a09513C18505A42317b63839A08471b62604O4528A78978D7960
9933H0465k0624n009a08062j36860D4406N2568a90753n9158A64134e7643o0856
$$ plain form
10011 -159122 -88435 -149585 75824 -356657 252461 -93334 -227985 273020 -216484 -121124
10001 -121124 -233252 -88560 56209 14080 -223832 121239 159344 -79678 65228 -21751 -9893
9989 -23376 -83466 16308 288694 -220367 -73651 -12672 -88538 -298045 171228 -74196 -104690
9978 -104690 14913 43633 -128391 -3741 -197562 165960 -188355 95745 -263400 102344 -109059
9966 -174757 -196627 209213 -14521 243862 -104996 -213620 -113128 154686 174717 -389333
9955 -38412 90309 -306289 49519 -303627 -309961 -101547 -128302 -21648 -84488 -108964 -435430
9944 -435430 173302 -109513 318505 142317 -263839 108471 -262604 -198076 178978 47960
9933 80465 59841 54832 -108062 -244922 44406 96974 -190753 -249911 164134 -57643 -118499
9922a18499m2608A6772J72898c6399k5677A277J66670p7941h0914A64360b7667
9910E8773a62326J9132k0945j09644B52225c4489m29012d8813l95329c411k21782
9899b25193e9100A9560b08172M4796A5550a42984k48071A9731a73426F7024J15141
9888A82165F4945a82132h6683A71833h8108D0670c2775C51091a71905o4000g1022
9876A35428a91980C0129g9534l53752K13761i7076B57813c19860J36995O0516
9866a22349d9500k36005h2422A2308b36165B1839i8046L5357J5803o0901j07128
9855b14915j9761M644A60797b05666L517h3673G6604B5102b20859O2592k13849
9844c72116d7979p4446K9015q6987l10350h2380B2491N8174b50209B1936b47405
$$ plain form
9922 -118499 -161107 16772 189670 -36399 -62076 1277 167947 90006 -80914 164360 -27667
9910 58773 -162326 -143194 -164139 -273783 252225 -34489 -463501 -48813 -444142 -3411 -225193
9899 -225193 -59100 19560 -208172 -163376 15550 -142984 -391055 19731 -173426 67024 182165
9888 182165 64945 -182132 -86683 171833 -88108 40670 -32775 351091 -171905 -235905 -71022
9876 135428 -191980 30129 -79534 -433286 -219525 -97076 257813 -319860 -182865 -122349
9866 -122349 -49500 -285505 -82422 12308 -236165 21839 -98046 -62689 -46886 -107787 -214915
9855 -214915 -234676 -230032 160797 -205666 -202149 -83673 76604 25102 -220859 -158267 -372116
9844 -372116 -47979 -122425 -93410 -180397 -490747 -82380 22491 80665 -250209 21936 -247405
9832A017e1750j68557b0714A55681b46619a0226m1100A68726k611a28900q7398
9821b16298L211N9962q0566D2059O0159A4604J17608q99H378a06061j41637a5382
9808i7908l9576A49497M5220b42707a8796k1390r233C58954G822a57901j16072
9797b73973b9476l53072i3268C34584H8952c30490M2390A38445h8545j05782e146
9785b59960f6884j4918j81374A02764b11163g9095E324a50670r1423O6150b8399
9773F1951c9056B13604D4062a36667j32158E1928P2997a15000R512A01789i8663
9761B7298a3401B5421a30887F4926c1932C782h237n7007l72033K08999m5749A05600
9748A20141M6855J07169h3744c8733k5851j23287H8099i833c352p3555q4036d7214
$$ plain form
9832 1017 -51750 -220307 -20714 155681 -246619 -10226 -51326 168726 166115 -128900 -216298
9821 -216298 -213087 -153125 -233691 42059 102218 14604 132212 131313 8378 -106061 -247698 -15382
9808 -97908 -137484 149497 194717 -242707 -18796 -40186 -49419 358954 7822 -157901 -273973
9797 -273973 -29476 -382548 -93268 334584 88952 -330490 -288100 138445 -88545 -194327 -5146
9785 -259960 -66884 -81802 -263176 102764 -211163 -79095 5324 -150670 -242093 -175943 -28399
9773 61951 -39056 213604 44062 -136667 -268825 51928 124925 -115000 -105488 101789 -98663
9761 27298 -13401 25421 -130887 64926 -31932 3782 -8237 -65244 -437277 -228278 -274027 105600
9748 120141 166996 274165 -83744 -38733 -64584 -187871 88099 -9833 -3352 -76907 -160943 -47214
9735d6605I1384c35116d0391A0986h5724j31291p9657j52222A8901a03899A32415
9723a57913k4251A38975b20766N5705n650B21696g8829j970A8229a88281k29588
9712d17869A67233D1873e0087R567j04437p3949I6694R8386g6875l6630h861l67170
9700c76031B06042e6102j35167g4519o0595k7417q5907I6449J210a42076p1576
9689b13652C65568b7455j18559B04968b1466l05424f3922H717K45850n7886a31675
9677a62199k29543R0383j7975a49492K0022B58058a07617A10661J5744a60322
9666I3801k518B9718c16211g7509l6853B03774a77728P8932D7284F821K05967
9655B12788b06961A0470a17132q2108L1335k9605L4321C2000R0185b74680a3777
$$ plain form
9735 -46605 91384 -335116 -40391 10986 -85724 -217015 -296672 -448894 18901 -103899 132415
9723 -157913 -182164 138975 -220766 -165061 -170711 221696 -78829 -80799 18229 -188281 -417869
9712 -417869 167233 41873 -50087 -40520 -144957 -218906 96694 195080 -76875 -113505 -8861 -376031
9700 -376031 206042 -56102 -191269 -74519 -135114 -162531 -248438 96449 97659 -142076 -213652
9689 -213652 365568 -27455 -146014 204968 -21466 -326890 -63922 8717 254567 196681 -131675
9677 -162199 -391742 -301359 -319334 -149492 -129470 258058 -107617 110661 126405 -160322
9666 93801 91283 29718 -316211 -77509 -114362 203774 -177728 -98796 47284 6821 212788
9655 212788 -206961 10470 -117132 -199240 -167905 -197510 -163189 32000 122185 -274680 -13777
9643a85275D19427A29352c2686A02068m4767e0270C7483a05546I3227a70800j00897
9632b71697D786a41540L1320H409f2480C4591i8577L4177A30809a59174j33374
9621b92548D271b8317H4676O2417c0649o9119M4145k20451a9685l74540I4010
9609A02899a55793k09583c8067j86928B0354b00087j80474A44274b43419P51I6443
9597C7213a08157d9257m4536C5591i9529D6184b92637e9809j3883l67638a65049
9585a70297O7031r6537a4815m53893A01686b29371A35502e7922l014m5648b2148
9573A31054d28565J33575c1900A0659e9133k75723B88128I1697a43473j8152I6675
9561h7078G9147j5549a48485A86067B6799N8245b22788k2834J22474A18591e2960
$$ plain form
9643 -185275 419427 129352 -32686 102068 57301 -50270 37483 -105546 93227 -170800 -271697
9632 -271697 4786 -141540 -110220 8409 -62480 34591 -98577 -64400 130809 -159174 -292548
9621 -292548 4271 -28317 84676 147093 -30649 -99768 -55623 -276074 -19685 -394225 94010
9609 102899 -155793 -365376 -38067 -224995 20354 -200087 -380561 144274 -243419 -242668 96443
9597 37213 -108157 -49257 -93793 35591 -99529 46184 -292637 -59809 -73692 -441330 -165049
9585 -170297 -103266 -199803 -14815 -468708 101686 -229371 135502 -57922 -60936 -106584 -22148
9573 131054 -428565 -294990 -31900 10659 -59133 -334856 288128 91697 -143473 -161625 96675
9561 -87078 79147 63598 -148485 186067 26799 85044 -222788 -245622 -123148 118591 -52960
9549A34568o5231J42481p6134n4145a84513A14355a68199p845o0016B97985b60805
9537a33499m0592N6703j248C98748A38381a76915c5319A22774g3484G4235O5015
9526A39250m9756E537f5347D3534a11438b3763l3398A345g8535j13761P904G6736
9513A03362k6888b19917L0805l1038j01092A81423N4871G5824b15598H165P2532
9502H0697A3245c63788i581j88863d7808k19249i2776m3477g92j83033p2112c2228
9489f1335j43768P3278A8944L2454d3732j28297M0321G7674c0579D3849c16756
9477A39356a85593A05206D7817h7584o9884j1840F2956a23174m7391n6303a04922
9465b44672J2143B0311b15989Q3884O0928p1805J7154F564J23618a00802j87282
$$ plain form
9549 134568 69337 211818 135684 81539 -184513 114355 -168199 -176044 -236060 297985 -260805
9537 -133499 -174091 -117388 -118636 398748 138381 -176915 -35319 122774 -73484 74235 139250
9526 139250 89494 5537 -65347 43534 -111438 -23763 -57161 1345 -78535 -192296 -184392 76736
9513 103362 76474 -219917 -189112 -220150 -321242 181423 236294 75824 -215598 8165 80697
9502 80697 13245 -363788 -9581 -198444 -47808 -267057 -92776 -136253 -792 -183825 -255937 -32228
9489 -61335 -205103 -131825 18944 51398 -43732 -172029 -131708 77674 -30579 43849 -316756
9477 139356 -185593 105206 47817 -87584 -157468 -169308 62956 -123174 -170565 -226868 -104922
9465 -244672 -232529 20311 -215989 -132105 -71177 -142982 -125828 6564 130182 -100802 -288084
9454b88084Q0144j9485A68537i484A67746m2486a57616A44085c46404O5466I1356
9442A45656g2694p1965j31645N2245e9753k54177I644M7337J69510j00572k7913
9431I8006K00972a02868c4550k51120B6472K9610c50949h4783b7221k57055R0196
9420a94080D8032b09728A37534M8074g6104j07683B67257b71648I0947a81691
9409B58561a31596B49371b32047n7806E5935c31651E9014m981J33206j0039e2347
9397g4567j4165H6090D888J01154D3199K3355a84242e3931Q848m2494n5377N632
9385a37322a3704r1754j20386l19136F0778i9025K6553A01200a32441A61637a06445
9373c03687h165p9521a0646j20705c6228k64835L3385e0326Q80n8324k26254e9887
$$ plain form
9454 -288084 -207940 -227425 168537 -9484 167746 125260 -157616 144085 -346404 -280938 91356
9442 145656 -72694 -144659 -276304 -224059 -59753 -313930 9644 56981 226491 125919 98006
9431 98006 298978 -102868 -34550 -285670 26472 56082 -350949 -84783 -27221 -284276 -194080
9420 -194080 48032 -209728 137534 185608 -76104 -183787 267257 -271648 90947 -181691
9409 258561 -131596 249371 -232047 -289853 55935 -331651 59014 54033 187239 177200 -52347
9397 -74567 -88732 86090 4888 106042 43199 66554 -184242 -53931 -45083 -87577 -142954 -137322
9385 -137322 -13704 -105458 -225844 -544980 60778 -99025 -72472 101200 -132441 161637 -106445
9373 -303687 -8165 -87686 -10646 -131351 -36228 -301063 -267678 -50326 -49446 -107770 -334024 -59887
9360a47768A81772a70719J5131q8478O3979p597I8773a0492p0314A83139d00776
9348f7230n5943M406o5126A68562Q8265b19768M3463e5565k52766K3756B80812
9336D4086a18607j25710K4518A82291F9355b09404j45715B7236i7704b4247j20392
9325a44639A22251b40071a4693A86700c42793F1392a18547I9765a07151M5489
9315f1662G4619J45154m7971n4253a25569n4550C997a95347h2509j09177n1424
9304b43110q731b7808B11809a68512O3387G4706e2846l65421J93861B20077g5119
9292b06529Q0502B9699K81556a21915K7107b6616B24426G1351a47896j8705n7637
9281b24238c0709k28321R7452c0090j49015N562h645G6353a86586a0376F3776
$$ plain form
9360 -147768 181772 -170719 -155588 -244066 -180087 -187684 98773 -10492 -80806 183139 -400776
9348 -67230 -123173 -118767 -183893 168562 256827 -219768 -176305 -55565 -308331 -284575 280812
9336 44086 -118607 -244317 -219799 182291 69355 -209404 -355119 27236 -97704 -24247 -144639
9325 -144639 122251 -240071 -14693 186700 -342793 61392 -118547 99765 -107151 -61662
9315 -61662 74619 219773 171802 117549 -125569 -180119 3997 -195347 -82509 -191686 -243110
9304 -243110 -251841 -27808 211809 -168512 -105125 74706 -52846 -418267 -224406 220077 -75119
9292 -206529 -126027 29699 311255 -121915 -94808 -26616 224426 71351 -147896 -166601 -224238
9281 -224238 -30709 -259030 -161578 -30090 -179105 -173543 -8645 76353 -186586 -10376 63776
9269D3989J7490c2104H1970g4619L0508k3752B8022J2703J70486A6072l004a99956
9256D590b39831G691J2259Q2116h1367L2076B40486c18156c5202k15146B30366
9244a59827A95719a1789l7845o7282A74127q0284c5513A686Q9465j9783l2147
9233C9221K9318f6527k73862I5467c19921i5527o9433j32575A18884A7665J32268
9222A49933A7797a90620Q0680k78353K4356J76632A42823m8378b0034k21982a5582
9210a02331q3193A49470Q0669b12355E8178a05100A06236i7691k35750A72747
9199A78068H1396g840j10762q0975L7719I9245c41899D8186d8189A45522o2488
9188H3034b00143A32242C0017a29790A3327J0713a6155m37891K22551R7202F9601
$$ plain form
9269 43989 61479 -32104 81970 -74619 -44111 -67863 28022 40725 211211 16072 13068 -199956
9256 4590 -239831 7691 19950 102066 -81367 -49291 240486 -318156 -35202 -250348 230366
9244 -159827 195719 -11789 -49634 -116916 174127 93843 -35513 1686 91151 71368 39221
9233 39221 68539 -66527 -340389 95467 -319921 -95527 -164960 -297535 118884 17665 149933
9222 149933 17797 -190620 -109940 -388293 -363937 -187305 142823 94445 -20034 -242016 -15582
9210 -102331 -185524 149470 230139 -212355 58178 -105100 106236 -97691 -333441 172747
9199 178068 81396 -7840 -118602 -199577 -161858 99245 -341899 48186 -48189 145522 83034
9188 83034 -200143 132242 30017 -129790 13327 24040 -16155 -454046 -231495 -134293 69601
9176b68338G4201N9149o0469N3086D1857c9021m1020I7030a64270N7134j80227
9165b87363P3046L6602F6146R7322c50123a72389B59236O3275d349G5324B4238
9153B69447b90605A47354i7164E4558e9439A76589d1226k9150k82619J65700B07623
9141a45133l7813k48464c9052n0309j66703R3949k206J0336A0486a30428I8302
9129e7497F7249e08085b17368f690k47393j1034a26795B8938a71737K2977D6232
9117b39562e6431p3199p8511d2984I9148M29d5274j05589H5735a03222b785C6436
9104A1304N3300l523b39300k4018M7591L5631L0748e6633B32842b66499i2863
9092B08038A03583G737c8390r7582f447k21142j7347N7693l1625B00820o3595
$$ plain form
9176 -268338 74201 133350 72881 125967 41857 -39021 -80041 97030 -164270 -107136 -287363
9165 -287363 -214317 -177715 66146 163468 -350123 -172389 259236 322511 -4349 75324 24238
9153 269447 -290605 147354 -97164 54558 -59439 176589 -41226 -70376 -352995 -187295 207623
9141 -145133 -182946 -431410 -39052 -89361 -256064 -162115 -164321 -153985 10486 -130428 98302
9129 -57497 67249 -508085 -217368 -6690 -254083 -265117 -126795 28938 -171737 -148760 46232
9117 -239562 -56431 -129630 -208141 -42984 99148 99577 -45274 -150863 85735 -103222 -2785 36436
9104 11304 64604 61081 -239300 -263318 -215727 -180096 -149348 -56633 232842 -266499 -92863
9092 208038 103583 7737 -38390 -135972 -6447 -227589 -244936 -187243 -218868 200820 137225
9081A37225i3675L5258j94404j36504a31089D4804J32410c06036n0754J78190
9071a78600g4408j72855f5715G4197b7762I3347a68093e358k6081Q468A76049
9059g1541k6116K9083j22940f2940j16934o174e6708j1006j14077e914n2610j01255
9047a59779r748A6072b66331A05635d5486o0951k8745A5644h7323B20591d818
9035A13303g6758A2801K19407A8297f5863D0070i217k53602B01910G3286b39987
9023i7444i03k48760h3567C1347a55368j17780k30826A56363E3340a34535J6414
9012a18121E0196Q3406F0262e08655e4805j36290G0597c100j0902C6961O0332
9001I7293k9526N1665b34773L7570g9900K5504r9609B50388b62035R4855B1584
$$ plain form
9081 137225 -93675 -58417 -252821 -389325 -131089 44804 177214 -306036 -356790 -178600
9071 -178600 -74408 -247263 -65715 74197 -27762 93347 -168093 -5358 -31439 -22971 176049
9059 -71541 -97657 -68574 -191514 -62940 -179874 -186048 -56708 -67714 -181791 -5914 -58524 -159779
9047 -159779 -169527 16072 -266331 105635 -45486 -106437 -135182 15644 -87323 220591 -4818
9035 113303 -76758 12801 232208 18297 -65863 40070 -9217 -262819 201910 73286 -239987
9023 -97444 -903 -249663 -83567 31347 -155368 -273148 -503974 156363 53340 -134535 -118121
9012 -118121 50196 133602 60262 -508655 -54805 -191095 70597 -3100 -14002 36961 97293
9001 97293 67767 119432 -234773 -197203 -79900 -54396 -154005 250388 -262035 -167180 21584
8989a01531j0514j36769J11726G020b60453R1086B53196b57214i6160e301m30045
8978d35346h8222j07497A33242b46931b6843A90207B8642b90582q6290H1161e0123
8966b89972A54696b01586f3430o0724j73468J47683N3702H3773L5383b12013O6160
8955a45853j89105C9341b44264A40756a62797O361c7376G810N2260b28477a05168
8943a77182e751A77734o0722B1083g6265a9711m37574D0889R5511F246a50542
8931e3724j43746R1742B4288J38482K5291J68093M72341O76425J448491K245156
8921E198567J336821B561558I57234C02815h6243A11404n3771a51423B60029c69208
8910a929C197K13510o8115l7605e1489E3392f7793n2371J5553o2398c0089A6356
$$ plain form
8989 -101531 -112045 -248814 -137088 7020 -260453 -169367 253196 -257214 -96160 -5301 -435346
8978 -435346 -88222 -195719 133242 -246931 -26843 190207 28642 -290582 -376872 81161 -50123
8966 -289972 154696 -201586 -63430 -124154 -297622 -149939 -96237 83773 119156 -212013 -145853
8955 -145853 -334958 39341 -244264 140756 -162797 -156436 -37376 7810 60070 -228477 -105168
8943 -177182 -5751 177734 117012 21083 -76265 -19711 -457285 40889 136400 6246 -150542
8931 -53724 -197470 -105728 24288 162770 188061 356154 828495 1504920 2953411 5198567
8921 5198567 6535388 2561558 957234 302815 -86243 111404 57633 -151423 260029 -369208
8910 -1929 3197 216707 148592 110987 -51489 53392 -67793 -120164 -104611 -167009 -30089 16356
8897b47958f2744B54189D8664b19527O3552C9254b42694l3036b8638A21666A8367
8885B38765C1043K81875A11394a30142q2810N9819B23899b59983C1078c91665
8874h7038A8664Q5818O1593n263D286a7786j46174C51828a03089A30847d30833
8862c49582b4083Q028j11268H8014A366i5332m511A35185j6901a18310A28729
8850B29883d50862a5211k26316j91383a44566k78320A33925a14494A39932c9367
$$ plain form
8897 -247958 -62744 254189 48664 -219527 -155975 39254 -242694 -275730 -28638 121666 18367
8885 238765 31043 312918 111394 -130142 -212952 -153133 223899 -259983 31078 -391665
8874 -87038 18664 104482 166075 160812 4286 -17786 -163960 351828 -103089 130847 -430833
8862 -349582 -24083 -16055 -127323 88014 1366 -95332 -99843 135185 118284 -118310 128729
8850 229883 -450862 -15211 -241527 -432910 -144566 -422886 133925 -114494 139932 -39367
$$ [...]
##END NTUPLES=NMR SPECTRUM
##END=
