##TITLE=AC1658_NARAH14394_8531691_RW0Km1pcaJ
##JCAMPDX= 6.0         $$ Bruker NMR JCAMP-DX V2.0
##DATA TYPE= NMR SPECTRUM
##DATA CLASS= NTUPLES
##ORIGIN= BRUKER
##OWNER= Administrator
$$ 1.72 TOPSPIN		Version 2.1
$$ 2014-03-14 17:28:15.501 -0800  Administrator@X
$$ Compression mode = diff/dup
##.OBSERVE FREQUENCY= 400.02188249412
##.OBSERVE NUCLEUS= ^1H
##.ACQUISITION MODE= SIMULTANEOUS (DQD)
##.ACQUISITION SCHEME= undefined
##.AVERAGES= 8
##.DIGITISER RES= 22
##SPECTROMETER/DATA SYSTEM= spect
##.PULSE SEQUENCE= zg30
##.SOLVENT NAME= COFFEE_meoh
##.SHIFT REFERENCE= INTERNAL, COFFEE_meoh, 1, 14.98509
##AUDIT TRAIL= $$ (NUMBER, WHEN, WHO, WHERE, PROCESS, VERSION, WHAT)
$$ ##TITLE= Audit trail, TOPSPIN		Version 2.1
$$ ##JCAMPDX= 5.01
$$ ##ORIGIN= Bruker BioSpin GmbH
$$ ##OWNER= Administrator
$$ $$ E:\/data/COFFEE/nmr/AC1658_NARAH14394_8531691_RW0Km1pcaJ/10/pdata/1/auditp.txt
$$ ##AUDIT TRAIL=  $$ (NUMBER, WHEN, WHO, WHERE, PROCESS, VERSION, WHAT)
(   1,<2014-03-14 17:28:08.189 -0800>,<Administrator>,<X>,<go>,<TOPSPIN 2.1>,
      <created by zg
	started at 2014-03-14 17:27:01.517 -0800,
	POWCHK enabled, PULCHK disabled,
       configuration hash MD5:
       C8 4E 4E 5D D3 5C D8 9E 9F 52 82 E0 59 8A DE 15
       data hash MD5: 64K
       DE 56 68 17 BF 0B 6A 38 65 44 5B D5 75 12 D2 6B>)
(   2,<2014-03-14 17:28:11.267 -0800>,<Administrator>,<X>,<proc1d>,<TOPSPIN 2.1>,
      <Start of raw data processing
       efp LB = 0 FT_mod = 6 PKNL = 1 PHC0 = 0 PHC1 = 0 SI = 32K 
       data hash MD5: 32K
       B7 0E F1 81 60 C5 AC A2 6B 53 2E CD 52 F4 37 8F>)
(   3,<2014-03-14 17:28:11.579 -0800>,<Administrator>,<X>,<proc1d>,<TOPSPIN 2.1>,
      <pk PHC0 = 93.16406 PHC1 = 0 
       data hash MD5: 32K
       A8 99 D3 40 0C 84 1D A2 88 83 DE C9 F4 09 4C AC>)
(   4,<2014-03-14 17:28:11.689 -0800>,<Administrator>,<X>,<proc1d>,<TOPSPIN 2.1>,
      <abs ABSG = 1 
       data hash MD5: 32K
       FC 53 A1 93 35 AC E0 60 EF 19 E3 3E BF E4 2E 0D>)
(   5,<2014-03-14 17:28:11.783 -0800>,<Administrator>,<X>,<proc1d>,<TOPSPIN 2.1>,
      <abs ABSG = 2 
       data hash MD5: 32K
       91 E6 FC 39 93 6C E0 5D BB C8 88 BA 8B 56 E8 0F>)
(   6,<2014-03-14 17:28:11.876 -0800>,<Administrator>,<X>,<proc1d>,<TOPSPIN 2.1>,
      <abs ABSG = 3 
       data hash MD5: 32K
       DF 46 B1 5A BB B1 2E 0B D2 9E F2 76 02 10 1B 25>)
(   7,<2014-03-14 17:28:12.048 -0800>,<Administrator>,<X>,<proc1d>,<TOPSPIN 2.1>,
      <abs ABSG = 4 
       data hash MD5: 32K
       EC 33 11 9D 36 52 A6 47 D0 E3 D9 75 A6 C1 1D 99>)
(   8,<2014-03-14 17:28:12.142 -0800>,<Administrator>,<X>,<proc1d>,<TOPSPIN 2.1>,
      <abs ABSG = 5 
       data hash MD5: 32K
       BC 65 AE E9 63 B4 62 5E 78 64 48 BD AF 12 72 DA>)
$$ ##END=
$$ 
$$ $$ hash MD5
$$ $$ B4 F4 4F 2B D3 C0 F0 F2 C8 2C F0 69 15 E5 F5 73
##$RELAX= 
##$RELAX= 
##$RELAX= 
##$RELAX= 
##$RELAX= 
##$RELAX= 
##$RELAX= 
$$ Bruker specific parameters
$$ --------------------------
##$DU= <E:\>
##$EXPNO= 10
##$NAME= <AC1658_NARAH14394_8531691_RW0Km1pcaJ>
$$ [...]
150 150 150 150 150 150 150 150
##$TP07= 0
##$TPNAME0= <>
##$TPNAME1= <>
##$TPNAME2= <>
##$TPNAME3= <>
##$TPNAME4= <>
##$TPNAME5= <>
##$TPNAME6= <>
##$TPNAME7= <>
##$TPOAL= (0..7)
0.5 0.5 0.5 0.5 0.5 0.5 0.5 0.5
##$TPOFFS= (0..7)
0 0 0 0 0 0 0 0
##$TUNHIN= 0
##$TUNHOUT= 0
##$TUNXOUT= 0
##$USERA1= <user>
##$USERA2= <user>
##$USERA3= <user>
##$USERA4= <user>
##$USERA5= <user>
##$V9= 5
##$VALIST= <valist>
##$VCLIST= <CCCCCCCCCCCCCCC>
##$VD= 0
##$VDLIST= <DDDDDDDDDDDDDDD>
##$VPLIST= <PPPPPPPPPPPPPPP>
##$VTLIST= <TTTTTTTTTTTTTTT>
##$WBST= 1024
##$WBSW= 4
##$XGAIN= (0..3)
0 0 0 0
##$XL= 0
##$YL= 0
##$YMAX_a= 606634
##$YMIN_a= -514516
##$ZGOPTNS= <>
##$ZL1= 120
##$ZL2= 120
##$ZL3= 120
##$ZL4= 120
##$ABSF1= 14.98509
##$ABSF2= -5.573092
##$ABSG= 5
##$ABSL= 3
##$ALPHA= 0
##$AQORDER= 0
##$ASSFAC= 0
##$ASSFACI= 0
##$ASSFACX= 0
##$ASSWID= 0
##$AUNMP= <proc_prof1d_extract_pilot.lims>
##$AXLEFT= 0
##$AXNAME= <>
##$AXNUC= <1H>
##$AXRIGHT= 0
##$AXTYPE= 0
##$AXUNIT= <>
##$AZFE= 0.1
##$AZFW= 0.1
##$BCFW= 0
##$BC_mod= 0
##$BYTORDP= 0
##$COROFFS= 0
##$CY= 15
##$DATMOD= 1
##$DC= 0
##$DFILT= <>
##$DTYPP= 0
##$F1P= 0
##$F2P= 0
##$FCOR= 0.5
##$FTSIZE= 32768
##$FT_mod= 6
##$GAMMA= 0
##$GB= 0
##$INTBC= 1
##$INTSCL= 1
##$ISEN= 128
##$LB= 0
##$LEV0= 0
##$LPBIN= 0
##$MAXI= 10000
##$MC2= 0
##$MEAN= 0
##$ME_mod= 0
##$MI= 0
##$NCOEF= 0
##$NC_proc= -8
##$NLEV= 6
##$NOISF1= 0
##$NOISF2= 0
##$NSP= 0
##$NTH_PI= 0
##$NZP= 0
##$OFFSET= 14.98509
##$PC= 1
##$PHC0= 93.16406
##$PHC1= 0
##$PH_mod= 1
##$PKNL= yes
##$PPARMOD= 0
##$PPDIAG= 0
##$PPIPTYP= 0
##$PPMPNUM= 2147483647
##$PPRESOL= 1
##$PSCAL= 4
##$PSIGN= 0
##$PYNMP= <proc.py>
##$REVERSE= no
##$SF= 400.02
##$SI= 32768
##$SIGF1= 0
##$SIGF2= 0
##$SINO= 400
##$SIOLD= 32768
##$SPECTYP= <>
##$SREGLST= <1H.CDCl3>
##$SSB= 0
##$STSI= 32768
##$STSR= 0
##$SW_p= 8223.68421052631
##$SYMM= 0
##$S_DEV= 0
##$TDeff= 65536
##$TDoff= 0
##$TI= <>
##$TILT= no
##$TM1= 0
##$TM2= 0
##$TOPLEV= 0
##$USERP1= <user>
##$USERP2= <user>
##$USERP3= <user>
##$USERP4= <user>
##$USERP5= <user>
##$WDW= 1
##$XDIM= 32768
##$YMAX_p= 440738652
##$YMIN_p= -696467
##$CURPLOT= <Network HP LaserJet P1505>
##$CURPRIN= <$Network HP LaserJet P1505>
##$DFORMAT= <normdp>
##$LAYOUT= <+/1D_H.xwp>
##$LFORMAT= <normlp>
##$PFORMAT= <normpl>
##$SURQMSG= 1
$$ End of Bruker specific parameters
$$ ---------------------------------
##NTUPLES= NMR SPECTRUM
##VAR_NAME=  FREQUENCY,     SPECTRUM/REAL,   SPECTRUM/IMAG
##SYMBOL=    X,             R,               I
##VAR_TYPE=  INDEPENDENT,   DEPENDENT,       DEPENDENT
##VAR_FORM=  AFFN,          ASDF,            ASDF
##VAR_DIM=   32768,         32768,           32768
##UNITS=     HZ,            ARBITRARY UNITS, ARBITRARY UNITS
##FACTOR=    0.250966925370066, 1,           1
##FIRST=     8223.43324360094, -110316,      -89893
##LAST=      0,             99813,           -241128
##MIN=       0,             -696467,         0
##MAX=       8223.43324360094, 440738652,    0
$$ Real data points
##PAGE= N=1
##DATA TABLE= (X++(R..R)), XYDATA
$$ [...]
$$ plain form
19559 158138 -41201 -47134 -63338 116544 -43111 120048 -66975 148535 95798 23237 -62784
19547 -197011 13479 -124388 -300806 -244047 335896 113186 76647 -138284 -34482 -39052 72996
19535 -92404 -12473 -45056 162946 -100266 -339623 23029 135695 -141948 -50572 33740 127438
19524 127438 138839 151381 10303 -29680 -190437 -492736 124358 75302 -39843 -96280 -161519
19513 -161519 97689 -145341 -303540 -82334 -64598 167704 -393071 -182817 -302440 -22544
19502 -3560 -185589 -214326 -94196 83180 246508 -11656 165093 -254243 144888 -167573 -224292
19491 -224292 -138290 16443 -325380 -1238 -103492 -490177 49814 -29990 205798 -196904 -87296
19479 -98253 110908 110809 -195655 -343167 -13470 -198826 -263363 -69049 -5458 -115685 27110
$$ packed form
19559A58138d1201n933j6204A16544d3111A20048f6975A48535n2737B3237f2784
19547a97011A3479a24388j76418N6759C35896A13186l6539a38284c4482m570G2996
19535i2404a2473l2583A62946a00266k39357B3029J12666a41948e0572C3740R3698
19524A27438J1401J2542A0303b9680j60757l02299A24358m9056c9843n6437o5239
19513a61519I7689a45341j58199h2334J7736A67704c93071a82817j19623b2544
19502c560j82029k8737i4196H3180J63328a1656A65093b54243A44888a67573n6719
19491b24292Q6002A6443c25380a238j02254l86685D9814b9990B05798a96904h7296
19479i8253A10908r9a95655j47512a3470j85356o4537f9049e458j10227B7110
$$ plain form
19467 -223351 -66496 -254582 -97612 40103 157414 122257 24097 176845 21221 -83968 44984
19455 -121872 191360 -138024 -363736 79680 -57957 -215416 125073 140308 -33034 -167149
19445 -167149 13859 -89927 -111650 -14800 -228435 245367 -315971 -196434 307704 153561
19434 -514509 327379 343562 -178050 -131294 188509 49296 -53993 71868 9460 -286344 -68631
19422 -33031 -197100 -249540 93070 -227839 400684 -94076 -41638 -45126 -62704 -317125 -115783
19410 400520 -56795 -114377 -8272 -241293 -346165 154517 55528 -4059 -361381 -210846 -16034
19398 -157301 -130756 56191 -136770 -31956 -218787 -119585 116179 1559 12044 152766 -221905
19386 -174338 -177431 -181232 83996 -142414 -77774 140518 9428 -253073 -217794 -59216 -84960
$$ packed form
19467b23351f6496j88086i7612D0103J17311l5157B4097J52748B1221h3968D4984
19455a21872A91360a38024k25712G9680e7957j57459A25073J5235c3034j34115
19445a67149A3859h9927k1723a4800k13635B45367c15971J19537C07704A53561
19434e14509C27379J6183a78050M6756A88509D9296e3993G1868I460b86344f8631
19422c3031j64069n2440I3070b27839D00684i4076d1638l488j7578k54421a15783
19410D00520e6795n7582h272k33021j04872A54517E5528d059l57322J50535a6034
19398a57301K6545E6191a36770c1956j86831R9202A16179A559J0485J40722b21905
19386a74338l093l801H3996a42414O4640A40518I428b53073L5279e9216k5744
$$ plain form
19375 -84960 75356 -72226 54316 2057 -104781 -338941 -111541 -32531 -212754 -199041 296963
19363 -76912 131448 -312907 39084 -69012 224202 41023 -416485 -158060 -5122 -158888 -106250
19352 -106250 171668 -70173 -185092 -35918 58573 -164247 -70652 103255 -79838 207954
19341 59499 -95416 -390751 -134587 -417784 -6925 -380175 -130273 -245048 -141860 -129971
19331 -129971 138716 64167 212998 -295791 -82838 -86055 -97233 -62860 -333832 -291813 -7439
19319 128251 -133284 -64461 28492 10134 38533 -95185 -275790 -329170 -55160 16936 -213744
19307 -5909 -186898 -35522 203697 -10581 -151903 -131620 196689 -180469 -247303 -55355 -39256
19296 -39256 -344628 3348 -181976 297216 -73285 -305724 -236486 -45148 -79477 -195620 72686
$$ packed form
19375h4960G5356g2226E4316B057a04781k34160a11541c2531j80223J3713B96963
19363g6912A31448c12907C9084f9012B24202D1023d16485a58060e122j53766N2638
19352a06250A71668g0173j14919c5918E8573a64247g0652A03255g9838B07954
19341E9499i5416k95335a34587k83197f925l73250a30273j14775J03188J1889
19331a29971A38716F4167J48831b95791h2838l217j1178L4373k70972M2019g439
19319A28251a33284f4461B8492A0134K8399i5185j80605n3380e5160A6936b13744
19307e909j80989c5522B03697a0581j41322K0283A96689a80469o6834e5355J6099
19296c9256l05372C348a81976B97216g3285k32439O9238d5148l4329j16143G2686
$$ plain form
19284 101720 -118909 -8283 12043 262757 105240 170288 -109764 -75290 -14751 -37390 -224242
19273 -224242 340783 13436 -65666 -32263 -3020 -214748 -151620 -443880 -115980 73230 -296492
19261 295976 171668 -367917 -28942 170238 -29379 -52460 -138958 89327 -282459 -98734 312586
19249 -64845 39923 96561 56236 -231105 17812 -199002 -190184 106850 57557 138920 -75513
19237 300228 -361936 -96537 -149372 99950 -51978 170330 186921 172355 -30556 14497 -7653
19225 -241691 168184 -105918 118332 -50005 -148678 5823 239902 431990 106699 48782
19214 -197711 -155821 -197290 -10178 -79953 -68764 -74971 36925 -223270 258526 19557 82360
19203 82360 -77495 -41611 -51229 -460655 -400022 72027 -92568 -213690 165207 -80159 -36229
$$ packed form
19284A01720a18909h283A2043K50714A05240O5048a09764L4474a4751k2639j86852
19273b24242C40783A3436f5666c2263c020k11728O3128k92260a15980G3230b96492
19261B95976j24308c67917b8942A70238b9379k3081q6498H9327b82459i8734C12586
19249f4845C9923N6638m0325b31105A7812a99002Q818A06850m9293Q1363g5513
19237C00228c61936i6537n2835I9950e1978A70330J6591j4566c0556A4497g653
19225b41691A68184a05918A18332e0005r8673E823K34079J92088A06699D8782
19214a97711M1890m1469a0178o9775J1189o207C6925b23270B58526A9557O2803
19203H2360g7495L5884r618m09426O0633G2027i2568j21122A65207h0159c6229
$$ plain form
19191 -177706 -250275 -9769 -48073 -99144 -167040 -30107 18796 -96871 217049 -9978 244057
19179 96451 -174443 -85672 -215786 20241 -111090 -104471 -203917 -427395 -117544 -69389 29844
19167 -65381 -7584 119491 33020 200839 -171799 -352809 -112532 55382 172286 160574 -28354
19155 198715 -92017 18159 -226470 186724 13873 -12233 -150532 506405 -20225 16647 149082
19144 149082 -65373 8110 -268753 -9115 -16360 -195301 63498 -38381 -7837 -255627 -149310
19133 -149310 -380641 47063 531594 189725 297066 72114 -187545 270872 2194 -38670
19122 580 -336515 353628 124983 73291 -219652 -123071 -186037 -151048 -73274 -44957 -157602
19111 -157602 -20507 -221141 66120 4529 33023 -94305 -155642 68851 -88041 -174736 3523 -106017
$$ packed form
19191a77706p2569i769l8304n1071o7896c0107A8796i6871B17049i978B44057
19179I6451a74443h5672j30114B0241a11090O619r9446k23478a17544M8155B9844
19167f5381g584A19491C3020J67819a71799j81010a12532E5382J16904j1712b8354
19155A98715i2017A8159b26470A86724A3873a2233j38299E06405b0225A6647J32435
19144A49082f5373H110b68753i115p245j78941F3498c8381g837k47790J06317
19133a49310k31331D7063M84531A89725J07341G2114a87545B70872B194c8670
19122E80c36515C53628A24983n1692b19652R6581o2966L4989g3274K8317j12645
19111a57602b0507k00634F6120D529K8494i4305o1337F8851h8041q6695C523a06017
$$ plain form
19098 -396370 -10224 94758 9958 -32639 -10975 -100506 -71940 -30521 -136495 22328 -2613 -165798
19086 -165798 -214517 -23963 -233206 128045 -61913 -15043 -208133 -219011 -103223 -147563 -304092
19075 -304092 -191516 -144474 40700 232969 -219634 -155535 -301529 -216918 -37455 120706
19064 -145022 -129948 113821 -18514 -133810 49814 -15584 -16836 -133799 -78009 -123694 -588111
19053 -588111 -52927 -182820 -53496 200276 154667 -87493 -267197 160156 -12311 -127153
19043 -127153 -151052 -10032 -187272 -198868 23030 322198 309636 -89453 -69411 -305944 -246584
19032 -246584 117043 -50887 100232 -114679 73986 213299 -206005 243719 45776 -137166
19021 -22931 235583 -3372 -153147 -175106 116113 -122591 216589 -24002 -209345 -35699 -48057
$$ packed form
19098c96370a0224I4758I958c2639a0975q9531K8566c0521j05974B2328b613j63185
19086a65798m8719b3963k09243A28045f1913a5043j93090j0878a03223m4340j56529
19075c04092J12576M7042D0700J92269b19634O4099j45994Q4611c7455A20706
19064a45022J5074A13821a8514j15296D9814a5584j252j16963N5790m5685m64417
19053e88111e2927j29893e3496B00276m5609h7493j79704A60156a2311j14842
19043a27153k3899a0032j77240j1596B3030K99168j2562h9453K0042k36533N9360
19032b46584A17043e0887A00232a14679G3986J39313b06005B43719D5776a37166
19021b2931B35583c372j49775k1959A16113a22591B16589b4002j85343c5699j2358
$$ plain form
19010 -48057 175909 15727 -210326 450428 -241560 -213240 -188840 -62267 -137267 6696 -64980
18998 -227280 -141286 -167158 97921 -220511 -227034 -285246 102206 -9866 -176543 -137305 112120
18986 -312057 42405 -335576 -109184 -221254 125174 -49080 -172500 -262388 -260543 27315 -123242
18974 17750 20597 136753 206227 -118529 -27897 -311735 -48846 -345513 -494234 184949 41692
18962 -89696 181677 -348690 -264298 88216 4553 -14163 246857 -408290 -268996 92547 151800
18951 151800 56504 -114261 141412 -215757 -290861 -35527 94375 -228508 -202015 -298543 40084
18939 67036 326670 108900 -111122 -238849 77344 102290 166591 173604 -369258 -24549 -30906
18928 -30906 -448361 -427486 -40680 104674 15850 38912 196648 168681 65910 -173397 -1742
$$ packed form
19010d8057A75909A5727b10326D50428b41560K8320K4400f2267p5000F696f4980
18998b27280Q5994k5872I7921b20511o523n8212A02206i866j66677L9238A12120
18986c12057D2405c35576a09184j12070A25174d9080j23420q9888J845B7315a23242
18974A7750K847J16156O9474a18529b7897k83838d8846k96667j48721A84949D1692
18962h9696A81677c48690Q4392H8216D553a4163B46857d08290J39294I2547N9253
18951A51800E6504a14261A41412b15757p5104c5527I4375b28508K6493r6528D0084
18939F7036K59634A08900a11122j27727G7344K4946O4301P013c69258b4549o357
18928c0906m17455K0875d0680A04674A5850K3062J57736k7967F5910a73397a742
$$ plain form
18916 -358230 54028 95434 -56562 -218311 -9619 -154975 -161332 -111272 78846 -290023 201695
18904 -1778 -325136 -240681 -222379 -96650 -110031 373845 -6488 244895 76200 69371 167433 -51971
18891 145383 180850 131233 -70139 -161624 -113984 -312752 279543 -379952 221778 -221263
18880 -101171 260787 -143974 319621 -177146 133173 133955 82736 -87388 308732 202883
18870 202883 -81146 -169291 35388 -156950 6832 -156275 119265 -3537 11061 -113730 -10286
18858 -62322 260605 6147 -28331 -23718 -193486 -124798 -214069 -213898 -337 -21432 81949 242069
18846 242069 144581 -45297 102025 -104911 -184587 31388 -166944 72158 -290206 280322
18835 -173291 -18964 -58859 -111474 -203379 -96222 74335 213323 -87104 109262 162332 -244575
$$ packed form
18916c58230E4028M1406e6562j61749i619j45356o357N0060G8846b90023B01695
18904a778l23358Q4455J8302i6650j3381C73845f488B44895G6200o829R8062e1971
18891A45383L5467m9617g0139r1485M7640j98768B79543c79952B21778b21263
18880a01171B60787a43974C19621a77146A33173P82n1219h7388C08732j05849
18870B02883h1146q8145C5388a56950F832a56275A19265c537A1061a13730a0286
18858f2322B60605F147b8331M613j69768O8688q9271J71c37k1095H1949J60120
18846B42069r7488d5297A02025a04911p9676C1388a66944G2158b90206B80322
18835a73291a8964l9895n2615r1905i6222G4335J38988h7104A09262N3070b44575
$$ plain form
18823 -21786 -48372 -166974 142183 -67011 -46527 -116432 185268 -118053 68787 -138478 25470
18811 50297 443776 356241 80138 -220155 10535 240916 40669 -88604 43668 215515 3596
18799 -272490 209686 92123 109656 -147500 -81175 204269 -15937 267903 -431645 -67854
18788 50984 221525 167428 -258419 162115 175097 -152287 -305261 2332 -80933 53551 -257736
18776 -112782 330303 -75347 -392486 138059 -314308 98680 -339677 33220 -8862 23821 -92445
18764 -79676 54228 32140 -75349 -126912 -49874 -12344 185109 -175998 -428239 -103006 72188
18752 -58366 18026 11240 -191670 69190 -61775 -18158 181725 111456 -190262 -13018 74305
18740 -74741 141866 27012 159503 48464 58380 -469441 -121684 -110412 176939 -156285 -240702
$$ packed form
18823b1786k6586j18602A42183f7011K0484o9905A85268a18053F8787a38478B5470
18811E0297L93479q7535H0138b20155A0535K30381D0669h8604D3668J71847C596
18799b72490B09686I2123J7533a47500O6325B04269a5937B67903d31645f7854
18788E0984J70541n4097b58419A62115J2982a52287j52974B332h0933E3551b57736
18776a12782C30303g5347l17139A38059c14308I8680c39677C3220h862B3821i2445
18764g9676E4228k2088g5349n1563d9874a2344A85109a75998k52241a03006G2188
18752e8366A8026o786a91670F9190f1775a8158A81725p0269a90262a3018G4305
18740g4741A41866B7012J32491D8464R916d69441a21684J1272A76939a56285q4417
$$ plain form
18729 -240702 -94122 -24756 -32798 2920 96881 233339 -105006 -80141 29358 -809 -35933 -1511
18716 153178 -147417 -237188 -58094 105412 -236379 -33044 -123385 -186372 342048 67152 -331416
18704 -218548 -71652 255968 89443 -176523 -318864 -336066 -114194 -64726 213378 97032
18693 -45055 -107525 -47352 24314 -325047 -163456 -57368 175775 134117 65166 -171143 92666
18681 114397 170304 -110388 72244 -18561 -187415 78104 -57002 -113168 -201257 -96669 -125921
18670 -125921 62455 -41920 75205 -392653 -113929 35255 -70870 82992 107915 -19411 -220943
18659 -220943 -179725 -237221 -268012 96188 162345 -129051 51250 -140791 -157286 -415636 21811
18647 91628 176991 71378 -27929 -125886 204830 -117249 123267 -177616 -123426 -343085 -209711
$$ packed form
18729b40702i4122b4756q042B920R3961J36458a05006K4865B9358h09l5124a511
18716A53178a47417q9771e8094A05412b36379c3044r0341o2987C42048F7152c31416
18704b18548g1652B55968H9443a76523j42341j7202a14194M9468B13378I7032
18693d5055o2470d7352B4314c25047J61591e7368A75775m1658F5166a71143I2666
18681A14397N5907a10388G2244a8561j68854G8104e7002n6166q8089i6669k9252
18670a25921F2455d1920G5205c92653a13929C5255g0870H2992K4923a9411k01532
18659b20943M1218n7496l0791I6188O6157a29051E1250a40791j6495k58350B1811
18647I1628Q5363G1378b7929r7957B04830a17249A23267a77616N4190k19659J33374
$$ plain form
18636 -209711 186504 27450 -190199 -8447 164629 -86523 -52640 -242676 -64568 -189192 -220731
18625 -220731 -239521 -16282 -26732 -154857 61621 -255318 -20915 -42018 -100339 394690 -74639
18613 169668 -194137 -267732 -60715 73874 2084 144212 145424 -170553 -24345 -124727 -64681
18602 -64681 -95050 -187280 9655 88918 -149744 -59996 -37873 -308907 45802 -26884 185891
18590 -148779 -180713 -165433 -322806 -337860 -69719 -40990 -217033 -286823 -194805 196438 16016
18578 -71366 66601 40602 -121861 -424144 120181 -58710 -228147 13685 144611 -291343
18567 -147122 -320494 68087 -133742 86731 -125331 25027 -65886 -231948 -24613 81670 -88553
18555 -228163 -328717 -92117 -244121 -54862 -70236 -365605 133144 -215266 -128171 -166118
$$ packed form
18636b09711A86504B7450a90199h447A64629h6523L3883j90036f4568j24624l1539
18625b20731j8790a6282j0450j28125F1621b55318b0915k1103n8321C94690g4639
18613A69668a94137p3595f0715G3874B084J42128J212a70553b4345j00382O0046
18602f4681l0369r2230I655P9263a49744e9996K2123k71034D5802b6884A85891
18590a48779l1934J5280j57373j5054f9719K8729j76043o9790R2018A96438A6016
18578g1366F6601k5999a21861l02283A20181e8710j69437A3685J30926b91343
18567a47122j73372F8087a33742H6731a25331B5027f5886j66062b4613H1670h8553
18555b28163j00554i2117j52004e4862j5374k95369A33144b15266Q7095l7947
$$ plain form
18545 -166118 -21807 -1712 241496 -224915 25052 176395 -315048 285 -147033 123486 114508
18534 114508 -422450 -80728 -269033 -126657 -12242 -156002 -333557 -129499 -34813 119104
18523 45082 -356411 -220442 37372 -135113 -156561 246606 136398 223959 200326 225008 -241325
18511 232859 -63912 -459 -44159 -6247 -123596 -192659 -33368 84810 159740 -93268 -15399 54859
18498 36970 -306123 -197378 -260540 3477 -98561 -264697 -241303 263897 -151343 -228700 145215
18486 182473 -13315 -100339 -63319 -156435 -17437 40439 -210210 273611 220839 28765 -128800
18474 -191576 117447 -232688 4793 -331639 108242 40973 257993 -114145 28629 -88384
18463 99853 40187 -111048 137797 119917 -221641 -181202 -56973 -112561 -142027 175 -136967
$$ packed form
18545a66118b1807a712B41496b24915B5052J51343c15048B85a47033A23486q978
18534A14508d22450h0728j88305a26657a2242j43760j77555a29499c4813A19104
18523D5082c56411J35969C7372a35113k1448B46606j10208Q7561k3633K4682b41325
18511B32859f3912d59m3700f247j17349o9063c3368H4810P4930i3268a5399E4859
18498C6970c06123J08745o3162C477i8561j66136K3394B63897a51343p7357A45215
18486A82473a3315q7024L7020r3116a7437D0439b10210B73611n2772B8765a28800
18474a91576A17447b32688D793c31639A08242D0973K17020a14145B8629h8384
18463I9853D0187a11048A37797j7880b21641M0439e6973n5588k9466A75a36967
$$ plain form
18451 -1471 31356 58111 105348 80594 -1554 -118564 -182487 -60390 179936 -52605 427812
18439 179948 -285070 262952 -239153 -118057 198913 -46272 -411247 191019 7052 -314173
18428 -123520 -219229 73601 -77846 -161456 -301721 -13162 173172 -56791 -86150 48148 705652
18417 705652 64729 -318040 -25367 -219295 -151066 84160 -29174 -163938 269789 211702 -12515
18405 377267 182663 83081 46778 -123319 175856 17448 -6871 67312 -148789 -278326 -5257
18393 -487538 -85209 -253748 -77305 -161685 -38890 -61362 -319789 102766 136506 -63587 318103
18381 193514 -109528 -241242 -502680 172510 -164644 -63873 -264035 -100619 58514 64321
18371 64321 -61410 -6578 -96613 -1928 23337 -314375 -96640 -19982 41943 365759 106000
$$ packed form
18451a471C1356K6755M7237k4754a554j17010o3923f0390A79936e2605D27812
18439A79948b85070B62952b39153a18057A98913d6272l64975A91019G052c14173
18428a23520r5709G3601g7846q3610j40265a3162A73172e6791k9359D8148O57504
18417G05652F4729c18040b5367j93928O8229H4160b9174j34764B69789n8087a2515
18405C77267A82663H3081l6303a23319A75856A7448f871F7312a48789j29537e257
18393d87538h5209j68539g7305q4380c8890k2472k58427A02766L3740f3587C18103
18381A93514a09528j31714k61438A72510a64644f3873k00162a00619E8514N807
18371F4321f1410f578r0035a928B3337c14375i6640a9982D1943L23816A06000
$$ plain form
18359 20571 43105 -299765 101119 54270 -161480 -8926 64814 112652 112953 -133977 9179 -253086
18346 -23807 -295067 -160122 266281 246761 -86410 -77125 45904 18355 -43521 -99994 72636
18334 133721 18569 -170718 -356683 -101141 124831 -504751 208235 198494 -35060 28092
18323 84585 10622 -155693 -206141 -212422 -197401 175488 16509 -245465 -25821 14045 -141883
18311 -254009 -76896 -186074 -148983 279986 5817 -264297 -467535 180507 -65936 94818 19494
18299 -389841 70169 -158461 -155762 -219271 184314 171749 -7660 -67593 128114 -32708 -142618
18288 -142618 160196 -168237 -185062 278211 -87393 -295870 81642 -86427 -97389 -373370
18278 -373370 -566474 -80771 69449 8020 186159 4439 47273 -136464 73702 -142417 64311
$$ packed form
18359B0571K2534b99765A01119m6849a61480h926F4814M7838L01a33977I179b53086
18346b3807k71260J34945B66281j9520h6410R285D5904A8355d3521n6473G2636
18334A33721A8569a70718j85965a01141A24831e04751B08235r741c5060B8092
18323H4585A0622a55693n0448o281J5021A75488A6509b45465b5821A4045a41883
18311b54009g6896j09178L7091B79986E817b64297k03238A80507f5936I4818A9494
18299c89841G0169a58461K699o3509A84314j2565g660n9933A28114c2708j09910
18288a42618A60196a68237j6825B78211h7393k08477H1642h6427j0962k75981
18278c73370j93104h0771F9449H020J78139D439M2834a36464G3702a42417F4311
$$ plain form
18266 -465538 -147264 -69499 -153229 269725 298531 169964 -245054 154381 -266786 87236
18255 -330117 193050 158512 271464 -90304 237719 -233940 78527 250457 160 -244385 -226405
18244 -226405 234025 -331697 87181 -55778 47241 -156640 -633914 49838 -81987 -24227 -73084
18233 -73084 321851 217979 317369 74506 -62297 84830 139333 -142077 -10540 -92990 42673
18221 30396 65893 -53737 -54639 172117 25967 -113372 -330820 -194202 -108061 59761 -324186
18209 13351 7633 2583 -156592 15713 -112547 -226689 -107458 -79355 208349 53311 103548
18198 103548 40878 -316389 -113184 -169641 -32495 -84000 -128338 -303616 87302 -173740 -24825
18186 -116334 -195982 -129036 -163365 -232191 42018 -53235 246157 -7033 -262192 -140979 -27164
$$ packed form
18266d65538a47264f9499q3730B69725K8806j28567b45054A54381b66786H7236
18255c30117A93050l4538J12952i0304B37719b33940G8527J71930A60b44385J7980
18244b26405B34025c31697H7181e5778D7241a56640m77274D9838h1987b4227m8857
18233g3084C21851j03872R9390G4506f2297H4830N4503a42077a0540q2450D2673
18221C0396L5497e3737r02A72117B5967a13372k17448J36618Q6141E9761c24186
18209A3351n718B583a56592A5713a12547j14142a07458K8103B08349E3311N0237
18198A03548D0878c16389a13184n6457c2495n1505m4338j75278H7302a73740b4825
18186a16334p9648O6946l4329o8826D2018e3235B46157g033k55159J21213b7164
$$ plain form
18174 -289580 -480259 -89164 324439 -157943 68845 164403 -192974 -69865 8488 80908 211111
18163 211111 29513 6847 245483 11240 -154962 -133883 198656 -153847 -167648 854 -491693
18151 93401 91559 -24705 -262839 -43919 -230679 133053 -231956 -315122 -53737 -186019 -113095
18140 -113095 64229 259396 -129333 -56188 83689 294175 90660 -85882 -530384 321140
18129 70776 -139750 -47255 -89099 -358606 140912 -120340 404851 -182446 -27954 -292016
18119 -292016 -83802 -223536 -189338 -39298 -152852 88902 -125164 -238956 -283812 -83905 -138312
18108 -138312 179154 -67317 -126805 -118208 -16056 -339908 -73524 -126722 -357891 -63785 121084
18096 15394 -35102 -310588 -145939 -300964 -77122 -68537 -130950 148033 84033 126125 106081
$$ packed form
18174b89580j90679h9164C24439a57943F8845R5558a92974f9865H488P2420J30203
18163B11111B9513F847K38636A1240a54962K1079A98656a53847j3801H54d91693
18151I3401j842b4705k38134d3919j86760A33053b31956q3166e3737j32282P2924
18140a13095F4229J95167a29333e6188H3689K10486I0660h5882m44502C21140
18129G0776a39750d7255m1844k69507A40912a20340D04851a82446b7954k64062
18119b92016h3802j39734L4198c9298j13554H8902a25164j13792m4856h3905n4407
18108a38312A79154f7317n9488Q597a6056l23852g3524n3198k31169f3785A21084
18096A5394c5102k75486a45939j55025g7122Q585o2413A48033o4000M2092k0044
$$ plain form
18085 106081 -111599 -242826 38817 4020 -136511 -77292 514981 51482 -269042 -125377
18074 323583 -37503 114665 73803 140292 -730 82275 294549 -239508 -60831 -253431 24295
18062 28324 123312 174592 93648 -88552 232130 239530 54934 -11726 -11447 252154 -106189 -140851
18050 -140851 -357098 -8087 -329731 -166816 -391571 241245 -82819 253524 182714 54478
18039 -183173 -161202 50662 114796 34972 -95098 72213 -157286 -23155 -4493 -300095 98687
18027 120829 125781 103221 -18103 -154738 -82867 -152655 84982 -69934 -27318 -142430 126921
18015 190807 -24563 -154583 32186 -75249 -37192 -186926 17741 -37427 -185911 222277 -172417
18003 -223458 -158807 81258 215104 77527 -471754 76630 260747 -252534 -116241 -208037
$$ packed form
18085A06081a11599j31227C8817D020a36511N9219E14981E1482b69042a25377
18074C23583c7503A14665m0862O6489g30H2275K12274b39508f0831j92600B4295
18062B8324R4988N1280q0944h8552B32130P400E4934a1726K79B52154a06189l4662
18050a40851k16247h087l21644J62915k24755B41245h2819B53524p0810E4478
18039a83173K1971E0662O4134C4972i5098G2213a57286b3155d493k95602I8687
18027A20829M952k2560a8103j36635P1871o9788H4982f9934b7318j15112A26921
18015A90807b4563j30020C2186g5249c7192j49734A7741c7427j48484B22277a72417
18003b23458O4651H1258J33846G7527d71754G6630J84117b52534a16241r1796
$$ plain form
17993 -208037 -40954 185189 69540 227805 154622 -168345 55352 108594 178308 150378 -48984
17981 -138468 11013 -150449 -181399 211997 -114263 -6062 -21357 110363 -144084 -197810 -234391
17970 -234391 -35659 3121 -117594 138309 28376 128788 -55108 225473 76441 -162269 110952
17958 -198614 -104670 88348 35938 -54764 331137 -51262 16321 317139 35940 10825 -159130
17946 -77525 -116495 180630 101255 49356 -41382 273768 -201504 -243318 -12821 -20865 69483
17934 -141042 47124 312117 -316301 13641 -35983 -54288 -12373 -123218 -66549 -8008 117463
17922 108456 -34062 24176 -200945 -164967 -102801 -147635 -32387 8313 -15852 -6940 -139434
17911 -139434 167108 248779 -170166 -532112 -187643 -38042 -192069 -33225 239478 23383
$$ packed form
17993b08037d0954A85189F9540J58265p3183a68345E5352N3242O9714k7930d8984
17981a38468A1013a50449l0950B11997a14263f062j5295A10363a44084n3726l6581
17970b34391c5659C121a17594A38309B8376J00412e5108B25473G6441a62269A10952
17958a98614R3944H8348C5938e4764C31137e1262A6321L00818C5940A0825a59130
17946g7525l8970A80630p9375D9356d1382B73768b01504m1814a2821q044F9483
17934a41042D7124K64993c16301A3641c5983j8305a2373j10845N6669h008A17463
17922A08456c4062B4176b00945L5978O2166m4834c2387H313a5852f940j32494
17911a39434A67108Q1671a70166l61946a87643c8042j54027c3225B39478B3383
$$ plain form
17900 -201608 -215529 -215273 -41168 -79105 -187496 150768 72186 -202389 -318927 -27289 27952
17888 -51103 124454 -189859 -210411 -231681 -12687 -144414 -206958 -222818 -103407 -101016 -270803
17877 -270803 281827 69525 32752 -118414 104502 30583 -84341 -154019 -361876 11351 -35379
17865 93684 -184489 17698 395831 -15826 51898 137928 40241 90449 4994 183713 292069
17854 292069 -12224 -126449 80844 -30201 -21755 342088 410558 161342 -202345 119668 -22972
17842 3253 -63740 18037 -273738 -9577 -71771 -159612 187497 115678 92598 135569 -13713 -299444
17830 -299444 -158567 -110648 26808 220550 68002 52509 50330 -111365 56013 -7899 -32698
17819 -32698 29997 -194708 29522 276408 -209362 -169550 130824 -189023 193963 176138
$$ packed form
17900b01608j3921K56d1168l7937j08391A50768G2186b02389j16538b7289B7952
17888e1103A24454a89859k0552k1270a2687j31727o2544j5860a03407K391j69787
17877b70803B81827F9525C2752a18414A04502C0583h4341o9678k07857A1351c5379
17865I3684a84489A7698L78133a5826E1898Q6030D0241N0208D994J78719J08356
17854B92069a2224j14225H0844c0201Q446C42088O8470A61342b02345A19668b2972
17842C253f3740A8037b73738i577o2194q7841A87497p1819k3080M2971a3713k85731
17830b99444J40877M7919B6808J93742F8002j5493k179a11365E6013g899k4799
17819c2698B9997a94708B9522K46886b09362L9812A30824a89023A93963j7825
$$ plain form
17809 176138 358901 215877 -196283 -209462 3917 55369 -327746 -177325 222797 213586 173846
17798 173846 177618 -142059 66608 -41001 -206691 113848 163359 -323406 69009 356678 15875
17786 -88962 67309 -6634 219421 -89046 -130146 -182110 -38873 -198043 -230262 -99049 16891
17774 79015 28508 -257936 -94964 -212717 290801 94951 -208707 -278767 132872 28630 323406
17763 323406 -271146 212432 457302 -218109 88195 -59813 -99424 527839 -128128 -477561
17753 -477561 41608 104230 -62966 20875 115697 -113493 268327 189080 -144112 -80618 -44635
17742 -44635 88596 -103349 78938 -248774 11143 -181205 -219487 -335280 69768 62666 -92800
17730 -92261 27358 -104111 14476 333517 157593 69619 146174 -270816 -60850 -392938 -81699
$$ packed form
17809A76138J82763j43024a96283j3179C917N1452c27746J50421B22797r211l9740
17798A73846L772a42059F6608d1001j65690A13848M9511c23406F9009K87669A5875
17786h8962F7309f634B19421h9046m1100n1964c8873j59170l2219i9049A6891
17774G9015B8508b57936i4964j17753B90801I4951b08707p0060A32872B8630K94776
17763C23406b71146B12432K44870b18109H8195e9813l9611E27839a28128l49433
17753d77561D1608O2622f2966B0875R4822a13493B68327p9247a44112O3494L5983
17742d4635H8596a03349G8938b48774A1143a81205l8282j15793F9768p102i2800
17730i2261B7358a04111A4476L19041A57593F9619P6555b70816f0850l32088h1699
$$ plain form
17718 -143681 -209999 140666 126369 -7430 -118571 -40150 -122456 -236305 -30579 212565 -123123
17706 55821 243362 155195 29023 3304 -13371 9828 69964 77606 -324797 -194324 89577 96538
17694 96538 128931 -103062 229298 -171098 -142946 -327949 -130499 -155277 -212697 -103681
17683 -252382 118150 86189 51059 182645 -211513 -99093 -144584 -1683 29075 -262647 240317
17671 128155 6433 19722 125065 -265191 85566 -177065 -109074 136757 -6946 31689 173587
17660 173587 247844 173493 136345 107011 -359589 -53591 -149087 -431007 167696 72544 335045
17649 335045 203575 76313 -91016 -15961 18853 1318 88899 -60391 212687 27818 -61660
17637 83627 126330 64583 122408 152864 75936 -42494 20368 366920 192391 37946 -34774
$$ packed form
17718a43681o6318A40666j4297g430j11141d0150q2306j13849c0579B12565a23123
17706E5821J87541q8167B9023C304a3371I828O0136P642c24797J30473H9577O961
17694I6538L2393a03062B29298a71098K8152j85003a30499k4778n7420a03681
17683b52382A18150l1961l5130J31586b11513i9093m5491a683B9075b62647B40317
17671A28155F433J3289J05343b65191H5566a77065O7991A36757f946C1689J41898
17660A73587P4257p4351l7148k9334c59589e3591r5496k81920A67696G2544K62501
17649C35045j31470G6313i1016a5961A8853A318Q7581f0391B12687B7818f1660
17637H3627M2703o1747N7825L0456G5936d2494B0368L46552j74529C7946c4774
$$ plain form
17625 368067 -28556 -104165 -252825 -103928 85647 58358 96857 -297586 -58534 110174 327360
17614 327360 -31722 91013 190594 178629 346955 -230324 115958 -26808 23852 86251 -77606
17602 262183 2786 57154 202440 99544 39413 -122079 -121269 -5367 159702 -138420 77682
17590 30875 97409 -29333 116775 105061 -190013 -332901 -204080 148097 34204 96700 113516
17579 113516 43715 -354297 227183 163066 283359 16403 117023 165976 -30880 122454
17568 77202 33949 -320233 -198335 275215 264089 -17848 -317508 121982 -44270 -111795 183900
17556 -108462 170093 109868 -195964 129575 276484 -85137 -345465 -121998 29457 -7627
17545 -239600 380433 337163 62240 189570 -12159 640131 194158 6609 -127921 75118 207598
$$ packed form
17625C68067b8556p5609j48660a03928H5647k7289L8499b97586e8534A10174K17186
17614C27360c1722I1013R9581j1965J68326b30324A15958b6808B3852O2399g7606
17602B62183B786N4368J45286I9544C9413a22079Q10e367A59702a38420G7682
17590C0875O6534b9333A16775j1714a90013j42888J28821A48097C4204O2496J6816
17579A13516D3715c54297B27183o4117J20293A6403J00620M8953c0880A22454
17568G7202C3949c20233J21898B75215j1126a7848k99660A21982d4270o7525A83900
17556a08462A70093o0225a95964A29575J46909h5137k60328a21998B9457g627
17545b39600C80433m3270F2240J27330a2159F40131A94158F609a27921G5118J32480
$$ plain form
17534 207598 170507 -193279 164163 354855 -284930 -25362 46075 147262 -112455 -149193
17524 -149193 300884 -230953 216684 -32641 110975 -73028 108671 181445 -39039 -92600
17514 -92600 -30997 108628 252821 333887 407460 -152946 308638 -10743 142043 232383 -31263
17502 -14492 223335 -182467 -126025 54138 103018 201508 350231 134660 358004 62925 3720
17490 109268 54662 43684 303950 10741 -57763 64484 -34007 -238218 66361 -56077 252377
17478 223088 -54541 202427 -77079 93931 280922 234577 246461 47981 262274 226453 490527
17467 490527 122459 174259 130101 373817 184607 410675 -90954 -88628 28144 25039 -54844
17455 184810 -101564 359749 145809 36856 117350 185384 20353 64110 579208 395451
$$ packed form
17534B07598l7091a93279A64163J90692b84930b5362D6075J01187a12455l6738
17524a49193C00884b30953B16684c2641A10975g3028A08671P2774c9039n3561
17514i2600c0997A08628J44193Q1066P3573a52946C08638a0743A42043R0340c1263
17502a4492B23335a82467N6442E4138M8880R8490J48723A34660K23344F2925C720
17490A09268n4606j0978K60266A0741e7763F4484c4007k04211F6361e6077B52377
17478B23088e4541B02427g7079I3931J86991m6345J1884D7981K14293l5821K64074
17467D90527A22459N1800m4158K43716A84607K26068i0954K326B8144l105e4844
17455A84810a01564C59749A45809C6856Q0494O8034B0353M3757N15098j83757
$$ plain form
17445 395451 111961 356680 60358 296216 86888 852938 592299 303427 -117884 356162
17434 427977 359733 245358 147815 418571 155455 238460 108522 119000 363751 275246
17424 275246 290805 209072 169681 106208 270193 295317 290492 -3648 143303 -4213 154997
17412 194358 25711 508781 -26402 48570 166872 183013 127841 5418 40152 127855 -91465
17400 -147045 196793 -1266 391386 -895 8159 194727 201626 124185 390617 -131855 332147
17388 431490 -275472 228266 280534 -63249 256006 56139 -150605 198686 -160565 326362
17377 254337 -172651 14498 -138798 -37313 331618 -209841 -62298 -126542 8941 82805 56406
17366 56406 338482 84482 475000 -30525 -24184 238633 72674 124185 112718 118229 107971
$$ packed form
17445C95451A11961K44719F0358K35858H6888P66050k60639k88872a17884C56162
17434D27977o8244j14375r7543K70756A55455Q3005A08522J0478K44751q8505
17424B75246J5559q1733l9391o3473J63985K5124m825c648A43303d213A54997
17412A94358B5711M83070b6402D8570J18302J6141n5172E418L4734Q7703i1465
17400a47045A96793a266C91386h95H159J86568O899p7441K66432a31855C32147
17388D31490b75472B28266N2268f3249B56006E6139a50605A98686a60565C26362
17377B54337a72651A4498a38798c7313C31618b09841f2298o4244H941P3864k6399
17366E6406K82076H4482L90518c0525O341B38633G2674N1511j1467N511j0258
$$ plain form
17355 107971 143331 93836 164980 149392 -16991 113241 180068 78444 48488 269395 -26746
17343 129744 50793 286644 -96967 231643 177805 -16937 -73689 199708 -113886 49966 555875
17332 555875 -10507 274851 151135 -85645 -99080 303301 64981 221970 119005 133219
17322 133219 324201 212322 322599 348008 120545 -40296 -48295 290291 99682 99701 -9944
17310 -187489 73255 315646 164856 125549 6131 38018 27304 41407 119587 206533 316462
17299 316462 129918 -47200 148729 246971 202171 -62500 -2629 276218 -52478 91758 507342
17288 507342 343273 -123424 184212 455493 18579 -89980 115591 190572 -123644 179578
17277 184836 -7226 145019 1563 150787 296080 172044 272527 31346 -62548 233834 207785
$$ packed form
17355A07971L5360m9495P1144j5588a6991A13241O6827G8444k9956K20907b6746
17343A29744E0793K35851i6967B31643n3838a6937n6752A99708a13886D9966N05909
17332E55875a0507B74851j23716h5645j3435C03301F4981J56989j02965J4214
17322A33219J90982j11879J10277K5409A20545d0296p999B90291I9682J9i944
17310a87489G3255K42391j50790l9307F131L1887j0714J4103P8180Q6946J09929
17299C16462A29918d7200A48729R8242m4800f2500b629B76218e2478I1758M15584
17288E07342j64069a23424A84212K71281A8579h9980A15591P4981a23644A79578
17277A84836g226A45019A563J49224J45293j24036J00483C1346f2548B33834k6049
$$ plain form
17266 207785 -5242 156462 -47618 36198 155297 -195929 -110285 191624 285847 132113 -103737
17254 283129 -108128 131813 215084 164774 255746 217561 239038 3137 188611 324477 364617
17243 364617 143404 88420 -9878 143307 -87632 291331 113783 145256 407521 29152 307975
17232 307975 134050 290920 160714 -131022 126978 -133352 371312 57974 279545 63001
17221 233360 39706 192616 25469 315122 390027 136416 -134883 178061 145969 172656
17211 172656 107585 558458 98583 226468 165288 527261 254707 318574 176067 15554
17200 149075 -56240 278134 -5109 23816 175427 448434 116256 12755 213927 161798 177787
17189 177787 248763 173257 449210 352956 320181 209897 471759 253123 235873 364151
$$ packed form
17266B07785e242A56462d7618C6198J19099a95929Q5644A91624R4223A32113a03737
17254B83129a08128A31813Q3271n0310R0972l8185K1477C137J85474J35866M0140
17243C64617A43404n4984i878A43307h7632B91331A13783L1473K62265B9152K78823
17232C07975A34050J56870j30206a31022A26978a33352C71312E7974K21571F3001
17221B33360C9706J52910B5469K89653P4905A36416a34883A78061l2092K6687
17211A72656o5071M50873I8583J27885o1180L61973B54707O3867j42507A5554
17200A49075e6240B78134e109B3816J51611K73007A16256A2755K01172n2129J5989
17189A77787P0976p5506K75953r6254l2775j10284K61862k18636j7250J28278
$$ plain form
17179 364151 364764 -33709 -12922 175370 328993 44816 251830 366877 318594 547687 639348
17168 639348 167877 -3575 228755 254280 339927 581121 68998 642265 59287 229403 447541
17157 447541 198069 168537 367026 212652 172112 45503 253332 322709 485688 -11597
17146 336403 569903 429805 224664 -57980 304137 338285 128317 189367 149460 660530
17136 660530 636432 93049 386842 195252 510819 160078 247431 322222 -67923 49715 574953
17125 574953 245662 267717 512772 270364 407395 302939 119076 254733 202641 488145
17115 488145 131009 472194 480637 304360 74078 453732 521409 463573 359181 408585 485253
17104 485253 282631 399908 368535 231115 269203 66662 402300 303614 412525 297655
$$ packed form
17179C64151O13c3709a2922A75370J53623D4816K07014J15047m8283K29093R1661
17168F39348A67877c575B28755K5525Q5647K41194F8998N73267E9287J70116K18138
17157D47541A98069k9532J98489j54374m0540D5503K07829O9377J62979a1597
17146C36403K33500j40098k05141e7980C04137L4148A28317O1050l9907N11070
17136F60530k4098I3049K93793j91590L15567A60078Q7353P4791f7923D9715N25238
17125E74953B45662K2055K45055k42408J37031j04456A19076J35657n2092K85504
17115D88145A31009L41185Q443j76277G4078L79654O7677n7836j04392M9404P6668
17104D85253k02622J17277l1373j37420L8088F6662L35638r8686J08911j14870
$$ plain form
17094 297655 450697 361859 287504 391812 289054 387828 240808 590636 328391 229164
17084 229164 253561 384073 662677 324922 452520 322418 249033 598598 296626 417837
17074 417837 184910 184604 713544 536135 459665 446973 484705 495788 89694 443802 616636
17063 616636 547846 689271 467784 345453 485035 318640 387221 621106 344269 608656
17053 608656 510360 494995 573360 417855 647448 588197 697528 178810 370793 499342
17043 499342 421084 605674 650632 663739 333219 465271 399211 303269 281454 684581 537096
17032 537096 454978 737989 501018 435989 683053 645823 670309 512046 727695 786983
17022 786983 595039 634028 437130 179124 737881 597957 670765 451913 517149 535125
$$ packed form
17094B97655J53042q8838p4355J04308j02758R8774j47020L49828k62245r9227
17084B29164K4397J30512K78604C24922J27598j30102p3385L49565B96626J21211
17074D17837A84910l06N28940j77409p6470j2692L7732J1083H9694L54108J72834
17063F16636o8790J41425k21487j22331J39582j66395O8581K33885k76837K64387
17053F08656r8296j5365P8365j55505K29593n9251J09331A78810J91983J28549
17043D99342p8258J84590M4958J3107l30520J32052o6060r5942k1815M03127j47485
17032E37096q2118K83011k36971o5029K47064l7230K4486j58263K15649N9288
17022G86983j91944L8989j96898A79124N58757j39924P2808k18852O5236J7976
$$ plain form
17012 535125 506062 742694 641275 765495 865359 662092 840017 217607 817083 419649
17002 419649 837578 598340 643601 731838 869786 624917 922025 966423 509910 956772
16992 956772 823709 677259 505477 904954 727925 835257 642016 534628 818354 908907
16982 908907 692320 856952 1244897 583348 767067 793330 826080 946102 835547 697317
16972 697317 1099955 994018 773967 1239125 673917 1055832 737256 899841 807043 1023515
16962 1023515 1105448 948168 1046890 1061899 1082129 519755 881982 1061824 831528 945158
16952 945158 1051853 1086754 1245426 824242 1103143 896617 1269954 1005116 828582 977048
16942 977048 1375354 778316 1065450 913082 1222428 1035932 1201812 1132802 1350898 1131474
$$ packed form
17012E35125k9063K36632j01419J24220R9864k03267J77925B17607N99476l97434
17002D19649M17929k39238M5261Q8237J37948k44869K97108M4398m56513M46862
16992I56772j33063j46450j71782L99477j77029J07332j93241j07388K83726R0553
16982I08907k16587J64632L87945E83348J83719K6263L2750J20022j10555j38230
16972F97317M02638j05937k20051M65158n65208L81915l18576J62585r2798K16472
16962A023515Q1933j57280R8722J5009K0230E19755L62227J79842k30296J13630
16952I45158J06695L4901J58672m21184K78901k06526L73337k64838j76534J48466
16942I77048L98306n97038K87134j52368L09346j86496J65880o9010K18096k19424
$$ plain form
16932 1131474 1685713 1474142 993369 1161792 1040472 1300776 1290391 1226692 1508664 1093501
16922 1093501 1411112 1759301 1444573 1417984 1244648 1103094 1363318 1648113 1583005 1356027
16912 1356027 1395252 1518211 1171923 1557364 1399055 1465013 1577844 1456496 1615167 1766586
16902 1766586 1709375 1557907 1725126 1524899 1795614 1626743 1586038 1665648 1656600 1664490 1860620
16891 1860620 1837178 1727375 1945679 1646049 1757441 2018265 1962062 1887465 2036894 1980638
16881 1980638 2242609 1866526 2090165 2054050 2200976 1940039 2310866 2026693 2173233 2268860
16871 2268860 2377341 2479161 2312950 2496803 2611896 2592462 2527048 2594042 2676497 2850864
16861 2850864 2574039 2834196 2919707 2535292 3069695 3011095 2730762 3116569 3026570 3109781
$$ packed form
16932A131474N54239k11571m80773J68423j21320K60304j0385o3699K81972m15163
16922A093501L17611L48189l14728k6589j73336j41554K60224K84795o5108k26978
16912A356027L9225J22959l46288L85441j58309O5958J12831j21348J58671J51419
16902A766586n7211j51468J67219k00227K70715j68871m0705P9610r048P890J96130
16891A860620k3442j09803K18304k99630J11392K60824n6203p4597J49429n6256
16881A980638K61971l76083K23639l6115J46926k60937L70827k84173J46540R5627
16871B268860J08481J01820j66211J83853J15093j9434o5414O6994Q2455J74367
16861B850864k76825K60157Q5511l84415N34403n8600k80333L85807q9999Q3211
$$ plain form
16851 3109781 3044595 2971137 3043845 3623103 3158060 3415685 3575018 3493432 3361660 3566291
16841 3566291 3684346 3679073 3793260 3762415 3762623 3632488 3717236 3834677 4086442 4114828 4265592
16830 4265592 4227617 4214422 4129882 4545952 4787777 4953097 4731083 5046835 5140417 5155814
16820 5155814 5134844 5404078 5103519 5493150 5688220 5625711 5853922 5897814 6014537 6239076
16810 6239076 6459123 6666701 6429088 6244980 6840208 6991362 7365610 7452878 7215500 7893083
16800 7893083 7979011 8272260 8464220 7948770 8650135 8771408 9140517 9203314 9479738 9824746
16790 9824746 10124527 10211314 10818761 10749254 11248236 11164286 11834471 12093182 12576296 12901769
16780 12901769 13547203 13615847 13800849 14174785 14945379 15287646 15903841 16237852 16870997
$$ packed form
16851C109781o5186p3458P2708N79258m65043K57625J59333q1586j31772K04631
16841C566291J18055n273J14187l0845K08j30135Q4748J17441K51765K8386J50764
16830D265592l7975j3195q4540M16070K41825J65320k22014L15752R3582J5397
16820E155814k0970K69234l00559L89631J95070o2509K28211M3892J16723K24539
16810F239076K20047K07578k37613j84108N95228J51154L74248Q7268k37378O77583
16800G893083Q5928K93249J91960n15450P01365J21273L69109O2797K76424L45008
16790I824746K99781Q6787O07447o9507M98982q3950O70185K58711M83114L25473
16780A2901769O45434O8644J85002L73936P70594L42267O16195L34011O33145
$$ plain form
16771 16870997 17513129 17929734 18802877 19284080 19833531 20838234 21596230 22294396 22982338
16762 22982338 24109272 24837223 26069530 27007131 28017536 28899053 30519603 31382994 33417887
16753 33417887 34210300 36202771 37810857 39622629 41504271 43408378 45698153 48034557
16745 48034557 50221111 53095608 55816963 59019953 62157379 65553149 69069025 73376135
16737 73376135 77577276 82129024 86659757 91971162 97243502 103091383 108930458 115251391
16729 115251391 121894561 128448830 135355298 142454876 149033740 155270977 161429630 166987180
16721 166987180 172000579 176045557 179662656 181889557 182688688 182795755 181271618 179069245
16713 179069245 175763683 171133287 165663828 160003073 153630404 146670496 139587619 132254278
$$ packed form
16771A6870997O42132M16605Q73143M81203N49451J004703P57996O98166O87942
16762B2982338J126934P27951J232307R37601J010405Q81517J620550Q63391K034893
16753C3417887P92413J992471J608086J811772J881642J904107K289775K336404
16745D8034557K186554K874497K721355L202990L137426L395770L515876M307110
16737G3376135M201141M551748M530733N311405N272340N847881N839075O320933
16729A15251391O643170O554269O906468P099578O578864O237237O158653N557550
16721A66987180N013399M044978L617099K226901P99131J07067j524137k202373
16713A79069245l305562m630396n469459n660755o372669o959908p082877p333341
$$ plain form
16705 132254278 125048461 118055285 111391757 104610914 98506799 92811072 87101681 81705179
16697 81705179 76964900 72241010 68223913 64077856 60748373 57218329 53816903 50878253
16689 50878253 48303841 45856926 43112476 40997147 38765452 37136482 35310763 33639302
16681 33639302 31618314 30620456 29194904 27969366 26463822 25109981 24220613 23233450
16673 23233450 22459527 21100295 20530201 19491940 18914793 18201146 17678568 16796283 16300454
16664 16300454 15729622 15063440 14636713 14344789 13887000 13178195 12458556 12472904 11761551
16655 11761551 11756306 11380769 10695881 10614313 10019656 9989161 9520058 9527505 9160938 9017472
16645 9017472 8824001 8125521 8328877 7870535 7747259 7491502 7223734 7084568 6871290
$$ packed form
16705A32254278p205817o993176o663528o780843o104115n695727n709391n396502
16697H1705179m740279m723890m017097m146057l329483l530044l401426k938650
16689E0878253k574412k446915k744450k115329k231695j628970j825719j671461
16681C3639302k020988r97858j425552j225538j505544j353841q89368r87163
16673B3233450p73923j359232n70094j038261n77147p13647n22578q82285m95829
16664A6300454n70832o66182m26727k91924m57789p08805p19639J4348p11353
16655A1761551n245l75537o84888q1568n94657l0495m69103P447l66567j43466
16645I017472j93471o98480K03356m58342j23276k55757k67768j39166k13278
$$ plain form
16636 6871290 6625118 6414425 6305293 5978728 6194639 5698660 5844121 5514829 5664807
16627 5664807 5293759 5193281 5460256 5357389 4488828 4686221 4383214 4642722 4254840
16618 4254840 4520724 4098076 4280094 4363630 4106219 4394714 3763748 4090988 3861399 3741436
16608 3741436 3547476 3810137 3585160 3181041 3481411 3483061 3420492 3009461 3143783 2792125
16598 2792125 3021759 2896126 3189958 2851328 2996255 2653369 2736304 2589248 2389467 2740734
16588 2740734 2716457 2613320 2260028 2321260 2382374 2362830 2134557 2196893 2210605 1969953
16578 1969953 2249176 1969436 2138496 2219827 1811207 1894570 1922445 1879446 1968548 2055901
16568 2055901 1999898 1777920 1859377 1717462 1965265 1846301 1823079 1580779 1428776 1666007
$$ packed form
16636F871290k46172k10693j09132l26565K15911m95979J45461l29292J49978
16627E664807l71048j00478K66975j02867q68561J97393l03007K59508l87882
16618D254840K65884m22648J82018Q3536k57411K88495o30966L27240k29589j19963
16608C741436j93960K62661k24977m04119L00370J650o2569m11031J34322l51658
16598B792125K29634j25633K93832l38630J44927l42886Q2935j47056j99781L51267
16588B740734k4277j03137l53292O1232O1114j9544k28273O2336J3712k40652
16578A969953K79223k79740J69060Q1331m08620Q3363K7875m2999Q9102Q7353
16568B055901n6003k21978Q1457j41915K47803j18964k3222k42300j52003K37231
$$ plain form
16558 1666007 1557780 1469451 1722737 1857953 1829494 1860268 1622308 1478381 1490017 1340943
16548 1340943 1770089 833427 1386964 1651833 1323240 1508065 1041884 1145508 1151462 1318154
16538 1318154 1222153 1231795 1151968 1038335 1480273 1329894 1205311 1176033 1317381 1289253
16528 1289253 1191689 1086485 1295341 1007879 963636 820863 889868 1154145 989060 872095
16518 872095 837461 884786 388957 756938 1085777 986687 725206 1006033 974406 536330
16508 536330 768878 500517 913694 770877 654344 889243 913724 786509 755727 729742
16498 729742 968311 744861 680343 744536 793574 564772 436790 637783 609676 626194
16488 626194 698446 730722 636310 737577 434091 783339 801408 742458 674056 755510 801275
$$ packed form
16558A666007j08227q8329K53286J35216k8459L0774k37960j43927J1636j49074
16548A340943M29146H33427N53537K64869l28593J84825m66181J03624N954J66692
16538A318154r6001R642p9827j13633M41938j50379j24583k9278J41348k8128
16528A289253r7564j05204K08856k87462m4243j42773O9005K64277j65085j16965
16518H72095l4634M7325C88957L67981L28839r9090k61481K80827l1627m38076
16508E36330K32548k68361M13177j42817j16533K34899K4481j27215l0782k5985
16498G29742K38569k23450o4518O4193M9038k28802j27982K00993k8107J6518
16488F26194P2252L2276r4412J01267l03486L49248J8069n8950o8402Q1454M5765
$$ plain form
16477 801275 787624 358064 498751 627027 860699 486842 652793 232273 366042 493905
16467 493905 289515 405413 371148 744106 481937 836717 661104 577531 303673 335526
16457 335526 470577 523088 304420 475107 648056 839028 394164 320543 475358 290570
16447 290570 342370 590962 601295 579745 178201 415373 474719 482705 320069 507693 563822
16436 563822 427805 560707 298595 264976 615031 713404 510008 412240 771756 344589
16425 284508 150282 486782 260447 329842 559726 259490 387059 301362 503900 123640
16414 246635 220066 299693 436382 320086 645049 366792 482106 227392 505430 -16963
16403 99048 296536 389903 216121 -37764 341932 474652 156506 168549 224941 310902 307704
$$ packed form
16477H01275j3651C58064J40687J28276K33672l73857J65951B32273J33769J27863
16467D93905k04390J15898l4265L72958k62169L54780j75613q3573k73858L1853
16457C35526J35051N2511k18668J70687J72949J90972C94164p3621J54815j84788
16447B90570N1800K48592J0333k1550A78201K37172N9346P986j62636J87624N6129
16436E63822j36017J32902k62112l3619L50055R8373k03396r7768L59516C44589
16425B84508j34226L36500k26335O9395K29884B59490J27569q5697K02538A23640
16414B46635k6569P9627J36689j16296L24963k78257J15314B27392K78038a6963
16403I9048J97488R3367j73782c7764C41932J32720A56506J2043N6392Q5961l198
$$ plain form
16392 307704 130305 239970 202485 492941 399043 334165 280333 482063 449528 376972 225291
16381 225291 40184 240311 240282 187087 53625 238596 155976 266314 -14298 236076 176447
16370 176447 298208 427608 524171 327280 333947 230749 350387 430793 158814 313711
16360 313711 341876 124431 458363 451990 91243 425019 161251 257177 180092 452168 265838
16349 265838 332887 212440 44947 422303 -127923 183955 303423 36388 258768 -104816
16338 187251 350684 151967 142080 535965 115643 12653 23271 274051 171546 178041 116461
16327 116461 159526 -249682 125241 289737 85252 -268997 81722 -35566 183077 393364
16317 393364 88008 -49699 234243 -16807 -227254 53414 213330 315050 -125883 198144
$$ packed form
16392C07704A30305J09665l7485K90456r3898o4878n3832K01730l2535p2556j51681
16381B25291D0184K00127k9n3195E3625J84971q2620J10338a4298B36076n9629
16370A76447J21761J29400R6563j96891O667j03198J19638Q0406A58814J54897
16360C13711K8165A24431L33932o373I1243L33776A61251R5926p7085K72076j86330
16349B65838O7049j20447D4947L77356a27923A83955J19468C6388K22380a04816
16338A87251J63433A51967r887L93885A15643A2653J0618K50780j02505O495o1580
16327A16461M3065b49682A25241J64496H5252b68997H1722c5566A83077K10287
16317C93364H8008d9699B34243a6807k10447E3414J59916J01720a25883A98144
$$ plain form
16306 138755 171153 81066 65326 -68635 90357 -265364 -60803 96945 158225 -25723 163786
16294 -76113 -254481 -125840 26283 83162 197929 326934 -140921 104402 -2064 111409
16283 53828 194265 136572 -30156 -147886 -147039 134092 -255767 -180337 231579 3513 142385
16272 142385 190061 133225 249176 44700 -149850 187969 -114329 110020 -127900 377519
16261 -111814 217425 109172 287989 144010 191497 -119989 -91747 -71307 -95155 -80 110917
16249 41813 198700 -17791 211985 21724 89307 -73810 112787 -63483 373159 -117608 -98718
16238 -98718 269440 234413 -129347 -20230 149356 332504 35788 263838 106290 -117774
16227 171261 -152302 390913 107793 -2570 -174881 236901 20837 -259488 225062 -167219
$$ packed form
16306A38755L2398H1066j5740f8635I0357b65364f0803I6945O1280b5723A63786
16294g6113j78368a25840B6283N6879J14767J29005a40921A04402b064A11409
16283E3828J40437n7693c0156j17730Q47A34092b55767P5430B31579C513J38872
16272A42385M7676n6836J15951D4700a49850A87969a14329A10020a27900C77519
16261a11814B17425j08253J78817j43979M7487a19989K8242K0440k3848h0A10917
16249D1813J56887a7791B11985B1724O7583g3810A12787f3483C73159a17608J8890
16238i8718B69440l5027a29347b0230A49356J83148C5788K28050A06290a17774
16227A71261a52302C90913A07793b570j72311B36901B0837b59488B25062a67219
$$ plain form
16216 151930 145476 2628 147888 124089 337170 -44266 195306 -190891 9366 -101774 93849
16204 250826 575265 -89383 -75542 87980 -137080 -25173 -83636 -359539 477931 -125939
16193 227628 38229 25112 265946 267644 -350051 -8520 421358 10369 -32766 -68553 -2082
16181 51540 222529 149595 64548 -10313 -201034 52093 -50564 -124226 -164470 -117127 -22436
16169 166650 -105919 -321950 -268 -411361 -148505 -8996 -382607 -191257 -291471 141029
16158 -44477 38208 246871 19422 153211 126751 -273239 46937 69250 -431203 -8253 -9035
16147 -9035 91459 -242351 -153204 10153 -143577 -101852 -184138 -43858 165944 -11285 -104344
16136 -104344 -448096 -156940 -81088 -38530 360834 -241875 -339463 -598613 295894 -96593
$$ packed form
16216A51930o454B628J45260k3799K13081d4266A95306a90891I366a01774I3849
16204B50826L24439h9383J3841H7980a37080b5173n8463k75903D77931a25939
16193B27628C8229j3117K40834J698c50051h520D21358A0369c2766l5787b082
16181E1540J70989p2934F4548a0313j90721E2093e0564p3662m0244M7343b2436
16169A66650a05919k16031b68m11093a48505h996l73611a91257j00214A41029
16158d4477C8208K08663A9422J33789k6460b73239D6937K2313d31203h253p82
16147i035I1459b42351Q9147A0153a43577M1725q2286d3858A65944a1285r3059
16136a04344l43752a56940P5852c8530C60834b41875r7588k59150B95894i6593
$$ plain form
16125 -85133 7164 -9696 120453 21496 199823 154043 147339 -280797 -74014 28897 129901
16114 129901 -23406 -95918 140620 -202516 12251 -11434 -242573 270194 208309 19218 348069
16103 348069 -56039 116796 58548 286098 -6630 12620 25618 245420 -17173 378703 98712
16091 -38120 250092 -268554 -217097 -209959 77178 -54648 -20486 -48810 155613 -75106 -483679
16080 -483679 97452 67384 46690 48597 -162129 -164099 -199882 151044 73469 138895 -145098
16068 52704 -25639 -70445 62543 -47737 -123021 -45303 285303 87647 -130083 -402968 -16657
16056 -49375 64072 37992 215698 58517 60649 -236115 -127943 226981 69434 -260966 -103578
16044 227244 -10430 80311 54250 40709 -53675 -337675 -209646 205377 133592 -74447 51752
$$ packed form
16125h5133G164i696A20453B1496J78327m5780o704b80797g4014B8897J01004
16114A29901b3406p2512A40620b02516A2251a1434k31139B70194o1885A9218L28851
16103C48069e6039A16796n8248K27550f630A2620J2998K19802a7173C78703I8712
16091c8120B50092b68554N1457P138G7178e4648b0486k8324A55613g5106m08573
16080d83679I7452l0068k0694J907a62129j970l5783A51044G3469O5426a45098
16068E2704b5639m4806F2543d7737p5284d5303B85303H7647a30083k72885a6657
16056d9375F4072k6080J77706E8517K132b36115J08172B26981F9434b60966a03578
16044B27244a0430H0311k6061j3541e3675k84000J28029B05377p1785g4447E1752
$$ plain form
16032 294192 26964 -231855 -120951 -48529 92472 -197774 -19412 188345 29414 202230
16022 202230 -172468 -150090 262205 -106630 -262101 -31040 148745 123566 5542 -109815
16011 945 58977 13631 -4317 -114841 -39540 -12764 120064 33904 -131815 58742 -37395 -236886
15999 -236886 -308130 -193633 -30042 -117487 245374 -196025 69773 33627 -181605 304427
15988 34156 -46977 194215 518354 137044 144454 285108 454221 264927 239386 302112 96731
15976 -3025 21414 40578 -184732 363446 -61302 76651 -117193 32096 63285 140795 151253
15965 151253 -253580 -148458 234505 -27710 156203 421854 167491 220829 240994 -72133
15954 -212284 -414947 -89211 -120225 -314869 1758 -163781 234616 -180123 86983 -319300
$$ packed form
16032B94192B6964b31855J10904d8529I2472a97774a9412A88345B9414J72816
16022B02230a72468K2378B62205a06630j55471c1040A48745k5179E542a09815
16011I45N8032A3631d317j10524c9540a2764A20064C3904a31815E8742c7395j99491
15999b36886p1244J14497c0042q7445B45374a96025F9773C3627a81605C04427
15988C4156d6977A94215L24139A37044P410J40654J69113j89294k5541O2726I6731
15976c025B1414J9164a84732C63446f1302G6651a17193C2096L1189P7510J0458
15965A51253b53580J05122B34505b7710A56203K65651A67491N3338K0165g2133
15954b12284k02663h9211l1014j94644A758a63781B34616a80123H6983c19300
$$ plain form
15943 103756 -25221 -42253 -238310 198897 89669 324929 -180434 29463 -24834 79256 -296795
15931 -57202 50597 -282087 -100729 -258914 -341729 302920 -438386 -83179 -236849 226098
15920 -111601 -54658 134696 -74380 93487 -183776 -140376 -172428 -341602 41670 -164657 147081
15908 -337451 -139926 -256978 43892 72832 -370733 -57842 -74095 115592 -243108 -235599 -234191
15897 -234191 -182885 -323279 -29078 229913 -10511 91791 -216029 223488 -206363 -6468 -260978
15886 -260978 -31999 101615 328922 -140345 -12730 4962 91757 -98565 -212262 -120982 -150183
15875 -150183 -20633 201722 -26810 -441683 64423 -29209 -317414 251925 19119 -96012 -186030
15864 -186030 56469 -105612 -298237 369118 -80970 144042 -263359 -71490 -288772 -51966
$$ packed form
15943A03756b5221j7032j96057A98897H9669K35260a80434B9463b4834G9256b96795
15931e7202E0597b82087a00729j58185q2815C02920d38386h3179j53670B26098
15920a11601e4658A34696g4380I3487a83776M3400l2052j69174D1670a64657A47081
15908c37451a39926j17052D3892K8940c70733e7842j6253A15592b43108P509J408
15897b34191N1306j40394b9078B29913a0511I1791b16029B23488b06363f468k54510
15886b60978c1999A01615K27307a40345a2730D962Q6795i8565j13697R1280k9201
15875a50183b0633B01722b6810m14873F4423b9209k88205B51925A9119i6012r0018
15864a86030E6469a05612j92625C69118h0970A44042b63359g1490k17282e1966
$$ plain form
15853 118580 48474 -146843 60914 134732 348652 -208515 -176116 -283646 28093 -281934
15842 -243012 -170979 -126414 -257167 82784 -78672 960 48560 -76449 -281364 -132821 -54472
15830 -161963 -292277 -18820 -121668 35982 2398 82 62904 187206 226989 -4635 -19670 -26600
15818 -26600 -203751 -367765 -159986 419724 298398 -163171 187638 -234019 -65007 -21549
15807 57643 61226 73145 -62655 225604 62538 -103053 -246252 70814 106388 207533 15019
15795 -157025 18627 -123021 -42916 20898 110028 -261534 -39301 -482356 -42765 -304689 -174803
15784 -174803 51371 239000 -143709 -187274 -154518 -799 -43659 7152 630 -77225 31824 56811
15772 56811 6355 -62423 84136 -218743 -15212 -83472 311188 16331 390575 168318 -134562
$$ packed form
15853A18580D8474a46843F0914P3818K13920b08515L2399j07530B8093b81934
15842b43012P2033M4565j30753H2784g8672I60M7600g6449k04915a32821e4472
15830a61963j30314a8820j02848C5982B398H2O2822J24302L9783d635j5035o930
15818b6600j77151j64014a59986D19724j21326a63171A87638b34019f5007b1549
15807E7643L583J1919f2655B25604F2538a03053j43199G0814L5574J01145A5019
15795a57025A8627a23021d2916B0898Q9130b61534c9301m43055d2765k61924J29886
15784a74803E1371J87629a43709m3565L2756g99m2860G152F30g7225C1824K4987
15772E6811F355f2423H4136b18743a5212o8260C11188A6331L74244A68318a34562
$$ plain form
15760 -40777 96690 42437 236547 217142 127909 156696 -34574 530591 33214 114259 56482
15748 45787 326813 -44509 -268763 122825 57109 -40064 -217478 -37132 98464 -355916 -149931
15736 -219367 155588 3667 186354 83259 -88201 198195 63667 114905 -164071 23245 -136914
15724 143432 -67466 -540331 -500278 -429392 31009 -48816 233154 38952 -172224 -137471 -34552
15712 99636 -35536 -105782 -56801 -149397 65970 -192123 188364 -20392 -31147 -193031 -4169
15700 -284607 -61884 263585 -356319 227730 -68592 383048 -197470 -25958 -218945 36540
15689 241856 225858 247288 -171176 37270 75593 97997 -232602 -11132 127780 -165491 86245
15677 -43256 133037 461 19302 17620 -80472 -190618 245597 -246449 186884 175875 -441304
$$ packed form
15760d0777I6690D2437J94110j9405q9233K8787c4574E30591C3214Q1045E6482
15748D5787K81026d4509k24254A22825E7109d0064j77414c7132I8464c55916a49931
15736b19367A55588C667J82687H3259h8201A98195F3667N1238a64071B3245a36914
15724A43432f7466m72865M0053P0886C1009d8816B33154C8952a72224L4753c4552
15712I9636c5536p0246M8981r2596F5970a92123A88364b0392j0755j61884d169
15700b84607f1884B63585c56319B27730f8592C83048a97470b5958j92987C6540
15689B41856j5998K1430a71176C7270L8323K2404b32602a1132A27780a65491H6245
15677d3256A33037D61J8841j682h0472j10146B45597b46449A86884j1009d41304
$$ plain form
15665 74677 -323136 -195042 -14204 -356608 -6566 -129703 -134636 1640 -259118 -166195 11671
15653 -277320 -393258 -247852 -20340 -202861 -153264 -47323 78811 -65964 217086 334041
15643 334041 -310256 -212106 160493 441 -8433 72999 126892 -153998 -157905 -258816 -37747
15631 67940 -112301 -126963 -300839 167877 -278211 106326 42243 171940 16871 -32032
15620 144938 -353635 -110660 -94741 -86842 -410637 -269318 -176578 148892 83884 -76692 112306
15608 164927 -22408 -145558 -341708 415679 -118301 176037 -294399 91940 -32582 71951
15597 -103346 -188134 -225676 -66848 -248987 136014 -185233 91829 -222418 154582 -162795
15586 126965 150575 -173105 -4301 126480 -128509 139277 136951 -90663 -27679 -184759 229745
$$ packed form
15665G4677c23136J28094a4204l42404f566j23137m933A640b59118R2923A1671
15653b77320j15938J45406b0340j82521M9597d7323G8811f5964B17086J16955
15643C34041c10256R8150A60493D41h433G2999N3893a53998l907j00911c7747
15631F7940a12301j4662j73876A67877b78211A06326D2243J29697A6871c2032
15620A44938c53635a10660J5919P899l23795J41319R2740A48892o5008g6692A12306
15608A64927b2408j23150j96150D15679a18301A76037b94399I1940c2582G1951
15597a03346q4788l7542f6848j82139A36014a85233I1829b22418A54582a62795
15586A26965K3610a73105d301A26480a28509A39277k326i0663b7679j57080B29745
$$ plain form
15574 -224622 -67502 4930 128587 144706 52334 -322462 246405 -104586 222373 212118 -120949
15562 97266 33561 296348 -272211 1610 -427304 116347 -13069 79938 -184782 55195 -165569
15550 -348268 54778 -73253 -405608 -161931 54419 270173 125267 66421 87931 -256504
15539 -32506 -81860 -139808 -185325 159981 -13100 -274283 270928 9676 78212 33613 -41029
15527 27575 69334 -142825 189956 -100752 60851 425765 64691 73381 207835 -379014 243313
15515 21714 -125899 282943 -245167 37784 -96272 28826 299731 -98117 -186482 256258 -348167
15503 147301 303511 234823 84528 -143486 -45515 -192799 -10771 225033 -135362 200652
15492 -60384 -125721 -79171 252316 227467 25322 206668 167796 -15849 -42475 98218 -67059
$$ packed form
15574b24622f7502D930J23657J6119E2334c22462B46405a04586B22373j0255a20949
15562I7266C3561K62787b72211A610d27304A16347a3069G9938a84782E5195a65569
15550c48268E4778g3253l32355a61931E4419K15754A25267n8846K1510b56504
15539c2506m9354n7948m5517A59981a3100k61183B70928I676O8536C3613d1029
15527B7575M1759a42825A89956a00752F0851L64914F4691Q690J34454c79014B43313
15515B1714a25899B82943b45167C7784i6272B8826K70905i8117q8365B56258c48167
15503A47301J56210o8688H4528a43486d5515j47284a0771B25033a35362B00652
15492f0384o5337M6550B52316k4849B5322J81346l8872a5849k6626I8218f7059
$$ plain form
15480 -412 317705 -198604 -174510 93882 200504 11025 186797 189670 200239 101950 -176099
15468 -42629 -97237 50217 35020 -191936 -87209 -121484 -300418 81673 -222654 -73295 39785
15456 239297 -72616 -52908 -158921 -24227 129893 -132050 -172692 167679 42069 -120324
15445 -14376 -250462 281248 240482 106097 -14241 -99033 102704 146971 -220294 -134550 -161699
15434 -161699 261893 -141886 -20970 -178760 -228991 163972 24125 111998 9966 -27653 185017
15422 70953 2931 -7771 37088 -11360 -122722 -78482 94854 -10361 -62228 34143 73181 44860
15410 44860 -51939 105913 84914 259562 -116101 58495 -112830 -35232 -181191 337274
15399 12762 -123339 190802 31325 -190642 38096 -66092 -270567 -145859 -182245 20909 -409807
$$ packed form
15480d12C17705a98604K4094I3882J06622A1025J75772K873J0569r8289a76099
15468d2629n4608E0217j5197a91936h7209l4275j78934H1673b22654g3295C9785
15456B39297g2616J9708j06013b4227A29893a32050m0642A67679D2069a20324
15445a4376k36086B81248m0766A06097a4241q4792A02704M4267b20294Q5744k7149
15434a61699B61893a41886b0970j57790n0231A63972B4125Q7873I966b7653A85017
15422G0953B931g771C7088a1360j11362M4240I4854a0361n1867C4143L9038k8321
15410D4860e1939A05913k0999J74648a16101E8495a12830c5232j45959C37274
15399A2762a23339A90802C1325a90642C8096f6092k04475J24708l6386B0909d09807
$$ plain form
15387 -104204 -40249 -60684 377794 147045 -80765 -257016 -283186 77883 218617 -293370
15376 -184760 81501 -55526 -227628 -112231 79603 -227567 180510 234787 -13014 -297188
15366 -297188 -18761 200290 178788 -159156 -97993 -235443 -2618 92938 21431 -85627 -248587
15355 -248587 46030 69432 -530341 17079 46317 -230955 -135959 149641 179705 -236494 -555109
15344 -555109 56378 -152483 -67111 -1116 -70617 -37592 -30245 248417 -16180 142342 -67774
15332 180242 56427 268219 10667 -109487 47572 -51053 -53110 -9416 12015 -32928 69083
15320 -296889 -257463 -20566 306114 151130 122527 -78843 -4 78628 123732 -142104 -32557 99323
15307 -356567 -134663 60343 -183955 -102342 65503 74376 56821 172705 -56390 -161977 211992
$$ packed form
15387a04204d0249k0435C77794A47045h0765j76251k6170G7883J40734b93370
15376a84760H1501e5526j72102a12231G9603b27567A80510N4277a3014k84174
15366b97188a8761B00290k1502a59156O1163j37450b618I2938B1431h5627j62960
15355b48587D6030K3402e30341A7079K9238b30955R4996A49641L0064b36494l18615
15344e55109E6378a52483f7111a116o9501L3025P347B48417a6180A42342f7774
15332A80242E6427K11792A0667a09487D7572e1053k057i416A2015c2928F9083
15320b96889L9426b0566C06114A51130k8603g8843dG8628M5104a42104c2557I9323
15307c56567a34663F0343a83955Q1613F5503Q873j7555J15884e6390j05587B11992
$$ plain form
15295 352619 -80613 183127 -259599 194397 15270 -326088 -73032 -287809 54686 397407
15285 397407 28603 318763 163058 75452 -268403 270854 426245 -97540 -132854 33884
15274 105596 -18025 -150768 91827 -130892 258116 134011 81672 -180805 298451 -25534
15263 263805 166870 173863 -221712 262133 -57567 156567 -59525 -10928 378922 240442 70736
15251 -10908 385081 261405 381208 888554 924081 1162889 1432840 1293055 1082575 969566
15241 969566 9978 324117 -80535 -102224 131350 11919 171896 -89395 81255 -209651 30662
15229 58319 -300051 -66989 14164 -65096 118488 24190 161181 -38785 3961 181151 7474
15217 -190764 -123513 429548 169963 -54111 133755 174278 -23145 75013 180859 41127 107484
$$ packed form
15295C52619h0613A83127b59599A94397A5270c26088g3032k14777E4686L42721
15285C97407B8603K90160j55705G5452b68403B70854J55391i7540l5314C3884
15274A05596a8025j32743I1827a30892B58116j24105n2339a80805B98451b5534
15263B63805r6935O993b21712B62133e7567A56567e9525a0928C78922j38480G0736
15251a0908C85081j23676J19803N07346L5527K38808K69951j39785k10480j13009
15241I69566I978L14139h0535k1689A31350A1919J59977h9395H1255b09651C0662
15229E8319c00051f6989A4164f5096A18488B4190J36991c8785C961J77190G474
15217a90764O7251D29548A69963e4111A33755M0523b3145G5013J05846D1127O6357
$$ plain form
15206 107484 -118384 30368 185517 -163768 -112586 81278 -84294 217435 -146977 30002
15195 -176321 -270296 -133283 -52156 45736 -126300 231496 53444 -218163 160000 38938
15184 98915 -19560 -36807 -263915 231961 285094 -102915 -8986 -155310 110228 260248 172030
15173 172030 153346 -31804 -12416 -38532 134222 -82617 -81326 52786 -92686 106791 -501134
15161 -44000 -77479 -151879 -197486 126526 -230067 386580 77658 -64418 103334 -128675 208377
15149 9990 -51595 280615 88406 27736 101896 -91339 -4479 -156588 -63999 -294177 -182351
15138 -182351 200820 161334 343848 402340 -225585 31331 492750 17070 128367 -108664
15127 -11158 -169210 129762 95463 -117856 55148 124877 263004 -63987 186619 -259268
$$ packed form
15206A07484a18384C0368J55149a63768N1182H1278h4294B17435a46977C0002
15195a76321r3975a33283e2156D5736a26300B31496E3444b18163A60000C8938
15184I8915a9560j7247k27108B31961N3133a02915h986j46324A10228J50020q8218
15173A72030j8684c1804a2416k6116A34222h2617J291E2786i2686A06791e01134
15161d4000l3479p4400m5607A26526b30067C86580G7658f4418A03334a28675B08377
15149I990e1595B80615H8406B7736P4160i1339d479j52109f3999k30178J11826
15138a82351B00820l9486J82514N8492b25585C1331M61419A7070J11297a08664
15127a1158j58052A29762l4299a17856E5148O9729J38127f3987A86619b59268
$$ plain form
15116 494768 153363 96573 505014 -62371 165960 -112303 44828 181284 92963 291168
15106 291168 57628 39906 -60260 213023 -33039 432790 169335 -18619 91981 103577 371477
15095 371477 206280 -86325 -36856 396335 210190 72457 -171548 -41700 122402 329933
15085 329933 187519 13098 277214 287813 66457 145747 394054 27278 180558 135700 221309
15074 221309 180756 345075 110144 -135392 2210 151373 189148 129800 116365 -84622 58950
15062 62568 -10595 97655 -17107 280432 220383 243477 557201 185908 -25390 -206725 40760
15050 543533 219146 405492 69970 -124395 -56579 245948 -30470 463957 99805 240721
15040 240721 125048 149611 312893 37869 298044 306045 444423 207991 200212 214742 360966
$$ packed form
15116D94768A53363n6790M08441f2371A65960a12303D4828J36456q8321J98205
15106B91168E7628j7722f0260B13023c3039D32790A69335a8619I1981J1596K67900
15095C71477j65197h6325c6856C96335j86145G2457a71548d1700A22402K07531
15085C29933j42414A3098K64116J0599F6457P9290K48307B7278J53280m4858Q5609
15074B21309m0553J64319A10144a35392B210J49163L7775n9348j3435h4622E8950
15062F2568a0595I7655a7107B80432o0049K3094L13724A85908b5390j81335D0760
15050E43533B19146J86346F9970a24395e6579B45948c0470D63957I9805J40916
15040B40721j15673K4563J63282C7869K60175Q001J38378B07991p779J4530J46224
$$ plain form
15029 360966 187095 177539 -155608 169501 190935 253475 16464 96510 -137414 31970 77325
15018 77325 144867 265556 175535 -112708 270076 324217 341102 541382 86755 81040 392174
15007 392174 276241 43363 316756 -50162 204108 54271 218973 306652 241528 104739
14996 163210 -89029 292332 255006 -3122 87165 4561 112892 159379 74942 254003 340611
14985 340611 95400 232858 94024 264772 -156064 399902 124815 6911 -93196 152281
14974 238177 347437 339939 320530 213645 -78789 342426 270695 -47517 177919 -171972 203780
14962 179039 52170 98164 307012 2441 56406 150123 304371 99992 340038 -29425 58470
14950 -176578 353908 188263 307220 299214 46250 269898 254698 309084 455336 182769
$$ packed form
15029C60966j73871r556a55608A69501K1434O2540A6464Q0046a37414C1970M5355
15018G7325O7542J20689r0021a12708B70076N4141J6885K00280H6755n715L11134
15007C92174j15933D3363K73393e0162B04108E4271J64702Q7679o5124A04739
14996A63210h9029B92332l7326c122H7165D561J08331M6487G4942J79061Q6608
14985C40611I5400J37458I4024J70748a56064C99902A24815F911i3196A52281
14974B38177J09260p498j9409j06885g8789C42426p1731d7517A77919a71972B03780
14962A79039E2170M5994K08848B441N3965R3717J54248I9992K40046b9425E8470
14950a76578C53908j65645J18957q006D6250K23648j5200N4386J46252A82769
$$ plain form
14939 290218 374594 389986 -15927 337951 120061 16128 180779 -31017 38912 214434 185156
14928 185156 370920 187881 372272 20429 178438 317418 -42532 295677 117393 168580
14918 168580 110071 24041 -193290 172418 179894 136210 436382 297781 236632 356298 310279
14907 310279 111011 489851 225542 345915 341311 452287 240749 287923 248947 -248242
14896 240042 89709 224570 308697 203987 189655 201988 392139 141260 93891 358008
14886 358008 102764 353541 320224 306864 435826 571765 102348 431538 83826 354301
14876 354301 156131 364570 345323 432500 225735 612545 103209 218331 176441 307578
14866 307578 714612 506094 684390 389309 469600 437846 727877 364112 315401 131030
$$ packed form
14939B90218Q4376J5392a5927C37951A20061A6128J64651c1017C8912J75522k9278
14928A85156J85764j83039J84391B0429J58009J38980d2532B95677A17393N1187
14918A68580n8509B4041a93290A72418P476m3684L00172j38601o1149J19666m6019
14907C10279A11011L78840B25542J20373m604J10976k11538M7174l8976b48242
14896B40042H9709J34861Q4127j04710j4332J2333J90151A41260m7369K64117
14886C58008A02764K50777l3317j3360J28962J35939A02348L29190H3826K70475
14876C54301A56131K08439j9247Q7177k06765L86810A03209J15122m1890J31137
14866C07578M07034k08518J78296k95081Q0291l1754K90031l63765m8711A31030
$$ plain form
14855 159705 418256 391049 512908 113510 437212 326765 294026 700767 598474 227805
14844 567201 142396 258382 447383 612105 447162 167775 367021 594345 538942 406608
14834 406608 415750 272124 564286 511695 432564 524037 318049 403013 419670 593317 403831
14823 403831 393392 674210 467001 306018 603572 180938 186670 288804 686923 466508
14813 466508 504200 579984 335735 211522 414309 521133 665945 399902 698403 291527
14802 490403 393247 623843 874331 236028 557912 569932 519504 542740 453735 476423 465861
14791 465861 219156 342051 606516 648098 631091 528142 389440 428072 722513 406226
14781 406226 483599 253813 648793 262250 418990 569002 285522 492462 648386 270062
$$ packed form
14855A59705K58551k7207J21859A13510L23702j10447l2739M06741j02293B27805
14844E67201A42396J15986J89001J64722j64943A67775J99246K27324n5403j32334
14834D06608R142j43626K92162n2591p9131R1473k05988Q4964J6657J73647j89486
14823D03831j0439K80818k07209j60983K97554A80938N732J02134L98119k20415
14813D66508L7692P5784k44249j24213K02787J06824J44812k66043K98501B91527
14802D90403r7156K30596K50488B36028L21884J2020n0428K3236q9005K2688j0562
14791D65861B19156J22895K64465M1582j7007j02949j38702L8632K94441l16287
14781D06226P7373k29786L94980B62250J56740J50012k83480K06940J55924B70062
$$ plain form
14770 581241 844498 273838 525443 592056 717089 471318 553865 430455 611095 632114
14760 632114 611243 656676 420810 539596 331849 726490 229725 593751 850143 288251
14749 394112 607494 728706 682749 809028 543261 843287 903225 428912 925150 504490
14739 504490 662443 694711 535432 788189 704320 471617 815545 641119 890575 507964
14729 507964 908087 504287 452213 658958 996420 843668 626744 840796 753967 763215
14719 763215 594855 797817 808099 827272 668792 702350 564861 501167 727982 842327
14709 842327 509769 437768 804432 905652 512198 763807 805060 656329 787415 794473
14699 794473 1117367 795852 607869 786008 947740 567204 747169 982429 804356 697222
$$ packed form
14770E81241K63257B73838K51605O6613J25033k45771Q2547j23410J80640K1019
14760F32114k0871M5433k35866J18786k07747L94641B29725L64026K56392B88251
14749C94112K13382J21212m5957J26279k65767L00026N9938D28912M96238m20660
14739E04490J57953L2268j59279K52757q3869k32703L43928j74426K49456l82611
14729E07964M00123m03800n2074K06745L37462j52752k16924K14052q6829R248
14719G63215j68360K02962J0282J9173j58480L3558j37489o3694K26815J14345
14709H42327l32558p2001L66664J01220l93454K51609M1253j48731J31086P058
14699G94473L22894l21515j87983J78139J61732l80536J79965K35260j78073j07134
$$ plain form
14689 697222 868752 1007755 802684 654532 921687 834222 986973 959329 561743 893723
14679 893723 627211 825717 826885 870303 1008516 796786 1084915 1027961 1245448 534509
14668 788979 531475 921703 917753 1050310 958729 909460 1090071 988889 862424 1167067
14658 1167067 1069082 926015 1146197 724414 1125521 1179047 1265837 880571 1212900 876863
14648 876863 1021841 747801 1312643 892232 938667 1065581 1263258 1118378 1035824 1113009
14638 1113009 918439 1435640 1248497 1279056 1209587 1167763 1010220 1181207 1201447 1305053
14628 1305053 1168160 1076454 1186420 1121085 1553843 1325493 1234758 1143874 910421 1563259
14618 1563259 1422301 880841 734274 1199882 1246590 1410654 1181419 1204328 1315132 1685585
$$ packed form
14689F97222J71530J39003k05071j48152K67155q7465J52751k7644l97586L31980
14679H93723k66512J98506J168M3418J38213k11730K88129n6954K17487E34509
14668G88979k57504L90228l950J32557r1581m9269J80611j01182j26465L04643
14658A167067r7985j43067K20182m21783M01107N3526Q6790l85266L32329l36037
14648H76863J44978k74040N64842m20411M6435J26914J97677j44880q2554P7185
14638A113009j94570N17201j87143L0559o9469m1824j57543J70987K0240J03606
14628A305053j36893r1706J09966o5335M32758k28350r0735r0884k33453O52838
14618A563259j40958n41460j46567M65608M6708J64064k29235K2909J10804L70453
$$ plain form
14608 1685585 1488652 1279401 1425510 1146311 1298813 1639184 1901051 1623325 1572503 1496021
14598 1496021 1446769 1546958 1789375 1624503 1535557 1473094 1402690 1820185 1648215 1238415
14588 1238415 1647301 1565571 1594138 1918018 1915373 1678362 1844943 1538647 1640337 1455448
14578 1455448 1322494 1970749 1732880 2040874 1754758 1988323 2215352 2253132 2272053 2113507
14568 2113507 1942145 2085886 2226480 2356988 2209760 2272231 2440826 2772153 2308823 2573818
14558 2573818 3043762 2858951 2912280 3283720 3531614 3825143 4298818 5948919 8042448
14549 8042448 11708021 16416388 22968835 28988897 34211230 17683595 8683589 5338616
14541 5338616 4087572 2016673 1970487 1614574 1650054 1503640 1717517 2159905 1753330
$$ packed form
14608A685585j96933k09251J46109k79199J52502L40371K61867k77726n0822p6482
14598A496021m9252J00189K42417j64872q8946o2463p0404M17495j71970m09800
14588A238415M08886q1730K8567L23880k645k37011J66581l06296J01690j84889
14578A455448j32954O48255k37869L07994k86116K33565K27029L7780J8921j58546
14568B113507j71362J43741J40594J30508j47228O2471J68595L31327m63330K64995
14558B573818M69944j84811N3329L71440K47894K93529M73675J650101K093529
14549H042448L665573M708367O552447O020062N222333j6527635H683589l344973
14541E338616j251044B016673m6186l55913L5480j46414K13877M42388m06575
$$ plain form
14532 1753330 1834714 1997431 1697454 2257983 2115513 1940819 2100783 2000434 2168566 2376090
14522 2376090 2494118 2376284 2381747 2390986 2227352 2373482 2511485 2367598 2280057 2660985
14512 2660985 2434355 2525762 2421774 2515638 2515622 2630706 2666947 2687763 2539273 2754596 2806854
14501 2806854 3064113 2800235 2977633 2998797 3082516 2969122 3013073 2895566 2850280 3315718
14491 3315718 3157794 3327979 3289880 3045934 3239421 3434086 3421707 3296516 3472487 3830779
14481 3830779 3482426 3462063 3756360 3438193 3690231 3785936 3629340 3707521 3706353 3687990
14471 3687990 4283800 3933828 4048859 4214955 4288372 4137701 4178785 4281514 4188386 4392539
14461 4392539 4303597 4328246 4412940 4722633 4607590 4784176 4601295 4760525 4949288 4842715
$$ packed form
14532A753330Q1384J62717k99977N60529j42470j74694J59964j00349J68132K07524
14522B376090J18028j17834N463R239j63634J46130J38003j43887q7541L80928
14512B660985k26630R1407j03988R3864j6J15084L6241K0816j48490K15323N2258
14501B806854K57259k63878J77398K1164Q3719j13394M3951j17507m5286M65438
14491C315718j57924J70185l8099k43946J93487J94665j2379j25191J75971L58292
14481C830779l48353k0363K94297l18167K52038R5705j56596P8181j168j8363
14471C687990N95810l49972J15031J66096P3417j50671M1084J02729r3128K04153
14461D392539q8942K4649Q4694L09693j15043J76586j82881J59230J88763j06573
$$ plain form
14451 4842715 4937495 5227216 5115979 5242379 5361580 5312637 5342927 5446321 5506676 5228319
14441 5228319 5521074 5766184 5798383 5852511 5787451 5991502 6133441 6146893 6337846 6101033
14431 6101033 6133452 6331216 6735038 6615648 7154894 7038960 6992501 7161904 7150661 7229229
14421 7229229 7015610 7624750 7511096 7429253 7539792 7740356 8135600 8285102 8296833 8284183
14411 8284183 8699095 8314806 8738147 8538605 9209341 9270440 9513501 9465260 9831975 10112925
14401 10112925 10105732 10159354 10043111 10628832 10227493 11018931 11097616 11336354 11378648 11267167
14391 11267167 11857912 11909448 12034836 12096526 12250424 12577720 12958394 13239956 13734614 13362913
14381 13362913 14083855 14350445 14369948 14629791 14928597 15317191 15686094 15882855 16102684
$$ packed form
14451D842715R4780K89721j11237J26400J19201m8943L0290J03394O0355k78357
14441E228319K92755K45110L2199N4128o5060K04051J41939J3452J90953k36813
14431F101033L2419J97764M03822j19390N39246j15934m6459J69403j1243P8568
14421G229229k13619O09140j13654q1843J10539K00564L95244J49502J1731j2650
14411H284183M14912l84289M23341j99542O70736O1099K43061m8241L66715K80950
14401A0112925p193N3622j16243N85721m01339P91438P8685K38738M2294j11481
14391A1267167N90745N1536J25388O1690J53898L27296L80674K81562M94658l71701
14381A3362913P20942K66590J9503K59843K98806L88594L68903J96761K19829
$$ plain form
14372 16102684 16451736 17049275 17250111 17580845 17863594 18363036 18701381 19316833 19604711
14363 19604711 19880525 20163858 21038522 21196455 21573339 22146998 22572190 23648743 23554256
14354 23554256 24493347 24865387 25153951 26377700 26807556 27350621 27926007 29084110 29607966
14345 29607966 30512678 31134285 31971541 33003576 33882300 34979092 35792099 36682326 37513835
14336 37513835 38495514 39895144 41238083 42364946 43684988 44895097 46226091 48125312
14328 48125312 49471252 51139911 52799759 54445086 56325659 58309208 60413526 62608945
14320 62608945 64841493 67112313 69476494 72108383 74818825 77899930 81149302 83979091
14312 83979091 87547775 91225443 94578340 98595110 103366821 107764559 112568282 117451553
$$ packed form
14372A6102684L49052N97539K00836L30734K82749M99442L38345O15452K87878
14363A9604711K75814K83333Q74664J57933L76884N73659M25192J076553r4487
14354B3554256R39091L72040K88564J223749M29856N43065N75386J158103N23856
14345B9607966R04712O21607Q37256J032035Q78724J096792Q13007Q90227Q31509
14336C7513835R81679J399630J342939J126863J320042J210109J330994J899221
14328D8125312J345940J668659J659848J645327J880573J983549K104318K195419
14320F2608945K232548K270820K364181K631889K710442L081105L249372K829789
14312H3979091L568684L677668L352897M016770M771711M397738M803723M883271
$$ plain form
14304 117451553 122761748 128262339 134366269 140428582 146889116 153866059 161170531 169118480
14296 169118480 177576539 186304459 195512183 205496252 215573377 226505664 238106857
14289 238106857 250029802 262902841 275885666 289367323 303571927 317767925 332664800
14282 332664800 347604524 362587116 377417262 391994477 406328264 419552534 430758062
14275 430758062 436719419 437088786 435768578 433784152 432383509 433905770 440738652 440410999
14267 440410999 435223444 428863789 417963145 405417264 392102473 377269583 362197039
14260 362197039 346141987 330258269 314552393 298738186 283923272 269376734 255360137
14253 255360137 242367983 230515746 218482911 206870729 196266751 186468113 177191288
$$ packed form
14304A17451553N310195N500591O103930O062313O460534O976943P304472P947949
14296A69118480Q458059Q727920R207724R984069J0077125J0932287J1601193
14289B38106857J1922945J2873039J2982825J3481657J4204604J4195998J4896875
14282C32664800J4939724J4982592J4830146J4577215J4333787J3224270J1205528
14275D30758062N961357L69367j320208j984426j400643J522261O832882l27653
14267D40410999n187555o359655j0900644j2545881j3314791j4832890j5072544
14260C62197039j6055052j5883718j5705876j5814207j4814914j4546538j4016597
14253B55360137j2992154j1852237j2032835j1612182j0603978r798638r276825
$$ plain form
14246 177191288 168113048 159615093 152072386 144963803 137888607 131497738 125310574 119519735
14238 119519735 114162125 109167331 104757621 100000667 95766658 91805424 87965470 84670405
14230 84670405 81438486 77883724 74855429 72046233 69208475 66575051 64119365 61710532
14222 61710532 59547086 58320382 55869882 53704150 52054114 50739227 48858512 47184380
14214 47184380 45962649 44662004 43388700 41763423 40568148 39500707 38327554 37664022
14206 37664022 36914889 35720644 34559570 33551940 32714442 31684197 31199163 30121216
14198 30121216 29276717 28706287 27790603 27362336 26530775 25836739 25285535 24256063 23776999
14189 23776999 23285606 22505951 22391304 22096065 21320025 20831974 20290447 19757006 19305829
$$ packed form
14246A77191288r078240q497955p542707p108583p075196o390869o187164n790839
14238A19519735n357610m994794m409710m756954m234009l961234l839954l295065
14230H4670405l231919l554762l028295k809196k837758k633424k455686k408833
14222F1710532k163446j226704k450500k165732j650036j314887j880715j674132
14214D7184380j221731j300645j273304j625277j195275j067441j173153o63532
14206C7664022p49133j194245j161074j007630q37498j030245m85034j077947
14198C0121216q44499n70430r15684m28267q31561o94036n51204j029472m79064
14189B3776999m91393p79655j14647k95239p76040m88051n41527n33441m51177
$$ plain form
14180 19305829 19248844 18602711 17996832 18008043 17693311 17155670 16880085 16483881 15951251 15705676
14170 15705676 15769200 15545597 15056636 14649263 14384636 14515074 13884304 13819548 13579422 13075699
14160 13075699 13137171 12717042 12726906 12350338 12125186 11915708 11989489 11763985 11364942 10875876
14150 10875876 10939888 10737619 10790409 10636403 10030249 10097831 9814105 9619659 9834797 9456396
14140 9456396 9221015 9192429 9070848 9176779 8866614 8806388 8582501 8480144 8451248 8337051
14130 8337051 8331482 7809247 7864787 8095465 7655886 7513128 7554742 7334319 7267908 7245284
14120 7245284 7275127 6992915 7198367 7108780 7046703 6522686 6537831 6538481 6627934 6240192 6265830
14109 6265830 6329507 6164487 6230337 5934730 6075966 5729114 5592750 6147618 5717932 5666786
$$ packed form
14180A9305829n6985o46133o05879J1211l14732n37641k75585l96204n32630k45575
14170A5705676O3524k23603m88961m07373k64627J30438o30770o4756k40126n03723
14160A3075699O1472m20129R864l76568k25152k09478P3781k25504l99043m89066
14150A0875876O4012k02269N2790j54006o06154O7582k83726j94446K15138l78401
14140I456396k35381k8586j21581J05931l10165o0226k23887j02357k8896j14197
14130H337051n569n22235N5540K30678m39579j42758M1614k20423o6411k2624
14120G245284K9843k82212K05452q9587o2077n24017J5145O50Q9453l87742K5638
14109F265830O3677j65020O5850k95607J41236l46852j36364N54868m29686n1146
$$ plain form
14099 5666786 5602451 5289885 5269507 5557842 5496621 4908957 5403035 5274466 5000653 5006797
14089 5006797 5031747 4955415 4976235 4679471 4563786 4732131 4811437 4785587 4720896 4654602 4480928
14078 4480928 4754577 4628531 4353707 4260382 3986300 4377412 4198712 4222345 4272850 3814448
14068 3814448 3995594 3769225 3904330 4000317 3697800 3790937 4211857 3839427 3726992 4199992
14058 4199992 3902375 3981216 3574169 3933531 3815679 3376701 3417479 3336970 3202165 3361226
14048 3361226 3298003 3192003 3209073 3084760 2997016 3394384 2990137 3212565 3122538 3047309
14038 3047309 3187043 3019624 2932067 2858002 3135315 3066277 3019055 3025158 2841943 2533529
14028 2533529 2896798 2662693 2573670 2585947 2509179 2906419 2377937 2716462 2577308 2627110
$$ packed form
14099E666786o4335l12566k0378K88335o1221n87664M94078j28569k73813O144
14089E006797K4950p6332K0820k96764j15685J68345P9306k5850o4691o6294j73674
14078D480928K73649j26046k74824r3325k74082L91112j78700K3633N0505m58402
14068C814448J81146k26369J35105R5987l02517R3137M20920l72430j12435M73000
14058D199992k97617P8841m07047L59362j17852m38978M0778q0509j34805J59061
14048C361226o3223j06000J7070j24313q7744L97368m04247K22428r0027p5229
14038C047309J39734j67419q7557p4065K77313o9038m7222O103j83215l08414
14028B533529L63269k34105q9023J2277p6768L97240n28482L38525j39154M9802
$$ plain form
14018 2627110 2548242 2250114 2630321 2271686 2360945 2418087 2362060 2424940 2124264 2570799
14008 2570799 2487113 2288973 2199613 2395145 1972244 2237252 2389850 2324846 2177657 2326413
13998 2326413 2213018 2123832 2356014 2355362 1974597 2254311 2485640 2987031 5001158 7612950
13988 7612950 12224159 18910776 25519673 35014099 22230395 11551269 6994820 4903716
13980 4903716 3997619 3533598 3153951 3144201 2732279 2508714 2487264 2316424 2596142 2192891
13970 2192891 2461482 2088869 2052028 2252479 2109828 1792584 2098369 1992627 1824344 2309199
13960 2309199 1887581 2026956 2135459 1692083 1981767 1841256 1765638 1883902 1740663 2012273
13950 2012273 1819476 1914774 1760590 1727805 1740197 1756639 2026306 1538806 1674675 1708877
$$ packed form
14018B627110p8868k98128L80207l58635Q9259N7142n6027O2880l00676M46535
14008B570799q3686j98140q9360J95532m22901K65008J52598o5004j47189J48756
13998B326413j13395q9186K32182o52l80765K79714K31329N01391K014127K611792
13988G612950M611209O686617O608897R494426j2783704j0679126m556449k091104
13980D903716r06097m64021l79647r750m11922k23565k1450j70840K79718m03251
13970B192891K68591l72613l6841K00451j42651l17244L05785j05742j68283M84855
13960B309199m21618J39375J08503m43376K89684j40511p5618J18264j43239K71610
13950B012273j92797R5298j54184l2785J2392J6442K69667m87500J35869L4202
$$ plain form
13940 1708877 1606584 1899553 1651975 1917863 1433287 1762287 1297552 1428246 1462959 1588871
13930 1588871 1543234 1578886 1409552 1418126 1344008 1493686 1566738 1693721 1731333 1359294 1885906
13919 1885906 1045558 1095333 1549636 1488097 1180750 1261714 1258085 1297119 1517874 1544412 1608176
13908 1608176 1377455 1243924 1301564 1431769 1293131 1416422 1297140 1084395 1275512 1057316
13898 1057316 1245250 1376062 1112110 840205 1143973 1208302 1235484 1660299 1259850 1217329
13888 1217329 1390409 1329256 1212569 1069455 889091 913383 1026549 1327407 1005041 870735
13878 870735 1088085 1267811 1037620 1053509 1063095 1151537 1118554 1013682 806333 1064018
13868 1064018 1052644 1179861 1208322 995065 1057232 1335555 1087393 1125613 748676 741538
$$ packed form
13940A708877j02293K92969k47578K65888m84576L29000m64735J30694L4713J25912
13930A588871m5637L5652j69334Q574p4118J49678P3052J26983L7612l72039N26612
13919A885906q40348M9775M54303o1539l07347Q0964l629L9034K20755K6538O3764
13908A608176k30721j33531N7640J30205j38638J23291j19282k12745J91117k18196
13898A057316J87934J30812k63952k71905L03768O4329K7182M24815m00449m2521
13888A217329J73080o1153j16687j43114j80364K4292J13166L00858l22366j34306
13878H70735K17350J79726k30191J5889R586Q8442l2983j04872k07349K57685
13868A064018j1374J27217K8461k13257O2167K78323k48162L8220l76937p138
$$ plain form
13858 741538 847079 903742 696121 1313896 960851 1086916 1011335 974160 1199475 1184850
13848 1184850 1399946 1185266 973017 1056905 827810 875583 685739 1117100 888117 804598
13838 804598 1083049 852487 954390 1185833 940401 1011806 875317 943971 994143 1105299
13828 1105299 1198214 904891 942168 885226 948220 1009064 794166 1087092 758590 660912
13818 660912 1030429 851998 764317 748725 804260 1018509 764338 668517 692492 699268 971304
13807 971304 983807 932052 660333 839490 800282 692710 854146 867092 650710 773643
13797 773643 688706 593465 541893 787064 683720 690702 380728 1075732 735554 491205
13787 491205 586024 665677 611301 500954 576108 565870 1134284 686986 805443 669571
$$ packed form
13858G41538J05541N6663k07621O17775l53045J26065p5581l7175K25315j4625
13848A184850K15096k14680k12249Q3888k29095M7773j89844M31361k28983q3519
13838H04598K78451k30562J01903K31443k45432P1405j36489O8654N0172J11156
13828A105299R2915k93323L7277n6942O2994O0844k14898K92926l28502r7678
13818F60912L69517j78431q7681j5592N5535K14249k54171r5821K3975O776K72036
13807I71304J2503n1755k71719J79157l9208j07572J61436J2946k16382J22933
13797G73643q4937r5241n1572K45171j03344O982l09974O95004l40178k44349
13787D91205R4819P9653n4376j10347P5154j0238N68414m47298J18457j35872
$$ plain form
13777 669571 874907 880196 605543 804534 754405 519446 627209 763269 397595 566068
13767 566068 362676 541292 497183 277351 491383 263250 657915 676367 824552 771235
13757 771235 569737 656881 723893 634980 679356 340372 550951 345107 658452 342304
13747 342304 806773 351607 615238 575618 718408 529322 824752 652809 808284 701827
13737 701827 593271 42422 613651 662254 517447 538957 325053 391448 491419 454668 824609
13726 824609 741840 641191 553189 737958 105768 414501 378381 627534 491359 669476
13716 669476 611416 478948 809953 438017 441032 691823 284455 273535 254318 849296
13706 849296 607805 278027 454872 330303 331183 524571 519419 517520 589953 270052 333267
$$ packed form
13777F69571K05336N289k74653J98991n0129k34959J07763J36060l65674J68473
13767E66068k03392J78616m4109k19832K14032k28133L94665J8452J48185n3317
13757G71235k01498Q7144O7012q8913M4376l38984K10579k05844L13345l16148
13747C42304M64469C51607K63631l9620J42790j89086K95430j71943J55475j06457
13737G01827j08556D2422N71229M8603j44807K1510k13904O6395R9971l6751L69941
13726H24609q2769j00649q8002J84769A05768L08733l6120K49153j36175J78117
13716F69476n8060j32468L31005l71936L015K50791B84455j0920j9217N94978
13706H49296k41491B78027J76845j24569Q80J93388n152j899P2433B70052O3215
$$ plain form
13695 333267 431106 607415 594135 641825 261776 534227 484569 678731 256114 602688
13685 602688 526955 499315 249234 491892 244019 583211 420012 251124 483159 500757
13675 500757 535450 651001 392768 481614 721476 330085 324671 568798 707273 506314
13665 506314 238853 283894 404353 298815 525274 528060 274022 221169 453532 269546
13655 269546 247918 490410 481954 340674 414948 147156 245657 424177 239692 306896 611189
13644 611189 368866 317045 349494 305693 654276 445038 666635 324309 596363 525930
13634 525930 288445 566331 465469 316468 324173 708610 292779 141816 375853 213474
13624 213474 -126851 561197 511980 171966 108322 569730 334586 399432 21822 351877
$$ packed form
13695C33267R7839J76309j3280M7690B61776K72451m9658J94162B56114L46574
13685F02688p5733k7640B49234K42658B44019L39192j63199j68888K32035J7598
13675E00757L4693J15551k58233Q8846K39862C30085n414K44127J38475k00959
13665E06314B38853M5041J20459j05538K26459K786k54038n2853K32363j83986
13655B69546k1628K42492q456j41280P4274A47156R8501J78520j84485O7204L04293
13644F11189k42323n1821L2449m3801L48583k09238K21597C24309K72054p0433
13634E25930k37485K77886j00862j49001P705L84437B92779A41816K34037j62379
13624B13474a26851E61197m9217A71966o3644M61408k35144O4846B1822L30055
$$ plain form
13614 351877 208090 680356 214487 516938 569074 180002 329371 353368 551323 511060
13604 511060 379314 475067 163396 517190 375016 236138 534900 388878 176892 270681
13594 270681 207503 302563 520929 524198 38903 260825 -4082 258169 405396 425273 425822
13583 425822 545975 430846 288782 272601 243224 404287 295593 311366 415275 137498
13572 263336 495116 317460 155384 363663 -19389 275869 207575 -30685 -50772 481503
13561 264787 254835 124022 375344 372165 416115 308752 257871 261195 557053 627785 239030
13549 353917 282013 282201 65441 452398 148387 321192 213673 132963 438355 -72004 264201
13537 246545 278002 379528 393543 174894 149021 73154 55081 279282 416370 294259
$$ packed form
13614C51877j43787M72266B14487L02451N2136A80002J49369K3997J97955m0263
13604E11060j31746R5753A63396L53794j42174j38878K98762j46022A76892R3789
13594B70681o3178R5060K18366L269C8903K21922d082B58169J47227J9877N49
13583D25822J20153j15129j42064j6181k9377J61063j08694J5773J03909A37498
13572B63336K31780j77656A55384K08279a9389B75869o8294c0685k0087D81503
13561B64787r952A24022K51322l179M3950j07363n0881L324K95858P0732B39030
13549C53917p1904J88F5441L86957A48387J72805j07519q0710L05392g2004B64201
13537B46545L1457J01526J4015A74894k5873G3154j8073K24201J37088j22111
$$ plain form
13527 294259 211401 281909 86747 275182 69233 -192323 401728 169198 174265 -4527 249216
13515 374555 572212 395961 391942 435903 236316 570379 133482 278419 104527 440535
13505 440535 -255456 340907 540913 221453 123971 184278 81285 110431 119529 279367 417801
13494 417801 -117616 491363 301032 146871 98470 307655 388110 505613 198627 -43541
13483 39043 536046 210745 8386 67216 6696 339630 126272 193558 225967 41658 420079
13472 420079 262756 199478 21904 490059 218798 406038 227051 166559 492840 306637
13462 306637 321314 106022 276996 331114 353151 397681 201108 -25950 35149 376741 144375
13450 110525 -62214 131780 289356 420413 164731 276099 -4448 540880 521654 597128
$$ packed form
13527B94259q2858P0508H6747J88435F9233a92323D01728A69198N067d527B49216
13515C74555J97657j76251m019M3961j99587L34063A33482J44937A04527L36008
13505D40535b55456C40907K00006B21453r7482O0307H1285K9146R098J59838J38434
13494D17801a17616D91363j90331A46871m8401K09185Q0455J17503A98627d3541
13483C9043M97003B10745H386N8830F696L32934A26272O7286L2409D1658L78421
13472D20079j57323o3278B1904M68155B18798J87240j78987o0492L26281j86203
13462C06637J4677A06022J70974N4118K2037M4530j96573b5950C5149L41592A44375
13450A10525f2214A31780J57576J31057A64731J11368d448E40880j9226P5474
$$ plain form
13440 597128 481757 176305 151262 475697 24794 42941 310936 497682 -1289 -84392 133460
13428 264609 -145396 22046 219504 382077 146459 241824 -9809 325441 428209 234902
13418 234902 468343 47973 15956 -57918 87829 135755 -29383 138205 422593 380641 187312
13406 378430 -126634 247934 -5932 456238 291956 276980 52251 -93716 -124822 139607 -202397
13394 372073 303077 437835 160898 -42398 231824 156597 24963 19537 184825 -110054 113688
13382 235844 166284 132758 267096 91651 298352 218891 68072 255422 193078 396067 525456
13371 525456 169940 187541 70599 -101329 236177 114214 400139 63346 111643 341593
13361 341593 231615 177505 344014 161643 -27048 -321474 626957 184474 271770 72385
$$ packed form
13440E97128j15371A76305k5043L24435B4794J8147K67995J86746a289q3103A33460
13428B64609a45396B2046J97458J62573A46459R5365i809C25441J02768j93307
13418B34902K33441D7973A5956e7918H7829M7926b9383A38205K84388m1952A87312
13406C78430a26634B47934e932D56238j64282j4976E2251i3716l1106A39607b02397
13394C72073o8996J34758A60898d2398B31824p5227B4963n426J65288a10054A13688
13382B35844o9560l3526J34338I1651K06701p9461F8072J87350o2344K02989J29389
13371E25456A69940J7601G0599a01329B36177A14214K85925F3346M8297K29950
13361C41593j09978n4110J66509A61643b7048k94426F26957A84474Q7296G2385
$$ plain form
13350 23317 20108 163623 73637 217905 202896 476206 297883 142967 600264 -63305 143187
13338 203467 546462 566071 435707 151574 138196 116340 90329 66390 223784 160281 -68407
13326 94646 389219 -83368 -35331 186886 44361 110464 285446 137300 307039 399643 99496
13314 530252 206611 350445 -65684 72257 54281 581771 57915 241989 60777 133454 194578
13303 194578 350418 -236455 542937 137878 147279 476219 177758 175916 38109 -172455
13292 -222653 232582 633845 -60160 234660 53254 126388 228217 73369 144625 143385 -142625
13280 145073 93824 -102984 552028 -47931 -102158 -166336 233910 -19782 292963 -181345
13269 11574 -55276 282302 -48255 174334 -70057 13300 -93571 6274 -212565 291596 188578
$$ packed form
13350B3317l209J43515G3637J44268j5009K73310j78323A42967M57297f3305A43187
13338B03467L42995J9609j30364A51574j3378k1856k6011k3939J57394o3503f8407
13326I4646K94573h3368c5331A86886D4361O6103J74982A37300J69739R2604I9496
13314E30252B06611J43834f5684G2257j7976N27490E7915J84074F0777P2677O1124
13303A94578J55840b36455E42937A37878R401L28940A77758j842C8109a72455
13292b22653B32582M01263f0160B34660E3254P3134J01829G3369P1256j240a42625
13280A45073n1249a02984E52028d7931n4227o4178B33910a9782B92963a81345
13269A1574e5276B82302d8255A74334g0057A3300i3571F274b12565B91596j03018
$$ plain form
13258 188578 70157 -199371 49256 403519 191714 -149914 237402 106214 -178869 -24913
13247 218192 152599 264321 214275 313934 66972 446503 460671 -156535 107144 277188
13237 277188 202397 335431 35195 332159 -147065 -189090 203271 179505 -46378 -5217 131047
13225 -29917 -65466 -109204 284753 181517 88469 -121540 173467 49784 -108131 100646
13214 -103619 23754 53014 301177 29242 9147 -64972 -27645 -101512 -111860 280521 292766
13203 292766 114610 377190 331410 524771 452949 218337 49395 198075 253955 273546
13193 273546 202193 250589 79566 71670 -110809 -120324 409260 200035 80146 160432 297028
13182 297028 219922 121556 -102226 -231462 89116 109617 53418 180616 131885 105974 -216806
$$ packed form
13258A88578G0157a99371D9256L54263A91714a49914B37402A06214a78869b4913
13247B18192o5593J11722n0046R9659F6972L79531J4168a56535A07144J70044
13237B77188p4791J33034C5195K96964a47065m2025B03271k3766d6378e217A31047
13225b9917l5549m3738B84753j03236H8469a21540A73467D9784a08131A00646
13214a03619B3754K9260K48163B9242I147f4972b7645p3867j0348B80521J2245
13203B92766A14610K62580m5780J93361p1822B18337D9395J48680N5880J9591
13193B73546p1353M8396G9566p896a10809r515D09260B00035H0146Q0286J36596
13182B97028p7106r8366a02226j29236H9116K0501E3418J27198m8731k5911b16806
$$ plain form
13170 65586 98410 143135 124434 -26196 -113187 176367 -90618 227437 -31964 211124 130754
13159 130754 209078 -70669 -175828 -64162 327609 -152218 83244 -139493 242245 81428
13148 61638 140571 -14083 -75638 225656 99733 125894 31244 315914 209631 236079 55828
13136 -31029 290499 95698 36360 -331700 -166991 134444 193969 211247 237549 -121418 -220805
13125 -220805 -70086 -40586 -196772 -58947 -68777 179316 219677 361523 31144 -186744 162066
13113 356014 42379 -253568 405977 84793 125584 217942 231168 -57117 16230 -23114 -236342
13102 -236342 141143 -204973 285965 -274387 418523 64930 -133713 171434 -38156 -149253
13092 -149253 -199561 197400 340975 -186819 -11135 34928 144924 -300249 283648 186998
$$ packed form
13170F5586L2824M4725j8701b6196q6991A76367i0618B27437c1964B11124q0370
13159A30754P8324g0669j05159f4162C27609a52218H3244a39493B42245H1428
13148F1638P8933a4083o1555B25656I9733K6161C1244K84670j06283K6448E5828
13136c1029B90499I5698C6360c31700J64709A34444N9525J7278K6302a21418r9387
13125b20805g0086K9500j56186e8947r830A79316M0361J41846C1144a86744A62066
13113C56014D2379b53568D05977H4793M0791R2358J3226e7117A6230b3114k13228
13102b36342A41143b04973B85965b74387D18523F4930a33713A71434c8156j11097
13092a49253n0308A97400J43575a86819a1135C4928J09996c00249B83648r6650
$$ plain form
13082 186998 -28811 -94257 -113460 278688 267016 325743 65585 -89046 -268691 119435 53465
13070 16687 102778 293384 240169 -105322 62512 72099 91080 131252 -189717 77541 165793
13059 165793 326737 -154258 145194 85934 193977 319724 175327 -239540 -61181 216790
13048 -107782 266582 -25024 271643 27317 366961 103960 -19920 50835 -17696 164490
13037 147546 217773 -54883 114868 166402 165288 -83180 340677 96492 170595 -140991 -282688
13026 -282688 6308 103045 299619 178766 116908 335785 -269336 326739 196549 -145954
13015 367353 175577 -348509 120516 288062 274418 97809 107187 168384 361453 202521
13005 202521 295238 87639 266687 52011 19585 -124309 34732 38527 -282819 395021 -8294
$$ packed form
13082A86998b8811o5446j9203B78688j1672N8727F5585h9046j79645A19435E3465
13070A6687Q6091J90606n3215a05322F2512R587J8981M0172a89717G7541Q8252
13059A65793J60944a54258A45194n9260J08043J25747j44397b39540f1181B16790
13048a07782B66582b5024B71643B7317L39644A03960a9920E0835a7696A64490
13037A47546P0227e4883A14868N1534j114h3180C40677I6492P4103a40991j41697
13026b82688F308R6737J96574j20853o1858K18877b69336C26739j30190a45954
13015C67353A75577c48509A20516J67546j3644I7809R378O1197J93069j58932
13005B02521R2717H7639J79048E2011A9585a24309C4732L795b82819C95021h294
$$ plain form
12993 151827 -152362 -27737 154769 22771 82957 251820 368227 -135277 -62447 -367612
12983 -367612 138004 -79513 178055 -105325 -68094 -99319 215837 -107809 183965 47670
12972 -83881 -320034 6857 330886 206691 503264 161511 237876 78307 -8862 -137719 20433
12960 -221472 -313009 125112 76510 325422 143184 -102081 -84004 -108700 319499 -18401
12949 286572 338714 -4680 100372 193571 136478 98638 -95534 62400 121979 -131129 -12870
12937 53425 -80781 2877 291340 165577 -140684 -226944 -61944 114940 69433 228853 23394
12925 -44501 54788 166292 234190 -109149 290888 317698 -50750 173838 -28451 181662 175169
12914 175169 -395477 320180 322406 6855 393357 11872 -56852 -281264 -53539 212937 87179
$$ packed form
12993A51827a52362b7737A54769B2771O0186J68863J16407a35277f2447l05165
12983c67612A38004g9513A78055a05325L7231l1225B15837a07809A83965D7670
12972h3881k36153F857L24029j24195K96573A61511P6365G8307h862j28857B0433
12960b21472r1537A25112m8602K48912A43184a02081J8077k4696C19499a8401
12949B86572N2142d680A00372R3199n7093l7840i5534F2400N9579a31129a2870
12937E3425h0781B877K88463j25763a40684q6260f1944A14940m5507J59420B3394
12925d4501E4788J11504O7898a09149B90888K6810e0750A73838b8451A81662o493
12914A75169c95477C20180K226F855L86502A1872e6852k24412e3539B12937H7179
$$ plain form
12902 -85839 -164730 -86847 -108476 168863 251834 18401 -110250 -61765 -117577 -63629 -153357
12891 -153357 -92642 -55770 -348228 61592 17504 408772 -18130 -45525 225234 76234 5463
12879 155761 -80009 -8192 -126833 54503 -178817 153927 -168636 245592 150247 -43662 157106
12867 -134685 141331 -62985 154923 173210 -386480 -37075 305822 -10079 58926 5074 -203766
12855 304618 14298 316086 -17140 -265137 294917 -125060 -351351 13275 382875 77345
12844 68668 120683 320831 -103389 114145 -198013 190064 47430 64354 130136 -229304
12833 -4803 227079 -355156 114957 -83321 224788 -88373 71402 -93224 -98586 -118913 234586
12821 -266942 133512 -112112 52771 -152855 254292 -220234 137680 -49962 -148007 97098
$$ packed form
12902h5839p8891P7883k1629A68863Q2971A8401a10250M8485n5812N3948q9728
12891a53357O0715L6872k92458F1592A7504L91268a8130k7395B25234G6234E463
12879A55761h0009h192j18641E4503a78817A53927a68636B45592r5345d3662A57106
12867a34685A41331f2985A54923J8287c86480c7075C05822a0079E8926E074b03766
12855C04618A4298L01788a7140k47997B94917a25060k26291A3275L69600G7345
12844F8668N2015K00148a03389A14145a98013A90064D7430J6924O5782b29304
12833d803B27079c55156A14957h3321B24788h8373G1402i3224n362k0327B34586
12821b66942A33512a12112E2771a52855B54292b20234A37680d9962r8045I7098
$$ plain form
12810 -379268 204104 21642 155904 6774 -67539 -28621 39004 320411 53152 153336 -101036
12798 -165136 -105267 -130621 83954 347105 -118114 113883 -5638 88871 228915 115190 192362
12787 192362 28811 340586 84503 214776 151285 -23662 -104692 128141 6654 150030 89231
12776 89231 222334 120346 2610 176089 357447 24607 135777 217264 97685 33360 -48332
12764 -205356 -115396 118730 59906 330836 -63442 -224211 69892 42591 182903 197905 486677
12753 486677 412045 390042 -522131 -33190 211645 -42057 372585 304525 -66171 -300621 54581
12741 -102196 -28660 139038 162629 -47680 129506 119841 119489 -125777 23932 4759 184400
12730 184400 -67936 -155736 -137686 91630 -68610 -255787 -8508 178675 319580 69250 238094
$$ packed form
12810c79268B04104B1642J34262F774f7539b8621C9004K81407E3152J00184a01036
12798a65136N9869k5354H3954K63151a18114A13883e638H8871J40044j13725P7172
12787A92362B8811L11775H4503J30273o3491b3662q1030A28141F654J43376o0799
12776H9231J33103j01988B610J73479J81358B4607J11170Q1487I7685C3360d8332
12764b05356Q9960A18730n8824K70930f3442j60769F9892k7301J40312J5002K88772
12753D86677p4632k2003e22131c3190B11645d2057C72585o8060f6171k34450E4581
12741a02196b8660A39038K3591d7680A29506r665l52a25777B3932D759J79641
12730A84400f7936q7800J8050I1630f8610j87177h508A78675J40905F9250J68844
$$ plain form
12719 238094 140417 44665 300984 8449 173250 85005 -60326 143632 282341 109081 200415
12708 200415 269508 119964 514339 42210 168198 277270 259077 132594 -47940 -240193
12698 -240193 68 272188 -174458 174429 232486 160517 122818 35103 131780 -116681 60686
12686 67569 159349 -153485 297422 436607 36650 41144 124474 479265 197406 283324 -1758
12674 -58695 504520 -45175 35177 6012 140001 -188179 212480 -130417 129488 408029
12664 408029 142857 -199647 -38970 219791 201203 17106 275017 358172 -92773 34930 60575
12653 60575 269668 318516 60517 267251 -66968 306466 -151616 23031 371769 127176
12642 -120461 51947 -201651 16833 122295 188812 123877 -253584 -220746 28610 54180 114687
$$ packed form
12719B38094r7677D4665K56319H449J64801H5005f0326A43632J38709A09081R1334
12708B00415O9093A19964L94375D2210J25988J09072j8193j26483d7940j92253
12698b40193F8K72120a74458A74429N8057p1969l7699C5103R6677a16681F0686
12686F7569R1780a53485B97422J39185C6650M494Q3330L54791A97406Q5918a758
12674e8695E04520d5175C5177F012J33989a88179B12480a30417A29488K78541
12664D08029A42857a99647c8970B19791j8588A7106K57911Q3155i2773C4930K5645
12653F0575K09093M8848F0517K06734f6968C06466a51616B3031L48738A27176
12642a20461E1947b01651A6833J05462O6517o4935b53584L2838B8610K5570O0507
$$ plain form
12631 114687 112272 74626 416008 97898 298059 10466 -31193 -3533 50094 383507 304421
12620 304421 -122108 221342 -127550 327869 154700 293902 -40826 -58760 471719 -179058
12609 233466 -98272 -72161 -117466 112421 52025 -21217 415010 129976 315382 142 -62226
12597 -28526 -88253 -10357 255728 132355 -333249 195325 158414 136606 181893 177853 14841
12585 148843 -77650 -105974 -261618 -67867 32878 448102 255588 75515 -92331 2826 -113708
12573 76805 -108546 -8555 -184908 -108431 209307 -106676 2597 305892 -139266 -65997 20869
12561 127998 51944 25331 192607 230085 247151 134637 13080 107644 114832 105634 17370
12549 16999 140346 -64062 43160 -263108 -136201 246392 -206794 145267 -113228 405953
$$ packed form
12631A14687k415l7646L41382I7898K00161A0466c1193c533E0094L33413p9086
12620C04421a22108B21342a27550C27869A54700J39202d0826j7934D71719a79058
12609B33466i8272K6111m5305A12421E2025b1217D15010A29976J85406A42f2226
12597b8526n9727a0357B55728j23373c33249A95325l6911k1808M5287m040A4841
12585A48843g7650k8324j55644f7867C2878M15224j92514G5515i2331B826a13708
12573G6805a08546h555j76353P6477B09307a06676B597L03295a39266f5997B0869
12561A27998E1944B5331J67276L7478J7066j12514A3080R4564P188r198A7370
12549A6999J23347f4062D3160b63108J26907B46392b06794A45267a13228D05953
$$ plain form
12538 60281 5365 187379 -259880 -221427 126316 -31968 77416 -152453 494369 108939 -120535
12526 1711 360361 24983 -105610 -118153 -195805 -927 60589 -138212 -21151 -114167 -190367 145866
12513 -161321 -35583 -117201 209249 -61019 -182344 -175902 105863 22923 -264176 -101896 144402
12501 -12955 -205445 187338 -47396 -34164 34742 46235 272790 17707 -58051 367474 49027
12489 -83988 -73822 46058 -109868 -18780 346536 -27714 -166725 -128426 -153345 -331406 263292
12477 100122 -58197 218546 -18288 121005 -90087 15551 -29052 158080 -197518 -72289 -176807
12466 -176807 -312431 -190577 -80903 -87464 31613 149917 263559 -61905 -374149 -1856 207249
12454 154012 87346 -96611 -181291 275251 -296020 114212 2219 8958 -249585 -34602 -54002
$$ packed form
12538F0281E365J82014b59880L8453A26316c1968G7416a52453D94369A08939a20535
12526A711L58650B4983a05610j2543p7652i27F0589a38212b1151r3016p6200A45866
12513a61321c5583q1618B09249f1019j21325O442A05863B2923b64176a01896A44402
12501a2955j92490A87338d7396J3232C4742J1493K26555A7707e8051C67474D9027
12489h3988J0166D6058a09868a8780C46536b7714j39011L8299k4919j78061B63292
12477A00122e8197B18546a8288A21005i0087A5551b9052A58080a97518g2289j04518
12466a76807j35624J21854h0903o561C1613J18304J13642f1905l12244a856B07249
12454A54012o6666i6611q4680B75251b96020A14212B219O739b49585c4602j9400
$$ plain form
12443 -54002 241404 59746 287373 -275964 -19118 148337 -71988 -272416 -141098 29242
12432 294286 -58644 196917 -9494 86385 -111371 -83276 -105914 125392 9207 140956 29643
12420 246785 -164203 69582 -14167 -27477 7806 -158579 -29307 -93231 118615 20860 -428361
12408 -52786 -9816 -232276 -40394 -67313 241477 234492 89878 -101504 -279191 -161917 119420
12396 63653 -205873 287482 -88369 -137645 -199092 33766 -133693 32775 -56837 -300519 -21029
12384 -61998 25413 -43750 -43529 -124858 247974 27465 -254276 15452 -61053 123110 2141 193495
12372 193495 270016 120178 -40524 49686 -157869 273653 180221 -6775 -256389 45320 127761
12361 127761 5914 140284 -207681 24920 45111 -7491 -364572 105759 -219175 -296974 -24816
$$ packed form
12443e4002B41404E9746K27627b75964a9118A48337g1988k00428J31318B9242
12432B94286e8644A96917i494H6385a11371K8095k2638A25392I207J31749B9643
12420B46785a64203F9582a4167j3310G806a58579b9307o3924A18615B0860d28361
12408e2786i816k22460d0394k6919B41477o985H9878a01504j77687J17274A19420
12396F3653b05873B87482h8369m9276o1447C3766a33693C2775e6837k43682b1029
12384f1998B5413d3750K21q1329B47974B7465b54276A5452f1053A23110B141J91354
12372A93495P6521A20178d0524D9686a57869B73653r3432f775k49614D5320Q2441
12361A27761E914J34370b07681B4920K0191g491l57081A05759b19175p7799b4816
$$ plain form
12349 -13477 49301 22460 156944 -39922 196128 100056 187277 141363 156168 -225741 334981
12337 -27408 73253 119132 172224 -174495 -177045 215262 148076 156036 119452 41845 94460 110057
12325 110057 -109272 -141233 -52732 -107956 132118 -333239 27555 33713 263194 -196298 195396
12313 293033 -232843 -47248 30075 265763 182434 -199230 -175900 -58489 -174385 -268230 216753
12301 -66745 -74306 213421 -20696 -145696 240933 -48570 -219443 -37698 -259696 203620 249106
12290 249106 -26437 192715 -8690 127457 48084 51063 -147173 99985 134644 161984 79401
12278 189970 32950 304921 -5682 407618 482998 -100581 123143 35695 58530 -53310 61261
12266 234770 254116 25534 114619 164556 171628 123968 138743 155218 18051 423698 59596
$$ packed form
12349a3477D9301B2460J34484c9922A96128r6072Q7221m5914J4805b25741C34981
12337b7408G3253M5879N3092a74495k550B15262o7186P960l6584D1845N2615J5597
12325A10057a09272l1961e2732n5224A32118c33239B7555O158K29481a96298A95396
12313B93033b32843d7248C0075K35688q3329a99230K3330e8489j15896r3845B16753
12301f6745p561B13421b0696j25000B40933d8570j70873c7698k21998B03620M5486
12290B49106b6437A92715h690A27457D8084K979a47173I9985L4659K7340G9401
12278A89970C2950K71971e682D07618P5380a00581A23143C5695K2835e3310F1261
12266B34770J9346B5534Q9085M9937P072m7660J4775J6475A8051M05647E9596
$$ plain form
12254 162075 275437 -38996 8555 394529 111026 -14109 257516 332007 360074 35917 11955
12242 13076 -15487 -391785 -453635 15454 144268 134855 51043 282867 188493 315411 17090
12230 363697 675905 363309 228803 353169 172459 485882 443758 223544 393085 206513
12220 206513 236883 73945 -13113 -52219 62128 166582 -86386 202856 183894 199665 86318
12208 89562 253786 105043 275934 -35209 79419 274100 148355 180364 -144301 133892
12197 183331 22023 338394 25452 117602 42264 127516 431810 -94238 -102794 152638 258623
12186 258623 144501 48173 -92808 699929 -65595 160696 139784 238145 150366 -171193 166717
12174 106521 14053 134924 -167657 -20202 204766 30106 161117 120283 -52594 142796
$$ packed form
12254A62075J13362c8996H555L85974A11026a4109B57516P4491K8067C5917A1955
12242A3076a5487l76298o1850A5454J28814r413E1043K31824r4374J26918A7090
12230C63697L12208l12596j34506J24366A72459L13423m2124k20214J69541j86572
12220B06513L0370G3945a3113l9106F2128J04454h6386B02856j8962J5771H6318
12208H9562J64224A05043J70891c5209G9419J94681j25745L2009a44301A33892
12197A83331B2023L16371B5452R2150D2264Q5252L04294i4238q556A52638J05985
12186B58623j14122D8173i2808F99929f5595A60696k0912R8361q7779a71193A66717
12174A06521A4053J20871a67657b0202B04766C0106J31011m0834e2594A42796
$$ plain form
12163 89516 2719 3406 105733 168813 349672 171236 67198 -239850 63553 255544 -72884
12151 341690 39099 207863 150126 101108 -110541 134076 296289 136287 72971 58015
12141 58015 -84806 249943 432003 363418 -63984 361989 -28161 -40012 34818 46174 -12983
12129 145119 79626 -252986 -233925 234610 -81901 51596 -36114 147070 -5060 289243 162923
12118 162923 -10224 -162673 -89888 9923 -142670 -9722 -50099 87152 -141868 161037 268763
12107 268763 60948 -67039 45318 52215 -335606 -61037 183909 -26556 135756 -125220 -122367
12096 -122367 143323 -84158 -27645 371453 -86247 -67658 -441312 -28188 89441 189697 50590
12084 -139697 23413 -37471 -25221 74675 22838 193123 418651 768063 1215237 1208173 764247
$$ packed form
12163H9516B719O87J02327O3080J80859A71236F7198b39850F3553J91991g2884
12151C41690C9099J68764n7737m9018a10541A34076J62213A36287o3316j4956
12141E8015h4806B49943J82060o8585f3984C61989b8161j1851C4818J1356a2983
12129A45119o5493b52986J9061B34610h1901E1596c6114A47070e060B89243j26320
12118A62923a0224j52449P2785I923a42670i722m0377H7152a41868A61037J07726
12107B68763F0948f7039D5318O897c35606f1037A83909b6556A35756a25220K853
12096a22367A43323h4158b7645C71453h6247J8589l73654b8188H9441J00256E0590
12084a39697B3413c7471J2250G4675B2838J70285K25528L49412M47174p064m43926
$$ plain form
12073 764247 299411 -35598 277553 -194200 497688 -173859 -279226 321345 -27338 127946
12062 221591 -148055 241326 207059 -16636 -222294 -164402 55827 -61331 -22358 13399 -50320
12050 -121285 140325 16723 186928 211665 174497 218405 303619 33105 -196227 -242149 -94050
12038 -189193 60036 214618 -403149 -27535 253551 38135 -17058 -140006 47783 -112941
12027 79641 29794 -113420 -53907 231077 87926 -406019 -134201 7693 91333 24876 -271430
12015 -210816 175662 -47109 1199 -23429 -59094 -108440 -244540 -111261 -234 60963 179481
12004 179481 119772 -104839 -4734 4861 -15105 34579 -131392 -45541 -155392 -209403 384078
11992 -251834 -160964 -210329 -1395 -40382 -114452 249314 118919 -23141 -34092 118814 -94105
$$ packed form
12073G64247B99411c5598B77553a94200D97688a73859j05367C21345b7338A27946
12062B21591a48055B41326l4267a6636k05658N7892E5827f1331b2358A3399e0320
12050a21285A40325A6723J70205K4737l7168M3908Q5214C3105a96227m5922i4050
12038a89193F0036J54582d03149b7535B53551C8135a7058j22948D7783a12941
12027G9641B9794a13420e3907B31077H7926d06019a34201G693Q3640B4876b71430
12015b10816A75662d7109A199b3429l5665m9346j36100a11261b34F0963J18518
12004A79481n9709a04839d734D861a5105C4579a31392d5541j09851n4011C84078
11992b51834R0870m9365a395l8987p4070B49314A18919b3141j0951A18814i4105
$$ plain form
11980 255741 73480 -152503 227518 128585 134862 226888 -385551 -297555 340552 138118 -203080
11968 -182741 -178379 40433 114544 195300 155670 -36707 37203 -6080 -202277 -83658 39904 158734
11956 158734 -329039 -164508 151683 120317 103531 103462 19757 -14598 372760 -41058 -20558
11945 -20558 129955 216161 156698 110065 468335 72180 -129150 -278803 -162895 -122922 -141163
11934 -141163 -50836 -79141 184194 201204 45171 15418 -140997 -196220 83235 12913 5141
11922 114052 -194753 113550 -196710 108128 -165869 172745 -302705 191914 -219850 -129757
11912 -129757 -86716 -42477 -116640 -247763 -36643 73839 -318133 196390 118386 132847 -55863
11900 -246013 122709 -54260 -274394 -159332 139186 -189073 162572 208876 -334036 137538
$$ packed form
11980B55741G3480a52503B27518r8933O277R2026c85551Q7996C40552A38118b03080
11968a82741M362D0433P4111Q0756l9630c6707C7203f080j96197h3658C9904J18830
11956A58734c29039a64508A51683l1366j6786o9A9757a4598C72760d1058K0500
11945b0558A29955Q6206n9463m6633L58270G2180a29150j49653J15908L9973j8241
11934a41163e0836k8305A84194J7010D5171A5418a40997n5223H3235A2913E141
11922A14052a94753A13550a96710A08128a65869A72745c02705A91914b19850R0093
11912a29757M3041d2477p4163j31123c6643G3839c18133A96390p8004J4461e5863
11900b46013A22709e4260k20134J15062A39186a89073A62572M6304c34036A37538
$$ plain form
11889 -106736 -158271 -284906 -276218 128566 -28948 -116406 364346 11700 -27463 119547 268439
11878 268439 -100242 181699 -128895 132457 113175 -36375 123118 3775 38031 -56080 -112023
11867 -112023 -252739 44700 116948 -45714 -133107 -125504 -137836 39198 -6849 124006 89276
11856 89276 -141009 -13067 -429863 -853 300908 -185807 -43545 -13617 -108516 11332 -441424
11844 97424 -281153 3149 -216303 -32875 -70791 -82621 156441 -95697 273768 -210295 -117335
11833 -117335 -60088 -225209 -231652 69519 -105903 52963 -14128 169414 -115607 24072 -142428
11821 21343 -223902 118497 41984 179846 122110 -47562 -111989 26246 -65670 -128363 180131
11809 -133484 -236904 -221166 -29009 145059 120461 90571 -86532 -75820 -406863 -207088 -160091
$$ packed form
11889a06736n1535j26635Q688A28566b8948q7458C64346A1700b7463A19547J48892
11878B68439a00242A81699a28895A32457j9282c6375A23118C775L4256e6080n5943
11867a12023j40716D4700P2248d5714q7393P603j2332C9198f849A24006l4730
11856H9276a41009a3067m16796h53C00908a85807d3545a3617r4899A1332d41424
11844I7424b81153C149b16303c2875l7916j1830A56441i5697B73768b10295R2960
11833a17335N7247j65121o443F9519a05903E2963a4128A69414a15607B4072a42428
11821B1343b23902A18497D1984J37862n7736d7562o4427B6246f5670o2693A80131
11809a33484j03420J5738b9009A45059k4598k9890h6532J0712l31043J99775M6997
$$ plain form
11798 -160091 -175576 -13367 55682 -74977 259327 -146333 223849 139275 118001 49561 -157075
11786 -85047 -23099 -147205 109720 183806 -426 -117464 162169 153081 -110347 -1926 -465413
11775 -465413 -58375 -118879 -10641 -280475 110347 94511 -211390 -406086 94185 204655
11765 204655 232907 63863 240860 80724 -80163 110482 354518 -80496 104497 121408 63197
11754 63197 -34752 107838 -65890 -33334 -53052 22225 -314064 41757 69540 46111 50561
11743 50561 175314 88277 -11162 193043 33249 284446 68919 -267171 -126558 54805 -182931
11731 52198 258644 -147319 123371 430722 194437 -175463 -129092 -125524 271590 30098
11720 12699 172163 -110801 80989 -130428 -219228 292710 -13021 184285 244680 -141048
$$ packed form
11798a60091j5485a3367E5682g4977B59327a46333B23849q4574k1274D9561a57075
11786h5047b3099j24106A09720P4086d26j17038A62169r088a10347a926m63487
11775d65413e8375o0504a0641k69834A10347j5836b11390j94696I4185J10470
11765B04655K8252F3863J76997H0724h0163A10482K44036h0496A04497J6911n8211
11754F3197c4752A07838f5890L2556j9718B2225c14064D1757K7783k3429M450
11743E0561J24753q7037a1162A93043C3249K51197F8919b67171a26558E4805a82931
11731E2198K06446a47319A23371L07351A94437a75463M6371L568B71590C0098
11720A2699J59464a10801H0989a30428q8800B92710a3021A84285O0395a41048
$$ plain form
11709 -27865 7235 118482 257225 -45893 120094 -113261 -121590 -284082 -52760 17772 372148
11698 372148 19857 109675 8852 278977 210254 5645 183744 -138785 -146991 -57423 -53363 -53128
11686 -53128 403521 130450 86277 -119369 -10328 292699 242381 11069 60471 46850 190890
11675 190890 -200102 177081 63042 100138 -30171 194894 31489 -144119 -88802 -263174
11665 -263174 -100664 -13600 4018 -367416 120907 217129 -135430 -42035 -151933 -5012 -78541
11654 -78541 -145025 -289006 -301115 10926 -173914 104133 -276459 169716 82682 25722 105062
11643 105062 64458 114300 -188274 174150 -171140 1217 -119589 366606 115791 88611
11633 88611 -41029 169851 364595 52429 175338 104219 22735 47529 140595 227616 -359910
$$ packed form
11709b7865G235J11247J38743d5893A20094a13261q329j62492e2760A7772L54376
11698C72148A9857Q9818H852K70125o8723E645J78099a38785q206e7423M060K35
11686e3128D03521A30450m4173a19369a0328B92699n0318A1069M9402j3621J44040
11675A90890b00102A77081F3042L7096c0171A94894C1489a44119N5317j74372
11665b63174a00664a3600D018c67416A20907R6222a35430d2035j09898e012p3529
11654g8541o6484j43981j2109A0926a73914A04133b76459A69716H2682B5722P9340
11643A05062m0604M9842a88274A74150a71140A217a19589C66606A15791k7180
11633H8611d1029A69851J94744E2429J22909p1119B2735K4794R3066Q7021c59910
$$ plain form
11621 34348 -84501 -109377 239978 197726 -244372 363892 326280 -47703 238053 123186 -223386
11609 230505 385125 43235 171400 6828 -107920 68557 261046 -123322 93999 93985 157930
11598 157930 183200 152156 302499 147758 239536 160293 -56504 26838 146333 45527 -167804
11586 239538 145089 -122265 -22903 165419 220184 50352 14140 64728 289168 55252 -65769
11574 -194 -3196 268120 384089 146180 429128 -43600 315934 -195238 27907 7379 -56874
11562 131172 98339 -128148 168368 84444 70917 208518 -881 -94477 105583 177214 217982
11551 217982 49118 -142523 362238 250699 112482 -85691 -41162 -127306 149979 -65253
11540 234002 183551 -117904 48411 87869 319910 -169513 50341 169194 45064 -109881
$$ packed form
11621C4348h4501k4876B39978m2252b44372C63892l7612d7703B38053j14867b23386
11609B30505J54620D3235J28165F828a07920F8557J92489a23322I3999j4O3945
11598A57930K5270l1044J50343A47758R1778p9243e6504B6838J19495D5527a67804
11586B39538r4449a22265b2903A65419N4765E0352A4140N0588K24440E5252f5769
11574a94l002B68120J15969A46180K82948d3600C15934a95238B7907G379e6874
11562A31172l2833a28148A68368q3924j3527J37601h81r3596A05583P1631M0768
11551B17982D9118a42523C62238j11539A12482h5691d1162q6144A49979f5253
11540B34002n0451a17904D8411L9458K32041a69513E0341J18853D5064a09881
$$ plain form
11529 10372 6526 -25604 323353 288605 97003 -190054 88863 476202 33787 -42553 -1871
11517 328727 -329994 403450 80125 32700 -194656 257658 229080 293006 341650 80680 255089
11506 255089 87909 93181 309289 283126 381734 129849 128422 89859 146672 316646 318168
11495 318168 210782 -34108 164374 -31704 -16328 306636 97440 491407 -267585 692739
11484 -15044 177874 243359 451676 236499 87613 212512 185067 294197 226572 249384 -88261
11472 390549 196216 -4270 134323 -33528 -173952 -85338 243565 314793 85825 -187767 335307
11460 419581 47115 -31080 -64049 56542 -274798 130717 332689 -47256 -70102 -123024 140771
11448 94621 277896 54769 -164978 258331 115707 -44314 513572 -410058 43079 11011
$$ packed form
11529A0372l846b5604C23353l4748I7003a90054H8863L87339C3787d2553a871
11517C28727c29994D03450H0125C2700a94656B57658k8578O3926M8644H0680J74409
11506B55089H7909N272K16108k6163R8608A29849j427l8563N6813J69974J522
11495C18168j07386c4108A64374c1704J5376C06636I7440L93967b67585F92739
11484a5044A77874O5485K08317k15177H7613J24899k7445J09130o7625K2812h8261
11472C90549j94333d270A34323c3528j40424h5338B43565P1228H5825a87767C35307
11460D19581D7115c1080l2969E6542b74798A30717K01972d7256k2846n2922A40771
11448I4621J83275E4769a64978B58331A15707d4314E13572d10058D3079A1011
$$ plain form
11437 172391 67792 169618 232952 -46770 59564 -19947 55836 133524 -70010 -147117 345815
11425 -26344 160944 64852 144030 4896 117036 168395 842 62049 -123602 279428 -175530
11413 318184 122550 12552 -173374 -268929 -71638 -48699 -100124 51660 202818 207277 -22658
11401 60182 426606 -25420 59361 101605 138707 240340 177652 141537 -94494 22691 -116784
11389 -31550 4549 140412 9066 -426602 85094 90281 -108227 55864 -134270 -266115 111247
11377 -197782 86295 186377 -211909 -141663 -124430 -6763 221803 560805 -253297 -153748 -236161
11366 -236161 47305 155010 -587230 -89387 -46599 -22447 39543 -153742 -10607 -307071 -295738
11355 -295738 -129217 -56782 -1954 368407 12507 -379761 103623 155128 133345 -82060 -97299
$$ packed form
11437A72391F7792J01826O3334d6770E9564a9947E5836P7688g0010p7107C45815
11425b6344A60944F4852P9178D896J12140N1359H42O1207a23602B79428a75530
11413C18184A22550A2552a73374r5555g1638K2939n1425E1660J51158M459b2658
11401F0182L66424b5420E9361M2244L7102J01633o2688l6115i4494B2691a16784
11389c1550D549J35863I066d26602H5094N187a08227E5864a34270j31845A11247
11377a97782H6295J00082b11909P0246J7233f763B21803L39002b53297R9549q2413
11366b36161D7305J07705e87230h9387M2788b2447C9543a53742a0607k96464J1333
11355b95738a29217e6782a954C68407A2507c79761A03623N1505k1783h2060j5239
$$ plain form
11344 -97299 189 -176786 37296 183155 299192 305710 11387 35137 103227 158269 -253723
11332 -155883 186265 -194985 -152304 102458 69378 -141917 -46994 103083 -68790 -203799
11322 -203799 -86708 -66226 179323 -190186 -268611 -93988 95043 -99514 147431 -64140 -302061
11311 -302061 280084 227811 -112479 -279398 88359 179023 -123149 200424 -312788 -257422
11301 -257422 167736 92159 163814 -320152 -91285 -83583 216807 108456 -88939 44720 116427
11290 116427 -328073 -198479 -41194 176370 -11229 -180335 -58945 68618 -236885 -237365 -53335
11278 49094 98511 34258 -1576 -205829 -140525 129393 -42158 -47410 -219005 -21542 86471
11266 101671 178790 -266851 102121 -262970 -106962 13727 66981 288856 104175 -254176
$$ packed form
11344i7299A89a76786C7296J45859J16037O518A1387K3750O8090N5042b53723
11332a55883A86265a94985M2681A02458l3080a41917d6994A03083f8790j35009
11322b03799h6708K0482A79323a90186p8425i3988I5043i9514A47431f4140k37921
11311c02061B80084n2273a12479j66919H8359R0664a23149B00424c12788N5366
11301b57422A67736p5577P1655c20152i1285P702B16807j08351h8939D4720P1707
11290A16427c28073J29594d1194A76370a1229j69106e8945F8618b36885m80e3335
11278D9094M9417C4258a576k04253O5304A29393d2158n252j71595b1542H6471
11266A01671P7119b66851A02121b62970a06962A3727N3254K21875A04175b54176
$$ plain form
11255 360827 -290389 89848 -246491 -12478 -234846 29590 92519 -131216 453177 -172965
11244 201061 186613 -62201 92139 -34442 117982 -91537 118612 41929 87551 -155206 239704
11232 -263248 64207 -54330 -78744 -54054 -15954 151735 383549 82097 106390 -5458 241804
11220 -20732 -177541 -59743 -81699 334726 -96361 13803 -20426 -19754 361828 173437 -187200
11208 -11022 -48875 -15126 -117750 -443954 -35718 -103295 -6657 87136 -85148 -83718 -359502
11197 -359502 -21456 -292744 -236812 -71738 -156535 -33608 18903 -46586 -190249 89588 99521
11186 99521 -38228 -114578 3263 -314271 -73922 -118192 174276 -22400 51862 5493 -328430
11174 8948 138206 462208 152702 -1929 247237 104255 -117572 -77805 143905 -192625
$$ packed form
11255C60827b90389H9848b46491a2478k22368B9590O2929a31216D53177a72965
11244B01061j4448f2201I2139c4442A17982i1537A18612D1929M5622a55206B39704
11232b63248F4207e4330k4414K4690a5954A51735K31814H2097K4293e458B41804
11220b0732j56809e9743k1956C34726i6361A3803b0426O72C61828A73437a87200
11208a1022l7853a5126j02624l26204c5718o7577f657H7136h5148J430k75784
11197c59502b1456k71288N5932g1738q4797c3608A8903d6586j43663H9588R933
11186I9521c8228p6350C263c14271g3922m4270A74276b2400E1862E493c28430
11174H948J29258L24002A52702a929B47237A04255a17572L9767A43905a92625
$$ plain form
11163 81903 -43599 -51164 39608 225225 -120777 74754 -1520 118220 112640 76961 -120019
11151 -201499 -16237 175391 -19630 -293611 -101005 291654 -121687 -236207 35586 146449
11141 146449 45086 -131206 70181 191093 -374015 162958 76424 -17160 134699 54818
11130 -9690 273066 145688 57992 -147369 25244 -32204 -52306 444575 -143185 7729 189070
11119 189070 139332 -71190 -156315 112898 64007 -46871 413501 -75312 118260 218054 363321
11108 363321 123955 100764 -64805 148540 267689 202652 63093 156360 -22738 257135 367476
11097 367476 201199 -176089 -63782 147203 193845 180501 213048 451789 129538 304537
11087 304537 173035 187665 192855 -24607 302553 189933 189398 157032 162268 498260 342983
$$ packed form
11163H1903d3599p565C9608J85617a20777G4754a520A18220n580l5679a20019
11151b01499a6237A75391a9630k73981a01005B91654a21687j14520C5586J10863
11141A46449D5086a31206G0181J20912c74015A62958G6424a7160A34699E4818
11130i690B73066j27378E7992a47369B5244c2204k0102D44575a43185G729J81341
11119A89070m9738g1190q5125A12898m8891d6871D13501g5312A18260R9794J45267
11108C63321A23955k3191f4805A48540J19149o5037F3093R3267b2738B57135J10341
11097C67476j66277a76089f3782A47203M6642j3344L2547K38741A29538J74999
11087C04537j31502J4630N190b4607C02553j12620n35l2366N236L35992j55277
$$ plain form
11076 342983 -45071 338546 192774 314040 314427 150136 479932 341846 381874 147040
11065 557492 358593 279178 525622 560991 433030 655130 639004 550801 758357 470571
11055 470571 467914 938083 828239 766323 889702 936347 514805 537990 606345 674033 773747
11044 773747 856813 584669 757867 643243 898471 655649 836566 688141 904950 918406
11034 918406 569564 557339 316087 890738 887208 808919 922378 480136 402339 838536
11024 838536 691787 510404 358407 541358 808754 700069 747336 743091 543529 368894
11014 368894 686374 723700 815372 606974 549017 580574 543687 498947 851902 591958 425595
11003 425595 413323 645862 628147 854418 532484 919490 686529 782518 525974 548980
$$ packed form
11076C42983d5071C38546j45772J21266L87A50136L29796j38086M0028A47040
11065E57492j98899p9415K46444L5369j27961K22100j6126q8203K07556k87786
11055D70571k657M70169j09844o1916J23379M6645m21542K3185O8355O7688R9714
11044G73747Q3066k72144J73198j14624K55228k42822J80917j48425K16809J3456
11034I18406l48842j2225k41252N74651l530p8289J13459m42242p7797M36197
11024H38536j46749j81383j51997J82951K67396j08685M7267m245j99562j74635
11014C68894L17480L7326R1672k08398n7957L1557l6887m4740L52955k59944j66363
11003D25595j2272K32539j7715K26271l21934L87006k32961R5989k56544K3006
$$ plain form
10993 548980 879045 845518 858029 868023 851902 1179675 1296461 793442 954754 1472715
10983 1472715 1081754 814116 1393680 1234236 1806432 1531023 1705682 2056122 2135736 2091675
10973 2091675 2238902 2570658 2884996 2711372 2686395 2424633 2757694 1977771 2093213 1667414
10963 1667414 1675969 1707851 1637065 1748185 1422938 2017821 1994032 1707908 2230461 1816611
10953 1816611 1532144 1446097 1288755 1138875 721918 684851 330439 860257 561996 356545
10943 356545 627840 281653 243205 41760 228912 348420 422745 -97034 87885 268852
10933 268852 101843 -118303 31071 77530 454667 -63106 264009 168573 354619 -62917
10922 42414 379719 -41248 136380 228644 74934 285219 36074 126146 164649 321371 -299607
$$ packed form
10993E48980L30065l3527J2511R994j6121L27773J16786n03019J61312N17961
10983A472715l90961k67638N79564j59444N72196k75409J74659L50440P9614m4061
10973B091675J47227L31756L14338j73624k4977k61762L33061p79923J15442m25799
10963A667414Q555L1882p0786J11120l25247N94883k3789k86124N22553m13850
10953A816611k84467q6047j57342j49880m16957l7067C30439N29818k98261k05451
10943C56545K71295B81653l8448D1760J87152J19508P4325i7034H7885J80967
10933B68852A01843a18303C1071M6459L77137f3106B64009r5436J86046f2917
10922D2414L37305d1248A36380R2264G4934K10285C6074R0072L8503J56722b99607
$$ plain form
10910 -235529 -237403 -57471 67733 -113896 166021 -113937 -113519 159536 51970 -64483 83753
10898 39024 204493 -43807 56689 -103787 -34376 -42736 -154237 -177108 -340665 -95042 -69318
10887 -69318 98127 113292 68645 -79607 -238443 -102020 171436 -114497 73616 2122 -157607
10875 -217993 -15064 12461 -17495 253690 79719 413126 295716 -90540 140822 188595 16793
10863 -346729 118745 -90245 161128 329868 -16869 -110068 -299445 137996 133559 220574 -73142
10851 57198 201686 70450 -193705 282119 203830 256631 164782 172758 111939 -55063 -49937
10840 -49937 102065 -34797 -277393 101721 -8526 -232807 213653 44898 -232251 67198 -48661
10828 -11239 174814 214517 -100427 19127 -108330 100392 -82646 -80806 5191 -87217 -215311
$$ packed form
10910b35529j874e7471F7733a13896A66021a13937M18A59536E1970f4483H3753
10898C9024J65469d3807E6689a03787c4376q360j11501k2871j63557i5042K5724
10887f9318I8127J5165m4647g9607j58836a02020A71436a14497G3616B122a57607
10875b17993a5064A2461a7495B53690G9719L33407j17410i0540A40822M7773A6793
10863c46729A18745i0245A61128J68740a6869r3199j89377A37996m437Q7015g3142
10851E7198J44488G0450a93705B82119p8289N2801r1849P976o0819e5063N126
10840d9937A02065c4797k42596A01721h526k24281B13653D4898b32251F7198d8661
10828a1239A74814L9703a00427A9127a08330A00392h2646J840E191h7217j28094
$$ plain form
10817 -215311 -32803 107755 49315 247414 9514 -104328 -390417 228559 120689 -55374
10806 -451341 4584 -239824 47215 -175594 35605 161001 -295966 -46540 -204996 -20467 -208001
10795 -208001 -107249 -18204 290969 -58201 -41874 126421 -72832 139706 -40973 45927 50745
10784 50745 -240966 -137146 145449 -99192 -43604 90323 -29927 -120074 -110617 -151209 10836
10772 84605 -97875 185071 192029 -467715 -74136 -243431 11380 -55658 18224 104652 272404
10761 272404 27196 209462 -232293 -85221 -58411 -58967 -94208 25174 185499 93800 -81107
10749 108808 -161754 -107591 -136983 -28862 -25025 -81762 -190810 -33530 -511669 -81300 14682
10737 -125735 -138273 6695 370114 -108625 -161817 -65123 -164468 -284522 114898 -149113 323853
$$ packed form
10817b15311c2803A07755D9315J98099I514a04328k86089B28559j07870e5374
10806d51341D584b39824D7215a75594C5605J25396b95966d6540j58456b0467j87534
10795b08001J00752a8204B90969e8201J6327A26421g2832A39706d0973D5927M818
10784E0745b40966J03820A45449i9192d3604I0323b9927r0147R457m0592A0836
10772H4605i7875A85071O958d67715g4136j69295A1380e5658A8224Q6428J67752
10761B72404B7196J82266b32293h5221K6810n56l5241B5174J60325r1699h1107
10749A08808a61754N4163k9392b8862L837n6737j09048c3530m78139h1300A4682
10737a25735j2538F695L63419a08625n3192f5123r9345j20054A14898a49113C23853
$$ plain form
10725 -85644 3495 87052 -461954 -156550 -230418 -246462 -58751 12246 -315573 -86386 109104
10713 -27721 -1058 -16755 -129044 323 -248777 -30920 -87784 24346 158677 81757 -198598
10701 -196550 -365953 70864 -42691 86649 245521 -285374 56325 -389510 -120392 -68327
10691 -68327 85887 66472 176185 21236 140216 130232 63783 162246 6161 -236916 -98076
10679 81977 -487565 -134121 52312 -103562 -305381 149140 -321901 -99949 -199896 360936
10668 18605 -76240 -160331 -364357 -43494 -80816 -235520 -57456 91728 -60979 -15795 -273166
10657 -273166 8349 121815 -207026 -106811 69475 323784 350318 201301 -258398 27076
10646 -10094 33056 45898 -149758 -75017 119800 -380401 -183346 -255786 -86581 25689 -110641
$$ packed form
10725h5644C495Q3557d61954a56550p3868j6044e8751A2246c15573h6386A09104
10713b7721a058j5697j12289C23b48777c0920n6864B4346J34331p6920a98598
10701a96550j69403G0864d2691H6649J58872b85374E6325c89510a20392N2065
10691f8327H5887j9415J09713B1236J18980r984F3783R8463F161b36916i8076
10679H1977d87565a34121E2312a03562k01819A49140c21901i9949r9947C60936
10668A8605g6240q4091k04026d3494l7322j54704e7456I1728f0979a5795k57371
10657b73166H349J13466b07026J00215F9475K54309K6534j49017b58398B7076
10646a0094C3056J2842a49758P4741A19800c80401a83346p2440h6581B5689a10641
$$ plain form
10634 -289560 71300 -153843 307877 174425 284750 -328184 -257172 -128027 80080 -93950
10623 482820 -186250 57486 223273 102670 220602 118764 -22036 -142614 185464 -105038
10612 -119180 -185260 -280241 94913 -318547 -141916 -283961 -34289 -253749 -174206 122096
10601 -67163 13149 -26502 -299927 -31700 -296791 -25686 178786 -48646 160906 378354 -71603
10589 238229 -32854 36777 145093 -279905 203997 75962 -197878 -131593 7381 -4441 -17911
10578 -17911 -134380 92773 -1364 59346 -152692 -123433 235473 -133916 -28401 -97126 -63082
10567 -63082 -144643 100167 -317941 87378 -217539 74447 -63293 -86249 -140876 149665 -18874
10555 -83159 87786 -194227 18240 -560089 -400011 -41809 148261 115166 89551 131560 -127403
$$ packed form
10634b89560G1300a53843C07877j33452J10325c28184P1012a28027H0080i3950
10623D82820a86250E7486J65787A02670J17932j01838b2036j20578A85464a05038
10612a19180o6080r4981I4913c18547a41916j42045c4289k19460P9543A22096
10601f7163A3149b6502k73425c1700k65091b5686A78786d8646A60906K17448g1603
10589B38229c2854C6777J08316b79905B03997G5962a97878O6285G381d441j3470
10578a7911j16469I2773a364E9346a52692K9259B35473a33916b8401o8725L4044
10567f3082q1561A00167c17941H7378b17539G4447f3293k2956n4627A49665a8874
10555h3159H7786a94227A8240e60089J60078d1809A48261l3095k5615M2009a27403
$$ plain form
10543 22710 -144354 -100747 -239131 -144803 -268946 32050 -131738 -59427 -52848 158094 -62565
10531 -4571 -52110 -82474 131867 270993 31943 214399 44002 -36798 -14249 63743 229467
10520 229467 -11218 23107 81678 -17074 -246512 -94199 -62350 -215391 -28426 -122723 -143290
10509 -143290 -173392 252382 -83394 -400247 157732 9343 -8579 124390 159397 98234 60170
10498 60170 -181665 235880 123281 -167688 -14463 -78246 -239447 -155875 14613 112483 -169350
10486 -73837 280214 22519 336872 78202 105071 338390 623608 499580 835065 263983
10475 134689 49296 283917 34167 -197343 80704 -100449 66130 -124500 -28389 -286558
10465 -286558 299542 -50650 116148 112410 58155 -70370 384120 -3893 34168 -32117 52726
$$ packed form
10543B2710a44354M3607j38384R4328j24143C2050a31738e9427O579A58094f2565
10531d571m7539l0364A31867J39126C1943J82456D4002c6798a4249F3743J65724
10520B29467a1218B3107N8571a7074k29438i4199L1849j53041b8426r4297k0567
10509a43290l0102B52382h3394l16853A57732I343h579A24390L5007o1163l8064
10498F0170a81665B35880j12599a67688a4463o3783j61201Q3572A4613R7870a69350
10486g3837B80214B2519L14353G8202K6869K33319K85218j24028L35485B63983
10475A34689D9296K34621C4167a97343H0704a00449F6130a24500b8389k58169
10465b86558B99542e0650A16148l738n4255g0370C84120c893C4168c2117E2726
$$ plain form
10453 -226724 -68205 -257214 -24050 -87442 -121297 13350 -243278 6384 189858 76023 -15561
10441 339046 122866 38008 -144597 175254 -49045 193915 161508 -39035 95600 -159005
10430 -156530 -136001 -122663 33798 99870 122151 -146269 195424 -368018 3259 -83040 311154
10418 -149265 190291 -15063 35402 -70538 -75278 230427 -179045 126618 -326412 -172248
10408 -172248 187294 9422 47439 -173668 -196230 -46790 165431 -50870 -213324 -87047 93701
10396 72901 87808 -192448 118607 120827 -65632 181219 -26427 126085 192314 -89878 128260
10384 218402 270248 97010 -118181 174957 -88217 -127191 85421 159382 100632 59663 89474
10373 89474 332983 353969 218735 396797 511202 423584 349574 479367 410077 223379
$$ packed form
10453b26724f8205j89009b4050o3392l3855A3350b43278F384J83474G6023a5561
10441C39046A22866C8008a44597A75254d9045A93915l2407c9035I5600a59005
10430a56530K0529J3338C3798O6072K2281a46269A95424c68018C259h3040C11154
10418a49265A90291a5063C5402g0538m740B30427a79045A26618c26412J54164
10408a72248A87294I422L8017a73668k2562d6790A65431e0870j62454h7047I3701
10396G2901J4907a92448A18607K220f5632A81219b6427A26085O6229h9878A28260
10384B18402N1846I7010a18181A74957h8217l8974H5421P3961n8750m0969K9811
10373H9474K43509K0986j35234J78062J14405q7618p4010J29793o9290j86698
$$ plain form
10363 223379 344299 337506 -104311 513663 372305 336075 231046 122918 314063 271688
10353 271688 187585 336867 296171 323487 343773 336235 265563 194425 60040 437169 317185
10342 317185 39658 436447 -75282 118285 129882 221327 285159 -43376 269455 130248 -91520
10330 -332179 300095 -158074 -198901 -39335 224585 126932 473366 -109320 29298 224879
10320 224879 220807 324774 7332 265390 191510 181719 173634 -85965 178721 -15876 -17142 150401
10307 -608064 -240666 159386 -11103 -113895 -189358 138469 137357 6248 74708 269628 55059
10295 173405 129330 -68039 -4141 165667 -58497 -311321 53638 76227 -9772 -213190 69279
10283 -339909 -374727 -93587 75458 95493 -62141 32832 98814 45625 15213 78341 -79736
$$ packed form
10363B23379J20920o793a04311E13663j41358l6230j05029j08128J91145m2375
10353B71688q4103J49282m0696K7316K0286p538p0672p1138F0040L77129j19984
10342C17185C9658L96789g5282A18285J1597R1445O3832d3376B69455A30248i1520
10330c32179C00095a58074m0827c9335B24585r7653L46434a09320B9298J95581
10320B24879m072J03967G332K58058p3880r791q085h5965A78721a5876j266A50401
10307f08064b40666A59386a1103j02792p5463A38469j112F248O8460J94920E5059
10295A73405m4075f8039d141A65667e8497k52824E3638K2589i772k03418F9279
10283c39909l4818i3587G5458K0035f2141C2832O5982D5625A5213O3128g9736
$$ plain form
10271 108335 25675 -14847 -339405 -122832 113047 243142 84803 149605 -157151 -111561
10261 -111561 298831 204121 -3718 348198 226526 195728 106666 -143977 175255 -100693
10250 -242657 -234681 345914 109304 -90263 3992 25602 -85581 -37641 -172980 110766 388228
10239 388228 111599 48173 -349333 303877 339865 79501 -67186 -84305 30410 8918 -2526
10227 56181 230809 -116697 54048 -118373 -85716 92986 2553 229564 164291 77188 -83069
10215 -150411 -215274 58284 77507 58337 135949 23228 62236 71058 125254 -309641 -120822
10203 206265 -46389 -106329 461044 -226297 -52184 -450499 -68612 -18766 71074 131608 5566
10191 141546 109103 -265581 168679 4963 -245476 -42963 -49813 -3883 148416 91875 -184736
$$ packed form
10271A08335B5675a4847l24558a22832A13047J30095H4803O4802a57151M5590
10261a11561B98831r4710c718C48198j21672l0798q9062a43977A75255a00693
10250b42657P976C45914A09304i0263C992K1610h5581c7641j35339A10766K77462
10239C88228A11599D8173c49333C03877L5988G9501f7186j7119C0410H918b526
10227E6181J74628a16697E4048a18373L2657I2986B553K27011o5273G7188h3069
10215a50411o4863E8284J9223j9170P7612B3228L9008Q822N4196c09641a20822
10203B06265d6389n9940D61044b26297e2184l98315f8612a8766G1074O0534E566
10191A41546l2443b65581A68679D963b45476d2963o850c883A48416n6541a84736
$$ plain form
10179 -279299 -310333 -56841 -36330 -248236 -208865 -15287 -35395 165105 -129578 -325147 -111023
10167 36040 57484 117589 178150 -65053 -260813 104286 -134286 -288194 -205697 -53471 -451643
10156 -451643 -66089 125936 -68131 245775 54766 64745 -34377 8608 -133641 -69495 -238011
10145 -238011 46962 98776 -146722 -300182 61127 96988 -59982 6075 239705 -297805 -192613
10134 -192613 197178 -196154 -135448 -260946 -163655 -118316 7366 -59143 167974 -56846 26343
10122 -420041 -33531 -449665 -1063 325310 -320563 157173 -269937 -286753 -76468 229440
10111 -215858 -160017 318711 -44627 -71227 -68391 -240424 -351257 -179227 12202 221988 -182978
10099 -105258 59843 -50999 139691 59360 6943 -38111 -283051 49594 180952 -77791 -194659
$$ packed form
10179b79299l1034e6841K0511k11906L9371a5287k0108A65105a29578j95569a11023
10167C6040K1444O0105O0561f5053j95760A04286a34286j53908Q2497e3471l98172
10156d51643f6089A25936f8131B45775E4766R979c4377H608a33641O4146j68516
10145b38011D6962N1814a46722j53460F1127L5861e9982F075K33630b97805J05192
10134a92613A97178a96154O0706j25498R7291M5339G366e9143A67974e6846B6343
10122d20041c3531m16134a063C25310c20563A57173b69937j6816g6468B29440
10111b15858N5841C18711d4627k6600K836j72033j10833J72030A2202K09786a82978
10099a05258E9843e0999A39691E9360F943c8111k44940D9594J31358g7791j16868
$$ plain form
10088 -194659 160395 -256866 -138883 -15604 14563 -176704 -43103 -239847 -167587 -198481
10078 -198481 104758 213840 -163892 -165320 -270290 -379997 -133998 -98334 -279109 -253438
10068 -253438 46894 -41318 320747 23952 -33894 297660 71437 -136826 -407189 134153
10057 -276020 -260081 -122837 -31987 428609 -67236 134094 204401 26601 -83642 -321904 -54649
10045 75318 -293295 235506 42051 -139270 -83398 63820 100812 -111212 -207998 -77392 12724
10033 161541 -141309 -85806 -99754 -516771 237578 -158910 -93701 -85090 -196086 -14255 -244369
10022 -244369 -12920 -65989 25371 -242780 63464 -1686 -80617 202964 -313573 -396927 35051
10010 25861 176755 266201 93033 -167618 -230716 -212973 97542 -112716 232965 -199295 -205745
$$ packed form
10088a94659A60395b56866J17983a5604A4563a76704d3103j96744P2260l0894
10078a98481A04758J09082a63892j428j04970j09707a33998L5664j80775K5671
10068b53438D6894d1318C20747B3952c3894B97660G1437a36826k70363A34153
10057b76020J5939a22837c1987D28609f7236A34094P0307B6601h3642k38262e4649
10045G5318b93295B35506D2051a39270N5872F3820L6992a11212r6786g7392A2724
10033A61541a41309N5503j3948m17017B37578a58910O5209Q611j10996a4255k30114
10022b44369a2920n3069B5371b42780F3464a686p8931B02964c13573q3354C5051
10010B5861J50894Q9446I3033a67618o3098J7743I7542a12716B32965a99295o450
$$ plain form
9999 -205745 -252236 -235772 -146070 -111518 -277910 -73598 73102 -112653 117092 -88371 -329232
9988 -329232 -20716 -242216 -205862 2503 -203494 95851 -100182 -44716 -339174 -238425 717
9976 -62848 44415 4811 -295218 -196510 -65933 -203112 -159085 -146037 -49027 -44380 -101691 -313435
9964 -313435 -331149 -39216 47790 75814 59597 -296663 192043 -159040 -206597 -86661 278098
9952 -140977 -81189 4581 -208819 163440 -40115 -224525 173440 -186006 -169824 -23221 -73279
9941 -73279 -335938 -280222 -172275 -241022 -149682 -57919 170547 -173768 -107012 38150 -166157
9929 151058 -368830 -21905 -113956 -198351 -67373 -471220 -215032 -77471 -58181 78749 -89966
9917 162424 21192 -71949 85543 -165234 37245 -14518 -173540 223355 97845 35180 -183905
$$ packed form
9999b05745m6491J6464Q9702L4552j66392g3598G3102a12653A17092h8371k40861
9988c29232b0716k21500L6354B503b03494I5851a00182d4716k94458J00749G17
9976f2848D4415D811b95218R8708f5933j37179M4027J3048d9027M647n7311k11744
9964c13435j7714c9216D7790K8024j6217b96663A92043a59040m7557h6661B78098
9952a40977N9788D581b08819A63440d0115j84410A73440a86006J6182b3221n0058
9941g3279k62659N5716J07947o8747R1340e7919A70547a73768O6756C8150a66157
9929A51058c68830b1905r2051q4395f7373m03847b15032g7471J9290G8749h9966
9917A62424B1192g1949H5543a65234C7245a4518j59022B23355I7845C5180a83905
$$ plain form
9905 -15185 -22026 97649 -58759 -293616 211688 -301475 2406 -350625 56258 -320058 -136027
9893 133962 14061 91483 -51570 -341121 -138130 -325608 54720 -78364 239288 -84093 -88707
9882 -88707 -461546 -177030 -110661 -214603 135273 -375350 -195090 -181636 153895 60814
9871 -98072 -234180 -55983 -182285 -48162 13301 -49409 -139146 70339 -38864 45242 198061
9860 198061 -50573 150255 -159895 38301 -33477 -168861 -79542 27809 -195129 -386468 -85340
9848 124742 -88698 86443 -141086 -31981 -155144 -133798 109996 18232 -289437 -149470 -297340
9837 -297340 -125098 216855 -227016 230019 -238626 -122813 -51916 37095 -100005 -93319
9827 -93319 42782 71849 -251197 289531 116330 157623 -228256 -150353 -207132 -124821 -268102
$$ packed form
9905a5185o841I7649e8759k34857B11688c01475B406c50625E6258c20058a36027
9893A33962A4061P7422e1570k89551a38130j87478E4720g8364B39288h4093m614
9882h8707l72839a77030O6369j03942A35273c75350J80260J3454A53895F0814
9871i8072j36108e5983j26302d8162A3301d9409q9737G0339c8864D5242J52819
9860A98061e0573A50255a59895C8301c3477j35384g9542B7809a95129j91339h5340
9848A24742h8698H6443a41086c1981j23163K1346A09996A8232b89437J39967j47870
9837b97340a25098B16855b27016B30019b38626J15813e1916C7095a00005O686
9827i3319D2782K9067b51197B89531A16330M1293b28256P7903n6779Q2311j43281
$$ plain form
9816 -268102 35104 7271 52524 -204462 -153477 -115305 -35428 -185224 293744 157786 215451
9805 215451 197624 -165225 -96674 104216 -106777 -110586 -62753 21903 128886 -156263 141656
9793 -3036 59601 -65543 105879 -277976 -433 13962 227591 -117651 76869 -153660 -218497
9782 -218497 -83308 -235526 454530 -166826 27321 177973 12788 -97758 69222 -147559 -187745
9771 -187745 10430 99742 218253 -142257 -222394 124441 -584711 149371 -240083 -299555
9761 -299555 164316 -143520 123886 -35607 -310444 247021 -93842 63552 113018 -94767 89805
9749 97546 194829 126437 -231216 337061 178987 -202640 86215 -210569 -161036 -325746 -193232
9738 -193232 -71659 -323246 64668 7294 -467903 -245652 68038 105283 102052 -29061 -317089
$$ packed form
9816b68102C5104G271M5253b04462N0985L8172c5428j49796B93744j35958N7665
9805B15451j7827a65225O8551A04216a06777l809M7833B1903J06983a56263A41656
9793c036E9601f5543A05879b77976d33A3962K13629a17651G6869a53660o4837
9782b18497h3308j52218D54530a66826B7321J50652A2788i7758F9222a47559m0186
9771a87745A0430Q9312J18511a42257q0137A24441e84711A49371b40083n9472
9761b99555A64316a43520A23886c5607k74837B47021i3842F3552M9466i4767H9805
9749I7546R7283o8392b31216C37061j58074b02640H6215b10569M9533j64710J32514
9738a93232g1659k51587F4668G294d67903K22251F8038L7245l231b9061k88028
$$ plain form
9727 -317089 -11885 48327 -557732 240808 -5965 -65709 -91225 -79720 -153673 -221617 728 244561
9715 244561 -100914 -125168 -243662 -285122 -23751 220225 -324517 -147935 29480 298146
9705 298146 -317376 -34038 -369353 255804 -114862 94759 -156968 -223281 -148783 -70102 182403
9693 -106476 150070 -203486 31298 24066 -9212 -81702 -74290 -357784 12726 -5122 -66666 -164631
9681 -164631 -134640 -281393 -195061 -187946 -2755 -107697 -405830 -310034 -175399 45106 -9449
9669 -84330 86073 254049 -15688 -112625 32530 -288734 -36699 178217 -45522 259842 -278435
9657 103208 -77329 -94006 28785 -300057 -5188 -214359 -189926 -90410 -124270 141215 133847
9646 133847 -278606 -19586 -81314 -5235 195396 61254 -172820 -70875 -281956 -289328 48390
$$ packed form
9727c17089a1885D8327e57732B40808e965n9744k5516J1505p3953o7944G28K43833
9715B44561a00914k4254j18494m1460b3751B20225c24517a47935B9480K68666
9705B98146c17376c4038l35315B55804a14862I4759a56968o6313P4498g0102A82403
9693a06476A50070b03486C1298p232i212p2490P412k83494A2726e122o1544r7965
9681a64631K9991j46753Q6332P115b755j04942k98133R5796J34635D5106i449
9669h4330H6073J67976a5688r6937C2530b88734c6699A78217d5522B59842b78435
9657A03208g7329j6677B8785c00057e188k09171K4433i0410l3860A41215p368
9646A33847b78606a9586o1728e235A95396F1254a72820g0875k11081p372D8390
$$ plain form
9634 -375021 133614 20606 -52502 -75680 -63990 -104328 -145902 165957 238972 94862 -59955
9622 -171149 -215969 273122 -230957 -208607 18728 -92961 -278509 -183191 -243340 100719 -70809
9610 -26896 -37360 102173 118215 -140160 -129546 -28842 -38220 -257215 -95428 17398 -64973
9598 103344 133401 -335013 -151106 -212761 -92024 -177914 -146591 -203984 -287346 377023 -80665
9586 -67601 -47633 132625 139876 -207252 -59296 284378 -231317 75431 -31783 -284027 -215834
9575 -215834 3302 10132 74083 -103565 269532 257549 -159234 -41242 -79619 -117046 -45828
9563 61389 27154 -456492 -186446 -79211 122498 -147584 90305 -11094 -106469 8126 -26784
9551 25150 109354 -174181 -24734 -2905 301026 -130915 -27819 120257 -272770 -164270 27084
$$ packed form
9634c75021A33614B0606e2502k3178J1690m0338m1574A65957P3015I4862e9955
9622a71149m4820B73122b30957K2350A8728i2961j85548R5318o0149A00719g0809
9610b6896j0464A02173J6042a40160J0614b8842r378k18995i5428A7398f4973
9598A03344L0057c35013a51106o1655i2024q5890L1323n7393q3362C77023h0665
9586f7601J9968A32625P251b07252e9296B84378b31317G5431c1783k52244O8193
9575b15834C302O830O3951a03565B69532j1983a59234d1242l8377l7427d5828
9563F1389B7154d56492a86446g9211A22498a47584I0305a1094r5375H126b6784
9551B5150Q4204a74181b4734b905C01026a30915b7819A20257b72770J08500B7084
$$ plain form
9539 58060 155246 -78372 -88941 -141054 -191639 236301 -248462 31885 -290287 58146 -259882
9527 209269 184746 -145247 157000 15331 9750 -80732 -232607 1793 -212910 -84663 226721
9515 27774 -207048 -164186 205565 273474 46875 114050 -293737 53709 181246 195462 -199422
9503 -119770 140213 -522199 96265 -73008 140945 -44771 -442281 156947 36343 -153571
9492 44419 -75830 22132 -73725 -166746 -85888 -357912 -173558 39236 -65877 -81226 -269571
9481 -269571 39525 -69202 83269 -122308 -56074 -199082 -255250 -22169 -31961 36611 104638
9470 104638 181709 -26895 121965 169316 -273292 -388695 -189309 -96642 -19069 -156598 204048
9458 11377 -331996 -243028 -46889 -45816 -190831 61785 182123 -185231 -167087 -367107 -273543
$$ packed form
9539E8060R7186g8372j0569n2113n0585B36301b48462C1885b90287E8146b59882
9527B09269k4523a45247A57000A5331n581h0732j51875A793b12910h4663B26721
9515B7774b07048M2862B05565O7909D6875O7175b93737E3709J27537J4216a99422
9503a19770A40213e22199I6265g3008A40945d4771l97510A56947C6343a53571
9492D4419g5830B2132g3725r3021Q0858k72024a73558C9236f5877j5349j88345
9481b69571C9525f9202H3269a22308e6074j43008n6168b2169r792C6611O8027
9470A04638P7071b6895A21965M7351b73292j15403a89309R2667a9069j37529B04048
9458A1377c31996Q8968d6889J073j45015F1785J20338a85231J8144k00020R3564
$$ plain form
9447 -273543 -266911 92452 -47821 -95114 -132766 -304943 23165 -193343 115315 212569 -61314
9435 171555 -132878 -161305 49930 -111554 205119 21591 -19596 194378 27900 -72465 245650
9423 -260012 6678 -132985 37998 -77699 -93676 -66609 189382 169883 -240237 319760 -213728
9411 10628 -491598 128831 -145724 42331 -168961 -40233 176256 -157294 16570 10576 -284400
9399 -259436 -18808 -80268 -15214 34884 -110694 121979 70926 158162 -298049 -198707 180416
9387 167015 90525 -35507 -9822 -139971 -77678 76551 75813 -137519 149287 -134807 -142095 -111554
9375 -111554 248357 -154716 -96551 -49503 -391757 -138225 -141310 -127811 -203122 -244923 -150997
9364 -150997 -214938 122432 -220497 115755 -27328 81763 -141211 113821 -173692 -357231
$$ packed form
9447b73543O632I2452d7821m7293l7652j72177B3165a93343A15315R7254f1314
9435A71555a32878k8427D9930a11554B05119B1591a9596A94378B7900g2465B45650
9423b60012F678a32985C7998g7699j5977K7067A89382j9499b40237C19760b13728
9411A0628d91598A28831a45724D2331a68961d0233A76256a57294A6570n994b84400
9399b59436a8808o1460a5214C4884a10694A21979n1053Q7236b98049R9342A80416
9387A67015p6490c5507i822j30149O2293G6551p38a37519A49287a34807p288L0541
9375a11554B48357a54716N8165M7048l42254a38225l085J3499p5311m1801R3926
9364a50997o3941A22432b20497A15755b7328H1763a41211A13821a73692j83539
$$ plain form
9354 -357231 -321510 -276867 99939 -240411 213781 192381 373751 137143 -49839 207376 -192838
9342 -116539 169352 -39222 81574 59413 -356543 -241818 267850 -192596 51378 -20711 -129841
9331 -129841 -77693 -205498 -101043 -322037 -28955 -16598 -162943 -95807 -109102 175168 -436496
9319 -335117 47535 -427902 -145669 -49313 -31642 44882 4809 -130709 74573 169635 -54209
9307 -121556 -153856 -196414 41217 -85124 -33125 -159123 -69986 -17374 -155623 215486 -208628
9295 178943 98830 -297227 190126 -142417 -194790 19621 209820 -263139 52984 3326 244630
9284 244630 -41311 -159420 36069 -117402 -419277 -195944 -223199 4584 120093 -62691 55129
9272 -206550 -162982 -323978 -26483 88450 142248 -48282 73749 -9543 144483 136293 153852 -213407
$$ packed form
9354c57231L5721M4643I9939b40411B13781k1400J81370A37143d9839B07376a92838
9342a16539A69352c9222H1574k2161c56543J14725B67850a92596E1378b0711j09130
9331a29841N2148j27805a01043k20994b8955J2357j46345O7136j3295A75168d36496
9319c35117D7535d27902a45669d9313J7671D4882D809a30709G4573R5062e4209
9307a21556l2300m2558D1217h5124c3125j25998f9986a7374j38249B15486b08628
9295A78943q0113b97227A90126a42417n2373A9621J90199b63139E2984C326K41304
9284B44630d1311j18109C6069a17402l01875a95944k7255D584J15509f2691E5129
9272b06550M3568j60996b6483H8450N3798d8282G3749i543A44483q190J7559b13407
$$ plain form
9259 279386 -93567 -385589 -86003 -119406 -8277 -129681 -27944 -182710 -336286 88469 92193
9248 92193 81933 -259821 134004 20252 70395 -171842 152535 -132692 41694 -310704 -99340
9236 -45830 -19835 109291 -104340 -204462 -246272 -233478 -264729 142001 -227238 -175396 56686
9224 -137290 -70727 -46389 117531 178957 140574 -148536 713 -1288 174726 -6508 176265 -43123
9211 -98227 395524 52782 -90108 223158 -132075 -128545 285953 304539 6097 83713 -78258
9199 -310721 -309331 27746 -1951 353088 -302950 -165589 -217582 45442 -14268 171477 118074
9188 118074 97496 -277547 -202822 -172409 -170127 -360991 -239231 56156 276499 67302 -118619
9176 -114195 -331865 -57301 46176 -255872 -82384 -277463 -101355 -188241 255 -305438 69487
$$ packed form
9259B79386i3567k92022h6003l3403h277j21404b7944j54766j53576H8469L724
9248I2193j0260b59821A34004B0252N0143a71842A52535a32692D1694c10704i9340
9236d5830a9835A09291a04340j00122m1810J2794l1251A42001b27238N1842E6686
9224a37290O6563K4338A17531O1426l8383a48536G13a288A74726f508A76265d3123
9211i8227C95524E2782i0108B23158a32075L530B85953J8586F097P7616g8258
9199c10721J390B7746a951C53088c02950J37361n1993D5442a4268A71477n3403
9188A18074k0578b77547P4725L0413K282j90864J21760E6156K20343F7302a18619
9176a14195k17670e7301D6176b55872h2384j95079a01355q6886B55c05438F9487
$$ plain form
9164 -245645 -224008 350429 -42830 -101960 400982 49649 74176 -292072 -119461 326947 69030
9152 -193115 -286544 -326017 -28448 274714 -257094 -171460 -116717 221852 -237565 -196299 -53896
9140 152697 -183735 -56565 -55118 -78342 -315723 256466 58489 -300625 -75415 57845 -199174
9128 -354463 -5894 -215805 146626 109725 39606 175913 109538 -143085 -34679 -86010 -71673
9117 -71673 -41342 -71449 -182156 -317749 -212630 -285354 -101974 193548 43755 -106164 -156333
9106 -156333 -57915 -118948 -266793 87923 -399361 63470 -131442 -163464 -103526 -73628 38088
9094 -157066 -137065 178844 41008 -164398 -290959 -175440 -182384 -100193 -183676 -46729 223238
9082 23842 -68773 -54737 -232583 -295969 -136073 -70810 -181900 21929 212868 90978 -142961
$$ packed form
9164b45645K1637C50429d2830n9130D00982D9649K4527b92072a19461C26947F9030
9152a93115r3429l9473b8448B74714b57094Q5634N4743B21852b37565M1266e3896
9140A52697a83735e6565J447k3224k37381B56466E8489c00625g5415E7845a99174
9128c54463e894k09911A46626l6901C9606J36307o6375a43085c4679n1331J4337
9117g1673L0331l0107j10707j35593J05119p2724a01974A93548D3755a06164n0169
9106a56333e7915o1033j47845H7923c99361F3470a31442l2022N9938K9898C8088
9094a57066K0001A78844D1008a64398j26561J15519o944Q2191q3483d6729B23238
9082B3842f8773J4036j77846o3386a36073O5263j11090B1929J90939I0978a42961
$$ plain form
9070 202113 50857 -99814 93122 -43037 117923 -324755 -316432 -183994 17547 -60864 82039
9058 191118 113439 -117377 -314073 -145647 -54206 167885 -247240 125932 -155478 23749
9047 81137 -353514 101125 -185099 -228865 17180 -107075 25006 53343 -112194 -70287 110463
9035 -1727 -115563 -47830 233645 28585 -356667 -109620 -93924 379433 307301 -371831 -197170
9024 -197170 -232921 25946 74360 72874 167302 -31470 2090 -240496 125454 52900 20838 -87388
9011 -146955 25316 -367518 -51642 -79024 74889 -149538 -84918 -61716 88557 -97743 -72004
9000 -72004 -178192 -44757 -54358 -406263 -50887 -33352 122702 -81356 -305933 43680 16747
8988 -400653 -145520 -126180 -182601 188390 239378 -341309 -44120 -149901 -63606 25984 244
$$ packed form
9070B02113E0857i9814I3122d3037A17923c24755Q323J32438A7547f0864H2039
9058A91118p7679a17377j96696a45647e4206A67885b47240A25932a55478B3749
9047H1137c53514A01125a85099m3766A7180a07075B5006K8337a12194M1907A10463
9035a727j13836d7830B33645B8585c56667a09620J5696C79433p2132c71831J74661
9024a97170l5751B5946M8414j486R4428c1470B090b40496A25454E2900B0838h7388
9011a46955B5316c67518e1642k7382G4889a49538O4620K3202H8557i7743K5739
9000g2004j06188d4757r601l51905e0887J7535A22702h1356k24577D3680A6747
8988d00653a45520J9340n6421A88390N0988c41309d4120j05781f3606B5984B44
$$ plain form
8976 -65566 -121158 89969 73000 292916 -272109 -322434 91261 12477 -68938 263528 -104511
8964 -273340 11957 -252086 -378829 -67319 79662 -222512 -185598 -11390 -133332 -111422 -146086
8953 -146086 -69814 -110985 4476 -95522 23880 20173 -182520 -224579 -206749 108687 -159150
8941 58927 -197974 20503 120950 28977 341321 46736 190934 203335 -32942 69162 238006
8930 238006 -222852 287209 223414 126020 455936 742878 1448872 3290921 4448510 6370367
8920 6370367 2112487 935970 296623 1982 44880 -145788 1524 -152104 -7757 44787 -110367
8908 204060 -119525 -39579 -55102 -117038 -41919 -137422 -242155 158797 -145613 -113329 -51830
8896 22145 132427 -244896 -289590 -97749 -131515 -287165 9970 -196134 -140319 101417 51752
$$ packed form
8976f5566n5592H9969j6969K19916b72109n0325I1261A2477f8938B63528a04511
8964b73340A1957b52086j26743f7319G9662b22512L6914a1390j21942K1910l4664
8953a46086f9814m1171D476i5522B3880l707a82520m2059J7830A08687a59150
8941E8927a97974B0503J00447B8977L12344D6736J44198J2401c2942F9162J68844
8930B38006b22852B87209o3795r7394L29916K86942P05994J842049J157589J921857
8920F370367B112487I35970B96623A982M2898a45788A524a52104g757D4787a10367
8908B04060a19525c9579j5523o1936d1919r5503j04733A58797a45613L2284e1830
8896B2145J10282b44896m4694i7749l3766j55650I970a96134N5815A01417m9665
$$ plain form
8885 51752 -4001 -346306 -38587 56952 -24216 4507 -163167 -163860 306338 -26172 -84962 -211611
8873 -211611 206458 -169275 -139266 152063 247612 -49093 -30909 130310 -164175 87264 -88710
8861 -92339 -212685 -231642 39472 -56215 -218646 -234862 2117 29430 170964 -76472 -197263
8850 -197263 -112471 -218500 -140782 -204762 -9744 21808 -171434 -263795 10178 -21099 -11119 -398383
$$ packed form
8885E1752d001l42305c8587E6952b4216D507a63167o93C06338b6172n8790j26649
8873b11611B06458a69275L0009A52063R5549d9093J8184A30310a64175H7264h8710
8861i2339j20346j8957C9472e6215j62431j6216B117K7313J41534g6472j20791
8850a97263Q4792j06029P7718o3980i744B1808a71434r2361A0178b1099R980l87264
$$ [...]
##END NTUPLES=NMR SPECTRUM
##END=
