##TITLE=AC1658_NARAH14394_8531691_RW0Km1pcaJ
##JCAMPDX= 6.0         $$ Bruker NMR JCAMP-DX V2.0
##DATA TYPE= NMR SPECTRUM
##DATA CLASS= NTUPLES
##ORIGIN= BRUKER
##OWNER= Administrator
$$ 1.72 TOPSPIN		Version 2.1
$$ 2014-03-14 17:41:16.255 -0800  Administrator@X
$$ Compression mode = diff/dup
##.OBSERVE FREQUENCY= 400.02188249412
##.OBSERVE NUCLEUS= ^1H
##.ACQUISITION MODE= SIMULTANEOUS (DQD)
##.ACQUISITION SCHEME= undefined
##.AVERAGES= 64
##.DIGITISER RES= 22
##SPECTROMETER/DATA SYSTEM= spect
##.PULSE SEQUENCE= noesygpps1d.comp
##.SOLVENT NAME= COFFEE_meoh
##.SHIFT REFERENCE= INTERNAL, COFFEE_meoh, 1, 14.96104
##AUDIT TRAIL= $$ (NUMBER, WHEN, WHO, WHERE, PROCESS, VERSION, WHAT)
$$ ##TITLE= Audit trail, TOPSPIN		Version 2.1
$$ ##JCAMPDX= 5.01
$$ ##ORIGIN= Bruker BioSpin GmbH
$$ ##OWNER= Administrator
$$ $$ E:\/data/COFFEE/nmr/AC1658_NARAH14394_8531691_RW0Km1pcaJ/12/pdata/1/auditp.txt
$$ ##AUDIT TRAIL=  $$ (NUMBER, WHEN, WHO, WHERE, PROCESS, VERSION, WHAT)
(   1,<2014-03-14 17:41:11.071 -0800>,<Administrator>,<X>,<go>,<TOPSPIN 2.1>,
      <created by zg
	started at 2014-03-14 17:29:41.267 -0800,
	POWCHK enabled, PULCHK disabled,
       configuration hash MD5:
       C8 4E 4E 5D D3 5C D8 9E 9F 52 82 E0 59 8A DE 15
       data hash MD5: 64K
       DE 05 0E F1 95 91 AE 03 98 59 06 37 75 A7 DA DF>)
(   2,<2014-03-14 17:41:14.239 -0800>,<Administrator>,<X>,<proc1d>,<TOPSPIN 2.1>,
      <Start of raw data processing
       efp LB = 0.3 FT_mod = 6 PKNL = 1 PHC0 = 0 PHC1 = 0 SI = 128K 
       data hash MD5: 128K
       CA B8 5C 3A 4E CB AB F9 4E C0 1F 8B B5 8F 64 1B>)
(   3,<2014-03-14 17:41:15.192 -0800>,<Administrator>,<X>,<proc1d>,<TOPSPIN 2.1>,
      <pk PHC0 = -84.47388 PHC1 = 0 
       data hash MD5: 128K
       03 5A 61 BB AD 36 04 3F CF D4 23 51 97 23 9D 2F>)
(   4,<2014-03-14 17:41:15.614 -0800>,<Administrator>,<X>,<proc1d>,<TOPSPIN 2.1>,
      <abs ABSG = 1 
       data hash MD5: 128K
       A8 C9 64 D6 31 27 75 8A B4 4C 8E 85 F0 20 11 01>)
(   5,<2014-03-14 17:41:15.708 -0800>,<Administrator>,<X>,<proc1d>,<TOPSPIN 2.1>,
      <abs ABSG = 2 
       data hash MD5: 128K
       1A CF 9C B2 DC 5E 8D 07 07 BF F5 E8 1F A9 B5 4D>)
(   6,<2014-03-14 17:41:15.802 -0800>,<Administrator>,<X>,<proc1d>,<TOPSPIN 2.1>,
      <abs ABSG = 3 
       data hash MD5: 128K
       0E 83 5F AC 0E C0 D9 E7 31 A8 6C 42 9B 30 D9 A9>)
(   7,<2014-03-14 17:41:15.895 -0800>,<Administrator>,<X>,<proc1d>,<TOPSPIN 2.1>,
      <abs ABSG = 4 
       data hash MD5: 128K
       C4 3E 07 5A 75 92 78 64 E9 15 4D CE 97 9B B4 E0>)
(   8,<2014-03-14 17:41:16.005 -0800>,<Administrator>,<X>,<proc1d>,<TOPSPIN 2.1>,
      <abs ABSG = 5 
       data hash MD5: 128K
       9D ED 63 2B E7 FB 94 5A 2F E9 1F 2F 16 33 8D 17>)
$$ ##END=
$$ 
$$ $$ hash MD5
$$ $$ 06 02 FB 05 C6 13 9C 62 CA 05 47 61 E7 0A 97 2D
##$RELAX= 
##$RELAX= 
##$RELAX= 
##$RELAX= 
##$RELAX= 
##$RELAX= 
##$RELAX= 
##$RELAX= 
$$ Bruker specific parameters
$$ --------------------------
##$DU= <E:\>
##$EXPNO= 12
$$ [...]
##$TP07= 0
##$TPNAME0= <>
##$TPNAME1= <>
##$TPNAME2= <>
##$TPNAME3= <>
##$TPNAME4= <>
##$TPNAME5= <>
##$TPNAME6= <>
##$TPNAME7= <>
##$TPOAL= (0..7)
0.5 0.5 0.5 0.5 0.5 0.5 0.5 0.5
##$TPOFFS= (0..7)
0 0 0 0 0 0 0 0
##$TUNHIN= 0
##$TUNHOUT= 0
##$TUNXOUT= 0
##$USERA1= <user>
##$USERA2= <user>
##$USERA3= <user>
##$USERA4= <user>
##$USERA5= <user>
##$V9= 5
##$VALIST= <valist>
##$VCLIST= <CCCCCCCCCCCCCCC>
##$VD= 0
##$VDLIST= <DDDDDDDDDDDDDDD>
##$VPLIST= <PPPPPPPPPPPPPPP>
##$VTLIST= <TTTTTTTTTTTTTTT>
##$WBST= 1024
##$WBSW= 4
##$XGAIN= (0..3)
0 0 0 0
##$XL= 0
##$YL= 0
##$YMAX_a= 6183871
##$YMIN_a= -13500215
##$ZGOPTNS= <>
##$ZL1= 120
##$ZL2= 120
##$ZL3= 120
##$ZL4= 120
##$ABSF1= 14.96104
##$ABSF2= -5.597142
##$ABSG= 5
##$ABSL= 3
##$ALPHA= 0
##$AQORDER= 0
##$ASSFAC= 0
##$ASSFACI= 0
##$ASSFACX= 0
##$ASSWID= 0
##$AUNMP= <proc_prof1d_extract.lims>
##$AXLEFT= 0
##$AXNAME= <>
##$AXNUC= <1H>
##$AXRIGHT= 0
##$AXTYPE= 0
##$AXUNIT= <>
##$AZFE= 0.1
##$AZFW= 0.1
##$BCFW= 0
##$BC_mod= 0
##$BYTORDP= 0
##$COROFFS= 0
##$CY= 15
##$DATMOD= 1
##$DC= 0
##$DFILT= <>
##$DTYPP= 0
##$F1P= 0
##$F2P= 0
##$FCOR= 0.5
##$FTSIZE= 131072
##$FT_mod= 6
##$GAMMA= 0
##$GB= 0
##$INTBC= 1
##$INTSCL= 1
##$ISEN= 128
##$LB= 0.3
##$LEV0= 0
##$LPBIN= 0
##$MAXI= 10000
##$MC2= 0
##$MEAN= 0
##$ME_mod= 0
##$MI= 0
##$NCOEF= 0
##$NC_proc= -2
##$NLEV= 6
##$NOISF1= 0
##$NOISF2= 0
##$NSP= 0
##$NTH_PI= 0
##$NZP= 0
##$OFFSET= 14.96104
##$PC= 1
##$PHC0= -84.47388
##$PHC1= 0
##$PH_mod= 1
##$PKNL= yes
##$PPARMOD= 0
##$PPDIAG= 0
##$PPIPTYP= 0
##$PPMPNUM= 2147483647
##$PPRESOL= 1
##$PSCAL= 4
##$PSIGN= 0
##$PYNMP= <proc.py>
##$REVERSE= no
##$SF= 400.020009619088
##$SI= 131072
##$SIGF1= 0
##$SIGF2= 0
##$SINO= 400
##$SIOLD= 131072
##$SPECTYP= <>
##$SREGLST= <1H.CDCl3>
##$SSB= 0
##$STSI= 131072
##$STSR= 0
##$SW_p= 8223.68421052631
##$SYMM= 0
##$S_DEV= 0
##$TDeff= 65536
##$TDoff= 0
##$TI= <>
##$TILT= no
##$TM1= 0
##$TM2= 0
##$TOPLEV= 0
##$USERP1= <user>
##$USERP2= <user>
##$USERP3= <user>
##$USERP4= <user>
##$USERP5= <user>
##$WDW= 1
##$XDIM= 131072
##$YMAX_p= 308791962
##$YMIN_p= -12867
##$CURPLOT= <Network HP LaserJet P1505>
##$CURPRIN= <$Network HP LaserJet P1505>
##$DFORMAT= <normdp>
##$LAYOUT= <+/1D_H.xwp>
##$LFORMAT= <normlp>
##$PFORMAT= <normpl>
##$SURQMSG= 1
$$ End of Bruker specific parameters
$$ ---------------------------------
##NTUPLES= NMR SPECTRUM
##VAR_NAME=  FREQUENCY,     SPECTRUM/REAL,   SPECTRUM/IMAG
##SYMBOL=    X,             R,               I
##VAR_TYPE=  INDEPENDENT,   DEPENDENT,       DEPENDENT
##VAR_FORM=  AFFN,          ASDF,            ASDF
##VAR_DIM=   131072,        131072,          131072
##UNITS=     HZ,            ARBITRARY UNITS, ARBITRARY UNITS
##FACTOR=    0.0627417313425164, 1,          1
##FIRST=     8223.62146879497, -2231,        -65221
##LAST=      0,             798,             -66103
##MIN=       0,             -12867,          0
##MAX=       8223.62146879497, 308791962,    0
$$ Real data points
##PAGE= N=1
##DATA TABLE= (X++(R..R)), XYDATA
$$ [...]
$$ plain form
63873 769875 775693 784091 795283 808984 824792 842405 861484 881524 901950 922296 942375 962377
63861 962377 982612 1002868 1022127 1039320 1054276 1067525 1079149 1088406 1094651 1098016 1098794 1096635 1090959
63848 1090959 1081849 1069922 1055452 1038211 1018166 995851 971966 946952 920968 893951 865641
63837 865641 835956 805393 774774 744578 714847 685726 657637 630836 605238 580892 558233
63826 558233 537596 518752 501208 484757 469520 455623 443065 431751 421461 411896 402909 394558
63814 394558 386818 379507 372701 367003 363043 360671 358873 356514 353103 348994 345039 342016 340111 338864
63800 338864 337640 336110 334232 331912 328964 325392 321496 317568 313636 309621 305717 302415 300113 298726
63786 298726 297775 296808 295646 294284 292774 291283 290090 289297 288629 287749 286713 285912 285575 285551 285570 285448 284987
$$ packed form
63873G69875N818Q398J1192J3701J5808J7613J9079K0040K0426K0346K0079K0002
63861I62377K0235K0256J9259J7193J4956J3249J1624R257O245L365P78k159n676
63848A090959r110j1927j4470j7241k0045k2315k3885k5014k5984k7017k8310
63837H65641k9685l0563l0619l0196k9731k9121k8089k6801k5598k4346k2659
63826E58233k0637j8844j7544j6451j5237j3897j2558j1314j0290r565q987q351
63814C94558p740p311o806n698l960k372j798k359l411m109l955l023j905j247
63800C38864j224j530j878k320k948l572l896l928l932m015l904l302k302j387
63786B98726r51r67j162j362j510j491j193p93o68q80j036q01l37k4J9j22m61
$$ plain form
63769 284987 283989 282566 281167 280122 279295 278402 277452 276629 275875 274928 273781 272822 272411 272511 272814 273109 273406
63752 273406 273805 274367 275099 275993 277044 278232 279534 280977 282646 284545 286482 288241 289939 292064 295005
63737 295005 298621 302451 306248 310078 313881 317248 319797 321641 323302 325254 327697 330694 334238 338088
63723 338088 341828 345291 348829 352933 357518 361832 365143 367427 369212 370853 372199 373020 373500 374063 374710
63708 374710 374867 374073 372673 371536 371109 371026 370752 370279 369941 369816 369765 369946 370805 372451 374458 376477 378671
63691 378671 381227 383744 385527 386352 386603 386765 387075 387577 388090 388137 387314 385894 384777 384630 385285 386094 386689
63674 386689 387213 387964 389024 390202 391168 391640 391549 391069 390471 389927 389351 388440 386968 385123 383405 382067 380744
63657 380744 378862 376330 373578 370907 368146 365045 361778 358829 356536 354910 353771 352886 352011 350993 349971
$$ packed form
63769B84987r98j423j399j045q27q93r50q23p54r47j147r59m11J00L03K95K97
63752B73406L99N62P32Q94J051J188J302J443J669J899J937J759J698K125K941
63737B95005L616L830L797L830L803L367K549J844J661J952K443K997L544L850
63723C38088L740L463L538M104M585M314L311K284J785J641J346Q21M80N63O47
63708C74710J57p94j400j137m27q3k74m73l38j25n1J81Q59J646K007K019K194
63691C78671K556K517J783Q25K51J62L10N02N13M7q23j420j117j47O55Q09N95
63674C86689N24P51J060J178R66M72r1m80n98n44n76r11j472j845j718j338j323
63657C80744j882k532k752k671k761l101l267k949k293j626j139q85q75j018j022
$$ plain form
63642 349971 349422 349912 351634 354164 356825 359383 362267 365973 370442 375275 380419 386243 392923 400132 407504
63627 407504 415081 423134 431751 440864 450523 461011 472756 486180 501369 517736 534331 550795
63615 550795 567835 586390 606410 626901 647177 667659 689143 711597 734066 755737 776633
63604 776633 797073 816683 834330 849019 860569 869344 875549 878960 879173 875941 869442 860347 849523
63591 849523 837503 824435 810609 796665 782891 768685 753196 736385 718968 701498 684100
63580 684100 667034 650780 635453 620869 607473 596457 588525 583019 578756 575294 572952 572080 572880
63567 572880 575519 579790 584864 589983 595231 601146 607898 615416 624063 634334 645981 658248 671124
63554 671124 685663 702808 722449 743830 766306 789440 812898 836649 860966 885925 911171
$$ packed form
63642C49971n49M90J722K530K661K558K884L706M469M833N144N824O680P209P372
63627D07504P577Q053Q617R113R659J0488J1745J3424J5189J6367J6595J6464
63615E50795J7040J8555K0020K0491K0276K0482K1484K2454K2469K1671K0896
63604G76633K0440J9610J7647J4689J1550Q775O205L411K13l232o499r095j0824
63591H49523j2020j3068j3826j3944j3774j4206j5489j6811j7417j7470j7398
63580F84100j7066j6254j5327j4584j3396j1016p932n506m263l462k342q72Q00
63567E72880K639M271N074N119N248N915O752P518Q647J0271J1647J2267J2876
63554F71124J4539J7145J9641K1381K2476K3134K3458K3751K4317K4959K5246
$$ plain form
63543 911171 936309 961024 984535 1005367 1022095 1034047 1040982 1042436 1037991 1028109 1014286 998338
63531 998338 981671 964957 948151 930815 912695 893945 874619 854191 831928 807655 781820
63520 781820 754901 727171 699093 671523 645265 620631 597589 576197 556642 538986 523063
63509 523063 508689 495841 484546 474608 465625 457336 449878 443491 438088 433339 429173 425796 423092
63496 423092 420472 417605 414936 413056 411865 410928 410450 411132 412938 414746 415612 415875 416562 418067 419972 421937
63480 421937 424127 426724 429500 432091 434439 436737 439053 441127 442477 442762 442113 441125 440374 439913 439343 438261
63464 438261 436529 434228 431657 429381 427976 427595 427968 428818 430068 431596 433171 434857 437192 440680 445253
63449 445253 450500 456307 462980 470802 479753 489615 500118 510982 522094 533708 546286 560147 575472
$$ packed form
63543I11171K5138K4715K3511K0832J6728J1952O935J454m445r882j3823j5948
63531I98338j6667j6714j6806j7336j8120j8750j9326k0428k2263k4273k5835
63520G81820k6919k7730k8078k7570k6258k4634k3042k1392j9555j7656j5923
63509E23063j4374j2848j1295r938q983q289p458o387n403m749m166l377k704
63496D23092k620k867k669j880j191r37m78O82J806J808Q66K63O87J505J905J965
63480D21937K190K597K776K591K348K298K316K074J350K85o49r88p51m61n70j082
63464D38261j732k301k571k276j405l81L73Q50J250J528J575J686K335L488M573
63449D45253N247N807O673P822Q951R862J0503J0864J1112J1614J2578J3861J5325
$$ plain form
63436 575472 592542 611626 632478 654325 676666 699857 724563 750615 776689 801214 823457
63425 823457 843638 862180 879113 894322 908132 921393 934952 949289 964655 981236 998937
63414 998937 1017230 1035564 1053741 1071527 1087982 1101668 1111561 1117421 1119223 1116725 1109856 1099098
63402 1099098 1085195 1068756 1050430 1031090 1011377 991176 969918 947348 923658 899014 873390
63391 873390 846875 819831 792702 765999 740492 717012 695902 676873 659557 643972 630325
63380 630325 618655 608954 601459 596526 594235 594367 596782 601540 608599 617590 628094 639991 653309
63367 653309 667841 683231 699481 717044 736192 756585 777736 799694 822824 847073 871942
63356 871942 897199 922989 949085 974511 998317 1020278 1040483 1058537 1073621 1085027 1092149 1094284
$$ packed form
63436E75472J7070J9084K0852K1847K2341K3191K4706K6052K6074K4525K2243
63425H23457K0181J8542J6933J5209J3810J3261J3559J4337J5366J6581J7701
63414I98937J8293J8334J8177J7786J6455J3686R893N860J802k498o869j0758
63402A099098j3903j6439j8326j9340j9713k0201k1258k2570k3690k4644k5624
63391H73390k6515k7044k7129k6703k5507k3480k1110j9029j7316j5585j3647
63380F30325j1670r701p495m933k291J32K415M758P059Q991J0504J1897J3318
63367F53309J4532J5390J6250J7563J9148K0393K1151K1958K3130K4249K4869
63356H71942K5257K5790K6096K5426K3806K1961K0205J8054J5084J1406P122K135
$$ plain form
63344 1094284 1091130 1083434 1072558 1059352 1043960 1026754 1008739 990684 972317 952835 931938 910020
63332 910020 887479 864277 840224 815507 790818 767008 744642 723948 705163 688696 674717
63321 674717 662741 651962 641969 632818 624428 616298 607953 599261 590078 579814 567648 553197 536954
63308 536954 520217 504522 490829 479096 468813 459876 452577 446773 441637 436503 431544 427291 423836
63295 423836 420921 418452 416414 414480 412189 409439 406414 403122 399470 395781 392732 390652 389295 388430
63281 388430 388241 388829 389634 389779 388946 387689 386837 386723 386988 387023 386628 386272 386679 388082 389944 391522 392735
63264 392735 394311 397015 400827 405014 408968 412734 416717 421147 426051 431542 437712 444294 450790 457125
63250 457125 463839 471455 479941 489058 498978 510112 522367 535004 547427 559862 573096 587748
$$ packed form
63344A094284l154p696j0876j3206j5392j7206j8015j8055j8367j9482k0897k1918
63332I10020k2541k3202k4053k4717k4689k3810k2366k0694j8785j6467j3979
63321F74717j1976j0779r993r151q390q130q345q692r183j0264j2166j4451j6243
63308E36954j6737j5695j3693j1733j0283q937p299n804n136n134m959m253l455
63295D23836k915k469k038j934k291k750l025l292l652l689l049k080j357q65
63281C88430j89N88Q05J45q33j257q52j14K65L5l95l56M07J403J862J578J213
63264C92735J576K704L812M187L954L766L983M430M904N491O170O582O496O335
63250D57125O714P616Q486R117R920J1134J2255J2637J2423J2435J3234J4652
$$ plain form
63238 587748 604002 621889 641445 662496 684606 707520 731523 757068 783990 811366 838251
63227 838251 864382 890116 915960 942290 969189 996167 1022233 1046641 1069491 1091314 1112254
63216 1112254 1132070 1150728 1168359 1184628 1198787 1210487 1219928 1226975 1230769 1230603 1226647 1219304 1208328
63203 1208328 1193232 1174305 1152604 1129022 1103886 1077412 1050140 1022900 996706 972628 951416
63192 951416 933303 918332 906680 898347 892816 889524 888514 890147 894357 900822 909757 921795 936842
63179 936842 953671 970924 988104 1005325 1022530 1039443 1055993 1072313 1088231 1102994 1115596
63168 1115596 1125435 1132738 1138227 1142193 1143966 1142587 1137925 1130752 1121676 1110378 1096092 1078503 1057948
63155 1057948 1034934 1009729 982464 953572 924038 895032 867135 840194 814132 789591 767333
$$ packed form
63238E87748J6254J7887J9556K1051K2110K2914K4003K5545K6922K7376K6885
63227H38251K6131K5734K5844K6330K6899K6978K6066K4408K2850K1823K0940
63216A112254J9816J8658J7631J6269J4159J1700R441P047L794j66l956p343j0976
63203A208328j5096j8927k1701k3582k5136k6474k7272k7240k6194k4078k1212
63192I51416j8113j4971j1652q333n531l292j010J633M210O465Q935J2038J5047
63179I36842J6829J7253J7180J7221J7205J6913J6550J6320J5918J4763J2602
63168A115596R839P303N489L966J773j379m662p173r076j1298j4286j7589k0555
63155A057948k3014k5205k7265k8892k9534k9006k7897k6941k6062k4541k2258
$$ plain form
63144 767333 747270 728766 711773 696951 684544 673873 664261 655861 649219 644482 641326 639242 637617
63131 637617 636106 635259 636219 639326 643494 647489 651284 655567 660411 665299 670124 675262 680638 685604 689881
63116 689881 693946 698230 702455 706012 708585 710202 711033 711382 711601 711812 711928 711967 712085 712198 711934 711099 709940
63099 709940 708818 707818 706800 705695 704647 704015 704147 704981 705973 706704 707472 708861 710847 712849 714705 716993
63083 716993 720163 723900 727718 731750 736465 741897 747636 753484 759758 766986 775566 785628 796980 809264
63069 809264 822429 836970 853528 872359 893311 916071 940161 965006 990563 1017833 1048233
63058 1048233 1082234 1118965 1157341 1197321 1239867 1285935 1335763 1389008 1445157 1503670 1563955
63047 1563955 1625495 1688070 1751766 1816594 1882068 1947224 2011136 2073341 2133728 2192092 2247943
$$ packed form
63144G67333k0063j8504j6993j4822j2407j0671r612q400o642m737l156k084j625
63131F37617j511q47R60L107M168L995L795M283M844M888M825N138N376M966M277
63116F89881M065M284M225L557K573J617Q31L49K19K11J16L9J18J13k64q35j159
63099G09940j122j000j018j105j048o32J32Q34R92P31P68J389J986K002J856K288
63083G16993L170L737L818M032M715N432N739N848O274P228Q580J0062J1352J2284
63069H09264J3165J4541J6558J8831K0952K2760K4090K4845K5557K7270L0400
63058A048233L4001L6731L8376L9980M2546M6068M9828N3245N6149N8513O0285
63047A563955O1540O2575O3696O4828O5474O5156O3912O2205O0387N8364N5851
$$ plain form
63036 2247943 2300699 2349958 2395570 2437577 2476077 2510928 2541481 2566694 2585687 2598155 2604172
63025 2604172 2603571 2595669 2579577 2554732 2521101 2479091 2429512 2373623 2312971 2249010 2182938 2116007
63013 2116007 2049828 1986170 1926458 1871620 1822401 1779630 1744019 1715774 1694492 1679508 1670393
63002 1670393 1667161 1669876 1678021 1690469 1706247 1725197 1747557 1773003 1800501 1829069 1858180 1887233
62990 1887233 1915160 1941029 1964783 1986868 2007236 2025113 2039780 2051122 2059196 2063476 2062814 2056196
62978 2056196 2043508 2025456 2002589 1974448 1939940 1898721 1851928 1801297 1747852 1691873 1633938
62967 1633938 1575381 1517583 1461260 1406671 1354148 1304140 1256861 1212156 1169683 1129255 1091075
62956 1091075 1055608 1023021 992828 964398 937759 913419 891280 870216 849084 827860 807453
$$ packed form
63036B247943N2756M9259M5612M2007L8500L4851L0553K5213J8993J2468O017
63025B604172o01p902j6092k4845l3631m2010m9579n5889o0652o3961o6072o6931
63013B116007o6179o3658n9712n4838m9219m2771l5611k8245k1282j4984r115
63002A670393l232K715Q145J2448J5778J8950K2360K5446K7498K8568K9111K9053
62990A887233K7927K5869K3754K2085K0368J7877J4667J1342Q074M280o62o618
62978B056196j2688j8052k2867k8141l4508m1219m6793n0631n3445n5979n7935
62967A633938n8557n7798n6323n4589n2523n0008m7279m4705m2473m0428l8180
62956A091075l5467l2587l0193k8430k6639k4340k2139k1064k1132k1224k0407
$$ plain form
62945 807453 788631 771491 755796 741375 728163 716130 705230 695342 686361 678411 671734 666159
62933 666159 660960 655597 650374 645982 642535 639530 636641 633999 631639 629226 626536 623773 621116 618311
62919 618311 615057 611522 608096 604794 601237 597288 593386 590138 587700 585642 583436 581008 578715 576795
62905 576795 575041 573159 571201 569360 567474 565205 562687 560510 558945 557629 556202 554815 553752 552955
62891 552955 552301 551966 552047 552084 551498 550386 549384 548799 548326 547653 546884 546272 545946 546046 546803 548214 549799 550843
62873 550843 550895 550044 548869 548048 547792 547645 546994 545676 543991 542337 541114 540738 541232 541921 542063 541806 541967
62856 541967 542805 543634 543866 543831 544165 544895 545586 546031 546297 546326 545985 545311 544348 542983 541307 539945 539503 539789
62838 539789 540012 539685 538972 538282 537976 538354 539461 540850 541990 542921 544095 545612 547148 548668 550661 553451
$$ packed form
62945H07453j8822j7140j5695j4421j3212j2033j0900r888q981p950o677n575
62933F66159n199n363n223m392l447l005k889k642k360k413k690k763k657k805
62919F18311l254l535l426l302l557l949l902l248k438k058k206k428k293j920
62905E76795j754j882j958j841j886k269k518k177j565j316j427j387j063p97
62891E52955o54l35Q1L7n86j112j002n85m73o73p69o12l26J00P57J411J585J044
62873E50843N2q51j175q21k56j47o51j318j685j654j223l76M94O89J42k57J61
62856E41967Q38Q29K32l5L34P30O91M45K66K9l41o74r63j365j676j362m42K86
62838E39789K23l27p13o90l06L78J107J389J140R31J174J517J536J520J993K790
$$ plain form
62822 553451 556760 560207 563829 567752 571711 575338 578714 582314 586457 591095 596104 601586 607806 614835
62808 614835 622213 629203 635689 642697 651476 661978 672830 683063 693292 704810 718104 732919
62796 732919 749344 768017 789281 812853 838411 866003 895827 928200 963787 1003301 1046720
62785 1046720 1093300 1142650 1195430 1252695 1314845 1381454 1451732 1524774 1599637 1675657 1752670
62774 1752670 1830606 1908909 1986521 2062322 2135327 2204463 2268353 2325270 2373225 2410362 2435580
62763 2435580 2448691 2449718 2438138 2413145 2374730 2324235 2263804 2195434 2120508 2039977 1954860
62752 1954860 1866673 1777366 1688674 1601566 1516539 1434398 1356440 1283789 1216806 1155231 1098631
62741 1098631 1046575 998725 955057 915839 881142 850479 823152 798781 777247 758284 741527
$$ packed form
62822E53451L309L447L622L923L959L627L376L600M143M638N009N482O220P029
62808F14835P378O990O486P008Q779J0502J0852J0233J0229J1518J3294J4815
62796G32919J6425J8673K1264K3572K5558K7592K9824L2373L5587L9514M3419
62785A046720M6580M9350N2780N7265O2150O6609P0278P3042P4863P6020P7013
62774A752670P7936P8303P7612P5801P3005O9136O3890N6917M7955L7137K5218
62763B435580J3111J027j1580k4993l8415n0495o0431o8370p4926q0531q5117
62752A954860q8187q9307q8692q7108q5027q2141p7958p2651o6983o1575n6600
62741A098631n2056m7850m3668l9218l4697l0663k7327k4371k1534j8963j6757
$$ plain form
62730 741527 726954 714835 705085 696968 689633 682788 676721 671884 668682 667483 668535 671793 676961 683694
62716 683694 691705 700858 711300 723462 737773 754478 773883 796566 822934 852558 884348 917594
62704 917594 952541 989826 1029711 1072197 1117501 1165820 1216715 1269316 1323285 1379042 1436727
62693 1436727 1495366 1553483 1610242 1665474 1718666 1768491 1813445 1852495 1884886 1909594 1925368
62682 1925368 1931263 1926935 1912465 1888088 1854168 1811344 1760602 1703224 1640692 1574634 1506723 1438430
62670 1438430 1370721 1304127 1239228 1176876 1117778 1062047 1009519 960460 915481 874686 837440
62659 837440 803239 772415 745530 722367 701920 683279 666094 650333 636006 623130 611550
62648 611550 600782 590431 580781 572549 565899 560114 554417 548740 543482 538879 534967 531877 529754 528494
$$ packed form
62730G41527j4573j2119r750q117p335o845o067m837l202j199J052L258N168O733
62716F83694Q011R153J0442J2162J4311J6705J9405K2683K6368K9624L1790L3246
62704I17594L4947L7285L9885M2486M5304M8319N0895N2601N3969N5757N7685
62693A436727N8639N8117N6759N5232N3192M9825M4954L9050L2391K4708J5774
62682A925368N895m328j4470k4377l3920m2824n0742n7378o2532o6058o7911o8293
62670A438430o7709o6594o4899o2352n9098n5731n2528m9059m4979m0795l7246
62659H37440l4201l0824k6885k3163k0447j8641j7185j5761j4327j2876j1580
62648F11550j0768j0351r650q232o650n785n697n677n258m603l912l090k123j260
$$ plain form
62634 528494 527807 527470 527287 526971 526314 525345 524090 522323 519907 517282 515273 514367 514454 515235 516586 518438 520628
62617 520628 523028 525695 528814 532645 537557 543909 551765 560819 570630 580906 591624 603115 616012
62604 616012 630880 647800 666465 686681 708521 731953 756650 782388 809468 838504 869833
62593 869833 903234 938114 973891 1010323 1047515 1085416 1123205 1159409 1192798 1222952 1249762
62582 1249762 1272613 1290358 1301944 1306780 1304673 1295812 1280780 1260280 1234842 1205017 1171698 1135824
62570 1135824 1097844 1058006 1017211 976984 938338 901227 865487 831765 800926 772952 747114
62559 747114 723105 701295 681846 664352 648550 634746 623101 613006 603676 595072 587711 581734
62547 581734 576691 572239 568538 565814 563837 562042 560063 558069 556621 556240 556987 558506 560491 562961 565977
$$ packed form
62634E28494o87l37j83l16o57r69j255j767k416k625k009r06Q7P81J351J852K190
62617E20628K400K667L119L831M912O352P856R054R811J0276J0718J1491J2897
62604F16012J4868J6920J8665K0216K1840K3432K4697K5738K7080K9036L1329
62593H69833L3401L4880L5777L6432L7192L7901L7789L6204L3389L0154K6810
62582A249762K2851J7745J1586M836k107q861j5032k0500k5438k9825l3319l5874
62570A135824l7980l9838m0795m0227l8646l7111l5740l3722l0839k7974k5838
62559G47114k4009k1810j9449j7494j5802j3804j1645j0095r330q604p361n977
62547E81734n043m452l701k724j977j795j979j994j448l81P47J519J985K470L016
$$ plain form
62532 565977 569325 572762 576437 580719 585806 591964 600003 610817 624288 639251 654918 671862 691177
62519 691177 713079 736847 761855 788112 815983 845966 878646 914241 952031 990693 1029393
62508 1029393 1068275 1107808 1148032 1188465 1228326 1266648 1302550 1335689 1366206 1394052 1418653
62497 1418653 1439495 1456779 1471222 1483442 1493857 1503097 1512182 1522246 1534186 1548416 1564782 1582836
62485 1582836 1602396 1623718 1646937 1671501 1696475 1721299 1745783 1769213 1789771 1805080 1813293
62474 1813293 1813596 1805919 1790440 1767393 1737073 1699755 1655547 1604447 1546789 1483737 1417246 1349437
62462 1349437 1281958 1215876 1152001 1091154 1034105 981322 932872 888697 849103 814831 786389
62451 786389 763299 744281 728286 715086 704769 697019 691212 686946 684086 682408 681615 681664 682721 684692
$$ packed form
62532E65977L348L437L675M282N087O158Q039J0814J3471J4963J5667J6944J9315
62519F91177K1902K3768K5008K6257K7871K9983L2680L5595L7790L8662L8700
62508A029393L8882L9533M0224M0433L9861L8322L5902L3139L0517K7846K4601
62497A418653K0842J7284J4443J2220J0415R240R085J0064J1940J4230J6366J8054
62485A582836J9560K1322K3219K4564K4974K4824K4484K3430K0558J5309Q213
62474A813293L03p677j5479k3047l0320l7318m4208n1100n7658o3052o6491o7809
62462A349437o7479o6082o3875o0847n7049n2783m8450m4175l9594l4272k8442
62451G86389k3090j9018j5995j3200j0317p750n807m266k860j678p93M9J057J971
$$ plain form
62437 684692 687084 689340 691077 692000 691982 691304 690458 689374 687084 682434 675169 666166 656674 647444 638489
62422 638489 629469 620148 610564 600906 591449 582588 574658 567534 560621 553571 546872 541302 536892 532939
62408 532939 529139 526119 524478 523786 523085 522087 521272 520909 520646 520226 520032 520580 521829 523383 525233 527858
62392 527858 531600 536167 540857 545134 548975 552817 557245 562627 568911 575718 582628 589409 596079 602896
62378 602896 610300 618690 628113 638284 649051 660795 674168 689395 706038 723534 741781 761108
62366 761108 781870 804368 828985 855978 885075 915585 947103 979895 1014446 1050812 1088629
62355 1088629 1127543 1167282 1207302 1246700 1284659 1320821 1354958 1386269 1413194 1434077 1447985
62344 1447985 1454866 1455097 1449166 1437802 1421965 1402367 1379174 1352541 1323313 1292758 1261643 1230028
$$ packed form
62437F84692K392K256J737R23j8o78q46j084k290m650p265r003r492r230q955
62422F38489r020r321r584r658r457q861p930p124o913p050o699n570m410l953
62408E32939l800l020j641o92p01r98q15l63k63m20j94N48J249J554J850K625
62392E27858L742M567M690M277L841L842M428N382O284O807O910O781O670O817
62378F02896P404Q390R423J0171J0767J1744J3373J5227J6643J7496J8247J9327
62366G61108K0762K2498K4617K6993K9097L0510L1518L2792L4551L6366L7817
62355A088629L8914L9739M0020L9398L7959L6162L4137L1311K6925K0883J3908
62344A447985O881K31n931j1364j5837j9598k3193k6633k9228l0555l1115l1615
$$ plain form
62332 1230028 1198052 1166318 1135247 1104625 1074329 1045095 1017863 992537 968085 943963 920736
62321 920736 899053 878582 858433 838267 818472 799319 780484 761596 743008 725783 710815
62310 710815 698070 686771 676313 666832 658811 652465 647816 645121 644669 646042 648144 650229 652536 655614
62296 655614 659424 663570 668216 674189 682078 691488 701246 710220 718067 725354 732905 740846 748538 755565
62282 755565 762386 769475 776186 781316 784847 788291 792936 798436 803616 808170 812923 818740 825846 834172
62268 834172 843730 854536 866571 880056 895569 913778 935166 959863 987488 1017273 1048672 1081884
62256 1081884 1117482 1155576 1195689 1237354 1280240 1323433 1365067 1403111 1436386 1464528 1487169
62245 1487169 1503543 1512897 1515015 1510202 1498858 1481182 1457377 1428120 1394631 1357956 1318272 1275332
$$ packed form
62332A230028l1976l1734l1071l0622l0296k9234k7232k5326k4452k4122k3227
62321I20736k1683k0471k0149k0166j9795j9153j8835j8888j8588j7225j4968
62310G10815j2745j1299j0458r481q021o346m649k695m52J373K102K085K307L078
62296F55614L810M146M646N973P889R410R758Q974P847P287P551P941P692P027
62282G55565O821P089O711N130L531L444M645N500N180M554M753N817P106Q326
62268H34172R558J0806J2035J3485J5513J8209K1388K4697K7625K9785L1399L3212
62256A081884L5598L8094M0113M1665M2886M3193M1634L8044L3275K8142K2641
62245A487169J6374R354K118m813j1344j7676k3805k9257l3489l6675l9684m2940
$$ plain form
62233 1275332 1229675 1182938 1136738 1091685 1047896 1006067 967427 932750 901934 874526 850108
62222 850108 828160 808148 790068 774476 761651 750985 741523 732898 725438 719410 714484 709989 705544
62209 705544 701341 697797 695043 692942 691689 692024 694392 698055 701708 705070 709221 715010 721778 728297
62195 728297 734474 741280 749188 757590 765845 773988 782113 789881 797275 805230 814670 825253 835862 846243
62181 846243 857239 869295 881615 893244 904316 915572 927170 938729 950287 962363 975098
62170 975098 988223 1002177 1018426 1038058 1060558 1084641 1109929 1137027 1166021 1195687 1224442
62159 1224442 1251483 1276648 1299620 1319699 1336106 1348107 1354986 1356326 1352367 1343823 1331332 1315226
62147 1315226 1295882 1274027 1250519 1225804 1199718 1171989 1143061 1114349 1087472 1063194 1041269
$$ packed form
62233A275332m5657m6737m6200m5053m3789m1829l8640l4677l0816k7408k4418
62222H50108k1948k0012j8080j5592j2825j0666r462q625p460o028m926m495m445
62209G05544m203l544k754k101j253L35K368L663L653L362M151N789O768O519
62195G28297O177O806P908Q402Q255Q143Q125P768P394P955R440J0583J0609J0381
62181H46243J0996J2056J2320J1629J1072J1256J1598J1559J1558J2076J2735
62170I75098J3125J3954J6249J9632K2500K4083K5288K7098K8994K9666K8755
62159A224442K7041K5165K2972K0079J6407J2001O879J340l959q544j2491j6106
62147A315226j9344k1855k3508k4715k6086k7729k8928k8712k6877k4278k1925
$$ plain form
62136 1041269 1021317 1003488 988103 974973 963423 952894 943301 934858 927785 922061 917227 912521
62124 912521 907519 902592 898516 895667 893857 892836 892592 893096 894160 895675 897693 900148 902769 905450 908390
62109 908390 911621 914627 916763 917908 918446 918667 918401 917208 914757 911109 906878 903065 900488 899335 899413
62094 899413 900670 903164 906540 909982 912904 915455 918135 921153 924457 928243 933032 939196 946655 955187
62080 955187 964828 975804 988209 1001943 1016905 1033018 1050029 1067484 1085066 1102882 1121297 1140500
62068 1140500 1160346 1180583 1201032 1221430 1241279 1260097 1277773 1294403 1309723 1322976 1333498
62057 1333498 1341232 1346435 1349061 1348737 1345176 1338187 1327306 1311964 1292284 1269304 1244150 1217282 1188825
62044 1188825 1159123 1128382 1096100 1061663 1025530 989178 953739 919361 886095 854661 825763
$$ packed form
62136A041269j9952j7829j5385j3130j1550j0529r593q443p073n724m834m706
62124I12521n002m927m076k849j810j021k44N04J064J515K018K455K621K681K940
62109I08390L231L006K136J145N38K21k66j193k451l648m231l813k577j153P8
62094H99413J257K494L376L442K922K551K680L018L304L786M789O164P459Q532
62080I55187R641J0976J2405J3734J4962J6113J7011J7455J7582J7816J8415J9203
62068A140500J9846K0237K0449K0398J9849J8818J7676J6630J5320J3253J0522
62057A333498P734N203K626l24l561o989j0881j5342j9680k2980k5154k6868k8457
62044A188825k9702l0741l2282l4437l6133l6352l5439l4378l3266l1434k8898
$$ plain form
62033 825763 799107 773776 749427 726653 706197 688205 672202 657528 643847 631477 621065
62022 621065 612729 605718 599197 593110 587868 583466 579460 575674 572348 569599 567289 565447 564266 563598
62008 563598 563025 562577 562786 563875 565423 567150 569402 572472 575926 579102 581917 584615 587046 588772 589710
61993 589710 590094 589891 588762 586645 583925 580947 577652 573725 568851 562851 555828 548200 540368 532456 524515
61978 524515 516751 509274 501869 494515 487942 483096 480018 477737 475330 472611 469786 467075 464887 463783
61964 463783 463858 464475 464930 465087 465195 465460 466068 467199 468667 469931 470902 472381 475255 479526 484638 490403
61948 490403 496943 503980 510939 517838 525315 533722 542852 552774 564171 577408 591817 606400 620812
61935 620812 635152 649201 662545 675194 687425 699040 709443 718455 726512 733905 740376 745650
$$ packed form
62033H25763k6656k5331k4349k2774k0456j7992j6003j4674j3681j2370j0412
62022F21065q336p011o521o087n242m402m006l786l326k749k310j842j181o68
62008E63598n73m48K09J089J548J727K252L070L454L176K815K698K431J726R38
61993E89710L84k03j129k117k720k978l295l927m874o000p023p628p832p912p941
61978E24515p764p477p405p354o573m846l078k281k407k719k825k711k188j104
61964D63783P5O17M55J57J08K65O08J131J468J264R71J479K874M271N112N765
61948D90403O540P037O959O899P477Q407R130R922J1397J3237J4409J4583J4412
61935F20812J4340J4049J3344J2649J2231J1615J0403R012Q057P393O471N274
$$ plain form
61923 745650 749917 753427 755983 757170 756892 755382 752908 749823 746749 744359 742943 742375 742519 743510 745654
61908 745654 749152 753890 759436 765328 771395 777600 783524 788324 791407 792906 793194 792211 789610 785359 779761
61893 779761 773005 765142 756411 747142 737367 727084 716898 707773 699962 692686 685126 677270 669528 662043
61879 662043 654789 647895 641336 634627 627339 619726 612431 605821 600109 595834 593551 593150 594081 596291 600314
61864 600314 606320 613700 621789 630462 639761 649461 659450 670188 682326 696037 711012 726899 743394
61851 743394 760122 776913 794147 812414 831679 851082 869666 887048 903220 917910 930478
61840 930478 940441 947910 953390 957250 959522 960128 959132 956723 953143 948770 944136 939729 935897 933053 931818
61825 931818 932617 935176 938648 942245 945492 947946 949006 948192 945343 940412 933217 923613 911704 897782
$$ packed form
61923G45650M267L510K556J187k78j510k474l085l074k390j416n68J44R91K144
61908G45654L498M738N546N892O067O205N924M800L083J499K88r83k601m251n598
61893G79761o756p863q731r269r775j0283j0186r125p811p276p560p856p742p485
61879F62043p254o894o559o709p288p613p295o610n712m275k283m01R31K210M023
61864F00314O006P380Q089Q673R299R700R989J0738J2138J3711J4975J5887J6495
61851G43394J6728J6791J7234J8267J9265J9403J8584J7382J6172J4690J2568
61840I30478R963P469N480L860K272O06r96k409l580m373m634m407l832k844j235
61825I31818P99K559L472L597L247K454J060q14k849m931p195r604j1909j3922
$$ plain form
61811 897782 882125 865028 846932 828394 809981 792215 775497 759931 745346 731532 718466
61800 718466 706295 695210 685278 676253 667604 658984 650636 643062 636319 630035 624144 619072 614973 611284
61786 611284 607426 603603 600421 598017 596026 594206 592500 590604 588099 585143 582532 580910 580250 580171 580341
61771 580341 580455 580283 580024 580266 581269 582580 583684 584742 586317 588502 590764 592676 594392 596305 598501
61756 598501 600710 602596 603971 604860 605518 606243 607030 607419 606828 604979 601938 597864 593009 587929 583325 579468
61740 579468 576040 572847 570405 569328 569278 569115 568269 567347 567045 567010 566369 565143 564423 565156 567259 569941 572418
61723 572418 574217 575318 576241 577674 579716 581773 583334 584502 585496 585986 585388 583653 581357 578997 576514
61708 576514 573558 569983 566013 562009 558147 554218 549785 544667 539299 534516 530840 527900 524631 520222
$$ packed form
61811H97782j5657j7097j8096j8538j8413j7766j6718j5566j4585j3814j3066
61800G18466j2171j1085r932r025q649q620q348p574o743o284n891n072m099l689
61786F11284l858l823l182k404j991j820j706j896k505k956k611j622o60p9J70
61771E80341J14j72k59K42J003J311J104J058J575K185K262J912J716J913K196
61756E98501K209J886J375Q89O58P25P87L89n91j849l041m074m855n080m604l857
61740E79468l428l193k442j077n0j63q46r22l02l5o41j226p20P33K103K682K477
61723E72418J799J101R23J433K042K057J561J168R94M90n98j735k296k360k483
61708E76514k956l575l970m004l862l929m433n118n368m783l676k940l269m409
$$ plain form
61694 520222 515007 510185 506456 503172 499299 495017 491647 489796 488346 485764 481874 477707 474047 470939
61680 470939 468400 466612 465293 463692 461623 459959 459673 460755 462349 463584 463983 463480 462488 461691 461375 461174
61664 461174 460737 460378 460689 461758 463253 465099 467503 470389 473252 475670 477555 478888 479624 479928 480121 480319
61648 480319 480486 480922 482248 484696 487718 490471 492394 493272 493210 492794 492771 493188 493237 492413 491354 490925 490742 489499
61630 489499 486787 483817 481992 481323 480683 479208 476962 474447 472019 469888 468248 467033 465599 462978 458788
61615 458788 453938 450055 447945 446826 445362 443236 441172 439554 437734 434961 431381 427710 424303 420997
61601 420997 417533 413657 409107 404080 399530 396374 394381 392345 389477 386192 383428 381618 380534 379700
61587 379700 378694 377325 375859 374888 374728 375014 375020 374299 372957 371528 370610 370398 370432 370052 369235 368667 368809 369294
$$ packed form
61694E20222n215m822l729l284l873m282l370j851j450k582l890m167l660l108
61680D70939k539j788j319j601k069j664k86J082J594J235L99n03r92p97l16k01
61664D61174m37l59L11J069J495J846K404K886K863K418J885J333P36L04J93J98
61648D80319J67M36J326K448L022K753J923Q78o2m16k3M17M9q24j059m29j83j243
61630D89499k712k970j825o69o40j475k246k515k428k131j640j215j434k621m190
61615D58788m850l883k110j119j464k126k064j618j820k773l580l671l407l306
61601D20997l464l876m550n027m550l156j993k036k868l285k764j810j084q34
61587C79700j006j369j466r71j60K86Op21j342j429r18k12L4l80q17n68J42M85
$$ plain form
61569 369294 369555 369661 370056 370717 371232 371636 372478 373894 375235 375946 376374 377243 378665 380138 381351 382475 383691
61552 383691 384958 386342 388089 390094 391642 392140 391956 392173 393476 395575 397715 399434 400686 401544 402114
61537 402114 402590 403080 403409 403378 403212 403499 404582 406209 407907 409391 410431 410602 409600 407788 405998 404634
61521 404634 403237 401175 398602 396466 395567 395822 396497 396946 397006 396770 396266 395498 394682 394182 394099 394096 393799 393323 393169
61502 393169 393580 394218 394541 394321 393681 392889 392339 392535 393739 395628 397633 399617 401886 404436 406576 407593
61486 407593 407565 407264 407412 408276 409808 411825 414088 416473 419091 422014 424974 427542 429560 431125 432242
61471 432242 432887 433367 434127 435081 435603 435386 434927 434873 435282 435830 436417 437054 437437 437075 435864 434190 432608 431667
61453 431667 431759 432672 433463 433318 432538 432117 432412 432820 432836 432773 433130 433902 434944 436534 438952 441758 444043 445417
$$ packed form
61569C69294K61J06L95O61N15M04Q42J416J341P11M28Q69J422J473J213J124J216
61552C83691J267J384J747K005J548M98j84K17J303K099K140J719J252Q58N70
61537D02114M76M90L29l1j66K87J083J627J698J484J040J71j002j812j790j364
61521D04634j397k062k573k136q99K55O75M49O0k36n04p68q16n00q3lk97m76j54
61502C93169M11O38L23k20o40p92n50J96J204J889K005J984K269K550K140J017
61486D07593k8l01J48Q64J532K017K263K385K618K923K960K568K018J565J117
61471D32242O45M80P60R54N22k17m59n4M09N48N87O37L83l62j211j674j582r41
61453D31667R2R13P91j45p80m21K95M08J6o3L57P72J042J590K418K806K285J374
$$ plain form
61435 445417 446316 447345 448655 450037 451297 452353 453116 453432 453174 452418 451488 450784 450522 450733 451428 452599 454081
61418 454081 455685 457471 459636 462028 464066 465264 465536 464925 463412 461254 459095 457429 456192 455157 454401
61403 454401 454027 453772 453354 452934 452739 452471 451661 450420 449279 448481 448077 448518 450312 453033 455571 457557 459709
61386 459709 462385 464713 465873 466534 468127 471025 474198 476563 477956 478887 480008 481875 484673 488024 491412
61371 491412 494745 498103 501076 503027 504097 505220 506905 508608 509755 510841 512943 516497 521105 526336
61357 526336 532038 537861 543165 547695 552001 556891 562662 569029 575554 581851 587577 592580 597163 601952
61343 601952 607327 612970 618048 621855 624315 625840 626782 627061 626414 624867 622784 620476 617972 615294 612725
61328 612725 610572 608786 607043 605155 603226 601546 600569 600882 602820 606058 609927 614236 619442 625868 633142
$$ packed form
61435D45417Q99J029J310J382J260J056P63L16k58p56r30p04k62K11O95J171J482
61418D54081J604J786K165K392K038J198K72o11j513k158k159j666j237j035p56
61403D54401l74k55m18m20j95k68q10j241j141p98m04M41J794K721K538J986K152
61386D59709K676K328J160O61J593K898L173K365J393R31J121J867K798L351L388
61371D91412L333L358K973J951J070J123J685J703J147J086K102L554M608N231
61357E26336N702N823N304M530M306M890N771O367O525O297N726N003M583M789
61343F01952N375N643N078L807K460J525R42K79o47j547k083k308k504k678k569
61328F12725k153j786j743j888j929j680r77L13J938L238L869M309N206O426P274
$$ plain form
61313 633142 640652 648274 656297 664916 674176 684214 695104 706496 717810 728774 739379 749402
61301 749402 758410 766277 773137 778702 782119 782814 781110 777711 772885 766482 758489 749212 739145 728995
61287 728995 719643 711602 704589 697987 691681 686082 681414 677415 673815 670714 668347 666825 666277 666936 668833
61272 668833 671531 674404 677128 679784 682609 685767 689311 693236 697564 702356 707546 712892 718284 724066
61258 724066 730658 737745 744245 749411 753662 757825 761752 764300 764723 763539 761741 759651 756997 753805
61244 753805 750589 747708 745049 742497 740277 738592 737239 735890 734575 733633 733362 733958 735595 738218 741325
61229 741325 744361 747389 751103 756079 762283 769321 776871 784725 792722 800856 809256 817838 826167 833887
61215 833887 841116 848226 855392 862636 870165 878267 886837 895268 902900 909471 915135 920261 925286 930643
$$ packed form
61313F33142P510P622Q023Q619R260J0038J0890J1392J1314J0964J0605J0023
61301G49402R008P867O860N565L417O95j704l399m826o403p993r277j0067j0150
61287G28995r352q041p013o602o306n599m668l999l600l101k367j522n48O59J897
61272F68833K698K873K724K656K825L158L544L925M328M792N190N346N392N782
61258G24066O592P087O500N166M251M163L927K548M23j184j798k090k654l192
61244G53805l216k881k659k552k220j685j353j349j315r42k71N96J637K623L107
61229G41325L036L028L714M976O204P038P550P854P997Q134Q400Q582Q329P720
61215H33887P229P110P166P244P529Q102Q570Q431P632O571N664N126N025N357
$$ plain form
61201 930643 936732 943909 952359 961900 972056 982514 993363 1004692 1016102 1026983 1037271 1047567
61189 1047567 1058306 1068981 1078334 1085268 1089526 1091585 1091903 1090300 1086212 1079648 1071591 1063127 1054360 1044634
61175 1044634 1033725 1022217 1010617 998673 985886 972257 958160 943867 929562 915525 901835
61164 901835 888072 873771 859072 844564 830608 817275 804843 793798 784232 775698 767883 761108
61152 761108 755901 752325 749949 748290 747101 746335 746079 746461 747470 748843 750129 750860 750705 749680 748228
61137 748228 746953 746239 746290 747547 750749 756394 764296 773873 784724 796810 810236 825120 841598 859687
61123 859687 879136 899583 920944 943507 967633 993399 1020447 1048049 1075396 1101983 1127758
61112 1127758 1152826 1177061 1200161 1221962 1242437 1261306 1277958 1291888 1303094 1311869 1318294 1322102
$$ packed form
61201I30643O089P177Q450R541J0156J0458J0849J1329J1410J0881J0288J0296
61189A047567J0739J0675R353O934M258K059L18j603m088o564q057q464q767r726
61175A044634j0909j1508j1600j1944j2787j3629j4097j4293j4305j4037j3690
61164I01835j3763j4301j4699j4508j3956j3333j2432j1045r566q534p815o775
61152G61108n207l576k376j659j189p66k56L82J009J373J286P31j55j025j452
61137G48228j275p14N1J257L202N645P902R577J0851J2086J3426J4884J6478J8089
61123H59687J9449K0447K1361K2563K4126K5766K7048K7602K7347K6587K5775
61112A127758K5068K4235K3100K1801K0475J8869J6652J3930J1206Q775O425L808
$$ plain form
61100 1322102 1323003 1320991 1316261 1308905 1298754 1285561 1269405 1250867 1230702 1209316 1186738 1163147
61088 1163147 1139292 1116239 1094800 1075291 1057651 1041577 1026660 1012736 1000169 989537 981006
61077 981006 974219 968865 965065 963058 962797 964155 967298 972482 979552 988035 997740 1008946 1021861 1036227
61063 1036227 1051643 1068051 1085699 1104782 1125327 1147296 1170600 1195048 1220473 1246939 1274691
61052 1274691 1303973 1334965 1367782 1402360 1438398 1475586 1513800 1552888 1592342 1631458 1669896
61041 1669896 1707841 1745573 1783088 1820192 1856698 1892311 1926526 1958944 1989689 2019288 2048195
61030 2048195 2076548 2104378 2131749 2158609 2184733 2210123 2235531 2262352 2291791 2324136 2359065
61019 2359065 2396756 2438603 2486790 2543346 2609882 2688156 2780556 2889979 3019601 3173020 3354271
$$ packed form
61100A322102R01k012m730p356j0151j3193j6156j8538k0165k1386k2578k3591
61088A163147k3855k3053k1439j9509j7640j6074j4917j3924j2567j0632q531
61077I81006o787n354l800k007k61J358L143N184P070Q483R705J1206J2915J4366
61063A036227J5416J6408J7648J9083K0545K1969K3304K4448K5425K6466K7752
61052A274691K9282L0992L2817L4578L6038L7188L8214L9088L9454L9116L8438
61041A669896L7945L7732L7515L7104L6506L5613L4215L2418L0745K9599K8907
61030B048195K8353K7830K7371K6860K6124K5390K5408K6821K9439L2345L4929
61019B359065L7691M1847M8187N6556O6536P8274R2400J09423J29622J53419J81251
$$ plain form
61008 3354271 3567162 3814354 4097286 4417093 4775598 5175572 5620629 6115478 6666470
60999 6666470 7281494 7968550 8733682 9579609 10505594 11507738 12578937 13709257 14888030
60990 14888030 16106859 17360333 18641960 19936424 21211928 22416069 23477904 24318840
60982 24318840 24872811 25109516 25048278 24752536 24306573 23786567 23238368 22667090 22038376
60973 22038376 21291307 20362270 19213038 17850302 16326471 14722710 13125012 11604950
60965 11604950 10210489 8965884 7876828 6937022 6133647 5451114 4873577 4386419 3976483
60956 3976483 3631463 3339738 3091040 2877013 2690918 2527139 2381306 2250495 2132670
60947 2132670 2025843 1928009 1837746 1754493 1678186 1608777 1545853 1488273 1434250 1382227 1331734
$$ packed form
61008C354271K12891K47192K82932L19807L58505L99974M45057M94849N50992
60999F666470O15024O87056P65132Q45927R25985J002144J071199J130320J178773
60990A4888030J218829J253474J281627J294464J275504J204141J061835Q40936
60982B4318840N53971K36705o1238k95742m45963n20006n48199n71278o28714
60973B2038376p47069r29037j149232j362736j523831j603761j597698j520062
60965A1604950j394461j244605j089056r39806q03375o82533n77537m87158m09936
60956C976483l45020k91725k48698k14027j86095j63779j45833j30811j17825
60947B132670j06827r7834r0263q3253p6307o9409o2924n7580n4023n2023n0493
$$ plain form
60936 1331734 1283173 1236921 1193098 1151990 1113992 1079011 1046541 1016498 989327 965013 942670
60925 942670 921596 902185 885180 870465 857263 845271 834859 826218 818965 812594 806807 801318
60913 801318 795879 790596 785791 781455 777239 773112 769528 766773 764536 762352 760112 757840 755284 752025
60899 752025 747843 742745 736830 730314 723475 716352 708646 700185 691290 682466 673859 665316 656817 648535
60885 648535 640501 632583 624830 617567 611030 605092 599450 593914 588415 582953 577731 573190 569606 566642
60871 566642 563573 560111 556815 554477 553245 552671 552490 552922 554075 555572 557173 559426 563110 568120 573422
60856 573422 578148 582232 585887 589110 592040 595325 599467 603985 607734 610103 611469 612410 612920 612671 611782
60841 611782 610869 610221 609248 607025 603313 598711 593749 588232 581865 575183 569275 564564 560342 555678 550279
$$ packed form
60936A331734m8561m6252m3823m1108l7998l4981l2470l0043k7171k4314k2343
60925I42670k1074j9411j7005j4715j3202j1992j0412q641p253o371n787n489
60913H01318n439n283m805m336m216m127l584k755k237k184k240k272k556l259
60899G52025m182n098n915o516o839p123p706q461q895q824q607q543q499q282
60885F48535q034p918p753p263o537n938n642n536n499n462n222m541l584k964
60871E66642l069l462l296k338j232n74j81M32J153J497J601K253L684N010N302
60856E73422M726M084L655L223K930L285M142M518L749K369J366R41N10k49q89
60841F11782r13o48r73k223l712m602m962n517o367o682n908m711m222m664n399
$$ plain form
60826 550279 544297 537877 531394 525739 521707 519139 517027 514410 510904 506579 501786 497069 492814 488954
60812 488954 485269 481857 478911 476113 472808 468881 465002 461849 459440 457370 455297 452982 450282 447451
60798 447451 445173 443893 443259 442578 441679 440989 440756 440594 439985 439083 438787 439960 442607 445911 449071 451929
60782 451929 454704 457355 459588 461360 462963 464498 465720 466541 467308 468315 469416 470444 471671 473348 475056
60767 475056 476047 476150 475824 475349 474555 473533 473032 473727 475343 476867 477451 476803 474954 472199 469302 467247
60751 467247 466407 466138 465464 464063 462370 460823 459411 457983 456579 455181 453497 451377 449218 447395 445379
60736 445379 442122 437562 433099 430039 427994 425511 422127 419031 417562 417648 418137 418223 418004 417832 417699 417511
60720 417511 417626 418683 420790 423151 424829 425808 426897 428509 430037 430864 431571 433340 436269 439111 440937
$$ packed form
60826E50279n982o420o483n655m032k568k112k617l506m325m793m717m255l860
60812D88954l685l412k946k798l305l927l879l153k409k070k073k315k700k831
60798D47451k278j280o34o81q99o90k33j62o09r02k96J173K647L304L160K858
60782D51929K775K651K233J772J603J535J222Q21P67J007J101J028J227J677J708
60767D75056R91J03l26m75p94j022n01O95J616J524N84o48j849k755k897k055
60751D67247q40k69o74j401j693j547j412j428j404j398j684k120k159j823k016
60736D45379l257m560m463l060k045k483l384l096j469Q6M89Q6k19j72j33j88
60720D17511J15J057K107K361J678R79J089J612J528Q27P07J769K929K842J826
$$ plain form
60705 440937 442296 444193 446552 448475 449655 450665 451882 452946 453525 453954 454702 455629 456219 456360 456510 457157
60689 457157 458312 459474 460002 459634 458719 457819 457073 456202 455153 454383 454309 454857 455775 457048 458623 460106 461215
60672 461215 462316 463930 465793 467012 467158 466688 466144 465500 464504 463186 461705 460065 458305 456732 455618
60657 455618 454840 454034 452954 451589 450237 449590 450302 452109 453739 454166 453732 453604 454356 455574 456665 457408
60641 457408 457699 457362 456423 455168 453733 451980 449873 447681 445701 444133 443231 443129 443398 443267 442568 442053
60625 442053 442391 443196 443504 442947 442027 441424 441466 442197 443382 444332 444198 442748 440716 439174 438647 438927 439610 440614
60607 440614 442128 444187 446430 448349 449719 450664 451340 451768 452032 452410 453068 453768 454117 454059 453906 453940 454288 455202
60589 455202 457132 460219 463849 466993 469107 470607 472382 474927 478033 481249 484424 487686 491103 494642
$$ packed form
60705D40937J359J897K359J923J180J010J217J064N79M29P48R27N90J41J50O47
60689D57157J155J162N28l68r15r00p46q71j049p70p4N48R18J273J575J483J109
60672D61215J101J614J863J219J46m70n44o44r96j318j481j640j760j573j114
60657D55618p78q06j080j365j352o47P12J807J630M27m34j28P52J218J091P43
60641D57408K91l37r39j255j435j753k107k192j980j568r02j02K69j31o99n15
60625D42053L38Q05L08n57r20o03M2P31J185R50j34j450k032j542n27K80O83J004
60607D40614J514K059K243J919J370R45O76M28K64L78O58P00L49n8j53L4L48R14
60589D55202J930L087L630L144K114J500J775K545L106L216L175L262L417L539
$$ plain form
60575 494642 498432 502814 507975 513677 519420 524818 529823 534725 540063 546341 553684 561810 570355 579088
60561 579088 587764 596014 603599 610592 617128 623041 627948 631583 633926 635080 635202 634430 632758 630150 627029
60546 627029 624515 623803 625272 628398 632450 637003 641890 647145 653204 660801 670382 681732 694294 707626
60532 707626 721398 735197 748653 761710 774488 786847 798231 807918 815287 819866 821400 820052
60520 820052 816466 811477 805690 799330 792415 785043 777542 770477 764533 760250 757731 756614 756490 757446 760113
60505 760113 765130 772630 782303 793889 807510 823519 842164 863444 887292 913769 942943 974517
60493 974517 1007739 1041855 1076540 1111621 1146452 1179912 1211109 1239682 1265256 1286950 1303709
60482 1303709 1314833 1319900 1318568 1311003 1298233 1281350 1260264 1233855 1201541 1164274 1123768 1081241
$$ packed form
60575D94642L790M382N161N702N743N398N005M902N338O278P343Q126Q545Q733
60561E79088Q676Q250P585O993O536N913M907L635K343J154J22p72j672k608l121
60546F27029k514p12J469L126M052M553M887N255O059P597R581J1350J2562J3332
60532G07626J3772J3799J3456J3057J2778J2359J1384R687P369M579J534j348
60520H20052l586m989n787o360o915p372p501p065n944m283k519j117j24R56K667
60505G60113N017P500R673J1586J3621J6009J8645K1280K3848K6477K9174L1574
60493I74517L3222L4116L4685L5081L4831L3460L1197K8573K5574K1694J6759
60482A303709J1124N067j332p565j2770j6883k1086k6409l2314l7267m0506m2527
$$ plain form
60470 1081241 1037231 992301 947402 903650 862072 823481 788345 756715 728427 703282 680964
60459 680964 660978 642902 626696 612565 600574 590429 581566 573385 565561 558277 551973 546731 542108
60446 542108 537696 533624 530202 527288 524435 521583 519157 517396 515971 514421 512661 510841 508964 506958
60432 506958 504970 503344 502318 501897 501990 502442 502984 503323 503339 503094 502703 502345 502307 502763 503410 503646 503313 503101 503932
60413 503932 506025 508804 511674 514553 517539 520373 522515 523703 524240 524732 525610 526888 528283 529583 530888
60398 530888 532416 534136 535828 537547 539716 542530 545552 548246 550713 553470 556541 559322 561492 563641
60384 563641 566653 570662 574889 578427 581019 583137 585473 588328 591470 594561 597630 600855 603985 606419
60370 606419 608094 609896 612761 616542 620147 622767 624612 626437 628803 631950 636033 641105 646864 652668
$$ packed form
60470A081241m4010m4930m4899m3752m1578l8591l5136l1630k8288k5145k2318
60459F80964j9986j8076j6206j4131j1991j0145q863q181p824p284o304n242m623
60446E42108m412m072l422k914k853k852k426j761j425j550j760j820j877k006
60432E06958j988j626j026m21R3M52N42L39J6k45l91l58l8M56O47K36l33k12Q31
60413E03932K093K779K870K879K986K834K142J188N37M92Q78J278J395J300J305
60398E30888J528J720J692J719K169K814L022K694K467K757L071K781K170K149
60384E63641L012M009M227L538K592K118K336K855L142L091L069L225L130K434
60370F06419J675J802K865L781L605K620J845J825K366L147M083N072N759N804
$$ plain form
60356 652668 657872 662227 666001 669772 674049 679000 684533 690493 696724 703026 709255 715446 721563 727090
60342 727090 731112 733018 732980 731538 728848 724627 718815 711954 704801 697775 690955 684396 678171 672204 666336
60327 666336 660589 655189 650346 646181 642836 640455 638988 638239 638150 638808 640164 642056 644627 648385 653595
60312 653595 659905 666908 674766 683928 694393 705755 717874 730927 744794 758882 772688 786081
60300 786081 798816 810269 819954 827919 834211 838212 838921 835831 829235 819794 808137 794813 780258
60287 780258 764719 748474 732136 716585 702445 689773 678265 667697 658106 649655 642398 636139
60275 636139 630449 624851 619066 613192 607662 602924 599013 595506 591975 588436 585249 582656 580597 578871
60261 578871 577288 575801 574730 574664 575690 576757 576439 574516 572370 571519 572146 573329 574311 575054 575833 576817
$$ packed form
60356F52668N204M355L774L771M277M951N533N960O231O302O229O191O117N527
60342G27090M022J906l8j442k690m221n812o861p153p026o820o559o225n967n868
60327F66336n747n400m843m165l345k381j467p49q9O58J356J892K571L758N210
60312F53595O310P003P858R162J0465J1362J2119J3053J3867J4088J3806J3393
60300G86081J2735J1453R685P965O292M001P09l090o596r441j1657j3324j4555
60287G80258j5539j6245j6338j5551j4140j2672j1508j0568r591q451p257o259
60275F36139n690n598n785n874n530m738l911l507l531l539l187k593k059j726
60261E78871j583j487j071o6J026J067l18j923k146q51O27J183R82P43P79R84
$$ plain form
60245 576817 578067 579557 581118 582462 583328 583631 583666 584137 585591 587695 589506 590651 591807 593763 596461
60230 596461 599403 602480 605831 609343 613034 617636 623944 631582 639169 645782 651668 657471 663440 669603
60216 669603 676072 682867 689902 697367 705705 715000 724756 734498 744158 753704 762862 771446 779546 787030
60202 787030 793286 797835 801029 803796 806816 810102 813091 814998 815338 814382 812881 811203 808980 805701 801302
60187 801302 796024 790146 784074 778233 772488 766126 758859 751472 744941 739300 733949 728859 724670 721600
60173 721600 718969 716042 712840 709889 707553 705914 705046 705012 705593 706232 706357 705818 704981 704311 703840 703212 702266
60156 702266 701376 701021 701315 702183 703701 705855 708206 710349 712657 716034 720748 725991 730878 735517 740725
60141 740725 746875 753488 760000 766534 773660 781513 789559 797334 805101 813395 822046 830160 837138 843237
$$ packed form
60245E76817J250J490J561J344Q66L03L5M71J454K104J811J145J156J956K698
60230E96461K942L077L351L512L691M602O308P638P587O613N886N803N969O163
60216F69603O469O795P035P465Q338R295R756R742R660R546R158Q584Q100P484
60202G87030O256M549L194K767L020L286K989J907L40r56j501j678k223l279m399
60187H01302n278n878o072n841n745o362p267p387o531n641n351n090m189l070
60173G21600k631k927l202k951k336j639q68l4N81O39J25n39q37o70m71o28r46
60156G02266q90l55K94Q68J518K154K351K143K308L377M714N243M887M639N208
60141G40725O150O613O512O534P126P853Q046P775P767Q294Q651Q114O978O099
$$ plain form
60127 843237 848891 854002 858288 861936 865267 868033 869744 870595 871348 872200 872495 871859 871039 871103 872200 873527
60111 873527 874263 874078 872899 870679 867485 863477 858717 853130 846708 839737 832861 826861 822037 817762 812956
60096 812956 807311 801785 797573 794847 792850 791009 789417 788329 787819 788024 789091 790612 791603 791499 790828
60081 790828 790403 790122 789121 787037 784475 782094 779731 776722 772723 767887 762412 756239 749165 741106 732342
60066 732342 723559 715426 707950 700531 692913 685824 680272 676420 673626 671465 670023 669158 668177 666736 665594
60051 665594 665894 667950 671186 675032 679308 683772 687969 691771 695629 699954 704559 709022 713346 717793
60037 717793 722120 725470 727250 727786 727838 727599 726483 723853 719598 713970 707242 699763 692073 684551 677008
60022 677008 668944 660184 651074 642140 633801 626277 619358 612332 604589 596376 588580 581772 575965 571358
$$ packed form
60127H43237N654N111M286L648L331K766J711Q51P53Q52K95o36q20O4J097J327
60111H73527P36j85j179k220l194m008m760n587o422o971o876o000m824m275m806
60096H12956n645n526m212k726j997j841j592j088n10K05J067J521R91j04o71
60081G90828m25k81j001k084k562k381k363l009l999m836n475o173p074q059q764
60066G32342q783q133p476p419p618p089n552l852k794k161j442q65r81j441j142
60051F65594L00K056L236L846M276M464M197L802L858M325M605M463M324M447
60037G17793M327L350J780N36N2k39j116k630m255n628o728p479p690p522p543
60022F77008q064q760r110q934q339p524o919p026p743q213p796o808n807m607
$$ plain form
60008 571358 568547 567578 567375 566760 565710 565048 565210 565976 567210 569097 571589 574248 576799 579330 581853 584191
59992 584191 586496 589372 593151 597432 601591 605407 608886 611814 613871 615052 615628 615813 615734 615559 615322 614661
59976 614661 613082 610564 607669 605032 602871 601037 599328 597686 596238 595310 595301 596394 598350 600714 603268
59961 603268 606104 609228 612302 615039 617675 620748 624331 627827 630544 632144 632473 631499 629704 628060 627093
59946 627093 626276 624822 622777 620762 618919 616885 614736 613130 612326 611703 610517 608641 606391 604240 602938
59931 602938 603252 605098 607467 609586 611748 614561 617978 621709 626089 631713 638328 644857 650475 655080
59917 655080 658734 661368 663260 665163 667648 670621 673761 677124 681009 685414 689900 693980 697545 700900
59903 700900 704409 708079 711535 714469 716976 719350 721701 723985 726272 728724 731321 733931 736675 740043
$$ packed form
60008E71358k811r69k03o15j050o62J62P66J234J887K492K659K551K531K523K338
59992E84191K305K876L779M281M159L816L479K928K057J181N76J85p9j75k37o61
59976F14661j579k518k895k637k161j834j709j642j448r28rJ093J956K364K554
59961F03268K836L124L074K737K636L073L583L496K717J600L29r74j795j644r67
59946F27093q17j454k045k015j843k034k149j606q04o23j186j876k250k151j302
59931F02938L14J846K369K119K162K813L417L731M380N624O615O529N618M605
59917F55080L654K634J892J903K485K973L140L363L885M405M486M080L565L355
59903G00900L509L670L456K934K507K374K351K284K287K452K597K610K744L368
$$ plain form
59889 740043 744529 750213 756659 763239 769664 776264 783500 791113 798133 803980 809191 814594 820088 824852
59875 824852 828588 831873 835164 838123 840076 840682 839915 837859 834760 830888 826091 819875 812181 803752 795459
59860 795459 787630 780339 773877 768473 763821 759418 755211 751501 748341 745578 743456 742644 743469 745442 747773
59845 747773 750161 753001 756968 762458 769272 776743 784200 791357 798220 804820 811184 817398 823358 828503
59831 828503 832204 834511 836154 837618 838492 838016 836097 833366 830251 826287 820544 812583 802868 792313
59817 792313 781560 770656 759281 747257 734977 723383 713397 705244 698411 692350 687022 682576 678692
59804 678692 674742 670672 667269 665257 664424 663962 663425 662865 662183 660901 658813 656450 654586 653485 652843 652321
59788 652321 651829 651376 650956 650681 650815 651497 652513 653462 654157 654719 655284 655760 655995 656138 656654 657897 659788 662013
$$ packed form
59889G40043M486N684O446O580O425O600P236P613P020N847N211N403N494M764
59875H24852L736L285L291K959J953O06p67k056l099l872m797o216p694q429q293
59860G95459p829p291o462n404m652m403m207l710l160k763k122q12Q25J973K331
59845G47773K388K840L967N490O814P471P457P157O863O600O364O214N960N145
59831H28503L701K307J643J464Q74m76j919k731l115l964n743p961r715j0555
59817G92313j0753j0904j1375j2024j2280j1594r986q153o833o061n328m446l884
59804F78692l950m070l403k012q33m62n37n60o82j282k088k363j864j101o42n22
59788F52321m92m53m20k75J34O82J016R49O95N62N65M76K35J43N16J243J891K225
$$ plain form
59770 662013 664498 667560 671531 676354 681628 687085 692881 699275 706009 712277 717571 722468 728279 735841
59756 735841 744890 754665 764744 775027 785299 795250 804832 814138 822994 831079 838478 845640 852634
59743 852634 858896 864011 868401 872793 877212 880929 883337 884461 884525 883469 881214 878204 875312 873087 871244
59728 871244 869033 866079 862733 859600 856887 854350 851796 849376 847275 845287 842909 839869 836431 833130
59714 833130 830259 827673 825112 822629 820556 819052 817880 816808 816006 815769 815955 816116 816175 816570 817559 818812
59698 818812 819936 821043 822465 824232 826210 828466 830974 833104 833973 833400 832103 830873 829888 828858 827420
59683 827420 825320 822564 819556 816715 813880 810419 806056 801188 796249 791246 786176 781440 777402 773862
59669 773862 770377 766905 763691 760738 757788 754746 751765 749050 746905 745813 746007 747096 748465 749970
$$ packed form
59770F62013K485L062L971M823N274N457N796O394O734O268N294M897N811P562
59756G35841R049R775J0079J0283J0272R951R582R306Q856Q085P399P162O994
59743H52634O262N115M390M392M419L717K408J124O4j056k255l010k892k225j843
59728H71244k211k954l346l133k713k537k554k420k101j988k378l040l438l301
59714H33130k871k586k561k483k073j504j172j072q02k37J86J61N9L95R89J253
59698H18812J124J107J422J767J978K256K508K130Q69n73j297j230r85j030j438
59683H27420k100k756l008k841k835l461m363m868m939n003n070m736m038l540
59669G73862l485l472l214k953k950l042k981k715k145j092J94J089J369J505
$$ plain form
59655 749970 751764 753615 754998 755943 757154 759047 761132 762580 763002 762374 760597 757599 753672 749319 744813
59640 744813 740113 735124 729780 723966 717563 710619 703428 696542 690666 686308 683332 681038 678822 676600
59626 676600 674481 672257 669517 666099 662202 658138 654162 650458 647066 643902 641008 638633 636839 635214
59612 635214 633296 631268 629918 629910 631300 633721 636679 639611 641972 643584 644796 646117 647711 649308 650563
59597 650563 651369 651777 651686 650798 649078 647137 645855 645494 645437 645006 644277 643830 643908 644155 644055 643252 641547 639049
59579 639049 636336 634002 631988 629779 627323 625240 623889 622784 621340 619770 618751 618482 618663 619186 620218
59564 620218 621562 622559 622874 622917 623195 623560 623386 622320 620587 618712 617162 616226 616075 616952 619225 623036 627827
59547 627827 632590 636883 641344 646834 653297 659962 666595 673896 682429 691646 700456 708561 716819 726333
$$ packed form
59655G49970J794J851J383R45J211J893K085J448M22o28j777k998l927m353m506
59640G44813m700m989n344n814o403o944p191o886n876m358k976k294k216k222
59626F76600k119k224k740l418l897m064l976l704l392l164k894k375j794j625
59612F35214j918k028j350qJ390K421K958K932K361J612J212J321J594J597J255
59597F50563Q06M08r1q88j720j941j282l61n7m31p29m47P8K47j00q03j705k498
59579F39049k713k334k014k209k456k083j351j105j444j570j019k69J81N23J032
59564F20218J344R97L15M3K78L65j74j066j733j875j550r36j51Q77K273L811M791
59547F27827M763M293M461N490O463O665O633P301Q533R217Q810Q105Q258R514
$$ plain form
59533 726333 737412 749314 760611 769778 775776 778407 778237 776188 773183 769956 766958 764377 762271 760565
59519 760565 758881 756658 753690 750355 746960 743052 737899 731583 724978 718446 711200 702443 692704 683470
59505 683470 675660 669047 663094 657745 653240 649636 646835 644788 643401 642416 641699 641576 642570 644738 647442
59490 647442 649837 651551 652812 654064 655590 657523 660003 663079 666503 669844 672903 675958 679508 683853
59476 683853 688977 694668 700644 706648 712509 718020 722734 726127 728239 730023 732676 736553 740884 744672
59462 744672 747656 750325 753171 756210 759304 762697 766942 772227 778010 783516 788470 793139 797776 802402
59448 802402 807013 811496 815222 817307 817635 817145 816627 815577 812855 808242 802675 797004 791231 785188 779415
59433 779415 774961 772569 772273 773614 776099 779604 784361 790444 797376 804633 812472 821830 833296 846651
$$ packed form
59533G26333J1079J1902J1297R167N998K631j70k049l005l227k998k581k106j706
59519G60565j684k223k968l335l395l908n153o316o605o532p246q757r739r234
59505F83470p810o613n953n349m505l604k801k047j387r85p17j23R94K168K704
59490F47442K395J714J261J252J526J933K480L076L424L341L059L055L550M345
59476F83853N124N691N976O004N861N511M714L393K112J784K653L877M331L788
59462G44672K984K669K846L039L094L393M245N285N783N506M954M669M637M626
59448H02402M611M483L726K085L28m90n18j050k722m613n567n671n773o043n773
59433G79415m454k392k96J341K485L505M757O083O932P257P839R358J1466J3355
$$ plain form
59419 846651 861479 877702 895167 913129 930649 947337 963366 978932 993977 1008284 1021462
59408 1021462 1032911 1042101 1048848 1053060 1054253 1051660 1045071 1035532 1025078 1015646 1008118 1002364 998099
59395 998099 995360 993898 992370 988705 981415 970389 956524 941105 925616 911458 899372 889252
59383 889252 880697 873435 867127 861302 855856 851216 847647 844821 842476 841047 840988 841748 842177 841950 842016 843524
59367 843524 846706 850784 854622 857534 859932 863223 868676 876320 885191 894525 904235 914395 924972 936279
59353 936279 949076 963796 979917 996357 1012314 1027579 1042267 1056453 1070001 1082681 1094492
59342 1094492 1105694 1116222 1125205 1131481 1134572 1134781 1132341 1127054 1118826 1108054 1095247 1080709 1064772
59329 1064772 1047865 1030033 1010889 990424 969507 949238 930102 912154 895640 880916 867953
$$ packed form
59419H46651J4828J6223J7465J7962J7520J6688J6029J5566J5045J4307J3178
59408A021462J1449R190O747M212J193k593o589r539j0454r432p528n754m265
59395I98099k739j462j528l665p290j1026j3865j5419j5489j4158j2086j0120
59383H89252q555p262o308n825n446m640l569k826k345j429n9P60M29k27O6J508
59367H43524L182M078L838K912K398L291N453P644Q871R334R710J0160J0577J1307
59353I36279J2797J4720J6121J6440J5957J5265J4688J4186J3548J2680J1811
59342A094492J1202J0528Q983O276L091K09k440n287q228j0772j2807j4538j5937
59329A064772j6907j7832j9144k0465k0917k0269j9136j7948j6514j4724j2963
$$ plain form
59318 867953 856418 846122 836958 828534 820355 812333 804711 797527 790612 784103 778466 773893 770080 766783
59304 766783 764241 762777 762256 762231 762467 763127 764575 767195 771317 777031 784035 791807 799992 808595 817770
59289 817770 827516 837558 847463 856773 865024 871673 876203 878408 878626 877686 876552 875970 876347 877832 880486
59274 880486 884427 889930 897404 907137 918866 931582 943931 954923 964287 972224 979025 984911 989868
59261 989868 993365 994455 992625 988580 983837 979394 974957 969526 962590 954659 946855 940118 934733 930487
59247 930487 927220 925092 924278 924639 925834 927593 929620 931450 932800 933944 935333 936888 938049 938437 938004
59232 938004 936590 933878 929862 924795 918591 910900 901919 892399 882553 871673 859288 846106 833272
59219 833272 821272 810137 800116 791338 783230 775144 767417 761094 756704 753898 752026 750442 748517
$$ packed form
59318H67953j1535j0296r164q424q179q022p622p184o915o509n637m573l813l297
59304G66783k542j464n21k5K36O60J448K620M122N714P004P772Q185Q603R175
59289H17770R746J0042R905R310Q251O649M530K205K18r40j134n82L77J485K654
59274H80486L941N503P474R733J1729J2716J2349J0992R364P937O801N886M957
59261I89868L497J090j830m045m743m443m437n431o936p931p804o737n385m246
59247I30487l267k128q14L61J195J759K027J830J350J144J389J555J161L88m33
59232I38004j414k712m016n067o204p691q981r520r846j0880j2385j3182j2834
59219H33272j2000j1135j0021q778q108q086p727o323m390k806j872j584j925
$$ plain form
59206 748517 746237 744662 744934 746805 748932 750636 752495 755089 758121 761109 764118 767367 770755 774223
59192 774223 778021 782226 786498 790651 794901 799219 803040 806043 808610 811028 812851 813643 813869 814367 815368
59177 815368 816688 818467 820892 823428 825125 825685 825595 825251 824629 823834 823297 823226 823338 823355 823359 823489 823480 822672 820376
59158 820376 816360 811122 805523 799889 793702 786470 778500 770295 761552 751570 740616 730081 721054 713396
59144 713396 706418 699869 693895 688554 683826 679826 676678 674347 672790 672003 671808 671949 672522 673943 676245
59129 676245 678881 681519 684656 689006 694550 700614 706701 712882 719475 726764 734966 744145 754149 764838
59115 764838 776252 788343 800641 812456 823380 833329 842236 850012 856794 862925 868607 873721 878025
59102 878025 881397 883860 885483 886252 886015 884678 882496 879921 877017 873388 868968 864560 861041 858128 854577
$$ packed form
59206G48517k280j575K72J871K127J704J859K594L032K988L009L249L388L468
59192G74223L798M205M272M153M250M318L821L003K567K418J823P92K26M98J001
59177H15368J320J779K425K536J697N60r0l44o22p95n37p1J12J7MJ30rq08k296
59158H20376m016n238n599n634o187p232p970q205q743r982j0954j0535r027p658
59144G13396o978o549n974n341m728m000l148k331j557p87j95J41N73J421K302
59129F76245K636K638L137M350N544O064O087O181O593P289Q202R179J0004J0689
59115G64838J1414J2091J2298J1815J0924R949Q907P776O782O131N682N114M304
59102H78025L372K463J623P69k37j337k182k575k904l629m420m408l519k913l551
$$ plain form
59087 854577 849759 844559 840397 837693 835563 832700 828204 821841 813991 805419 796784 788267 779802 771562
59073 771562 763923 756937 750224 743590 737446 732275 727820 723236 718105 712946 708516 704911 701662 698504
59059 698504 695625 693177 690987 688921 687194 685996 685064 683952 682685 681840 681912 682747 683641 683908 683392 682588
59043 682588 682273 682843 683952 684930 685617 686657 688846 692242 696084 699656 703122 707421 713339 720824 729259
59028 729259 738261 747966 758585 769957 781706 793674 806022 818871 831923 844465 855745 865380
59016 865380 873349 879553 883529 884838 883643 880589 876160 870553 864280 858383 853737 850457 848350 847581
59002 847581 848402 850471 853042 855825 859156 863264 867865 872529 876994 881009 884343 887160 889951 892823
58988 892823 895215 896653 897463 898336 899438 900375 900949 901566 902878 905344 909154 914302 920611 927833 935859
$$ packed form
59087H54577m818n200m162k704k130k863m496o363p850q572q635q517q465q240
59073G71562p639o986o713o634o144n171m455m584n131n159m430l605l249l158
59059F98504k879k448k190k066j727j198r32j112j267q45P2Q35Q94K67n16q04
59043F82588l15N70J109R78O87J040K189L396L842L572L466M299N918P485Q435
59028G29259R002R705J0619J1372J1749J1968J2348J2849J3052J2542J1280R635
59016H65380P969O204L976J309j195l054m429n607o273n897m646l280k107p69
59002H47581Q21K069K571K783L331M108M601M664M465M015L334K817K791K872
58988H92823K392J438Q10Q73J102R37N74O17J312K466L810N148O309P222Q026
$$ plain form
58973 935859 944753 954603 965365 976815 988524 999987 1010895 1021276 1031201 1040388 1048287 1054597 1059538
58960 1059538 1063461 1066244 1067187 1065585 1061325 1054849 1046579 1036570 1024792 1011550 997395 982692 967523
58947 967523 952066 936805 922267 908686 896041 884274 873464 863903 856032 850065 845615 841972
58935 841972 838893 836903 836560 837612 839102 840194 840708 841019 841626 842653 843457 842899 840340 836377 832295 828821
58919 828821 825782 822936 820651 819533 819774 821217 823825 827655 832349 837109 841474 846014 851927 859869
58905 859869 869322 879298 889527 900680 913450 927748 943032 959077 976055 993986 1012549 1031448
58893 1031448 1050561 1069596 1087982 1105404 1122242 1139173 1156417 1173520 1189767 1204601 1217738
58882 1217738 1229129 1238828 1246662 1251994 1254044 1252550 1248049 1241393 1233135 1223431 1212367 1200158 1187021
$$ packed form
58973I35859Q894R850J0762J1450J1709J1463J0908J0381R925R187P899O310M941
58960A059538L923K783R43j602m260o476q270j0009j1778j3242j4155j4703j5169
58947I67523j5457j5261j4538j3581j2645j1767j0810r561p871n967m450l643
58935H41972l079j990l43J052J490J092N14L11O07J027Q04n58k559l963m082l474
58919H28821l039k846k285j118K41J443K608L830M694M760M365M540N913P942
58905H59869R453R976J0229J1153J2770J4298J5284J6045J6978J7931J8563J8899
58893A031448J9113J9035J8386J7422J6838J6931J7244J7103J6247J4834J3137
58882A217738J1391R699P834N332K050j494m501o656q258r704j1064j2209j3137
$$ plain form
58869 1187021 1173070 1158471 1143672 1129367 1116144 1104090 1092737 1081495 1070172 1059040 1048363
58858 1048363 1038026 1027772 1017597 1007625 997604 986974 975544 963813 952431 941642 931441
58847 931441 921923 912992 903957 893929 882728 871017 859570 848763 838736 829508 820741 811834 802569
58834 802569 793470 785342 778683 773650 770241 768300 767545 767752 768639 769578 769959 770071 771097 773760 777427 781046
58818 781046 784529 788478 792810 796527 798941 800407 801622 802725 803378 803281 802306 800408 797756 794795 791971
58803 791971 789363 786655 783329 778938 773408 767124 760616 754210 748097 742561 737810 733690 729877 726336
58789 726336 723299 720949 719552 719697 721772 725114 728331 730722 732933 735962 739964 744324 748402 751813
58775 751813 754315 755877 756699 756816 755846 753371 749427 744442 738940 733478 728548 724233 720251 716579 713703
$$ packed form
58869A187021j3951j4599j4799j4305j3223j2054j1353j1242j1323j1132j0677
58858A048363j0337j0254j0175r972j0021j0630j1430j1731j1382j0789j0201
58847I31441r518q931r035j0028j1201j1711j1447j0807j0027r228q767q907r265
58834H02569r099q128o659n033l409j941p55K07Q87R39L81J12J026K663L667L619
58818G81046L483L949M332L717K414J466J215J103O53r7r75j898k652k961k824
58803G91971k608k708l326m391n530o284o508o406o113n536m751m120l813l541
58789G26336l037k350j397J45K075L342L217K391K211L029M002M360M078L411
58775G51813K502J562Q22J17r70k475l944m985n502n462m930m315l982l672k876
$$ plain form
58760 713703 711878 710532 708977 707497 707134 708426 710885 713702 716453 719061 721626 724546 728356 733107
58746 733107 738140 742736 746791 750689 754760 759183 764239 770234 777118 784445 791807 799086 806207 812954
58732 812954 819253 825440 831874 838354 844331 849780 855378 861564 867842 873469 878504 883573 888767 893455
58718 893455 897228 900400 903357 905962 907926 909287 910163 910397 909771 908207 905392 900536 892973 882836 870792
58703 870792 857343 842748 827424 811931 796576 781295 765836 749910 733375 716637 700692
58692 700692 686428 673984 662978 653107 644253 636342 629511 624158 620297 617138 613808 610335 607413
58679 607413 605395 604073 603296 603101 603313 603695 604519 606275 608732 611018 612888 615242 619063 624402 630730
58664 630730 637687 645047 652450 659606 666405 672406 676669 678600 678605 677383 674835 670328 663888 656505 649205
$$ packed form
58760G13703j825j346j555j480l63J292K459K817K751K608K565K920L810M751
58746G33107N033M596M055L898M071M423N056N995O884P327P362P279P121O747
58732H12954O299O187O434O480N977N449N598O186O278N627N035N069N194M688
58718H93455L773L172K957K605J964J361Q76K34o26j564k815m856p563j0137j2044
58703H70792j3449j4595j5324j5493j5355j5281j5459j5926j6535j6738j5945
58692G00692j4264j2444j1006r871q854p911o831n353l861l159l330l473k922
58679F07413k018j322p77j95K12L82Q24J756K457K286J870K354L821N339O328
58664F30730O957P360P403P156O799O001M263J931Nj222k548m507o440p383p300
$$ plain form
58649 649205 642313 635735 629518 623893 618988 614759 611122 608108 605873 604560 604058 604045 604328 605055 606446
58634 606446 608445 610805 613372 616058 618590 620520 621524 621621 621160 620770 621185 622816 625372 628050 630250
58619 630250 632126 634376 637552 641566 645868 650107 654500 659520 665279 671376 677292 682723 687466 691201
58605 691201 693611 694736 695118 695520 696422 697679 698701 699114 699213 699674 700941 703135 706385 710806 716057 721398
58589 721398 726524 732085 739032 747577 757084 766884 776892 787423 798672 810539 822796 835330 848175
58576 848175 861410 875038 889008 903238 917598 932031 946833 962626 979806 998144 1017314
58565 1017314 1037686 1060036 1084314 1109234 1133404 1156499 1178891 1200384 1219749 1235438 1246487
58554 1246487 1252878 1255357 1254819 1251586 1245365 1236140 1224894 1213012 1200999 1188251 1174186 1159178 1144091
$$ packed form
58649F49205o892o578o217n625m905m229l637l014k235j313n02j3K83P27J391
58634F06446J999K360K567K686K532J930J004R7m61l90M15J631K556K678K200
58619F30250J876K250L176M014M302M239M393N020N759O097N916N431M743L735
58605F91201K410J125L82M02R02J257J022M13R9M61J267K194L250M421N251N341
58589G21398N126N561O947Q545R507R800J0008J0531J1249J1867J2257J2534J2845
58576H48175J3235J3628J3970J4230J4360J4433J4802J5793J7180J8338J9170
58565A017314K0372K2350K4278K4920K4170K3095K2392K1493J9365J5689J1049
58554A246487O391K479n38l233o221r225j1246j1882j2013j2748j4065j5008j5087
$$ plain form
58541 1144091 1129196 1113857 1097198 1078762 1058532 1036695 1013665 990202 967218 945359 924929
58530 924929 906250 889760 875594 863359 852643 843515 836175 830286 825158 820455 816131 811801 806920
58517 806920 801723 797159 793549 790139 786507 783610 782536 782730 782467 780924 778897 777502 776962 776801 776513
58502 776513 775839 774957 774549 775169 776452 777514 778231 779526 782145 785794 789802 794101 799077 804903 811524
58487 811524 819032 827583 837061 847175 857797 869011 881018 894128 908545 923915 939376 954270
58475 954270 968462 981663 992965 1001536 1007417 1010975 1011844 1009187 1003029 994723 985932 977693 970523 964778
58461 964778 960569 957811 956767 958217 962709 969869 978678 988158 997575 1006394 1014493 1022139 1029219 1034693
58447 1034693 1037333 1036894 1033954 1028690 1020618 1009785 997519 985476 974414 964371 955588 948572 943422
$$ packed form
58541A144091j4895j5339j6659j8436k0230k1837k3030k3463k2984k1859k0430
58530I24929j8679j6490j4166j2235j0716r128p340n889n128m703m324m330m881
58517H06920n197m564l610l410l632k897j074J94k63j543k027j395n40j61k88
58502G76513o74q82m08O20J283J062P17J295K619L649M008M299M976N826O621
58487H11524P508Q551R478J0114J0622J1214J2007J3110J4417J5370J5461J4894
58475I54270J4192J3201J1302Q571N881L558Q69k657o158q306q791q239p170n745
58461I64778m209k758j044J450M492P160Q809R480R417Q819Q099P646P080N474
58447A034693K640m39k940n264q072j0833j2266j2043j1062j0043q783p016n150
$$ plain form
58434 943422 939778 937484 936739 937519 939406 942170 946056 951178 957006 962786 968279 973780 979490 985090 989831
58419 989831 992872 993648 992118 988608 983417 976729 968944 960768 952725 944768 936626 928337 920179 912253
58405 912253 904517 897213 890941 886221 883118 881363 880706 881157 882979 886365 891098 896622 902539 908778 915144
58390 915144 921076 926269 931322 937183 943893 950381 955657 959815 963711 968037 972987 978411 983840 988583
58376 988583 992286 995433 998959 1003354 1008442 1014107 1020784 1029003 1038691 1049258 1060264 1071702 1083711
58363 1083711 1096310 1109427 1122830 1135954 1148174 1159509 1170744 1182440 1193997 1204106 1212080
58352 1212080 1218359 1223777 1228797 1233544 1238095 1242483 1246723 1251154 1256452 1263048 1270683 1278848 1287537 1297316
58338 1297316 1308725 1321785 1336065 1351037 1366383 1382033 1397914 1413735 1429141 1443978 1458199
$$ packed form
58434I43422l644k294p45P80J887K764L886N122N828N780N493N501N710N600M741
58419I89831L041P76j530l510n191o688p785q176q043p957q142q289q158p926
58405I12253p736p304o272m720l103j755o57M51J822L386M733N524N917O239O366
58390I15144N932N193N053N861O710O488N276M158L896M326M950N424N429M743
58376I88583L703L147L526M395N088N665O677Q219R688J0567J1006J1438J2009
58363A083711J2599J3117J3403J3124J2220J1335J1235J1696J1557J0109P974
58352A212080O279N418N020M747M551M388M240M431N298O596P635Q165Q689R779
58338A297316J1409J3060J4280J4972J5346J5650J5881J5821J5406J4837J4221
$$ plain form
58327 1458199 1471534 1483580 1494199 1503433 1511058 1516746 1520818 1524295 1527899 1531519 1534980 1538793 1543672
58314 1543672 1549816 1557222 1566307 1577466 1590260 1603765 1617640 1632209 1647591 1663472 1679865 1697394
58302 1697394 1716534 1736971 1757941 1778936 1799944 1821295 1843365 1866181 1889271 1912121 1934780
58291 1934780 1957739 1981380 2005836 2031299 2057888 2085228 2112749 2140626 2169980 2201805 2235944
58280 2235944 2271350 2307225 2343756 2381817 2422088 2464394 2507924 2552177 2597581 2645048 2695106
58269 2695106 2747695 2802742 2860585 2921752 2986443 3054192 3124043 3195222 3267776 3342298 3419011
58258 3419011 3497400 3576812 3656967 3737752 3819230 3902266 3988457 4078789 4172895 4270293 4371809
58247 4371809 4478961 4592461 4712266 4838716 4972602 5114334 5264087 5422685 5591276
$$ packed form
58327A458199J3335J2046J0619R234P625N688M072L477L604L620L461L813M879
58314A543672O144P406R085J1159J2794J3505J3875J4569J5382J5881J6393J7529
58302A697394J9140K0437K0970K0995K1008K1351K2070K2816K3090K2850K2659
58291A934780K2959K3641K4456K5463K6589K7340K7521K7877K9354L1825L4139
58280B235944L5406L5875L6531L8061M0271M2306M3530M4253M5404M7467N0058
58269B695106N2589N5047N7843O1167O4691O7749O9851P1179P2554P4522P6713
58258C419011P8389P9412Q0155Q0785Q1478Q3036Q6191R0332R4106R7398J01516
58247D371809J07152J13500J19805J26450J33886J41732J49753J58598J68591
$$ plain form
58238 5591276 5770203 5959214 6158892 6370911 6596783 6837286 7093252 7366002 7656867
58229 7656867 7967262 8299531 8656956 9042740 9459735 9911308 10401812 10936218 11520238
58220 11520238 12161064 12867457 13649478 14519396 15493184 16590703 17835356 19256118 20891649
58211 20891649 22792589 25019463 27636978 30706168 34276182 38379730 43035273 48253412
58203 48253412 54042488 60413219 67385528 74996456 83304272 92387216 102338213 113253966
58195 113253966 125216395 138269963 152399505 167508889 183408065 199830266 216486407
58188 216486407 233115665 249470977 265229288 279883050 292670982 302565933 308343391
58181 308343391 308791962 303078900 291129136 273781789 252601203 229451153 206065053
$$ packed form
58238E591276J78927J89011J99678K12019K25872K40503K55966K72750K90865
58229G656867L10395L32269L57425L85784M16995M51573M90504N34406N84020
58220A1520238O40826P06393P82021Q69918R73788J097519J244653J420762J635531
58211B0891649J900940K226874K617515L069190L570014M103548M655543N218139
58203D8253412N789076O370731O972309P610928Q307816R082944R950997J0915753
58195A13253966J1962429J3053568J4129542J5109384J5899176J6422201J6656141
58188B16486407J6629258J6355312J5758311J4653762J2787932R894951N777458
58181C08343391M48571n713062j1949764j7347347k1180586k3150050k3386100
$$ plain form
58174 206065053 183775765 163427681 145417026 129799159 116408559 104949663 95051927
58167 95051927 86316996 78380866 70978381 63977480 57365993 51202816 45561223 40488925
58159 40488925 35994373 32052684 28618270 25636192 23050752 20810575 18869324 17184287
58151 17184287 15716649 14433171 13306205 12311926 11429703 10642805 9937812 9302625 8725940
58142 8725940 8198684 7714537 7268562 6856324 6474534 6121366 5795458 5495199 5219105
58133 5219105 4965894 4733744 4520087 4322428 4138875 3967839 3807926 3658111 3517273
58124 3517273 3383570 3255183 3131846 3014740 2904640 2801027 2703242 2611467 2525924 2445843
58114 2445843 2370018 2298031 2230313 2167142 2108022 2052005 1998363 1946909 1897749 1850754 1805467
$$ packed form
58174B06065053k2289288k0348084j8010655j5617867j3390600j1458896r897736
58167I5051927q734931p936130p402485p000901o611487o163177n641593n072298
58159D0488925m494552l941689l434414k982078k585440k240177j941251j685037
58151A7184287j467638j283478j126966r94279q82223p86898p04993o35187n76685
58142H725940n27256m84147m45975m12238l81790l53168l25908l00259k76094
58133E219105k53211k32150k13657j97659j83553j71036j59913j49815j40838
58124C517273j33703j28387j23337j17106j10100j03613r7785r1775q5543q0081
58114B445843p5825p1987o7718o3171n9120n6017n3642n1454m9160m6995m5287
$$ plain form
58103 1805467 1761565 1719032 1677596 1636431 1594969 1553772 1514032 1476414 1440884 1407399 1376013
58092 1376013 1346392 1317935 1290465 1264253 1239396 1215674 1192885 1170782 1148832 1126788 1105350
58081 1105350 1085498 1067129 1049129 1030803 1012422 994261 976045 957723 940042 923804 908960
58070 908960 894825 880873 867130 854066 842214 831586 821495 811318 801312 792143 783790 775624
58058 775624 767552 760223 753909 747939 741501 734348 726498 717954 709058 700511 692660 685231 677992 671145
58044 671145 664877 659077 653738 648948 644244 638686 631950 624724 617709 610883 604142 597832 592096 586369
58030 586369 580187 573908 567930 561760 554689 547034 539916 534011 529140 524824 520565 515799 510351 504884
58016 504884 500284 496621 493292 490090 487511 485924 485047 484429 483975 483745 483503 482709 480989 478631 476626 475907
$$ packed form
58103A805467m3902m2533m1436m1165m1462m1197l9740l7618l5530l3485l1386
58092A376013k9621k8457k7470k6212k4857k3722k2789k2103k1950k2044k1438
58081A105350j9852j8369j8000j8326j8381j8161j8216j8322j7681j6238j4844
58070I08960j4135j3952j3743j3064j1852j0628j0091j0177j0006r169q353q166
58058G75624q072p329o314n970o438p153p850q544q896q547p851p429p239o847
58044F71145o268n800n339m790m704n558o736p226p015o826o741o310n736n727
58030E86369o182o279n978o170p071p655p118n905m871m316m259m766n448n467
58016E04884m600l663l329l202k579j587q77o18m54k30k42p94j720k358k005p19
$$ plain form
58000 475907 476315 476536 475404 473109 470845 469485 468946 468630 468002 466879 465617 464977 465357 466150 466236 465148 463335
57983 463335 461283 458932 456198 453616 451981 451454 451451 451419 451428 451778 452231 452014 450704 448821 447301 446495 446052 445655
57965 445655 445474 445861 446947 448650 450707 452557 453570 453609 453132 452608 452130 451728 451568 451601 451398 450705 449849 449251
57947 449251 448874 448587 448788 450184 453049 457043 461705 466799 472316 478395 485164 492381 499418 505802 511598
57932 511598 517060 522178 526750 530522 532961 533322 531436 528127 524312 519980 514535 507854 500385 492483
57918 492483 484339 476453 469477 463523 458219 453440 449432 446229 443578 441532 440492 440495 440990 441475 441906 442426
57902 442426 443210 444645 447051 450076 452914 455294 457674 460319 462908 465373 468318 472062 475888 478941
57888 478941 481447 484330 487913 491649 494946 497552 499233 499775 499456 498925 498463 497747 496493 494916 493280
$$ packed form
58000D75907M08K21j132k295k264j360n39l16o28j123j262o40L80P93Q6j088j813
57983D63335k052k351k734k582j635n27ll2RL50M53k17j310j883j520q06m43l97
57965D45655j81L87J086J703K057J850J013L9m77n24m78m02j60L3k03o93q56n98
57947D49251l77k87K01J396K865L994M662N094N517O079O769P217P037O384N796
57932E11598N462N118M572L772K439L61j886l309l815m332n445o681p469p902
57918D92483q144p886o976n954n304m779m008l203k651k046j040LM95M85M31N20
57902D42426P84J435K406L025K838K380K380K645K589K465K945L744L826L053
57888D78941K506K883L583L736L297K606J681N42l19n31m62p16j254j577j636
$$ plain form
57873 493280 491325 488538 484894 481072 477918 475882 474998 475201 476368 478041 479488 480332 481002 482200 483946
57858 483946 485586 486826 488270 490673 494016 497685 501253 504657 507860 510827 513785 517002 520278 522972
57844 522972 524651 525416 525611 525508 525317 525173 524996 524604 524069 523770 523992 524651 525406 525844 525558 524416 522826 521382
57826 521382 520171 518811 517245 515947 514983 513445 510435 506332 502365 499046 495746 491850 487586 483422
57812 483422 479313 475063 470936 467331 464044 460454 456398 452398 448965 446016 443028 439544 435450 430995
57798 430995 426597 422542 418911 415853 413741 412809 412842 413510 414819 416850 419259 421586 424012 427220 431445
57783 431445 436215 441187 446619 452726 459186 465627 472118 478701 484896 490256 495057 499791 504174 507344
57769 507344 509023 509861 510508 510874 510465 509130 507238 505349 503775 502358 500732 498949 497671 497432 497921 498404
$$ packed form
57873D93280j955k787l644l822l154k036q84K03J167J673J447Q44O70J198J746
57858D83946J640J240J444K403L343L669L568L404L203K967K958L217L276K694
57844E22972J679P65J95j03j91j44j77l92n35k99K22O59P55M38k86j142j590j444
57826E21382j211j360j566j298r64j538l010m103l967l319l300l896m264m164
57812D83422m109m250m127l605l287l590m056m000l433k949k988l484m094m455
57798D30995m398m055l631l058k112r32L3O68J309K031K409K327K426L208M225
57783D31445M770M972N432O107O460O441O491O583O195N360M801M734M383L170
57769E07344J679Q38O47L66m09j335j892j889j574j417j626j783j278k39M89M83
$$ plain form
57753 498404 498681 499084 499568 499520 498685 497705 497412 497966 499034 500392 501919 503256 503992 504217 504509 505299 506428
57736 506428 507347 507615 507177 506323 505478 504977 504987 505504 506371 507388 508513 509942 511808 513915 515947 517879 519873
57719 519873 521793 523208 524012 524731 525922 527494 528890 529839 530633 531665 532931 534104 534960 535603 536247 536901
57703 536901 537321 537295 536824 535977 534671 532768 530369 527867 525690 524058 522926 522113 521542 521394 521942 523199
57687 523199 524971 527361 530997 536500 543972 553200 564116 576703 590743 606197 623689 644081 667558
57674 667558 693570 721660 751773 783734 816950 850858 885221 919783 953959 986879 1017234
57663 1017234 1042821 1060612 1067637 1061808 1042321 1010101 968093 920432 870841 821958 776006 735042
57651 735042 700043 670443 645243 624152 607148 593515 582150 572515 564612 558266 553135 549253
$$ packed form
57753D98404K77M03M84m8q35r80k93N54J068J358J527J337P36K25K92P90J129
57736E06428R19K68m38q54q45n01J0N17Q67J017J125J429J866K107K032J932J994
57719E19873J920J415Q04P19J191J572J396R49P94J032J266J173Q56O43O44O54
57703E36901M20k6m71q47j306j903k399k502k177j632j132q13n71j48N48J257
57687E23199J772K390L636N503P472R228J0916J2587J4040J5454J7492K0392K3477
57674F67558K6012K8090L0113L1961L3216L3908L4363L4562L4176L2920L0355
57663A017234K5587J7791P025n829j9487l2220m2008m7661m9591m8883m5952m0964
57651G35042l4999k9600k5200k1091j7004j3633j1365r635p903o346n131l882
$$ plain form
57639 549253 546854 545722 545298 545325 545803 546395 546557 546355 546551 547661 549281 550459 550462 549258 547606 546582 546657
57622 546657 547276 547730 548194 549333 551057 552397 552723 552427 552260 552553 553245 554147 554948 555456 556039 557283 559008
57605 559008 560170 560116 559498 559524 560608 562163 563397 563935 563857 563517 563302 563332 563432 563462 563500 563652 563944 564443 565191
57586 565191 565949 566412 566791 567735 569439 571263 572512 573159 573537 573761 573922 574370 575221 575883 575699 574988 574866 576028
57568 576028 578157 580501 582537 584001 584781 585089 585554 586907 589514 593143 597137 600987 604862 609341 614460
57553 614460 619429 623637 627585 632227 637609 642863 647480 651859 656434 660989 665197 669221 673290 677112
57539 677112 680319 683224 686572 690553 694572 698080 701243 704595 708251 711720 714508 716835 719662 723860
57525 723860 729295 734920 739861 744208 748582 753122 757334 760873 764109 767783 772357 777829 783878 790026
$$ packed form
57639E49253k399j132m24K7M78N92J62k02J96J110J620J178Lj204j652j024P5
57622E46657O19M54M64J139J724J340L26k96j67K93O92R02Q01N08N83J244J725
57605E59008J162n4o18K6J084J555J234N38p8l40k15L0J00L0L8J52K92M99P48
57586E65191P58M63L79R44J704J824J249O47L78K24J61M48Q51O62j84p11j22J162
57568E76028K129K344K036J464P80L08M65J353K607L629L994L850L875M479N119
57553F14460M969M208L948M642N382N254M617M379M575M555M208M024M069L822
57539F77112L207K905L348L981M019L508L163L352L656L469K788K327K827M198
57525G23860N435N625M941M347M374M540M212L539L236L674M574N472O049O148
$$ plain form
57511 790026 795849 801357 807005 813032 818888 823724 827478 831087 835444 840429 845261 849465 853190 856749
57497 856749 860368 864300 868706 873301 877521 881231 884919 888994 893287 897569 902170 907582 913617 919517
57483 919517 924907 930169 935818 941962 948453 955107 961506 967023 971487 975623 980391 986014 992003 998056
57469 998056 1004433 1011367 1018537 1025458 1032107 1038861 1045921 1053129 1060375 1067840 1075740 1084059 1092666 1101526
57455 1101526 1110594 1119638 1128368 1136702 1144730 1152525 1160195 1168095 1176677 1186054 1195944 1206067 1216326
57442 1216326 1226496 1236144 1245128 1253903 1262919 1271912 1280297 1288253 1296901 1307190 1318887 1330919 1342426
57429 1342426 1353226 1363489 1373449 1383487 1394094 1405408 1416924 1427957 1438513 1449377 1461204
57418 1461204 1473680 1485910 1497503 1508829 1520199 1531375 1542242 1553452 1565798 1579184 1592861
$$ packed form
57511G90026N823N508N648O027N856M836L754L609M357M985M832M204L725L559
57497H56749L619L932M406M595M220L710L688M075M293M282M601N412O035N900
57483I19517N390N262N649O144O491O654O399N517M464M136M768N623N989O053
57469I98056O377O934P170O921O649O754P060P208P246P465P900Q319Q607Q860
57455A101526R068R044Q730Q334Q028P795P670P900Q582R377R890J0123J0259
57442A216326J0170R648Q984Q775R016Q993Q385P956Q648J0289J1697J2032J1507
57429A342426J0800J0263R960J0038J0607J1314J1516J1033J0556J0864J1827
57418A461204J2476J2230J1593J1326J1370J1176J0867J1210J2346J3386J3677
$$ plain form
57407 1592861 1606563 1620699 1635320 1649709 1663362 1676746 1690507 1704415 1717793 1730765 1744361
57396 1744361 1759312 1775307 1791563 1807705 1823871 1840329 1857219 1874470 1891830 1909072 1926321
57385 1926321 1943953 1962098 1980409 1998522 2016565 2035028 2054186 2073796 2093313 2112235 2130265
57374 2130265 2147300 2163396 2178814 2194068 2209802 2226446 2243911 2261688 2279290 2296590 2313800
57363 2313800 2331221 2349070 2367484 2386636 2406791 2428186 2450745 2474037 2497602 2521272 2545079
57352 2545079 2568979 2592904 2617032 2641706 2666987 2692499 2717817 2742859 2767836 2792990 2818450
57341 2818450 2844171 2869922 2895452 2920743 2945882 2970685 2994812 3018493 3042806 3068795 3096356
57330 3096356 3124332 3151677 3178258 3204559 3231019 3257881 3285356 3313608 3342607 3372185 3402260
$$ packed form
57407A592861J3702J4136J4621J4389J3653J3384J3761J3908J3378J2972J3596
57396A744361J4951J5995J6256J6142J6166J6458J6890J7251J7360J7242J7249
57385A926321J7632J8145J8311J8113J8043J8463J9158J9610J9517J8922J8030
57374B130265J7035J6096J5418J5254J5734J6644J7465J7777J7602J7300J7210
57363B313800J7421J7849J8414J9152K0155K1395K2559K3292K3565K3670K3807
57352B545079K3900K3925K4128K4674K5281K5512K5318K5042K4977K5154K5460
57341B818450K5721K5751K5530K5291K5139K4803K4127K3681K4313K5989K7561
57330C096356K7976K7345K6581K6301K6460K6862K7475K8252K8999K9578L0075
$$ plain form
57319 3402260 3432878 3464032 3495533 3527106 3558544 3589747 3620672 3651399 3682251 3713683 3745891
57308 3745891 3778597 3811468 3844666 3878719 3913793 3949419 3985144 4021130 4057766 4094944 4132124
57297 4132124 4169040 4205931 4243021 4280249 4317693 4355901 4395435 4436183 4477401 4518453 4559350
57286 4559350 4600534 4642240 4684159 4725767 4766926 4808062 4849715 4892025 4934755 4977622 5020356
57275 5020356 5062558 5103944 5144799 5185851 5227475 5269251 5310518 5351200 5391849 5432970 5474554
57264 5474554 5516259 5557876 5599633 5642132 5686006 5731527 5778526 5826635 5875470 5924628 5973854
57253 5973854 6023449 6074263 6126965 6181420 6237135 6294244 6353611 6415860 6480667 6547282 6615375
57242 6615375 6684966 6755576 6825884 6894357 6960118 7023329 7085066 7146847 7209833 7274071 7338606
$$ packed form
57319C402260L0618L1154L1501L1573L1438L1203L0925L0727L0852L1432L2208
57308C745891L2706L2871L3198L4053L5074L5626L5725L5986L6636L7178L7180
57297D132124L6916L6891L7090L7228L7444L8208L9534M0748M1218M1052M0897
57286D559350M1184M1706M1919M1608M1159M1136M1653M2310M2730M2867M2734
57275E020356M2202M1386M0855M1052M1624M1776M1267M0682M0649M1121M1584
57264E474554M1705M1617M1757M2499M3874M5521M6999M8109M8835M9158M9226
57253E973854M9595N0814N2702N4455N5715N7109N9367O2249O4807O6615O8093
57242F615375O9591P0610P0308O8473O5761O3211O1737O1781O2986O4238O4535
$$ plain form
57231 7338606 7402550 7465899 7529188 7592626 7656000 7719266 7782653 7846089 7908993 7970868 8031661
57220 8031661 8091286 8149227 8205065 8259183 8312559 8366060 8420314 8476000 8533631 8593018 8653310
57209 8653310 8713528 8772703 8829675 8883388 8933559 8980694 9025442 9068392 9110406 9152387 9194453
57198 9194453 9235929 9276475 9316627 9356834 9396631 9435388 9473453 9511785 9550629 9589190 9626553
57187 9626553 9662311 9696346 9728591 9759192 9788501 9816751 9843997 9870311 9895633 9919368 9940615
57176 9940615 9959031 9975211 9990058 10004010 10016995 10028815 10039283 10048116 10054988 10059755 10062515 10063383
57164 10063383 10062205 10058505 10051760 10041685 10028144 10010818 9989214 9963163 9933067 9899433 9862393 9821991
57152 9821991 9778753 9733583 9687198 9640057 9592893 9546890 9503218 9462690 9426013 9394073 9367693
$$ packed form
57231G338606O3944O3349O3289O3438O3374O3266O3387O3436O2904O1875O0793
57220H031661N9625N7941N5838N4118N3376N3501N4254N5686N7631N9387O0292
57209H653310O0218N9175N6972N3713N0171M7135M4748M2950M2014M1981M2066
57198I194453M1476M0546M0152M0207L9797L8757L8065L8332L8844L8561L7363
57187I626553L5758L4035L2245L0601K9309K8250K7246K6314K5322K3735K1247
57176I940615J8416J6180J4847J3952J2985J1820J0468Q833O872M767K760Q68
57164A0063383j178l700o745j0075j3541j7326k1604k6051l0096l3634l7040m0402
57152I821991m3238m5170m6385m7141m7164m6003m3672m0528l6677l1940k6380
$$ plain form
57141 9367693 9347216 9332450 9322778 9317028 9313143 9308212 9299147 9283680 9260905 9230810 9193371 9148266
57129 9148266 9095504 9035865 8970357 8899394 8822971 8741810 8658250 8576178 8500189 8434351 8380873
57118 8380873 8339453 8307961 8283949 8265707 8252342 8243655 8240620 8246325 8266670 8310253 8387370 8508414
57106 8508414 8682000 8912840 9199753 9535141 9907246 10304499 10719532 11151342 11605564
57097 11605564 12091581 12613428 13154789 13666466 14068822 14274913 14225671 13917216 13402177
57088 13402177 12763711 12081614 11415572 10813668 10330959 10036708 10002095 10274220 10846977
57079 10846977 11642186 12517613 13308428 13883164 14180407 14209304 14026935 13713363 13349128
57070 13349128 12991136 12653773 12310226 11915807 11436012 10861345 10205889 9497771 8769053
$$ packed form
57141I367693k0477j4766r672n750l885m931r065j5467k2775l0095l7439m5105
57129I148266n2762n9639o5508p0963p6423q1161q3560q2072p5989o5838n3478
57118H380873m1420l1492k4012j8242j3365q687l035N705K0345M3583P7117J21044
57106H508414J73586K30840K86913L35388L72105L97253M15033M31810M54222
57097A1605564M86017N21847N41361N11677M02356K06091m9242l08455n15039
57088A3402177o38466o82097o66042o01904m82709k94251l4613K72125N72757
57079A0846977P95209Q75427P90815N74736K97243K8897j82369l13572l64235
57070A3349128l57992l37363l43547l94419m79795n74667o55456p08118p28718
$$ plain form
57061 8769053 8048564 7358832 6716207 6131385 5609142 5148679 4745417 4392759 4082857
57052 4082857 3807534 3560026 3335941 3132393 2946805 2776951 2621435 2479225 2348813
57043 2348813 2228318 2116289 2011977 1914889 1824412 1739870 1660727 1586714 1517751 1453699 1394267
57032 1394267 1339276 1288838 1243040 1201670 1164669 1132718 1106948 1088198 1077036 1074243 1080419 1094960
57020 1094960 1116085 1142049 1171793 1204290 1237865 1270264 1298628 1319105 1327288 1319771 1295267 1254475
57008 1254475 1199960 1136511 1070367 1006675 947581 893095 843105 797754 756479 718130 682318
56997 682318 649800 621218 596033 573025 551400 531056 512073 494282 477339 461093 445906
56986 445906 432539 421601 413049 406285 400585 395331 390011 384292 378088 371379 364055 356079 347776 339746
$$ packed form
57061H769053p20489o89732o42625n84822n22243m60463m03262l52658l09902
57052D082857k75323k47508k24085k03548j85588j69854j55516j42210j30412
57043B348813j20495j12029j04312r7088r0477q4542p9143p4013o8963o4052n9432
57032A394267n4991n0438m5798m1370l7001l1951k5770j8750j1162k793O176J4541
57020A094960K1125K5964K9744L2497L3575L2399K8364K0477Q183p517k4504m0792
57008A254475n4515o3449o6144o3692n9094n4486m9990m5351m1275l8349l5812
56997F82318l2518k8582k5185k3008k1625k0344j8983j7791j6943j6246j5187
56986D45906j3367j0938q552o764n700n254n320n719o204o709p324p976q303q030
$$ plain form
56972 339746 332579 326752 322610 320270 319612 320591 323422 328213 334591 341987 350262 359692 370323 381661
56958 381661 393110 404429 415492 425771 434310 440214 442947 442096 437167 428019 415557 401623 387969
56945 387969 375526 364752 356212 350337 346929 345540 346224 349277 354300 360352 367202 375657 386299 398593
56931 398593 411636 424963 437936 448968 456277 458999 456807 448917 434646 415000 392717 370415
56919 370415 349330 329842 312296 296848 283164 270857 259822 249854 240431 231360 223335 217372
56907 217372 213827 212244 211960 212531 213725 215478 217862 220966 224865 229806 236151 243915 252592 261696 271338
56892 271338 282017 293981 307076 321092 335900 351319 367134 383255 399480 415046 428699
56881 428699 439339 446413 449729 449313 445745 440357 434717 429913 426524 425117 426373 430687 437992 448163
$$ packed form
56972C39746p167n827m142k340o58R79K831M791O378P396Q275R430J0631J1338
56958C81661J1449J1319J1063J0279Q539N904K733q51m929r148j2462j3934j3654
56945C87969j2443j0774q540n875l408j389O84L053N023O052O850Q455J0642J2294
56931C98593J3043J3327J2973J1032P309K722k192p890j4271j9646k2283k2302
56919C70415k1085j9488j7546j5448j3684j2307j1035r968r423r071q025n963
56907B17372l545j583k84N71J194J753K384L104L899M941O345P764Q677R104R642
56892B71338J0679J1964J3095J4016J4808J5419J5815J6121J6225J5566J3653
56881D28699J0640P074L316m16l568n388n640m804l389j407J256M314P305J0171
$$ plain form
56867 448163 461321 477560 496605 518042 541744 567773 595860 625235 654984 684299 712200
56856 712200 737104 756779 768847 771646 765035 750613 731139 709659 689017 671648 659275 652686
56844 652686 652171 658197 671412 691948 719179 752277 790570 833136 878494 925124 971991 1018146
56832 1018146 1061952 1101057 1132876 1154662 1163380 1156368 1132677 1093879 1043722 987089 928897 873238
56820 873238 823085 780570 747147 723191 707808 699775 698767 705250 719105 738876 762586 788823
56808 788823 816686 844998 871985 895666 914204 925823 928581 920426 899850 866949 824101 775407
56796 775407 725225 676970 632880 594311 561962 536070 516650 503489 495918 492935 493779 498242
56784 498242 506144 516697 528614 540709 552153 562143 569611 573290 571900 564249 549415 527111 498089
$$ packed form
56867D48163J3158J6239J9045K1437K3702K6029K8087K9375K9749K9315K7901
56856G12200K4904J9675J2068K799o611j4422j9474k1480k0642j7369j2373o589
56844F52686n15O026J3215K0536K7231L3098L8293M2566M5358M6630M6867M6155
56832A018146M3806L9105L1819K1786Q718p012k3691l8798n0157n6633n8192n5659
56820H73238n0153m2515l3423k3956j5383q033j008O483J3855J9771K3710K6237
56808G88823K7863K8312K6987K3681J8538J1619K758q155k0576l2901m2848m8694
56796G75407n0182m8255m4090l8569l2349k5892j9420j3161p571k983Q44M463
56784D98242P902J0553J1917J2095J1444R990P468L679j390p651j4834k2304k9022
$$ plain form
56771 498089 464236 428193 392554 359162 328926 302097 278427 257202 237649 219716 204225
56760 204225 191854 182065 173495 165476 158691 154052 151316 149210 146721 143781 140780 138002 135702 134186
56746 134186 133302 132219 130253 127832 126049 125220 124442 122851 120829 119511 119354 119666 119516 118712 117802 117337
56730 117337 117344 117530 117937 119201 121868 125449 128509 129969 130058 129810 129946 130595 131741 133349 135080 136431 137295
56713 137295 138045 139017 140219 141568 143017 144371 145338 145940 146566 147450 148337 148812 148754 148333 147805 147470 147567 148007
56695 148007 148342 148196 147643 147096 146969 147495 148612 149873 150705 150981 151178 151754 152528 152911 152716 152546 153303 155392
56677 155392 158386 161382 163687 165171 166027 166351 166137 165567 165077 165072 165703 166853 168143 169025 169216 169048 169119 169548
56659 169548 169900 169926 169983 170482 171242 171674 171510 171113 171126 171871 173000 173720 173579 173053 173049 173763 174422 174324 173685 173140
$$ packed form
56771D98089l3853l6043l5639l3392l0236k6829k3670k1225j9553j7933j5491
56760B04225j2371r789q570q019o785m639k736k106k489k940l001k778k300j516
56746A34186q84j083j966k421j783q29p78j591k022j318j57L12j50q04r10m65
56730A17337PJ86M07J264K667L581L060J460Q9k48J36O49J146J608J731J351Q64
56713A37295P50R72J202J349J449J354R67O02O26Q84Q87M75n8m21n28l35R7M40
56695A48007L35j46n53n47j27N26J117J261Q32K76J97N76P74L83j95j70P57K089
56677A55392K994K996K305J484Q56L24k14n70m90nO31J150J290Q82J91j68P1M29
56659A69548L52K6N7M99P60M32j64l97J3P45J129P20j41n26mP14O59r8o39n45
$$ plain form
56639 173140 172801 172375 171972 172173 173149 174161 174179 172824 170601 168364 166643 165449 164583 163994 163719 163511 162823
56622 162823 161326 159275 157247 155665 154695 154369 154515 154759 154854 154942 155293 155861 156326 156477 156329 155990 155634 155555
56604 155555 155944 156650 157387 158142 159133 160392 161661 162732 163674 164691 165915 167359 168870 170100 170745 170874
56588 170874 170888 171101 171451 171643 171463 171021 170822 171563 173564 176374 179138 181413 183440 185589 187812 189856
56572 189856 191846 194351 197841 202264 207227 212439 217840 223363 228802 234057 239370 245177 251745 259102
56558 259102 267172 275708 284038 291225 296636 300196 301994 301933 299978 296478 291966 286773 281156 275636 270852
56543 270852 267031 263884 261022 258231 255352 252192 248745 245357 242506 240425 238948 237631 236054 234063
56529 234063 231799 229479 227265 225317 223800 222753 222041 221554 221240 220868 220068 218814 217592 216722 215753 214006
$$ packed form
56639A73140l39m26m03K01R76J012J8j355k223k237j721j194q66n89k75k08o88
56622A62823j497k051k028j582r70l26J46K44R5Q8L51N68M65J51j48l39l56p9
56604A55555L89P06P37P55R91J259J269J071R42J017J224J444J511J230O45J29
56588A70874J4K13L50J92j80m42j99P41K001K810K764K275K027K149K223K044
56572A89856J990K505L490M423M963N212N401N523N439N255N313N807O568P357
56558B59102Q070Q536Q330P187N411L560J798o1j955l500m512n193n617n520m784
56543B70852l821l147k862k791k879l160l447l388k851k081j477j317j577j991
56529B34063k264k320k214j948j517j047p12m87l14l72q00j254j222q70r69j747
$$ plain form
56513 214006 211573 209265 207540 206047 204381 202818 201948 201889 202187 202301 201888 200756 198939 196886 195360 194923
56497 194923 195496 196445 197136 197466 197813 198508 199534 200780 202306 204061 205534 206109 205793 205181 204676 204126 203362
56480 203362 202647 202313 202299 202429 202846 203769 204996 206077 206930 207799 208631 208966 208604 207953 207498 207282 207260 207780 209156
56461 209156 210873 211848 211653 210980 210653 210577 210163 209473 209369 210440 212335 214298 215986 217474 218733 219450 219361
56444 219361 218567 217575 217061 217469 218685 220149 221342 222056 222295 222190 222078 222327 222857 223158 223030 222974 223513 224426
56426 224426 225142 225668 226533 227796 228724 228666 227862 227111 226908 227151 227508 227832 228250 228952 229912 230794 231222 231126 230716
56407 230716 230207 229766 229653 230107 231011 231882 232319 232323 232162 232055 232077 232247 232622 233329 234470 235956 237542 239151
56389 239151 241029 243368 245888 248002 249335 249842 249572 248700 247732 247300 247629 248435 249354 250226 250978 251615 252353
$$ packed form
56513B14006k433k308j725j493j666j563q70n9K98J14m13j132j817k053j526m37
56497A94923N73R49O91L30L47O95J026J246J526J755J473N75l16o12n05n50p64
56480B03362p15l34j4J30M17R23J227J081Q53Q69Q32L35l62o51m55k16k2N20J376
56461B09156J717R75j95o73l27p6m14o90j04J071J895J963J688J488J259P17q9
56444B19361p94r92n14M08J216J464J193P14K39j05j12K49N30L01j28n6N39R13
56426B24426P16N26Q65J263R28n8q04p51k03K43L57L24M18P02R60Q82M28r6m10
56407B30716n09m41j13M54R04Q71M37Mj61j07K2J70L75P07J141J486J586J609
56389B39151J878K339K520K114J333N07k70q72r68m32L29Q06R19Q72P52O37P38
$$ plain form
56372 252353 253435 254744 255936 257045 258512 260429 262213 263347 264170 265493 267550 269721 271258 272035 272485
56357 272485 273015 273685 274446 275558 277441 280057 282659 284481 285561 286618 288231 290417 292851 295128 296880
56342 296880 298099 299311 300979 302838 304427 306207 309284 313795 318447 322131 325215 328573 332040 334793
56328 334793 336863 339234 342474 346181 349907 353746 357658 360882 362590 362842 362472 362197 362182 362400 363065 364478
56312 364478 366485 368349 369455 370164 371619 374521 378408 382393 386243 390334 394856 399767 405422 412442
56298 412442 420686 428935 436055 442163 448247 454863 461674 468150 474328 480756 487972 496175 505260 514985
56284 514985 525095 535443 546166 557708 570531 584719 599961 615915 632445 649439 666755
56273 666755 684659 704134 726295 751435 778958 808358 839985 874691 912973 954760 1000006
$$ packed form
56372B52353J082J309J192J109J467J917J784J134Q23J323K057K171J537P77M50
56357B72485N30O70P61J112J883K616K602J822J080J057J613K186K434K277J752
56342B96880J219J212J668J859J589J780L077M511M652L684L084L358L467K753
56328C34793K070K371L240L707L726L839L912L224J708K52l70k75j5K18O65J413
56312C64478K007J864J106P09J455K902L887L985L850M091M522M911N655P020
56298D12442Q244Q249P120O108O084O616O811O476O178O428P216Q203R085R725
56284E14985J0110J0348J0723J1542J2823J4188J5242J5954J6530J6994J7316
56273F66755J7904J9475K2161K5140K7523K9400L1627L4706L8282M1787M5246
$$ plain form
56262 1000006 1049308 1103840 1164683 1232170 1305866 1385233 1470321 1561774 1660226 1765781 1878069
56251 1878069 1996646 2121220 2251498 2386849 2526149 2667994 2810995 2953657 3093919
56242 3093919 3229063 3356326 3473519 3578887 3670483 3745941 3802857 3839259 3853905 3846455 3817371
56231 3817371 3767443 3697493 3608864 3504133 3386814 3260162 3126522 2987861 2846386 2704245
56221 2704245 2562968 2423682 2287771 2156938 2032561 1915234 1804987 1701789 1605805 1517255
56211 1517255 1435988 1361163 1291596 1226636 1166523 1111702 1061973 1016650 975330 938029 904542
56200 904542 874182 846342 820903 797900 777126 758352 741616 726945 713957 702095 691135
56189 691135 681168 672193 664042 656685 650272 644883 640449 636899 634108 631721 629357 627081 625398 624737
$$ packed form
56262A000006M9302N4532O0843O7487P3696P9367Q5088R1453R8452J05555J12288
56251A878069J18577J24574J30278J35351J39300J41845J43001J42662J40262
56242C093919J35144J27263J17193J05368R1596P5458N6916L6402J4646p450k9084
56231C817371m9928o9950q8629j04731j17319j26652j33640j38661j41475j42141
56221B704245j41277j39286j35911j30833j24377j17327j10247j03198r5984q8550
56211A517255q1267p4825o9567o4960o0113n4821m9729m5323m1320l7301l3487
56200I04542l0360k7840k5439k3003k0774j8774j6736j4671j2988j1862j0960
56189F91135r967q975q151p357o413n389m434l550k791k387k364k276j683o61
$$ plain form
56175 624737 625148 626518 628747 631609 634796 638291 642421 647363 652855 658644 665027 672660 681937 692760
56161 692760 704813 717871 731871 746889 763125 780968 801169 824733 852244 883263 916798
56150 916798 952481 990965 1033116 1079349 1129925 1185264 1245426 1309782 1377698 1449215 1524541
56139 1524541 1603268 1684636 1768141 1853089 1937757 2019816 2097531 2169868 2235574 2293063 2341450
56128 2341450 2380951 2412076 2435102 2450526 2459300 2462125 2458872 2448921 2431679 2406609 2373350 2332226
56116 2332226 2284297 2230675 2172010 2108601 2040459 1967192 1888550 1805530 1720552 1636289 1554739
56105 1554739 1477557 1406520 1343028 1287514 1239744 1199349 1165755 1138064 1115578 1098154 1085620
56094 1085620 1077102 1071329 1067401 1064894 1063580 1063428 1064689 1067530 1071667 1076638 1082268 1088673 1096025 1104450
$$ packed form
56175F24737M11J370K229K862L187L495M130M942N492N789O383P633R277J0823
56161F92760J2053J3058J4000J5018J6236J7843K0201K3564K7511L1019L3535
56150I16798L5683L8484M2151M6233N0576N5339O0162O4356O7916P1517P5326
56139A524541P8727Q1368Q3505Q4948Q4668Q2059P7715P2337O5706N7489M8387
56128B341450L9501L1125K3026J5424Q774K825l253r951j7242k5070l3259m1124
56116B332226m7929n3622n8665o3409o8142p3267p8642q3020q4978q4263q1550
56105A554739p7182p1037o3492n5514m7770m0395l3594k7691k2486j7424j2534
56094A085620q518n773l928k507j314j52J261K841M137M971N630O405P352Q425
$$ plain form
56080 1104450 1113852 1123695 1133332 1142788 1152883 1164364 1177250 1191181 1205895 1221136 1236634 1252536
56068 1252536 1269388 1287281 1305459 1323129 1340295 1357511 1375269 1393912 1413571 1433753 1453516
56057 1453516 1472422 1490836 1509001 1526582 1543549 1560664 1578372 1596034 1613087 1630315 1649005
56046 1649005 1669392 1690874 1713275 1736826 1761305 1786287 1812084 1839429 1868358 1898288 1929062
56035 1929062 1961027 1994214 2028423 2064100 2102206 2143112 2186356 2231515 2278630 2327778 2378961
56024 2378961 2432398 2488264 2546168 2605548 2666550 2729921 2796207 2865654 2938612 3015224 3094888
56013 3094888 3176936 3261756 3350517 3443909 3541973 3644943 3753291 3866950 3985391 4108533
56003 4108533 4236908 4371084 4511787 4660381 4818208 4985373 5161081 5345250 5539081
$$ packed form
56080A104450R402R843R637R456J0095J1481J2886J3931J4714J5241J5498J5902
56068A252536J6852J7893J8178J7670J7166J7216J7758J8643J9659K0182J9763
56057A453516J8906J8414J8165J7581J6967J7115J7708J7662J7053J7228J8690
56046A649005K0387K1482K2401K3551K4479K4982K5797K7345K8929K9930L0774
56035A929062L1965L3187L4209L5677L8106M0906M3244M5159M7115M9148N1183
56024B378961N3437N5866N7904N9380O1002O3371O6286O9447P2958P6612P9664
56013C094888Q2048Q4820Q8761R3392R8064J02970J08348J13659J18441J23142
56003D108533J28375J34176J40703J48594J57827J67165J75708J84169J93831
$$ plain form
55994 5539081 5744185 5962006 6193984 6441352 6704858 6985561 7285820 7608680 7956554
55985 7956554 8331575 8737029 9177343 9656892 10180085 10752804 11382876 12079491 12853476
55976 12853476 13718432 14691126 15791902 17047022 18491798 20171557 22140126 24456855
55968 24456855 27180696 30360771 34028805 38199842 42879716 48072611 53786927 60042508
55960 60042508 66878641 74358192 82565649 91599203 101555525 112509476 124497852 137510900
55952 137510900 151481650 166269196 181657618 197391879 213227376 228935892 244239275
55945 244239275 258699114 271611726 281952662 288431360 289723274 284862402 273629695
55938 273629695 256717004 235569739 212005424 187798741 164379355 142697227 123242065
$$ packed form
55994E539081K05104K17821K31978K47368K63506K80703L00259L22860L47874
55985G956554L75021M05454M40314M79549N23193N72719O30072O96615P73985
55976A2853476Q64956R72694J100776J255120J444776J679759J968569K316729
55968B4456855K723841L180075L668034M171037M679874N192895N714316O255581
55960F0042508O836133P479551Q207457R033554R956322J0953951J1988376J3013048
55952A37510900J3970750J4787546J5388422J5734261J5835497J5708516J5303383
55945B44239275J4459839J2912612J0340936O478698J291914m860872j1232707
55938B73629695j6912691k1147265k3564315k4206683k3419386k1682128j9455162
$$ plain form
55931 123242065 106160159 91391236 78768410 68072931 59065076 51505589 45168238
55924 45168238 39845914 35356478 31547619 28295537 25499013 23075541 20960192 19102688
55916 19102688 17462656 16007180 14710622 13553037 12517204 11587546 10750883 9996156
55908 9996156 9313246 8693264 8129529 7616700 7149113 6721134 6328679 5968788 5637953
55899 5637953 5332342 5049525 4788463 4547626 4324372 4116367 3922528 3742397 3575444
55890 3575444 3421029 3278161 3145221 3020710 2904282 2796310 2696530 2603904 2517724 2437983
55880 2437983 2364526 2296580 2233256 2173949 2118164 2065425 2015441 1967947 1922388 1878051 1834370
55869 1834370 1790795 1746535 1700818 1653334 1604301 1554464 1505161 1457845 1413082 1370402 1329392
$$ packed form
55931A23242065j7081906j4768923j2622826j0695479r007855p559487o337351
55924D5168238n322324m489436l808859l252082k796524k423472k115349j857504
55916A9102688j640032j455476j296558j157585j035833r29658q36663p54727
55908I996156o82910o19982n63735n12829m67587m27979l92455l59891l30835
55899E637953l05611k82817k61062k40837k23254k08005j93839j80131j66953
55890C575444j54415j42868j32940j24511j16428j07972r9780r2626q6180p9741
55880B437983p3457o7946o3324n9307n5785n2739m9984m7494m5559m4337m3681
55869A834370m3575m4260m5717m7484m9033m9837m9303m7316m4763m2680m1010
$$ plain form
55858 1329392 1290336 1253465 1218344 1184641 1152811 1123314 1095679 1069119 1043544 1019173 995576
55847 995576 971964 948172 924615 901555 879075 857479 837018 817518 798896 781627 766010
55836 766010 751368 736821 722516 709273 697308 686098 675294 664948 655042 645630 637216 630236
55824 630236 624343 618927 614014 609801 605641 600599 594847 589407 584538 579491 574055 569249 566085 564521
55810 564521 564014 564361 565500 567106 568883 570918 573458 576547 579994 583410 586335 588689 590888 592988 593893
55795 593893 592180 587708 581736 575338 568426 560480 551483 541847 531979 522277 513137 504716 497018 490332
55781 490332 485165 481600 479059 476753 474040 470531 466474 463086 461787 462778 464801 466491 467531 468350 469224
55766 469224 469910 469734 467743 463101 455558 445427 433132 419139 404228 389312 374884 361075 348276
$$ packed form
55858A329392l9056l6871l5121l3703l1830k9497k7635k6560k5575k4371k3597
55847I95576k3612k3792k3557k3060k2480k1596k0461j9500j8622j7269j5617
55836G66010j4642j4547j4305j3243j1965j1210j0804j0346r906r412q414o980
55824F30236n893n416m913m213m160n042n752n440m869n047n436m806l164j564
55810E64521n07L47J139J606J777K035K540L089L447L416K925K354K199K100R05
55795E93893j713m472n972o398o912p946q997r636r868r702r140q421p698o686
55781D90332n167l565k541k306k713l509m057l388j299R91K023J690J040Q19Q74
55766D69224O86j76j991m642p543j0131j2295j3993j4911j4916j4428j3809j2799
$$ plain form
55753 348276 337224 328318 321270 315516 310531 305741 300673 295431 290690 287033 284525 282845 281446 279662
55739 279662 277255 274890 273530 273324 273599 273901 274370 274997 275280 274899 274102 273143 271919 270372 268665 266655
55723 266655 263893 260517 257514 255601 254418 253328 252470 252349 252812 253146 253092 253170 254040 255936 258630 261572
55707 261572 264170 266212 267979 269666 270861 270860 269441 267071 264408 261738 258875 255428 251237 246607 242131
55692 242131 238327 235563 234105 233905 234415 235013 235627 236614 238127 240049 242439 245391 248445 250851 252644
55677 252644 254772 257831 261260 264140 266132 267215 267144 265885 264163 262917 262354 262045 261668 261211 260698 260315
55661 260315 260597 261925 263914 265785 267297 268869 270788 272733 274113 274593 274296 273698 273208 272614 271020 267647
55645 267647 262601 256660 250491 244349 238366 232696 227403 222490 217997 213839 209678 205326 201176 197856
$$ packed form
55753C48276j1052q906p048n754m985m790n068n242m741l657k508j680j399j784
55739B79662k407k365j360k06K75L02M69O27K83l81p97r59j224j547j707k010
55723B66655k762l376l003j913j183j090q58j21M63L34n4P8Q70J896K694K942
55707B61572K598K042J767J687J195jj419k370k663k670k863l447m191m630m476
55692B42131l804k764j458k00N10N98O14R87J513J922K390K952L054K406J793
55677B52644K128L059L429K880J992J083p1j259j722j246n63l09l77m57n13l83
55661B60315K82J328J989J871J512J572J919J945J380M80k97n98m90n94j594l373
55645B67647n046n941o169o142n983n670n293m913m493m158m161m352m150l320
$$ plain form
55631 197856 195429 193312 191030 188729 186774 185136 183397 181306 179102 177283 176118 175452 174983 174564 174093
55616 174093 173237 171568 169047 166155 163427 161070 159066 157378 155877 154325 152626 150977 149578 148372
55602 148372 147249 146337 145851 145724 145501 144674 143099 141213 139751 139111 138977 138758 138286 137855 137699 137834 138362
55585 138362 139483 141147 143087 145201 147405 149155 149776 149493 149480 150606 152616 154876 157261 159916 162678
55570 162678 165270 167687 169980 172101 174318 177237 180892 184293 186409 187162 186904 185591 183239 180706 178995
55555 178995 177989 176730 174826 172679 170504 168107 165749 164279 164091 164639 165266 165886 166647 167492 168266 168750
55539 168750 168443 166912 164570 162501 161233 160246 158983 157674 156738 155963 154925 153784 152978 152368 151309 149551
55523 149551 147469 145361 143019 140195 137123 134332 132093 130250 128514 126714 124849 123118 121901 121508
$$ packed form
55631A97856k427k117k282k301j955j638j739k091k204j819j165o66m69m19m71
55616A74093q56j669k521k892k728k357k004j688j501j552j699j649j399j206
55602A48372j123r12m86j27k23q27j575j886j462o40j34k19m72m31j56J35N28
55585A38362J121J664J940K114K204J750O21k83j3J126K010K260K385K655K762
55570A62678K592K417K293K121K217K919L655L401K116P53k58j313k352k533j711
55555A78995j006j259j904k147k175k397k358j470j88N48O27O20P61Q45P74M84
55539A68750l07j531k342k069j268r87j263j309r36p75j038j141q06o10j059j758
55523A49551k082k108k342k824l072k791k239j843j736j800j865j731j217l93
$$ plain form
55509 121508 121768 121991 121535 120309 118646 116882 115381 114739 115326 116619 117547 117688 117566 117560 117241 116324 115542 115739
55491 115739 116513 116639 115732 114641 114208 114359 114531 114380 113872 113173 112596 112299 112057 111742 111834 112854 114413 115577
55473 115577 116135 116686 117383 117561 116965 116399 116563 116949 116618 115544 114479 113851 113481 113139 112756 112211 111514 111063
55455 111063 111208 111605 111528 110818 110033 109643 109511 109374 109423 110078 111340 112644 113349 113268 112677 111908 111108 110453 110310
55436 110310 110859 111637 111922 111693 111796 112943 114816 116497 117543 118265 119016 119596 119490 118570 117437 116999 117590
55419 117590 118534 118749 117861 116534 115656 115474 115672 116059 116812 118122 119830 121423 122307 122123 120979 119431 118152
55402 118152 117501 117331 117169 116655 115859 115099 114445 113656 112744 112315 112969 114502 116077 117101 117560 117592 117211 116499
55384 116499 115654 114771 113932 113496 113839 114744 115561 116078 116665 117407 117741 117268 116415 115864 115783 115996 116448 117000 117188
$$ packed form
55509A21508K60K23m56j226j663j764j501o42N87J293R28J41j22ol19r17p82J97
55491A15739P74J26r07j091m33J51J72j51n08o99n77k97k42l15R2J020J559J164
55473A15577N58N51O97J78n96n66J64L86l31j074j065o28l70l42l83n45o97m51
55455A11063J45L97p7p10p85l90j32j37M9O55J262J304P05q1n91p69q00o55j43
55436A10310N49P78K85k29J03J147J873J681J046P22P51N80j06r20j133m38N91
55419A17590R44K15q88j327q78j82J98L87P53J310J708J593Q84j84j144j548j279
55402A18152o51j70j62n14p96p60o54p89r12m29O54J533J575J024M59L2l81p12
55384A16499q45q83q39m36L43R05Q17N17N87P42L34m73q53n51q1K13M52N52J88
$$ plain form
55365 117188 116733 116073 115879 116212 116579 116573 116103 115296 114620 114732 115582 115922 114485 111674 109367 108905 109873 111012
55347 111012 111691 112094 112447 112690 112822 113069 113521 113828 113515 112609 111771 111636 112151 112785 113274 113808 114458 114829 114525
55328 114525 113639 112517 111309 110037 108925 108380 108727 110001 111759 113136 113573 113638 114530 116439 118038 118121
55312 118121 117116 116253 115754 114866 113402 112174 111818 112074 112445 112828 113213 113449 113571 113831 114125 113933 113086 112118
55294 112118 111602 111609 112058 113053 114499 115849 116648 117001 117188 117221 117109 117135 117430 117600 117258 116643 116188 115724 114717
55275 114717 113239 112092 111875 112308 112649 112435 111703 110784 110140 110170 110886 111767 112151 111891 111538 111804 112857 114281
55257 114281 115639 116849 117913 118635 118919 119131 119722 120510 120838 120496 120061 120080 120305 120066 119168 118057 117209 116611
55239 116611 115877 114759 113565 113019 113530 114593 115178 114810 114007 113597 113895 114685 115596 116267 116445 116282 116307 116769
$$ packed form
55365A17188m55o60j94L33L67om70q07o76J12Q50L40j437k811k307m62R68J139
55347A11012O79M03L53K43J32K47M52L07l13r06q38j35N15O34M89N34O50L71l04
55328A14525q86j122j208j272j112n45L47J274J758J377M37O5Q92J909J599Q3
55312A18121j005q63m99q88j464j228l56K56L71L83L85K36J22K60K94j92q47r68
55294A12118n16PM49R95J446J350P99L53J87L3j12K6K95J70l42o15m55m64j007
55275A14717j478j147k17M33L41k14p32r19o44L0P16Q81L84k60l53K66J053J424
55257A14281J358J210J064P22K84K12N91P88L28l42m35J9K25k39q98j111q48n98
55239A16611p34j118j194n46N11J063N85l68q03m10K98P90R11O71J78j63K5M62
$$ plain form
55221 116769 117244 117176 116608 116006 115588 115249 115055 115283 115937 116603 116860 116566 115736 114509 113324 112803 113222 114297
55203 114297 115541 116633 117402 117748 117786 117874 118290 118957 119585 119983 120161 120206 120148 119863 119090 117754 116356 115814 116661
55184 116661 118482 120277 121367 121774 121831 121718 121456 121050 120438 119449 118117 116992 116840 117907 119679 121460
55168 121460 122936 124025 124566 124560 124522 125066 126142 127175 127963 128815 129648 129631 128240 126167 124546 123612 122820 122033
55150 122033 121747 122116 122557 122648 122696 123020 123251 122914 122350 122460 123578 125066 125979 125829 124813 123608 122953 123023
55132 123023 123207 122717 121425 119866 118516 117451 116744 116749 117704 119306 120949 122267 123286 124142 124876 125473 125919
55115 125919 126219 126385 126433 126362 126206 126115 126255 126576 126815 126791 126613 126522 126655 127080 127907 129176 130676 132040 132986
55096 132986 133416 133402 133213 133196 133457 133738 133827 133968 134543 135432 136081 136281 136491 137188 138182 138861 138975 138947 139426 140664
$$ packed form
55221A16769M75o8n68o02m18l39j94K28O54O66K57k94q30j227j185n21M19J075
55203A14297J244J092P69L46L8Q8M16O67O28L98J78M5n8k85p73j336j398n42Q47
55184A16661J821J795J090M07N7j13k62m06o12r89j332j125j52J067J772J781
55168A21460J476J089N41ol8N44J076J033P88Q52Q33j7j391k073j621r34p92p87
55150A22033k86L69M41R1M8L24K31l37n64J10J118J488R13j50j016j205o55P0
55132A23023J84m90j292j559j350j065p07NR55J602J643J318J019Q56P34N97M46
55115A25919L00J66M8p1j56r1J40L21K39k4j78r1J33M25Q27J269J500J364R46
55096A32986M30j4j89j7K61K81Q9J41N75Q89O49K00K10O97R94O79J14k8M79J238
$$ plain form
55076 140664 142249 143411 143734 143603 143806 144562 145225 145088 144187 143081 142091 141140 140192 139395 138763 138082 137273 136575
55058 136575 136259 136305 136426 136286 135674 134676 133666 133015 132745 132653 132652 132763 132807 132393 131353 129990 128817 128165 128065
55039 128065 128342 128791 129404 130344 131556 132557 132878 132621 132199 131707 131049 130594 130990 132162 133179 133436 133384 133649
55021 133649 134064 134101 133793 133529 133313 132974 132861 133467 134456 134934 134754 134733 135328 135876 135608 134785 134282 134479 135122
55002 135122 135978 137048 138219 139211 139910 140439 140906 141395 142118 143233 144441 145105 145022 144837 145407 146721 147737
54985 147737 147457 146080 144815 144559 145054 145499 145637 145798 146102 146244 146173 146373 147126 147938 148127 147744 147453 147650
54967 147650 148114 148530 148902 149359 149833 150120 150178 150211 150476 150967 151385 151558 151863 152917 154635 155952 155870 154639
54949 154639 153467 153129 153285 153304 153271 153824 155198 156803 157835 158150 158383 159210 160583 161896 162826 163730 165072
$$ packed form
55076A40664J585J162L23j31K03P56O63j37r01j106r90r51r48p97o32o81q09o98
55058A36575l16M6J21j40o12r98j010o51k70r2jJ11M4m14j040j363j173o52j00
55039A28065K77M49O13R40J212J001L21k57m22m92o58m55L96J172J017K57n2K65
55021A33649M15L7l08k64k16l39j13O06R89M78j80k1N95N48k68q23n03J97O43
55002A35122Q56J070J171R92O99N29M67M89P23J115J208O64q3j85N70J314J016
54985A47737k80j377j265k56M95M45J38J61L04J42p1K00P53Q12J89l83k91J97
54967A47650M64M16L72M57M74K87N8L3K65M91M18J73L05J054J718J317q2j231
54949A54639j172l38J56J9l3N53J374J605J032L15K33Q27J373J313R30R04J342
$$ plain form
54932 165072 166792 168575 170496 172958 176076 179608 183486 187906 192761 197453 201530 205154 208663 211953
54918 211953 214582 216246 216885 216547 215432 213881 212047 209726 206714 203136 199208 194927 190337 185897 182186
54903 182186 179308 176920 174692 172437 170024 167669 166193 166363 167876 169500 170374 170708 171078 171608 172234 173288
54887 173288 175230 177964 180876 183532 185989 188526 191424 194991 199423 204479 209476 213775 217170 219787
54873 219787 221678 222608 222224 220435 217580 214132 210178 205403 199732 193783 188425 183918 179754 175353 170717
54858 170717 166373 162874 160408 158655 156916 154583 151706 149032 147313 146608 146336 145936 145326 144738 144304 143871
54842 143871 143133 141941 140554 139575 139420 139800 139914 139287 138238 137383 136915 136663 136668 137137 137890 138394 138576 139067
54824 139067 140309 141928 143397 144817 146356 147346 146929 145585 145018 146164 148102 149368 149672 149729 149984 150290
$$ packed form
54932A65072J720J783J921K462L118L532L878M420M855M692M077L624L509L290
54918B11953K629J664O39l38j115j551j834k321l012l578l928m281m590m440l711
54903A82186k878k388k228k255k413k355j476J70J513J624Q74L34L70N30O26J054
54887A73288J942K734K912K656K457K537K898L567M432N056M997M299L395K617
54873B19787J891R30l84j789k855l448l954m775n671n949n358m507m164m401m636
54858A70717m344l499k466j753j739k333k877k674j719p05k72m00o10n88m34m33
54842A43871p38j192j387r79j55L80J14o27j049q55m68k52NM69P53N04J82M91
54824A39067J242J619J469J420J539R90m17j344n67J146J938J266L04N7K55L06
$$ plain form
54808 150290 150518 150713 150689 150142 149218 148403 147818 147137 146324 145983 146694 148324 150194 151675 152500 152754 152810 153128
54790 153128 153927 155065 156257 157302 158077 158578 159068 160009 161656 163804 166007 167989 169761 171449 173203
54775 173203 175292 178127 182020 186879 192273 197844 203486 208926 213434 216510 218841 221904 226222 230548
54761 230548 233260 234120 234014 233296 231313 227607 222737 217567 212333 206845 201227 196048 191916 189111 187399
54746 187399 186000 184030 181224 178129 175432 173309 171578 170299 170011 171323 174241 177852 180870 182775
54732 182775 184250 186174 188480 190578 192653 195608 199602 203528 206403 208548 210896 213702 216521 218930
54718 218930 220640 221310 220837 219540 217509 214191 209311 203821 199112 195453 191996 188172 184287 180736 177501
54703 177501 174592 172206 170213 168110 165786 163759 162384 161410 160611 160273 160627 161277 161622 161446 160706 159200
$$ packed form
54808A50290K28J95k4n47r24q15n85o81q13l41P11J630J870J481Q25K54N6L18
54790A53128P99J138J192J045P75N01M90R41J647K148K203J982J772J688J754
54775A73203K089K835L893M859N394N571N642N440M508L076K331L063M318M326
54761B30548K712Q60j06p18j983l706m870n170n234n488n618n179m132k805j712
54746A87399j399j970k806l095k697k123j731j279k88J312K918L611L018J905
54732A82775J475J924K306K098K075K955L994L926K875K145K348K806K819K409
54718B18930J710O70m73j297k031l318m880n490m709l659l457l824l885l551l235
54703A77501k909k386j993k103k324k027j375r74p99l38L54O50L45j76p40j506
$$ plain form
54687 159200 157014 154953 153832 153481 153040 152161 151351 151070 151153 151313 151644 152239 152713 152651 152307 152314 152695 152689 151792 150544
54667 150544 149879 149984 150227 150113 149773 149454 149036 148307 147378 146537 145952 145740 146063 146822 147479 147548 147126 146671 146457
54648 146457 146559 147120 148146 149168 149583 149333 148822 148226 147337 146158 145134 144663 144731 145134 145723 146337 146853 147427
54630 147427 148350 149596 150849 152001 153154 154085 154284 153797 153477 153937 154665 154658 153710 152609 152186 152517 153019 153036
54612 153036 152380 151488 150991 151054 151333 151649 152335 153648 155213 156437 157242 157908 158353 158059 156772 154909 153178
54595 153178 152073 151778 152259 153256 154276 154768 154441 153554 152899 153232 154563 156132 157177 157578 157672 157707 157670 157406
54577 157406 156674 155322 153616 152158 151295 150867 150800 151467 153010 154682 155538 155625 155819 156487 157042 156977 156652 156698
54559 156698 157122 157519 157890 158750 160388 162345 163694 163784 162774 161545 161033 161563 162778 164109 165154 165709
$$ packed form
54687A59200k186k061j121l51m41q79q10k81Q3J60L31N95M74o2l44PL81oq97j248
54667A50544o65J05K43j14l40l19m18p29r29q41n85k12L23P59O57O9m22m55k14
54648A46457J02N61J026J022M15k50n11n96q89j179j024m71O8M03N89O14N16N74
54630A47427R23J246J253J152J153R31J99m87l20M60P28pr48j101m23L31N02J7
54612A53036o56q92m97O3K79L16O86J313J565J224Q05O66M45k94j287j863j731
54595A53178j105k95M81R97J020M92l27q87o55L33J331J569J045M01R4L5l7k64
54577A57406p32j352j706j458q63m28o7O67J543J672Q56Q7J94O68N55o5l25M6
54559A56698M24L97L71Q60J638J957J349R0j010j229n12N30J215J331J045N55
$$ plain form
54543 165709 165749 165502 165419 165917 167132 168824 170433 171330 171227 170366 169201 168053 167205 167072 167792 168707 168749 167532
54525 167532 165717 164185 163159 162301 161308 160175 159109 158420 158315 158625 158908 159000 159175 159603 159924 159685 159007
54508 159007 158518 158684 159467 160507 161355 161620 161184 160324 159476 158916 158825 159466 160903 162564 163483 163178 162150 161434
54490 161434 161729 162957 164443 165455 165724 165608 165747 166488 167684 168918 169800 170086 169804 169336 169181 169475 169819
54473 169819 169728 169239 168995 169698 171447 173591 175303 176365 177268 178442 179516 179698 178855 177838 177533 177883 178113
54456 178113 177754 177085 176649 176592 176521 175834 174266 172289 170870 170594 171053 171344 171039 170356 169522 168529 167535 166971
54438 166971 166985 167291 167806 168912 170678 172359 173255 173654 174248 174971 175243 175189 175618 176696 177574 177672 177515 177807
54420 177807 178395 178734 178803 178905 178970 178801 178727 179335 180696 182441 184390 186492 188221 188775 187994 186599 185426
$$ packed form
54543A65709M0k47q3M98J215J692J609Q97j03q61j165j148q48j33P20R15M2j217
54525A67532j815j532j026q58r93j133j066o89j05L10K83R2J75M28L21k39o78
54508A59007m89J66P83J040Q48K65m36q60q48n60r1O41J437J661R19l05j028p16
54490A61434K95J228J486J012K69j16J39P41J196J234Q82K86k82m68j55K94L44
54473A69819r1m89k44P03J749K144J712J062R03J174J074J82q43j017l05L50K30
54456A78113l59o69m36n7p1o87j568j977j419k76M59K91l05o83q34r93r94n64
54438A66971J4L06N15J106J766J681Q96L99N94P23K72n4M29J078Q78R8j57K92
54420A77807N88L39O9J02O5j69p4O08J361J745J949K102J729N54p81j395j173
$$ plain form
54403 185426 184876 185054 185918 187133 188262 189235 190255 191249 191908 192332 193006 193935 194423 194132 193836 194539 196105
54386 196105 197323 197324 196506 196001 196460 197482 198176 198181 198037 198462 199457 200402 200916 201232 201737 202544 203633 204946 206245
54367 206245 207311 208446 210274 212810 215242 217031 218645 220729 222976 224475 224849 224364 223116 220881 217840
54352 217840 214745 212103 209672 207003 204119 201466 199430 198067 197080 195969 194437 192773 191601 191142 190918
54337 190918 190296 189180 188015 187254 186885 186497 185778 184973 184742 185477 186909 188529 190176 191928 193548 194485
54321 194485 194451 193687 192645 191690 191094 190950 190993 190830 190427 190096 189904 189487 188576 187391 186275 185270 184325 183655
54303 183655 183513 183766 184017 184124 184298 184717 185266 185680 185790 185613 185323 185118 185026 184888 184625 184420 184507 184893 185468
54284 185468 186287 187495 188935 190109 190625 190561 190313 190216 190385 190775 191243 191605 191789 191898 192029 192101 192069 192268 193236
$$ packed form
54403A85426n50J78Q64J215J129R73J020R94O59M24O74R29M88k91k96P03J566
54386A96105J218Jq18n05M59J022O94Nj44M25R95R45N14L16N05Q07J089J313J299
54367B06245J066J135J828K536K432J789J614K084K247J499L74m85j248k235l041
54352B17840l095k642k431k669k884k653k036j363r87j111j532j664j172m59k24
54337A90918o22j116j165p61l69l88p19q05k31P35J432J620J647J752J620R37
54321A94485l4p64j042r55n96j44M3j63m03l31j92m17r11j185j116j005r45o70
54303A83655j42K53K51J07J74M19N49M14J10j77k90k05r2j38k63k05Q7L86N75
54284A85468Q19J208J440J174N16o4k48r7J69L90M68L62J84J09J31P2l2J99R68
$$ plain form
54265 193236 195041 197021 198474 199461 200607 202157 203646 204555 204887 204862 204487 203733 202914 202416 202193 201914 201535
54248 201535 201351 201507 201846 202287 202924 203655 204090 204014 203652 203295 202943 202562 202404 202780 203633 204595 205374 205860 205971
54229 205971 205673 205152 204709 204413 204039 203465 203079 203558 205121 206982 207820 207009 205387 204495 205002 206041 206200
54212 206200 204928 202824 200746 198999 197485 196321 195991 196742 198023 198840 198757 198297 198130 198113 197553 196304 195139
54195 195139 194880 195494 196217 196335 195725 194883 194566 195174 196342 197331 197826 198089 198289 198168 197597 197031 197059 197762 198810
54176 198810 199875 200581 200399 199090 197105 195180 193660 192571 192069 192310 192988 193534 193759 193847 193743 193111 191981
54159 191981 190952 190534 190669 191017 191363 191563 191418 190879 190133 189355 188585 187898 187431 187119 186760 186468 186738 187827
54141 187827 189352 190746 191870 192846 193540 193632 193212 192934 193418 194596 195810 196521 196847 197362 198448 199949 201436
$$ packed form
54265A93236J805J980J453R87J146J550J489R09L32k5l75p54q19m98k23k79l79
54248B01535j84J56L39M41O37P31M35p6l62l57l52l81j58L76Q53R62P79M86J11
54229B05971k98n21m43k96l74n74l86M79J563J861Q38q11j622q92N07J039J59
54212B06200j272k104k078j747j514j164l30P51J281Q17q3m60j67j7n60j249j165
54195A95139k59O14P23J18o10q42l17O08J168R89M95K63K00j21n71n66K8P03J048
54176A98810J065P06j82j309j985j925j520j089n02K41O78N46K25Q8j04o32j130
54159A91981j029m18J35L48L46K00j45n39p46p78p70o87m67l12l59k92K70J089
54141A87827J525J394J124R76O94R2m20k78M84J178J214P11L26N15J086J501J487
$$ plain form
54124 201436 202591 203307 203700 204217 205391 207145 208594 209007 208794 209027 210113 211569 213075 214972 217498 220244
54108 220244 222778 225250 227898 230435 232430 234039 235834 238119 240773 243514 245964 247711 248695 249289 249626
54093 249626 249239 247755 245598 243429 241272 238931 236990 236477 237475 238882 239746 240198 240824 241800 242959 244179
54077 244179 245264 245862 245932 245992 246541 247398 247900 247564 246364 244576 242669 241176 240410 240314 240560 240674 240130 238747
54059 238747 237099 236171 236362 237138 237801 238251 238707 239142 239402 239644 240233 241363 243084 245530 248752 252480 256342
54042 256342 260198 263976 267441 270546 273851 278081 283268 288724 293865 298714 303611 308815 314430 320394
54028 320394 326454 332379 338193 343913 349134 353249 356066 357884 358956 359392 359606 360302 361649 362901 363188
54013 363188 362467 361397 360414 359225 357087 353404 348207 342256 336567 331668 327342 323081 318593 313876 309162
$$ packed form
54124B01436J155P16L93N17J174J754J449M13k13K33J086J456J506J897K526K746
54108B20244K534K472K648K537J995J609J795K285K654K741K450J747R84N94L37
54093B49626l87j484k157k169k157k341j941n13R98J407Q64M52O26R76J159J220
54077B44179J085N98P0O0N49Q57N02l36j200j788j907j493p66r6K46J14n44j383
54059B38747j648r28J91P76O63M50M56M35K60K42N89J130J721K446L222L728L862
54042B56342L856L778L465L105L305M230N187N456N141M849M897N204N615N964
54028C20394O060N925N814N720N221M115K817J818J072M36K14O96J347J252K87
54013C63188p21j070r83j189k138l683n197n951n689m899m326m261m488m717m714
$$ plain form
53998 309162 304934 301601 298937 296153 292829 289444 286676 284490 282391 280283 278455 276895 275232 273432
53984 273432 271927 270844 269668 267983 266190 265101 265006 265427 265743 265800 265970 266706 268056 269565 270752 271704
53968 271704 273043 275341 278745 283124 288228 293570 298487 302590 306039 309263 312617 316456 321245 327212
53954 327212 334000 340874 347159 352250 355450 356311 355132 352716 349558 345630 341160 337152 334690 333890 333968
53939 333968 334382 335425 337526 340312 342883 344888 346842 349229 351719 353643 354936 356152 357712 359686
53925 359686 362328 366162 371249 376866 382346 387856 393869 400161 406011 411377 417176 424152 431931 439524
53911 439524 446464 453019 459420 465324 470169 473830 476723 479353 481843 483925 485237 485565 484924 483537 481700
53896 481700 479493 476637 472858 468420 463996 459876 455615 450689 445166 439394 433312 426579 419254 411814
$$ packed form
53998C09162m228l333k664k784l324l385k768k186k099k108j828j560j663j800
53984B73432j505j083j176j685j793j089r5M21L16N7J70P36J350J509J187R52
53968B71704J339K298L404M379N104N342M917M103L449L224L354L839M789N967
53954C27212O788O874O285N091L200Q61j179k416l158l928m470m008k462q00P8
53939C33968M14J043K101K786K571K005J954K387K490J924J293J216J560J974
53925C59686K642L834N087N617N480N510O013O292N850N366N799O976P779P593
53911D39524O940O555O401N904M845L661K893K630K490K082J312L28o41j387j837
53896D81700k207k856l779m438m424m120m261m926n523n772o082o733p325p440
$$ plain form
53882 411814 404470 396972 389257 381819 375167 369228 363547 357861 352287 347168 342856 339423 336399 333038
53868 333038 329082 325030 321419 318071 314379 310171 305947 302248 299091 296081 292892 289589 286545 284038
53854 284038 281906 279682 277121 274486 272202 270383 268845 267458 266341 265693 265565 265797 266158 266590 267174 267720
53838 267720 267560 266160 263953 262122 261386 261409 261588 261936 262758 263855 264641 264924 265117 265703 266812 268199 269342
53821 269342 269741 269526 269578 270641 272417 274064 275393 276954 278868 280354 280771 280670 281359 283575 286913 290483
53805 290483 293897 297599 302270 307966 314023 319898 325745 331839 337740 342682 346694 350709 355405 360509
53791 360509 365389 369752 373528 376611 379120 381474 383794 385502 385934 385095 383471 381373 378826 375862 372532
53776 372532 368754 364499 359986 355397 350621 345595 340706 336394 332451 328170 323171 317733 312343 307290
$$ packed form
53882D11814p344p498p715p438o652n939n681n686n574n119m312l433l024l361
53868C33038l956m052l611l348l692m208m224l699l157l010l189l303l044k507
53854B84038k132k224k561k635k284j819j538j387j117o48j28K32L61M32N84N46
53838B67720j60j400k207j831p36K3J79L48Q22J097P86K83J93N86J109J387J143
53821B69342L99k15N2J063J776J647J329J561J914J486M17j01O89K216L338L570
53805B90483L414L702M671N696O057N875N847O094N901M942M012M015M696N104
53791C60509M880M363L776L083K509K354K320J708M32q39j624k098k547k964l330
53776C72532l778m255m513m589m776n026m889m312l943m281m999n438n390n053
$$ plain form
53762 307290 302763 298948 295796 292939 290071 287302 284984 283217 281666 279944 278161 276919 276609 276787 276505
53747 276505 275299 273576 271972 270662 269512 268618 268323 268809 269868 271045 271848 272033 271851 271848 272254 272741 272931
53730 272931 272891 272898 272989 273060 273205 273643 274450 275655 277343 279323 280914 281527 281381 281281 281780 282915 284576 286670
53712 286670 288963 291197 293391 295742 298318 301206 304742 309046 313390 316709 318847 320811 323625 327398
53698 327398 331611 335719 339215 341658 343158 344553 346672 349524 352407 354644 355990 356543 356559 356337 356108
53683 356108 356035 356273 356867 357521 357663 356882 355248 353241 351457 350251 349486 348702 347745 347040 346952 347162 347108 346843
53665 346843 346809 346971 346918 346800 347257 348191 348540 347703 346475 346002 346428 347134 347750 348279 348673 348920 349224 349577 349577 349215
53645 349215 349334 350593 352459 354036 355485 357617 360395 362934 364882 366705 368509 369797 370711 372406 375549
$$ packed form
53762C07290m527l815l152k857k868k769k318j767j551j722j783j242l10J78k82
53747B76505j206j723j604j310j150q94k95M86J059J177Q03J85j82lM06M87J90
53730B72931m0PR1P1J45M38Q07J205J688J980J591O13j46j00M99J135J661K094
53712B86670K293K234K194K351K576K888L536M304M344L319K138J964K814L773
53698C27398M213M108L496K443J500J395K119K852K883K237J346N53J6k22k29
53683C56108p3K38N94O54J42p81j634k007j784j206p65p84r57p05q8K10n4k65
53665C46843l4J62n3j18M57R34L49q37j228m73M26P06O16N29L94K47L04L53%l62
53645C49215J19J259J866J577J449K132K778K539J948J823J804J288R14J695L143
$$ plain form
53630 375549 379327 382638 385536 388703 392100 395066 397455 399833 402574 405558 408775 412596 417241 422443
53616 422443 427838 433328 438845 444066 448650 452674 456636 460924 465312 469009 471349 472481 473258 474394
53602 474394 475892 477359 478614 479755 480830 481778 482565 483092 483052 482251 481039 479995 479141 477903 476075 474394
53586 474394 473751 474046 474292 473772 472657 471416 470054 468240 465985 463825 462272 461262 460207 458587 456471
53571 456471 454465 453110 452337 451592 450533 449472 448991 449253 449820 450150 450107 449987 450126 450532 450874 450814 450399 450006
53553 450006 449884 449922 449944 450069 450562 451534 453051 455361 458638 462510 466250 469464 472336 475254 478591 482759
53537 482759 487967 493786 499511 505184 511680 519474 527825 535690 543029 550706 559432 569356 580450 592684
53523 592684 605881 619854 634581 649865 665122 680033 695181 711371 728500 745884 763618
$$ packed form
53630C75549L778L311K898L167L397K966K389K378K741K984L217L821M645N202
53616D22443N395N490N517N221M584M024L962M288M388L697K340J132P77J136
53602D74394J498J467J255J141J075R48P87N27m0q01j212j044q54j238j828j681
53586D74394o43K95K46n20j115j241j362j814k255k160j553j010j055j620k116
53571D56471k006j355p73p45j059j061m81K62N67L30m3j20J39M06L42o0m15l93
53553D50006j22L8K2J25M93R72J517K310L277L872L740L214K872K918L337M168
53537D82759N208N819N725N673O496P794Q351P865P339P677Q726R924J1094J2234
53523E92684J3197J3973J4727J5284J5257J4911J5148J6190J7129J7384J7734
$$ plain form
53512 763618 782676 803475 825255 847288 869857 893442 917592 941351 964434 987285 1010248
53501 1010248 1033355 1056769 1080738 1104996 1128774 1151520 1173257 1194139 1214104 1233189 1251888
53490 1251888 1270897 1290566 1310666 1330571 1349605 1367427 1384265 1400748 1417366 1433991 1449916
53479 1449916 1464340 1476912 1487932 1498117 1508138 1518266 1528281 1537578 1545408 1551206 1554795 1556273
53467 1556273 1555700 1552964 1547930 1540592 1531103 1519798 1507225 1493965 1480315 1466195 1451422 1436074
53455 1436074 1420530 1405152 1389867 1374059 1357063 1338912 1320443 1302463 1284958 1267423 1249844
53444 1249844 1233003 1217790 1204525 1192907 1182222 1171652 1160918 1150793 1142510 1136466 1131952 1128322
53432 1128322 1125877 1125186 1126099 1127997 1130741 1134732 1140186 1146914 1154770 1163831 1174108 1185535 1198296 1212763
$$ packed form
53512G63618J9058K0799K1780K2033K2569K3585K4150K3759K3083K2851K2963
53501A010248K3107K3414K3969K4258K3778K2746K1737K0882J9965J9085J8699
53490A251888J9009J9669K0100J9905J9034J7822J6838J6483J6618J6625J5925
53479A449916J4424J2572J1020J0185J0021J0128J0015R297P830N798L589J478
53467A556273n73k736n034p338r489j1305j2573j3260j3650j4120j4773j5348
53455A436074j5544j5378j5285j5808j6996j8151j8469j7980j7505j7535j7579
53444A249844j6841j5213j3265j1618j0685j0570j0734j0125q283o044m514l630
53432A128322k445o91R13J898K744L991N454O728P856R061J0277J1427J2761J4467
$$ plain form
53418 1212763 1229042 1246895 1266172 1286982 1309375 1333155 1358128 1384332 1411901 1440898 1471340
53407 1471340 1503216 1536417 1570779 1606229 1642851 1680916 1720908 1763243 1807647 1852992 1898178
53396 1898178 1943235 1989241 2037206 2087308 2139104 2191934 2244993 2297463 2348942 2399604 2449769
53385 2449769 2499514 2548645 2596677 2642661 2685450 2724517 2760344 2793670 2824461 2851862 2875072
53374 2875072 2893979 2908899 2919928 2926703 2928759 2925944 2918371 2906045 2888856 2867068 2841428 2812438
53362 2812438 2779764 2742874 2702164 2658811 2613504 2566058 2516621 2466578 2417632 2370311 2323924
53351 2323924 2277782 2231916 2186726 2142525 2099503 2057762 2017315 1978266 1940892 1905220 1870607
53340 1870607 1836234 1802058 1768895 1737493 1707898 1679853 1653304 1628266 1604516 1581800 1560158
$$ packed form
53418A212763J6279J7853J9277K0810K2393K3780K4973K6204K7569K8997L0442
53407A471340L1876L3201L4362L5450L6622L8065L9992M2335M4404M5345M5186
53396A898178M5057M6006M7965N0102N1796N2830N3059N2470N1479N0662N0165
53385B449769M9745M9131M8032M5984M2789L9067L5827L3326L0791K7401K3210
53374B875072J8907J4920J1029O775K056k815p573j2326j7189k1788k5640k8990
53362B812438l2674l6890m0710m3353m5307m7446m9437n0043m8946m7321m6387
53351B323924m6142m5866m5190m4201m3022m1741m0447l9049l7374l5672l4613
53340A870607l4373l4176l3163l1402k9595k8045k6549k5038k3750k2716k1642
$$ plain form
53329 1560158 1539794 1520815 1503281 1487317 1472798 1459071 1445374 1431539 1417940 1404741 1391565
53318 1391565 1378101 1364770 1352468 1341713 1332297 1323770 1316011 1309202 1303433 1298648 1295031 1293135 1293411
53305 1293411 1295693 1299391 1304188 1310256 1317724 1326234 1335283 1344920 1355848 1368864 1384317 1402000 1421299
53292 1421299 1441442 1461888 1482553 1503563 1524755 1545615 1565691 1584854 1603108 1620389 1636672
53281 1636672 1651970 1665988 1678026 1687527 1694567 1699546 1702530 1703246 1701533 1697397 1690629 1680924 1668523
53268 1668523 1654323 1639034 1622526 1604264 1584105 1562336 1539100 1514249 1487812 1460331 1432546
53257 1432546 1404830 1377030 1348953 1320991 1294124 1268981 1244931 1220475 1194778 1168543 1143161
53246 1143161 1119241 1096268 1073443 1050439 1027426 1004812 982995 962078 941813 922033 903026
$$ packed form
53329A560158k0364j8979j7534j5964j4519j3727j3697j3835j3599j3199j3176
53318A391565j3464j3331j2302j0755r416q527p759o809n769m785l617j896K76
53305A293411K282L698M797O068P468Q510R049R637J0928J3016J5453J7683J9299
53292A421299K0143K0446K0665K1010K1192K0860K0076J9163J8254J7281J6283
53281A636672J5298J4018J2038R501P040M979K984P16j713m136o768r705j2401
53268A668523j4200j5289j6508j8262k0159k1769k3236k4851k6437k7481k7785
53257A432546k7716k7800k8077k7962k6867k5143k4050k4456k5697k6235k5382
53246A143161k3920k2973k2825k3004k3013k2614k1817k0917k0265j9780j9007
$$ plain form
53235 903026 885134 868108 851338 834763 819025 804546 790952 777684 764805 752747 741521
53224 741521 730603 719599 708652 698124 688013 677796 666826 654902 642437 630001 617735
53213 617735 605345 592596 579575 566491 553570 541204 529846 519532 509757 500021 490275 480765
53201 480765 471833 464052 457970 453212 448182 441362 432812 423868 415443 407292 399022 391132 384630 379974
53187 379974 376705 373871 370548 366187 360889 355345 350351 346307 343154 340567 338150 335670 333259 331261
53173 331261 329762 328451 327063 325741 324759 324040 323196 321963 320375 318593 316759 314945 313078 310936 308434
53158 308434 305904 303876 302575 301781 301191 300709 300340 300001 299613 299252 299089 299209 299568 300063 300556 300835 300630 299737
53140 299737 298182 296344 294901 294534 295488 297333 299184 300315 300733 301175 302414 304474 306571 307911 308502
$$ packed form
53235I03026j7892j7026j6770j6575j5738j4479j3594j3268j2879j2058j1226
53224G41521j0918j1004j0947j0528j0111j0217j0970j1924j2465j2436j2266
53213F17735j2390j2749j3021j3084j2921j2366j1358j0314r775r736r746r510
53201D80765q932p781o082m758n030o820q550q944q425q151q270p890o502m656
53187C79974l269k834l323m361n298n544m994m044l153k587k417k480k411j998
53173C31261j499j311j388j322r82p19q44j233j588j782j834j814j867k142k502
53158C08434k530k028j301p94n90m82l69l39l88l61j63J20L59M95M93K79k05q93
53140B99737j555j838j443l67R54J845J851J131M18M42J239K060K097J340N91
$$ plain form
53125 308502 309062 310236 312077 314250 316451 318498 320206 321484 322548 323860 325676 327697 329244 329876 329852
53110 329852 329900 330429 330977 330639 329115 327135 325661 324783 323709 321847 319543 317550 316066 314657 313034 311475
53094 311475 310278 309126 307355 304791 302033 299845 298447 297493 296552 295471 294364 293455 292937 292891 293312 294174
53078 294174 295411 296742 297655 297732 296976 295766 294519 293533 292975 292802 292680 292279 291691 291336 291344 291323 290921 290365 290162
53059 290162 290431 290816 291003 290998 290870 290548 290012 289504 289437 290078 291296 292533 293138 292972 292638 292908 293902 295102 296136
53040 296136 297110 298061 298567 298382 298180 299057 301146 303179 303685 302376 300160 298048 296480 295582 295521 296231 297157
53023 297157 297784 298338 299473 301131 302320 302382 302059 302656 304342 305936 306432 306081 305760 305859 306197 306618 307155 307799
53005 307799 308553 309646 311292 313191 314581 314856 314059 312806 311825 311473 311569 311794 312249 313344 315036 316580
$$ packed form
53125C08502N60J174J841K173K201K047J708J278J064J312J816K021J547O32k4
53110C29852M8N29N48l38j524j980j474q78j074j862k304j993j484j409j623j559
53094C11475j197j152j771k564k758k188j398r54r41j081j107r09n18m6M21Q62
53078B94174J237J331R13P7p56j210j247r86n58j73j22m01n88l55Qk1m02n56k03
53059B90162K69L85J87nj28l22n36n08o7O41J218J237O05j66l34K70R94J200J034
53040B96136R74R51N06j85k02Q77K089K033N06j309k216k112j568q98o1P10R26
53023B97157O27N54J135J658J189O2l23N97J686J594M96l51l21R9L38M21N37O44
53005C07799P54J093J646J899J390K75p97j253r81l52R6K25M55J095J692J544
$$ plain form
52989 316580 317352 317594 317954 318596 319315 320293 322069 324738 327751 330641 333392 335955 337933 339096 339760 340279
52973 340279 340454 339902 338887 338346 338978 340497 341900 342456 342373 342416 342914 343424 343511 343488 343882 344406 344150 342857 341344
52954 341344 340425 339985 339471 338730 337856 336657 334913 332942 331325 330126 328852 327111 324890 322334 319798
52939 319798 318080 317880 318804 319430 318736 317165 315950 315682 315922 316043 315966 315998 316352 317036 317963 318856 319158 318457
52921 318457 317145 316353 316857 318079 318521 317281 314931 312791 311611 311164 310896 310637 310618 311006 311569 311823 311527
52904 311527 311044 311067 311991 313555 315043 315690 315061 313444 311916 311594 312583 313921 314769 315251 315854 316419 316364 315711
52886 315711 315217 315376 315818 315934 315766 315964 317022 318754 320476 321569 321958 322113 322602 323647 325140 326940
52870 326940 328990 331150 333099 334485 335192 335513 336037 337124 338427 339116 338733 337577 336137 334517 332694
$$ packed form
52989C16580P72K42L60O42P19R78J776K669L013K890K751K563J978J163O64N19
52973C40279J75n52j015n41O32J519J403N56q3M3M98N10Q7k3L94N24k56j293j513
52954C41344r19m40n14p41q74j199j744j971j617j199j274j741k221k556k536
52939C19798j718k00R24O26o94j571j215k68K40J21p7L2L54O84R27Q93L02p01
52921C18457j312p92N04J222M42j240k350k140j180m47k68k59j9L88N63K54k96
52904C11527m83K3R24J564J488O47o29j617j528l22R89J338Q48M82O03N65n5o53
52886C15711m94J59M42J16j68J98J058J732J722J093L89J55M89J045J493J800
52870C26940K050K160J949J386P07L21N24J087J303O89l83j156j440j620j823
$$ plain form
52855 332694 330941 329458 327825 325409 322243 318959 315889 312897 310098 308076 307048 306388 305343 303777
52841 303777 301899 299768 297569 296005 295744 296546 297424 297645 297206 296380 295297 294057 292873 291886 291048 290316
52825 290316 289844 289831 290288 291031 291855 292671 293490 294266 294720 294462 293456 292324 291916 292485 293463 294147 294419 294641
52807 294641 295019 295432 295813 296321 296894 296975 296080 294514 293171 292521 292173 291497 290324 288864 287322 285928 285047
52790 285047 284801 284740 284315 283607 283146 283073 282969 282608 282344 282519 282905 283087 283135 283506 284424 285627 286713 287479 287923
52771 287923 288042 287731 286886 285657 284560 284169 284666 285747 286936 287850 288319 288492 288764 289327 289835 289831 289473 289411
52753 289411 289961 290864 291972 293525 295480 297126 297914 298260 299033 300521 302385 304360 306374 308169 309436
52738 309436 310327 311302 312419 313338 314061 315084 316580 318013 318899 319568 320687 322292 323676 324158 323597 322232
$$ packed form
52855C32694j753j483j633k416l166l284l070k992k799k022j028o60j045j566
52841C03777j878k131k199j564k61Q02Q78K21m39q26j083j240j184r87q38p32
52825B90316m72j3M57P43Q24Q16Q19P76M54k58j006j132m08N69R78O84K72K22
52807B94641L78M13L81N08N73Q1q95j566j343o50l48o76j173j460j542j394q81
52790B85047k46o1m25p08m61p3j04l61k64J75L86J82M8L71R18J203J086P66M44
52771B87923J19l11q45j229j097l91M97J081J189R14M69J73K72N63N08ml58o2
52753B89411N50R03J108J553J955J646P88L46P73J488J864J975K014J795J267
52738C09436Q91R75J117R19P23J023J496J433Q86O69J119J605J384M82n61j365
$$ plain form
52722 322232 320369 318296 316233 314234 312245 310405 309189 309091 310104 311547 312476 312342 311281 309877 308713
52707 308713 308077 307881 307730 307208 306317 305604 305696 306648 307882 308812 309424 310178 311405 312897 314090 314622 314674 314771
52689 314771 315263 316037 316692 316913 316719 316418 316318 316365 316059 314903 312996 311058 309806 309401 309527 309768 309754 309186
52671 309186 308041 306725 305752 305235 304887 304544 304501 305204 306693 308547 310375 312239 314392 316632 318199 318618
52655 318618 318488 319106 321211 324347 327467 329867 331417 332353 333071 333867 334524 334378 333095 331228 329666 328737
52639 328737 328182 327845 327922 328542 329486 330406 331044 331216 330914 330462 330341 330755 331538 332457 333398 334295 335083 335682 335853
52620 335853 335235 333841 332351 331431 330864 329933 328635 327864 328069 328394 327683 325977 324450 324060 324776 326042 327459
52603 327459 328800 329795 330195 329955 329229 328224 327175 326363 326023 326144 326428 326535 326437 326486 327100 328404 330199 332220
$$ packed form
52722C22232j863k073k063j999j989j840j216r8J013J443R29j34j061j404j164
52707C08713o36j96j51n22q91p13R2R52J234R30O12P54J227J492J193N32N2R7
52689C14771M92P74O55K21j94l01j00M7l06j156j907j938j252m05J26K41j4n68
52671C09186j145j316r73n17l48l43m3P03J489J854J828J864K153K240J567M19
52655C18618j30O18K105L136L120K400J550R36P18P96O57j46j283j867j562r29
52639C28737n55l37P7O20R44R20O38J72l02m52j21M14P83R19R41Q97P88N99J71
52620C35853o18j394j490r20n67r31j298p71K05L25p11j706j527l90P16J266J417
52603C27459J341R95M00k40p26j005j049q12l40J21K84J07r8M9O14J304J795K021
$$ plain form
52585 332220 334323 336471 338605 340548 341961 342538 342327 341767 341286 340943 340578 340176 339905 339874 339998 340021 339556 338323
52567 338323 336566 335013 334106 333508 332724 331937 331636 331637 331234 330338 329676 329613 329565 328990 328254 327942 327829 327282 326323
52548 326323 325562 325220 324919 324437 324098 324270 324902 325735 326668 327811 329385 331534 333983 335950 336712 336324 335548
52531 335548 335014 334710 334349 334012 334279 335764 338464 341519 343753 344678 344918 345512 346991 349263 352051 354963
52515 354963 357354 358771 359652 361075 363570 366561 369163 371136 372777 374213 375207 375507 375016 373682 371504
52500 371504 368685 365558 362308 358973 355718 352915 350763 348961 346975 344710 342735 341643 341280 340875 339962
52485 339962 338926 338452 338689 339213 339613 339832 340022 340472 341619 343723 346370 348649 350029 350862 351880 353384
52469 353384 355100 356650 357971 359336 361114 363487 366302 369164 371662 373443 374229 373954 372876 371346 369470
$$ packed form
52585C32220K103K148K134J943J413N77k11n60m81l43l65m02k71l1J24K3m65j233
52567C38323j757j553r07n98p84p87l01Jm03q96o62o3m8n75p36l12j13n47r59
52548C26323p61l42l01m82l39J72O32Q33R33J143J574K149K449J967P62l88p76
52531C35548n34l04l61l37K67J485K700L055K234R25K40N94J479K272K788K912
52515C54963K391J417Q81J423K495K991K602J973J641J436R94L00m91j334k178
52500C71504k819l127l250l335l255k803k152j802j986k265j975j092l63m05r13
52485C39962j036m74K37N24M00K19J90M50J147K104K647K279J380Q33J018J504
52469C53384J716J550J321J365J778K373K815K862K498J781P86k75j078j530j876
$$ plain form
52454 369470 367139 364329 361113 357482 353545 349857 347039 344926 342646 339847 337357 336122 335916 335632 334644
52439 334644 333262 331980 330926 330143 329788 329817 329852 329606 329115 328461 327641 326957 327099 328449 330499 332316 333465
52422 333465 334158 334706 335239 336024 337613 340401 344063 347641 350278 351987 353698 356466 360594 365557 370715
52407 370715 375890 381198 386674 392304 398159 404202 410089 415505 420557 425499 430080 433551 435336 435356 433680
52392 433680 430356 425758 420661 415647 410695 405651 400818 396710 393416 390656 388414 387091 386947 387676 388703
52377 388703 389703 390750 392093 393879 396016 398288 400599 403061 405757 408517 411082 413350 415294 416763
52363 416763 417601 417895 417863 417527 416836 416031 415601 415738 416137 416417 416545 416743 417181 417893 418816 419892 421268 423415
52345 423415 426779 431308 436493 441853 447093 451883 455977 459711 463909 469036 474779 480684 486795 493389
$$ packed form
52454C69470k331k810l216l631l937l688k818k113k280k799k490j235k06k84r88
52439C34644j382j282j054p83l55K9L5k46m91o54q20o84J42J350K050J817J149
52422C33465O93N48N33P85J589K788L662L578K637J709J711K768M128M963N158
52407C70715N175N308N476N630N855O043N887N416N052M942M581L471J785K0j676
52392D33680l324m598n097n014m952n044m833m108l294k760k242j323j44P29J027
52377C88703J000J047J343J786K137K272K311K462K696K760K565K268J944J469
52363D16763Q38K94l2l36o91q05m30J37L99K80J28J98M38P12R23J076J376K147
52345D23415L364M529N185N360N240M790M094L734M198N127N743N905O111O594
$$ plain form
52331 493389 500468 507895 515753 524166 533099 542755 553805 566615 580469 594175 607381 620704 634658
52318 634658 649097 663774 678740 694012 709477 725409 742476 760770 779366 797376 815171
52307 815171 833939 854166 875187 896287 917629 939667 961971 983229 1002593 1020662 1038748
52296 1038748 1057245 1075202 1091576 1106358 1119982 1132085 1141607 1148139 1152503 1155811 1158509 1160533
52284 1160533 1161796 1162081 1160935 1158296 1155008 1152219 1150308 1148742 1146853 1144422 1141615 1138834 1136687 1135734
52270 1135734 1136118 1137585 1139860 1142828 1146405 1150529 1155323 1160994 1167512 1174599 1182152 1190543 1200364 1211913
52256 1211913 1224950 1238912 1253362 1268254 1283725 1299604 1315274 1330070 1343689 1356091 1367217
52245 1367217 1376959 1385291 1392234 1397781 1402053 1405325 1407653 1408622 1407775 1405136 1401028 1395501 1388395 1379934
$$ packed form
52331D93389P079P427P858Q413Q933R656J1050J2810J3854J3706J3206J3323J3954
52318F34658J4439J4677J4966J5272J5465J5932J7067J8294J8596J8010J7795
52307H15171J8768K0227K1021K1100K1342K2038K2304K1258J9364J8069J8086
52296A038748J8497J7957J6374J4782J3624J2103R522O532M364L308K698K024
52284A160533J263K85j146k639l288k789j911j566j889k431k807k781k147r53
52270A135734L84J467K275K968L577M124M794N671O518P087P553Q391R821J1549
52256A211913J3037J3962J4450J4892J5471J5879J5670J4796J3619J2402J1126
52245A367217R742Q332O943N547M272L272K328R69q47k639m108n527p106q461
$$ plain form
52231 1379934 1370768 1361348 1351649 1341611 1331383 1320972 1310081 1298600 1286945 1275630 1264767 1254289
52219 1254289 1244370 1235262 1226877 1218946 1211478 1204797 1199202 1194801 1191526 1189058 1186917 1185017 1183929 1184155
52205 1184155 1185252 1186242 1186971 1188478 1191720 1196361 1201203 1205535 1209667 1214259 1219554 1225268 1230890 1236012
52191 1236012 1240601 1245060 1249885 1255034 1259677 1262717 1263677 1263009 1261376 1258705 1254291 1247998 1240981 1234660
52177 1234660 1229127 1223165 1215983 1208358 1201744 1196774 1193066 1190057 1187411 1184877 1182427 1180487 1179433 1178927
52163 1178927 1178326 1177756 1178040 1179409 1181068 1182387 1183845 1186195 1189206 1191907 1193733 1194749 1195013 1194489 1193601
52148 1193601 1193131 1193359 1193830 1194158 1194672 1196018 1198491 1201919 1205899 1209975 1213877 1217753 1221953 1226520 1231223
$$ packed form
52231A379934r166r420r699j0038j0228j0411j0891j1481j1655j1315j0863j0478
52219A254289r919r108q385p931p468o681n595m401l275k468k141j900j088K26
52205A184155J097R90P29J507L242M641M842M332M132M592N295N714N622N122
52191A236012M589M459M825N149M643L040R60o68j633k671m414o293p017o321
52177A234660n533n962p182p625o614m970l708l009k646k534k450j940j054n06
52163A178927o01n70K84J369J659J319J458K350L011K701J826J016K64n24q88
52148A193601m70K28M71L28N14J346K473L428L980M076L902L876M200M567M703
$$ [...]
##END NTUPLES=NMR SPECTRUM
##END=
