##TITLE=AC1659_NSAAH14395_8531237_ArgPjRldyK
##JCAMPDX= 6.0         $$ Bruker NMR JCAMP-DX V2.0
##DATA TYPE= NMR SPECTRUM
##DATA CLASS= NTUPLES
##ORIGIN= BRUKER
##OWNER= Administrator
$$ 1.72 TOPSPIN		Version 2.1
$$ 2014-03-14 21:50:53.426 -0800  Administrator@X
$$ Compression mode = diff/dup
##.OBSERVE FREQUENCY= 400.02188249412
##.OBSERVE NUCLEUS= ^1H
##.ACQUISITION MODE= SIMULTANEOUS (DQD)
##.ACQUISITION SCHEME= undefined
##.AVERAGES= 8
##.DIGITISER RES= 22
##SPECTROMETER/DATA SYSTEM= spect
##.PULSE SEQUENCE= zg30
##.SOLVENT NAME= COFFEE_meoh
##.SHIFT REFERENCE= INTERNAL, COFFEE_meoh, 1, 14.98509
##AUDIT TRAIL= $$ (NUMBER, WHEN, WHO, WHERE, PROCESS, VERSION, WHAT)
$$ ##TITLE= Audit trail, TOPSPIN		Version 2.1
$$ ##JCAMPDX= 5.01
$$ ##ORIGIN= Bruker BioSpin GmbH
$$ ##OWNER= Administrator
$$ $$ E:\/data/COFFEE/nmr/AC1659_NSAAH14395_8531237_ArgPjRldyK/10/pdata/1/auditp.txt
$$ ##AUDIT TRAIL=  $$ (NUMBER, WHEN, WHO, WHERE, PROCESS, VERSION, WHAT)
(   1,<2014-03-14 21:50:46.613 -0800>,<Administrator>,<X>,<go>,<TOPSPIN 2.1>,
      <created by zg
	started at 2014-03-14 21:49:40.910 -0800,
	POWCHK enabled, PULCHK disabled,
       configuration hash MD5:
       C8 4E 4E 5D D3 5C D8 9E 9F 52 82 E0 59 8A DE 15
       data hash MD5: 64K
       EB 64 B5 BB 5D B1 B8 CF 27 AE 0B C2 78 D7 18 C1>)
(   2,<2014-03-14 21:50:49.567 -0800>,<Administrator>,<X>,<proc1d>,<TOPSPIN 2.1>,
      <Start of raw data processing
       efp LB = 0 FT_mod = 6 PKNL = 1 PHC0 = 0 PHC1 = 0 SI = 32K 
       data hash MD5: 32K
       2E 30 4C E1 B5 C3 09 FA B5 BA 3A 63 FA 95 3E 3D>)
(   3,<2014-03-14 21:50:49.848 -0800>,<Administrator>,<X>,<proc1d>,<TOPSPIN 2.1>,
      <pk PHC0 = 90.63721 PHC1 = 0 
       data hash MD5: 32K
       3F BD F6 64 0E 9F 63 6A 09 F1 E3 A7 83 EE A8 95>)
(   4,<2014-03-14 21:50:49.988 -0800>,<Administrator>,<X>,<proc1d>,<TOPSPIN 2.1>,
      <abs ABSG = 1 
       data hash MD5: 32K
       A9 D2 7D 2E D5 BA 50 47 0D EA 70 80 6F 76 90 7C>)
(   5,<2014-03-14 21:50:50.051 -0800>,<Administrator>,<X>,<proc1d>,<TOPSPIN 2.1>,
      <abs ABSG = 2 
       data hash MD5: 32K
       01 91 4F 7E FA 85 99 8E B7 AF 4F 8D 20 3D 04 73>)
(   6,<2014-03-14 21:50:50.113 -0800>,<Administrator>,<X>,<proc1d>,<TOPSPIN 2.1>,
      <abs ABSG = 3 
       data hash MD5: 32K
       CC EF 4D BA D8 B0 BE 69 03 74 CC 2B 38 3D 56 57>)
(   7,<2014-03-14 21:50:50.160 -0800>,<Administrator>,<X>,<proc1d>,<TOPSPIN 2.1>,
      <abs ABSG = 4 
       data hash MD5: 32K
       68 99 43 77 39 C5 F9 70 D7 65 52 B8 6D 76 3A 64>)
(   8,<2014-03-14 21:50:50.207 -0800>,<Administrator>,<X>,<proc1d>,<TOPSPIN 2.1>,
      <abs ABSG = 5 
       data hash MD5: 32K
       E4 D0 56 38 3F A2 5A 4B C1 6D 88 3D 25 F5 3F E9>)
$$ ##END=
$$ 
$$ $$ hash MD5
$$ $$ 81 F8 0B 6D 18 61 BF 88 48 C4 A5 81 2D 58 B2 BF
##$RELAX= 
##$RELAX= 
##$RELAX= 
##$RELAX= 
##$RELAX= 
##$RELAX= 
##$RELAX= 
$$ Bruker specific parameters
$$ --------------------------
##$DU= <E:\>
##$EXPNO= 10
##$NAME= <AC1659_NSAAH14395_8531237_ArgPjRldyK>
$$ [...]
##$TP= (0..7)
150 150 150 150 150 150 150 150
##$TP07= 0
##$TPNAME0= <>
##$TPNAME1= <>
##$TPNAME2= <>
##$TPNAME3= <>
##$TPNAME4= <>
##$TPNAME5= <>
##$TPNAME6= <>
##$TPNAME7= <>
##$TPOAL= (0..7)
0.5 0.5 0.5 0.5 0.5 0.5 0.5 0.5
##$TPOFFS= (0..7)
0 0 0 0 0 0 0 0
##$TUNHIN= 0
##$TUNHOUT= 0
##$TUNXOUT= 0
##$USERA1= <user>
##$USERA2= <user>
##$USERA3= <user>
##$USERA4= <user>
##$USERA5= <user>
##$V9= 5
##$VALIST= <valist>
##$VCLIST= <CCCCCCCCCCCCCCC>
##$VD= 0
##$VDLIST= <DDDDDDDDDDDDDDD>
##$VPLIST= <PPPPPPPPPPPPPPP>
##$VTLIST= <TTTTTTTTTTTTTTT>
##$WBST= 1024
##$WBSW= 4
##$XGAIN= (0..3)
0 0 0 0
##$XL= 0
##$YL= 0
##$YMAX_a= 611899
##$YMIN_a= -526279
##$ZGOPTNS= <>
##$ZL1= 120
##$ZL2= 120
##$ZL3= 120
##$ZL4= 120
##$ABSF1= 14.98509
##$ABSF2= -5.573092
##$ABSG= 5
##$ABSL= 3
##$ALPHA= 0
##$AQORDER= 0
##$ASSFAC= 0
##$ASSFACI= 0
##$ASSFACX= 0
##$ASSWID= 0
##$AUNMP= <proc_prof1d_extract_pilot.lims>
##$AXLEFT= 0
##$AXNAME= <>
##$AXNUC= <1H>
##$AXRIGHT= 0
##$AXTYPE= 0
##$AXUNIT= <>
##$AZFE= 0.1
##$AZFW= 0.1
##$BCFW= 0
##$BC_mod= 0
##$BYTORDP= 0
##$COROFFS= 0
##$CY= 15
##$DATMOD= 1
##$DC= 0
##$DFILT= <>
##$DTYPP= 0
##$F1P= 0
##$F2P= 0
##$FCOR= 0.5
##$FTSIZE= 32768
##$FT_mod= 6
##$GAMMA= 0
##$GB= 0
##$INTBC= 1
##$INTSCL= 1
##$ISEN= 128
##$LB= 0
##$LEV0= 0
##$LPBIN= 0
##$MAXI= 10000
##$MC2= 0
##$MEAN= 0
##$ME_mod= 0
##$MI= 0
##$NCOEF= 0
##$NC_proc= -8
##$NLEV= 6
##$NOISF1= 0
##$NOISF2= 0
##$NSP= 0
##$NTH_PI= 0
##$NZP= 0
##$OFFSET= 14.98509
##$PC= 1
##$PHC0= 90.63721
##$PHC1= 0
##$PH_mod= 1
##$PKNL= yes
##$PPARMOD= 0
##$PPDIAG= 0
##$PPIPTYP= 0
##$PPMPNUM= 2147483647
##$PPRESOL= 1
##$PSCAL= 4
##$PSIGN= 0
##$PYNMP= <proc.py>
##$REVERSE= no
##$SF= 400.02
##$SI= 32768
##$SIGF1= 0
##$SIGF2= 0
##$SINO= 400
##$SIOLD= 32768
##$SPECTYP= <>
##$SREGLST= <1H.CDCl3>
##$SSB= 0
##$STSI= 32768
##$STSR= 0
##$SW_p= 8223.68421052631
##$SYMM= 0
##$S_DEV= 0
##$TDeff= 65536
##$TDoff= 0
##$TI= <>
##$TILT= no
##$TM1= 0
##$TM2= 0
##$TOPLEV= 0
##$USERP1= <user>
##$USERP2= <user>
##$USERP3= <user>
##$USERP4= <user>
##$USERP5= <user>
##$WDW= 1
##$XDIM= 32768
##$YMAX_p= 451002271
##$YMIN_p= -654496
##$CURPLOT= <Network HP LaserJet P1505>
##$CURPRIN= <$Network HP LaserJet P1505>
##$DFORMAT= <normdp>
##$LAYOUT= <+/1D_H.xwp>
##$LFORMAT= <normlp>
##$PFORMAT= <normpl>
##$SURQMSG= 1
$$ End of Bruker specific parameters
$$ ---------------------------------
##NTUPLES= NMR SPECTRUM
##VAR_NAME=  FREQUENCY,     SPECTRUM/REAL,   SPECTRUM/IMAG
##SYMBOL=    X,             R,               I
##VAR_TYPE=  INDEPENDENT,   DEPENDENT,       DEPENDENT
##VAR_FORM=  AFFN,          ASDF,            ASDF
##VAR_DIM=   32768,         32768,           32768
##UNITS=     HZ,            ARBITRARY UNITS, ARBITRARY UNITS
##FACTOR=    0.250966925370066, 1,           1
##FIRST=     8223.43324360094, 12257,        -95798
##LAST=      0,             -64827,          33070
##MIN=       0,             -654496,         0
##MAX=       8223.43324360094, 451002271,    0
$$ Real data points
##PAGE= N=1
##DATA TABLE= (X++(R..R)), XYDATA
$$ [...]
19584c26743J12458G8727K03750f3228E732J5544b5898C9410a21737B40463f9117
$$ -326743 -214285 78727 282477 -63228 5732 21276 -25898 39410 -121737 240463 -69117
19572E686d2746k16562f1695D3032e2056D5429a28413o0144o8388A38998b27206
$$ 5686 -42746 -259308 -61695 43032 -52056 45429 -128413 -188557 -256945 138998 -227206
19560a98053i143B60906A00274B6498h8395F2651b7210j42236C67293a85841d215
$$ -198053 -9143 260906 100274 26498 -88395 62651 -27210 -169446 367293 -185841 -4215
19548a18527F2513a1115A00624D7689d2090j77185g6036k550j45530A77812a50575
$$ -118527 62513 -11115 100624 47689 -42090 -219275 -76036 -78586 -224116 177812 -150575
19536e0089j39653B1024b88076A01732e3504l9263C27984c51228b5350o8765m8088
$$ -50089 -189742 21024 -288076 101732 -53504 -92767 327984 -351228 -25350 -94115 -142203
19525a42203c9096j00365K2494D605a43959k88238a84319B3742g4142j70800A4253
$$ -142203 -39096 -139461 -116967 4605 -143959 -432197 -184319 23742 -74142 -244942 14253
19513D2000b14981d0505l9353I7631m4517d698r4304j23336R0857b6977A23946
$$ 42000 -214981 -40505 -79858 97631 53114 -4698 -99002 -222338 -131481 -26977 123946
19501h9960B85718A23340b91634Q9593e6264I3687j3373g6987K9917J7396A76601
$$ -89960 285718 123340 -291634 -202041 -56264 93687 80314 -76987 -47070 -29674 176601
19489b460m65476i7857A73436b31523R5276O2062L4056r2606a9805G8677i8451
$$ -2460 -467936 -97857 173436 -231523 -136247 -74185 -40129 -132735 -19805 78677 -98451
19477A87058b8907A72150D8866l705b1885B6825k30d9718B5009i9598j99933M1533
$$ 187058 -28907 172150 48866 45161 -21885 26825 26595 -49718 25009 -99598 -299531 -257998
19465b57998O5190K581B0103d6266B2910O1684a09856B12560M773D9607K50373
$$ -257998 -192808 -190227 20103 -46266 22910 84594 -109856 212560 217333 49607 299980
19454B99980i8462F2834a0512K60n6158k64696Q7513P6629A88879d7824k33492
$$ 299980 -98462 62834 -10512 -10252 -66410 -331106 -243593 -166964 188879 -47824 -281316
19443b81316G2500J7586a29428k3B9767i4394B02431a67734j07890g1101A12697
$$ -281316 72500 90086 -129428 -129451 29767 -94394 202431 -167734 -275624 -71101 112697
19431e05302K04251J24072L5246B27497a12428a8569F6950M8360a92974C3800
$$ -505302 -301051 -176979 -141733 227497 -112428 -18569 66950 115310 -192974 33800
19420B1934d4043j923B49385r9270b4827H1848E083i4973A6340q159b11348a01605
$$ 21934 -44043 -45966 249385 150115 -24827 81848 5083 -94973 16340 8181 -211348 -101605
19407b65504o5763E9909a5007j64605Q6658p3391J8921C00105g2687j91065J13131
$$ -265504 -331267 59909 -15007 -179612 -92954 -166345 -147424 300105 -72687 -263752 -150621
19396a50621A1206b03963J70B06697c22135C6613a70025b6703C52586d17848A68780
$$ -150621 11206 -203963 -203793 206697 -322135 36613 -170025 -26703 352586 -417848 168780
19384a39776A68902a61632c3039j08280A13363L03168E6079a67626J3077M7569
$$ -139776 168902 -161632 -33039 -141319 113363 416531 56079 -167626 -154549 -106980
19374a06980j69664g2327I1381f0062j32972j65816d3564B25016d21631B1297
$$ -106980 -276644 -72327 91381 -60062 -193034 -358850 -43564 225016 -421631 21297
19363F9339a14540k9716N1368C9900a98480J3462r4737C11324G6078e6458k4711
$$ 69339 -114540 -144256 -92888 39900 -198480 -185018 -279755 311324 76078 -56458 -81169
19352h1169n0158o9719A09996b4704h93G7096c50114a22905E2000a34109l50736
$$ -81169 -131327 -201046 109996 -24704 -893 77096 -350114 -122905 52000 -134109 -484845
19341d84845C3291a35276e6616k5303G8753l8759J25538b21028h0945J5188A40238
$$ -484845 33291 -135276 -56616 -81919 78753 39994 165532 -221028 -80945 -65757 140238
19329G5314B5087J21461E822J75247a15658M617k64004a27451A1889g3332g968
$$ 75314 25087 146548 5822 181069 -115658 -111041 -375045 -127451 11889 -73332 -7968
19317a29873L5938C2961K20863i7488D7888d2729m8238A24175J41141b44153b8181
$$ -129873 -93935 32961 253824 -97488 47888 -42729 -90967 124175 265316 -244153 -28181
19305G1388b5578A87633a11538M1611A09304a28942D9080c82978a9045A65895
$$ 71388 -25578 187633 -111538 -69927 109304 -128942 49080 -382978 -19045 165895
19294a72722d4421j1830A36897c9587j76529A60656l2673c1307p1698C5120b59245
$$ -172722 -44421 -56251 136897 -39587 -216116 160656 127983 -31307 -103005 35120 -259245
19282I2887g3139B4731a04905F2290b6061j88833d3947j41411P8655G4285c32851
$$ 92887 -73139 24731 -104905 62290 -26061 -214894 -43947 -185358 -106703 74285 -332851
19270d9027k57531N7114B13947r2125a1371E5003a23035B36359E3637B1275f4550
$$ -49027 -306558 -249444 213947 121822 -11371 55003 -123035 236359 53637 21275 -64550
19258b8199C13977B4828b6156C9360c11434a4670A3581Q396J670b17257a04498
$$ -28199 313977 24828 -26156 39360 -311434 -14670 13581 21977 23647 -217257 -104498
19246f9442A07622j5215d2850p7222F9537g3878l2180C71916c56099A81880h6789
$$ -69442 107622 92407 -42850 -120072 69537 -73878 -106058 371916 -356099 181880 -86789
19234a34741A29441H399a12351M8039A08129a20989A66911a40801A46199a37404
$$ -134741 129441 8399 -112351 -64312 108129 -120989 166911 -140801 146199 -137404
19223a66677l15988a7141k04910A6608b80642E1375f4505j24149J6407o1569A30493
$$ -166677 -482665 -17141 -222051 16608 -280642 51375 -64505 -188654 -172247 -233816 130493
19211c49958B2418J04692e2863E3213b54419h777C0588a9711H1756c37871g4303
$$ -349958 22418 127110 -52863 53213 -254419 -8777 30588 -19711 81756 -337871 -74303
19199a90485N1213d2508j25024E9498b17813e7993n9803A81072a05317C3513b16289
$$ -190485 -139272 -42508 -167532 59498 -217813 -57993 -117796 181072 -105317 33513 -216289
19187D0826d97514g5637A37078A8132R5078a34346H070Q3740b15642l9111K7054
$$ 40826 -497514 -75637 137078 18132 113210 -134346 8070 91810 -215642 -254753 -227699
19176b27699j25227h3739D5069b61148C2661b6641q4195P077A0516e8999E498
$$ -227699 -352926 -83739 45069 -261148 32661 -26641 -110836 -103759 10516 -58999 5498
19164A75423b55074d6978C8070N0948a86599A34615a91923p3935P3160a8026J850
$$ 175423 -255074 -46978 38070 89018 -186599 134615 -191923 -265858 -192698 -18026 -16176
19153a6176m7259A02587b02785b5764C9119B340a30027J9915l3018B8606J48464
$$ -16176 -63435 102587 -202785 -25764 39119 2340 -130027 -110112 -143130 28606 177070
19142A77070D3611a87331c1181l2543l2934l43411g6030E7487b67664a09724B8130
$$ 177070 43611 -187331 -31181 -63724 -96658 -440069 -76030 57487 -267664 -109724 28130
19130b95357c3689A17446k0338i8838j43265R7103P2403q5034A80740b60799A16874
$$ -295357 -33689 117446 97108 -98838 -242103 -145000 -72597 -157631 180740 -260799 116874
19118A79107n7778b01758d9932B66744a35252E2931J08644d4306A89988o3029
$$ 179107 121329 -201758 -49932 266744 -135252 52931 161575 -44306 189988 126959
19108A26959d37729c4609o0619G3745d3033D7094I78f7847k86129A78958e4964
$$ 126959 -437729 -34609 -95228 73745 -43033 47094 978 -67847 -353976 178958 -54964
19096A04646K15338b12297m9712R3462M7444M7867j78840E7382d38982a86384
$$ 104646 319984 -212297 -262009 -168547 -121103 -73236 -252076 57382 -438982 -186384
19085e8575A61610a65081L2069I0600K51791a61127H5012a6999l2770j78005A00806
$$ -58575 161610 -165081 -133012 90600 342391 -161127 85012 -16999 -49769 -227774 100806
19073E2952F023J7831c35360A35005b07649e1239p7769K724e8428C8134J99827
$$ 52952 6023 23854 -335360 135005 -207649 -51239 -129008 -126284 -58428 38134 237961
19062B37961a36062f7735B40197g1559j03867A32552a15275D8302J01132b07608
$$ 237961 -136062 -67735 240197 -71559 -175426 132552 -115275 48302 149434 -207608
19051A52984a15888L8957A46253b47489I0505a22531l6864M9432A11314b71360
$$ 152984 -115888 -76931 146253 -247489 90505 -122531 -159395 -109963 111314 -271360
19040G0379a00418j13015G8382f2163A33682c00082I2183d323A75950n6050P8294
$$ 70379 -100418 -213433 78382 -62163 133682 -300082 92183 -4323 175950 119900 198194
19029A98194e6472B55316I8059l8333J68030p0131j1757j7559K4897a2203j77284
$$ 198194 -56472 255316 98059 59726 227756 157625 145868 128309 153206 -12203 -189487
19018a89487Q5539q4390A07931d0416l85586B7257a95072r7577i743G7038f094
$$ -189487 -103948 -188338 107931 -40416 -426002 27257 -195072 -292649 -9743 77038 -6094
19006A88259e9698F4777a7824j00134a4492G5667a83398j4154k9574n5297a3253
$$ 188259 -59698 64777 -17824 -117958 -14492 75667 -183398 -197552 -227126 -282423 -13253
18994a96196A93038a36223B0127e9988B07654N734b1346A747b088n8570k1106
$$ -196196 193038 -136223 20127 -59988 207654 213388 -21346 1747 -2088 -60658 -81764
18983h1764j13852L9755b900k03900c6827q1500i33l1336j15042m9889M7437Q930
$$ -81764 -195616 -155861 -2900 -206800 -36827 -118327 -933 -32269 -147311 -197200 -149763 -140833
18971a40833D47259f5063k58494I156J5835a44286i737k119I261c6592k08140
$$ -140833 447259 -65063 -323557 9156 24991 -144286 -9737 -11856 9261 -36592 -244732
18960b44732A86181c09291a5489m963m8486a0778j32423A38749E327Q7293a2788
$$ -244732 186181 -309291 -15489 -20452 -68938 -10778 -143201 138749 5327 92620 -12788
18948a8829j40839B30511a53758M4119G4101Q6158F9312b93301h8388k3924o5868
$$ -18829 -159668 230511 -153758 -109639 74101 160259 69312 -293301 -88388 -112312 -178180
18937a78180A07221J8272a03671E14524h6762A02641b47546e2066k7680F4533
$$ -178180 107221 125493 -103671 514524 -86762 102641 -247546 -52066 -79746 64533
18926d1348g524m8614q3374n1877C096O6498a2335j63074r5516P0527j1601i4485
$$ -41348 -7524 -56138 -139512 -191389 3096 69594 -12335 -175409 -270925 -200398 -211999 -94485
18913b88410g0939B82187a9669m10107n2324c3709B24235a64769p701a2922k53684
$$ -288410 -70939 282187 -19669 -429776 -482100 -33709 224235 -164769 -172470 -12922 -266606
18902b66606C82403A48946d3649l1456B65561F3978j639K12424a00347B31608
$$ -266606 382403 148946 -43649 -75105 265561 63978 62339 274763 -100347 231608
18891B4995a36015B22382C6909c31979A21415b34388A89340m6423r116K8620b60641
$$ 24995 -136015 222382 36909 -331979 121415 -234388 189340 142917 133801 162421 -260641
18879a48098E0827b42063H6665L6743b38327a05279A79944D9581b38313B6805
$$ -148098 50827 -242063 86665 123408 -238327 -105279 179944 49581 -238313 26805
18868d5770k61669J32497j70996a23955A33463a52531A07960a21696j74199A32045
$$ -45770 -307439 -174942 -345938 -123955 133463 -152531 107960 -121696 -295895 132045
18857a44962J6520E3201b94722b0257l41200C40815c2792j06385k4866B57335
$$ -144962 -128442 53201 -294722 -20257 -361457 340815 -32792 -139177 -164043 257335
18846A8204g4811j77784f1376j66392B45696A17643b78803d5084d379l39044F9516
$$ 18204 -74811 -252595 -61376 -227768 245696 117643 -278803 -45084 -4379 -343423 69516
18834e6566A0102a89231B9900a6642j28640A41806a00676B2142a18177B7382g3161
$$ -56566 10102 -189231 29900 -16642 -145282 141806 -100676 22142 -118177 27382 -73161
18822A37185J09764j04024J0868A4529e3143A46198m6594d8957B44280A0068K73154
$$ 137185 246949 142925 153793 14529 -53143 146198 99604 -48957 244280 10068 283222
18811B83222a15581A59283K45960A11084J42645a77249e2095G9882c66603a8687
$$ 283222 -115581 159283 405243 111084 253729 -177249 -52095 79882 -366603 -18687
18800A21409b63138O59F937c8852j8399J1815C5330J42266a93573c857F0354b62889
$$ 121409 -263138 -262479 6937 -38852 -57251 -45436 35330 177596 -193573 -3857 60354 -262889
18787H0725J56758D5864h7402m2368e1373n7401F4663b62098a6335j23913k22151
$$ 80725 237483 45864 -87402 -129770 -51373 -108774 64663 -262098 -16335 -140248 -362399
18776c62399c3136c980j70391j84974A8455L28366c35086M1281a42620A43308
$$ -362399 -33136 -3980 -174371 -359345 18455 346821 -335086 -293805 -142620 143308
18765A04964J08926a95587Q7836A86475e21255a69478C1941c78629F799a16392
$$ 104964 213890 -195587 -107751 186475 -521255 -169478 31941 -378629 6799 -116392
18754F3473b10691N4528d1230j07773j59293j9096C8327N0328a46320D70778h1165
$$ 63473 -210691 -156163 -41230 -149003 -308296 -327392 38327 88655 -146320 470778 -81165
18742a02697K581m8373D9061d4099K0870j04353k27232D75106I4609L997N9990
$$ -102697 -100116 -148489 49061 -44099 -23229 -127582 -354814 475106 94609 98606 158596
18731A58596d4929J5368G8595N3633b8610k7843F5099a86701e2730J0119J5292
$$ 158596 -44929 -29561 78595 132228 -28610 -56453 65099 -186701 -52730 -42611 -27319
18720b7319E8288K56271A2655J01418n5014a05475d4103j77541C23238E4931g9958
$$ -27319 58288 314559 12655 114073 59059 -105475 -44103 -221644 323238 54931 -79958
18708e4114A41666f8884D4082N9404b05739i4629L3222E0501a9489k02509J00262
$$ -54114 141666 -68884 44082 103486 -205739 -94629 -61407 50501 -19489 -221998 -121736
18697a21736m99951h719H011a24079p8261C1546b31020e3338j51115j17862H2822
$$ -121736 -621687 -8719 8011 -124079 -202340 31546 -231020 -53338 -204453 -322315 82822
18685h8916m39792L3459b1983A37751a59147c2154E0470b11129N5790A3681a08473
$$ -88916 -528708 -495249 -21983 137751 -159147 -32154 50470 -211129 -155339 13681 -108473
18673A91232I2871J99051g913A2543N9180a79049a8768m4121b0402p3958J4415
$$ 191232 92871 291922 -7913 12543 71723 -179049 -18768 -62889 -20402 -94360 -79945
18662g9945k28659H0297a50842Q05C2171a75455L1774C3734K07967b90947a00316
$$ -79945 -308604 80297 -150842 -150037 32171 -175455 -143681 33734 241701 -290947 -100316
18650D7019k2034b0539j49973d8838e962k09394B208b48926a18703k9016F5140
$$ 47019 24985 -20539 -170512 -48838 -5962 -215356 2208 -248926 -118703 -147719 65140
18638b12174b1046D0136P3946g7867H4049l0382a36491n2862M7303B3703a39638
$$ -212174 -21046 40136 114082 -77867 84049 53667 -136491 -189353 -142050 23703 -139638
18626a19580j489A8733J56501D148J24402c7001p8084A82850H9542l6020Q2562
$$ -119580 -121069 18733 175234 4148 128550 -37001 -115085 182850 89542 53522 136084
18615A36084i2029B04645a35117r4637A08800a16854n9305Q2180H5043a40466
$$ 136084 -92029 204645 -135117 -229754 108800 -116854 -176159 -93979 85043 -140466
18604I8814C5320M6072J25264b45927e4515j74939k83401a89018M41B52811a38262
$$ 98814 35320 81392 206656 -245927 -54515 -229454 -512855 -189018 -188577 252811 -138262
18592B00645a74569C727a90069A03584b72885c2382q7843A86512R6564B7659a35973
$$ 200645 -174569 3727 -190069 103584 -272885 -32382 -120225 186512 283076 27659 -135973
18580A90552k095c3590A2312a38368d2290k5666L277k04573f6228k964m5847e3833
$$ 190552 188457 -33590 12312 -138368 -42290 -67956 -64679 -269252 -66228 -69192 -115039 -53833
18567c08637k584J54353F8714J22095B3039a8269F1168b62760C279a21826C4091
$$ -308637 -311221 -156868 68714 190809 23039 -18269 61168 -262760 3279 -121826 34091
18555g7495p5091N3522n3689C7537a38863j91924d2608Q395G959c27957a50098
$$ -77495 -152586 -99064 -152753 37537 -138863 -330787 -42608 -34213 7959 -327957 -150098
18543A21017b4030B09293H6231c23757h1049m1542E593f4916j5984j3486F6808
$$ 121017 -24030 209293 86231 -323757 -81049 -122591 5593 -64916 -80900 -94386 66808
18531d58478E2610b84483B44621D030O5123M7691A5843a7484j50470A92834c65558
$$ -458478 52610 -284483 244621 4030 69153 116844 15843 -17484 -167954 192834 -365558
18519b10822r6783c1793k87088f5858l2485k79173f3907B45689a86371K4898r0887
$$ -210822 -307605 -31793 -318881 -65858 -98343 -377516 -63907 245689 -186371 -161473 -252360
18508b52360A7792c7304l5555A15226d63914H2041b38246h523j10813I2206f4992
$$ -252360 17792 -37304 -72859 115226 -463914 82041 -238246 -8523 -119336 92206 -64992
18496B28947h5519A80041b04342P5470A52871a26955I2286b38612B13529a35516
$$ 228947 -85519 180041 -204342 -128872 152871 -126955 92286 -238612 213529 -135516
18485C0224a41965j49023c7612j76065A51998d4807j15263A7513m526a8309B20814
$$ 30224 -141965 -290988 -37612 -213677 151998 -44807 -160070 17513 12987 -18309 220814
18473C8759b94853C6712b5079F1520c6761I2528a37483E5051O845g3840B25037
$$ 38759 -294853 36712 -25079 61520 -36761 92528 -137483 55051 61896 -73840 225037
18461a81833A61165a8559C40324E2419c2494A31801c63108h4737J0812K4914j09141
$$ -181833 161165 -18559 340324 52419 -32494 131801 -363108 -84737 -73925 -49011 -158152
18450a58152C6785J69666c39896A92940a77912J4199M5007B01672b27956A42673
$$ -158152 36785 206451 -339896 192940 -177912 -163713 -118706 201672 -227956 142673
18439b81101a31788P647b4014j5430J7467q554B89219f0112l2210m931m7246O6785
$$ -281101 -131788 -124141 -24014 -39444 -21977 -30531 289219 -60112 -92322 -97253 -144499 -77714
18427g7714B38147b81667B2148a9779j61182F1441k5922J14003C9570K09385c65893
$$ -77714 238147 -281667 22148 -19779 -180961 61441 35519 149522 39570 248955 -365893
18415A51145c2086n7561A07143m7471m843A0572a23516A87879a57773I0331A558
$$ 151145 -32086 -89647 107143 59672 54829 10572 -123516 187879 -157773 90331 1558
18403A16446J51583A02061a93841j0235C56125i4011a8641A8955i3531m2990A07965
$$ 116446 268029 102061 -193841 -204076 356125 -94011 -18641 18955 -93531 -136521 107965
18391C71124I9992K20107e6881a1199A17243m4819f0257m46307b32282a9287B25969
$$ 371124 99992 320099 -56881 -11199 117243 72424 -60257 -506564 -232282 -19287 225969
18379b20621e4126k0659E0694J0862g9588k98997a83841e8784G1075b83105A47353
$$ -220621 -54126 -74785 50694 61556 -79588 -378585 -183841 -58784 71075 -283105 147353
18367a21114m5872e5914A9719K33824f2524K798K9016A18796C4667c9279J3508
$$ -121114 -166986 -55914 19719 253543 -62524 -59726 -30710 118796 34667 -39279 -25771
18356b5771B49365b59097B16610a5217j06551c4129q5359A481R7105a10860r6900
$$ -25771 249365 -259097 216610 -15217 -121768 -34129 -119488 1481 98586 -110860 -207760
18345b07760A75511d1528A2900n621a62883B9811K23563a49694j27590a12680
$$ -207760 175511 -41528 12900 7279 -162883 29811 253374 -149694 -277284 -112680
18334a49082M9297A47182e5600k27853a31207A67838l168a38373O1758B52012
$$ -149082 -99785 147182 -55600 -283453 -131207 167838 164670 -138373 -76615 252012
18323a99081a9067G0716i5303h32A2438N1254h9667q8284D8859J9571J06100b62980
$$ -199081 -19067 70716 -95303 -832 12438 63692 -89667 -177951 48859 68430 174530 -262980
18310b7544A99660j9548a51853E604N8806j5884d6385C0316J63713i515m7921
$$ -27544 199660 180112 -151853 5604 64410 48526 -46385 30316 194029 -9515 -57436
18299e7436r119F6055i7282A03197g7959j76327e9507A13488D5030J37823F7642
$$ -57436 -66555 66055 -97282 103197 -77959 -254286 -59507 113488 45030 182853 67642
18287G7403e0069H5899a66656b0091E1155a79002j8910B81577b18853h2368b5488
$$ 77403 -50069 85899 -166656 -20091 51155 -179002 -197912 281577 -218853 -82368 -25488
18275A02750g8438A5312J22016o6011L2574c23105B11523d2755B13892a70926
$$ 102750 -78438 15312 137328 71317 103891 -323105 211523 -42755 213892 -170926
18264a91892j10643A90824B1925J33700f4627A9696I265f1947k09165A10837h2432
$$ -191892 -302535 190824 21925 155625 -64627 19696 9265 -61947 -271112 110837 -82432
18252g8085b7581A63371i3288c3015k27233g9197j00637I5146a93247g4237G7062
$$ -78085 -27581 163371 -93288 -33015 -260248 -79197 -179834 95146 -193247 -74237 77062
18240a27971E247b61725R1402l5148h9503j40437F8279N0190a94130A60281F5007
$$ -127971 5247 -261725 -170323 -205471 -89503 -229940 68279 118469 -194130 160281 65007
18228A163J76727q4532K81227c9403j63057A63234h8107r2016B8140N0547N2447
$$ 1163 177890 93358 374585 -39403 -202460 163234 -88107 -180123 28140 78687 131134
18217A31134L3062d5141G9048a41924d2709l73011b1742A39820e2533I7098A6172
$$ 131134 164196 -45141 79048 -141924 -42709 -415720 -21742 139820 -52533 97098 16172
18205b4003j34617A4075h4499A56695a41573E21306e36803B21829b42219C883
$$ -24003 -158620 14075 -84499 156695 -141573 521306 -536803 221829 -242219 3883
18194A80861J96309M963a6604k65013D6568c2561D6006J06931C6661R9362e9052
$$ 180861 377170 382133 -16604 -281617 46568 -32561 46006 152937 36661 136023 -59052
18182H065f0539k19728a38587B16137a12627l06180a35162j02110R6308b2018
$$ 8065 -60539 -280267 -138587 216137 -112627 -418807 -135162 -237272 -140964 -22018
18171A98753a17588d7943j7063b731k1964A62195J8428B1536a73717p9083R2090
$$ 198753 -117588 -47943 -65006 -2731 -24695 162195 180623 21536 -173717 -252800 -160710
18160a60710O3113C63811a04566D664a98711p0271c7514j97322j07246E308K3912
$$ -160710 -97597 363811 -104566 4664 -198711 -268982 -37514 -234836 -342082 5308 29220
18149B9220d92487i2604j0007G9987a62419B2346K42282b72365j614h6361B46895
$$ 29220 -492487 -92604 -102611 79987 -162419 22346 264628 -272365 -273979 -86361 246895
18137a89229e2050H0283b42007d9965r2275E0944a11l75558a60979j07563E3982
$$ -189229 -52050 80283 -242007 -49965 -142240 50944 -111 -375669 -160979 -268542 53982
18125B49137l8786m5952h9088I4199a89421A65813d3731q31B37548a50213A33045
$$ 249137 210351 164399 -89088 94199 -189421 165813 -43731 -44562 237548 -150213 133045
18113A40099A6020a13063o711l9345j24651q9659J79664H4535b01813i8108A06417
$$ 140099 16020 -113063 -119774 -159119 -283770 -373429 -193765 84535 -201813 -98108 106417
18101a87775b2084H2485l727b60365c3812O313A42910h0775j6477A85081d4277
$$ -187775 -22084 82485 78758 -260365 -33812 -27499 142910 -80775 -97252 185081 -44277
18089b10573e4922j20315K5839J8015m02769A02426c67187A16201b80031F0098
$$ -210573 -54922 -175237 -149398 -131383 -534152 102426 -367187 116201 -280031 60098
18078A86619e0699j29032o5497a02355I0443a9364q4083B13992a2614I1062a22071
$$ 186619 -50699 -179731 -245228 -102355 90443 -19364 -103447 213992 -12614 91062 -122071
18066a3504k8809D4046b51262P0294g0043K0840G9668d7550B80052b37719J01331
$$ -13504 -42313 44046 -251262 -180968 -70043 -49203 79668 -47550 280052 -237719 -136388
18055a36388b8139G768a29899j63828C8050a77317O1330D1963a89893B12254a22357
$$ -136388 -28139 7768 -129899 -293727 38050 -177317 -115987 41963 -189893 212254 -122357
18043g7386D8313O3609d97G6872c9218C5702e6580C83050F5145e6127j65578A21093
$$ -77386 48313 111922 -497 76872 -39218 35702 -56580 383050 65145 -56127 -221705 121093
18030a9430j52009A42874j1247n9955B3826d9443A39357k8255K074b07680G1231
$$ -19430 -171439 142874 131627 71672 23826 -49443 139357 111102 113176 -207680 71231
18018a00789A56373d15733J53743M8788m2956c0436A27756E0183J87945b56334
$$ -100789 156373 -415733 -261990 -213202 -256158 -30436 127756 50183 238128 -256334
18007H7069b07136N9348B9813a75528c7290j62193A97501B4791a41429o2896A48402
$$ 87069 -207136 -147788 29813 -175528 -37290 -199483 197501 24791 -141429 -204325 148402
17995h8782j03596N1848q6281H3732h3403B0624c25302I0923i0306J7143H8401
$$ -88782 -192378 -140530 -226811 83732 -83403 20624 -325302 90923 -90306 -73163 88401
17983b59862A51639G4375a34165A00862K0839J24575G5708B1390a02859L1624
$$ -259862 151639 74375 -134165 100862 121701 246276 75708 21390 -102859 -71235
17973g1235A1356L3997a30527A61960a83672h2966k75455F4127J49951I5469f2126
$$ -71235 11356 45353 -130527 161960 -183672 -82966 -358421 64127 214078 95469 -62126
17961a75870c4947G3039N0499c23556D3671a29624a7341j42940L4981k01335D6545
$$ -175870 -34947 73039 123538 -323556 43671 -129624 -17341 -160281 -125300 -326635 46545
17949f361H4587e29827d6108p4108E425c532B69538B2999P2982O1417A4751K20165
$$ -6361 84587 -529827 -46108 -120216 5425 -3532 269538 22999 95981 157398 14751 234916
17937B34916A05420b26796K0837B39562C4291b049C1867J72921a14098H8032a54182
$$ 234916 105420 -226796 -205959 239562 34291 -2049 31867 204788 -114098 88032 -154182
17925d5848r0163M45L8690k3470C393h9407E6070R563a63904j769C830M0027j7173
$$ -45848 -136011 -135566 -96876 -120346 3393 -89407 56070 65633 -163904 -165673 3830 43857 26684
17912B6684N5281a2795B51362m0588n0481a28227l71371b17469J06807I4309g927
$$ 26684 81965 -12795 251362 210774 160293 -128227 -499598 -217469 -110662 94309 -7927
17900A65219G1255b54145a11479A33707k4405b30967J14907d0700l15048B12889
$$ 165219 71255 -254145 -111479 133707 109302 -230967 -116060 -40700 -355748 212889
17889h2310A33298J29396p1095C0775A2856a20343A81306a19333j20849N9951
$$ -82310 133298 262694 191599 30775 12856 -120343 181306 -119333 -240182 -180231
17879a80231C03038A43899C7907J41223a87424g7440C82627g2900O991B7616R2257
$$ -180231 303038 143899 37907 179130 -187424 -77440 382627 -72900 -65909 27616 119873
17868A19873b15014J2634D8104d0604A7150a76152H6345d08925D8712K03017a02805
$$ 119873 -215014 -202380 48104 -40604 17150 -176152 86345 -408925 48712 251729 -102805
17856b29437e2844r8355E2128f7832o1841e363A70842g0260B28398a70533j10034
$$ -229437 -52844 -151199 52128 -67832 -129673 -5363 170842 -70260 228398 -170533 -280567
17845b80567A30442J65940H5010J07525i4804C26553I3607l3965n884e2397B15553
$$ -280567 130442 296382 85010 192535 -94804 326553 93607 59642 53758 -52397 215553
17833E96Q211c07787B7446h8102B90212E8429J11822I485a86907D2723J61375
$$ 596 8807 -307787 27446 -88102 290212 58429 170251 9485 -186907 42723 204098
17822B04098o1349E4481a77116D4715b26118a05394k32814A07969a70776B04429
$$ 204098 142749 54481 -177116 44715 -226118 -105394 -338208 107969 -170776 204429
17811G5736K94790a55895A47391J97090c73733A3522b38724B33310l0311n39b50541
$$ 75736 370526 -155895 147391 344481 -373733 13522 -238724 233310 202999 202460 -250541
17799c08158G3937a38023A30600C333a96212A72469A1159J88019a49501k1650
$$ -308158 73937 -138023 130600 3333 -196212 172469 11159 199178 -149501 -171151
17789a71151F92a22733r7156f5075n19D6815b60852E2005M942a43131k4227A71076
$$ -171151 692 -122733 -219889 -65075 -65594 46815 -260852 52005 56947 -143131 -167358 171076
17776a24778k9255N6242B536c09871C09685b9795D0098J97504h9435K1420A71373
$$ -124778 -154033 -97791 2536 -309871 309685 -29795 40098 237602 -89435 -68015 171373
17764E3633a60094B55855j16719b07413A4305a337l6467B1768J35651M1023I0964
$$ 53633 -160094 255855 139136 -207413 14305 -1337 -37804 21768 157419 198442 90964
17752B5862b29379B46880i4726p3622j49445a08706H5403J30056m3064A1804N15579
$$ 25862 -229379 246880 -94726 -168348 -317793 -108706 85403 215459 172395 11804 527383
17741E27383B24577a4049k87942d8725A59557C4450R6001d5917m4001j8731B90477
$$ 527383 224577 -14049 -301991 -48725 159557 34450 130451 -45917 -89918 -108649 290477
17729C29862h3825D7497J22211c24128A93647N9220A02600d07304D4657a04089
$$ 329862 -83825 47497 169708 -324128 193647 252867 102600 -407304 44657 -104089
17718a13864e4446n4580d468p818n9698K4427O831F2104R691R665M6964n28J35259
$$ -113864 -54446 -109026 -4468 -12286 -71984 -47557 -40726 62104 71795 81460 128424 127896 263155
17705B63155c2488j85361d0077j01838A66925D0925a98503f0030l5538A52519
$$ 263155 -32488 -217849 -40077 -141915 166925 40925 -198503 -60030 -95568 152519
17694B9592d49751a04435a7276A89897E7819a19110A15613H195b39502C8234J76659
$$ 29592 -449751 -104435 -17276 189897 57819 -119110 115613 8195 -239502 38234 214893
17683B14893a58415B05797j00186a53248I2173e20510a56822e8806b1593j41768
$$ 214893 -158415 205797 105611 -153248 92173 -520510 -156822 -58806 -21593 -163361
17673a63361H5508N108L4975e5161B05656C9171g893B28564L8539f5794j54920
$$ -163361 85508 90616 125591 -55161 205656 39171 -7893 228564 267103 -65794 -220714
17662b20714d2296k24191J12796A15861n3006R9781l8343M2383E9109K29341p9522
$$ -220714 -42296 -266487 -153691 115861 62855 162636 124293 166676 59109 288450 208928
17651B08928J45429i2348j22324b5965A7221J54442K89007a91970A32601M9169
$$ 208928 354357 -92348 -214672 -25965 17221 171663 460670 -191970 132601 181770
17641A81770b4161E2296a18900m1879n4760R225D25627j13794a4116k48923A58116
$$ 181770 -24161 52296 -118900 -160779 -215539 -206314 425627 311833 -14116 -263039 158116
17629A9200a84102h2916I4926i6177B05426c4861B6269e9812K11m5021B42030
$$ 19200 -184102 -82916 94926 -96177 205426 -34861 26269 -59812 -59601 -104622 242030
17617i454A28743b80674B130a88723B86589d5474k23339h3184j72869L5849A95473
$$ -9454 128743 -280674 2130 -188723 286589 -45474 -268813 -83184 -256053 -220204 195473
17605b19948R6384j32956g9448A89172F0425L6919h8237B66565G1031C3186J29782
$$ -219948 -123564 -256520 -79448 189172 60425 97344 -88237 266565 71031 33186 162968
17594A62968l8972f7044K6251G6808b03805L3201A85230b14414E3003A3505J6078
$$ 162968 123996 -67044 -40793 76808 -203805 -170604 185230 -214414 53003 13505 29583
17583B9583a18463D57a39169D4181J05377M2535c17596A89044a52291C41369C1824
$$ 29583 -118463 457 -139169 44181 149558 192093 -317596 189044 -152291 341369 31824
17571A7701M24502E7795B1176J92094j9995e7158D85581j82811c68064f6898I1835
$$ 17701 442203 57795 21176 213270 193275 -57158 485581 302770 -368064 -66898 91835
17559a4091B05458m0930c40823E4675J5816K31033j23980H6406a1427B75630A07793
$$ -14091 205458 164528 -340823 54675 70491 301524 177544 86406 -11427 275630 107793
17547A6479b27735g5677A51517h4544k1613j53409a27297G187J83421h2545a5687
$$ 16479 -227735 -75677 151517 -84544 -106157 -259566 -127297 7187 190608 -82545 -15687
17535B6660J5193K84198j60233Q2897C8718e6078j21101A79531A3113C988Q5423
$$ 26660 41853 326051 165818 248715 38718 -56078 -177179 179531 13113 3988 89411
17524H9411L57208A17566J36802m8248R7550j27745G6436K16836A19684k1640
$$ 89411 446619 117566 254368 206120 303670 175925 76436 293272 119684 98044
17514I8044a34505A41798m5491n285b95921a25619D49719g7711b0578j24997D93
$$ 98044 -134505 141798 96307 91022 -295921 -125619 449719 -77711 -20578 -145575 493
17502A08918C8164L181f9647B03996o3279M4240E1639K12791E9395J24243I0706
$$ 108918 38164 41345 -69647 203996 140717 184957 51639 264430 59395 183638 90706
17490b04225F1205J38024B2881c0646q0131r975J3884A12711J32950F2896K18313
$$ -204225 61205 199229 22881 -30646 -110777 -120752 -106868 112711 245661 62896 281209
17479B81209a99324B63443q8286j1649o2588L50024A79336m5091l0988L26599
$$ 281209 -199324 263443 175157 163508 100920 450944 179336 134245 103257 429856
17469D29856O5527A89744b20424I8921L0054n9221J0692J55825o1476K68034e520
$$ 429856 495383 189744 -220424 98921 128975 69754 80446 236271 174795 442829 -5520
17457A71785J22P9377A8116N9568R1086J98698J33679B33835j06083o720L07695
$$ 171785 171907 251284 18116 77684 168770 367468 501147 233835 127752 121032 428727
17446D28727E4290N83344B61621I0308K67241J4235a34875L5828D43391j33834
$$ 428727 54290 637634 261621 90308 357549 371784 -134875 -99047 443391 309557
17436C09557b06747B41669R984E8605R8315L1643J06240j08114Q576a41227A31290
$$ 309557 -206747 241669 251653 58605 156920 188563 294803 186689 195265 -141227 131290
17424B12593O7596a1939B13855H3065a36743B94787A8070K10027n9914H1871M43465
$$ 212593 280189 -11939 213855 83065 -136743 294787 18070 228097 168183 81871 525336
17413E25336B48078Q5757J12126q649j19464c6981B6940J41659J86551a73278
$$ 525336 248078 333835 445961 437312 317848 -36981 26940 168599 355150 -173278
17402A35904K02081I4637h968B96382J75837M5005c6456A8281e6867B03574K4115
$$ 135904 337985 94637 -8968 296382 472219 517224 -36456 18281 -56867 203574 227689
17391B27689j05360l3656R4256f316B15652N2355p1724D2957L4689h7100B08132
$$ 227689 122329 88673 182929 -6316 215652 268007 196283 42957 77646 -87100 208132
17379A61139E0466o446J0683b02516B53265l9102K8669j5259E5010J53545K45225
$$ 161139 50466 44020 54703 -202516 253265 214163 242832 227573 55010 208555 453780
17368D53780e3628E0539h2255B86338b04679B22540n1122D8039K87753j57601
$$ 453780 -53628 50539 -82255 286338 -204679 222540 171418 48039 335792 178191
17358A78191J00742A05665c8392B7108J97165a3970A12789m5025A2789K76033
$$ 178191 278933 105665 -38392 27108 224273 -13970 112789 67764 12789 288822
17348B88822m4154r4825R7025q9141Q6203R4359j8899J3527A64694l102a64895
$$ 288822 244668 149843 246868 157727 243930 338289 319390 332917 164694 161592 -164895
17336A40111K38790B4271L48277j16361R3398C0930J04123J0906c7880A096d9250
$$ 140111 378901 24271 372548 256187 349585 30930 135053 145959 -37880 1096 -49250
17324G4129j9565k6481J26696h0215B63170C0602P9177h3132A72130g4197N54
$$ 74129 54564 28083 154779 -80215 263170 30602 109779 -83132 172130 -74197 -73643
17313g3643B97403p5184K55379i6818C5441L75026n1379E0918J16249J94327j04710
$$ -73643 297403 222219 477598 -96818 35441 410467 359088 50918 167167 361494 256784
17302B56784j09706K47241a16549N4365D56768A98021Q4113F8220J62520c06706
$$ 256784 147078 394319 -116549 -62184 456768 198021 282134 68220 230740 -306706
17291B83585D5422J17721J26704a32225D84039a0993A18404M7615g2523A33809
$$ 283585 45422 163143 289847 -132225 484039 -10993 118404 166019 -72523 133809
17280C50749j21080J2315o029G1563J75899b6793G8878J63668E3416K79138E6382
$$ 350749 229669 241984 235955 71563 247462 -26793 78878 242546 53416 332554 56382
17268D83795F8377O5754R5749K50703B25652I3689J2798K57984j69226d0329A66541
$$ 483795 68377 134131 229880 480583 225652 93689 106487 364471 195245 -40329 166541
17256A95587K4190q5220J56539p3265G1736P0736L04663j22516O4602f0854A37848
$$ 195587 219777 134557 291096 217831 71736 142472 447135 324619 389221 -60854 137848
17244B89461g8554A24135K37176c1255C8214P1716K99102D3828M36152L2500B17190
$$ 289461 -78554 124135 361311 -31255 38214 109930 409032 43828 479980 512480 217190
17232B3771J71843L71876B66501J2697L2845e8562K0022D36193d3955J6590C23952
$$ 23771 195614 567490 266501 279198 312043 -58562 -38540 436193 -43955 -27365 323952
17220D6876J32623a42274C31266l7764P6587G0943L34529r9840j11852N340K04300
$$ 46876 179499 -142274 331266 293502 370089 70943 405472 305632 193780 199120 403420
17209D03420A1467L49584I0573J83764P7849j67675J75315I5004N9642K84311
$$ 403420 11467 361051 90573 274337 352186 184511 359826 95004 154646 438957
17199D38957A72746n1980J70684J42256j98411K48424k35323o0895l3861J96407
$$ 438957 172746 120766 291450 433706 235295 483719 248396 187501 153640 350047
17189C50047m8154H9950L69804A98112D8765J74715J10984A48067J75502j23354
$$ 350047 301893 89950 459754 198112 48765 223480 334464 148067 323569 200215
17179B00215J58422K21328k68211A04400J23967B3359e5911A36346j3126K66540
$$ 200215 358637 579965 311754 104400 228367 23359 -55911 136346 123220 389760
17169C89760q3212H2280K0981K69260j38069K71359C2797O591J12690B0287Q55
$$ 389760 306548 82280 103261 372521 234452 505811 32797 39388 152078 20287 21142
17158B1142J15492L3807d4512C40802j03554K41554j60402j06245M0626J2530
$$ 21142 136634 170441 -44512 340802 237248 478802 318400 212155 252781 265311
17148B65311k809L41146j33829A84913J74863j36296N2992o6128i5038G3658K75895
$$ 265311 262502 603648 469819 184913 359776 223480 276472 210344 -95038 73658 349553
17137C49553K7677j1713A66005L64639k63877q6775M45428B76759k2132r7808
$$ 349553 377230 365517 166005 530644 266767 179992 625420 276759 254627 156819
17127A56819Q410N6474L140K43856q1124M18258m02154j3598I9191K71343j73525
$$ 156819 165229 221703 224843 468699 387575 805833 403679 390081 99191 370534 197009
17116A97009J69243K45519O4437B46141j15184J86096J82530k43763J34118O5811
$$ 197009 366252 611771 676208 246141 130957 317053 499583 255820 389938 455749
17106D55749R947A34087K60994M53j53782L30131b1218C61200O4449k03467P8204
$$ 455749 465696 134087 395081 395534 241752 571883 -21218 361200 425649 222182 300386
17095C00386E4620N37118p7599M3290p2343k16932R4689H6087K70984M8060K07875
$$ 300386 54620 591738 514139 557429 485086 268154 362843 86087 357071 405131 613006
17084F13006j96539J07324r9568n0359K28358k87933K22648B40626L66656j32726
$$ 613006 416467 523791 424223 373864 602222 314289 536937 240626 607282 474556
17074D74556j88553L59476k16232K6659l8949J9569N4719o5218r2335L45867j17300
$$ 474556 286003 645479 429247 455906 416957 436526 491245 426027 333692 679559 562259
17063E62259k7397J77710k48842N7027K45175k91436k19628J27137j22028L07968
$$ 562259 534862 712572 463730 520757 765932 474496 254868 382005 259977 567945
17053E67945j98555K1137r62R6877k8047R15R7196J22508k01409N81982m23688
$$ 567945 369390 390527 389565 486442 458395 459310 556506 679014 477605 1059587 635899
17042F35899B62570K20718P7484L11324C24992M49290j35943p355K20986j6234
$$ 635899 262570 483288 560772 872096 324992 774282 638339 630984 851970 835736
17032H35736l01816k03762M04944l29616R3502j6138R0224N5272O9964k57754
$$ 835736 533920 330158 735102 405486 498988 482850 573074 628346 698310 440556
17022D40556M62403l06285L86133l62044j91588L99131l75032P2243J82140l24957
$$ 440556 902959 596674 982807 620763 429175 828306 453274 525517 707657 382700
17012C82700J38999L5884K37604j19299k80263P58091A43063O87564M84786E25894
$$ 382700 521699 557583 795187 675888 395625 1153716 143063 830627 1315413 525894
17001E70195J8591Q7071N7001j02997L04928k34747j28502O3430J83934l18861
$$ 570195 588786 675857 732858 629861 934789 700042 571540 634970 818904 500043
16991E00043K42110L35569r2718o3645k30981J35945J94732l08101n7578K35418
$$ 500043 742153 1077722 985004 921359 690378 826323 1021055 712954 655376 890794
16981H90794k83128L41408j23951k40121L16563j42873N68055m62571k09196N7317
$$ 890794 607666 949074 825123 585002 901565 758692 1326747 864176 654980 712297
16971G12297J6478K52655P6623k78483K29979J77529j53931j87651P4184J60493
$$ 712297 728775 981430 1058053 779570 1009549 1187078 1033147 845496 919680 1080173
16961A080173k82474K44569k52079K09953k24931L22777m8760J88224j57638k12614
$$ 1080173 797699 1042268 790189 1000142 775211 1097988 1049228 1237452 1079814 867200
16951H67200N10500j78962q9369K12436n46776L88960p9488J69228k50294M9161
$$ 867200 1377700 1198738 1109369 1321805 775029 1163989 1084501 1253729 1003435 1052596
16941A052596q1858R0668M56459l91265J23686k07581j12693Q4942K22578O7849
$$ 1052596 970738 1061406 1517865 1126600 1250286 1042705 930012 1014954 1237532 1305381
16931A305381k0969J67790k40371M61410m42055J00977L38822k89148Q8115j64767
$$ 1305381 1284412 1452202 1211831 1673241 1231186 1332163 1670985 1381837 1469952 1305185
16921A305185q4522K43900p7366j15479k15724J41018j67837L36228J47932O1973
$$ 1305185 1220663 1464563 1387197 1271718 1055994 1197012 1029175 1365403 1513335 1575308
16911A575308K32885l86011K47809k84871L89651k02419q4850p3084M24967j59637
$$ 1575308 1808193 1422182 1669991 1385120 1774771 1572352 1487502 1414418 1839385 1679748
16901A679748K0942j07882j08518K03660J30979o1244k5093L06999k9659K8473
$$ 1679748 1700690 1592808 1484290 1687950 1818929 1757685 1732592 2039591 2009932 2038405
16891B038405k18156j83758K52369m77636M29739j22213L77958p5685r8448K91861
$$ 2038405 1820249 1636491 1888860 1411224 1840963 1718750 2096708 2021023 1922575 2214436
16881B214436J96200l41252K02775j76175L6913k16020L43886l32982L77875j49694
$$ 2214436 2410636 2069384 2272159 2095984 2132897 1916877 2260763 1927781 2305656 2155962
16871B155962K90934m7958L17718k16091k20213L77046q152k27003j21304K90058
$$ 2155962 2446896 2398938 2716656 2500565 2280352 2657398 2649246 2422243 2300939 2590997
16861B590997J4590k50025L53411M44852o44454N78573k15749J05324J63366k77118
$$ 2590997 2605587 2355562 2708973 3153825 2509371 3087944 2872195 2977519 3140885 2863767
16851B863767K22831K4691L54275m44270M04428K8732J15424k61366K35671j9728
$$ 2863767 3086598 3111289 3465564 3021294 3425722 3454454 3569878 3308512 3544183 3524455
16841C524455L41958j17262k63128J96885K45880j74646K6433r7249M35174J44933
$$ 3524455 3866413 3749151 3486023 3682908 3928788 3754142 3780575 3683326 4118500 4263433
16831D263433j23725J62266r846M16993r7334r1153J5393K58176Q6118k65739
$$ 4263433 4139708 4301974 4292128 4709121 4611787 4520634 4536027 4794203 4880321 4614582
16821D614582M93456o2356J7100K91759J62897q9291O3740N06463m38275M11048
$$ 4614582 5108038 5045682 5062782 5354541 5517438 5428147 5491887 5998350 5560075 5971123
16811E971123P2999j48555M02191J52817m8043K57467M11178l8711k226m5230
$$ 5971123 6044122 5895567 6297758 6450575 6402532 6659999 7071177 7032466 7030240 6985010
16801F985010P40939M8607J8715M70866j60578M59575J10879K82397N92012l22518
$$ 6985010 7725949 7774556 7793271 8264137 8103559 8563134 8674013 8956410 9548422 9225904
16791I225904O54460N9262K16271O91568m60651O22557K52365M67207K96070N08417
$$ 9225904 9880364 9939626 10155897 10847465 10386814 11009371 11261736 11728943 12025013 12533430
16781A2533430J77485L85840L62053J88348M87936M00168O32410L75978O23217
$$ 12533430 12710915 13096755 13458808 13647156 14135092 14535260 15167670 15543648 16166865
16772A6166865N84990J86627O63750R87928R00973L21611R63835O83483M34989
$$ 16166865 16751855 16938482 17602232 18590160 19491133 19812744 20776579 21460062 21895051
16763B1895051R55355Q14768J240944P66560R64211J336078J441837J250451J456747
$$ 21895051 22850406 23665174 24906118 25672678 26636889 27972967 29414804 30665255 32122002
16754C2122002J391140J511454J696708K024118J376697K327961K134337K481303
$$ 32122002 33513142 35024596 36721304 38745422 40122119 42450080 44584417 47065720
16746D7065720K597951K806479K884154L255531L024260L507277L819339M232108
$$ 47065720 49663671 52470150 55354304 58609835 61634095 65141372 68960711 73192819
16738G3192819M366745M716428N255210N486614N872368O031998O468566O849226
$$ 73192819 77559564 82275992 87531202 93017816 98890184 104922182 111390748 118239974
16730A18239974P386877Q008460P280393P813497P802235P706596P355509O525933
$$ 118239974 125626851 133635311 140915704 148729201 156531436 164238032 171593541 178119474
16722A78119474O027965M893128M413045K278799J387795l72498j725847k974978
$$ 178119474 184147439 189040567 193453612 195732411 197120206 196747708 195021861 192046883
16714A92046883m476232n401402o376171p473596p576175q053662p952530q085890
$$ 192046883 187570651 182169249 175793078 168319482 160743307 152689645 144737115 136651225
16706A36651225p760270p884406p255630p007403o639805o088853o259806n097399
$$ 136651225 128890955 121006549 113750919 106743516 100103711 94014858 87755052 82657653
16698H2657653n035841n048378m205971m105807l862913l489541l105061k977013
$$ 82657653 77621812 72573434 68367463 64261656 60398743 56909202 53804141 50827128
16690E0827128l286842k019524k753268j845788k175316k021916j943582j679005
$$ 50827128 47540286 45520762 42767494 40921706 38746390 36724474 34780892 33101887
16682C3101887k094664q07565j701040q77266j373305j038084r98406j350081
$$ 33101887 31007223 30199658 28498618 27621352 26248047 25209963 24211557 22861476
16674B2861476j049527n29497q46844o69947r37701q71709q44760l79509l25857
$$ 22861476 21811949 21282452 20435608 19765661 18827960 17956251 17111491 16731982 16406125
16665A6406125o83128q16528l52875n24182k72833j105556N074n14637q46013
$$ 16406125 15722997 14906469 14553594 14029412 13756579 12651023 12656097 12141460 11295447
16656A1295447J05415k72680j17041o65407l48482k08775m76619m14249n4798
$$ 11295447 11400862 11128182 11011141 10345734 9997252 9788477 9311858 8897609 8842811
16647H842811o4466l85481j96207n46485O651j68908O1827m35792l15560N3055
$$ 8842811 8778345 8392864 8196657 7650172 7656823 7487915 7549742 7113950 6798390 6851445
16637F851445k61760k99136M700K4870m29789m38098J83513J26842l75207J99744
$$ 6851445 6589685 6290549 6295249 6320119 5890330 5452232 5635745 5762587 5387380 5587124
16627E587124l38548j69585J4739k72229K15003m10621R9196j61280j89811q3667
$$ 5587124 5248576 5078991 5093730 4821501 5036504 4625883 4725079 4563799 4373988 4290321
16617D290321j05399k39655K00788p8075j48858k02677p7952p6817j74366R5027
$$ 4290321 4184922 3945267 4146055 4067980 3919122 3716445 3638493 3561676 3387310 3482337
16607C482337R3981q2220l56802J23581K78874o91884K70465l78169M17449k83779
$$ 3482337 3576318 3494098 3137296 3260877 3539751 2847867 3118332 2740163 3157612 2873833
16597B873833k13755L36608j53352j51584p9449L5085O2918l39347q0148K32426
$$ 2873833 2660078 2996686 2843334 2691750 2612301 2647386 2710304 2370957 2290809 2523235
16587B523235J31039k75645K96488p09906J66794p7653K94787j46962j68186m8193
$$ 2523235 2654274 2378629 2675117 1965211 2132005 2054352 2349139 2202177 2033991 1985798
16577A985798K13536l49872o5260q4701J78382L17308m45375K10573k35946O8940
$$ 1985798 2199334 1849462 1784202 1699501 1877883 2195191 1749816 1960389 1724443 1793383
16567A793383q3076l25874J36830J01958m06055K60049J59521K42370j85383o3797
$$ 1793383 1710307 1384433 1521263 1623221 1217166 1477215 1636736 1879106 1693723 1629926
16557A629926J91429k68425n16110L91046q4284P7267O289l7605Q0677k04898
$$ 1629926 1821355 1552930 1036820 1427866 1343582 1420849 1427138 1389533 1470210 1265312
16547A265312k29726K23569j40139K07313L20165m05623k82827J78258J97602
$$ 1265312 1035586 1259155 1119016 1326329 1646494 1240871 958044 1136302 1333904
16538A333904j92451L29755k02820k79569k80603K27988M98587j8064k78186k77527
$$ 1333904 1141453 1471208 1268388 988819 708216 936204 1434791 1416727 1138541 861014
16528H61014M26059l01018j00114J74665k83222K30699j15398L17204n60972j10544
$$ 861014 1287073 986055 885941 1060606 777384 1008083 892685 1209889 648917 538373
16518E38373L09422O4000q5137L3732Q7076K4346j73264l5606R3358R996L7932
$$ 538373 847795 911795 826658 860390 947466 971812 798548 762942 856300 866296 904228
16507I04228Q3955k10617j88311P3842r5348j46903K90365K93591l69743j12355
$$ 904228 988183 777566 589255 663097 567749 420846 711211 1004802 635059 522704
16497E22704j98447K92937J5257j87474J29459q9724R2609J87848k61816J97117
$$ 522704 324257 617194 632451 444977 574436 484712 577321 765169 503353 700470
16487G00470l23200K19975q9453L47078m07533R9577J49550N203J802k52373J72577
$$ 700470 377270 597245 507792 854870 447337 546914 696464 701667 703469 451096 623673
16476F23673k58243K94926k61686M9354L28591C07919M26073p8956N2118k52587
$$ 623673 365430 660356 398670 448024 776615 307919 733992 655036 707154 454567
16466D54567j08363j37681N28196k65322J46665C04041J36829j91460L20050j90306
$$ 454567 346204 208523 736719 471397 618062 304041 440870 249410 569460 379154
16456C79154K78639k78119J18574J87937l04451j53839L10888n0194l5190j54256
$$ 379154 657793 379674 498248 686185 381734 227895 538783 488589 453399 299143
16446B99143l671j00224K19098M18702l87745j17027M3276L439L47707C14848
$$ 299143 295472 195248 414346 833048 445303 328276 371552 374991 722698 314848
16435F67284B88260Q570L26001A24540N66836A88769L2907A9855L84257A72228
$$ 667284 288260 296830 622831 124540 691376 188769 221676 19855 404112 172228
16424B30794L990l740J68470j57749J31619K67305B12857K75279A30692Q5922
$$ 230794 234784 231044 399514 241765 373384 640689 212857 488136 130692 216614
16414B16614K30924B08479n1740L1543N628R1547J76421Q7735k17929j9436P6783
$$ 216614 447538 208479 156739 188282 193910 285457 461878 549613 331684 312248 389031
16403C89031j92127G7814K33410g9437C81470O7893a2293B35501I2273J88303
$$ 389031 196904 77814 311224 -79437 381470 449363 -12293 235501 92273 280576
16393B80576K89797B69627o3371a6678A23691C010N31195A26592h5551C57773
$$ 280576 570373 269627 206256 -16678 123691 3010 534205 126592 -85551 357773
16382A69855a78839B95452E723J22359O7954k5694K01823d1861A97708e6301l1174
$$ 169855 -178839 295452 5723 128082 196036 170342 372165 -41861 197708 -56301 -87475
16371h7475B9190L64787B1678K35517L40702j25757k16106l1296J9230N3078C2676
$$ -87475 29190 393977 21678 257195 597897 472140 256034 224738 243968 297046 32676
16359A51217d2285B26024J42937A67004n0928J54183A00655a39377C63269g492
$$ 151217 -42285 226024 368961 167004 116076 270259 100655 -139377 363269 -7492
16348C12165A36641J99227A59870P3558g9531B2026J09617F943J24939K04936
$$ 312165 136641 335868 159870 233428 -79531 22026 131643 6943 131882 336818
16338C36818r4683G7989J82365a51692f8925A94296J60929c5589A64882F0054
$$ 336818 242135 77989 260354 -151692 -68925 194296 355225 -35589 164882 60054
16327E3860j5880J21725c9996A23260c0066B02038P1612b71365A94598i4626F78729
$$ 53860 37980 159705 -39996 123260 -30066 202038 273650 -271365 194598 -94626 678729
16315a34453L0939B29250M8969A10245L09546C7241q816L60069J9309j81767G9927
$$ -134453 -103514 229250 278219 110245 419791 37241 28425 388494 407803 226036 79927
16303c9019r4400d428D1330L0832Q0939B2868J04818M2657n3960K55338e4357
$$ -39019 -133419 -4428 41330 72162 153101 22868 127686 170343 116383 371721 -54357
16291a50544A81422q288E2845M14551k22215M0705o0256l6547l764L2069B3073
$$ -150544 181422 173134 52845 467396 245181 285886 225630 189083 185319 217388 23073
16279E42576A66338B156a44661B52837A23831K24466E7720B4043J54268a4337
$$ 542576 166338 2156 -144661 252837 123831 348297 57720 24043 178311 -14337
16268g2455F7965r606P2129h8301L6423m5145A8499L29423c06853H0091C5505
$$ -72455 67965 58359 130488 -88301 -51878 -97023 18499 347922 -306853 80091 35505
16256A7650K60084G4528K953D554f0738A09662e4640A14071b14594d2919m1535
$$ 17650 277734 74528 77481 4554 -60738 109662 -54640 114071 -214594 -42919 -84454
16245h4454J8403k12260M3765P5958A00224g4260F3214P8898G0910j3681J0481
$$ -84454 -66051 -278311 -234546 -158588 100224 -74260 63214 142112 70910 57229 67710
16234F7710j336A7310a40558A31005a04921j3433A8519a03770D4912M4536b0513
$$ 67710 66374 17310 -140558 131005 -104921 -118354 18519 -103770 44912 89448 -20513
16222f6830k1751j33678B03597b73040J29054j83780G5974L9057J53818E4084
$$ -66830 -88581 -222259 203597 -273040 -143986 -327766 75974 115031 268849 54084
16211b02353G4581i7597B05815a97297E2000e5958C7347a23862J7433E7327j5993
$$ -202353 74581 -97597 205815 -197297 52000 -55958 37347 -123862 -106429 57327 41334
16200D1334a06303j008j75512P7106B47725J47825j20061j17331a9145b599A52165
$$ 41334 -106303 -107311 -282823 -205717 247725 395550 275489 158158 -19145 -2599 152165
16188a02652I9263b34831g9852k17524M4244H1545b90050E0894f6943j13886m1106
$$ -102652 99263 -234831 -79852 -297376 -253132 81545 -290050 50894 -66943 -180829 -221935
16177b21935d7607e181A31027a58465j26124a38046C9884O3138A2920N2195d02892
$$ -221935 -47607 -5181 131027 -158465 -284589 -138046 39884 103022 12920 65115 -402892
16165C5905O6131k7898a31405e1594I5335J11659c7364B18560d7012j8200b0654
$$ 35905 102036 74138 -131405 -51594 95335 206994 -37364 218560 -47012 -65212 -20654
16153C5768J89907j07805J28448K2142i8368M3303B09623a51009c2287k99809
$$ 35768 225675 117870 246318 268460 -98368 -55065 209623 -151009 -32287 -332096
16143c32096g384l12340R3420c4946G1726h2700C4012b869j09175c1380m668B27152
$$ -332096 -7384 -319724 -226304 -34946 71726 -82700 34012 -2869 -112044 -31380 -36048 227152
16130a07686B1261J83276a40797F3501a68649G6470a91794C2013a84618k4922
$$ -107686 21261 204537 -140797 63501 -168649 76470 -191794 32013 -184618 -209540
16120b09540H9672J6988Q8811D0394d5330k19054H5161b68621R3955M7325d8590
$$ -209540 89672 106660 195471 40394 -45330 -264384 85161 -268621 -174666 -127341 -48590
16108B48660a47656B78822F2798b82381B30674f2131A00468C9156e3379B62241
$$ 248660 -147656 278822 62798 -282381 230674 -62131 100468 39156 -53379 262241
16097g1447m744C4436Q3124E224O466K09727E6019k3709a63617D9784N5999C0704
$$ -71447 -76191 34436 117560 5224 11690 221417 56019 32310 -163617 49784 105783 30704
16084a69062B12865A5739r32b60155a05424A00339Q4110J38933d34787a55831
$$ -169062 212865 15739 14807 -260155 -105424 100339 184449 323382 -434787 -155831
16073c46818A65732E192a24454A10421a119C9270a02449j18750h4233B0254b25709
$$ -346818 165732 5192 -124454 110421 -1119 39270 -102449 -221199 -84233 20254 -225709
16061A18312m6658g2870B41409j16102a02920E5480a41854B58218B2705E003L3295
$$ 118312 71654 -72870 241409 125307 -102920 55480 -141854 258218 22705 5003 38298
16050C8298h7545n7533L2423a4503j52886o6920h0403A58706K09307a00197B76491
$$ 38298 -87545 -145078 -112655 -14503 -167389 -234309 -80403 158706 368013 -100197 276491
16038A30999b3887E2975e87j28559C58719E6009b65557i1519r2789j20901f7817
$$ 130999 -23887 52975 -587 -129146 358719 56009 -265557 -91519 -184308 -305209 -67817
16026C4656h4201o4098D9794a2823j68134F5601b71736J34702e0222E3210a44596
$$ 34656 -84201 -148299 49794 -12823 -180957 65601 -271736 -137034 -50222 53210 -144596
16014c1120j97004A99855a78855f3155G8429K52163c7658G4008j2733a21757F987
$$ -31120 -228124 199855 -178855 -63155 78429 330592 -37658 74008 61275 -121757 6987
16002A91646c20876E414a9944j59978k4353G5435b16027a9609q8148e108A75892
$$ 191646 -320876 5414 -19944 -179922 -204275 75435 -216027 -19609 -107757 -5108 175892
15990f0222A26598B7744f6196L638I8728J43836b14317A02437L65J79586k5880
$$ -60222 126598 27744 -66196 -62558 98728 242564 -214317 102437 102802 282388 256508
15979B56508L3049B6008M7761b76403A38985C8851c0805A38732b16648C7824L1456
$$ 256508 289557 26008 73769 -276403 138985 38851 -30805 138732 -216648 37824 69280
15968F9280b2657A84688g6956C5817d6027a1839k37777A24703D159M5075O2986
$$ 69280 -22657 184688 -76956 35817 -46027 -11839 -249616 124703 4159 49234 112220
15957A12220a58791j0068o163n0898I4578k0519K01076a13032E2276g9575r8139
$$ 112220 -158791 -168859 -175022 -225920 94578 74059 275135 -113032 52276 -79575 -177714
15946a77714c9772k20564B2717f3744K4916J9164j5850j44428A34984b53640A0622
$$ -177714 -39772 -260336 22717 -63744 -38828 -19664 -35514 -179942 134984 -253640 10622
15934F9838h220m8954r8125k5848A32800E6477a52340k88800A48354b23571A35117
$$ 69838 -8220 -57174 -155299 -181147 132800 56477 -152340 -441140 148354 -223571 135117
15922G3647a49559E0156b93587f8799r7357E2805b13682c2319p3856B22951H2592
$$ 73647 -149559 50156 -293587 -68799 -166156 52805 -213682 -32319 -106175 222951 82592
15910A08797p053k509b56321A29437i2738j4808k90694h1606a6519j66593E0796
$$ 108797 101744 99235 -256321 129437 -92738 -107546 -398240 -81606 -16519 -183112 50796
15898h5422A59205f2957j5891j51284D3954h2624A53315m1740f2106o8171c5469
$$ -85422 159205 -62957 -78848 -230132 43954 -82624 153315 111575 -62106 -130277 -35469
15886b2488k56482a12680G3761Q5902c4411j74004e8483A67902i0865L384A79537
$$ -22488 -278970 -112680 73761 159663 -34411 -208415 -58483 167902 -90865 -87481 179537
15874a34825F191a94554f3431j8100l13477a29555q3099M8444A37219b81720O7207
$$ -134825 6191 -194554 -63431 -81531 -395008 -129555 -212654 -164210 137219 -281720 -214513
15863b14513B30434G8446b8008d90j64683g5245I1002d8501E4933j6557q33c2661
$$ -214513 230434 78446 -28008 -490 -165173 -75245 91002 -48501 54933 38376 37543 -32661
15850h4422b2371q8531q7007c8405A3398a70653F8781c03574B29992g3804k40391
$$ -84422 -22371 -110902 -197909 -38405 13398 -170653 68781 -303574 229992 -73804 -314195
15839c14195b1101q1385F4167b3329B8751K47731a37730A63188C5446L06611c14736
$$ -314195 -21101 -102486 64167 -23329 28751 276482 -137730 163188 35446 342057 -314736
15827b3244K398A13760j5056e268p7236B68868c44578g7497D1094c97j58862k13889
$$ -23244 -20846 113760 98704 -5268 -82504 268868 -344578 -77497 41094 -397 -159259 -373148
15815c73148G6986a52518H8867e0989l04154K2616B73508c00812C0272R5495O1938
$$ -373148 76986 -152518 88867 -50989 -355143 -332527 273508 -300812 30272 125767 187705
15804A87705a89377C50952b23971C89220G2149j2640c06624A13940R3231c13595
$$ 187705 -189377 350952 -223971 389220 72149 59509 -306624 113940 207171 -313595
15793b94976c9040B64290A03938J25713J73849b42139J02317f0729k51945a35556
$$ -294976 -39040 264290 103938 229651 403500 -242139 -139822 -60729 -312674 -135556
15782c8447B4767H247a53562o2918i3992L4930A02712c48309e7380A38714a26206
$$ -38447 24767 8247 -153562 -216480 -93992 -59062 102712 -348309 -57380 138714 -126206
15770b3632B66188A11909f4271I7199L2042j3256j0103a50230b4717n2539r9915
$$ -23632 266188 111909 -64271 97199 129241 115985 105882 -150230 -24717 -77256 -177171
15759a77171f5167A5681R9628b50806A08434n2008B6873a71967d7884J6459p586
$$ -177171 -65167 15681 115309 -250806 108434 56426 26873 -171967 -47884 -31425 -39011
15748c9011j6123a3591k02707A11670j1328c36525A25309h4946A71086a5776E7099
$$ -39011 -55134 -13591 -216298 111670 100342 -336525 125309 -84946 171086 -15776 57099
15736b02077A22471g8871k15841C8186A0886a62453j38072a40890d1973A10294
$$ -202077 122471 -78871 -294712 38186 10886 -162453 -300525 -140890 -41973 110294
15725h3453I6436M2708a25764l6979A57703b2127j79174P0575f3289k00171c599
$$ -83453 96436 139144 -125764 -162743 157703 -22127 -201301 -130726 -63289 -263460 -3599
15713d58594C1614R0626l0804e357o5366B41973a53782F697J33163h02o8633B16949
$$ -458594 31614 122240 91436 -5357 -70723 241973 -153782 6697 139860 -802 -69435 216949
15700a60379d8285k71585A53343i8997j89410D8721J73064J43848C2525N3666
$$ -160379 -48285 -319870 153343 -98997 -288407 48721 221785 365633 32525 86191
15690H6191K13396j07842J17246A27591a18484f220j09275d1249k08273B80049
$$ 86191 299587 191745 308991 127591 -118484 -6220 -115495 -41249 -249522 280049
15679h1399G4885h0987j39332j5793e3391j17335b7020D3846J28257C4355c4929
$$ -81399 74885 -80987 -220319 -236112 -53391 -170726 -27020 43846 172103 34355 -34929
15667b00159I7641l422c5759k74437A46644n8311K67966b77896L9832N0836n7280
$$ -200159 97641 94219 -35759 -310196 146644 88333 356299 -277896 -238064 -187228 -244508
15656b44508A38152J6133L3359f4209j32019A2950N7592J10993b16246C9901a86850
$$ -244508 138152 154285 187644 -64209 -196228 12950 70542 181535 -216246 39901 -186850
15644E3799a45432E0070b37115A37175b74350D0423c9414j81458j05785c965j33659
$$ 53799 -145432 50070 -237115 137175 -274350 40423 -39414 -220872 -326657 -3965 -137624
15633a37624L1263k2006C42109a00073A09741e5295A3541K7352J65748n26m6551
$$ -137624 -106361 -128367 342109 -100073 109741 -55295 13541 40893 206641 206115 159564
15622A59564b41010C25755j30031e3096A44194d7199B36391I6067e4050b1877
$$ 159564 -241010 325755 195724 -53096 144194 -47199 236391 96067 -54050 -21877
15611B49433a71881B6245L4757c6416j54228R3756C5203J4764g1790J1210A8846
$$ 249433 -171881 26245 61002 -36416 -190644 -96888 35203 49967 -71790 -60580 18846
15599a3495A5332O7306c52785i0699A22687O9940a23443M2813A01990i0983m6672
$$ -13495 15332 82638 -352785 -90699 122687 192627 -123443 -80630 101990 -90983 -137655
15588a37655j28916h9565A44120J13521q3291I451f3399C24837A16095P1217G940
$$ -137655 -266571 -89565 144120 257641 174350 9451 -63399 324837 116095 187312 7940
15576H7996b04878N6940A9383K16865k6596E5446a50135j55107e6823K410G8137
$$ 87996 -204878 -147938 19383 236248 209652 55446 -150135 -305242 -56823 -54413 78137
15564b5787j35261h0267B28341F9089R1184k7525c07140E0337J33147k8918n4312
$$ -25787 -161048 -80267 228341 69089 160273 132748 -307140 50337 183484 154566 100254
15553A00254b5983B1927c4692j73939e3045A21204a28913K6264o1959d7570c826
$$ 100254 -25983 21927 -34692 -208631 -53045 121204 -128913 -102649 -164608 -47570 -3826
15541b90457C10948F5885J1231J15183j9488A3038K10953b78757B9303b69384
$$ -290457 310948 65885 77116 192299 172811 13038 223991 -278757 29303 -269384
15530a93240k4648h1586J5687H7282c62G4468k9964a6072D45175G388c02047B01028
$$ -193240 -217888 -81586 -65899 87282 -362 74468 44504 -16072 445175 7388 -302047 201028
15517g7476r4109N5894b24B31407A5459K72428a96292A22777B092f6626I608P1716
$$ -77476 -171585 -115691 -224 231407 15459 287887 -196292 122777 2092 -66626 9608 81324
15505H1324e666A69302a35051d4085j92250J11224N4982D2216f8691A05524J67847
$$ 81324 -5666 169302 -135051 -44085 -236335 -125111 -70129 42216 -68691 105524 273371
15494B73371c18656A79403H8438f69B94682i4370n9422k1489B65831b97218Q6220
$$ 273371 -318656 179403 88438 -669 294682 -94370 -153792 -175281 265831 -297218 -210998
15483b10998B99425a13699B25803k6365E2546L3858l0441c45433A45441p045O0835
$$ -210998 299425 -113699 225803 199438 52546 86404 55963 -345433 145441 138396 199231
15472A99231I8976h393p7785A53902L646b220l39293a62112A32414a54921A69941
$$ 199231 98976 -8393 -86178 153902 157548 -2220 -341513 -162112 132414 -154921 169941
15460E4698g2951c5989m02488C7973a38587B9245J77167a76670A3069a93580i6447
$$ 54698 -72951 -35989 -438477 37973 -138587 29245 206412 -176670 13069 -193580 -96447
15448A80800M2449B1250J20847K08015h9572p5956n8931A70316H3036C8838h2806
$$ 180800 223249 21250 142097 350112 -89572 -165528 -224459 170316 83036 38838 -82806
15436d5673R511l65384E4713j0868h5423E1199J30578F3958b4343j30285j28384
$$ -45673 -36162 -401546 54713 43845 -85423 51199 181777 63958 -24343 -154628 -283012
15425b83012A18995C7393a78970A15329b36105B18376b2817A29089a7702B02387
$$ -283012 118995 37393 -178970 115329 -236105 218376 -22817 129089 -17702 202387
15414i1138A36589R3070i8922B6729K21655J24468H2928b68609C91076b08585
$$ -91138 136589 229659 -98922 26729 248384 372852 82928 -268609 391076 -208585
15403B46705r2380a02573B57545a8352D76446b6719H4338a76668j87672B84010
$$ 246705 154325 -102573 257545 -18352 476446 -26719 84338 -176668 -364340 284010
15392a89600g5058E2661G937a1199D1686a44728D5060b28944h9625m2755A99635
$$ -189600 -75058 52661 7937 -11199 41686 -144728 45060 -228944 -89625 -132380 199635
15380B68190d0098C1194r872a80098o1912E26425e5526C6596K61544H5266L51487
$$ 268190 -40098 31194 21322 -180098 -242010 526425 -55526 36596 298140 85266 436753
15369D36753A85979B7675J08248c4873q5775A16053a75248A32262b02667b8455
$$ 436753 185979 27675 135923 -34873 -120648 116053 -175248 132262 -202667 -28455
15358a31880E2211R1716L1774n3139P3161J22815H6091q909c5914A15326K10020
$$ -131880 52211 143927 175701 122562 195723 318538 86091 77182 -35914 115326 325346
15347C25346H4293i2507A81364a27030H8238a36250L3390r2764A03897b03998
$$ 325346 84293 -92507 181364 -127030 88238 -136250 -102860 -195624 103897 -203998
15336b68008b0382i525k72379J17058B3853b13907M5252F585J35813a15065B361
$$ -268008 -20382 -9525 -281904 -164846 23853 -213907 -168655 6585 142398 -115065 2361
15324A30059D621f9595g794p0789L0015m86160f3482j0218p1293A61675A3525
$$ 130059 4621 -69595 -7794 -78583 -48568 -534728 -63482 -73700 -144993 161675 13525
15312c66845D2181M7251k8178K03966b21442O3497M7611A01155J48864e3547B58880
$$ -366845 42181 89432 61254 265220 -221442 -157945 -110334 101155 250019 -53547 258880
15300b20644B31145A02898b2365j53124M5064o8201B29355e3691j11185d8934
$$ -220644 231145 102898 -22365 -175489 -130425 -198626 229355 -53691 -164876 -48934
15289A42082J57096O9514m6112a95742A23640m8259k7307H767i2252H3869B4771
$$ 142082 299178 368692 322580 -195742 123640 75381 48074 8767 -92252 83869 24771
15277a35046d3690H8526J40807a26575O2814H4017M06794A83869K0675r5892m2590
$$ -135046 -43690 88526 229333 -126575 -63761 84017 490811 183869 204544 108652 66062
15266F6062a05290p5541G7395K54J23156i0528E8317b47977B91871o1445b16928
$$ 66062 -105290 -180831 77395 77649 200805 -90528 58317 -247977 291871 230426 -216928
15254a7769A32914J86591A11476n5444L04016G5838L20371N90028R14705m80213
$$ -17769 132914 319505 111476 56032 360048 75838 396209 986237 1900942 1420729
15244A420729J17162k56474D84279j98723G9147M5864E7952M3976J13934P7349
$$ 1420729 1537891 1281417 484279 285556 79147 125011 57952 101928 215862 293211
15234B93211F4376d8047C02461D6395j6364j0920P4329a26479N5436j96926A95157
$$ 293211 64376 -48047 302461 46395 30031 19111 93440 -126479 -71043 -267969 195157
15222H9111N4637i4541B41657E1808b33007C7044e4434l1908I6199a43464A26340
$$ 89111 143748 -94541 241657 51808 -233007 37044 -54434 -86342 96199 -143464 126340
15210B8364K1460j6848a35585C39963a33085B46503H8147b10514C4513P6118d9190
$$ 28364 49824 32976 -135585 339963 -133085 246503 88147 -210514 34513 110631 -49190
15198a7165C34753R5584a3212j13575N1045G0369i0438J7394B72910f1791C4372
$$ -17165 334753 430337 -13212 -126787 -75742 70369 -90438 -73044 272910 -61791 34372
15186A9f0031B55688R036H1399f6056A33879f3183A45108c14047J31236D0254
$$ 19 -60031 255688 264724 81399 -66056 133879 -63183 145108 -314047 -182811 40254
15174g7907e836B5430K16958A15665m893L64754j53879c8023E7874J22080C0539
$$ -77907 -5836 25430 242388 115665 110772 475526 321647 -38023 57874 179954 30539
15162E5268K47533A26437Q3968o4210J54297B2340e5853a3612D4518f3146A42286
$$ 55268 302801 126437 210405 146195 300492 22340 -55853 -13612 44518 -63146 142286
15150c56836g8960F707J57485d9859C57208j62081j2810a49290B22520p1040b2034
$$ -356836 -78960 6707 164192 -49859 357208 195127 182317 -149290 222520 151480 -22034
15138B65767Q390c5349I9805J27232L194B397R1030c324A36913e560D14008l2796
$$ 265767 274157 -35349 99805 227037 230231 2397 93427 -3324 136913 -5560 414008 381212
15126C81212j59813c42853h1341B2956K88908A38523J47611c4294A43183n1265
$$ 381212 221399 -342853 -81341 22956 311864 138523 286134 -34294 143183 91918
15116I1918J49365j04474Q5808A02631i311A31600b0020j18540E7087J26261q4862
$$ 91918 241283 136809 222617 102631 -9311 131600 -20020 -138560 57087 183348 98486
15105I8486N6016N4971a17754B92544F5364J25174p4n7212a15997C07273A02066
$$ 98486 154502 209473 -117754 292544 65364 190538 190464 133252 -115997 307273 102066
15093A01393a08676A31692a17921B0729J51498l6025A1573g632k59946A58452
$$ 101393 -108676 131692 -117921 20729 172227 136202 11573 -7632 -267578 158452
15082A26999P7140I3324M8915k8378J2599P596R4401a04435B81090a2002F5553
$$ 126999 204139 93324 142239 113861 126460 134056 228457 -104435 281090 -12002 65553
15070F3196n604j0925c4831F3277K89490C7871J40591D2478a31987E57J00273
$$ 63196 57592 46667 -34831 63277 352767 37871 178462 42478 -131987 557 100830
15059A00830K53376F3062j7215D194R7704J60570L0618L46619C02242G0628a04163
$$ 100830 354206 63062 45847 4194 101898 262468 293086 639705 302242 70628 -104163
15047A91832C9375P9836k1M1362J22770a10627A48730J36494r6856K11796M114
$$ 191832 39375 119211 119190 160552 283322 -110627 148730 285224 188368 400164 404278
15036D04278k00422F6975J05908R1538c5833B82813j18712L94490B26734o9576
$$ 404278 203856 66975 172883 264421 -35833 282813 164101 558591 226734 157158
15026A57158J61727r7986a24535N2692A17642K9568D9871J71181a0859B06496
$$ 157158 318885 220899 -124535 -71843 117642 147210 49871 221052 -10859 206496
15015B57030A23784J89381A54219a21348C17379A56208Q3391J37050c902A71805
$$ 257030 123784 313165 154219 -121348 317379 156208 239599 376649 -3902 171805
15004E9294J71880E9971M5532a39086o6035F6493L97954H6593K39795n1681R272
$$ 59294 231174 59971 105503 -139086 -205121 66493 464447 86593 326388 274707 283979
14993B83979n9367a55367C96791A05764R6167J39348r7820I1094K12254R9214
$$ 283979 224612 -155367 396791 105764 201931 341279 243459 91094 303348 402562
14983D02562j62694k1655p6425J91893c0041I01J46523l6679J92712j46236K4743
$$ 402562 239868 218213 141788 333681 -30041 901 147424 110745 303457 157221 181964
14972A81964G1991a22887B70348J9407n5074n1453J52790K5757I321c5152I8138
$$ 181964 71991 -122887 270348 289755 234681 183228 336018 361775 9321 -35152 98138
14960A72683K4039N9751r3160L99365A86448J3344M53852C25342L27574j77018
$$ 172683 196722 256473 163313 562678 186448 199792 653644 325342 652916 475898
14950D75898j56901j59264j4315j9684K44536Q9428o8247j84276B3567J02834
$$ 475898 318997 159733 145418 125734 370270 459698 391451 207175 23567 126401
14940A26401L71074A84082J31475N4883J65663k67143l438h040B86829J39378
$$ 126401 497475 184082 315557 370440 536103 268960 265522 -8040 286829 426207
14930D26207l2864d9239A71971J79500J63441A24184M5427F8508L56801A88278
$$ 426207 393343 -49239 171971 351471 514912 124184 169611 68508 425309 188278
14919A18652J04359o2389P3524K35554j81016L4664l3963l6584j6304J41101B6985
$$ 118652 223011 160622 234146 469700 288684 323348 289385 252801 236497 377598 26985
14907C81901j16095A28307N99777B30494o0907L04025j18321N7182P5037A09360
$$ 381901 265806 128307 728084 230494 169587 473612 355291 412473 487510 109360
14896B00195P700L03375k50738L814A02016J93304J53583b439H7513K04202j25608
$$ 200195 207895 511270 260532 264346 102016 295320 448903 -2439 87513 291715 166107
14885A66107J98491K07421k79291J18253J36249j54577j10159k1746n9494J52854
$$ 166107 364598 572019 292728 410981 547230 392653 282494 260748 201254 354108
14875C54108j10591j9680e5313B23959L43491J26227R311l16050Q0364j51753
$$ 354108 243517 223837 -55313 223959 567450 693677 702988 386938 467302 315549
14865C15549j09592M19969j97984M30265C82770M7519J92640k56797j42124J32901
$$ 315549 205957 625926 427942 858207 382770 430289 622929 366132 224008 356909
14855C56909A972L53896o1079M14158E269K05193n015J26463k0265K9608L40929
$$ 356909 1972 355868 294789 708947 5269 210462 205447 331910 311645 341253 682182
14844F82182C21025M26978C40691I9133M57869j88822J4513L62031l48605l1172
$$ 682182 321025 748003 340691 99133 557002 368180 382693 744724 396119 364947
14834C64947o3745K76796J523C4158J68996K92654j67600L0743J54087J45493
$$ 364947 301202 577998 579521 34158 203154 495808 328208 358951 513038 658531
14824F58531j85675B27666L68603k50383K51282L90190D83193J2388j5884J0537
$$ 658531 472856 227666 596269 345886 597168 987358 483193 495581 479697 490234
14814D90234q7312j17809L65158j58192B02178L18788K0754j29201j1715o885
$$ 490234 402922 285113 650271 492079 202178 520966 541720 412519 400804 393919
14804C93919R4161J61373n6663q0879J08483J03406l21195M4976r3805J56705
$$ 393919 488080 649453 592790 511911 620394 723800 402605 447581 353776 510481
14794E10481r5484A94482L70847M8924j30830J51070k64807N126N91926m00539
$$ 510481 414997 194482 565329 614253 483423 634493 369686 374812 966738 566199
14784E66199J52658L1507p1947k4858j19933j06344K68812j26214B39163O55676
$$ 566199 718857 750364 678417 653559 533626 427282 696094 569880 239163 894839
14774H94839l05327k77758J06586J71490O6698j39888K08109K6987C62014J42837
$$ 894839 589512 311754 418340 589830 656528 516640 724749 751736 362014 504851
14764E04851R4391L3352q6678M43090l54543j31160K50263C61287M30748j81994
$$ 504851 599242 632594 545916 989006 634463 503303 753566 361287 792035 610041
14754F10041N3434R531j64356J92709B94193L42106j23580K70370k06816j6692
$$ 610041 663475 673006 508650 701359 294193 636299 512719 783089 576273 559581
14744E59581N6937R4537l24276M01188j60035k8253K46695l29173J94203J23827
$$ 559581 616518 711055 386779 787967 627932 599679 846374 517201 711404 835231
14734H35231J47514j70095j79394M7877M0803K16282r297l86613J08409Q2337
$$ 835231 982745 812650 633256 681133 721936 938218 928921 542308 650717 733054
14724G33054K02133k33138K76090k37233o0039J61622j65236p0788N6001o9667
$$ 733054 935187 702049 978139 740906 680867 842489 677253 606465 662466 592799
14714E92799L58887j24087m2835J4943j52114k60883M03552j08423J88885D07003
$$ 592799 951686 827599 784764 799707 647593 386710 790262 681839 870724 407003
14703H99723j71194J43181K79290l23826R9849j31316J22999J85149m23792L07646
$$ 899723 728529 871710 1151000 827174 927023 795707 918706 1103855 680063 987709
14693I87709j31050J44074n6419k85279J44308q7895M0619J51082Q0222j98691
$$ 987709 856659 1000733 944314 659035 803343 715448 756067 907149 987371 788680
14683G88680K11659j40713L282R9206K81j80211N52047F58870L56727j97476J47636
$$ 788680 1000339 859626 862908 962114 962395 782184 1334231 658870 1015597 818121 965757
14672I65757K04398k45748J72241m2009k45943O21876m85363j23573J18411J00209
$$ 965757 1170155 924407 1096648 1054639 808696 1430572 945209 821636 940047 1040256
14662A040256j8176Q9157J1573j05625J21374P6327m04569L12139j40323j65368
$$ 1040256 1022080 1111237 1122810 1017185 1138559 1214886 810317 1122456 982133 816765
14652H16765K38975J79718j31569K53782l11920K62945l22262n5174K69400n2947
$$ 816765 1055740 1235458 1103889 1357671 1045751 1308696 986434 931260 1200660 1147713
14642A147713P0644k80500J46312K92179n6357L63171n93610K47031j23069J04347
$$ 1147713 1218357 937857 1084169 1376348 1319991 1683162 1089552 1336583 1213514 1317861
14632A317861k59793p9363N69752l73935M16067k92881j17354J97688N6990M7739
$$ 1317861 1058068 978705 1548457 1174522 1590589 1297708 1180354 1378042 1435032 1482771
14622A482771m89312L91932M06800l81271J04920k32946N67631n04664J24275
$$ 1482771 993459 1385391 1792191 1410920 1515840 1282894 1850525 1345861 1470136
14613A470136R094j15864K93812L9633m2385j97902M4718J47491r8435R8577p7338
$$ 1470136 1479230 1363366 1657178 1696811 1654426 1456524 1501242 1648733 1550298 1648875 1571537
14602A571537R864K1264k79481K55141k77862N68595l03609K82329j92082P7871
$$ 1571537 1581401 1602665 1323184 1578325 1300463 1869058 1565449 1847778 1655696 1733567
14592A733567j27010K09352j34193J990m6152L12642L4955n17454N23329k37033
$$ 1733567 1606557 1815909 1681716 1683706 1637554 1950196 1985151 1467697 1991026 1753993
14582A753993l0989K08089k45971J49930L79797k71759k09159M11802k85178P9613
$$ 1753993 1723004 1931093 1685122 1835052 2214849 1943090 1733931 2145733 1860555 1940168
14572A940168r8720L59535J19602l47250L57941P9799J24854l11494J14599J1096
$$ 1940168 1841448 2200983 2320585 1973335 2331276 2411075 2535929 2224435 2339034 2350130
14562B350130o8352L38050q0796j65146L21645J58421K2115J4816N25621M20465
$$ 2350130 2281778 2619828 2539032 2373886 2695531 2853952 2876067 2890883 3416504 3836969
14552C836969J45046R70754J476486K861839L635814Q155803K2404429m046977
$$ 3836969 3982015 4952769 6429255 9291094 12926908 21082711 43487140 39440163
14544C9440163A6104337p774451j714272l260525j151857m30734M39790n28441
$$ 39440163 16104337 8329886 6615614 3355089 2203232 1772498 2212288 1683847
14536A683847R5865n1330M77489k3580l69875m216M49086R8929M8087k27549M5824
$$ 1683847 1779712 1728382 2205871 2182291 1812416 1808200 2257286 2356215 2404302 2176753 2222577
14525B222577K65180n35275L69193N4037j99339r5342Q2288L30358o1319o3241
$$ 2222577 2487757 1952482 2321675 2375712 2176373 2081031 2163319 2493677 2432358 2369117
14515B369117J16184P3648l57334O06883k49655J25161j72512J53041k38445O49313
$$ 2369117 2485301 2558949 2201615 2808498 2558843 2684004 2511492 2664533 2426088 3075401
14505C075401m7540K32923n92697J58021K55763N4127R3289j31713R3856k43476
$$ 3075401 3027861 3260784 2668087 2826108 3081871 3135998 3229287 3097574 3191430 2947954
14495B947954J3999L07604m07030K67283j43307J77454J19676K42141j27876L30689
$$ 2947954 2961953 3269557 2862527 3129810 2986503 3163957 3283633 3525774 3397898 3728587
14485C728587l75121m1605L46486L2753q0950J58661k26072L77584j06595K3227
$$ 3728587 3353466 3311861 3658347 3691100 3610150 3768811 3542739 3920323 3813728 3836955
14475C836955K17001n7575m1863L42837l97334O0963J27313K81040K13143o52790
$$ 3836955 4053956 3996381 3954518 4297355 3900021 3960984 4088297 4369337 4582480 3929690
14465C929690K49015J20721k12742L89535J07310P4691j8536J05828r823K01550
$$ 3929690 4178705 4299426 4086684 4476219 4583529 4658220 4639684 4745512 4735689 4937239
14455D937239Q4420j92248j44662L27969M11999N1184l26067j8895K35033l5412
$$ 4937239 5021659 4829411 4684749 5012718 5424717 5475901 5149834 5130939 5365972 5330560
14445E330560L21163l2655L10762j95539J89204j08644J49942K57859l13061L16911
$$ 5330560 5651723 5619068 5929830 5734291 5923495 5814851 5964793 6222652 5909591 6226502
14435F226502l725o2530L38264L4659K8927K58274j70798N66187l82106L38764
$$ 6226502 6222777 6160247 6498511 6533170 6562097 6820371 6649573 7215760 6833654 7172418
14425G172418k69152J26623L06607L13916l24363L14022j36915L67752J58110
$$ 7172418 6903266 7029889 7336496 7650412 7326049 7640071 7503156 7870908 8029018
14416H029018M4622K73436r635j46049K50656M17773l85389K38105L55817J89339
$$ 8029018 8073640 8347076 8337441 8191392 8442048 8859821 8474432 8712537 9068354 9257693
14406I257693k2305L2099L85985K34818k2985O0237K70587N8874J10764K80999
$$ 9257693 9235388 9267487 9653472 9888290 9865305 9925542 10196129 10255003 10365767 10646766
14396A0646766J92628N49555j79795K81871l31589L61567P16801j60769M77492
$$ 10646766 10839394 11388949 11209154 11491025 11159436 11521003 12237804 12077035 12554527
14387A2554527R5758L05152J22725R9838K04923L37705J31546P55241O8042K68471
$$ 12554527 12650285 12955437 13078162 13178000 13382923 13720628 13852174 14607415 14675457 14943928
14377A4943928M8387M62566J59660M48859L55039K67802J5673L21175M25977L58222
$$ 14943928 14992315 15454881 15614541 16063400 16418439 16686241 16701914 17023089 17449066 17807288
14367A7807288M65660N41342M53722j7544P65019O18614N42402K32808L82930
$$ 17807288 18272948 18814290 19268012 19250468 20015487 20634101 21176503 21409311 21792241
14358B1792241N16204K86764Q79254L04991Q27392L79895P77549O54712J56423
$$ 21792241 22308445 22595209 23474463 23779454 24606846 24986741 25764290 26419002 26575425
14349B6575425J100193M30040Q14549O07413J022031N45273J234618P59269O45721
$$ 26575425 27675618 28105658 28920207 29527620 30549651 31094924 32329542 33088811 33734532
14340C3734532J070379J041354R26302J146709J255815J175094R71094J279397
$$ 33734532 34804911 35846265 36772567 37919276 39175091 40350185 41321279 42600676
14332D2600676J118218J403710J543838J595094J376091J721331J857664J664440
$$ 42600676 43718894 45122604 46666442 48261536 49637627 51358958 53216622 54881062
14324E4881062K112896J646401K184182K324436K105663K543208K134557K585277
$$ 54881062 56993958 58640359 60824541 63148977 65254640 67797848 69932405 72517682
14316G2517682L045124L040230L060640K881159L586319L826114L840188L916256
$$ 72517682 75562806 78603036 81663676 84544835 88131154 91957268 95797456 99713712
14308I9713712M650835M457712M587515N141834N721604O023629N919458O833454
$$ 99713712 104364547 108822259 113409774 118551608 124273212 130296841 136216299 143049753
14300A43049753O560346P581791P906936Q092432Q785013R442575J0047910J0471832
$$ 143049753 149610099 157191890 165098826 173191258 181976271 191418846 201466756 211938588
14292B11938588J0553867J1651956J1870366J2652198J3024866J3623600J4166817
$$ 211938588 222492455 234144411 246014777 258666975 271691841 285315441 299482258
14285B99482258J4588354J4511633J4808802J5202883J5085728J4510250J4020934
$$ 299482258 314070612 328582245 343391047 358593930 373679658 388189908 402210842
14278D02210842J3350881J2149883J0226477O930393K575891J84559J040531K066679
$$ 402210842 415561723 427711606 437938083 444868476 447444367 447628926 448669457 450736136
14270D50736136K66135l734331n394293n051058p519792j0609672j2232265j3838218
$$ 450736136 451002271 447267940 441873647 436822589 429302797 418693125 406460860 392622642
14262C92622642j4764905j5373317j6018513j5465502j5795529j5086387j5121267
$$ 392622642 377857737 362484420 346465907 331000405 315204876 300118489 284997222
14255B84997222j4404506j3805354j1949734j2174668j2176434j1037841j0774177
$$ 284997222 270592716 256787362 244837628 232662960 220486526 209448685 198674508
14248A98674508r735061r514055q767928q383990p292304p637230p026636o627757
$$ 198674508 188939447 179425392 170657464 162273474 154981170 147343940 140317304 133689547
14240A33689547o104201n487578n076165n185446m867979m470565m510957m117308
$$ 133689547 127585346 122097768 117021603 111836157 106968178 102497613 97986656 93869348
14232I3869348l400928l535288l428583l398680l062921l358903k422173k651885
$$ 93869348 90468420 86933132 83504549 80105869 77042948 73684045 71261872 68609987
14224F8609987k936565j992646k429865j651461j838203k242538j952350j659775
$$ 68609987 65673422 63680776 61250911 59599450 57761247 55518709 53566359 51906584
14216E1906584j532991j440417j665659j276546j620359r12055j252757j897735
$$ 51906584 50373593 48933176 47267517 45990971 44370612 43458557 42205800 40308065
14208D0308065q25527o25088j054223j431628j215751o48443j034547r93920k75189
$$ 40308065 39482538 38857450 37803227 36371599 35155848 34507405 33472858 32478938 32203749
14199C2203749j252694p05089j040466o48436m70520n35103o78110q70330o24250
$$ 32203749 30951055 30245966 29205500 28557064 28086544 27551441 26873331 26003001 25378751
14190B5378751m55626r28415l16692n80055l12938p52322m06659p55702K0393
$$ 25378751 24923125 23994710 23678018 23097963 22785025 22032703 21626044 20870342 20890735
14181B0890735m82034n19880m55379o01583j80281l23473k22943k89431m88823
$$ 20890735 20408701 19888821 19433442 18831859 18651578 18328105 18105162 17815731 17326908
14172A7326908k85146o35104l98357J60181n71396J14247k37763p06954k79822
$$ 17326908 17041762 16406658 16008301 16168482 15597086 15711333 15473570 14766616 14486794
14163A4486794l45063l18458k18335k6796l62636o32442K67680j4332o32335J58424
$$ 14486794 14141731 13823273 13604938 13578142 13215506 12583064 12850744 12836412 12204077 12362501
14153A2362501m04358n03645m3848K5814o4070l49392j61649l32068l7636j48012
$$ 12362501 11958143 11454498 11410650 11436464 11372394 11023002 10861353 10529285 10491649 10343637
14143A0343637j84356j79446l33811q2633R0885K2217m86156j96466N1639j90241
$$ 10343637 10159281 9979835 9646024 9563391 9654276 9676493 9190337 8993871 9045510 8855269
14133H855269K98379m03943j36049k2553l92322R4339n52166K05596k4047l62995
$$ 8855269 9153648 8749705 8613656 8591103 8198781 8293120 7740954 7946550 7922503 7559508
14123G559508J14187k75524k68241K80489K45337n05864l54128L09924k28287
$$ 7559508 7673695 7398171 7129930 7410419 7655756 7149892 6795764 7105688 6877401
14114F877401k98509J29830k87705R4004K16733j55183j07708m85789M4039j98305
$$ 6877401 6578892 6708722 6421017 6515021 6731754 6576571 6468863 5983074 6027113 5828808
14104E828808Q5823O8857j76024O0429p8942O8509k95980j68140R1129k02806
$$ 5828808 5914631 5983488 5807464 5867893 5788951 5857460 5561480 5393340 5484469 5281663
14094E281663r949J6326q4930o9922n7783m24701N19933k31088M9049l67133P6416
$$ 5281663 5271714 5288040 5203110 5133188 5075405 4650704 5170637 4939549 4988598 4621465 4697881
14083D697881k66551K83639K1369j16283k92860O59942o99137n9913J48160o362
$$ 4697881 4431330 4714969 4736338 4620055 4327195 4987137 4288000 4228087 4376247 4369885
14073D369885k08959J485O9149j41607Q8901l43035K72004m10679L21496p9629
$$ 4369885 4160926 4162411 4231560 4089953 4178854 3835819 4107823 3697144 4018640 3939011
14063C939011j60385j10898L20876j26041R9318L8204k7710k8112m38349M59285
$$ 3939011 3778626 3667728 3988604 3862563 3961881 4000085 3972375 3944263 3505914 3965199
14053C965199o26836Q5483r2925n664k6210K53793k38365P3592J68678k37341
$$ 3965199 3338363 3423846 3330921 3325257 3299047 3552840 3314475 3388067 3556745 3319404
14043C319404o356p6572M437j97036P0792K58397l23858l50420L62983j48910
$$ 3319404 3313048 3236476 3240913 3043877 3114669 3373066 3049208 2698788 3061771 2912861
14033B912861J60846l07085N4432L5584K5740n60004K41450J59766K13355k13372
$$ 2912861 3073707 2766622 2821054 2856638 2882378 2322374 2563824 2723590 2936945 2723573
14023B723573l2684k32986J83702n1077K8905m3324j91415K21755l27122K86237
$$ 2723573 2690889 2457903 2641605 2590528 2619433 2576109 2384694 2606449 2279327 2565564
14013B565564k39533k13248j6632J2815J80126k21880Q305n5861J26754l0038
$$ 2565564 2326031 2112783 2096151 2108966 2289092 2067212 2075517 2019656 2146410 2116372
14003B116372L74132m24779K28131Q279n18330M41603l50357O3998J08806r6028
$$ 2116372 2490504 2065725 2293856 2302135 1783805 2225408 1875051 1939049 2047855 1951827
13993A951827P9278L5613K49227P13679J813303L115773O010066K2524497P123623
$$ 1951827 2031105 2066718 2315945 3029624 4842927 7958700 13968766 36493263 43616886
13984D3616886B1220345r874838m521022j748710j208991l3646l88254l68228
$$ 43616886 21220345 11345507 6824485 5075775 3866784 3833138 3444884 3076656
13976C076656l7683l59288j65604M2939j76742K92351j33566k48142J89980k5310
$$ 3076656 3038973 2679685 2514081 2557020 2380278 2672629 2539063 2290921 2480901 2455591
13966B455591Q626M7482n07032l2827k2309R6462K42882m36867K93899k12544
$$ 2455591 2464217 2511699 2004667 1971840 1949531 2045993 2288875 1852008 2145907 1933363
13956A933363j59806K33441l0601m6004j65895p2931L0167K46242o48143O96643
$$ 1933363 1773557 2006998 1976397 1930393 1764498 1691567 1721734 1967976 1319833 2016476
13946B016476m57193k18607L16232J95947j0933j79001R7972K571o7454O2549
$$ 2016476 1559283 1340676 1656908 1852855 1841922 1662921 1760893 1763464 1696010 1758559
13936A758559k41620K00304k47189M3389j1378j38650J50251l4258l1055N5978
$$ 1758559 1516939 1717243 1470054 1513443 1502065 1363415 1513666 1479408 1448353 1504331
13926A504331K18443j19047l1963k47144j12113K40975J63103j10755J67020J41650
$$ 1504331 1722774 1603727 1571764 1324620 1212507 1453482 1616585 1505830 1672850 1814500
13916A814500k81491j29451j65039O9397M10692m16466J31408p3819r0986r1211
$$ 1814500 1533009 1403558 1238519 1307916 1718608 1302142 1433550 1359731 1268745 1177534
13906A177534o5013L83094L0943l56599k70523L56852k11814L47169m7009k02211
$$ 1177534 1112521 1495615 1526558 1169959 899436 1256288 1044474 1391643 1344634 1142423
13896A142423m4394j13166l6434N81058l18923k32734L66948N0181K00372m58776
$$ 1142423 1098029 984863 948429 1529487 1210564 977830 1344778 1394959 1595331 1136555
13886A136555K35102k60652K58524l36509j49978J47960K5818J88545J04817l95881
$$ 1136555 1371657 1111005 1369529 1033020 883042 1031002 1056820 1245365 1350182 954301
13876I54301M5795J37623M3300P1454m7083j60047N822l8145J4364L24573m03476
$$ 954301 1000096 1137719 1181019 1252473 1205390 1045343 1051165 1013020 1027384 1351957 948481
13865I48481R5196j273L58079l25061m9397p5807k65170L39649J22390j02559
$$ 948481 1043677 1042404 1400483 1075422 1026025 950218 685048 1024697 1147087 1044528
13855A044528r5593D17719O31315j08411L92679l75830L85027n19470J89093R9775
$$ 1044528 948935 417719 1049034 940623 1333302 957472 1342499 823029 1012122 1111897
13845A111897o2819m04502K25551K7459l8570j01927K38363j36130j94163M57372
$$ 1111897 1049078 644576 870127 897586 859016 757089 995452 859322 665159 1122531
13835A122531j64623j75621k5010M3257M1839L06914l08782j78164Q3310m0357
$$ 1122531 957908 782287 757277 800534 842373 1149287 840505 662341 745651 705294
13825G05294J19292K37332n15020L17606J61389l40468n9808O32269E87269K84338
$$ 705294 824586 1061918 546898 864504 1025893 685425 625617 1257886 587269 871607
13815H71607M3942m3252J00669q9151j23658K31610J11879j29784l79063J68384
$$ 871607 915549 872297 972966 883815 760157 991767 1103646 973862 594799 763183
13805G63183k74197K16083J03158K2629l61626M71896k8390k27460J11310K93643
$$ 763183 488986 705069 808227 830856 469230 941126 912736 685276 796586 1090229
13795A090229l44269N4834r0548J46612j77042J6709K06708m01282j7782P1455
$$ 1090229 745960 800794 710246 856858 679816 696525 903233 501951 484169 555624
13785E55624J71048j13119R2066J23532J45260m00518m7443L0649K25526l77738
$$ 555624 726672 613553 705619 829151 974411 573893 526450 557099 782625 404887
13775D04887J71135l4701K5851l2336R2470j24949L38647l58043K80565r1559
$$ 404887 576022 541321 567172 534836 627306 502357 841004 482961 763526 671967
13765F71967k18361K17939K16310k75826L30874l47303n30j39877J26404K65869
$$ 671967 453606 671545 887855 612029 942903 595600 595070 455193 581597 847466
13755H47466k11553r9758k06771K46239K3482j4352O0375N7191K40075C87008
$$ 847466 635913 536155 329384 575623 599105 584753 645128 702319 942394 387008
13744D94409m995K97863l13247M20993j63325j76411n3866N1653j17764Q3976
$$ 494409 489414 787277 474030 895023 731698 555287 501421 553074 435310 519286
13734E19286J3026L2889L50428l85927j28745J25093k23086O32677D37977M03274
$$ 519286 532312 565201 915629 529702 400957 526050 302964 935641 437977 841251
13724H41251A97177K00985K42388N7814k18546J36567p595r8964k11543J79820
$$ 841251 197177 398162 640550 698364 479818 616385 608790 509826 298283 478103
13714D78103J92686k32098n575J98495l00125N68137j4856C47657q6666J38172
$$ 478103 670789 438691 433116 631611 331486 899623 884767 347657 260991 399163
13704C99163O1183J29455j90061J01380r1657R0715K88846l21766K6641R5575
$$ 399163 460346 589801 399740 501120 409463 500178 789024 467258 493899 589474
13694E89474r7727J00142j50415o698R3153m0688A99172M89977k35533j12553
$$ 589474 491747 591889 441474 434776 527929 487241 199172 689149 453616 341063
13684C41063M7085j84807J29133M3105j3896L09813k04189K06925k65255J44960
$$ 341063 388148 203341 332474 375579 361683 671496 467307 674232 408977 553937
13674E53937j52918K7746n8056J6302J45816J346A98891J19209K15926J27081
$$ 553937 401019 428765 370709 387011 532827 534173 198891 318100 534026 661107
13664F61107A94891K48054L95219j32924k80321M1020q4503O9609R3853R1786
$$ 661107 194891 442945 838164 705240 424919 465939 381436 451045 544898 636684
13654F36684A66045L83175k47848J15180R152p4099K9651K2552l6393J86775J89753
$$ 636684 166045 549220 301372 416552 425704 351605 381256 403808 367415 554190 743943
13643G43943B36610R1143K92436B56208L7367m2950R3733J52521k06057k1947
$$ 743943 236610 327753 620189 256208 293575 250625 344358 496879 290822 268875
13633B68875Q4133R0367r7054n0597L94184j77064r6135K435j4271n747J02481
$$ 268875 353008 443375 346321 295724 689908 512844 416709 419144 404873 399126 501607
13622E01607j35991q6427L5019K0449n7484M7170J0690R6772j29893r0384M04221
$$ 501607 365616 279189 314208 334657 277173 324343 335033 431805 301912 211528 615749
13611F15749A96050M90378j60088k10040j44215J20552K80302k79018j16372K32310
$$ 615749 196050 686428 526340 316300 172085 292637 572939 293921 177549 409859
13601D09859j39825l6436A03892O8792J51721J61764B42160m5813L89858A78029
$$ 409859 270034 233598 103892 172684 324405 486169 242160 196347 586205 178029
13590C52158L61803j81457B34951L9166J490J18715A50645J35906J6216L3923
$$ 352158 713961 532504 234951 274117 275607 394322 150645 286551 302767 336690
13580C36690A66920J22930J44141j79073l8823K22435j08822q4830l3227M90958
$$ 336690 166920 289850 433991 254918 216095 438530 329708 244878 211651 702609
13570G02609r1682B07436L3969k1255L5817K6000j09028o7946O91433E7034L6130
$$ 702609 610927 207436 241405 220150 255967 281967 172939 104993 796426 57034 93164
13559I3164K11380j31504O5827j13731J60956K33715k38850c5033A91887m6464
$$ 93164 304544 173040 238867 125136 286092 519807 280957 -35033 191887 145423
13549A45423o5906L30723H4341K1258J97646A49351j1149K40813J70431j62405
$$ 145423 79517 410240 84341 105599 303245 149351 138202 379015 549446 387041
13539C87041O3088k14825E687L46446C2214J18285L25544K60946A84107K96955
$$ 387041 450129 235304 5687 352133 32214 150499 476043 736989 184107 481062
13529D81062j06748I8964J80922F3370J21380R9802J33967j55331j22735J28629
$$ 481062 374314 98964 279886 63370 184750 284552 418519 263188 140453 269082
13519B69082l2264j6544L9913J019K99964B50895O569C9982R1869K80700A36807
$$ 269082 236818 220274 260187 261206 561170 250895 257464 39982 131851 412551 136807
13507C92395L8843g7312D41168D1649J09431e7506E29810A63849R0268l9468m3227
$$ 392395 431238 -77312 441168 41649 151080 -57506 529810 163849 254117 214649 171422
13496A71422L3944J34563K4802N3322a12900D20990H4596P9524Q7218a65866D89016
$$ 171422 205366 339929 364731 418053 -112900 420990 84596 164120 251338 -165866 489016
13484A96593F351L04717p9108H3264M73671B27826K71511B38134N4388j17319
$$ 196593 6351 311068 231960 83264 556935 227826 499337 238134 292522 175203
13474A75203D9076J279N3463K41123o8096O783d8942A45306F0102j0710J75970
$$ 175203 49076 50355 103818 344941 276845 283628 -48942 145306 60102 49392 225362
13463B25362O6135Q2281C5091K96781O7698I9021C4349K99789o4245q9652J86829
$$ 225362 291497 373778 35091 331872 399570 99021 34349 334138 269893 180241 367070
13452C67070A47182J94910F4077J08240Q5885j12325O4305p1386L25381A03137
$$ 367070 147182 342092 64077 172317 258202 145877 210182 138796 464177 103137
13441E1075K67287a6605A23848Q4414M5223D2637M1922K06117J21824j28423m3513
$$ 51075 318362 -16605 123848 208262 253485 42637 84559 290676 412500 284077 240564
13430B40564I3787J60985K85305j27505k05392a8785k18945C56477r6892L08395
$$ 240564 93787 254772 540077 412572 207180 -18785 -237730 356477 259585 567980
13420E67980B31111p1646J82667H9460K60425b5528A92459F4015J81315q612Q8528
$$ 567980 231111 159465 342132 89460 349885 -25528 192459 64015 245330 236718 325246
13409C25246j55525m9016P3118J2391n0296J20161k4722P7375a76437B26875J2832
$$ 325246 169721 120705 193823 206214 155918 276079 251357 328732 -176437 226875 239707
13398B39707M248j5634O7179J7204q7610b3876C47281O4700A73483J98942j84668
$$ 239707 243955 228321 295500 312704 225094 -23876 347281 411981 173483 372425 187757
13387A87757P9604F8747d1945B09868J42977C6860J67170R7791A587J07733Q8516
$$ 187757 267361 68747 -41945 209868 352845 36860 204030 301821 1587 109320 197836
13376A97836q2017K90579j06785K26553k32274a70375A53434F1969M9635h6863
$$ 197836 115819 406398 299613 526166 293892 -170375 153434 61969 111604 -86863
13365B14302G3286c6150C90429p2016J12038j4309A50801K30860j12212E5499
$$ 214302 73286 -36150 390429 318413 430451 416142 150801 381661 269449 55499
13354B95647j04920A8785K0373K15746I7004Q2873K21708J58103A17947J1238
$$ 295647 190727 18785 39158 254904 97004 179877 401585 559688 117947 129185
13344A29185K60016r4113r6647R7253A16430K93021j61342G8057P5152j7968J3903
$$ 129185 389201 295088 198441 295694 116430 409451 248109 78057 153209 135241 149144
13333A49144k9659J46460K124m984M6943O1497J96986f797o6316C63903M2698
$$ 149144 119485 265945 268069 263085 310028 371525 568511 -6797 -73113 363903 406601
13322D06601e6171C28367p4051K62191I6458J24952o8266J22662m3103P2206J075
$$ 406601 -56171 328367 254316 516507 96458 221410 153144 275806 232703 304909 305984
13311C05984b6334K18B09597D1028Q7133n2052J31449L6543M3781F3263M8913
$$ 305984 -26334 -26116 209597 41028 128161 76109 207558 244101 287882 63263 112176
13300A12176R8309I5688K22107j30779a25493f0256I7746K28124C2905J90332
$$ 112176 210485 95688 317795 187016 -125493 -60256 97746 325870 32905 223237
13290B23237k8301H4328B9303K56691D3635O5085c6296C5353J99839O6109a10457
$$ 223237 194936 84328 29303 285994 43635 108720 -36296 35353 235192 301301 -110457
13278E17646k21857A7256L3243J01930D2996g052C49917a76053L0628B06696i0834
$$ 517646 295789 17256 50499 152429 42996 -7052 349917 -176053 -145425 206696 -90834
13266A09812Q1190J6618m9254P253J7727a05335B83151j17681q2257K83969j80706
$$ 109812 191002 207620 158366 165619 183346 -105335 283151 165470 83213 367182 186476
13255A86476b38447d9874o1276A19853l6468k1801K83802c8233A82307n2016B4997
$$ 186476 -238447 -49874 -111150 119853 83385 61584 345386 -38233 182307 130291 24997
13243B28330b7111k40738F21J07934R2042a4383C80283j34419b5702B94827g3628
$$ 228330 -27111 -267849 621 108555 200597 -14383 380283 245864 -25702 294827 -73628
13231F0785j8180K05313q0442a14825F183Q7527K45967K22274A18120b9440j80967
$$ 60785 42605 247918 167476 -114825 6183 93710 339677 561951 118120 -29440 -210407
13220b10407b387l1623D98745A00804K291j7689h4297G5855K34763k4605j30476
$$ -210407 -2387 -34010 498745 100804 103095 85406 -84297 75855 310618 286013 155537
13209A55537d7565A17612J37801I1665a16380A25935a38224A9928m238P1363d3973
$$ 155537 -47565 117612 255413 91665 -116380 125935 -138224 19928 15690 87053 -43973
13197F120a21762M5653C3906K00264A12131n2519c32200B39154o9020J25621B3605
$$ 6120 -121762 -76109 33906 234170 112131 59612 -332200 239154 170134 295755 23605
13185C3895R8970m3164J62390r5024b11983D6219a32931F8173C0465L05227j55691
$$ 33895 132865 89701 252091 157067 -211983 46219 -132931 68173 30465 335692 180001
13174A80001G9248J70947E6468J86467d3199F4684L35331j52224J39749A16602
$$ 180001 79248 250195 56468 242935 -43199 64684 400015 247791 387540 116602
13163f5633D7371J55319M166r7993L9180k4854c72163h2497I3195d7252n84I7394
$$ -65633 47371 202690 206856 108863 148043 123189 -372163 -82497 93195 -47252 -47836 97394
13150a90479C90850e8574A31895P8904q3107Q4177K21794a59574B78497J9394
$$ -190479 390850 -58574 131895 210799 127692 211869 433663 -159574 278497 297891
13140B97891j47676F1570J17968J2979H7364g6682A47256j8080c25006D7566a57835
$$ 297891 150215 61570 179538 192517 87364 -76682 147256 129176 -325006 47566 -157835
13128a77604A7917b58q279j01354b52j97172B03259P8120b2324H4655P8541H0183
$$ -177604 17917 -258 -8537 -109891 -252 -197424 203259 281379 -22324 84655 163196 80183
13115G3281J88232a73898B12238K7376b08962C09556m674C2307a5767p4365H9251
$$ 73281 261513 -173898 212238 239614 -208962 309556 304882 32307 -15767 -90132 89251
13103B32712D8059f184A98148j635g6576A26700k7699J58851i57A41431n8845
$$ 232712 48059 -6184 198148 196513 -76576 126700 99001 257852 -957 141431 82586
13092H2586J9201b5201A69279B1001L09173A57082N1662b7667B33165A160K40960
$$ 82586 101787 -25201 169279 21001 330174 157082 208744 -27667 233165 1160 242120
13081B42120A18176J18187D7064K1624N7918f0378j99647A39401e8599j42442
$$ 242120 118176 236363 47064 68688 126606 -60378 -260025 139401 -58599 -201041
13071b01041I6520K74169A48739B0248k098J44699b99992C68906a1350B43200
$$ -201041 96520 370689 148739 20248 18150 162849 -299992 368906 -11350 243200
13060H0407f9811j35229B7883J77456I1171d5328D43027j09027L5585d6805q0047
$$ 80407 -69811 -205040 27883 205339 91171 -45328 443027 334000 369585 -46805 -126852
13049a26852B20099I8435J75556a08544A71379n7923J72409D8984h300C66717
$$ -126852 220099 98435 273991 -108544 171379 113456 285865 48984 -8300 366717
13038a16592c8516G3517J76825c02957G2883l2210N1235J52626H0418J05633J07232
$$ -116592 -38516 73517 250342 -302957 72883 40673 91908 244534 80418 186051 293283
13027B93283b74308A42398F8141h7415C0162a20364E7163M5646n0800K21058c9475
$$ 293283 -274308 142398 68141 -87415 30162 -120364 57163 102809 52009 273067 -39475
13015F8591J34927Q4955Q5082A65328L90388b03044J0568A77819J01826i3691
$$ 68591 203518 288473 373555 165328 555716 -203044 -192476 177819 279645 -93691
13004I259O4401e5238A35028f152A81213J82629H6076o333j9714e0036F2366h7046
$$ 9259 73660 -55238 135028 -6152 181213 363842 86076 79743 60029 -50036 62366 -87046
12991A31283J77949j1843l6739b03659A39168m8047f205A80795R649b01432b8902
$$ 131283 309232 297389 260650 -203659 139168 91121 -6205 180795 190444 -201432 -28902
12979f3462r255A83042H7868m2173c71486G2306l5102Q7207A7218B07a44586F4829
$$ -63462 -72717 183042 87868 45695 -371486 72306 37204 124411 17218 207 -144586 64829
12966B9524f2615m4378B982L77009j67648G1212e0627B96249d5605b781o0510
$$ 29524 -62615 -106993 2982 379991 212343 71212 -50627 296249 -45605 -2781 -63291
12955f3291j04862A04207J77593b60707h5211R421k9490C18397a52350A42382
$$ -63291 -168153 104207 281800 -260707 -85211 -75790 -105280 318397 -152350 142382
12944b60712m9045d2782C5511a12715j93757J35067A88887f8919B27714j13451
$$ -260712 -309757 -42782 35511 -112715 -306472 -171405 188887 -68919 227714 114263
12934A14263K1189f0250B14898H143O9838e1519A86305E6844f9184E6454a0655
$$ 114263 135452 -60250 214898 8143 77981 -51519 186305 56844 -69184 56454 -10655
12922A45693f2234D1154J06731b93791D58490o5688A09862J0691a16313A59606
$$ 145693 -62234 41154 147885 -293791 458490 392802 109862 120553 -116313 159606
12911B04868r2212a50096o8982B38909k2844h4676c3522A01459b6530A55717D2570
$$ 204868 112656 -150096 -219078 238909 216065 -84676 -33522 101459 -26530 155717 42570
12899E1441F036J83294J44170h1975H8914l3377L12926r7986o3927n4533a469
$$ 51441 6036 189330 333500 -81975 88914 55537 368463 270477 206550 152017 -1469
12887a07073G2275K05433H4694b40141C12094c55759B07072Q4273I8047h2928
$$ -107073 72275 277708 84694 -240141 312094 -355759 207072 291345 98047 -82928
12876e9362A30602a02040k681j4796j22111K0778j35149A5912b4687G2394b9761
$$ -59362 130602 -102040 -104721 -119517 -241628 -220850 -355999 15912 -24687 72394 -29761
12864A29101b53818B74228J07054a33422D5641b10219A60322N9683a53502q8537
$$ 129101 -253818 274228 381282 -133422 45641 -210219 160322 220005 -153502 -242039
12854b42039A41445c16393I4870a50674A25805b01414h7639j85451A09561J30978
$$ -242039 141445 -316393 94870 -150674 125805 -201414 -87639 -273090 109561 240539
12844B40539d7865C5841f18m3314B6338N0632a32918B50147i6590o4582P260A1406
$$ 240539 -47865 35841 -618 -43932 26338 76970 -132918 250147 -96590 -161172 -153912 11406
12831G9031a03222H1180J01755b42828d9714l6778B31002k6262p1188b06757f7990
$$ 79031 -103222 81180 182935 -242828 -49714 -86492 231002 204740 133552 -206757 -67990
12819A35851j8375j1780N6253L06037a26682k67009A52719J1041A7240i9759B16251
$$ 135851 117476 105696 161949 467986 -126682 -393691 152719 163760 17240 -99759 216251
12807B22538j02733B7647b8567G2940M43409A87848b2197A12524f3165G6679d79045
$$ 222538 119805 27647 -28567 72940 516349 187848 -22197 112524 -63165 76679 -479045
12795i1871j87912c3330k8014B59107G2434i9984b7987m6730c0968q5512M5202
$$ -91871 -279783 -33330 -61344 259107 72434 -99984 -27987 -74717 -30968 -116480 -71278
12784g1278H432N1693a22411l566A12914b8065m6B56395n8512H5433a83221l3884
$$ -71278 8432 60125 -122411 -125977 112914 -28065 -28111 256395 197883 85433 -183221 -217105
12772b17105N4368O8824F6251a79767K1286K0249A25787K93925A49346p1730o900
$$ -217105 -162737 -93913 66251 -179767 -158481 -138232 125787 419712 149346 77616 70716
12761G0716a26182B84883j18731N3473b43751n6592F9857K08998b7097A82869
$$ 70716 -126182 284883 166152 219625 -243751 -300343 69857 278855 -27097 182869
12750g8587j02104O2675J0032H5620C6764h6904A73189e793r0548j65999d5393
$$ -78587 -180691 -118016 -107984 85620 36764 -86904 173189 -5793 -96341 -262340 -45393
12738A80136J29391H155Q3410L15692E3771J80045j12079m7813d8196B59348r1562
$$ 180136 309527 8155 91565 407257 53771 233816 121737 73924 -48196 259348 167786
12727A67786F0444b06788b9778r2995M5882F5447k7985a16422A53197L6099J69447
$$ 167786 60444 -206788 -29778 -122773 -76891 65447 37462 -116422 153197 189296 358743
12716C58743k3312H0255l007K00037e9384A39330a4779B64530L8723K54753B6886
$$ 358743 335431 80255 77248 277285 -59384 139330 -14779 264530 303253 558006 26886
12704D01862a05111C46376l8918C8857F300Q2231k1033d213A74015n9092O2430
$$ 401862 -105111 346376 307458 38857 6300 88531 67498 -4213 174015 114923 177353
12693A77353a08818i541F2882J9035C0649c2203D4613J57014N5698f8626A64671
$$ 177353 -108818 -9541 62882 81917 30649 -32203 44613 201627 257325 -68626 164671
12681A63519J39982A10535a72404C72446a98767A83027b7898C23483j55644H3736
$$ 163519 303501 110535 -172404 372446 -198767 183027 -27898 323483 167839 83736
12670A07816a91425A56567m0883P0191D7948a27589j3953B4152P8533i9885D8703
$$ 107816 -191425 156567 115684 185875 47948 -127589 -141542 24152 102685 -99885 48703
12658a34577p1093R9115J4038A42325o2189L52419B03960H0245h2828B50845I8577
$$ -134577 -205670 -106555 -92517 142325 80136 432555 203960 80245 -82828 250845 98577
12646g0744B80305a20356M1108C78848e9183j06062B97825h035B795a3523l11590
$$ -70744 280305 -120356 -79248 378848 -59183 -165245 297825 -8035 2795 -13523 -325113
12635c25113a61952B2573a34436C6118a05500C38356K0181r1406R5929j21971
$$ -325113 -161952 22573 -134436 36118 -105500 338356 358537 267131 363060 241089
12625B41089L92765G8855K6533J67488j22600o6531J66735c79175h3448C0778
$$ 241089 633854 78855 105388 272876 150276 83745 250480 -379175 -83448 30778
12614b25083f8570J2456k01745C2166K13315b08152A84165a81159e5273q7815
$$ -225083 -68570 -56114 -257859 32166 245481 -208152 184165 -181159 -55273 -143088
12604a43088L5109M8802B09834k7552J59190o9338M53j05005l1129k3115J31481
$$ -143088 -107979 -59177 209834 182282 341472 272134 272587 167582 136453 113338 244819
12593B44819b16891C46641c8132o5165A1255L0590Q2504a4530A84863a2650A53414
$$ 244819 -216891 346641 -38132 -103297 11255 41845 124349 -14530 184863 -12650 153414
12581I4001b83341A93711M0705i7117o3533I0929a12771A15663J7812k222j5909
$$ 94001 -283341 193711 234416 -97117 -160650 90929 -112771 115663 133475 131253 115344
12570A15344a3605A98394h0897H2963a92402j34352B67699a0714c40B32602b32121
$$ 115344 -13605 198394 -80897 82963 -192402 -326754 267699 -10714 -340 232602 -232121
12558b24436d905l18748A7444a42887A0138J65884p4791B561J93204H404f1034
$$ -224436 -4905 -323653 17444 -142887 10138 176022 101231 2561 195765 8404 -61034
12546d2169E6597a43959b7388g746j23742a1667q3830B07220b49818I5628b13588
$$ -42169 56597 -143959 -27388 -7746 -131488 -11667 -95497 207220 -249818 95628 -213588
12534a6582I6263j8561A3557K37436a86877B53953b3502C0266a33800A09348a37525
$$ -16582 96263 77702 13557 250993 -186877 253953 -23502 30266 -133800 109348 -137525
12522f2929B8328a67137C36294b38015N9289N9646N1237c1025A64665D1880L38905
$$ -62929 28328 -167137 336294 -238015 -178726 -119080 -67843 -31025 164665 41880 380785
12511C80785a06042j8310q218j04711b6262A45480h9386E7253J3665G681R693
$$ 380785 -106042 -124352 -132570 -237281 -26262 145480 -89386 57253 70918 7681 17374
12500A7374c9673B23787C6214A2668L9368J60876a20563b2515E3901b0796G1237
$$ 17374 -39673 223787 36214 12668 52036 212912 -120563 -22515 53901 -20796 71237
12488a16929A92228i6219j16687R9108i998F5739P7571r32K8522a5208A33227
$$ -116929 192228 -96219 -212906 -113798 -9998 65739 143310 142378 170900 -15208 133227
12476f1476j44669R0194K6181A23670m7152J0225e2592n9029A5682i3248I674
$$ -61476 -206145 -115951 -89770 123670 76518 86743 -52592 -111621 15682 -93248 9674
12464A99997K129I4695R7506I5345h9275r9483O9991l2419o5889A11057b07702
$$ 199997 202126 94695 192201 95345 -89275 -188758 -118767 -151186 -217075 111057 -207702
12452A03812K08568j27885a29432c0391B13726b4032k33744P4275o6692A73512
$$ 103812 312380 184495 -129432 -30391 213726 -24032 -257776 -183501 -250193 173512
12441B76875h7072A92894F4679f2923k9184D1642i0377A30986F0481a52332G8351
$$ 276875 -87072 192894 64679 -62923 -92107 41642 -90377 130986 60481 -152332 78351
12429D8493a74484j23763A06983J9780A238a77689D2290P5286J0276k9570L0745
$$ 48493 -174484 -298247 106983 126763 1238 -177689 42290 117576 127852 98282 129027
12418A29027i3631C87683a43820D721c7335F7768J61424A08923k5789C8159a73142
$$ 129027 -93631 387683 -143820 4721 -37335 67768 229192 108923 83134 38159 -173142
12406a11202B29036i7004a4776D65512i9572a6259P493H8567P8519J194Q4037
$$ -111202 229036 -97004 -14776 465512 -99572 -16259 -8766 88567 167086 168280 252317
12395B52317D804a32120E41262B17193d4582C14894e6577B78265a01717I979J3924
$$ 252317 4804 -132120 541262 217193 -44582 314894 -56577 278265 -101717 9979 23903
12384B3903K4623A8481a05580j51183D2508J3487K5451M2265P2729k4644b99493
$$ 23903 48526 18481 -105580 -256763 42508 55995 81446 123711 196440 171796 -299493
12372a52938k03793B47921a10470q2087F222Q1621e7938j6904B98951b88262F6070
$$ -152938 -356731 247921 -110470 -192557 6222 87843 -57938 -74842 298951 -288262 66070
12360f8830j97544e7279m3443p9446B01489P476a98683Q2900e5537I2362e5839
$$ -68830 -266374 -57279 -100722 -180168 201489 208965 -198683 -115783 -55537 92362 -55839
12348g0782j97431a11207d524C2438d6642n4117I0888K36926j46390d3644a2570
$$ -70782 -268213 -111207 -4524 32438 -46642 -100759 90888 327814 181424 -43644 -12570
12336b58210A11283C8282L14096a5594j36489A03112K0996A9617M1271a13149
$$ -258210 111283 38282 352378 -15594 -152083 103112 124108 19617 60888 -113149
12325A11107b27502A81204e7422p7669l35762b02699D95595b60360A61055K52900
$$ 111107 -227502 181204 -57422 -135091 -470853 -202699 495595 -260360 161055 413955
12315D13955j45310a92587A28805a51079B86293g1507A54074b8212A77388a28405
$$ 413955 268645 -192587 128805 -151079 286293 -71507 154074 -28212 177388 -128405
12304c5670B00415n8379m4290b60638A72572E0938J28479O942p6617D8117d9350
$$ -35670 200415 142036 97746 -260638 172572 50938 179417 186359 109742 48117 -49350
12292b6914B07448o1170c41791A65657o8089J12981I4106N4411b44280d4876A62810
$$ -26914 207448 146278 -341791 165657 97568 210549 94106 148517 -244280 -44876 162810
12280a46093j1357F0823j820L43556e5781k9560D10519J08682j34825E4597c0185
$$ -146093 -157450 60823 59003 402559 -55781 -85341 410519 519201 384376 54597 -30185
12268C14649A38002O4271E1316K59196p356O328e0438A09305a4757k2963A92667
$$ 314649 138002 202273 51316 310512 303156 309484 -50438 109305 -14757 -37720 192667
12256A71299K74598A79254c98079d6770B03055J27539N413m8611a6303A85670
$$ 171299 445897 179254 -398079 -46770 203055 330594 336007 287396 -16303 185670
12245B56062H5547b28964f9100K155A12598J26423k9670m038O1725N823h2899
$$ 256062 85547 -228964 -69100 -66945 112598 239021 209351 205313 267038 272861 -82899
12233B67583a97936C44088a29273A92477K09992A13247D9865d0936B05941J0745
$$ 267583 -197936 344088 -129273 192477 402469 113247 49865 -40936 205941 216686
12223B16686a363A24904K71088A04880J17876J58274j85399J72722O3538b03233
$$ 216686 -1363 124904 395992 104880 222756 381030 195631 368353 431891 -203233
12212A64946G3977K28096k0661J91541A48839D6180D461M5190J02934f6203F2114
$$ 164946 73977 302073 281412 472953 148839 46180 4461 49651 152585 -66203 62114
12200A6640J8604b59645B81883o8321A01962J59118J26418G7744J30539D2021
$$ 16640 35244 -259645 281883 213562 101962 261080 387498 77744 208283 42021
12189A90894a26513B25614L74148A41425N5011J74400A089N52404B02045f925
$$ 190894 -126513 225614 599762 141425 196436 370836 1089 553493 202045 -6925
12178E7978J94504B9245d500A03808J0882m0617P335c9572A07339a62860B60700
$$ 57978 252482 29245 -4500 103808 114690 74073 81408 -39572 107339 -162860 260700
12166D93411B44165J2814a68419O7542A48238b82672O4460k5795B58918c7524
$$ 493411 244165 256979 -168419 -100877 148238 -282672 -218212 -244007 258918 -37524
12155B02304b70829N033J29824C14544F3237A4931b07427B04835D9210J16521
$$ 202304 -270829 -265796 -135972 314544 63237 14931 -207427 204835 49210 165731
12145A65731b36431A03762c2020A39697a9811n1016A91761p5373b92404H3804
$$ 165731 -236431 103762 -32020 139697 -19811 -70827 191761 116388 -292404 83804
12134B1015J75189H6422Q1606G0285j287h133j82419B1924c087F1756g0877A01339
$$ 21015 196204 86422 168028 70285 68998 -8133 -190552 21924 -3087 61756 -70877 101339
12121A47594d2703m1368I8364N10072b45129B6612a20519n3851B9621e2260A683
$$ 147594 -42703 -84071 98364 608436 -245129 26612 -120519 -174370 29621 -52260 1683
12109B47793i3807H2544a74299e8220j62540A17273b42435i1257A22777J64415
$$ 247793 -93807 82544 -174299 -58220 -220760 117273 -242435 -91257 122777 287192
12099B87192a93714A60193b8210H5844a97359A42302N967e45680i82J60A28592
$$ 287192 -193714 160193 -28210 85844 -197359 142302 148269 -545680 -982 -822 128592
12087A93943d8972B58980E6211A0011Q3450a63185k6121A81637L87320K57625
$$ 193943 -48972 258980 56211 10011 93461 -163185 -189306 181637 568957 826582
12077H26582J434954l89256B00607J37120e8981K685A808M3197e2901A01876k6639
$$ 826582 2261536 1872280 200607 337727 -58981 -56296 1808 45005 -52901 101876 75237
12066G5237L45447j99886k1519C2314I512P8574a0219j30731c4059G639b18039
$$ 75237 420684 220798 199279 32314 9512 88086 -10219 -140950 -34059 7639 -218039
12054A70637a5575A62151A6455c7034k56015K1257c3030A3782J41924i0046k0450
$$ 170637 -15575 162151 16455 -37034 -293049 -271792 -33030 13782 155706 -90046 -110496
12043a10496c8887F2230J01072h9501A32508A6532O4088a80296C69671a59757
$$ -110496 -38887 62230 163302 -89501 132508 16532 80620 -180296 369671 -159757
12032b66679F0039k4808h4423A9695N9169e0930B73739A29144c6174C9868a34514
$$ -266679 60039 35231 -84423 19695 78864 -50930 273739 129144 -36174 39868 -134514
12020a63269k62921B83578A6011M308K17901k6922i824A89748a07820A7655b3522
$$ -163269 -426190 283578 16011 20319 238220 211298 -9824 189748 -107820 17655 -23522
12008H6220K37601I8410a34469b2771n9347j78699i7539B00143b5166a0621A969
$$ 86220 323821 98410 -134469 -22771 -82118 -260817 -97539 200143 -25166 -10621 1969
11996G8450J67464o3920o8026D3417N4264a58689j94932I811a25518D6832n156
$$ 78450 245914 181994 113968 43417 97681 -158689 -353621 9811 -125518 46832 41676
11985D1676a31993J4610N7415A93652b32504H0905K4362B6279M2759B0460e0448
$$ 41676 -131993 -117383 -59968 193652 -232504 80905 105267 26279 69038 20460 -50448
11973b14226P7192H4574J04737r3452j1515J06387e3653A01816b85048B76427
$$ -214226 -137034 84574 189311 95859 84344 190731 -53653 101816 -285048 276427
11962i1520k86510A38455b2899k70627a33836o1878B83631A11034N6740b68518
$$ -91520 -378030 138455 -22899 -293526 -133836 -195714 283631 111034 167774 -268518
11951A55121e723A81772o4225A2643J5332g1052C66134c6921j10794f8961C27759
$$ 155121 -5723 181772 117547 12643 27975 -71052 366134 -36921 -147715 -68961 327759
11939a47907A30918a8776j79470J5261N9355B39104g5585b9947C44011a15805
$$ -147907 130918 -18776 -198246 -182985 -123630 239104 -75585 -29947 344011 -115805
11928h3517F0767c1931B0395R1433g3319G2893b84317C27354a94680A00914b39365
$$ -83517 60767 -31931 20395 111828 -73319 72893 -284317 327354 -194680 100914 -239365
11916a07585A48999f2096n1699C03025a52233l5274K5163e2708A75759A0840c8510
$$ -107585 148999 -62096 -113795 303025 -152233 -187507 -162344 -52708 175759 10840 -38510
11904A5865a10184A31692b0935j23935f4035p4074A4716a52327l6833l6208A1825
$$ 15865 -110184 131692 -20935 -144870 -64035 -138109 14716 -152327 -189160 -225368 11825
11892c5339B17935h5859A53623b02853N5783A02421a41415j09653I8730b35421
$$ -35339 217935 -85859 153623 -202853 -147070 102421 -141415 -251068 98730 -235421
11881a06824G0330Q4737a1560G1458O1074J4444C6988J37079L5662f2222E0360
$$ -106824 70330 155067 -11560 71458 132532 146976 36988 174067 209729 -62222 50360
11869a53108F8847B5939M3052J28887g554j43816j39850B0939b16934h2047j98846
$$ -153108 68847 25939 68991 197878 -7554 -151370 -291220 20939 -216934 -82047 -280893
11858b80893h7149q2007B78484c3090B29462g268A64888p9905h5272l2234c0273
$$ -280893 -87149 -169156 278484 -33090 229462 -7268 164888 84983 -85272 -117506 -30273
11846c88361R7524J08658B71943j1975j21660e7532B71676f1475r3036E2574a15807
$$ -388361 -290837 -182179 271943 259968 138308 -57532 271676 -61475 -154511 52574 -115807
11834b66848A06088l0066b77293I2860E595J71922b08384g5790o2709j00157a4059
$$ -266848 106088 76022 -277293 92860 5595 177517 -208384 -75790 -138499 -238656 -14059
11822d090F1934c04650i5135M5056A51882B9410a90010H5761b02273j72627B67475
$$ -4090 61934 -304650 -95135 -50079 151882 29410 -190010 85761 -202273 -374900 267475
11810c0076n8714j35743a04911I9315b11660B3791J44606b14889b7207A79725
$$ -30076 -88790 -224533 -104911 99315 -211660 23791 168397 -214889 -27207 179725
11799a00818B1052b47617F0482F881J10404I302c81676G6110p910B3943O4963
$$ -100818 21052 -247617 60482 6881 117285 9302 -381676 76110 68200 23943 88906
11788H8906b10996E1324A6856i1401j36287d923B59401a11172H2926c3430j32933
$$ 88906 -210996 51324 16856 -91401 -227688 -4923 259401 -111172 82926 -33430 -166363
11777a66363A30367b69200A10830m3738b38330J07112O0360n642A42529c9633
$$ -166363 130367 -269200 110830 67092 -238330 -131218 -70858 -76500 142529 -39633
11766a62760j1734A20619n2746e9774k47059J52169H6806b4k3252p2786p5886
$$ -162760 -174494 120619 67873 -59774 -306833 -154664 86806 -24 -23276 -96062 -171948
11755a71948j57220G3418h9210a9020n9185A10035a37998A88510H9840a6086H9027
$$ -171948 -329168 73418 -89210 -19020 -78205 110035 -137998 188510 89840 -16086 89027
11743b52160A42948a88211e6109r2153E333a01495B70525A1763K0590q087b02038
$$ -252160 142948 -188211 -56109 -148262 5333 -101495 270525 11763 32353 24266 -202038
11731g7008k1734c4386k54812A42452f2937m4562j56043B95178a91207A92196
$$ -77008 -98742 -34386 -289198 142452 -62937 -107499 -263542 295178 -191207 192196
11720A04949P1841c2807k60926D9877a52484j14559B7505b03270B545b2947A21524
$$ 104949 176790 -32807 -293733 49877 -152484 -267043 27505 -203270 2545 -22947 121524
11708B82666q9605a83772A80921o9128k0324K1122M1713c3064j65710n5180F7955
$$ 282666 193061 -183772 180921 111793 91469 112591 154304 -33064 -198774 -253954 67955
11696B09616f8007j49491A04099B7485e0089E4109d5791F1810h3885j20730B8371
$$ 209616 -68007 -217498 104099 27485 -50089 54109 -45791 61810 -83885 -204615 28371
11684C00773b654A53986R2363K6762D7894O9267f618E0108J25970m0295J12082
$$ 300773 -2654 153986 246349 273111 47894 117161 -6618 50108 176078 135783 247865
11673B47865E1422P8781c315j06039C24529e4369B79711a22360b4335C09153A19368
$$ 247865 51422 130203 -3315 -109354 324529 -54369 279711 -122360 -24335 309153 119368
11661C72858j79467l0178c0517j29902a4761D54227c28269C09255C8502J09402
$$ 372858 193391 163213 -30517 -160419 -14761 454227 -328269 309255 38502 147904
11651A47904K2591O0401l9379J91183a37547B221a84163A9806g6176A6897a08323
$$ 147904 170495 230896 191517 382700 -137547 2221 -184163 19806 -76176 16897 -108323
11639A51780L9148H3254b1857n3141j0464G6309O484J09220O8165a2730E7705
$$ 151780 190928 83254 -21857 -74998 -85462 76309 82793 192013 260178 -12730 57705
11627c61136C14293a00414d7149p8735B15950L5708p3608J6448J22818r1767I2195
$$ -361136 314293 -100414 -47149 -125884 215950 251658 178050 194498 317316 225549 92195
11615a64508C14043A4563g436j37519j76044M4989f0425k34719A06817D6696A9952
$$ -164508 314043 14563 -7436 -144955 -320999 -276010 -60425 -295144 106817 46696 19952
11603f9496M551D2885k0045Q5664K1567B5008n571d5119d368A23485m7052a56392
$$ -69496 -64945 42885 22840 108504 130071 25008 19437 -45119 -4368 123485 76433 -156392
11590C07163a24155A1309J62822p179J34866b043C03764g7817C13641a34169d9053
$$ 307163 -124155 11309 174131 166952 301818 -2043 303764 -77817 313641 -134169 -49053
11578g422A87322E0087a6999k48422d7882e794r9515r2526d6357B19662p6295
$$ -7422 187322 50087 -16999 -265421 -47882 -5794 -105309 -197835 -46357 219662 143367
11567A43367a67884F9856L5331E0872K0913b4650C335J76172o8673E1452A3799
$$ 143367 -167884 69856 105187 50872 71785 -24650 3335 179507 110834 51452 13799
11555B0445J75501a61404A53438p0782b8534p180E5003K35028a84971j3524a1347
$$ 20445 195946 -161404 153438 82656 -28534 -35714 55003 290031 -184971 -198495 -11347
11543A49707K66034a90105B46058a3236m7660A85691D1162J60222l9589J8689
$$ 149707 415741 -190105 246058 -13236 -60896 185691 41162 201384 161795 180484
11533A80484q7349K48011j52396q1898D3452M829G865J52163A6657J2359a16369
$$ 180484 93135 341146 188750 106852 43452 48281 7865 160028 16657 29016 -116369
11521a49830C2876J51336a03976j64448A56165A1603K44312a7964C56975A27405
$$ -149830 32876 184212 -103976 -268424 156165 11603 255915 -17964 356975 127405
11510A96441J59509d4446q9156A34939F206J88047O9614h6690B41725P1598D405
$$ 196441 355950 -44446 -133602 134939 6206 194253 263867 -86690 241725 313323 4405
11498C5452A1074a60586A99343b32321B38198C0370J26626J79320a9285A91899
$$ 35452 11074 -160586 199343 -232321 238198 30370 156996 336316 -19285 191899
11487G0577K45811E0217J206J02756L37404A98519K49962B13268K34895B21032
$$ 70577 316388 50217 51423 154179 491583 198519 448481 213268 448163 221032
11476A38072a70197C68426j80834l5956Q8586h3831A82058n3990L98533A26126
$$ 138072 -170197 368426 187592 151636 240222 -83831 182058 128068 526601 126126
11465D4774K86518A41564J31033A15798J12449K01183A56873n159B0305K7285
$$ 44774 331292 141564 272597 115798 228247 429430 156873 151714 20305 47590
11455D7590h1096b8538p263A18588K55763H3678C9339b6126k15367a16070L7619
$$ 47590 -81096 -28538 -35801 118588 374351 83678 39339 -26126 -241493 -116070 -78451
11444g8451C71063J9959a11313C69863I1580m0278J00466E6937a06984B35965
$$ -78451 371063 391022 -111313 369863 91580 51302 151768 56937 -106984 235965
11433C31895a76736A8339a24896A46630a25797J1507B02826P1190A02362I303
$$ 331895 -176736 18339 -124896 146630 -125797 -114290 202826 274016 102362 9303
11422b63865I2305h8056D0806N3539E875K32068b90138g5672C46236a24868a688
$$ -263865 92305 -88056 40806 94345 5875 237943 -290138 -75672 346236 -124868 -1688
11410B44906b9222l351C1248K5747L0872a94833R0115A17000a6498k2499C10933
$$ 244906 -29222 -32573 31248 56995 87867 -194833 -104718 117000 -16498 -38997 310933
11398A68501I785K3625K46438i5451K032j47A37988C4908n096J35620a69631K4404
$$ 168501 9785 33410 279848 -95451 -93419 -93566 137988 34908 29812 165432 -169631 -145227
11386a45227d3371A233K8505J04870c3408j55731C03476j3830a84484A90356c0172
$$ -145227 -43371 1233 29738 134608 -33408 -189139 303476 289646 -184484 190356 -30172
11374B39160K1452a27632g211E1095J19987a34212A68780a90346L227A73875F6143
$$ 239160 260612 -127632 -7211 51095 171082 -134212 168780 -190346 -187119 173875 66143
11362b58203B15476b1621P379k31727A7148J20423m291b1225E1144b2351j01436
$$ -258203 215476 -21621 -14242 -245969 17148 137571 133280 -21225 51144 -22351 -123787
11351a23787A09573m7429b75876a27833M5504B57221a70335r9037B55860H8545
$$ -123787 109573 62144 -275876 -127833 -82329 257221 -170335 -269372 255860 88545
11340A80176G7799a19095H4598d4521A42516i1395j08790h5820A3052c34780a34581
$$ 180176 77799 -119095 84598 -44521 142516 -91395 -200185 -85820 13052 -334780 -134581
11328A28519c6062a71F3177K20520a48532K0832D8144k1769b14756K1751k01284
$$ 128519 -36062 -171 63177 283697 -148532 -127700 48144 26375 -214756 -193005 -394289
11317c94289F9285h6677j88466P8618E5315c9961B6676c38992h3688E9344a01215
$$ -394289 69285 -86677 -275143 -196525 55315 -39961 26676 -338992 -83688 59344 -101215
11305B7747a07551l2133A60939M0566a42721a7626B84714f8655k04152a32245
$$ 27747 -107551 -139684 160939 201505 -142721 -17626 284714 -68655 -272807 -132245
11294b64690d9967B99562j08041b06502c6324l64744i7518m8267l2881P7112P074
$$ -264690 -49967 299562 191521 -206502 -36324 -401068 -97518 -145785 -178666 -101554 -94480
11283i4480A21169b8385q047j71779J7023c7131k39183A9989J65305a36158g053
$$ -94480 121169 -28385 -36432 -208211 -191188 -37131 -276314 19989 185294 -136158 -7053
11271c1299A71037b0843j50905m4865G0246b86019g8432H3100k6941j6638b76472
$$ -31299 171037 -20843 -171748 -216613 70246 -286019 -78432 83100 56159 39521 -276472
11259d7668i809p0947A92115h5352j12810H8842c10518a22555N0282r6722J929
$$ -47668 -9809 -80756 192115 -85352 -198162 88842 -310518 -122555 -72273 -168995 -167066
11248a67066k836F7697b427E3154d2875F1170L37764A01917g0154j38081A30648
$$ -167066 -169902 67697 -2427 53154 -42875 61170 398934 101917 -70154 -208235 130648
11236B50548j12537a32653l95578a75052K0510B77114D7104A8548b41589A86510
$$ 250548 138011 -132653 -528231 -175052 -154542 277114 47104 18548 -241589 186510
11225a40671f1360j53528A2342g7516j78777O0337F8432a95681E4163B4585b57047
$$ -140671 -61360 -214888 12342 -77516 -256293 -195956 68432 -195681 54163 24585 -257047
11213C3845P7985l9869b92441a33011d6960r4016A39985m6910b10764Q3686b9193
$$ 33845 111830 71961 -292441 -133011 -46960 -140976 139985 93075 -210764 -127078 -29193
11201C4146c21113B40283j10280D8421N4257B251a40939h58B80396j07918b6471
$$ 34146 -321113 240283 130003 48421 102678 2251 -140939 -858 280396 172478 -26471
11189a58533m1903d3507B62000d23515J53021H5632d08689G8648a74475A41204
$$ -158533 -200436 -43507 262000 -423515 -270494 85632 -408689 78648 -174475 141204
11178b18890J02213j42498G8220b09579A00495J8643D7901B1910h9536m9544r484
$$ -218890 -116677 -259175 78220 -209579 100495 119138 47901 21910 -89536 -139080 -148564
11167a48564j07674i3995M6631H6319P0728e5461j01967e653A37889l7133C8680
$$ -148564 -256238 -93995 -47364 86319 157047 -55461 -157428 -5653 137889 100756 38680
11155b16156O0437B9211e4159A37107a35042H2545c3468C7701J18163k7223B1245
$$ -216156 -155719 29211 -54159 137107 -135042 82545 -33468 37701 155864 128641 21245
11143B34649b15737a06698j12660g4958D2104b13432A1112M5096J62597n0663
$$ 234649 -215737 -106698 -219358 -74958 42104 -213432 11112 56208 218805 168142
11133A68142G2470f6704B51025J23611a87663f25C29271a58119i521B318g7347
$$ 168142 72470 -66704 251025 374636 -187663 -625 329271 -158119 -9521 2318 -77347
11121C9930K48582a5322C84076I6988J46240P871j16490C1688a30974j26333R1060
$$ 39930 288512 -15322 384076 96988 243228 251099 134609 31688 -130974 -257307 -166247
11110a66247G6947L8254f5720G4428l6652K10030q5410i8579B2949M2747J13850
$$ -166247 76947 115201 -65720 74428 37776 247806 162396 -98579 22949 65696 179546
11099A79546L47727E6434K05461H8092d8774j65016A90397G9180K35034A25157
$$ 179546 527273 56434 261895 88092 -48774 -213790 190397 79180 314214 125157
11088C20677K7920b3749B10787G3284L49820f4933D20460A84442c6129A91231
$$ 320677 348597 -23749 210787 73284 423104 -64933 420460 184442 -36129 191231
11077A35360J43323J09299G9775C5598N37315f8793C81100A44643K38434N3085
$$ 135360 278683 387982 79775 35598 572913 -68793 381100 144643 383077 436162
11067D36162j49859N0282J77793k33629J18633J65743P7320A94255M99901k12327
$$ 436162 286303 336585 514378 280749 399382 565125 642445 194255 694156 481829
11057D81829k911J27760k8115J64363A19979M16277K65167j25091J40461M4856
$$ 481829 478918 606678 578563 742926 119979 536256 801423 676332 816793 861649
11047H61649k7832p8586o3386K03346k31462J28509B80471L83558O4414J62957
$$ 861649 833817 755231 691845 895191 663729 792238 280471 664029 728443 891400
11037H91400j03321R996j9509q6469J7072K1461p6944o434J0982P603J29798l9627
$$ 891400 788079 798075 778566 692097 709169 730630 653686 647252 658234 665837 795635 756008
11025G56008j01219k31348M43127N7170k07783C24501K32440k44694M61560C74048
$$ 756008 654789 423441 866568 923738 715955 324501 556941 312247 773807 374048
11014C28946M43345l08772J68976n4587m342p0199J09017j1911K62631k69737
$$ 328946 772291 463519 632495 577908 573566 503367 612384 600473 863104 593367
11004E93367j13668J13738k03162L30670k77829L21406l37556L22977P2272C48668
$$ 593367 479699 593437 390275 720945 443116 764522 426966 749943 822215 348668
10993F96984R138k74372L46406j78137J55885J7211j30403K08185k01585L04980
$$ 696984 706122 431750 778156 600019 755904 773115 642712 850897 649312 954292
10983I54292J67748j61586O47660m68737J96948J22932k81303R36024j76649L18530
$$ 954292 1122040 960454 1608114 1139377 1336325 1459257 1177954 2113978 1937329 2255859
10973B255859L24561o9482J53685l5219j74380j42141k32400k81757J2232q6366
$$ 2255859 2580420 2510938 2664623 2629404 2455024 2312883 2080483 1798726 1810958 1724592
10963A724592K6607M1475J52326j90592j77086L17457P8847k17719J11417k55286
$$ 1724592 1751199 1792674 1945000 1754408 1577322 1894779 1973626 1755907 1867324 1612038
10953A612038k41485J30074k73622m4263r1496D92488K88049B74939J39662A86021
$$ 1612038 1370553 1500627 1227005 1182742 1091246 492488 780537 274939 414601 186021
10942D19328j22181R957j35934j6723L19889G0747O5569R2459L540p5447K4824
$$ 419328 297147 307104 171170 154447 474336 70747 136316 228775 232315 156868 181692
10931A81692A9742P1607a29156d2492F3467J90592K6387b02583B61398q5777a12196
$$ 181692 19742 91349 -129156 -42492 63467 254059 280446 -202583 261398 175621 -112196
10919H7345J66138F9993e7147o1926G6179a49735m4953M5197p0893l0570i2301
$$ 87345 253483 69993 -57147 -119073 76179 -149735 -194688 -149491 -220384 -250954 -92301
10907H0092J47229R4523o8824b9306k3273H7280B9423a44814H6494J66042d3617
$$ 80092 227321 321844 253020 -29306 -52579 87280 29423 -144814 86494 252536 -43617
10895C23888a30299a8869A23502b41124A39548a21292B4526M7229b01883j09210
$$ 323888 -130299 -18869 123502 -241124 139548 -121292 24526 71755 -201883 -311093
10885c11093A91543a04979q6781c0687A21525P7472J7553f1665H3639a59837A34313
$$ -311093 191543 -104979 -191760 -30687 121525 198997 216550 -61665 83639 -159837 134313
10873a36884G5762J8360L23967e1426A34642c33734B05835c8536C4487b02159
$$ -136884 75762 94122 418089 -51426 134642 -333734 205835 -38536 34487 -202159
10862C3906A4180a28203C39643m5024j06287b5812C80566j54234b14756A10122
$$ 33906 14180 -128203 339643 294619 188332 -25812 380566 226332 -214756 110122
10851E7181h3893l1865p36j51403o4816A39598B4192J36048D3354O4239j7568
$$ 57181 -83893 -115758 -116494 -267897 -332713 139598 24192 160240 43354 107593 90025
10840I0025l1321J06714a71134D8751N8005D3513f5093A8986a20612J7807n3472
$$ 90025 58704 165418 -171134 48751 106756 43513 -65093 18986 -120612 -102805 -156277
10829a56277B49556B6965J14983d9805K2510A10746L1992c30131J42056j7375
$$ -156277 249556 26965 141948 -49805 -27295 110746 142738 -330131 -188075 -205450
10819b05450h1556j46698D7599b77936r9175C955K8359N9890J2414K8366a71988
$$ -205450 -81556 -228254 47599 -277936 -377111 3955 32314 92204 104618 132984 -171988
10807C75800j40036h1834P536j5758K6316G7132a98322m3500B22991b64693c4724
$$ 375800 235764 -81834 -74298 -90056 -63740 77132 -198322 -241822 222991 -264693 -34724
10795a66160g5620J9838m282k44511A29676i7586M7920n1543A46890a64304A57442
$$ -166160 -75620 -55782 -60064 -304575 129676 -97586 -49666 -101209 146890 -164304 157442
10783A24849C0127L8802B3180p615b69251a1939j31612j62774a05711n6824P8237
$$ 124849 30127 68929 23180 15565 -269251 -11939 -143551 -306325 -105711 -162535 -84298
10772h4298L6112B00756B8222b8590r3725m171j25160J22932A42332b70716B33683
$$ -84298 -48186 200756 28222 -28590 -122315 -126486 -251646 -128714 142332 -270716 233683
10760I6852b88615A34660C6342a0411o0548a4082B57044c6012J3441n2444m9967
$$ 96852 -288615 134660 36342 -10411 -70959 -14082 257044 -36012 -22571 -75015 -124982
10749a24982A86232b67340c463n7970B14877I5415D0902J2895o595f2237K117
$$ -124982 186232 -267340 -3463 -61433 214877 95415 40902 53797 47202 -62237 -60120
10738f0120r633A19132O8021d2360A48758a2900j15334j75115A11969f8106A98791
$$ -60120 -69753 119132 187153 -42360 148758 -12900 -128234 -303349 111969 -68106 198791
10726a0523D0500a39983f5047j45304j8269M034K9679H9604a44634o1522a5237
$$ -10523 40500 -139983 -65047 -210351 -228620 -224586 -194907 89604 -144634 -206156 -15237
10714A93945h5545j21701D4386L7634K3139D4737i9387c5405l2702k8460B4608
$$ 193945 -85545 -207246 44386 82020 105159 44737 -99387 -35405 -68107 -96567 24608
10702a87219A41422a96840B53936a79092o7452d1593q818H0254B7240K699e8340
$$ -187219 141422 -196840 253936 -179092 -246544 -41593 -50411 80254 27240 29939 -58340
10690A1152b25741j16053h6555H8494P4656E0585e2282j48466j083L9460H501
$$ 11152 -225741 -341794 -86555 88494 163150 50585 -52282 -200748 -201831 -162371 8501
10678a48899k67916a44255d3985j44615G3433K11125b4837A86512a7108j84424
$$ -148899 -416815 -144255 -43985 -188600 73433 284558 -24837 186512 -17108 -201532
10668b01532D1880C730d5599g753A61228a12621j36169M8370F9978f4525j0910
$$ -201532 41880 3730 -45599 -7753 161228 -112621 -248790 -200420 69978 -64525 -75435
10657g5435j61882A57201d99471J84993e9019J5903A83424L71732A60383L4016
$$ -75435 -237317 157201 -499471 -314478 -59019 -43116 183424 555156 160383 194399
10647A94399n9859a59912A04579c4216N491l2742C14793h7410A19091J30554a70307
$$ 194399 134540 -159912 104579 -34216 -28725 -61467 314793 -87410 119091 249645 -170307
10635B313c87122A06192L3405C9194K10546b38101L9023i4866M0649A0476K57744
$$ 2313 -387122 106192 139597 39194 249740 -238101 -199078 -94866 -54217 10476 268220
10624B68220a37028B2913b83004I5862A7282g558m9565A25381J04561a09988b6660
$$ 268220 -137028 22913 -283004 95862 17282 -7558 -57123 125381 229942 -109988 -26660
10612A60744m3742a35926c3586j45450L154D04075j75878b9504l6436K8804l61241
$$ 160744 117002 -135926 -33586 -179036 -175882 404075 228197 -29504 -65940 -37136 -398377
10601c98377A85119a53712M282j41527A19306h2141j78895L3164b6531D6978i5369
$$ -398377 185119 -153712 -149430 -290957 119306 -82141 -261036 -227872 -26531 46978 -95369
10589a16773k2479q67j10621A37689h6040E7395J00043M8464a20915B47559a40643
$$ -116773 -139252 -140119 -250740 137689 -86040 57395 157438 205902 -120915 247559 -140643
10577A8900d54674a22157r9129b4141A38341g0462E0540a57835A75587b02878
$$ 18900 -454674 -122157 -221286 -24141 138341 -70462 50540 -157835 175587 -202878
10566b43583R3759c5722C91555c7357j61158f7223E142g5379A25729a41726A47290
$$ -243583 -149824 -35722 391555 -37357 -198515 -67223 5142 -75379 125729 -141726 147290
10554B1382b01463R4077j3585C6109I29N0361b34832N1165r1065c1243A43482
$$ 21382 -201463 -107386 -120971 36109 929 51290 -234832 -183667 -274732 -31243 143482
10542A62687o0447J16874H9365f9514n514A0660d3220l5033A3870a6379j06018
$$ 162687 102240 219114 89365 -69514 -75028 10660 -43220 -78253 13870 -16379 -122397
10531a22397n029f2699b9848B7837g4421J673C54394h0563A84883G8064h1937
$$ -122397 -127426 -62699 -29848 27837 -74421 -72748 354394 -80563 184883 78064 -81937
10519I7053E780b4544m63336a29867q5690J6529I2378J0875R951f0372B39143
$$ 97053 5780 -24544 -487880 -129867 -215557 -199028 92378 103253 113204 -60372 239143
10507A0687h4763A11778j9074g9702A00295D2138L25483D182J41919D5486A7553
$$ 10687 -84763 111778 92704 -79702 100295 42138 367621 4182 146101 45486 17553
10495c43824A29349B266d6789J6261B19038g0644g414r2049O118J8278A4106K82832
$$ -343824 129349 2266 -46789 -30528 219038 -70644 -7414 -99463 -93345 -75067 14106 296938
10483B96938H0756C0638L43951l7919K68172k62079q4419e7973A41007n3565M19556
$$ 296938 80756 30638 374589 336670 604842 342763 258344 -57973 141007 87442 506998
10472E06998F4440L17921c01186B70677D1787c1848o2978f174A9975J30627a03005
$$ 506998 64440 382361 -301186 270677 41787 -31848 -94826 -6174 19975 150602 -103005
10460A08237g8519A21239P0954l3935b68752i870k96884B62394A00614i2737m2395
$$ 108237 -78519 121239 192193 158258 -268752 -9870 -306754 262394 100614 -92737 -135132
10449a35132f4906B3750c8503G089K97432g4586A55912a7684B96034b30376b0641
$$ -135132 -64906 23750 -38503 7089 304521 -74586 155912 -17684 296034 -230376 -20641
10437a96000L2674I5389J83932E2915b60857P2315C7623P7821a29700d1565k2683
$$ -196000 -163326 95389 279321 52915 -260857 -188542 37623 115444 -129700 -41565 -64248
10426f4248q2757a6672A11816c4722H3335a94205A34003J3463Q2450a03997j75634
$$ -64248 -147005 -16672 111816 -34722 83335 -194205 134003 147466 229916 -103997 -279631
10415b79631M5724a04224M2880M251A56261o2775b03783a1034j85780d8234A42123
$$ -279631 -233907 -104224 -61344 -57093 156261 93486 -203783 -11034 -196814 -48234 142123
10403F8699K08169j275A20986O619a35301K3192j45299r0886A75580O9513h6793
$$ 68699 276868 275593 120986 127605 -135301 -112109 -257408 -348294 175580 245093 -86793
10391C15480j11926n5258P4264A5148a40706F7016Q0749i5313A75516K10088l2631
$$ 315480 203554 148296 222560 15148 -140706 67016 147765 -95313 175516 385604 352973
10380C52973K5427d629A12631h7427A07126K3869f9280B18314K28978p4641m4994
$$ 352973 378400 -4629 112631 -87427 107126 130995 -69280 218314 447292 372651 327657
10369C27657J0006J40982j40033R4726j0689m0307L3501A57407j1674Q4935l9841
$$ 327657 337663 478645 338612 433338 422649 382342 415843 157407 145733 230668 190827
10358A90827Q9859D5786K03584A02656l1025J98764K75100N472o0220j6412j45390
$$ 190827 280686 45786 249370 102656 71631 270395 545495 550967 490747 474335 328945
10347C28945F3296K00195n2840J99152p113j04741j20851K59764A71516C3722
$$ 328945 63296 263491 210651 409803 402690 297949 177098 436862 171516 33722
10336C44523d216B28134p3993K7833P0184g4107A42842g3146B28543J26192G6897
$$ 344523 -4216 228134 154141 181974 252158 -74107 142842 -73146 228543 354735 76897
10324a57309B69077n640A18605J01111d1262D619J05188B6218J57201J53083g3426
$$ -157309 269077 263437 118605 219716 -41262 4619 109807 26218 183419 336502 -73426
10312E7999b76001B086c46311j38617G7229a99210a5476o1277a9073E1593k0516
$$ 57999 -276001 2086 -346311 -484928 77229 -199210 -15476 -76753 -19073 51593 31077
10301C1077L3509o258a94166A60553C3924J58156b25197h385k11407g8946K2156
$$ 31077 64586 58328 -194166 160553 33924 192080 -225197 -8385 -219792 -78946 -56790
10290e6790n2777O01F8307b36918J1409Q1985L884A0231a11007B41923c2216A865
$$ -56790 -109567 -108966 68307 -236918 -225509 -143524 -139640 10231 -111007 241923 -32216 1865
10277a33424B78091f4124r7949d8744E8839J82423l1435J72993a88380A91530
$$ -133424 278091 -64124 -162073 -48744 58839 241262 209827 382820 -188380 191530
10266A03841a85662d4902C41728E7892L06461e6101A42978L98092M7236k09229
$$ 103841 -185662 -44902 341728 57892 364353 -56101 142978 541070 588306 379077
10256C79077q255A58871f8939A24233N964J47267a55042H0194b17237B0920b19686
$$ 379077 370822 158871 -68939 124233 130197 277464 -155042 80194 -217237 20920 -219686
10244a42930A26915J09639N4004c91575a13183C0493d71853B0936b21731a03117
$$ -142930 126915 236554 290558 -391575 -113183 30493 -471853 20936 -221731 -103117
10233b12226B19150n9147D2908J99611C5849a30760e53l3713A95401q4853C9140
$$ -212226 219150 160003 42908 242519 35849 -130760 -553 -34266 195401 110548 39140
10221b90511B07557a8713n4471A40944C0216K17884A432M9492K83039j60887i5333
$$ -290511 207557 -18713 -73184 140944 30216 248100 1432 50924 333963 173076 -95333
10209a23389N7325A61697l3168a76889P9517j92929a15557A43357H28f5795q43
$$ -123389 -66064 161697 128529 -176889 -97372 -290301 -115557 143357 828 -65795 -66638
10198f6638A09898l2748K16155d04072A17242i2844k49174f14j02749m9338b9770
$$ -66638 109898 77150 293305 -404072 117242 -92844 -342018 -614 -103363 -152701 -29770
10186a04781j58550J21618A41610A8792n986a56634p8583M5367d8500G2828J63267
$$ -104781 -263331 -141713 141610 18792 12806 -156634 -235217 -189850 -48500 72828 236095
10175B36095g6097n3937j48614B15151o4772b97034j66191B5078b97959a36440
$$ 236095 -76097 -130034 -278648 215151 150379 -297034 -463225 25078 -297959 -136440
10164b03038H4688e3120j87492L7885L8335D4394e41p6848A83647q3012b1626
$$ -203038 84688 -53120 -240612 -202727 -164392 44394 -541 -77389 183647 100635 -21626
10152A13212c13527G6782a5820r4653K2868i517n1309A33486A2133P2856o693
$$ 113212 -313527 76782 -15820 -110473 -87605 -9517 -60826 133486 12133 84989 78296
10141G8296c32760J06458O4770K5714F6742b89168J01166A69195J99342c08596
$$ 78296 -332760 -226302 -161532 -135818 66742 -289168 -188002 169195 368537 -308596
10130A31542b16703c6488j31771C81346b20271c9627k48804g5573b6071D7098
$$ 131542 -216703 -36488 -168259 381346 -220271 -39627 -288431 -75573 -26071 47098
10119A57341i1488d5187k2246j32191c0064B7786a25987A52389C3348N8674a97479
$$ 157341 -91488 -45187 -67433 -199624 -30064 27786 -125987 152389 33348 92022 -197479
10107e05001b10680N7482A93955g13j71153E0730J14806b48381N5684n1335C15871
$$ -505001 -210680 -153198 193955 -713 -171866 50730 165536 -248381 -192697 -244032 315871
10095a15551F1348b23318A48531a31240J6577c6781k00075A71223b62364g6860
$$ -115551 61348 -223318 148531 -131240 -114663 -36781 -236856 171223 -262364 -76860
10084b89160K7476B66466g1643b3377j5482j60651b5718j06571j76673d1452l68439
$$ -289160 -261684 266466 -71643 -23377 -38859 -199510 -25718 -132289 -308962 -41452 -409891
10073d09891e11j37318J8946j45289B19389J35162b2103j6542j50832h6587j24976
$$ -409891 -511 -137829 -118883 -264172 219389 354551 -22103 -38645 -189477 -86587 -211563
10062b11563A85121b9150A73142b02803b5807k18204L0741f5769k00075I501h0088
$$ -211563 185121 -29150 173142 -202803 -25807 -244011 -213270 -65769 -265844 9501 -80088
10050a77708r6173J29976p4571D1431b44849D0528a89584b5469I4406N0137h5897
$$ -177708 -273881 -143905 -218476 41431 -244849 40528 -189584 -25469 94406 144543 -85897
10038B83275a28856p4905L2705M5194B52314a44914n0711L2911j63978g6956I5045
$$ 283275 -128856 -203761 -171056 -125862 252314 -144914 -195625 -162714 -326692 -76956 95045
10026A844f5323b5627G0362c4585m9835I9963J08212h911F360a29453M9879p5610
$$ 1844 -65323 -25627 70362 -34585 -84420 99963 208175 -8911 6360 -129453 -79574 -155184
10014a55184C8213J36832c729A49049J82323b29880I1462L0350a2757A1214a53419
$$ -155184 38213 175045 -3729 149049 331372 -229880 91462 121812 -12757 11214 -153419
10002A17447b33702K2966r2129a46207B30152b50303D9174K6380b563j603k02617
$$ 117447 -233702 -210736 -302865 -146207 230152 -250303 49174 75554 -2563 -4166 -206783
9991b06783g8884B6953e166p4160j9295k21039a18145A02095K7030g6002l32186
$$ -206783 -78884 26953 -5166 -79326 -98621 -319660 -118145 102095 129125 -76002 -408188
9980d08188e3571A63988M6451k4056b85678c5308l07120J17740B05265d0471j1852
$$ -408188 -53571 163988 210439 186383 -285678 -35308 -342428 -224688 205265 -40471 -52323
9969e2323H869f9267j04643j24408A39855a60069M2335e5698F1485O513a18279
$$ -52323 8869 -69267 -173910 -298318 139855 -160069 -117734 -55698 61485 67998 -118279
9957b99517I4395L4938b16361N8464O1238D8382b38398C9992R1050c00739D30582
$$ -299517 94395 129333 -216361 -157897 -96659 48382 -238398 39992 131042 -300739 430582
9945A21785d84967C631i7543A04390c8941E1406a04495j02917c9878q6862e9198
$$ 121785 -484967 3631 -97543 104390 -38941 51406 -104495 -207412 -39878 -126740 -59198
9933D4948J43294h2231B00183B6347K25753e1869j26430h3483e153p4837l0770
$$ 44948 188242 -82231 200183 26347 252100 -51869 -178299 -83483 -5153 -79990 -110760
9922a10760j70517B91833a74848j79591d5026B2354J76277c8514D9011g1923P026
$$ -110760 -281277 291833 -174848 -354439 -45026 22354 198631 -38514 49011 -71923 -64897
9911f4897b6404G3110f54496a30022A07091l3746Q0824B1476h1894F6759c15310
$$ -64897 -26404 73110 -654496 -130022 107091 73345 154169 21476 -81894 66759 -315310
9899a74819b1401o295q7907j93271a6682G1678h769j52143j2455I4153J48200
$$ -174819 -21401 -27696 -115603 -308874 -16682 71678 -8769 -160912 -173367 94153 242353
9888B42353A7443J13832c32641A74724B9585A120a8263k82719A35664d7577o1697
$$ 242353 17443 131275 -332641 174724 29585 1120 -18263 -300982 135664 -47577 -109274
9877a09274d6246D6810J80608n270a12345j4215l0869b5231A9431J74425b6202
$$ -109274 -46246 46810 227418 222148 -112345 -126560 -157429 -25231 19431 193856 -26202
9865b47035C2533a99666D0794a81679F0445e7139b6630j00415d5198m2022k28058
$$ -247035 32533 -199666 40794 -181679 60445 -57139 -26630 -127045 -45198 -87220 -315278
9854c15278B70214i1887p4406A1801M1658b35722J11658a6508k68585A64467b59101
$$ -315278 270214 -91887 -166293 11801 53459 -235722 -124064 -16508 -285093 164467 -259101
9842c6114f23o9443E3626K00135f8653C3706N4898b20588C67393b24995g11p4833
$$ -36114 -623 -70066 53626 253761 -68653 33706 88604 -220588 367393 -224995 -711 -75544
9830g5544j48176C3019e2411K4548j60585F4468a01874j45522e1156k70860D2834
$$ -75544 -223720 33019 -52411 -27863 -188448 64468 -101874 -247396 -51156 -322016 42834
9818g6378j33171M0107E2811b06272d1860k36707O2378A75757D4856N6553K33513
$$ -76378 -209549 -169442 52811 -206272 -41860 -278567 -216189 175757 44856 101409 334922
9807C34922b37332M1495A30209C8572g9565A00553C8895b01748B06128b07012
$$ 334922 -237332 -195837 130209 38572 -79565 100553 38895 -201748 206128 -207012
9796A2647f1006A30270d95826F136b71681G764b37936h1855P440A00057J01429
$$ 12647 -61006 130270 -495826 6136 -271681 7764 -237936 -81855 -74415 100057 201486
9785B01486J31614b91544g8328j74772o6855H0593b40472R2672d1707j10155q3935
$$ 201486 333100 -291544 -78328 -253100 -319955 80593 -240472 -147800 -41707 -151862 -235797
9774b35797O718i0912b0036o4022j91250m167J17565n890J5805A37840a41616
$$ -235797 -229079 -90912 -20036 -84058 -275308 -279475 -161910 -167800 -151995 137840 -141616
9762a39965A5448K94672a41863d2657j8113C0465Q5314h3676q1526B5784N843
$$ -139965 15448 310120 -141863 -42657 -60770 30465 115779 -83676 -165202 25784 31627
9751C1627b05258j20928J35215R3228K7194k14269A37749d6084I0936m3435c20170
$$ 31627 -205258 -326186 -190971 -97743 -70549 -284818 137749 -46084 90936 47501 -320170
9739c6722j80238K7136A51555e0570B10196C1908a16243d2222G4974A5173b15025
$$ -36722 -216960 -189824 151555 -50570 210196 31908 -116243 -42222 74974 15173 -215025
9727a44026j15780M0763a04077j38684r4006A10825i0115c414n7665o4669b6516
$$ -144026 -259806 -219043 -104077 -242761 -336767 110825 -90115 -3414 -61079 -125748 -26516
9715b63063L2211h6598L1797l78718G7173a79067c7464A68168c20975D0806e9931
$$ -263063 -230852 -86598 -54801 -433519 77173 -179067 -37464 168168 -320975 40806 -59931
9703g3725j4496A69637f1011q645l28790h7024L5788G6555f3080k30531f1103
$$ -73725 -88221 169637 -61011 -69656 -398446 -87024 -51236 76555 -63080 -293611 -61103
9691b81827J11699A9286b44849I1267E726a6403j97172k3397d8641j50214f1229
$$ -281827 -170128 19286 -244849 91267 5726 -16403 -213575 -236972 -48641 -198855 -61229
9679A7202J52209i658p9906A11746m7687Q5280b9651j2432H5400P2819p0831j4912
$$ 17202 169411 -9658 -89564 111746 64059 149339 -29651 -42083 85400 158219 87388 72476
9667G2476a33593F6206e9602b5254o0592G0441e4989j16095F8830K660g9246G7347
$$ 72476 -133593 66206 -59602 -25254 -85846 70441 -54989 -171084 68830 71490 -79246 77347
9654A56116m0823N7753J4993b86333R526D2813J32883D7503k842K10967c95567
$$ 156116 115293 173046 188039 -286333 -276807 42813 175696 47503 44661 255628 -395567
9642i5455K3663j57745e9186J0565j47121A59525a20848e3905r9973A21270a08108
$$ -95455 -71792 -229537 -59186 -48621 -195742 159525 -120848 -53905 -153878 121270 -108108
9630e14935K09949J27866B33751g3600I6210a87768B18762c9579j11142b8830
$$ -514935 -304986 -177120 233751 -73600 96210 -187768 218762 -39579 -150721 -28830
9619A90415a21839k89824a53376f8359G294a796q2666j17039B793a46429o6202
$$ 190415 -121839 -411663 -153376 -68359 7294 -1796 -84462 -201501 2793 -146429 -212631
9608b12631j16290J07013e3424k32180e1242J5636I6068m4195B4763b74362B13848
$$ -212631 -328921 -221908 -53424 -285604 -51242 -35606 96068 51873 24763 -274362 213848
9596F5606K194f2474A34907l7268c94016a21868N2900j59751A88676F6144K9833
$$ 65606 67800 -62474 134907 97639 -394016 -121868 -68968 -228719 188676 66144 95977
9585I5977b1561j59109P3096D6824a13018A80031i5332j05507A30855c16146a19593
$$ 95977 -21561 -180670 -107574 46824 -113018 180031 -95332 -200839 130855 -316146 -119593
9573a52694d6241l132C9983a3046r1279N174o3869j44721D4523R016a20938j72507
$$ -152694 -46241 -49373 39983 -13046 -104325 -99151 -163020 -307741 44523 53539 -120938 -293445
9561b93445N8486B4980e0108E0072f65A36375K27k3415p110h8109B34201i8088
$$ -293445 -234959 24980 -50108 50072 -665 136375 136602 113187 106077 -88109 234201 -98088
9548A12776a2983l63715c0570A29747J33111j15736e6408G0533J59996a98465
$$ 112776 -12983 -376698 -30570 129747 262858 147122 -56408 70533 230529 -198465
9537a24583q8493c4265m8512A22681A5065b06900G914d1048j7730P513J2474m2821
$$ -124583 -213076 -34265 -82777 122681 15065 -206900 7914 -41048 -58778 -51265 -38791 -81612
9525h1612b9720A71605p3135n731c48608a12965k08234J20175r062E7820c60254
$$ -81612 -29720 171605 98470 92739 -348608 -112965 -321199 -201024 -210086 57820 -360254
9513a97779j5625b8110A05453a13032C8494a17427l8559J4132l7030a4E7371f0408
$$ -197779 -213404 -28110 105453 -113032 38494 -117427 -155986 -141854 -178884 -14 57371 -60408
9500B79673b93489E9206b0362l76977A34553c61266B70237C2294R8858a26139
$$ 279673 -293489 59206 -20362 -397339 134553 -361266 270237 32294 131152 -126139
9489A27596c18181a39984k27666I5999a84117D32507b52656a00931A10078c22020
$$ 127596 -318181 -139984 -367650 95999 -184117 432507 -252656 -100931 110078 -322020
9478A67233b9862p5249A61457b78828J31298k6731J2703m5568N1817q8641A50499
$$ 167233 -29862 -105111 161457 -278828 -147530 -174261 -161558 -207126 -155309 -243950 150499
9466b82075B05770f0365p6325E426e9248C6411J12604c56752F1094a13039A42941
$$ -282075 205770 -60365 -136690 5426 -59248 36411 149015 -356752 61094 -113039 142941
9454b0362r7818J378k9345r8949B59378d1456n9520l1590b3696C0595b90028I1635
$$ -20362 -118180 -116802 -146147 -245096 259378 -41456 -100976 -132566 -23696 30595 -290028 91635
9441d00351E0769P3025b01808d8557C1708e03240b50919C86786c27805A3037J67951
$$ -400351 50769 123794 -201808 -48557 31708 -503240 -250919 386786 -327805 13037 180988
9430A80988c6239q2756k47853J16221j75395A01915K29369A23728f8537D5018
$$ 180988 -36239 -118995 -366848 -250627 -426022 101915 331284 123728 -68537 45018
9419b74047C0165M5613a35195B35377b09439p7542a21521a2455A3855i6997b6109
$$ -274047 30165 75778 -135195 235377 -209439 -286981 -121521 -12455 13855 -96997 -26109
9407a11853L0959K0221j0879j08042E5207L7063a5110j72009Q8396r5446p6903
$$ -111853 -80894 -60673 -71552 -179594 55207 92270 -15110 -187119 -98723 -194169 -271072
9396b71072O9217I7301a26806A19343A6756J60920c1512k34470B5201J32022a00488
$$ -271072 -201855 97301 -126806 119343 16756 177676 -31512 -265982 25201 157223 -100488
9384a21615m2752j55241a06567l8488G7211b32463d7695B44599G627L150M372
$$ -121615 -164367 -319608 -106567 -145055 77211 -232463 -47695 244599 7627 10777 15149
9373A5149b42457f4915k97715D3085K4058e06741c9708j1046k90911A15802e5761
$$ 15149 -242457 -64915 -362630 43085 67143 -506741 -39708 -50754 -341665 115802 -55761
9361a2660A17741P2916b80958a3419j14882m8338A3302a81434P513k62752G6460
$$ -12660 117741 190657 -280958 -13419 -128301 -176639 13302 -181434 -173921 -436673 76460
9349a75202A18436n6399a43917A73041L00601c75875A55700a83369j27738B0823
$$ -175202 118436 62037 -143917 173041 473642 -375875 155700 -183369 -311107 20823
9338a81641H8877a5881B14824a58669j72496A51662a02334n3937d8319a8983o495
$$ -181641 88877 -15881 214824 -158669 -331165 151662 -102334 -156271 -48319 -18983 -25478
9327b5478k80227I4232A0775d3323A46078l1392l2783b05102E4232a45632j47756
$$ -25478 -305705 94232 10775 -43323 146078 114686 81903 -205102 54232 -145632 -293388
9316b93388M7837A58405a25962C60030n4470f3142b1065A4688b68186H0968B8195
$$ -293388 -245551 158405 -125962 360030 305560 -63142 -21065 14688 -268186 80968 28195
9304B67935c1599k99801J07430e6749a5282j59503j62685J54057g0753B6872a1047
$$ 267935 -31599 -331400 -223970 -56749 -15282 -174785 -337470 -183413 -70753 26872 -11047
9292a14339a1283j29358j74182e6562j65161j5947A5917O2809J24672I5767a94423
$$ -114339 -11283 -140641 -314823 -56562 -221723 -237670 15917 78726 203398 95767 -194423
9280A507c05497H6443b54029A94994h1529p3327h609n129k8413F3535A7828b43331
$$ 1507 -305497 86443 -254029 194994 -81529 -154856 -8609 -13738 -42151 63535 17828 -243331
9267A05586e0456j7069j02948l5033A66717d2758j88186G38a53638e0088A54248
$$ 105586 -50456 -67525 -170473 -205506 166717 -42758 -230944 738 -153638 -50088 154248
9255a49408l8652A72693b78746h4807C6973a54031N5292a649p5245m6078B2360
$$ -149408 -188060 172693 -278746 -84807 36973 -154031 -98739 -1649 -76894 -122972 22360
9243b05088e6208A70791a74518j31149J11851g8438F5716c3406r3474L8601A22567
$$ -205088 -56208 170791 -174518 -305667 -193816 -78438 65716 -33406 -126880 -88279 122567
9231a68305B19990a7640j13366j58588q9442C1921h0907h585F6923c94386A53160
$$ -168305 219990 -17640 -131006 -289594 -379036 31921 -80907 -8585 66923 -394386 153160
9219B5745e3038E130L5816K99011A9420b64653b4457A28024j7450d9048l34234
$$ 25745 -53038 5130 40946 339957 19420 -264653 -24457 128024 110574 -49048 -383282
9208c83282B11968r9282c5333k58086b3820l64937A12363a44480Q219b2722B85439
$$ -383282 211968 112686 -35333 -293419 -23820 -388757 112363 -144480 -136261 -22722 285439
9196C50159i3655F8023A028b9238n7759m3631A90319J89126C6927b59161N9491
$$ 350159 -93655 68023 1028 -29238 -86997 -130628 190319 379445 36927 -259161 -199670
9185a99670G754a71568A5770d60251J86157c2736j70219E7090j1629c63994D4108
$$ -199670 7754 -171568 15770 -460251 -274094 -32736 -202955 57090 45461 -363994 44108
9173a59807F9784b68519j39992b4897j53926H68a6778k0234k25939A80656b53418
$$ -159807 69784 -268519 -408511 -24897 -178823 868 -16778 -37012 -262951 180656 -253418
9161A5402e4136D3282j3372Q6617J12295A04575a25167A7909c88923G9898b65134
$$ 15402 -54136 43282 29910 116527 228822 104575 -125167 17909 -388923 79898 -265134
9149D933f6545B10966a31903b3385l82464B09223a81007E5697h2147l50045Q5190
$$ 4933 -66545 210966 -131903 -23385 -405849 209223 -181007 55697 -82147 -432192 -347002
9138c47002a59913E2312B0189a02646J0574E1883A4647e9341I4180a96780A37159
$$ -347002 -159913 52312 20189 -102646 -92072 51883 14647 -59341 94180 -196780 137159
9126a8229j44869a1605l67071J02624D124h8988A10997Q656E930a57448j10853
$$ -18229 -163098 -11605 -378676 -276052 4124 -88988 110997 119653 5930 -157448 -268301
9115b68301J01164A20954B7802J40531D5908b23084m6370B22128D2017b27251
$$ -268301 -167137 120954 27802 168333 45908 -223084 -269454 222128 42017 -227251
9104B5687b25802A34815b79452a31735j68642a07946F07a25228L750B60758a00580
$$ 25687 -225802 134815 -279452 -131735 -300377 -107946 607 -125228 -121478 260758 -100580
9092e9430B91415g3861E4858e9736G4878K8411c2056B9206a15753A03979J4281
$$ -59430 291415 -73861 54858 -59736 74878 103289 -32056 29206 -115753 103979 118260
9081A18260k1988a09894l7006B10197d59469h1457k97878a35086a2075B81490
$$ 118260 96272 -109894 -146900 210197 -459469 -81457 -379335 -135086 -12075 281490
9070A430a18858E1632a30518B85969g6410B12200n3600c0777l280B95415b94804
$$ 1430 -118858 51632 -130518 285969 -76410 212200 158600 -30777 -34057 295415 -294804
9058a31383N7815A1842a35610E0255a48664B03125A2598b84878e1032k45901N7005
$$ -131383 -73568 11842 -135610 50255 -148664 203125 12598 -284878 -51032 -296933 -239928
9047b39928E2366a53942c9548q8273j42271N0527q0115h7495P244m061d949G0055
$$ -239928 52366 -153942 -39548 -127821 -270092 -219565 -299680 -87495 -80251 -84312 -4949 70055
9034e6874j25536n808e3719Q081C60829b26634e3108j16201B24196p7951j1991
$$ -56874 -182410 -188218 -53719 -45638 360829 -226634 -53108 -169309 224196 146245 134254
9023A34254b6925p906A49888a10308m3938j71322C0931b33475h3407B8370J19583
$$ 134254 -26925 -34831 149888 -110308 -154246 -325568 30931 -233475 -83407 28370 147953
9012A47953b4543m10172H9660d92B438g155k38747D8984A8794c97180f3590q6960
$$ 147953 -24543 -434715 89660 -492 2438 -7155 -245902 48984 18794 -397180 -63590 -150550
9000a50550m8189A67658n0845c75782Q4083Q14n892d3438B19530D5603c309A74872
$$ -150550 -198739 167658 116813 -375782 -291699 -290885 -296777 -43438 219530 45603 -3309 174872
8987C13056e5439J5254o5576A9571c0387A31066M6453f4052I8223Q8315C8674
$$ 313056 -55439 -40185 -105761 19571 -30387 131066 177519 -64052 98223 186538 38674
8975a58252o741P0184A68639b22876o6642A25328C3145d22686a06645q7932h9417
$$ -158252 -164993 -94809 168639 -222876 -289518 125328 33145 -422686 -106645 -194577 -89417
8963B9246g6970k05197J03193E1197A1254c16742A80813B5862a50613j38128J12884
$$ 29246 -76970 -282167 -178974 51197 11254 -316742 180813 25862 -150613 -288741 -175857
8952a75857B1885c17997f0039k72732f9380c2862p019j1683l7830b157E2219b3020
$$ -175857 21885 -317997 -60039 -332771 -69380 -32862 -39881 -51564 -89394 -2157 52219 -23020
8939A38652a80817G6789L6512a48311d4280k21188A724b80018e3945A9398a30732
$$ 138652 -180817 76789 113301 -148311 -44280 -265468 1724 -280018 -53945 19398 -130732
8927a14797A37823J14202m4431O55563N84240M728329N72283B104612E66058E2511
$$ -114797 137823 252025 207594 863157 1447397 6175726 6748009 2104612 566058 52511
8916B35192j17229C928b4965I5323f9243m8328B4459F569L44839H7623O6326N156
$$ 235192 117963 3928 -24965 95323 -69243 -117571 24459 6569 351408 87623 153949 159105
8904A59105g1008J3095J5941m8509k10920K7223e0398p874j45609j86088J94252
$$ 159105 -71008 -57913 -41972 -90481 -301401 -274178 -50398 -58272 -203881 -389969 -195717
8893a95717g4190j18075A42578A5106b4749C3921K86956f4275A11021j718D1928
$$ -195717 -74190 -192265 142578 15106 -24749 33921 320877 -64275 111021 109303 41928
8881F53039b5100H463d5929H4337Q4192b18195h7442j41719B71400j13663A4424
$$ 653039 -25100 8463 -45929 84337 168529 -218195 -87442 -229161 271400 157737 14424
8869A8855a66673b0845n7405b6149j21611d8215C83752E7159c5377C5363J35530
$$ 18855 -166673 -20845 -78250 -26149 -147760 -48215 383752 57159 -35377 35363 170893
8858A70893c2065o0770k86654D38045A6899h5361p1701m32590a66376j87364a24852
$$ 170893 -32065 -92835 -379489 438045 16899 -85361 -157062 -589652 -166376 -353740 -124852
8846d38147E8505J13482i9013d8617m1815b5768G0125f7430G079d74515f8766
$$ -438147 58505 171987 -99013 -48617 -90432 -25768 70125 -67430 7079 -474515 -68766
8834a22335d3047o1703C657e3465j06870B71851H0218a76689B68762b3149A14046
$$ -122335 -43047 -104750 3657 -53465 -160335 271851 80218 -176689 268762 -23149 114046
$$ [...]
##END NTUPLES=NMR SPECTRUM
##END=
