##TITLE=AC1659_NSAAH14395_8531237_ArgPjRldyK
##JCAMPDX= 6.0         $$ Bruker NMR JCAMP-DX V2.0
##DATA TYPE= NMR SPECTRUM
##DATA CLASS= NTUPLES
##ORIGIN= BRUKER
##OWNER= Administrator
$$ 1.72 TOPSPIN		Version 2.1
$$ 2014-03-14 22:03:52.488 -0800  Administrator@X
$$ Compression mode = diff/dup
##.OBSERVE FREQUENCY= 400.02188249412
##.OBSERVE NUCLEUS= ^1H
##.ACQUISITION MODE= SIMULTANEOUS (DQD)
##.ACQUISITION SCHEME= undefined
##.AVERAGES= 64
##.DIGITISER RES= 22
##SPECTROMETER/DATA SYSTEM= spect
##.PULSE SEQUENCE= noesygpps1d.comp
##.SOLVENT NAME= COFFEE_meoh
##.SHIFT REFERENCE= INTERNAL, COFFEE_meoh, 1, 14.96095
##AUDIT TRAIL= $$ (NUMBER, WHEN, WHO, WHERE, PROCESS, VERSION, WHAT)
$$ ##TITLE= Audit trail, TOPSPIN		Version 2.1
$$ ##JCAMPDX= 5.01
$$ ##ORIGIN= Bruker BioSpin GmbH
$$ ##OWNER= Administrator
$$ $$ E:\/data/COFFEE/nmr/AC1659_NSAAH14395_8531237_ArgPjRldyK/12/pdata/1/auditp.txt
$$ ##AUDIT TRAIL=  $$ (NUMBER, WHEN, WHO, WHERE, PROCESS, VERSION, WHAT)
(   1,<2014-03-14 22:03:47.551 -0800>,<Administrator>,<X>,<go>,<TOPSPIN 2.1>,
      <created by zg
	started at 2014-03-14 21:52:17.551 -0800,
	POWCHK enabled, PULCHK disabled,
       configuration hash MD5:
       C8 4E 4E 5D D3 5C D8 9E 9F 52 82 E0 59 8A DE 15
       data hash MD5: 64K
       EB 2C DA DE 38 BE 9D E8 92 CC AB 84 F6 64 96 E9>)
(   2,<2014-03-14 22:03:50.488 -0800>,<Administrator>,<X>,<proc1d>,<TOPSPIN 2.1>,
      <Start of raw data processing
       efp LB = 0.3 FT_mod = 6 PKNL = 1 PHC0 = 0 PHC1 = 0 SI = 128K 
       data hash MD5: 128K
       1B 4B 73 96 BE 40 3B B2 D6 F7 71 D3 EE E2 FB C6>)
(   3,<2014-03-14 22:03:51.442 -0800>,<Administrator>,<X>,<proc1d>,<TOPSPIN 2.1>,
      <pk PHC0 = -86.83594 PHC1 = 0 
       data hash MD5: 128K
       B1 39 C9 08 88 91 B2 6E F9 8D 79 CD 1A CC AE 92>)
(   4,<2014-03-14 22:03:51.895 -0800>,<Administrator>,<X>,<proc1d>,<TOPSPIN 2.1>,
      <abs ABSG = 1 
       data hash MD5: 128K
       25 C0 04 9C DB 7B E9 FC AF C6 73 3E 5C DF 75 4E>)
(   5,<2014-03-14 22:03:52.004 -0800>,<Administrator>,<X>,<proc1d>,<TOPSPIN 2.1>,
      <abs ABSG = 2 
       data hash MD5: 128K
       F1 A5 D4 98 5C EB 85 57 A5 0C 96 5B A6 EE DF E1>)
(   6,<2014-03-14 22:03:52.113 -0800>,<Administrator>,<X>,<proc1d>,<TOPSPIN 2.1>,
      <abs ABSG = 3 
       data hash MD5: 128K
       65 E7 B6 66 46 89 11 DC 9E 6B F9 99 D0 0D 7E 2F>)
(   7,<2014-03-14 22:03:52.192 -0800>,<Administrator>,<X>,<proc1d>,<TOPSPIN 2.1>,
      <abs ABSG = 4 
       data hash MD5: 128K
       44 2E FD 5E BB 79 85 9C D5 0B 40 07 D0 28 AE C2>)
(   8,<2014-03-14 22:03:52.285 -0800>,<Administrator>,<X>,<proc1d>,<TOPSPIN 2.1>,
      <abs ABSG = 5 
       data hash MD5: 128K
       6D D2 D7 B3 47 EF DE 5B 66 3D 82 1D 01 21 34 F4>)
$$ ##END=
$$ 
$$ $$ hash MD5
$$ $$ D1 B4 B0 84 73 8E 34 65 6E 70 0F 15 5E C3 55 FC
##$RELAX= 
##$RELAX= 
##$RELAX= 
##$RELAX= 
##$RELAX= 
##$RELAX= 
##$RELAX= 
##$RELAX= 
$$ Bruker specific parameters
$$ --------------------------
##$DU= <E:\>
##$EXPNO= 12
$$ [...]
##$TP07= 0
##$TPNAME0= <>
##$TPNAME1= <>
##$TPNAME2= <>
##$TPNAME3= <>
##$TPNAME4= <>
##$TPNAME5= <>
##$TPNAME6= <>
##$TPNAME7= <>
##$TPOAL= (0..7)
0.5 0.5 0.5 0.5 0.5 0.5 0.5 0.5
##$TPOFFS= (0..7)
0 0 0 0 0 0 0 0
##$TUNHIN= 0
##$TUNHOUT= 0
##$TUNXOUT= 0
##$USERA1= <user>
##$USERA2= <user>
##$USERA3= <user>
##$USERA4= <user>
##$USERA5= <user>
##$V9= 5
##$VALIST= <valist>
##$VCLIST= <CCCCCCCCCCCCCCC>
##$VD= 0
##$VDLIST= <DDDDDDDDDDDDDDD>
##$VPLIST= <PPPPPPPPPPPPPPP>
##$VTLIST= <TTTTTTTTTTTTTTT>
##$WBST= 1024
##$WBSW= 4
##$XGAIN= (0..3)
0 0 0 0
##$XL= 0
##$YL= 0
##$YMAX_a= 5971952
##$YMIN_a= -12767233
##$ZGOPTNS= <>
##$ZL1= 120
##$ZL2= 120
##$ZL3= 120
##$ZL4= 120
##$ABSF1= 14.96095
##$ABSF2= -5.597232
##$ABSG= 5
##$ABSL= 3
##$ALPHA= 0
##$AQORDER= 0
##$ASSFAC= 0
##$ASSFACI= 0
##$ASSFACX= 0
##$ASSWID= 0
##$AUNMP= <proc_prof1d_extract.lims>
##$AXLEFT= 0
##$AXNAME= <>
##$AXNUC= <1H>
##$AXRIGHT= 0
##$AXTYPE= 0
##$AXUNIT= <>
##$AZFE= 0.1
##$AZFW= 0.1
##$BCFW= 0
##$BC_mod= 0
##$BYTORDP= 0
##$COROFFS= 0
##$CY= 15
##$DATMOD= 1
##$DC= 0
##$DFILT= <>
##$DTYPP= 0
##$F1P= 0
##$F2P= 0
##$FCOR= 0.5
##$FTSIZE= 131072
##$FT_mod= 6
##$GAMMA= 0
##$GB= 0
##$INTBC= 1
##$INTSCL= 1
##$ISEN= 128
##$LB= 0.3
##$LEV0= 0
##$LPBIN= 0
##$MAXI= 10000
##$MC2= 0
##$MEAN= 0
##$ME_mod= 0
##$MI= 0
##$NCOEF= 0
##$NC_proc= -2
##$NLEV= 6
##$NOISF1= 0
##$NOISF2= 0
##$NSP= 0
##$NTH_PI= 0
##$NZP= 0
##$OFFSET= 14.96095
##$PC= 1
##$PHC0= -86.83594
##$PHC1= 0
##$PH_mod= 1
##$PKNL= yes
##$PPARMOD= 0
##$PPDIAG= 0
##$PPIPTYP= 0
##$PPMPNUM= 2147483647
##$PPRESOL= 1
##$PSCAL= 4
##$PSIGN= 0
##$PYNMP= <proc.py>
##$REVERSE= no
##$SF= 400.020009658301
##$SI= 131072
##$SIGF1= 0
##$SIGF2= 0
##$SINO= 400
##$SIOLD= 131072
##$SPECTYP= <>
##$SREGLST= <1H.CDCl3>
##$SSB= 0
##$STSI= 131072
##$STSR= 0
##$SW_p= 8223.68421052631
##$SYMM= 0
##$S_DEV= 0
##$TDeff= 65536
##$TDoff= 0
##$TI= <>
##$TILT= no
##$TM1= 0
##$TM2= 0
##$TOPLEV= 0
##$USERP1= <user>
##$USERP2= <user>
##$USERP3= <user>
##$USERP4= <user>
##$USERP5= <user>
##$WDW= 1
##$XDIM= 131072
##$YMAX_p= 389610246
##$YMIN_p= -10932
##$CURPLOT= <Network HP LaserJet P1505>
##$CURPRIN= <$Network HP LaserJet P1505>
##$DFORMAT= <normdp>
##$LAYOUT= <+/1D_H.xwp>
##$LFORMAT= <normlp>
##$PFORMAT= <normpl>
##$SURQMSG= 1
$$ End of Bruker specific parameters
$$ ---------------------------------
##NTUPLES= NMR SPECTRUM
##VAR_NAME=  FREQUENCY,     SPECTRUM/REAL,   SPECTRUM/IMAG
##SYMBOL=    X,             R,               I
##VAR_TYPE=  INDEPENDENT,   DEPENDENT,       DEPENDENT
##VAR_FORM=  AFFN,          ASDF,            ASDF
##VAR_DIM=   131072,        131072,          131072
##UNITS=     HZ,            ARBITRARY UNITS, ARBITRARY UNITS
##FACTOR=    0.0627417313425164, 1,          1
##FIRST=     8223.62146879497, -866,         -60969
##LAST=      0,             308,             -61712
##MIN=       0,             -10932,          0
##MAX=       8223.62146879497, 389610246,    0
$$ Real data points
##PAGE= N=1
##DATA TABLE= (X++(R..R)), XYDATA
$$ [...]
63886H55917k3412k2969k2857k2060k0014j7250j4804j3079j1629r869p668n198
63874F65108k561J86K849N132O833P931Q640R399J0616J2294J4017J5359J6170
63861G71973J6437J6205J5685J5124J4385J2959J0698Q194O097M353K468L19j831
63848H93066l928o142q375j0305j1991j3900j6158j8233j9600k0378k1089k2064
63836G20903k3240k4305k4872k4764k4183k3485k2753k1870k0890j9956j8861
63825D71724j7232j5263j3662j2648j1593j0065q615p982p907p461o348n225m734
63812C42989m728m604l994k977j924j215r84j003r30p07n68o75q57p93m43l18
63796C16269j168l127n209o024n169l618k590k370k461k508k546k563k359j868
$$ plain form
63886 855917 832505 809536 786679 764619 744605 727355 712551 699472 687843 677974 670306 665108
63874 665108 662547 662733 665582 670714 677547 685478 694118 703517 714133 726427 740444 755803 771973
63861 771973 788410 804615 820300 835424 849809 862768 873466 881660 887757 892110 894578 894897 893066
63848 893066 889138 882996 874621 864316 852325 838425 822267 804034 784434 764056 742967 720903
63836 720903 697663 673358 648486 623722 599539 576054 553301 531431 510541 490585 471724
63825 471724 454492 439229 425567 412919 401326 391261 382646 374664 366757 359296 352948 347723 342989
63812 342989 338261 333657 329663 326686 324762 323547 322563 321560 320630 319923 319355 318680 317823 317030 316587 316269
63796 316269 315101 311974 306765 300741 295572 291954 289364 286994 284533 282025 279479 276916 274557 272689
63782B72689j300q45n28l75m68q09j280j766k188k456k506k338j909j183l49J98
63766B52587L06K88M77P20O28J91k03k81j54m7k4k6j1p2l86r41j273q01M32J646
63746B53056K140J967J605J366J430K022L017L681L479K865K716L134L488L499
63732B89465L534L756L815L497L085K825K620K534K886L601M011L778L414L491
63718C36312L737L541K917K353J957J371M92l33q67j254j605j734j495j135j042
63703C43215j255j393j033j25R25J591J636J283R63J010J504K301L107L584L550
63688C60863L113K563K131J807J414Q39J49o12j618k900l794l242j095J225K045
63673C62888J257K83J76N23M61M1n5L31O37N08K53K36K73j40j174k471l549m214
$$ plain form
63782 272689 271389 270544 270016 269641 269173 268364 267084 265318 263130 260674 258168 255830 253921 252738 252389 252587
63766 252587 252893 253181 253658 254378 255006 255197 254994 254713 254559 254512 254488 254462 254451 254379 253993 253052 251779 250978 251410 253056
63746 253056 255196 257163 258768 260134 261564 263586 266603 270284 273763 276628 279344 282478 285966 289465
63732 289465 292999 296755 300570 304067 307152 309977 312597 315131 318017 321618 325629 329407 332821 336312
63718 336312 340049 343590 346507 348860 350817 352188 352680 352347 351480 350226 348621 346887 345392 344257 343215
63703 343215 341960 340567 339534 339409 340334 341925 343561 344844 345807 346817 348321 350622 353729 357313 360863
63688 360863 363976 366539 368670 370477 371891 372730 372879 372267 370649 367749 363955 360713 359618 360843 362888
63673 362888 364145 364428 364604 365127 365588 365629 365574 365905 366542 367050 367303 367539 367812 367672 366498 364027 360478 356264
63655C56264m543m620m462m215m125m141l772k732j588j259j848k449k236j250
63641C13024L7J365K524L033K650J931J796K524L569M279M473M421M646N536O818
63626C62626P560P217O530O806Q283R866J0574J0654J1010J2070J3641J5483J7478
63613D99798J9358K0716K1343K1396K1344K1740K2859K4430K5878K6901K7521
63602G53284K7427K5799K2120J6903J1207N702N90l810p024q890r630r478q739
63589H15461q141q549j0138j2386j4845j7457j9895k1346k1423k0754k0222j9880
63577F20425j9131j7595j5405j2843j0227p902n920l939j836j03Q75J576K716
63564E30691M138N112N552N999O443O275N644N804P511R931J1795J2974J4151
$$ plain form
63655 356264 351721 347101 342639 338424 334299 330158 326386 323654 322066 320807 318959 316510 314274 313024
63641 313024 313061 314426 316950 319983 322633 324564 326360 328884 332453 336732 341205 345626 350272 355808 362626
63626 362626 370186 377403 383933 390739 399022 408888 419462 430116 441126 453196 466837 482320 499798
63613 499798 519156 539872 561215 582611 603955 625695 648554 672984 698862 725763 753284
63602 753284 780711 806510 828630 845533 856740 862442 863032 859222 852198 843308 833678 824200 815461
63589 815461 807320 798771 788633 776247 761402 743945 724050 702704 681281 660527 640305 620425
63577 620425 601294 583699 568294 555451 545224 537322 531402 527463 525627 525524 526399 527975 530691
63564 530691 534829 539941 545493 551492 557935 564210 569854 575658 583169 593100 604895 617869 632020
63551F32020J5574J7016J8606K0835K3737K6767K9528L2059L4386L6147L6624
63540I23299L4846K9924K1882J2164K879m560r876j3312j5077j5380j4574j3145
63528I39070j1748j1131j1768j3614j6399j9945k3904k7497k9964l1138l1300
63517G10662l0710k9598k8297k6827k4715k1735j8546j6017j4220j2735j1553
63506D75709j0801r922q195o080m883m956n235m886m349m247m245l674k644j801
63492C99791j455j485j680j701j146j38N96O29L96M58P34R22J195J839K613L098
63476D04666L320L474L386K884K368K288K258J418l79k313l515l783l458l107
63462D09507l247l883m294l712k217o13N00J129J550K020K741L637M192M004L523
$$ plain form
63551 632020 647594 664610 683216 704051 727788 754555 784083 816142 850528 886675 923299
63540 923299 958145 988069 1009951 1022115 1024994 1020434 1010558 997246 982169 966789 952215 939070
63528 939070 927322 916191 904423 890809 874410 854465 830561 803064 773100 741962 710662
63517 710662 679952 650354 622057 595230 570515 548780 530234 514217 499997 487262 475709
63506 475709 464908 454986 446791 440711 435828 430872 425637 420751 416402 412155 407910 404236 401592 399791
63492 399791 398336 396851 395171 393470 392324 392186 392782 393411 393807 394265 394999 395921 397116 398955 401568 404666
63476 404666 407986 411460 414846 417730 420098 422386 424644 426062 425683 423370 419855 416072 412614 409507
63462 409507 406260 402377 398083 394371 392154 391541 392041 393170 394720 396740 399481 403118 407310 411314 414837
63447D14837L753N118P026Q514R070Q825Q343Q291Q900R753J0383J1054J2536
63434E26403J5137J8390K1757K5019K7820K9334K8838K6460K3037J9362J5864
63423G77421J2841J0714R839J0203J1470J3364J5925J9191K2734K5778K7891K9150
63411I86521K9501K8353K5149K0087J3887P102K01n985j0492j3041j4151j4458
63399A052674j4377j4425j5250j7063j9358k1619k3918k6579k9399l1554l2266
63388H06866l1452k9738k7888k6180k4315k1986j9389j7052j5185j3415j1172
63377E69094q253n009k115PJ643L502N789P886R211J0177J1620J3493J4768J4820
63363F46633J4311J4405J5553J7417J9618K2011K4433K6653K8612L0379L1769
$$ plain form
63447 414837 418590 423708 430734 439248 448318 457143 465486 473777 482677 492430 502813 513867 526403
63434 526403 541540 559930 581687 606706 634526 663860 692698 719158 742195 761557 777421
63423 777421 790262 800976 810815 821018 832488 845852 861777 880968 903702 929480 957371 986521
63411 986521 1016022 1044375 1069524 1089611 1103498 1110600 1110801 1104816 1094324 1081283 1067132 1052674
63399 1052674 1038297 1023872 1008622 991559 972201 950582 926664 900085 870686 839132 806866
63388 806866 775414 745676 717788 691608 667293 645307 625918 608866 593681 580266 569094
63377 569094 560841 555832 553717 553724 555367 558869 564658 572544 581755 591932 603552 617045 631813 646633
63363 646633 660944 675349 690902 708319 727937 749948 774381 801034 829646 860025 891794
63352H91794L2281L1545K9639K6822K3025J7918J1579M905q73n126q120j0419
63340A044970j2224j3358j3704j3515j3443j4297j6501j9651k2791k5241k6959
63329H53286k8116k8696k8684k8142k6919k4735k1798j8835j6115j3053r325n766
63317F03102l381k091j366j688m088q311j2611j5559j7017j7221j6131j4131j2213
63304D77294j0773r117o877m982m396m609m393l460k437j687j177j204k097l320
63290D16765l906l842m029m715n046m450l574l186l035k445j577j232j608j993
63276C72127j757j111p49r71j410j462q76K9P51J150J516K106K736K985K659J968
63260C79691J329J099J435K244L249M142M704M909N030N550O695P988Q547Q063
$$ plain form
63352 891794 924075 955620 985259 1012081 1035106 1053024 1064603 1069508 1068635 1063509 1055389 1044970
63340 1044970 1032746 1019388 1005684 992169 978726 964429 947928 928277 905486 880245 853286
63329 853286 825170 796474 767790 739648 712729 687994 666196 647361 631246 618193 608868 603102
63317 603102 599721 597630 596264 594576 590488 582177 569566 554007 536990 519769 503638 489507 477294
63304 477294 466521 457404 450527 445545 441149 436540 432147 428687 426250 424563 423386 422182 420085 416765
63290 416765 412859 409017 404988 400273 395227 390777 387203 384017 380982 378537 376960 375728 374120 372127
63276 372127 370370 369259 368510 367539 366129 364667 363791 363820 364571 365721 367237 369343 372079 375064 377723 379691
63260 379691 381020 382119 383554 385798 389047 393189 397893 402802 407832 413382 420077 428065 436612 444675
63246D44675P264P186Q069R295J0241J0874J1489J2306J3482J5169J7268J9324
63234E86642K0954K2249K3527K4880K6220K7531K8716K9269K8644K7073K5561
63223H71266K4891K4911K4994K4823K4465K4012K3542K3258K3233K3122K2418
63212A134935K1009J9157J6944J4010R993N012l19n351r879j4196j8531k2498
63200A150286k5384k7052k8139k9040k9202k7901k5408k2587j9631j6030j1883
63189H88029q290n917l963j184K486O018Q729J0957J3294J5775J8012J9703K0804
63176I84453K1379K1562K1523K1322K0929K0344J9657J8819J7578J5785J3672
63165A197023J1592R444O604K586k317p339j2076j6759k1646k6409l0355l3057
$$ plain form
63246 444675 451939 459125 467194 476489 486730 497604 509093 521399 534881 550050 567318 586642
63234 586642 607596 629845 653372 678252 704472 732003 760719 789988 818632 845705 871266
63223 871266 896157 921068 946062 970885 995350 1019362 1042904 1066162 1089395 1112517 1134935
63212 1134935 1155944 1175101 1192045 1206055 1216048 1221060 1220741 1215390 1205511 1191315 1172784 1150286
63200 1150286 1124902 1097850 1069711 1040671 1011469 983568 958160 935573 915942 899912 888029
63189 888029 879739 873822 869859 868675 871161 877179 885908 896865 910159 925934 943946 963649 984453
63176 984453 1005832 1027394 1048917 1070239 1091168 1111512 1131169 1149988 1167566 1183351 1197023
63165 1197023 1208615 1218059 1224663 1227249 1224932 1217593 1205517 1188758 1167112 1140703 1110348 1077291
63153A077291l4594l5301l5459l5137l4158l2367l0030k7720k5630k3305k0427
63142G43163j7526j5437j4143j2819j1017r201p885o821n412l573j747l07P34
63129F38009J496K040K432K852L572M798O385P777Q455Q527Q520Q579Q184O861
63115G18487M914L180K198J762J237J74j196k070j871j027o39j257k233k571k103
63100G16985j530j483j912k376k597k601k480k135j355k46O16P38M20M74J132
63085G01650J739J799J808K424L267L378K852K976M422O060O357N499N173O354
63071G55758Q147R205R468R893J0913J2068J3005J4064J5701J7937K0651K3748
63059I20558K6755K8901L0180L1765L4686L8516M2078M5113M8321N1939N5305
$$ plain form
63153 1077291 1042697 1007396 971937 936800 902642 870275 840245 812525 786895 763590 743163
63142 743163 725637 710200 696057 683238 672221 663020 655135 648314 642902 639329 637582 637275 638009
63129 638009 639505 641545 643977 646829 650401 655199 661584 669361 677816 686343 694863 703442 711626 718487
63115 718487 723401 726581 728779 730541 731778 731952 730756 728686 726815 725788 725149 723892 721659 719088 716985
63100 716985 715455 713972 712060 709684 707087 704486 702006 699871 698516 698270 698886 699624 700044 700518 701650
63085 701650 703389 705188 706996 709420 712687 716065 718917 721893 726315 732375 738732 744231 749404 755758
63071 755758 763905 773110 782578 792471 803384 815452 828457 842521 858222 876159 896810 920558
63059 920558 947313 976214 1006394 1038159 1072845 1111361 1153439 1198552 1246873 1298812 1354117
63048A354117N7985O0311O2476O3944O4265O3833O3251O2545O1513O0349N9262
63037B033851N7857N5673N3109N1115M9970M8950M7248M4646M1120L6291K9681
63026B549511K1278J1577J063j0064k1671l3321m4366n4290o2792o9432p3657
63015B213836p5366p5205p3806p0953o6050n9351n2064m5093l8223l0769k2568
63004A604388j4048n810J590P832J3131J8067K2848K7138L0684L3674L6172L7750
62992A813416L8049L7371L6355L5446L4893L4680L4164L2378K9161K5399K1589
62981B172901J6902J0390K498n594j3604k2090l1050l9753m7879n5609o2423o6979
62969A857710o8698o8643o8282o7909o6803o4347o0555n5908n1199m7278m4480
$$ plain form
63048 1354117 1412102 1472413 1534889 1598833 1663098 1726931 1790182 1852727 1914240 1974589 2033851
63037 2033851 2091708 2147381 2200490 2251605 2301575 2350525 2397773 2442419 2483539 2519830 2549511
63026 2549511 2570789 2582366 2583429 2573365 2551694 2518373 2474007 2419717 2356925 2287493 2213836
63015 2213836 2138470 2063265 1989459 1918506 1852456 1793105 1741041 1695948 1657725 1626956 1604388
63004 1604388 1590340 1584530 1586120 1593952 1607083 1625150 1647998 1675136 1705820 1739494 1775666 1813416
62992 1813416 1851465 1888836 1925191 1960637 1995530 2030210 2064374 2096752 2125913 2151312 2172901
62981 2172901 2189803 2200193 2202691 2197097 2183493 2161403 2130353 2090600 2042721 1987112 1924689 1857710
62969 1857710 1789012 1720369 1652087 1584178 1517375 1453028 1392473 1336565 1285366 1238088 1193608
62958A193608m2340m0094l7354l4256l1259k8926k7545k6772k5856k4423k2836
62947H51947k1600k0722j9807j8610j7232j5883j4592j3209j1708j0422r797r745
62935F68620r505q495p059n941n180m187k870j953j939k392k567k311j908j507
62921F10806j182j231j848k672l131l186l296l665l956l828l420l139l214l591
62907E69447m043m224l849l037k324k103k129j911j475j295j491j531j106p07
62893E38222q47j102o41L91Q75J91j003j732j742j237l11Q21J584J600J162O57
62877E36888l9j012j662j363m66J14J13j6k5j32l91o71j116j866k331j700l06
62860E24019M62o0r33r62j86N19P19P05P95R85J109J012O49K60K10N17P40M53
$$ plain form
62958 1193608 1151268 1111174 1073820 1039564 1008305 979379 951834 925062 899206 874783 851947
62947 851947 830347 809625 789818 771208 753976 738093 723501 710292 698584 688162 678365 668620
62935 668620 659115 650620 643561 637620 632440 628253 625383 623430 621491 619099 616532 614221 612313 610806
62921 610806 609624 608393 606545 603873 600742 597556 594260 590595 586639 582811 579391 576252 573038 569447
62907 569447 565404 561180 557331 554294 551970 549867 547738 545827 544352 543057 541566 540035 538929 538222
62893 538222 537375 536273 535632 536023 536898 537089 536086 534354 532612 531375 531064 531885 533469 535069 536231 536888
62877 536888 536849 535837 534175 532812 532346 532460 532573 532557 532532 532400 532009 531338 530222 528356 526025 524325 524019
62860 524019 524481 524421 523488 522526 522340 522859 523578 524283 525078 526063 527172 528184 528833 529093 529303 529820 530560 531013
62842E31013l79j541k687l317l062k218j554j379j193m76N57J258J263P34J63
62827E17182M6M92J061J338J597K380L466L972L615L088K908K733K281K098K795
62812E51052M129N471O574P289P173O177N211N114N531N679N734O449P696Q683
62798F37962R456J0915J3129J4900J5476J5667J6628J8455K0697K3439K6943L0734
62786H54401L4033L6886M0041M3790M7771N1889N6636O2188O7888P3065P7799
62775A446387Q2402Q6510Q9317R0553R0629Q9753Q7428Q2988P6190O7091N5741
62764B344989M2422K7829J2617l038j9012l4566m8665o0855p1311q0020q6591
62753B023799r0927r3445r4389r3491r0780q7104q3338p9381p4571o8797o2707
$$ plain form
62842 531013 530634 529093 526406 523089 520027 517809 516255 514876 513683 513207 513764 515022 516285 517019 517182
62827 517182 517228 517720 518781 520119 521716 524096 527562 531534 535149 538237 541145 543878 546159 548257 551052
62812 551052 555181 560652 567226 574515 581688 587865 593076 598190 603721 609400 615134 621583 629279 637962
62798 637962 647418 658333 671462 686362 701838 717505 734133 752588 773285 796724 823667 854401
62786 854401 888434 925320 965361 1009151 1056922 1108811 1165447 1227635 1295523 1368588 1446387
62775 1446387 1528789 1615299 1704616 1795169 1885798 1975551 2062979 2145967 2222157 2289248 2344989
62764 2344989 2387411 2415240 2427857 2424819 2405807 2371241 2322576 2261721 2190410 2110390 2023799
62753 2023799 1932872 1839427 1745038 1651547 1560767 1473663 1390325 1310944 1236373 1167576 1104869
62742A104869n6882n1451m6479m2130l8322l4693l1117k7925k5331k2914j9991
62731G07634j6455j3019j0521r093q093o869n452m303l428k160r2K087L209L130
62717F36575L053M169O288Q257R534J0845J3098J6124J8927K1079K3276K6334
62705G97559L0123L3844L7084M0125M3383M7030N1074N5288N9069O1902O4116
62694A320597O6641O9808P2900P5104P6335P6692P5516P1686O4750N5329M4400
62683B069758L2504J9631N649r197k4106l8067n0422o0958o9524p5917q0178q2619
62671A636554q3462q2787q0875p8072p4249o9135o3404n8551n5069n1600m6747
62660H92603m1117l6471l3319l0603k7594k4744k2450k0237j7763j5631j4440
$$ plain form
62742 1104869 1047987 996536 950057 907927 869605 834912 803795 775870 750539 727625 707634
62731 707634 691179 678160 667639 658546 650453 643584 638132 633829 630401 628241 628149 630236 633445 636575
62717 636575 639628 643797 650085 658342 667876 678721 691819 707943 726870 747949 771225 797559
62705 797559 827682 861526 898610 938735 982118 1029148 1080222 1135510 1194579 1256481 1320597
62694 1320597 1387238 1457046 1529946 1605050 1681385 1758077 1833593 1905279 1970029 2025358 2069758
62683 2069758 2102262 2121893 2127542 2118345 2094239 2056172 2005750 1944792 1875268 1799351 1719173 1636554
62671 1636554 1553092 1470305 1389430 1311358 1237109 1167974 1104570 1046019 990950 939350 892603
62660 892603 851486 815015 781696 751093 723499 698755 676305 656068 638305 622674 608234
62649F08234j3694j2463j0757r433q912q657q004o974o093n585n075m072k672
62636E05843j523j011p29j19O06O85o1r29j299j394j754k407k899k879k324j463
62620D86343o70k22Q6Q49K347M110N411N924N770N289N032N553O790Q009Q727
62605E49348R390J0602J2037J2945J3478J4708J7144K0075K2659K4952K7402K9992
62593G64732L2452L4923L7679M0483M2742M4223M4982M4743M3032L9908L5948
62582A205847L1320K5511J8209R952J561o548j4206k1119k7149l2512l7166m0433
62570A113267m1841m2016m1991m1863m0890l8909l6673l4628l2275k9145k5710
62559G07326k2753k0318j7958j5564j3396j1509r770q311p404o916o356n490m557
$$ plain form
62649 608234 594540 582077 571320 561887 552975 544318 536314 529340 523247 517662 512587 508515 505843
62636 505843 504320 503309 502580 502461 503067 503752 503691 502762 501463 500069 498315 495908 493009 490130 487806 486343
62620 486343 485673 485451 485537 486386 488733 492843 498254 504178 509948 515237 520269 525822 532612 540621 549348
62605 549348 558738 569340 581377 594322 607800 622508 639652 659727 682386 707338 734740 764732
62593 764732 797184 832107 869786 910269 953011 997234 1042216 1086959 1129991 1169899 1205847
62582 1205847 1237167 1262678 1280887 1290839 1292400 1285852 1271646 1250527 1223378 1190866 1153700 1113267
62570 1113267 1071426 1029410 987419 945556 904666 865757 829084 794456 762181 733036 707326
62559 707326 684573 664255 646297 630733 617337 605828 596058 587747 580343 573427 567071 561581 557024
62546E57024l806l187k577k031j686j516j298p92J6Q64J478J909K406K940L150
62531E52894K923K686K936L715M807O189P890R673J1188J2424J3711J5416J7751
62518F64203K0657K3676K6234K8348L0755L3970L7555M0751M3479M6110M8541
62507A044279N0179N0885N1154N1170N0270M7616M3130L7515L1635K6007K0616
62496A504456J5183R793N213K345J444K189M293P629J1834J6449K1472K7211L3445
62483A662956L9342M4426M9116N3834N7823N9132N5688M6628L3207J8558N810
62472B126520m236j3520k4619l8386n3537o7854p9351q6967r1000r2786r3386
62461A480878r2604q9645q4533p8253p1539o4293n6433m8703m2053l6471l1040
$$ plain form
62546 557024 553218 550031 547454 545423 543737 542221 540923 540131 540147 541011 542489 544398 546804 549744 552894
62531 552894 555817 558503 561439 565154 569961 576150 584040 593713 604901 617325 631036 646452 664203
62518 664203 684860 708536 734770 763118 793873 827843 865398 906149 949628 995738 1044279
62507 1044279 1094458 1145343 1196497 1247667 1297937 1345553 1388683 1426198 1457833 1483840 1504456
62496 1504456 1519639 1529432 1534645 1536990 1538434 1540623 1544916 1552545 1564379 1580828 1602300 1629511 1662956
62483 1662956 1702298 1746724 1795840 1849674 1907497 1966629 2022317 2068945 2102152 2120710 2126520
62472 2126520 2122284 2108764 2084145 2045759 1992222 1924368 1845017 1758050 1667050 1574264 1480878
62461 1480878 1388274 1298629 1214096 1135843 1064304 1000011 943578 894875 852822 816351 785311
62450G85311k5229j9636j5270j2342j0061p532m578j664O92K251L092L542L996
62437G02572M625N214N450N207M474L194J416n20k237l711n208o866q556j0053
62423F95001j1161j1801j2128j2403j2501j1866j0324q686p954q125q359q222
62411E71471q015p830p171n845m488l724l307k697j987j700j894k110k064j859
62397E16780j560r81k6J105K133K951L619M202M568M407L634K776K665L515M672
62382E54460N450N943O634P557Q257Q463Q411Q520R030R861J0610J0802J0480
62369F64478J0390J1264J2936J4560J5662J6642J8210K0610K3523K6493K9381
62358H64149L2498L6184M0184M3642M6047M7970N0295N2715N3536N1252M5911
$$ plain form
62450 785311 760082 740446 725176 712834 702773 695241 690663 688999 689691 691942 695034 698576 702572
62437 702572 707197 712411 717861 723068 727542 730736 732152 731632 729395 725684 720476 713610 705054 695001
62423 695001 683840 672039 659911 647508 635007 623141 612817 604131 596177 588052 579693 571471
62411 571471 563456 555626 548455 542610 538122 534398 531091 528394 526407 524707 522813 520703 518639 516780
62397 516780 515220 514239 514213 515318 517451 520402 524021 528223 532791 537198 540832 543608 546273 549788 554460
62382 554460 559910 565853 572487 580044 588301 596764 605175 613695 622725 632586 643196 653998 664478
62369 664478 674868 686132 699068 713628 729290 745932 764142 784752 808275 834768 864149
62358 864149 896647 932831 973015 1016657 1062704 1110674 1160969 1213684 1267220 1318472 1364383
62347A364383L8704L0644K2182J3775O177r0n226r874j4488j9097k3520k7616
62335A375954l1268l4176l5850l5969l4853l3358l2089l0818k8973k6566k4290
62324A027744k2569k1066j9396j7934j7382j7751j8310j8473j8212j7591j6506
62313H22554j5091j3816j2879j1895j0488q877p492o357n234m141l315k884k825
62300G17260l112l593l975m179m445m816m938m652m336m192l738k577j261n88
62286F66858n09m59l59l79r9R72K282K848K896L538M787N383M926M664N476O516
62270G09341O832P044Q256J0237J1993J3350J4729J6022J7093J8874K2412K7039
62258H83222L0961L3749L6806M1117M5844M9638N2205N3925N4726N4179N2122
$$ plain form
62347 1364383 1403087 1433731 1455913 1469688 1475865 1475775 1470549 1460675 1446187 1427090 1403570 1375954
62335 1375954 1344686 1310510 1274660 1238691 1203838 1170480 1138391 1107573 1078600 1052034 1027744
62324 1027744 1005175 984109 964713 946779 929397 911646 893336 874863 856651 839060 822554
62313 822554 807463 793647 780768 768873 758385 749508 742016 735659 730425 726284 722969 720085 717260
62300 717260 714148 710555 706580 702401 697956 693140 688202 683550 679214 675022 671284 668707 667446 666858
62286 666858 666349 665890 665531 665152 665053 666025 668307 671155 674051 677589 682376 687759 692685 697349 702825 709341
62270 709341 716173 723217 731473 741710 753703 767053 781782 797804 814897 833771 856183 883222
62258 883222 914183 947932 984738 1025855 1071699 1121337 1173542 1227467 1282193 1336372 1388494
62247A388494M8518M3030L5420K6222J6617P644l65p739j5051k2583l0061l6944
62235A453202m2857m7547n0669n2068n2145n1451m9963m7288m3627l9869l6587
62224I39131l3504l0179k6709k3413k0301j7337j4791j2899j1350r558p429n505
62212G26156m396m199m411m352l755k938k275j533j36J915L824M909N367N818
62198G19994O451O961P154P162P163P180P163P098P020P052P281P625Q011Q750
62184H22065J0316J2434J3832J3474J1867J0585J0465J0808J0485R228P602O220
62172I49381N466N698P100R360J1882J4464J7426K0992K4829K8350L1223L3422
62160A159593L4988L5859L5772L4195L0595K5022J8272J1287M641j289o083r734
$$ plain form
62247 1388494 1437012 1480042 1515462 1541684 1558301 1565945 1565580 1557841 1542790 1520207 1490146 1453202
62235 1453202 1410345 1362798 1312129 1260061 1207916 1156465 1106502 1059214 1015587 975718 939131
62224 939131 905627 875448 848739 825326 805025 787688 772897 759998 748648 739090 731661 726156
62212 726156 721760 717561 713150 708798 705043 702105 699830 698297 698161 700076 703900 708809 714176 719994
62198 719994 726445 733406 740560 747722 754885 762065 769228 776326 783346 790398 797679 805304 813315 822065
62184 822065 832381 844815 858647 872121 883988 894573 905038 915846 926331 935559 943161 949381
62172 949381 954847 960545 967645 977005 988887 1003351 1020777 1041769 1066598 1094948 1126171 1159593
62160 1159593 1194581 1230440 1266212 1300407 1331002 1356024 1374296 1385583 1390224 1388935 1382852 1373118
62148A373118j3020j6828k1061k4865k7827l0396l2837l4486l4456l2693k9938
62137A074711k6973k4185k1571j8824j5703j2597j0437r665r636r343q471p411
62125H99895o640o480p032p767p599o054m110l072k816k079m22J160J841K139
62111H50964K945M108M781M589L753K324J55k369m277m912m533l763k846j643
62097H49276k59P10O91k65j518k493l154l726m137l982l060j670k81R09J959K917
62081H31917L816M869O383Q339J0249J1616J2525J3536J4929J6305J7084J7162
62069I68730J6807J6157J5342J4930J5657J7502J9598K1215K2393K3345K3897
62058A175573K3818K3162K1688J8610J3598P718K568j330m635p970j1422j5136
$$ plain form
62148 1373118 1360098 1343270 1322209 1297344 1269517 1239121 1206284 1171798 1137342 1104649 1074711
62137 1074711 1047738 1023553 1001982 983158 967455 954858 944421 934756 925120 915777 907306 899895
62125 899895 893255 886775 879743 871976 864377 858323 854213 851141 848325 846246 845824 846984 848825 850964
62111 850964 853909 858017 862798 867387 871140 873464 873619 871250 866973 862061 857528 853765 850919 849276
62097 849276 849017 849727 850418 850153 848635 846142 842988 839262 835125 831143 828083 826413 826132 827041 829000 831917
62081 831917 835733 840602 846985 855324 865573 877189 889714 903250 918179 934484 951568 968730
62069 968730 985537 1001694 1017036 1031966 1047623 1065125 1084723 1105938 1128331 1151676 1175573
62058 1175573 1199391 1222553 1244241 1262851 1276449 1284167 1286735 1285405 1280770 1272800 1261378 1246242
62046A246242j9435k4203k8794l2731l5918l8145l9103l9010l8499l7711l6178
62035H76515l3834l1416k9463k7626k5334k2669k0063j7735j5786j4424j3556
62024F24609j2616j1231r720q547p701p050o748o823o791o302n780n737n827n290
62010E18446m094k918k120j482r14o90q37r38o75l7R66K228L187L265K796K797
61994E18980L442L655K640J107J93k30j193k886m380n140n826p162q726r503r151
61979D75820q140o990n954n224m790m199l108k039j897k608l008k363j348r69
61965D23183j187j196o43K02J121K040K567K298J632J491K112K756K796K495K436
61950D44103K757L240L670L898L934M190N102O377P170P219P179P572Q067Q249
$$ plain form
62046 1246242 1226807 1202604 1173810 1141079 1105161 1067016 1027913 988903 950404 912693 876515
62035 876515 842681 811265 781802 754176 728842 706173 686110 668375 652589 638165 624609
62024 624609 611993 600762 591042 582495 574794 567744 560996 554173 547382 541080 535300 529563 523736 518446
62010 518446 514352 511434 509314 507832 506918 506228 505391 504453 503778 503741 504707 506935 510122 513387 516183 518980
61994 518980 522422 526077 528717 529824 530017 529787 528594 525708 521328 516188 510362 503200 494474 484971 475820
61979 475820 467680 460690 454736 449512 444722 440523 437415 435376 433479 430871 427863 425500 424152 423183
61965 423183 421996 420800 420157 420359 421480 423520 426087 428385 430017 431508 433620 436376 439172 441667 444103
61950 444103 446860 450100 453770 457668 461602 465792 470894 477271 484441 491660 498839 506411 514478 522727
61936E22727Q378Q838R424R843J0261J0658J0206Q324N956M708M826N021M367
61923F23537L261K303J251l54k195l507l989l915l646l329k902k059m47J844M181
61908F10034N897O745O889O780P057P961Q728Q175O191M054K840K114Q28j002
61894F83291k411l015l418m075m599m574m258m041l731l006k217k106k837l840
61880F35163m595n155n842o814q012r172r818r523q376o978n835m959m158l421
61866E42505k796k113j139J39J597L189M818O113O736O906P269Q200R524J0981
61852F01929J2581J4303J5768J6562J6766J6898J7304J7885J8315J8307J7604
61841G84222J5998J3543J0643P709M760J593j652m356o029o788o982o556n222
$$ plain form
61936 522727 531105 539943 549367 559210 569471 580129 590335 598659 604615 609323 614149 619170 623537
61923 623537 626798 629101 630352 629998 627803 624296 620307 616392 612746 609417 606515 604456 604009 605853 610034
61908 610034 615931 622676 629565 636345 643402 651363 660091 668266 674457 678511 681351 683465 684293 683291
61894 683291 680880 677865 674447 670372 665773 661199 656941 652900 649169 646163 643946 641840 639003 635163
61880 635163 630568 625413 619571 612757 604745 595573 585755 576232 567856 560878 555043 550084 545926 542505
61866 542505 539709 537596 536457 536596 538193 541382 546200 552313 559049 565955 573224 581424 590948 601929
61852 601929 614510 628813 644581 661143 677909 694807 712111 729996 748311 766618 784222
61841 784222 800220 813763 824406 832115 836875 838468 836816 832460 826431 819643 812661 806105 800883
61828H00883l180j155M63K022L924N961P608Q542Q494P055M273J093j466l339
61814H41178n076o704p785q457r456j0941j2120j2318j1653j0469q920p530p230
61801G22519q146r133r251r083r721j0920j1305j0202q363o844o028n779n833
61788F11911n784n298m498l766l129k358j661j603k170k593k344j781j396j024
61774E72506k71N94Q21K01n80o96n5P42J193J475K165L426M718N471N827O330
61758F03867P031P354O907N991N086M270L398K512J628M04j516l779n456o065
61744F31632o145o525p266p672p328o682o342o177n558m363l180k423j786r26
61730E59259j79q9m86o35k09M29R12J269J554J564J228Q37O45M95J87q4R2P22
$$ plain form
61828 800883 797703 796548 797011 799033 802957 808918 816526 825068 833562 840617 844890 845983 844517 841178
61814 841178 836102 829398 821613 813156 803700 792759 780639 768321 756668 746199 737279 729749 722519
61801 722519 714373 705240 695989 686906 677185 666265 654960 644758 636395 629551 623523 617744 611911
61788 611911 606127 600829 596331 592565 589436 587078 585417 583814 581644 579051 576707 574926 573530 572506
61774 572506 572235 572829 573650 573851 573271 572575 572520 573262 574455 575930 578095 581521 586239 591710 597537 603867
61758 603867 610898 618252 625159 631150 636236 640506 643904 646416 648044 648448 646932 643153 637697 631632
61744 631632 625487 618962 611696 604024 596696 590014 583672 577495 571937 567574 564394 561971 560185 559259
61730 559259 559080 558991 558505 557870 557661 558090 559002 560271 561825 563389 564617 565454 566099 566594 566781 566697 566789 567511
61712E67511J290J174J53j375k600k951k715k759l507m377m585m145l765l829
61698E33520m011l911l664l641l890m136m183m057l824l505l217l184l486l904
61684D80907m100l890l340k660k144k076k464k853k590j554m75k73r89j558r04
61669D49037P81K101J876L69j081j489j007k98L23R52J582K050K361K694L079
61654D63330L376L597L913M274M353L928L069J886N12o24r88n98r8O8J08K43J88
61637D90537k70o60m59L0J58M0M16J409K199K100J293L25n79j373j959k440l185
61620D87582m302n319n754n649n332m907m391l982l836l730l410l043k997l231
61606D27699l343l196l132l444l977m300m182l755l288k849k279j549j117j516
$$ plain form
61712 567511 568801 569975 570128 568753 566153 563202 560487 557728 554221 549844 545259 541114 537349 533520
61698 533520 529509 525598 521934 518293 514403 510267 506084 502027 498203 494698 491481 488297 484811 480907
61684 480907 476807 472917 469577 466917 464773 462697 460233 457380 454790 453236 452761 452488 451499 449941 449037
61669 449037 449818 451919 453795 454164 453083 451594 450587 450289 450612 451564 453146 455196 457557 460251 463330
61654 463330 466706 470303 474216 478490 482843 486771 489840 491726 492238 491614 490626 490028 489930 489998 490106 490349 490537
61637 490537 490267 489607 489148 489178 489336 489376 489792 491201 493400 495500 496793 497118 496539 495166 493207 490767 487582
61620 487582 483280 477961 472207 466558 461226 456319 451928 447946 444110 440380 436970 433927 430930 427699
61606 427699 424356 421160 418028 414584 410607 406307 402125 398370 395082 392233 389954 388405 387288 385772
61592C85772k518l103k634j676j238j468j698j609j543j607j314m70K43J53m20
61577C64870o77m91l67n01o06o25q49j234j278p88j45M40J298K497L299K973J788
61560C69604O14j11m41l18M00J325J759J567J308J417J768K030J979J420M15l85
61544C84351k46O37J303J327J247J419J317N59j72L1R32J543J489J245J154J045
61528C99181Q32P10O21J69o85j414j654j685j893k103j884j228o51n63q51j081
61512C85821r88o67l44j30k5KR7N59J412K027J686O22m1L48J166J538J613K152
61494C96848L165L744L340K546K355K955L575L420K568J851J807J935J428M98
61480D32035K64J128K138K453K618L454M375M061K476R87M47L08k03j071j947
$$ plain form
61592 385772 383254 380151 377517 375841 374603 373135 371437 369828 368285 366678 365364 364894 365137 365290 364870
61577 364870 364193 363702 363335 362834 362228 361603 360754 359520 358242 357454 357309 357749 359047 361544 364843 367816 369604
61560 369604 370218 370107 369666 369348 369748 371073 372832 374399 375707 377124 378892 380922 382901 384321 384736 384351
61544 384351 384105 384742 386045 387372 388619 390038 391355 391914 391742 391773 392705 394248 395737 396982 398136 399181
61528 399181 400013 400723 401344 401513 400828 399414 397760 396075 394182 392079 390195 388967 388316 387753 386902 385821
61512 385821 384833 384166 383822 383692 383667 383669 383766 384325 385737 387764 389450 390072 390031 390379 391545 393083 394696 396848
61494 396848 400013 403757 407097 409643 411998 414953 418528 421948 424516 426367 428174 430109 431537 432035
61480 432035 432299 433427 435565 438018 440636 444090 448465 452526 455002 455989 456436 456744 456541 455470 453523
61465D53523k663k916k357j430j246k123l091l342l315l598l629k567q70J13j7
61450D20472l47j18L76O19P85J310K016K239J709R51P33J279K100K551K458K163
61434D41296K071K253K417K128J196K6o06m45k36p91j750j830m64J470K737K993
61418D52465K673K203J766J434J109N81k9k02K70Q94J104Q92N37N4n75j032j070
61401D63074r48r99j014o09P7O02R48J404J820J703J085O57Q83J468J859J889
61385D73899J700J477J424J727K336K976L468L887M309M649M781M659M301L864
61371E19457L623L664L584K857J508J70o60j126j632k241k621k460j767q66j54
61356E21336J94L94Q48J718K773L637M180M591N104N650N756M955L352J659N91
$$ plain form
61465 453523 450860 447944 445587 444157 442911 440788 437697 434355 431040 427442 423813 421246 420376 420489 420472
61450 420472 420125 420007 420383 421002 421787 423097 425113 427352 429061 430012 430745 432024 434124 436675 439133 441296
61434 441296 443367 445620 448037 450165 451361 451387 450781 450336 450100 449309 447559 445729 445265 446735 449472 452465
61418 452465 455138 457341 459107 460541 461650 462231 462202 462000 462270 463164 464268 465160 465697 465751 465176 464144 463074
61401 463074 462126 461127 460113 459504 459581 460183 461131 462535 464355 466058 467143 467800 468683 470151 472010 473899
61385 473899 475599 477076 478500 480227 482563 485539 489007 492894 497203 501852 506633 511292 515593 519457
61371 519457 523080 526744 530328 533185 534693 534863 534203 533077 531445 529204 526583 524123 522356 521490 521336
61356 521336 521530 521924 522772 524490 527263 530900 535080 539671 544775 550425 556181 561136 564488 566147 566738
61341E66738K71L76O19Q91J070J022P96N76M70M66N81P90Q74N76l0o06r36j026
61323E73518p98k5J317K855M154N040N567N893O331P223Q468R457R792R973J0849
61308F59614J2522J4206J5312J6091J6890J7320J6689J4929J2488R474N702J621
61296H12858j703l848n574p595r455j0317j0348j0447j0907j1206j1137j1167
61284G09154j1469j1399j0332q496o603n057l844k832j887r26m0O49J279K047
61270F50244K733K915K708K660K810K550J777J383K122L579M842N680O343O718
61256F99064O445N629M666L531J959K58q19j114j325k027k921l316k969k233j606
61241G03222j330j296j175o85K51J442K399K508J633O01N91J845L442M602N585
$$ plain form
61341 566738 567009 567385 568004 568895 569965 570987 571783 572359 572829 573295 573876 574666 575540 576116 576086 575480 574544 573518
61323 573518 572720 572695 574012 576867 581021 586061 591628 597521 603852 611075 619543 629000 638792 648765 659614
61308 659614 672136 686342 701654 717745 734635 751955 768644 783573 796061 805535 811237 812858
61296 812858 811155 807307 801733 794138 784683 774366 764018 753571 742664 731458 720321 709154
61284 709154 697685 686286 675954 667458 660855 655798 651954 649122 647235 646309 646269 646918 648197 650244
61270 650244 652977 655892 658600 661260 664070 666620 668397 669780 671902 675481 680323 686003 692346 699064
61256 699064 705509 711138 715804 719335 721294 721552 720733 719619 718294 716267 713346 710030 707061 704828 703222
61241 703222 701892 700596 699421 698736 698987 700429 702828 705336 706969 707570 708161 710006 713448 718050 723635
61226G23635O857Q037Q411Q117P965Q269Q657Q900R126R234Q894Q296Q142Q672
61212H41212R214R014P987O508M927L566K763K612K873L321L901M532N107N794
61198I13331O945Q633J0565J2496J4350J5866J6622J6472J5574J3919J1366Q147
61186A064286M839J706j319l925n469o039o663p922r105r418r402j0190j1775
61173I89604j3074j3551j3728j3955j3780j2930j2107j2153j2968j3813j4273
61162H43272j4357j4002j3137j2154j1548j1091r962p892n602l879k644j309L88
61149G36083K243L920N025N085M039K497J043m69k377m190m895m266l085j949
61135G38704o81Q55K216L215M458O369Q272R317R856J1006J3119J5574J7917K0225
$$ plain form
61226 723635 730492 738529 746940 755057 763022 771291 779948 788848 797974 807208 816102 824398 832540 841212
61212 841212 850426 859440 867427 873935 878862 882428 885191 887803 890676 893997 897898 902430 907537 913331
61198 913331 920276 928909 939474 951970 966320 982186 998808 1015280 1030854 1044773 1056139 1064286
61186 1064286 1069125 1070831 1069512 1065587 1060118 1054079 1047416 1039494 1030389 1020971 1011569 1001379 989604
61173 989604 976530 962979 949251 935296 921516 908586 896479 884326 871358 857545 843272
61162 843272 828915 814913 801776 789622 778074 766983 757021 749129 743527 739648 737004 735695 736083
61149 736083 738326 742246 747271 752356 756395 758892 759935 759466 757089 752899 748004 743738 740653 738704
61135 738704 738023 738878 741094 744309 748767 755136 763408 772725 782581 793587 806706 822280 840197 860422
61121H60422K2356K3791K4580K5577K7299K9204L0545L1366L2080L2518L2139
61110A171877L0996K9774K8785K7551K5621K3361K1510K0212J8851J6789J3872
61099A429199J0270O195J978j961n442q555j1111j2565j2824j2772j3258j3875
61087A355279j3477j1840r970q738p997p209o141m725l003j523q92o70L45K266
61073A281705L638L493K809K960L692L805L118K366J682N51r42k098k728l144
61059A300907l227k668k044k380l550m306m014l301k773k230j376l57P65K129
61045A271575L498M452N245O475P846Q461Q462R066J0612J1918J2185J2196J2900
61032A384891J4016J4901J5724J6818J7828J8501J9495K1442K3946K6431K9198
$$ plain form
61121 860422 882778 906569 931149 956726 984025 1013229 1043774 1075140 1107220 1139738 1171877
61110 1171877 1202873 1232647 1261432 1288983 1314604 1337965 1359475 1379687 1398538 1415327 1429199
61099 1429199 1439469 1445664 1447642 1445681 1440239 1431684 1420573 1408008 1395184 1382412 1369154 1355279
61087 1355279 1341802 1329962 1319992 1311254 1303257 1296048 1289907 1285182 1282179 1280656 1279764 1279094 1279439 1281705
61073 1281705 1285343 1288836 1291645 1294605 1298297 1302102 1305220 1307586 1309268 1309819 1308877 1306779 1304051 1300907
61059 1300907 1297680 1295012 1292968 1290588 1287038 1282732 1278718 1275417 1272644 1270414 1269038 1268681 1269446 1271575
61045 1271575 1275073 1279525 1284770 1291245 1299091 1307552 1316014 1325080 1335692 1347610 1359795 1371991 1384891
61032 1384891 1398907 1413808 1429532 1446350 1464178 1482679 1502174 1523616 1547562 1573993 1603191
61021A603191L2590L5888L8201M0017M2704M6865N2265N9050O7948P9355R3158
61010B191232J09414J28401J50039J73813J99101K25306K52330K81627L16147
61001D027410L58450M09461M69664N40452O23256P18841Q29294R59267J112589
60992A0048684J288457J482655J687095J876068J988453J937891J665354J197309
60984B3171966O50513J70233j44460k67663k25131p2478J01898J79664N6740k91757
60974B3329525p86989j291080j683068j906097j964858j897169j748979j561256
60966A0490029j364115j175472j003697q51520p18681o03642n05059m22038l53231
60957C492574k96653k50680k14251j85788j62946j43896j27961j14536j02371
$$ plain form
61021 1603191 1635781 1671669 1709870 1749887 1792591 1839456 1891721 1950771 2018719 2098074 2191232
61010 2191232 2300646 2429047 2579086 2752899 2952000 3177306 3429636 3711263 4027410
61001 4027410 4385860 4795321 5264985 5805437 6428693 7147534 7976828 8936095 10048684
60992 10048684 11337141 12819796 14506891 16382959 18371412 20309303 21974657 23171966
60984 23171966 23822479 23992712 23848252 23580589 23355458 23282980 23384878 23564542 23621282 23329525
60974 23329525 22542536 21251456 19568388 17662291 15697433 13800264 12051285 10490029
60966 10490029 9125914 7950442 6946745 6095225 5376544 4772902 4267843 3845805 3492574
60957 3492574 3195921 2945241 2730990 2545202 2382256 2238360 2110399 1995863 1893492
60948A893492r0673p9975p1100o3892n7773n2928m9876m8240m6913m5378m4024
60937A242720m3110m2155m0576l8408l6096l3826l1383k8497k5273k2178j9634
60926H81584j7658j6006j4638j3710j3093j2277j0941r390q128p235o467n781
60914G46260n451n568n756n461m481l188k213j881j942j949j849k083k990m304
60900F97144n330n561n084m487m419n131o332p478q194q461q460q308p935p179
60886F04785o086n043m449m210l851l264l000l509m416m921m760m331m006l766
60872E45173l469k986k121q25M19R30O81M15P64J592K397K942L261L379L386L562
60856E59500M099M764N108M937M413L742K948J954Q19j65o65o30l61j62l6J9l28
$$ plain form
60948 1893492 1802819 1722844 1651744 1587852 1530079 1477151 1427275 1379035 1332122 1286744 1242720
60937 1242720 1199610 1157455 1116879 1078471 1042375 1008549 977166 948669 923396 901218 881584
60926 881584 863926 847920 833282 819572 806479 794202 783261 773871 765743 758508 752041 746260
60914 746260 740809 735241 729485 724024 719543 716355 714142 712261 710319 708370 706521 704438 701448 697144
60900 697144 691814 686253 681169 676682 672263 667132 660800 653322 645128 636667 628207 619899 611964 604785
60886 604785 598699 593656 589207 584997 581146 577882 574882 571373 566957 562036 557276 552945 548939 545173
60872 545173 541704 538718 536597 535772 536191 537121 537802 538217 538981 540573 542970 545912 549173 552552 555938 559500
60856 559500 563599 568363 573471 578408 582821 586563 589511 591465 592284 592119 591454 590824 590463 590301 590265 590284 589956
60839E89956j460l211m937o258p317q240q753q582p948p290o787o358n975n627
60825E01213n174m497l759l263l099l151l358l687l878l597k907k365k452l063
60811D52963l693m002m022l849l450k803k052j385q00j88M33R18J177J243J162
60796D31652R72P65O35N42M19L95O76J140J356J140Q71J020J569K064K083J534
60780D48833O46j08l25j67k99j100k038k260j664r66p20p59o82n36o27r16r30
60763D35382l63M81R98R57P00O07N84L40m3j90p6j34n17p57m45J28M18M52O27
60744D39149R20P90k1j088j851k231k539k980l397l421k866j953j184q82r73j155
60728D14318j158p79j7P03Q17L90K44Q97J722J675O68l29n32q3M67R09J331J708
$$ plain form
60839 589956 588496 585285 580348 574090 566773 558533 549780 541198 533250 525960 519173 512815 506840 501213
60825 501213 496039 491542 487783 484520 481421 478270 474912 471225 467347 463750 460843 458478 456026 452963
60811 452963 449270 445268 441246 437397 433947 431144 429092 427707 426907 426719 427152 428070 429247 430490 431652
60796 431652 432624 433389 434024 434566 434985 435380 436056 437196 438552 439692 440563 441583 443152 445216 447299 448833
60780 448833 449479 449371 449046 448879 448580 447480 445442 443182 441518 440552 439832 439073 438391 437855 437228 436312 435382
60763 435382 435019 435500 436498 437455 438155 438762 439346 439686 439643 439453 439377 439243 438726 437969 437524 437652 438070 438522 439149
60744 439149 440069 440859 440838 439750 437899 435668 433129 430149 426752 423331 420465 418512 417328 416446 415473 414318
60728 414318 413160 412381 412364 413067 413884 414274 414518 415415 417137 418812 419480 419151 418619 418536 419003 419912 421243 422951
60710D22951J843J574R90M39K89N39P38N24R9p6M6J9m57j150j586j511j063n97
60692D23611l98m63o23p99j000j074q30m66l79m26M7J067J636J052J08J36J192
60675D22391K139K314K206K392K745K905K862K664K086R41n91k126l232l488k794
60660D33414j721j074j044j138r93p17m25j1N08R32J289J831K468K675K204J412
60644D39610P67L61P3k12o80j443k259k700k728k655k589k393k093j802j239r2
60628D17926J099J287M32j76M44J609J913R92k38q15o39k93k98n67n18J42Q88
60611D23188J016O69O12J049J407J402J449J705J591P25l41r03r38o99o2J038
60595D32908K057K394K089J530Q63L16M70J556K833L405L339L269L271K919K193
$$ plain form
60710 422951 424794 426368 427358 427797 428086 428625 429363 429887 429986 429910 429956 429975 429518 428368 426782 425271 424208 423611
60692 423611 423213 422750 422127 421328 420328 419254 418424 417958 417579 417153 417200 418267 419903 420955 421063 421199 422391
60675 422391 424530 426844 429050 431442 434187 437092 439954 442618 444704 445645 445054 442928 439696 436208 433414
60660 433414 431693 430619 429575 428437 427444 426727 426302 426291 426799 427731 429020 430851 433319 435994 438198 439610
60644 439610 440377 440738 440811 440599 439919 438476 436217 433517 430789 428134 425545 423152 421059 419257 418018 417926
60628 417926 419025 420312 420744 420568 421012 422621 424534 425526 425288 424473 423834 423541 423243 422676 422158 422300 423188
60611 423188 424204 424873 425485 426534 427941 429343 430792 432497 434088 434813 434472 433569 432631 431932 431870 432908
60595 432908 434965 437359 439448 440978 441841 442157 442627 444183 447016 450421 453760 457029 460300 463219 465412
60580D65412J530J084O80M93J001K147L204L638L692L952M688N748O781P539Q101
60565E19690Q744R522J0203J0768J1590J2710J3341J2600J0511P861N203K564
60553F35307j27k746n010o422o425n111l464k347j437J11K221L959M986O074P865
60538F27434R977J1715J3066J4507J6227J8116K0189K2569K4947K6460K6192K3832
60526H55231J9810J4886R606M152j301o316j0384j3252j4916j5504j5302j4746
60514H11964j4066j3057j1474r483p441n364k990l52K098M027N637P437R746J2506
60500G89188J5531J8900K2942K7685L2433L6420L9909M3977M8885N3161N5041
60489A184072N4338N2270M9679M6260M1496L5470K8573K1144J3705O881N73o429
$$ plain form
60580 465412 466942 468026 468706 469199 470200 472347 475551 479189 482881 486833 491521 497269 504050 511589 519690
60565 519690 528434 537956 548159 558927 570517 583227 596568 609168 619679 627540 632743 635307
60553 635307 635180 632434 627424 621002 614577 609466 606002 603655 602218 602329 604550 608509 613495 619569 627434
60538 627434 637411 649126 662192 676699 692926 711042 731231 753800 778747 805207 831399 855231
60526 855231 875041 889927 899533 903685 902384 896068 885684 872432 857516 842012 826710 811964
60514 811964 797898 784841 773367 763884 756443 751079 748089 747737 749835 753862 759499 766936 776682 789188
60500 789188 804719 823619 846561 874246 906679 943099 983008 1026985 1075870 1129031 1184072
60489 1184072 1238410 1290680 1340359 1386619 1428115 1463585 1492158 1513302 1527007 1533888 1534461 1528032
60477A528032j5358k6077l7096m6929n5058o1562o6170o8088o6825o2990n8004
60466I63875n3064m8468m3922l9201l4421k9919k6082k3126k0878j8910j6994
60455F08890j5258j3798j2399j0857r310q066p251o780o441n864m762l416k558
60442E02130k484k650k472k150k205k510k428j752r88o76q56j195j285q66j13
60427D77500L91K73j53l33k66l45o09o31j83M89J075J530J866K015J961J834J800
60410D88214J989K391K672K315J325N32P93J933K949L182K864K523K279J943J470
60395E19374J128J264J926K697L108L225L529M084M316L902L337L186L240L065
60381E61381K840K965L121K705J939J638J914K071J881J973K646L193K918K079
$$ plain form
60477 1528032 1512674 1486597 1449501 1402572 1347514 1285952 1219782 1151694 1084869 1021879 963875
60466 963875 910811 862343 818421 779220 744799 714880 688798 665672 644794 625884 608890
60455 608890 593632 579834 567435 556578 547268 539202 531951 525171 518730 512866 508104 504688 502130
60442 502130 499646 496996 494524 492374 490169 487659 485231 483479 482491 481815 480959 479764 478479 477613 477500
60427 477500 477891 478164 478011 477678 477412 477067 476458 475827 475644 476133 477208 478738 480604 482619 484580 486414 488214
60410 488214 490203 492594 495266 497581 498906 499438 500231 502164 505113 508295 511159 513682 515961 517904 519374
60395 519374 520502 521766 523692 526389 529497 532722 536251 540335 544651 548553 551890 555076 558316 561381
60381 561381 564221 567186 570307 573012 574951 576589 578503 580574 582455 584428 587074 590267 593185 595264
60367E95264J314P56L02K67J040K265L034K985K743L083L939M516M317L825L944
60352F33594M931O213P263Q152R028R551R263Q225O838N341L842K439R24j231
60338G14373l982o298p378p829q746r961j0291r327p878o617n411m228l578l614
60324F19235l729l495l212l073k615j520k73N25R19J230J568K159L544N860Q427
60309F25550J0517J2082J3364J4330J5008J5766J6684J7148J6661J5599J4573
60298G87282J3469J1710R140N986K303j975o610j1159j5220j8221j9431j8785
60286G38489j7313j6136j5262j4001j2156j0172q325o592n239m779n271o165o883
60273F10195p141o801o004n336n284n529n302m508l858l770l728l042j813q17
$$ plain form
60367 595264 596578 597334 597636 597903 598943 601208 604242 607227 609970 613053 616992 621508 625825 629650 633594
60352 633594 638525 644738 652001 660153 669181 678732 687995 696220 703058 708399 712241 714680 715604 714373
60338 714373 710391 704093 696715 688886 680140 670179 659888 650561 642683 636066 630655 626427 622849 619235
60324 619235 615506 612011 608799 605726 603111 601591 601318 601843 602762 603992 605560 607719 611263 617123 625550
60309 625550 636067 648149 661513 675843 690851 706617 723301 740449 757110 772709 787282
60298 787282 800751 812461 821601 827587 829890 827915 821305 810146 794926 776705 757274 738489
60286 738489 721176 705040 689778 675777 663621 653449 645124 638532 633293 628514 623243 617078 610195
60273 610195 603054 596253 590249 584913 579629 574100 568798 564290 560432 556662 552934 549892 548079 547262
60259E47262o60j221j817j765j000j07L41M56P59J372J846J829J468J076P63N89
60243E51191O95R88R52J90q88j293n30Q19J731J869J792K075K585K859K932L303
60227E71270M156N041N479N493N345N128M903M957N512O299O868P266Q034R396
60213F55147J0769J1275J0710R762R292R544J0109J0484J0441R910Q898P715O935
60200G80991O839P030O892O234N195L839K263Q48j31r79k089l206l855m362n510
60185G99999p112p983p607o858o604o591o330o235o854p672p688o848n931n247
60171G04439m378l166k058j406j093r73j040j171j232j460k138k833k675j536
60157F77280k89L50O34J099J563J443P05J5n1M95J310K231L260M196M615M327
$$ plain form
60259 547262 546602 545381 543564 541799 540799 540692 541033 541489 542248 543620 545466 547295 548763 549839 550602 551191
60243 551191 551886 552874 553826 554016 553128 551835 551305 552124 553855 555724 557516 559591 562176 565035 567967 571270
60227 571270 575426 580467 585946 591439 596784 601912 606815 611772 617284 623583 630451 637717 645751 655147
60213 655147 665916 677191 687901 697663 706955 716499 726608 737092 747533 757443 766341 774056 780991
60200 780991 787830 794860 801752 807986 813181 817020 819283 820131 820000 819021 816932 813726 809871 805509 799999
60185 799999 792887 784904 777297 770439 763835 757244 750914 744679 737825 730153 722465 715617 709686 704439
60171 704439 700061 696895 694837 693431 692338 691365 690325 689154 687922 686462 684324 681491 678816 677280
60157 677280 676991 677341 677975 679074 680637 682080 682785 682800 682749 683244 684554 686785 690045 694241 698856 703183
60141G03183L766L595L968M501N026N903P306Q651R211R081Q982R262R577R527
60127H01539R054Q139O649M754L099K193J840J492J111J280K334L610L922K926
60113H53942J658J385K106K678K295J257J26j051k361l466m127m759n824o988
60099H36871p556p467p156o610n467l963k932k693k652k221j467o89o8P7o28j853
60083G83526k569k240j467r83o75j93K1p52k302l675m571n678p490r510j0932
60068G30510j1530j1468j0771r510q201p414p013o341n208m219l943m122m017
60055F36753l296k246j203k58N45J102J579K444L806M975N125M428M042M803O273
60040F68872P371P648P531P362O848N622L948K429J229P5j103k013k603l277m336
$$ plain form
60141 703183 706949 710544 714512 719013 724039 729942 737248 745899 755110 764191 773173 782435 792012 801539
60127 801539 810593 818732 825381 830135 833234 835427 837267 838759 839870 841150 843484 847094 851016 853942
60113 853942 855600 856985 859091 861769 864064 865321 865447 864396 862035 858569 854442 849683 843859 836871
60099 836871 829315 821848 814692 808082 802615 798652 795720 793027 790375 788154 786687 785998 785930 786007 785379 783526
60083 783526 780957 778717 777250 776267 775592 775399 775420 774668 772366 768691 764120 758442 750952 741442 730510
60068 730510 718980 707512 696741 687231 679030 671616 664603 658262 653054 648835 644892 640770 636753
60055 636753 633457 631211 630008 629750 630295 631397 632976 635420 639226 644201 649326 653754 657796 662599 668872
60040 668872 676243 683891 691422 698784 705632 711254 715202 717631 718860 718935 717832 715819 713216 709939 705603
60025G05603n617o961q550j0383j1803j2183j1808j1415j1082j0243q895p846
60013E88817p527p281o338m964l983l551l051k055p94K81R35J048N25m28j197
59998E50437j180l34Q17J704K182K482K837L320M003M937N820O014N300M357M025
59983E96721M196L961K872J456L53m49j234j986k605l303m252n087n178m342l017
59968E78106j822j107p72l67N02J731K839L534L970M464N211O184O902O477M517
59953F20369K002M34L2m26j681k859k817j788q83o01o41p33q24p98p42j167k250
59936F04627l180l027j914o02P20K292L802M634M950N500O282O523O049N529N134
59921F47319M039J870l28j334j195p32k03O95J891K873L440L856M294M631M811
$$ plain form
60025 705603 699986 693025 684475 674092 662289 650106 638298 626883 615801 605558 596663 588817
60013 588817 581290 574009 567671 562707 558724 555173 552122 550067 549273 549554 550489 551537 552062 551634 550437
59998 550437 549257 548923 549740 551444 553626 556108 558945 562265 566268 571205 577025 583039 588339 592696 596721
59983 596721 600917 604878 607750 609206 609559 609110 607876 605890 603285 599982 595730 590643 585465 581123 578106
59968 578106 576284 575177 574405 574038 574540 576271 579110 582644 586614 591078 596289 602473 609375 615852 620369
59953 620369 622371 622805 622837 622411 620730 617871 615054 613266 612383 611782 611141 610408 609584 608786 608044 606877 604627
59936 604627 601447 598420 596506 595904 596624 598916 602718 607352 612302 617802 624084 630607 636656 642185 647319
59921 647319 651358 653228 652900 651566 650371 649639 649436 650131 652022 654895 658335 662191 666485 671116 675927
59906F75927M905M747M002K757J617R82N02l92j593k309k019j050r0N60J021J403
59890F90970J795K523L820N252O025N972N747N812N927N914O296P475Q820R292
59876G71640Q782Q144P919P706O838N257L561K396J859J328J07j661k993l248
59862H17635k911k872l329l900m355m735m984n122n438n929n912m961l826l585
59848G55776l997l747k236k50J277K265L017L712M617O010P455P833O612M559
59834G92903K832J838J446J787L202N491P678Q578P560M911J594j518m227o718
59820H27357q870j0182j0378r662q427p053n923n209m663l981l367l301l800m350
59806G38191m533m327l863l358l182l499l889l905l822m207m886n140m866m719
$$ plain form
59906 675927 680832 685579 689581 692338 693955 694937 695439 695047 693454 691145 689126 688076 687986 688546 689567 690970
59890 690970 692765 695288 699108 704360 710385 716357 722104 727916 733843 739757 746053 753528 762348 771640
59876 771640 780422 788566 796485 804191 811029 816286 819847 822243 824102 825430 825537 823876 820883 817635
59862 817635 814724 811852 808523 804623 800268 795533 790549 785427 779989 774060 768148 763187 759361 755776
59848 755776 751779 748032 745796 745546 746823 749088 752105 755817 760434 766444 773899 781732 788344 792903
59834 792903 795735 797573 799019 800806 804008 809499 817177 825755 833315 838226 839820 838302 834075 827357
59820 827357 818487 808305 797927 788265 779838 772785 766862 761653 756990 753009 749642 746341 742541 738191
59806 738191 733658 729331 725468 722110 718928 715429 711540 707635 703813 699606 694720 689580 684714 679995
59792F79995m947m956m287l354k845k967l439l769l449k481j701j795k134j517
59778F36354j32N38L6k27Q75K512L364L698M586N842O284N779N621O680Q285R301
59762F99396R498R437R547R774R865R728R547R623J0008J0438J0749J1138J1758
59749H30506J2318J2395J1959J1230J0182Q593O566M614L106J901O15q23k043
59736I11119k698l000l557m562n381n282m401l504k917k333j639j271j409j495
59722H67670r54jO80P29K73l84q15o14J33P32N86r5n91m71J15P55J187J472J895
59703H72302K527K919K617J994K066L232M661N252M873M335M415N225O191O337
59689I28946M837J738j876m632n828n704n045m623m758n249n716o011o176o286
$$ plain form
59792 679995 675048 670092 665805 662451 659606 656639 653200 649431 645982 643501 641800 640005 637871 636354
59778 636354 636222 636760 636796 636569 637444 639956 643320 647018 651604 657446 663730 669509 675130 681810 690095 699396
59762 699396 708894 718331 727878 737652 747517 757245 766792 776415 786423 796861 807610 818748 830506
59749 830506 842824 855219 867178 878408 888590 897183 903749 908363 911469 913370 913985 913162 911119
59736 911119 908421 905421 901864 897302 891921 886639 882238 878734 875817 873484 871845 870574 869165 867670
59722 867670 866716 866715 867395 868124 868397 868013 867198 866584 866717 867449 868035 867940 867349 866878 866993 867748 868935 870407 872302
59703 872302 874829 877748 880365 882359 884425 887657 892318 897570 902443 906778 911193 916418 922609 928946
59689 928946 933783 935521 933645 929013 923185 917481 912436 907813 903055 897806 892090 886079 879903 873617
59675H73617o614p595r129j0194r824q354o932n987m991l756k910k814k883k403
59661G89231j319J03J631K819L171K900K820L247L800M375N306O208N938M314
59647H34544K660J805P20j786n039p438q637r513j0508j1302j1744j1864j1286
59634G50612r763q062p187o894o163m930m151m184m416m560n147o370p482p771
59620F63532p320o499n450m406l791l601l307k705k243k195k072j301o1R99J546
59605F21126J730J777J744J558J164P31O32J054J660J922J708J282Q54M96L88
59590F39826O25Q58N72j55o94p38o98j051j718k328k772l156l430l427l189k977
59574F15548k849k515j877j470j890k718k686j349J3l5j035j201Q1J591K255K391
$$ plain form
59675 873617 867003 859408 850279 840085 830261 821907 814975 808988 803997 800241 797331 794517 791634 789231
59661 789231 787912 788015 789646 792465 795636 798536 801356 804603 808403 812778 818084 824292 830230 834544
59647 834544 837204 839009 839729 837943 832904 825466 816829 807316 796808 785506 773762 761898 750612
59634 750612 740849 732787 725600 718706 712543 707613 703462 699278 694862 690302 685155 678785 671303 663532
59620 663532 656212 649713 644263 639857 636066 632465 629158 626453 624210 622015 619943 618642 618581 619580 621126
59605 621126 622856 624633 626377 627935 629099 629830 630462 631516 633176 635098 636806 638088 638942 639438 639826
59590 639826 640451 641309 641881 641726 641032 640294 639596 638545 636827 634499 631727 628571 625141 621714 618525 615548
59574 615548 612699 610184 608307 606837 604947 602229 599543 598194 598207 598172 597137 595936 596017 597608 599863 602254
59558F02254K417J706j55k032k435j461l34M91J452K423K599J953J587K271L530
59543F16266M561N272O022O976Q064R198J0307J1518J3332J6003J8575J9037J5978
59530G61109R954L214j866m200m336l628l007k468j673p26j90n44j791l384m503
59515G41961m787m892n759p259q238q122p604p328o964o245n907o505p113o503
59501F48735n055m155m053l660k373p84M68J351J836J723J292J232J671K116K382
59486F42726K772L261L427L366L693M454M946M862M780N141N623N821N917O215
59472G07004O568O595O076M981L536K246J346M42p65j681j563q14m73n32M2J516
59456G34524K948L854N010O962Q865R566R057Q094P096O158N498N118M405K769
$$ plain form
59558 602254 604671 606377 606222 604190 601755 600294 599960 600451 601903 604326 606925 608878 610465 612736 616266
59543 616266 620827 626099 632121 639097 647161 656359 666666 678184 691516 707519 726094 745131 761109
59530 761109 771063 774277 772411 768211 763875 760247 757240 754772 753099 752373 752183 751639 749848 746464 741961
59515 741961 737174 732282 726523 719264 711026 702904 695300 687972 681008 674763 668856 662351 655238 648735
59501 648735 643680 639525 635472 631812 629439 628655 629123 630474 632310 634033 635325 636557 638228 640344 642726
59486 642726 645498 648759 652186 655552 659245 663699 668645 673507 678287 683428 689051 694872 700789 707004
59472 707004 713572 720167 726243 731224 734760 737006 738352 738794 738029 736348 734785 733971 733498 732966 733008 734524
59456 734524 737472 741326 746336 753298 762163 771729 780786 788880 795976 802134 807632 812750 817155 819924
59442H19924M29j897l786n212o241o976p495p535o611m769k831j582j055q26o00
59427G62937k03N49J681L045M637O692R226J1898J4385J6547J8184J9126J9643
59414H88347K0236K0991K1689K2556K4105K5825K5759K1879J3824L260o936j3908
59402A067627j6192j4493j0836o690k150L054Q232J1642J1354O428k074j1187
59390A044715j7851k0994k1529k0605j8684j6191j3962j2517j1624j0836r934
59379H69988q675o881m969l668k984k187j046k31j89m54m27o4N50J549K766L638
59363H46716M049M566N451O205O477O726P508Q792J0352J2123J3756J4638J4803
59350I62162J5166J6294J7656J8501J8792J8720J8056J6585J4598J2512J0478
$$ plain form
59442 819924 820353 818456 814670 809458 803217 796241 788746 781211 774600 769831 767000 765418 764363 763537 762937
59427 762937 762734 763283 764964 768009 772646 779338 788564 800462 814847 831394 849578 868704 888347
59414 888347 908583 929574 951263 973819 997924 1023749 1049508 1071387 1085211 1088471 1081535 1067627
59402 1067627 1051435 1036942 1026106 1019416 1017266 1020320 1028552 1040194 1051548 1057976 1055902 1044715
59390 1044715 1026864 1005870 984341 963736 945052 928861 914899 902382 890758 879922 869988
59379 869988 861313 854432 849463 845795 842811 840624 839578 839347 839158 838704 838277 838213 838763 840312 843078 846716
59363 846716 850765 855331 860782 866987 873464 880190 887698 896490 906842 918965 932721 947359 962162
59350 962162 977328 993622 1011278 1029779 1048571 1067291 1085347 1101932 1116530 1129042 1139520
59339A139520Q546O560L761m16m947p886q956j0194j3193j6995j9697k0900k1324
59326A033879k1063j9822j8238j7415j7359j7154j6425j5536j4573j3286j1855
59315H51153j0758r943r084q466q627r258r365q590p483o495n486m295l068j925
59301G48310q84q2L82Q39J765L174M736O268P784R292J0989J3176J5414J6111
59287H37274J3823Q832K879k468o557r131r984r142o869l454N79M309P085R186
59273H36362J1292J3418J4967J5610J5593J5211J4534J3559J2285J0618Q603O477
59261I88529M261J625j420m133n829o643p051p103o744o381o316o016m796l044
59247I28939j887j745j928j699j016j86O02J230J620J795J695J057j91j596k654
$$ plain form
59339 1139520 1148066 1154626 1158387 1157971 1153024 1145138 1136182 1125988 1112795 1095800 1076103 1055203 1033879
59326 1033879 1012816 992994 974756 957341 939982 922828 906403 890867 876294 863008 851153
59315 851153 840395 830452 821368 812902 804275 795017 785652 777062 769579 763084 757598 753303 750235 748310
59301 748310 747426 747344 747726 748565 750330 753504 758240 764508 772292 781584 792573 805749 821163 837274
59287 837274 851097 859929 862808 860340 853783 844652 834668 825526 818657 815203 815782 820091 827176 836362
59273 836362 847654 861072 876039 891649 907242 922453 936987 950546 962831 973449 982052 988529
59261 988529 992790 994415 992995 988862 983033 976390 969339 962236 955492 949111 942795 936779 931983 928939
59247 928939 927052 925307 923379 921680 920664 920478 921080 922310 923930 925725 927420 928477 928286 926690 924036
59232I24036l428m352n583o916q102q937r314r495r983j0843j1566j1843j1921
59219H11753j1860j1219r950q832q262p430n636l708k920l006k521j025L64O59
59205G36407K26N1N63J459K170K363K303K675L705M746N180N248N389N315M604
59190G82404L760L641M090M112L376K581K304K330K228J813J034Rp66r40q98j249
59174H09829j854k127k087k239k475k095j055k16r9j57L36J204J577Q16r18k752
59158G95688l818m128m623n959p587q528q720q846r108r052q550q141q148q222
59144F92258p951p430p035o922o857o367n201l827l120l197l059j831L5J450K081
59129F33027K491L195M286N579O508O368N333M758N670P480Q961R918J0812J1384
$$ plain form
59232 924036 920608 916256 910673 903757 895655 886718 877404 867909 857926 847083 835517 823674 811753
59219 811753 799893 788674 778724 769892 761630 754200 748564 744856 741936 738930 736409 735384 735748 736407
59205 736407 736633 736684 737247 738706 740876 743239 745542 748217 751922 756668 761848 767096 772485 777800 782404
59190 782404 786164 789805 793895 798007 801383 803964 806268 808598 810826 812639 813673 813682 812916 811976 811078 809829
59174 809829 807975 805848 803761 801522 799047 796952 795897 795681 795582 795425 795761 796965 798542 799358 798440 795688
59158 795688 791870 787742 783119 777160 769573 761045 752325 743479 734371 725319 716769 708628 700480 692258
59144 692258 684307 676877 669842 662920 656063 649696 644495 640668 637548 634351 631292 629461 629496 630946 633027
59129 633027 635518 638713 642999 648578 655086 661454 666787 671545 677215 684695 693656 703574 714386 725770
59115G25770J0976R973R547R991J0460J0352R840R028P746O246N160M513L711
59102H33313K572J502O33l85j643k857l940m890n275m713l769l353l406l095k230
59087G98464j429j021q44j075k109l657n031o208p509q416q129p198p051p776
59073G31011p920o789n462m980m949m621m114l857l794l737l664l274k218j108
59059F70524j157k477l773m159m056l882l162j721n32m92j211j745j743j215j06
59044F39093J214J838J391N31j01n58p51k1J713L312L801L593L587L833M004M461
59028F70940N857Q071J0384J2360J3969J5140J5815J6084J5894J4970J3345J1485
59016H24314R538P024L647r7l453o013p607q187q109p884p404o095m050k174r52
$$ plain form
59115 725770 736746 746719 756266 766257 776717 787069 796909 805937 813683 819929 825089 829602 833313
59102 833313 835885 837387 838020 837635 835992 833135 829195 824305 819030 814317 810548 807195 803789 800694 798464
59087 798464 797035 796014 795170 794095 791986 788329 783298 777090 769581 761165 753036 745838 738787 731011
59073 731011 723091 716302 710840 705860 700911 696290 692176 688319 684525 680788 677124 673850 671632 670524
59059 670524 669367 666890 663117 658958 654902 651020 647858 646137 645605 645113 643902 642157 640414 639199 639093
59044 639093 640307 642145 643536 644067 643966 643408 642657 642636 644349 647661 651462 655055 658642 662475 666479 670940
59028 670940 676797 684868 695252 707612 721581 736721 752536 768620 784514 799484 812829 824314
59016 824314 833852 840876 844523 844426 840973 834960 827353 819166 811057 803173 795769 789674 785624 783450 782498
59001G82498J45J691L487M999N929O113N651N181N144M831L312J232K36M59K65
58986H31173j032j955j279P3P18R07J646K889M018N112O454P618Q286R157J0833
58971H84618J2573J3453J3913J4846J5812J5645J4330J2918J1899J0933R837Q583
58959A039360O669L663J92k777n362q333j1540j4065j5734j7205j8532j8905j8111
58946I19320j7054j6459j5922j4766j3115j1542j0149q478o266l938k219j293
58934G98119n42O17J824K238J791J287J123Q28J44l94m71o47j352k023k087k008
58918G98447k510l297l495k908j946p47P78K337L456M107M559M921N365O385Q163
58903H23615J0072J1453J2490J3777J5383J6938J8191J8949J8929J8228J7486
$$ plain form
59001 782498 782643 784334 787821 792820 798749 804862 810513 815694 820838 825669 828981 830213 830449 830908 831173
58986 831173 830141 828186 826907 826980 827698 828605 830251 833140 837158 842270 848724 856342 864628 873785 884618
58971 884618 897191 910644 924557 939403 955215 970860 985190 998108 1010007 1020940 1030777 1039360
58959 1039360 1046029 1049692 1049884 1047107 1041745 1033412 1021872 1007807 992073 974868 956336 937431 919320
58946 919320 902266 885807 869885 855119 842004 830462 820313 811835 805569 801631 799412 798119
58934 798119 797577 798194 800018 802256 804047 805334 806457 807285 807429 807035 806564 805917 804565 802542 800455 798447
58918 798447 795937 792640 789145 786237 784291 783544 784322 786659 790115 794222 798781 803702 809067 815452 823615
58903 823615 833687 845140 857630 871407 886790 903728 921919 940868 959797 978025 995511
58892I95511J7034J6452J5545J5064J5719J7059J8097J8475J8306J7445J5742
58881A180449J3527J1066Q086M542J241j174l250n785q392j0045j0659j1073j1681
58868A156852j2036j1737j0936r995r225q870q884r002r279j0045j1077j1555
58856A034211j1290j1084j1313j1151j0051q946q869r327r272q972r487j0862
58844I13587j2165j2977j3650j4273j4556j4551j4446j3899j2583j1034j0033
58833G69420r360q207o553n133m250l537k674j623l70Q27J419J483K005L433M695
58818G41575M674L943L790M208M224L669L183K813K051J070N38L49k45j368k518
58803G71956l595m705n356n081m588m941n825o067n628n551o004o027n325m754
$$ plain form
58892 995511 1012545 1028997 1044542 1059606 1075325 1092384 1110481 1128956 1147262 1164707 1180449
58881 1180449 1193976 1205042 1213128 1217670 1218911 1217737 1214487 1208702 1200310 1190265 1179606 1168533 1156852
58868 1156852 1144816 1133079 1122143 1112148 1102923 1094053 1085169 1076167 1066888 1056843 1045766 1034211
58856 1034211 1022921 1011837 1000524 989373 979322 970376 961507 952180 942908 933936 924449 913587
58844 913587 901422 888445 874795 860522 845966 831415 816969 803070 790487 779453 769420
58833 769420 760060 751853 745300 740167 735917 732380 729706 728083 727713 728540 729959 731442 733447 736880 741575
58818 741575 746249 750192 753982 758190 762414 766083 769266 772079 774130 775200 775738 776087 775842 774474 771956
58803 771956 768361 763656 758300 753219 748631 743690 737865 731798 726170 720619 714615 708588 703263 698509
58789F98509m660m169k594m13J537K961L870M404M988N873O488O187N479N380
58775G33840N688N161L434J457j72k004m479o987q610r013q363p138o127n786
58761F90901n600m858l841l298k978j932k24J018J290J197J112O93m1l82j12J94
58745F73139L53J009K460M102N451O679P728Q003P482P147P664Q329Q073O860
58731G54479N552M785M565M649M884N179N328M927L837K693K424L023L505L454
58717H13284L657M595N397N277M902N081N080L897K218J286N21j659n094q140
58703H40302j0491j3375j6786j8894j8895j8365j8788j9516j9239j7999j6613
58692F51341j5224j3538j1650r789p893o024m619l952l889m288m951n205m549
$$ plain form
58789 698509 693849 689680 687086 686673 688210 691171 695041 699445 704433 710306 716794 722981 728460 733840
58775 733840 739528 744689 748123 749580 749408 747404 742925 735938 727328 718315 709952 702814 696687 690901
58761 690901 685301 680443 676602 673304 670326 668394 668170 669188 670478 671675 672787 673480 673439 673057 672945 673139
58745 673139 673492 674501 676961 681063 686514 693193 700921 708924 716406 723553 731217 739546 747619 754479
58731 754479 760031 764816 769381 774030 778914 784093 789421 794348 798185 800878 803302 806325 809830 813284
58717 813284 816941 821536 826933 832210 837112 842193 847273 851170 853388 854674 855195 853536 848442 840302
58703 840302 829811 816436 799650 780756 761861 743496 724708 705192 685953 667954 651341
58692 651341 636117 622579 610929 601140 593247 587223 582604 578652 574763 570475 565524 560319 555770
58679E55770l611l390l596k952j277J32M72M73J050K085L043L807M507N289O518
58664E68320Q392J0343J1531J1778J1127Q985N035O09k454m156n978q266r774
58651F05492r827r128q242p000n715n228n373n108m405m283m623l991k071l80
58637E30118J44L57J037J636J815K329L402L828K779J081k46j235j992j958j078
58622E42017l01n6L80J259J720J550J869L167M351M781N437O875P768O951N404
58607E93172M643M541M220L799L682L298K127R86P73Q67K21q01j106o68k22J98
58591F19730J076K275L299M290N789P873J0183J2346J3811J4002J3188J2422J2156
58578G32440J1816J1131J0672J0564J0058R076Q809R885J1344J2382J3757J6374
$$ plain form
58679 555770 552159 548769 545173 542221 540944 541076 541548 542021 543071 545156 548199 552006 556513 561802 568320
58664 568320 576712 587055 598586 610364 621491 630476 635511 636120 633666 629510 623532 615266 605492
58651 605492 595665 586537 578295 571295 565580 560352 554979 549871 545466 541183 536560 532569 530498 530118
58637 530118 530262 530619 531656 533292 535107 537436 540838 544666 547445 548526 548280 547045 545053 543095 542017
58622 542017 541716 541660 542040 543299 545019 546569 548438 551605 555956 560737 566174 573049 580817 587768 593172
58607 593172 597815 602356 606576 610375 614057 617355 619482 620468 621241 622108 622329 621528 620422 619754 619532 619730
58591 619730 620806 623081 626380 630670 636459 644332 654515 666861 680672 694674 707862 720284 732440
58578 732440 744256 755387 766059 776623 786681 795757 804566 814451 825795 838177 851934 868308
58566H68308J9662K2521K4854K7029K8882L0207L1251L1770L0667K7451K2966
58555A165568J7832J1554M140k748p521j0399j2295j3170j2664j1286r764q165
58543A111082o778o808r070j2848j6903k0689k3817k5684k6453k7105k7667k6819
58531H80441k4175k1318j9435j7671j5065j2480j1055j0324r339q305p506o200
58519G17568m201l039l747m823m357k897k209k330j982j116q74j481k027j979
58505F80506j501p12J71N31K47J30N09N60QN5J335K502K424K187L121M361M472
58488G00906M191N231P363R037J0153J1901J4312J6133J6971J7690J8828K0114
58476H52830K1279K1911K0908J7436J2098O151K12n269r291j1410j2602j3709
$$ plain form
58566 868308 887970 910491 935345 962374 991256 1021463 1052714 1084484 1115151 1142602 1165568
58555 1165568 1183400 1194954 1199094 1196346 1188825 1178426 1166131 1152961 1140297 1129011 1119247 1111082
58543 1111082 1104304 1097496 1088426 1075578 1058675 1037986 1014169 988485 962032 934927 907260 880441
58531 880441 856266 834948 815513 797842 782777 770297 759242 748918 739579 731274 723768 717568
58519 717568 713367 710328 706581 701758 697401 694504 692295 689965 687983 686867 685993 684512 682485 680506
58505 680506 679005 678293 678464 678995 679242 679372 679881 680441 680449 680504 681839 684341 686765 688952 692073 696434 700906
58488 700906 705097 710328 717691 726728 736881 748782 763094 779227 796198 813888 832716 852830
58476 852830 874109 896020 916928 934364 946462 952613 952825 947556 938265 926855 914253 900544
58464I00544j3955j2325r421o501l738q18J844L988O486R881J3022J4631J5116
58451I18754J5255J4370J1431O871J683m088j0225j5113j7406j7875j7927j7499
58439H68231j6065j4287j2857j1004q135n470m141l116j082J077J983K455M143
58426H01732O658Q467R488J0465J0847R612P216M614J509k318n343o339o689q252
58412H41667j0243j0782j0233j0248j0731j0516r940j0004r920q289n787m081
58400G30893l067j684l65p3k5J002K277K629K969M539O114N952N049N365O208
58385G67783N751M770N392P275Q568R484J1267J2712J1513Q386O091N131M046
58372H68169L112L909N789O584O396P062Q429Q841Q723R945J2106J3195J3350
$$ plain form
58464 900544 886589 874264 864843 858342 854604 853786 855630 859618 866104 875985 889007 903638 918754
58451 918754 934009 948379 959810 966681 968364 964276 954051 938938 921532 903657 885730 868231
58439 868231 852166 837879 825022 814018 805883 800413 796272 793156 792074 793151 795134 797589 801732
58426 801732 808390 816857 826345 836810 847657 857269 864485 869099 870608 868290 862947 856608 849919 841667
58412 841667 831424 820642 810409 800161 789430 778914 768974 758970 749050 740761 734974 730893
58400 730893 727826 726142 725777 725704 725679 726681 728958 731587 734556 739095 745209 751161 756210 761575 767783
58385 767783 773534 778304 783696 790971 799539 809023 820290 833002 844515 852901 858992 864123 868169
58372 868169 871281 875190 880979 887563 893959 901021 909450 918291 927014 936959 949065 962260 975610
58359I75610J4215J5143J3997J1183Q929P164M153O59q19o22j383l130l222j162
58345A040715P88J845L378N315N980N681O474Q357R524J0177J2063J4536J5315
58332A140148J4859J5626J7316J7297J5449J3973J2687R415M893K356K090J314
58320A267423m59q87K66P13L27J279L314L963L600N084Q243J0022J0193J1439
58306A324520J3669J3988J2620J2932J5075J5600J4026J3710J5426J6183J5206
58295A482955J5060J6064J5786J4816J6563K0437K1923K0451K0379K2966K4454
58284A691854K3543K3655K6027K7585K7532K9032L2449L3988L2933L3123L5517
58273B017238L6553L5766L7235M1490M3908M3349M4405M8617N1779N2472N4809
$$ plain form
58359 975610 989825 1004968 1018965 1030148 1039077 1046241 1050394 1051053 1050234 1049612 1048229 1045099 1041877 1040715
58345 1040715 1041503 1043348 1046726 1052041 1058021 1063702 1070176 1078533 1088057 1098234 1110297 1124833 1140148
58332 1140148 1155007 1170633 1187949 1205246 1220695 1234668 1247355 1256770 1261663 1264019 1266109 1267423
58320 1267423 1266964 1266077 1266343 1267056 1267383 1268662 1271976 1275939 1279539 1284623 1292866 1302888 1313081 1324520
58306 1324520 1338189 1352177 1364797 1377729 1392804 1408404 1422430 1436140 1451566 1467749 1482955
58295 1482955 1498015 1514079 1529865 1544681 1561244 1581681 1603604 1624055 1644434 1667400 1691854
58284 1691854 1715397 1739052 1765079 1792664 1820196 1849228 1881677 1915665 1948598 1981721 2017238
58273 2017238 2053791 2089557 2126792 2168282 2212190 2255539 2299944 2348561 2400340 2452812 2507621
58262B507621N9803O2688O1947O2339O5560O6722O3743O1463O2622O3527O2496
58251C200531O3653O8405P2170P3532P7383Q5057R0988R3259R7479J05970J13412
58240D141839J17747J24601J36056J46104J52354J60890J74234J86291J94865
58231E534981K06956K25523K43566K57676K74655K98114L21959L43888L71332
58222H078650M06927M42888M77166N19665N74788O34433O96584P73009Q69832
58213A3473942R79464J101513J251540J438932J657916J911261K218504K587586
58205B6620658L003303L456628L957124M503191N074655N674587O344689P121057
58197F5755892Q015285R060334J0327456J1873914J3732330J5977248J8717152
$$ plain form
58262 2507621 2567424 2630112 2692059 2754398 2819958 2886680 2950423 3011886 3074508 3138035 3200531
58251 3200531 3264184 3332589 3404759 3478291 3555674 3640731 3731719 3824978 3922457 4028427 4141839
58240 4141839 4259586 4384187 4520243 4666347 4818701 4979591 5153825 5340116 5534981
58231 5534981 5741937 5967460 6211026 6468702 6743357 7041471 7363430 7707318 8078650
58222 8078650 8485577 8928465 9405631 9925296 10500084 11134517 11831101 12604110 13473942
58213 13473942 14453406 15554919 16806459 18245391 19903307 21814568 24033072 26620658
58205 26620658 29623961 33080589 37037713 41540904 46615559 52290146 58634835 65755892
58197 65755892 73771177 82831511 93158967 105032881 118765211 134742459 153459611
58190A53459611K1966613K5604616K9461774L3175454L5678096L5010705K9250037
58183C63606906J8099447L600891j0876782k2454250k9811320l3039866l2980188
58176B56144838l0710656k7243745k3331484j9465373j6042168j3423168j1770300
58169A14157944j0908469j0446112j0029330r473184q734468p854526o921692
58162D9790163o022108n198866m462261l820281l276901k817510k422342k086308
58154A9683586j808632j575442j370744j193783j049216r30348q26897p39045
58146A0189479o69571o11541n57017n08785m71138m37981m01859l66050l36432
58137E829105l09818k81109k53742k32460k13595j92706j74385j64362j58985
$$ plain form
58190 153459611 175426224 201030840 230492614 263668068 299346164 334356869 363606906
58183 363606906 381706353 385307244 374430462 351976212 322164892 289125026 256144838
58176 256144838 225434182 198190437 174858953 155393580 139351412 125928244 114157944
58169 114157944 103249475 92803363 82774033 73300849 64566381 56711855 49790163
58162 49790163 43768055 38569189 34106928 30286647 27009746 24192236 21769894 19683586
58154 19683586 17874954 16299512 14928768 13734985 12685769 11755421 10928524 10189479
58146 10189479 9519908 8908367 8351350 7842565 7371427 6933446 6531587 6165537 5829105
58137 5829105 5519287 5238178 4984436 4751976 4538381 4345675 4171290 4006928 3847943
58128C847943j52055j45299j42633j40650j34105j25094j18105j11577j02472
58119B675953r3599q8538q4631p8416p2554p0173o8036o2560n6996n5356n4693
58108A890401n0737m5958m4624m4817m2688m0013m0239m1346l9628l6637l5652
58097A428062l5242l2683k9861k9445k9149k6014k2482k1987k2366j9954j6419
58086A142460j5331j5524j4151j2799j4242j6438j6065j4885j6303j8631j8117
58075I69974j6025j6198j7959j7679j5512j4593j5056j4478j2879j2097j1699
58064H05799j0203q745q977r286p626n902o932r182r445q496r169j0749j0419
58051F90668q615p936q210p425o147o332p071o115m324m184n184n034m155m590
$$ plain form
58128 3847943 3695888 3550589 3407956 3267306 3133201 3008107 2890002 2778425 2675953
58119 2675953 2582354 2493816 2409185 2330769 2258215 2188042 2120006 2057446 2000450 1945094 1890401
58108 1890401 1839664 1793706 1749082 1704265 1661577 1621564 1581325 1539979 1500351 1463714 1428062
58097 1428062 1392820 1360137 1330276 1300831 1271682 1245668 1223186 1201199 1178833 1158879 1142460
58086 1142460 1127129 1111605 1097454 1084655 1070413 1053975 1037910 1023025 1006722 988091 969974
58075 969974 953949 937751 919792 902113 886601 872008 856952 842474 829595 817498 805799
58064 805799 795596 786851 777874 768588 760962 755060 748128 738946 729501 721005 711836 701087 690668
58051 690668 682053 674117 665907 658482 652335 646003 638932 632817 628493 624309 619125 614091 609936 605346
58037F05346n762n608m748n223o364o161n476o568q599q953p987q093r052q668
58023E08084p185o744p134o266m408l816m565m683l974l953m433l844k593k484
58009D42002l240l083k217k276k877k303j010r53j890j911j133j317k296k268
57995D13228j299j004j100K37K801M520M940N287N436M209K343J737J964R71r05
57980D43365j258R9P07m03j513j589j543j686r66N85J377Q68K19N7j28k24L74
57963D38341R67K83j028j104j2L31p18j926k589l069l171k510k139l272m660l991
57947D09733j575J37M59R32K106K879L160M160N778O501O229O493P616Q327Q398
57932D71333Q901R653R081O936M561K277p83m100n931o422p632r991j1530j1213
$$ plain form
58037 605346 599584 593976 589228 584005 577641 571480 566004 559436 550837 541884 533897 525804 516752 508084
58023 508084 500899 494155 487021 480755 476347 472531 467966 463283 459309 455356 450923 447079 444486 442002
58009 442002 438762 435679 433462 431186 428309 426006 424996 424043 422153 420242 419109 417792 415496 413228
57995 413228 411929 410925 409825 410062 412863 417383 422323 427610 433046 437255 439598 441335 443299 444270 443365
57980 443365 442107 442206 442913 442510 440997 439408 437865 436179 435213 435798 437175 438043 438262 438319 438191 437967 438341
57963 438341 439308 439591 438563 437459 437447 437778 437060 435134 432545 429476 426305 423795 421656 418384 413724 409733
57947 409733 408158 408295 408754 409686 411792 414671 417831 421991 427769 434270 440499 446992 454608 462935 471333
57932 471333 480234 489887 498968 505904 510465 512742 511959 507859 501928 495506 487874 477883 466353 455140
57918D55140j0341r855r033p641o775o671o052m537l351k928k124o91j26j063
57904C83952k025j830j256j303j628j713j857k154k000j298p12l46L79J313J769
57889C69291K181L638N695O650O152N483N124M253K919K334K564K252J151O73
57875D20360J250J422L41r01j244r30j96J280K968L433K486J523J216P65m5j64
57859D33564P22J448J391J377J946K552K907L311L255J825k10q80n9K62p94j903
57843D50714k224k573l184k916j711j286k195k642j493j41N3j05M37J081J176
57828D32991J539K770L882M067M055M344L932K306Q14M49M7j596l581m538m909
57813D46572n702o431o136n293m896m627l715k739l019m769p019q818r549q937
$$ plain form
57918 455140 444799 434944 425911 418270 411495 404824 398772 394235 390884 387956 385832 385141 385015 383952
57904 383952 381927 380097 378841 377538 375910 374197 372340 370186 368186 366888 366176 365830 366209 367522 369291
57889 369291 371472 375110 380805 387455 393607 399090 404214 408467 411386 413720 416284 418536 419687 420360
57875 420360 421610 423032 423373 422472 421228 420298 420102 421382 424350 427783 430269 431792 433008 433773 433728 433564
57859 433564 434286 435734 437125 438502 440448 443000 445907 449218 452473 454298 454088 453208 453149 453411 452617 450714
57843 450714 448490 445917 442733 439817 438106 436820 434625 431983 430490 430349 430402 430297 430734 431815 432991
57828 432991 434530 437300 441182 445249 449304 453648 457580 459886 460700 461149 461196 459600 456019 451481 446572
57813 446572 440870 434439 428303 423010 418114 413487 409772 407033 404014 399245 392226 383408 373859 364922
57799C64922p618o808o705o212m782l292k396j523l05N58P01Q78J490J902K042
57784C32852K871M327M777L756L169M361N908O070N515N634N890N023L546K793
57770C96492K475J346n20k047l076m151m976m856m162l827l826l568l123k810
57756C59371k174q41L78N65L35R57K464L841M590M824M477L584K834K686K603
57741C90494K086J650J744J657P43k20k89o3o78j878k548k502k282j866j026l88
57725C84634n70q59k35P43O31o35j696j790j374q76k25K84j8j048j807j610p74
57708C72775k5K28K4k86l60k69l31m58k32L11P00R82J628K333K118J003K53L80
57690C80774L85l70r98p52l65o65j142j074p15k21J238L976O748Q554J0234J2843
$$ plain form
57799 364922 357304 350496 343791 337579 332797 329505 327109 325586 325281 325839 326540 327418 328908 330810 332852
57784 332852 335723 340050 344827 348583 351752 356113 362021 368091 373606 379240 385130 390153 393699 396492
57770 396492 398967 400313 399793 397746 394670 390519 385543 380687 376525 372698 368872 365304 362181 359371
57756 359371 357197 356356 356734 357299 357634 358591 361055 364896 369486 374310 378787 382371 385205 387891 390494
57741 390494 392580 394230 395974 397631 398374 398154 397865 397802 397124 395246 392698 390196 387914 386048 385022 384634
57725 384634 384064 383205 382970 383713 384344 383709 382013 380223 378849 377973 377748 378032 378014 376966 375159 373549 372775
57708 372775 372750 372978 373002 372716 372356 372087 371756 371298 371066 371377 372077 373059 374687 377020 379138 380141 380394 380774
57690 380774 381159 380789 379791 379039 378674 378009 376867 375793 375078 374857 376095 380071 386819 395373 405607 418450
57674D18450J5832J8374K1219K5473L0716L6154M2496N0657N9298O5354O6143
57663H50166N9463M3295J8150j0710l5944n3244o2593o5469o3226n7852n1684
57652E70352m5708l9606l3528k8295k3962j9796j5762j2546j0172p982n919m471
57640C22605l536k624j970k000k073j293k21j89j139j791j771j847k130j853r88
57625B97180n31r33j666k396l157l427k569j305j154k220k981k504j474q03o03
57610B69457p48j218j605j423j025j117j374q25M72J364J241M93n89k023l209
57595B57871l252k325j465j100r08j034j881k838k805k014j708k009j788q66n42
57580B31336j420k445k657k449k415k329j971j774j997k297k518k901l264k995
$$ plain form
57674 418450 434282 452656 473875 499348 530064 566218 608714 659371 718669 784023 850166
57663 850166 909629 952924 971074 960364 924420 871176 808583 743114 679888 622036 570352
57652 570352 524644 485038 451510 423215 399253 379457 363695 351149 340977 332995 327076 322605
57640 322605 319069 316445 314475 312475 310402 309109 308888 308699 307560 305769 303998 302151 300021 298168 297180
57625 297180 296649 295716 294050 291654 288497 285070 282501 281196 280042 277822 274841 272337 270863 270060 269457
57610 269457 268709 267491 265886 264463 263438 262321 260947 260122 260594 261958 263199 263692 263103 261080 257871
57595 257871 254619 252294 250829 249729 248821 247787 245906 243068 240263 238249 236541 234532 232744 231878 231336
57580 231336 229916 227471 224814 222365 219950 217621 215650 213876 211879 209582 207064 204163 200899 197904
57566A97904k216j717j583j151n34p32j826k510j968q99j35M44J073J423J452
57551A87025J731K356K647K423K406K824K859K074J161O15p1j112j538n80J042
57536B05862K069K173J671O49p41j837k166k076k056j962j444n82L19J066J390
57521B02335J099N83M80P27P16N05Q53J843K582K526K083J574Q03Q7L36J576K508
57504B23216K243J411Q68M80o5l88k91n53j764l171l653l243k765k545k375k235
57488B05170k171j842r16K91J168J449J149L41n88r79o66k85l86p51q82p11n05
57471A98886n23r99j915k659k558j867j482j574j370n29K67M49L22K92K46J39
57455A85125L39Q41R76M26k38n08o11p80o65o0N40P18P37R10J051J076J425K288
$$ plain form
57566 197904 195688 193971 192388 191237 190703 189971 188145 185635 183667 182768 182633 183077 184150 185573 187025
57551 187025 188756 191112 193759 196182 198588 201412 204271 206345 207506 208121 208050 206938 205400 204820 205862
57536 205862 207931 210104 211775 212424 211683 209846 207680 205604 203548 201586 200142 199560 199879 200945 202335
57521 202335 203434 204017 204497 205224 205940 206445 207298 209141 211723 214249 216332 217906 218709 218796 219132 220708 223216
57504 223216 225459 226870 227738 228218 228153 227765 227474 226921 225157 221986 218333 215090 212325 209780 207405 205170
57488 205170 202999 201157 200241 200532 201700 203149 204298 204639 204051 203072 202406 202121 201735 200984 200102 199391 198886
57471 198886 198363 197364 195449 192790 190232 188365 186883 185309 183939 183410 183677 184126 184448 184740 184986 185125
57455 185125 185464 186305 187281 187707 187469 186961 186350 185570 184905 184845 185385 186103 186840 187750 188801 189877 191302 193590
57437A93590L031L007K380J753J431J332J265J020O83P74J486J973J373L27K75
57422B15700J284J960J632J065P30L2j106j550p22L26N49L51M99Q52J164J892
57406B24658L053L468K284L95q31j308j649j782j342o82l03P8Q57J596J751J672
57390B31915J961K452K721K937L339L600L590L926M837N317M544L337L048L698
57376B81222M260M270L960L386K532J852J659J437O27l73q52q39p60o13l29k55
57360C01184m35k23N16P59l0o46J71J694K320K003K026K824L591L749L467K855
57344C25825J945J239J189J346J100Q24J180J739J632J171J405K268K611K061
57330C47535J502J669K290K880L332L678L976M410M839M556L248J829J422J933
$$ plain form
57437 193590 196621 199628 202008 203761 205192 206524 207789 208809 209492 210266 211752 213725 215098 215425 215700
57422 215700 216984 218944 220576 221641 222371 222403 221297 219747 219025 219351 219900 220251 220750 221602 222766 224658
57406 224658 227711 231179 233463 233858 233027 231719 230070 228288 226946 226264 225961 226039 226896 228492 230243 231915
57390 231915 233876 236328 239049 241986 245325 248925 252515 256441 261278 266595 271139 274476 277524 281222
57376 281222 285482 289752 293712 297098 299630 301482 303141 304578 305205 304832 303980 303141 302381 301768 301439 301184
57360 301184 300749 300526 301042 301801 301771 301125 301296 302990 305310 307313 309339 312163 315754 319503 322970 325825
57344 325825 327770 329009 330198 331544 332644 333468 334648 336387 338019 339190 340595 342863 345474 347535
57330 347535 349037 350706 352996 355876 359208 362886 366862 371272 376111 380667 383915 385744 387166 389099
57316C89099K503K901L427L891L839L486L361L363L180L240M035M964N130M870
57302D41289N195N987O176N577N140N364N758N905N885N690N308N277O062P097
57288E21710P621Q090R413J1071J1620J1001J0704J1449J2361J2816J3540J5181
57276F56577J6995J7653J6640J4478J2262J1169J1477J2086J1754J0753J0287
57265H02131J0505J0357R419Q482Q171Q255Q536R212J0031J0348J0280J0719J1888
57252I28334J2996J3547J3869J4156J4165J4129J4717J5780J6365J6319J6626
57241A091003J7719J8696J8727J8136J7582J7255J7363J8303J9838K1072K1689
57230A297383K2263K3025K3460K3485K3836K4787K5679K6188K6858K7820K8249
$$ plain form
57316 389099 391602 394503 397930 401821 405660 409146 412507 415870 419050 422290 426325 431289 436419 441289
57302 441289 446484 452471 458647 464224 469364 474728 480486 486391 492276 497966 503274 508551 514613 521710
57288 521710 529331 537421 546834 557905 569525 580526 591230 602679 615040 627856 641396 656577
57276 656577 673572 691225 707865 722343 734605 745774 757251 769337 781091 791844 802131
57265 802131 812636 822993 832412 840894 849065 857320 865856 875068 885099 895447 905727 916446 928334
57252 928334 941330 954877 968746 982902 997067 1011196 1025913 1041693 1058058 1074377 1091003
57241 1091003 1108722 1127418 1146145 1164281 1181863 1199118 1216481 1234784 1254622 1275694 1297383
57230 1297383 1319646 1342671 1366131 1389616 1413452 1438239 1463918 1490106 1516964 1544784 1573033
57219A573033K7784K7287K7492K7984K8284K8751K9571L0010K9600K9132K9487
57208A888415L0413L1332L2413L3942L5486L6662L7864L9322M0287M0158L9586
57197B285880L9442L9489L9106L8513L8119L7406L5833L4401L4951L8068M2759
57186B703967M7789N2379N5901N8238O0337O3198O6313O8137O8206O7671O7530
57175C379666O7376O6360O4534O2664O1240O0277N9750N9642N9595N9012N7582
57164D057698N5625N3748N2335N1531N1608N2800N4663N6079N6404N6226N6505
57153D655222N7339N8198N8971N9803O0249N9677N8526N7794N7096N4428M8453
57142E285756L9951L0429K0421R850q59j0897j9613k6251k9807k9899k7188k2378
$$ plain form
57219 1573033 1600817 1628104 1655596 1683580 1711864 1740615 1770186 1800196 1829796 1858928 1888415
57208 1888415 1918828 1950160 1982573 2016515 2052001 2088663 2126527 2165849 2206136 2246294 2285880
57197 2285880 2325322 2364811 2403917 2442430 2480549 2517955 2553788 2588189 2623140 2661208 2703967
57186 2703967 2751756 2804135 2860036 2918274 2978611 3041809 3108122 3176259 3244465 3312136 3379666
57175 3379666 3447042 3513402 3577936 3640600 3701840 3762117 3821867 3881509 3941104 4000116 4057698
57164 4057698 4113323 4167071 4219406 4270937 4322545 4375345 4430008 4486087 4542491 4598717 4655222
57153 4655222 4712561 4770759 4829730 4889533 4949782 5009459 5067985 5125779 5182875 5237303 5285756
57142 5285756 5325707 5356136 5376557 5386407 5385548 5374651 5355038 5328787 5298980 5269081 5241893 5219515
57130E219515j5608p387P67P570J2994J7169J9039J7431J2939P558K783p69k211
57117E291790l45N051J2845K1536K9928L7023M2390M6776N1513N7303O4387P3768
57105E733965Q7137J05457J28968J59164J99756K54984L27707M19628N32473O68340
57095H617579Q30079J022663J253340J528604J849738K209217K586723K944626
57087B2842569L230403L393945L412408L301562L102524K857669K597326K339588
57079D7077994K088660J827011J515830J114578O07229J3154o23129j250524j825563
57070E0545240k319484k719301l022983l232003l347182l369907l304899l161571
57062B6067910k954554k703407k429688k152268j884867j636894j414408j219742
$$ plain form
57130 5219515 5203907 5196520 5197287 5204857 5217851 5235020 5254059 5271490 5284429 5291987 5294770 5294001 5291790
57117 5291790 5291445 5296496 5309341 5330877 5360805 5397828 5440218 5486994 5538507 5595810 5660197 5733965
57105 5733965 5821102 5926559 6055527 6214691 6414447 6669431 6997138 7416766 7949239 8617579
57095 8617579 9447658 10470321 11723661 13252265 15102003 17311220 19897943 22842569
57087 22842569 26072972 29466917 32879325 36180887 39283411 42141080 44738406 47077994
57079 47077994 49166654 50993665 52509495 53624073 54231302 54244456 53621327 52370803 50545240
57070 50545240 48225756 45506455 42483472 39251469 35904287 32534380 29229481 26067910
57062 26067910 23113356 20409949 17980261 15827993 13943126 12306232 10891824 9672082
57054I672082j051967r08978p88545o87604o02434n30437m70487m20888l78391
57045C832351l40086l05020k73135k43881k16865j92638j71682j53459j37285
57036A798300j23131j10795r9268q7898p7224o7805n9130n0559m2310l4667k7163
57025A018350j9359j1333k609Q072K0966L4747M8749O3699P8013Q4820P5812M8620
57013A448547R222l2483o8045r2600j04952j07026j02231r3471q2732p1753o1834
57002F40642n3047m4874l7574l1956k7959k4579k1182j7900j4836j1892r272p208
56990C38363n276k947n76J179K800N575R801J4185J7010J6963J3208O007k573
56977D13719r720j4076j6190j6905j6395j4836j2840j0814q677o504m657l010
$$ plain form
57054 9672082 8620115 7711137 6922592 6234988 5632554 5102117 4631630 4210742 3832351
57045 3832351 3492265 3187245 2914110 2670229 2453364 2260726 2089044 1935585 1798300
57036 1798300 1675169 1564374 1465106 1377208 1299984 1232179 1173049 1122490 1080180 1045513 1018350
57025 1018350 998991 987658 985049 993121 1014087 1048834 1097583 1161282 1239295 1324115 1399927 1448547
57013 1448547 1457769 1425286 1357241 1264641 1159689 1052663 950432 856961 774229 702476 640642
57002 640642 587595 542721 505147 473191 445232 420653 399471 381571 366735 354843 345571 338363
56990 338363 333087 330140 329564 330743 333543 339118 348919 363104 380114 397077 410285 416292 413719
56977 413719 403999 389923 373733 356828 340433 325597 312757 301943 293266 286762 282105 279095
56965B79095q39K210N725R275J2857J6424J9771K3055K6513K9107K8241K1814
56953D73248J0462k561j3758k1452k5860k7708k7212k4452k0281j6169j2907j0023
56941B81327o739l052N55L933P326J0962J4987J9528K4473K9460L4140L7724L8092
56928D92716L2526K0330M271j1288k3298l0830l4213l4518l3230l1317k8723k5372
56916B97054k1967j9092j6365j3428j0973r641q750p335n772m942m412l037r49
56903A70391N97J206J618K209K643L051L977N204N981O507P795R977J2158J4056
56889B47370J6412J9535K2789K5709K8082K8698K5633J8487R217J55p647j3727
56877D20713j7355j8226j7036j4553j0919o432k035J716N398R719J4475J9136
$$ plain form
56965 279095 278256 280466 286191 295466 308323 324747 344518 367573 394086 423193 451434 473248
56953 473248 483710 481149 467391 445939 420079 392371 365159 340707 320426 304257 291350 281327
56941 281327 274588 271536 272091 276024 283350 294312 309299 328827 353300 382760 416900 454624 492716
56928 492716 525242 545572 549843 538555 515257 484427 450214 415696 382466 351149 322426 297054
56916 297054 275087 255995 239630 226202 215229 205588 196838 189503 183731 178789 174377 171340 170391
56903 170391 170988 172194 173812 176021 178664 181715 185692 190896 196877 203384 211179 221156 233314 247370
56889 247370 263782 283317 306106 331815 359897 388595 414228 432715 441932 442087 434440 420713
56877 420713 403358 385132 368096 353543 342624 336192 334157 335873 341271 350990 365465 384601
56865C84601K3866K9198L5224M1722M8713N6065O2424O4803N9658M5172K3257
56854H74703q18k1535l6098m4347m6799m4064l7762l0303k3180j6286r052j343
56842E63116O828J5451K4206L2887M2194N3108O5373P7675Q9118R8838J03759
56831A172553R8385P8438M4700L296l7105o8803q7858r5020r3801q7320p7247
56820H50218o5094n2726m1179l0249j9872j0666k544N889J5682K6307L6943M7886
56808G60595N9520P0293P6502P3907N9646L4054J687l0203n5474p1691p9353p9855
56796H19628p4854o6484n6846m7265l8376l0350k2728j4871p041l03N068J0204
56784D75782J6129K2518K8550L3836L7514L7352L1051J8363J376j6699l2482m3200
$$ plain form
56865 384601 408467 437665 472889 514611 563324 619389 681813 746616 806274 851446 874703
56854 874703 873885 852350 816252 771905 725106 681042 643280 612977 589797 573511 564459 563116
56842 563116 569944 585395 609601 642488 684682 737790 803163 880838 969956 1068794 1172553
56831 1172553 1270938 1349376 1394076 1397372 1360267 1291464 1203606 1108586 1014785 927465 850218
56820 850218 785124 732398 691219 660970 641098 630432 627888 633777 649459 675766 712709 760595
56808 760595 820115 890408 966910 1040817 1100463 1134517 1136204 1106001 1050527 978836 899483 819628
56796 819628 744774 678290 621444 574179 535803 505453 482725 467854 460813 460510 465578 475782
56784 475782 491911 514429 542979 576815 614329 651681 682732 701095 702471 685772 653290 610090
56772F10090m7891m7866m5372m1886l7942l3829k9727k5622k1774j8758j6574
56761B42849j4369j1701r376q188p565o453m960m016l725l301k506k063k399k926
56747A59301k935k534k255k127j636n45N72Q58J98n94p69n26m92o39l88L25R19
56730A46733J179J561K246K603K070R64J9m12l67KL88M75L12K84N25P77R12J085
56712A61356J370J643J805J682R61j62o25K90J682K107J649J630K367K745K221
56697A82721J629J545J366O75J19J54J87j95k94M52J371J611J409J424J641J784
56681A97599J978K251K176J729J661K237K489J586R0r08j182j124r05o41o91j022
56665B07323r94l99J04Q2k4R3k8n95r44o95m20m65k98K41L00m25q19j31O45M17
$$ plain form
56772 610090 562199 514333 468961 427075 389133 355304 325577 299955 278181 259423 242849
56761 242849 228480 216779 207403 199215 191650 185197 180237 176221 172496 169195 166689 164626 162227 159301
56747 159301 156366 153832 151577 149450 147814 147269 147841 148699 148897 148303 147534 147008 146516 145877 145489 145814 146733
56730 146733 147912 149473 151719 154322 156392 157356 157375 156963 156596 156598 156986 157461 157773 158057 158582 159359 160271 161356
56712 161356 162726 164369 166174 167856 168817 168655 168030 168320 170002 172109 173758 175388 177755 180500 182721
56697 182721 184350 185895 187261 187936 188055 188209 188396 188201 187907 188359 189730 191341 192750 194174 195815 197599
56681 197599 199577 201828 204004 205733 207394 209631 212120 213706 213796 212888 211706 210582 209677 209036 208345 207323
56665 207323 206329 205930 206034 206116 206092 206185 206157 205562 204618 203923 203503 203038 202740 202981 203281 202856 202037 201906 202551 202968
56645B02968k36k68l7l91r49p91j22K26K58L56J46p65j596j389n41j9K47P09P64
56626A98570l39j803k192j642j465j889j868j094m81o19j058j293j310j107o82
56611A79728l99n12o03k52J56K28M43J255J984J811J159P89L27q05j786j382L
56594A82144R70J342J935K570K263J259Q94J384J530Q36K16L21P35J083J485J670
56578B02637J115K91L27J237J829J646J476J767J986J963K404L529M532M970N433
56563B37142O335P218P811Q747J0544J2692J4278J4717J3524J0339N684J015k431
56550C47615m438n406n773n942o066n833m991m002l538l584l730l937m194l911
56536B82270k773j707j759k392k298j638j830l147m176l873k767j723q89k34O4
$$ plain form
56645 202968 202732 202464 202427 202036 201087 200296 200174 200400 200658 201014 201160 200395 198799 197410 196869 196850 197097 197806 198570
56626 198570 198231 196428 194236 192594 191129 189240 187372 186278 185797 185178 184120 182827 181517 180410 179728
56611 179728 179329 178817 178214 177962 178118 178346 178789 180044 182028 183839 184998 185787 186114 185309 183523 182141 182144
56594 182144 183114 184456 186391 188961 191224 192483 193377 194761 196291 197127 197343 197664 198399 199482 200967 202637
56578 202637 203752 204043 204370 205607 207436 209082 210558 212325 214311 216274 218678 222207 226739 231709 237142
56563 237142 243477 250695 258506 267253 277797 290489 304767 319484 333008 343347 349031 350046 347615
56550 347615 343177 337771 331998 326056 319990 314157 309166 305164 301626 298042 294312 290375 286181 282270
56536 282270 279497 277790 276031 273639 271341 269703 267873 264726 260550 256677 253910 252187 251298 251064 251128
56521B51128R9J61j9q94j940k014j089m10p65j711k631l345l527k775j582j031
56505B27655j251j332r32q49j548k329k371j696p43J52O16M30Jj39j24k95k45
56488B15000N21J371J327P58P74J194Q36k63p15j11L73J08o1M29Q40N75J64R9
56470B23219L2k41k08L30Q22J025J284J433Q06l13p12k08j3n91p55L16J682K200
56452B30108K108K064J901J343R46J252J821J959J650J235Q58P21R62J041K29
56437B50198j025j469j053j110k109k770k158j109o91o49l65j12k77l68R1O18
56421B35642O11L46L14L64K73L40P51J092J061R23Q79P98Q53J421K117K016J134
56404B50935M48K19l06j183j390o61p5j84j00P04J366J285J231J772K079J481
$$ plain form
56521 251128 251227 251388 251369 250475 248535 246521 245432 245022 244257 242546 239915 236570 233043 230268 228686 227655
56505 227655 226404 225072 224140 223291 221743 219414 217043 215347 214604 214756 215372 215802 215803 215664 215540 215245 215000
56488 215000 215521 216892 218219 218977 219751 220945 221781 221518 220803 220692 221065 221173 221112 221541 222381 222956 223120 223219
56470 223219 223251 223010 222802 223132 223954 224979 226263 227696 228502 228189 227477 227269 227256 226665 225910 226226 227908 230108
56452 230108 232216 234280 236181 237524 238470 239722 241543 243502 245152 246387 247245 247966 248928 249969 250198
56437 250198 249173 247704 246651 245541 243432 240662 238504 237395 236704 236055 235690 235578 235301 234933 235024 235642
56421 235642 236253 236599 236913 237277 237550 237890 238641 239733 240794 241717 242596 243394 244247 245668 247785 249801 250935
56404 250935 251383 251602 251296 250113 248723 248062 247987 247803 247703 248407 249773 251058 252289 254061 256140 257621
56388B57621Q03R54J435J406J121J111J019M31j51k24j97m17l36L56Q38M72n2
56371B66190J06O05Q10R75J501J984K033K028K160J745N33l09K53J566K295K183
56355B86658J788J402J195J596K514K961K323J207L87j12l18J21R65J263J017
56340C04967J504L054M068L430K429K813M290N433N860N917N280L636K042J892
56326C56615K998L999M253M115L775L058K106J347R46Q69J010R65L68l06j49P04
56310C86673J178J074J330K131K415J921J961L310M995O092P041Q130Q460P586
56296D44297O527N935N007L443K655L524M750N022N173O406Q025Q758Q939R523
56282E27984J0173J0149R966J0453J1267J1883J2874J4660J6288J6978J7650J9357
$$ plain form
56388 257621 258424 259378 260813 262219 263340 264451 265470 265901 265750 265526 265329 264912 264576 264932 265770 266242 266190
56371 266190 266296 266901 267711 268686 270187 272171 274204 276232 278392 280137 280670 280361 280614 282180 284475 286658
56355 286658 288446 289848 291043 292639 295153 298114 300437 301644 302031 301919 301601 301722 302687 303950 304967
56340 304967 306471 309525 313593 317023 319452 322265 326555 331988 337848 343765 349045 352681 354723 356615
56326 356615 359613 363612 367865 371980 375755 378813 380919 382266 383212 384081 385091 386056 386424 386118 385969 386673
56310 386673 387851 388925 390255 392386 394801 396722 398683 401993 406988 413080 420121 428251 436711 444297
56296 444297 450824 456759 461766 465209 467864 471388 476138 481160 486333 492739 500764 509522 518461 527984
56282 527984 538157 548306 558272 568725 579992 591875 604749 619409 635697 652675 670325 689682
56270F89682K1528K3271K4992K7202K9205L0672L2956L7066M1839M6015N0461
56259A054889N6437O3214O9628P6392Q4654R3651J02123J10800J21020J32080
56249A964888J42359J51974J61940J71603J79331J84859J88676J89941J87238
56240C522809J80566J70496J56266J36887J13215Q6881N8067K6533o127l7442
56230D408151o6394r2817j15635j33968j48779j61139j69979j73899j74056j72625
56220B998860j69598j63788j55992j48309j41086j33220j24838j16980j09293
56211A735756j00730r2021q4884p9161p3237o6780o0818n5586n0592m6146m2724
56200I83077l9509l5662l2052k9608k7179k3426j9461j7070j5599j3426j1160
$$ plain form
56270 689682 711210 734481 759473 786675 815880 846552 879508 916574 958413 1004428 1054889
56259 1054889 1111326 1174540 1244168 1320560 1405214 1498865 1600988 1711788 1832808 1964888
56249 1964888 2107247 2259221 2421161 2592764 2772095 2956954 3145630 3335571 3522809
56240 3522809 3703375 3873871 4030137 4167024 4280239 4367120 4425187 4451720 4445593 4408151
56230 4408151 4341757 4248940 4133305 3999337 3850558 3689419 3519440 3345541 3171485 2998860
56220 2998860 2829262 2665474 2509482 2361173 2220087 2086867 1962029 1845049 1735756
56211 1735756 1635026 1543005 1458121 1378960 1305723 1238943 1178125 1122539 1071947 1025801 983077
56200 983077 943568 907906 875854 846246 819067 795641 776180 759110 743511 730085 718925
56189G18925j0362j0380r597q595q811r156p527m725l354l503l136k005j573j545
56175F34656k17J954K791K214K178K949K931K103K200L451M402M937O272Q100
56161F80921Q995R432J1164J3840J5591J6622J8785K1827K3727K4540K6342K9442
56149I01228L2387L5557M0885M7904N3929N8518O4116P2058Q1466R2074J04222
56138A584344J15828J23275J25802J25355J21949J13226R9177Q3367O8831N6266
56128B617420M6612M1295L9002L5707K8917J8965O395q253k2025l1137l5730l9661
56116B697507m5439n3049o3242p7376r3518j07168j16497j22877j26103j23701
56106A768537j15580j04841r3277q0398o7318n6827m8915m0822l2280k6048k2592
$$ plain form
56189 718925 708563 698183 688586 679991 671180 662024 654497 649772 646418 642915 639779 637774 636201 634656
56175 634656 634439 636393 639184 641398 643576 646525 649456 651559 653759 657210 661612 666549 672821 680921
56161 680921 689916 699348 710512 724352 739943 756565 775350 797177 820904 845444 871786 901228
56149 901228 933615 969172 1010057 1057961 1111890 1170408 1234524 1306582 1388048 1480122 1584344
56138 1584344 1700172 1823447 1949249 2074604 2196553 2309779 2408956 2492323 2561154 2617420
56128 2617420 2664032 2705327 2744329 2780036 2808953 2827918 2834313 2826060 2804035 2772898 2737168 2697507
56116 2697507 2652068 2599019 2535777 2458401 2364883 2257715 2141218 2018341 1892238 1768537
56106 1768537 1652957 1548116 1454839 1374441 1307123 1250296 1201381 1160559 1128279 1102231 1079639
56095A079639j9142j4826j1783j0297p898m351k394k417j497J027K314J649J999
56082A012023M425O199O130O575Q449R402Q726Q889J0564J1287J0665J1594J4571
56069A129499J6300J5686J5694J7448J8159J6899J6550J7999J8214J6288J5379
56058A314115J6453J6091J3016J0721J1080J1440J0587J1292J4254J5860J4846
56047A459755J4873J7611J9734J9755K1071K5007K7688K7252K7391L0177L2162
56036A722476L1337L1059L3260L4642L3541L3581L6583L8900L8779M0000M4124
56025B118282M6713M5602M5297M8496N1118N0562N0969N5121N9027N9782O1009
56014B691978O5188O8626O9348P1742P8036Q3527Q5636Q8961R5846J01258J02715
$$ plain form
56095 1079639 1060497 1045671 1033888 1023591 1015693 1011342 1008948 1006531 1005034 1006061 1008375 1010024 1012023
56082 1012023 1016448 1022647 1028777 1035352 1043801 1053203 1061929 1070818 1081382 1092669 1103334 1114928 1129499
56069 1129499 1145799 1161485 1177179 1194627 1212786 1229685 1246235 1264234 1282448 1298736 1314115
56058 1314115 1330568 1346659 1359675 1370396 1381476 1392916 1403503 1414795 1429049 1444909 1459755
56047 1459755 1474628 1492239 1511973 1531728 1552799 1577806 1605494 1632746 1660137 1690314 1722476
56036 1722476 1753813 1784872 1818132 1852774 1886315 1919896 1956479 1995379 2034158 2074158 2118282
56025 2118282 2164995 2210597 2255894 2304390 2355508 2406070 2457039 2512160 2571187 2630969 2691978
56014 2691978 2757166 2825792 2895140 2966882 3044918 3128445 3214081 3303042 3398888 3500146 3602861
56003C602861J05631J12899J19213J21984J27227J38008J48037J53880J61934
55994D791674J75781J88676J96755K07219K24568K41625K53754K68683K92068
55985F840803L16971L38354L63888L98914M35473M68530N07859N60933O19934
55976A0851659O79540P50912Q43274R49364J065070J205173J382817J593009J834237
55967B1155055K124645K476433K876357L312334L794172M326050M889188N480806
55959E0435040O140447O908615P795144Q822023J0055220J1555155J3348727J5498756
55951A30559127J8129362K1304345K4944146K8906543L2913023L6054737L6434158
55944C29245441L1868439K1520514O975852q427766k1445589l0314675l4854521
$$ plain form
56003 3602861 3708492 3821391 3940604 4062588 4189815 4327823 4475860 4629740 4791674
55994 4791674 4967455 5156131 5352886 5560105 5784673 6026298 6280052 6548735 6840803
55985 6840803 7157774 7496128 7860016 8258930 8694403 9162933 9670792 10231725 10851659
55976 10851659 11531199 12282111 13125385 14074749 15139819 16344992 17727809 19320818 21155055
55967 21155055 23279700 25756133 28632490 31944824 35738996 40065046 44954234 50435040
55959 50435040 56575487 63484102 71279246 80101269 90156489 101711644 115060371 130559127
55951 130559127 148688489 169992834 194936980 223843523 256756546 292811283 329245441
55944 329245441 361113880 382634394 389610246 381182480 359736891 329422216 294567695
55937B94567695l5809906l4254320l1259277k7675742k4026052k0573209j7454383
55930A03514806j4730572j2387313j0379608q682890p278590o121201n158018
55923C8776614m362603l719220l194310k752064k380919k078707j827308j605598
55915A6855885j412314j253142j118452r94563q84211p95512p21953o52095n88384
55906H435259n38334m96844m54328m13328l80947l53304l22815k92864k70533
55897D911962k52276k30928k09731j95670j85530j71786j56409j46071j39312
55888C224249j30425j20857j15177j10776j02560r3108q7667q3853p6463o7746
55878B235617o2756n9112n1484m2212l7664l7769l8358m0177m6232n3578n6689
$$ plain form
55937 294567695 258757789 224503469 193244192 165568450 141542398 120969189 103514806
55930 103514806 88784234 76396921 66017313 57334423 50055833 43934632 38776614
55923 38776614 34414011 30694791 27500481 24748417 22367498 20288791 18461483 16855885
55915 16855885 15443571 14190429 13071977 12077414 11193203 10397691 9675738 9023643 8435259
55906 8435259 7896925 7400081 6945753 6532425 6151478 5798174 5475359 5182495 4911962
55897 4911962 4659686 4428758 4219027 4023357 3837827 3666041 3509632 3363561 3224249
55888 3224249 3093824 2972967 2857790 2747014 2644454 2551346 2463679 2379826 2303363 2235617
55878 2235617 2172861 2113749 2062265 2020053 1982389 1944620 1906262 1866085 1819853 1766275 1709586
55867A709586n6215n6273n6162n2781m8055m5890m4698m0606l5177l2537l1826
55856A209366k9771k7696k8557l0020k7923k3955k2610k3161k1911j9834k0636
55845I33292k3352k3979k2606k2170k2063j9690j6523j6032j7218j6546j4554
55834G18559j4283j4826j2875r196p462p799p479o557p045p825o276l799l986
55821F09151o368p549p322q057r204q136n641m943n810n101k608j106r84Q6K404
55806E38812L892M285N184O396O400N927O836Q159P433N052L209J511j933o171
55792E94992q661r861j2044j4494j4567j2707j1627j1268r347o331m864m638k860
55779D71723J74J003j173l238l271k539j697O68M875R181J2798J6331J8815J7665
$$ plain form
55867 1709586 1653371 1597098 1540936 1488155 1440100 1394210 1349512 1308906 1273729 1241192 1209366
55856 1209366 1179595 1151899 1123342 1093322 1065399 1041444 1018834 995673 973762 953928 933292
55845 933292 909940 885961 863355 841185 819122 799432 782909 766877 749659 733113 718559
55834 718559 704276 689450 676575 667379 659917 652118 644639 638082 631037 623212 616936 613137 609151
55821 609151 602783 595234 587912 579855 570651 562515 556874 551931 546121 541020 538412 537306 536322 536408 538812
55806 538812 542704 546989 552173 558569 564969 570896 577732 585891 593324 598376 601585 603096 601163 594992
55792 594992 586331 576470 564426 549932 535365 522658 511031 499763 490416 484085 479221 474583 471723
55779 471723 471897 472900 471727 468489 465218 462679 460982 461650 466525 475706 488504 504835 523650 541315
55765E41315J2319M754l700j2914k1230k5823k6381k5396k4377k2709k0275j8112
55753C57471j6080j2850q519m682j855O12K244J853Q4j176j648k399l175k755
55739C07125j443n18J80J425K192J116n96q97n81j781l805m214l306l493m724
55724B86680m702l461l491n088n734m529l339k872j634N43J674J343J770M000
55710B61160O286P306P874Q507Q194O630M923L223L67l446o332p717q938j0288
55696B77749j0311q718p126o151m602k299q62p78m72Q31J860J792J533J703J806
55681B45955K020L316N185N772M865M179M168L386J536K13j75j164l008l687k376
55666B70185r94r82j201m65M00N95R80K133K882K314J335R35P41M05N03R97P02
$$ plain form
55765 541315 553634 558388 554688 541774 520544 494721 468340 442944 418567 395858 375583 357471
55753 357471 341391 328541 320022 315340 313485 314097 316341 318194 318278 317102 315454 313055 309880 307125
55739 307125 305682 305164 305344 306769 308961 310077 309481 308584 308003 306222 302417 298203 294897 291404 286680
55724 286680 281978 278517 275026 269938 264204 259675 256336 253464 251830 252373 254047 255390 257160 261160
55710 261160 267446 274752 282626 291133 299327 305957 310880 314103 314470 311024 304692 296975 288037 277749
55696 277749 267438 258720 251594 245443 240841 238542 237680 236902 236430 237261 239121 240913 242446 244149 245955
55681 245955 247975 251291 256476 262248 267113 271292 275460 278846 280382 280595 280420 279256 276248 272561 270185
55666 270185 269191 268209 267008 266543 266943 267538 268518 270651 273533 275847 277182 278117 278858 279263 279766 280763 281465
55649B81465o26j624j658j897l128m480n303o193p208p122n551l909l258l114
55635B26394l151l991n319n527m292l389l763l977k838j453j208j591j506j111
55621A83278r54q28o34r58j810k328k418k929l607k943r89K0r76k093j501j05
55605A58225L17k70r13j406j772j550r52j165k278k627j380l2K3m09j46K59p0
55588A43854m85o1O20O29L20L38K65k79m94K20R35P12K17M37J013J285J727K899
55570A54152M043M259M033M206M452M128L658L616L384K072O3j584k539l022l070
55555A81851k867k986l428l370k615k066k082j734n86K93K06J38R26J625J159
55540A64464K73K90J016J389J293J242J185Q72N82L96l44j758k705k471k045k506
$$ plain form
55649 281465 280839 279215 277557 275660 272532 268052 262749 256556 249348 242226 236675 232766 229508 226394
55635 226394 223243 219252 213933 208406 204114 200725 196962 192985 190147 188694 187486 185895 184389 183278
55621 183278 182324 181496 180862 179904 178094 175766 173348 170419 166812 163869 162880 162900 161924 159831 158330 158225
55605 158225 158542 158272 157359 155953 154181 152631 151679 150514 148236 145609 144229 144197 144220 143811 143665 143924 143854
55588 143854 143369 143308 143928 144557 144877 145215 145480 145201 144707 144927 145862 146574 146791 147228 148241 149526 151253 154152
55570 154152 158195 162454 166487 170693 175145 179273 182931 186547 189931 192003 192066 190482 187943 184921 181851
55555 181851 178984 175998 172570 169200 166585 164519 162437 160703 160117 160410 160616 160754 161680 163305 164464
55540 164464 164737 165027 166043 167432 168725 169967 171152 172024 172606 173002 172658 170900 168195 165724 163679 161173
55524A61173l351l670l793m282m469l565k258j669j560j115o59j027j943k409
55510A25403k222j792j159l84k02r72j699j375n72m05o96n04J52N11N48Q38J309
55493A16779J374R91N95K68q6k12L0J54j71m36j88Q5j72n16k10O31J399J850J901
55474A24066J314K93l70l87l41m44j05O11N15p97j905j625p59o55j146j293r96
55457A15976o25J0R62J432R83M48M68K83p39j646j386o16m48n76k33J24j82m05
55439A13830M12J470J295J08p27q56p91l32R06J987J635L66j83K33M06j73p88
55422A18798r93j069j058p59m66m67k12P89J807J940J706K031K438J936R98P42
55406A28161P00m63k333l059k245j434j471j467p15J03K34j34o30j194j486r80
$$ plain form
55524 161173 157822 154152 150359 146077 141608 138043 135785 134116 132556 131441 130782 129755 127812 125403
55510 125403 123181 121389 120230 119846 119644 118672 116973 115598 115026 114621 113925 113421 113573 114084 114632 115470 116779
55493 116779 118153 119144 119739 120007 119921 119709 119739 119893 119722 119286 119098 119183 119011 118495 118285 118916 120315 122165 124066
55474 124066 125380 125673 125303 124916 124575 124131 124026 124637 125152 124355 122450 120825 120066 119411 118265 116972 115976
55457 115976 115351 115361 116323 117755 118738 119186 119654 119937 119198 117552 116166 115550 115102 114526 114293 114417 114235 113830
55439 113830 114242 115712 117007 117115 116388 115532 114741 114409 115315 117302 118937 119303 119120 119353 119759 119586 118798
55422 118798 117805 116736 115678 114919 114453 113986 113774 114563 116370 118310 120016 122047 124485 126421 127419 128161
55406 128161 128861 128398 126065 123006 120761 119327 117856 116389 115674 115777 116011 115877 115247 114053 112567 111587
55390A11587J6N87N30M77O25N44K16J05J73Mk68k10j22n39j010o92Q1K57j59k87
55370A11915j64o09j363j137K79J596J981J901J685R10l84j286j347j066o74K00
55354A12437J268J406L32p62r17n46l89m22m21n39p28m48M46J273J477J224P90
55337A15481J22n97q20m08J16K94J24l78j146j583j022J84R36Q46N04K58j31n68
55319A12212m69R4J90n73j408j518j055n10J1N02P91R36J258J605J315K30q42
55302A12769j088n83J6K70J94M5Op4m42q32n60L59R16N86K63Q18J525J219L41
55283A15748K26Q58R95L98J10M64N02k15q07o16j78j42l69o11r58j160o06N33
55265A14172J176P81L1k86j73J47O03Q39L88l10j95P77J302O16m30p13l82l13
$$ plain form
55390 111587 111603 112190 112720 113197 113822 114366 114582 114687 114860 114864 114596 114386 114264 113725 112715 112023 112104 112361 112202 111915
55370 111915 111751 111142 109779 108642 108921 110517 112498 114399 116084 116994 116610 115324 113977 112911 112237 112437
55354 112437 113705 115111 115443 114681 113764 113218 112829 112407 111986 111447 110719 110271 110717 111990 113467 114691 115481
55337 115481 115603 115006 114186 113778 113894 114188 114312 113934 112788 111205 110183 110367 111303 112149 112653 112911 112780 112212
55319 112212 111743 111837 112027 111454 110046 108528 107473 106963 106974 107476 108267 109203 110461 112066 113381 113611 112769
55302 112769 111681 111098 111114 111384 111578 111623 111629 111555 111113 110281 109721 110080 110996 111582 111845 112663 114188 115407 115748
55283 115748 115974 116832 117827 118225 118335 118799 119301 119086 118279 117663 117485 117343 116974 116363 115405 114245 113639 114172
55265 114172 115348 116129 116160 115874 115701 115848 116451 117290 117678 117368 117173 117950 119252 119868 119438 118725 118343 118030
55247A18030p69j227j109k89P39J069L36o16o82J5M43K39p1k55n58p00n2R83J164
55228A16690K20p20q74o27l75J20P19O57q7m28J23O49L90j00j15rk97n93l41J85
55208A15187M41M55M07J08m46p07l96k7p3k91l66m14m60k02K58L40J8JM37N10
55188A14780j52p43n48N2N03R34J373J252M62j17k1n9q73j641j353m34O7J48M74
55169A14104J026J274J256J312J126K00r91j383p29K87J092J617J774J396O85
55154A24046Q4k80n24o19n39o10j144j843k009j326j74P44R44N67K62L58L64k36
55136A18065q86n60N76J228Q80M58P11J027N27o13j637k170k089j246k4O33M40
55119A15320K69P91J461J533J250J215J316J169R68J037J100Q16N19O22Q65Q08
$$ plain form
55247 118030 117261 116034 114925 114636 115375 116444 116780 116164 115482 115497 115940 116179 116108 115853 115295 114595 114543 115526 116690
55228 116690 116910 116190 115316 114689 114314 114434 115153 115810 115723 115295 115418 116067 116457 116357 116242 116233 115936 115343 115002 115187
55208 115187 115628 116083 116490 116598 116152 115445 115049 115022 114949 114658 114292 113878 113418 113216 113474 113814 113832 113833 114270 114780
55188 114780 114628 113885 113337 113389 113892 114826 116199 117451 117913 117796 117775 117716 116843 115202 113849 113415 113482 113630 114104
55169 114104 115130 116404 117660 118972 120098 120298 119307 117924 117195 117482 118574 120191 121965 123361 124046
55154 124046 124130 123850 123326 122707 122168 121558 120414 118571 116562 115236 115062 115806 116750 117317 117579 117937 118301 118065
55136 118065 117179 116619 117195 118423 119303 119761 120472 121499 122026 121413 119776 117606 115517 114271 114247 114880 115320
55119 115320 115589 116380 117841 119374 120624 121839 123155 124324 125292 126329 127429 128245 128764 129386 130251 131059
55103A31059N54L13q2n94o00J64R02Q46L82L12O07P49O98O61M79J17J33P79J261
55084A38740Q69K11K34O17L07o71j236q94k63kk00p40j348j378m01R89J684J377
55066A37895O66J1o63j339j626j289n71Q4L19po01q80o07j56J15L26N90N75N7
55047A32899n68q20q33r86j284j491j462j014j3J038J203L78l67k46K68M82O13
55030A27797J038J296Q79L16L87P72O02j27o35n85l08q0J4j40l90j59O54J194
55012A32525Q22J04j41j19m13p68o33k79j94O2J137K446K800K101J264O96J24
54995A41534l76m32k78m15n83k35K36N6n13n69j91j56l34J28J011J136L84l1L19
54976A40691M03l35r29n47K23O07R15J553J888J211P2m39k21om7KJ69M9l87n77
$$ plain form
55103 131059 131613 131926 131844 131250 130650 130814 131716 132562 132944 133256 133863 134612 135310 135971 136450 136567 136700 137479 138740
55084 138740 139609 139820 140054 140671 140978 140307 139071 138177 137914 137912 137712 136972 135624 134246 133845 134834 136518 137895
55066 137895 138561 138572 137909 136570 134944 133655 133084 133168 133487 133480 132879 131999 131392 131236 131351 131677 132267 132842 132899
55047 132899 132331 131511 130678 129692 128408 126917 125455 124441 124428 125466 126669 127047 126680 126434 126702 127184 127797
55030 127797 128835 130131 131010 131326 131713 132485 133087 132960 132325 131740 131432 131352 131366 131226 130836 130677 131331 132525
55012 132525 133347 133451 133310 133191 132778 132010 131377 131098 130904 130966 132103 134549 137349 139450 140714 141410 141534
54995 141534 141158 140726 140448 140033 139450 139215 139451 139507 138994 138425 138234 138078 137744 137872 138883 140019 140403 140372 140691
54976 140691 141094 140759 139830 139283 139506 140113 141028 142581 144469 145680 145752 145313 145092 145086 145039 145041 145210 145259 144872 144295
54956A44295j32O11J000P91K95q9l18n65p14m16L14Q74Q06L46l3k30l05r1M27
54937A46866P75O28M78R69J856K386K401K387K597K802K865K842K781K875L606
54922A79114N052O424O905O605O045N196L867K500J592P26p63k528l768m585n600
54907B06782o490o320n191m232l947l847l673l647l459k477j111n76j040j346
54893A59426q94l52j43K62J011J330J053J265K508L619L458K685K659L506M408
54878A85801N177O181P159P278O325N008L959L028J609n93l094m902n547n682
54864B11707o178o811o708n915n413n392m885l583k631k840l244k570j202m94
54850A53841p85j319j648j958k147j816j142r04j412k066k086j315k54M02L75
$$ plain form
54956 144295 144163 144774 145774 146565 146860 146771 146453 145888 145174 144758 145072 145946 146752 147098 147065 146835 146530 146439 146866
54937 146866 147641 148269 148747 149716 151572 153958 156359 158746 161343 164145 167010 169852 172633 175508 179114
54922 179114 184166 190590 197495 204100 210145 215341 219208 221708 223300 224026 223263 220735 216967 212382 206782
54907 206782 200292 193972 188781 184549 180602 176755 173082 169435 165976 163499 162388 161812 160772 159426
54893 159426 158532 158180 158037 158299 159310 160640 161693 162958 165466 169085 172543 175228 177887 181393 185801
54878 185801 190978 197159 204318 211596 217921 222929 226888 229916 231525 230932 227838 222936 217389 211707
54864 211707 205529 198718 192010 186095 180682 175290 170405 166822 164191 161351 158107 155537 154335 153841
54850 153841 153056 151737 150089 148131 145984 144168 143026 142122 140710 138644 136558 135243 134989 135391 135766
54835A35766J34M03J143J508J094O32Q59J270P86n93j708j720r73k86l1j02l18
54818A37864n29n44k39K95P48Q51O66N31O18O59L79N5J75O44Q27M72P5J25N20
54799A44192R46J353J748J892J546P82j49r55j261q26m1K75j42o00l21O30J549
54782A50618J894J603J029P32J071J756K134K035J992K500L453M493N350N703
54768A86363N283M523M514N797P509Q259P539N883L901J777m11k431m073n284
54754B29149n959n914n250m587m626n347n912n661m996m758m833m184k468p25
54740A63929J21N42J281J788J072l62q87NJ196J835K299K949L292L017K800L322
54724A88199M258M955N387N828O137N968N213L874J954k02k066l631n284o774
$$ plain form
54835 135766 135900 136303 137446 138954 140048 140680 141539 142809 143595 143002 141294 139574 138601 138315 138284 138182 137864
54818 137864 137335 136791 136552 136847 137595 138446 139112 139643 140261 140920 141299 141354 141529 142173 143000 143472 143547 143672 144192
54799 144192 145138 146491 148239 150131 151677 152459 152310 151355 150094 149268 149227 149502 149360 148760 148439 149069 150618
54782 150618 152512 154115 155144 155876 156947 158703 160837 162872 164864 167364 170817 175310 180660 186363
54768 186363 191646 196169 200683 206480 213989 222248 229787 235670 239571 241348 240937 238506 234433 229149
54754 229149 223190 217276 212026 207439 202813 197466 191554 185893 180897 176139 171306 167122 164654 163929
54740 163929 164050 164592 165873 167661 168733 168371 167484 167489 168685 170520 172819 175768 179060 182077 184877 188199
54724 188199 192457 197412 202799 208627 214764 220732 225945 229819 231773 231571 229505 225874 220590 213816
54710B13816p134o183n114m997n365n076l940k761k236k387k769k722j803l77
54696A60952N87O04J85m8j12k64m95q22j468k261k538k061j433j133q56k52L52
54679A48937N85O96R53J001N32n0k92n22j156j793j750j179p97p44n29K9M88M20
54661A44829r6o66r70r65q13n40R2J006J433P49m37r32n69j69L5N90J321J230
54643A45128L23K3Q46J317K65j154j182n9O68N36L00K81J12j83j64J78N70J011
54625A48816J312P94n45j341o33M63L36n77o08L46P89K51q7M12P61Q8j002j447
54607A48128j001l6R81J491J198O70P12J056O85m42j189r29l57k62n21p18p76
54590A48690n65J72J105J316M66p72j612j822j321q6J248J668J060L70J91P8l77
$$ plain form
54710 213816 206682 200499 195385 190388 185023 179947 176007 173246 171010 168623 165854 163132 161329 160952
54696 160952 161539 162143 162328 162280 162168 161904 161409 160587 159119 156858 154320 152259 150826 149693 148837 148585 148937
54679 148937 149522 150218 151171 152172 152704 152654 152362 151840 150684 148891 147141 145962 145165 144421 143892 143921 144409 144829
54661 144829 144733 144067 143097 142132 141319 140779 140871 141877 143310 144059 143622 142690 142121 141952 141987 142577 143898 145128
54643 145128 145451 145474 146320 147637 147902 146748 145566 145507 146175 146711 147011 147292 147404 147221 147057 147235 147805 148816
54625 148816 150128 150922 150377 149036 148403 148866 149202 148625 148017 148363 149152 149403 149316 149728 150489 150577 149575 148128
54607 148128 147127 147091 148072 149563 150761 151431 152143 153199 153884 153442 152253 151324 150967 150705 150184 149466 148690
54590 148690 148125 148297 149402 150718 151184 150412 148800 146978 145657 145571 146819 148487 149547 149917 150108 150186 149809
54573A49809p37n42j03J19K01L58M64N05P57J128R83J88m25j87M03M97Q1k48k28
54554A53023l5K23N03O04M90M97Q37J187J212J107J247J647K115K533K566J676
54538A71432k6j386j369l55L73K52j36k08j63m46r96j399j474j357j145p65k58
54521A60574N5j03n70q68p77o02o80q37o21M9P51J066R80P48N42L15l2m15n07
54502A59068j26M19O12L94J56P8m6j64J41Q36J186Q12L14K51K29k06m28L52J507
54483A65385J594M04p20p16R7Q93J305J233O92J31K00Q36J295J297J379J857K200
54466A79362J866J133O73P78J236J571J284L83k77R2R51Q73n92k382l420l749
54450A79782l751l258k114q49n5L89P72P97Q3r63j484j248p99o88r54j230j016
$$ plain form
54573 149809 149072 148530 148427 148546 148747 149105 149569 150074 150831 151959 152942 153130 152705 152518 152921 153418 153499 153251 153023
54554 153023 152988 153211 153714 154318 154808 155305 156142 157329 158541 159648 160895 162542 164657 167190 169756 171432
54538 171432 171406 170020 168651 168296 168669 168921 168785 168577 168414 167968 166972 165573 164099 162742 161597 160832 160574
54521 160574 160629 160526 159956 159088 158311 157709 157029 156192 155571 155620 156371 157437 158417 159165 159707 160022 159990 159575 159068
54502 159068 158942 159361 159973 160367 160523 160601 160555 160391 160532 161368 162554 163366 163680 163931 164160 163954 163526 163878 165385
54483 165385 166979 167383 166663 165947 166044 166937 168242 169475 170167 170298 170498 171334 172629 173926 175305 177162 179362
54466 179362 181228 182361 183034 183812 185048 186619 187903 188286 188009 188101 189052 189925 189333 186951 183531 179782
54450 179782 176031 172773 170659 169810 169755 170144 170916 171713 171796 170833 169349 168101 167302 166614 165660 164430 163414
54433A63414n6J256K047J822R79L26K53N76Q84R02P30P96J313J811J589O56k83
54416A79015p41q51p95n45k76l38n67k80O86J575J673J106L70l72j049j291q05
54399A76515J60J025J343R43J09l29K54J344J774J331R81J221J256L87p15r91
54383A86608m76Q1M83R66J286R08j1o85o64j33O16J424K061K404K707L296M069
54366B04940M646M776M302L064J350J4m20m54q51j494j649j203q68j158j765k036
54350B11194j689r99o01j012k086l044l324l109k807k406j698q16l9O43J259J483
54334A90949J069L93qk37o70j113j011m96l83r98j614j389m04N19P41L47p9k5
54316A85591M90R76R70M49k38o46n03J9L07q8q43j274j344j549j805j386l01L12
$$ plain form
54433 163414 163358 164614 166661 168483 169462 169788 170041 170617 171501 172403 173133 173929 175242 177053 178642 179298 179015
54416 179015 178274 177423 176628 176083 175807 175469 174902 174622 175308 176883 178556 179662 180032 179660 178611 177320 176515
54399 176515 176675 177700 179043 179986 180095 179766 180020 181364 183138 184469 185450 186671 187927 188314 187599 186608
54383 186608 186132 186213 186696 187662 188948 189856 189845 189160 188496 188363 188979 190403 192464 194868 197575 200871 204940
54366 204940 209586 214362 218664 221728 223078 223092 222672 222218 221367 219873 218224 217021 216153 214995 213230 211194
54350 211194 209505 208506 207905 206893 204807 201763 198439 195330 192523 190117 188419 187603 187564 188207 189466 190949
54334 190949 192018 192411 192403 192166 191496 190383 189372 188876 188493 187495 185881 184492 184088 184607 185348 185695 185616 185591
54316 185591 186081 187057 188027 188476 188238 187592 187089 187108 187415 187327 186484 185210 183866 182317 180512 179126 178825 179137
54298A79137p3k66R25K635K998J787N94M26N71J48n22p19n40n76r33j104o37M61
54280A84312J614J927R84m83j270j060n50k32J04M58K92l80m97N61J743J663P00
54263A89886N55J810L065K816J300p8m14J48J052J796J963J399M26m08q04p51
54247B03761l31J57J01p78j715j575m37K82l36j405j510o75r8j95r1P66J547J211
54229A98679K9p51m28N57J393J657J428R73M92l4o47j156j254j017r19j168j379
54212A96455j153o77m01l81k95m7M8k84q26j021n05M45J108J040N51K55K88K89
54194A94889M7k46l82m02l83l86n52q84r61m05M37Q90R50J176J521J302N05J31
54176A97247P17J463J498J178J258J498J103Q0q00j147j175j047p51n34o80r70
$$ plain form
54298 179137 179064 178798 179723 182358 185356 187143 187737 188163 188734 188882 188360 187641 187101 186525 185592 184488 183851 184312
54280 184312 185926 187853 188837 188354 187084 186024 185474 185242 185346 185804 186096 185716 185219 185780 187523 189186 189886
54263 189886 190441 192251 195316 198132 199432 199354 198940 199088 200140 201936 203899 205298 205724 205316 204512 203761
54247 203761 203430 203587 203688 202910 201195 199620 199183 199465 199129 197724 196214 195539 195441 195246 195155 195921 197468 198679
54229 198679 198708 197957 197529 198086 199479 201136 202564 203537 204029 203995 203348 202192 200938 199921 199002 197834 196455
54212 196455 195302 194625 194224 193843 193548 193501 193549 193265 192439 191418 190913 191358 192466 193506 194057 194312 194600 194889
54194 194889 194936 194690 194308 193906 193523 193137 192585 191701 190740 190335 190772 191662 192612 193788 195309 196611 197116 197247
54176 197247 197964 199427 200925 202103 203361 204859 205962 206042 205242 204095 202920 201873 201122 200588 199908 198938
54160A98938r86q64j102j700k088j884j188k53O11R49N42j78n30l55j0K29K82
54143A90413M6m95j065j356j311q55J95J521K170J678P61L32L63N06J052K273
54127A96228L342L239K387J986J940J040p22j657p74P54J332J013R45J601K545
54112B15199L351L876L963L598L229L328L816M232M237L686K500Q59p41j928k692
54097B50513l113l159k965k909l131l299l051k421j685j134j084j612k210k139
54083B16601j398p55o40o06k37J12K2p9N44J706K394K054J237R04J386K177K508
54066B27930K078J325R53J161J424J173M54k19m88m17k24pK15L53K66Qm6M59J315
54047B37713J897J970K041K587L324L649L557L525L718L905M087M540N226N784
$$ plain form
54160 198938 197952 197088 195986 194286 192198 190314 189126 188873 189484 190433 190975 190797 190267 189912 189902 190131 190413
54143 190413 190459 189964 188899 187543 186232 185377 185572 187093 189263 190941 191702 192034 192397 192903 193955 196228
54127 196228 199570 202809 205196 207182 209122 210162 209440 207783 207009 207763 209095 210108 211053 212654 215199
54112 215199 218550 222426 226389 229987 233216 236544 240360 244592 248829 252515 255015 255874 255133 253205 250513
54097 250513 247400 244241 241276 238367 235236 231937 228886 226465 224780 223646 222562 220950 218740 216601
54083 216601 215203 214448 213808 213202 212965 213077 213099 213020 213564 215270 217664 219718 220955 221859 223245 225422 227930
54066 227930 230008 231333 232286 233447 234871 236044 236498 236279 235791 235374 235150 235143 235358 235711 235977 235985 235939 236398 237713
54047 237713 239610 241580 243621 246208 249532 253181 256738 260263 263981 267886 271973 276513 281739 287523
54033B87523O158O628P188P482P466P449P380O783N641M590M021L610L108K781
54019C67808K644K023N21j136j956j937j801j849j856j869k337l450m879o178
54005C43748p004p045o257n163m444m237m155l931l593l085k294j488j253j738
53991B88061k409k702k633k482k288k013j892k206k713k761k038r31j4N40R06
53976B62425J217J492J751J964J994J856J886K329K935L428M138N539P143P646
53962C07743O392M039J458j104l426m719m551l745l378l355k878j957j317j043
53948B88159l95Q64K069K693K977L268L503L638L795L895L795L893M697N702N650
53933C38203M222K581J772J541J205Q40Q99J412K179L208M340N038N179N457O392
$$ plain form
54033 287523 293681 300309 307497 314979 322445 329894 337274 344057 349698 354288 358309 361919 365027 367808
54019 367808 370452 372475 372996 371860 369904 367967 366166 364317 362461 360592 358255 354805 349926 343748
54005 343748 336744 329699 323442 318279 313835 309598 305443 301512 297919 294834 292540 291052 289799 288061
53991 288061 285652 282950 280317 277835 275547 273534 271642 269436 266723 263962 261924 260993 260979 261519 262425
53976 262425 263642 265134 266885 268849 270843 272699 274585 276914 279849 283277 287415 292954 300097 307743
53962 307743 314135 318174 319632 318528 315102 310383 305832 302087 298709 295354 292476 290519 289202 288159
53948 288159 287764 288628 290697 293390 296367 299635 303138 306776 310571 314466 318261 322154 326851 332553 338203
53933 338203 342425 345006 346778 348319 349524 350364 351263 352675 354854 358062 362402 367440 372619 378076 384468
53918C84468P471P942P902P914Q045Q072Q213Q815R552R714R153Q315P501O654
53904D99731N731M718L461J977O66k24j085k303l559m359m925n742o494o436n762
53889D75395n623o622q089r169r790j0160j0068r287q282p751p646p233o231n277
53875C64167n041n246n027m190l537l775m543m959m802m562m498m321l925l688
53861C02053l834m034l958l735l491k972k052j203r43j105j126q26n21n39r13
53846B70801j383j532j187p72q41j201j071l22K10Jl26o0M74N30J17k93o49j083
53828B61413j235p44p8R7N0M69J080R06j06q22m78M59J256J807K260K488K398
53811B71220K183K002J916K227L235M512N146M952M751N058N283M765L966L943
$$ plain form
53918 384468 391939 399881 407783 415697 423742 431814 440027 448842 458394 468108 477261 485576 493077 499731
53904 499731 505462 510180 513641 515618 516284 516060 514975 512672 509113 504754 499829 494087 487593 481157 475395
53889 475395 469772 463150 455061 445892 436102 425942 415874 406587 398305 390554 382908 375675 369444 364167
53875 364167 359126 353880 348853 344663 341126 337351 332808 327849 323047 318485 313987 309666 305741 302053
53861 302053 298219 294185 290227 286492 283001 280029 277977 276774 275831 274726 273600 272774 272253 271714 270801
53846 270801 269418 267886 266699 265927 265086 263885 262814 262492 262702 262703 262377 262317 262791 263321 263438 263145 262496 261413
53828 261413 260178 259434 259356 259453 259503 259972 261052 261958 261852 261030 260552 261011 262267 264074 266334 268822 271220
53811 271220 273403 275405 277321 279548 282783 287295 292441 297393 302144 307202 312485 317250 321216 325159
53797C25159M979O377P400P844P764P158O033M581L235K521K675L233L284K342
53783C94585Q48l51r06j186j756k819m096n172n849o189o239n957n491n311n644
53768C38467o043n838n006m161l733l555l324l016k734k443k104j848j871k227
53754B90564k777l190l118k558j962j704j585j152m90j96n76j234j576j403r04
53739B66139l76m5K1j12l97q72j321j159q4J280J891J480P25L52N05J009J621
53722B70657J961J740J298J325J887K297K147J802J534R48j01o62L30K470M112
53707B93745M247L445K862K900L165L238L017K587K162K144K837M005M949N194
53693C40497M919M554M111L275K078J088P32P52N93J23l25m67l06k7R7j90q46
$$ plain form
53797 325159 330138 336515 343915 351759 359523 366681 372714 377295 380530 383051 385726 388959 392243 394585
53783 394585 395433 395082 394176 392990 391234 388415 384319 379147 373298 367109 360870 354913 349422 344111 338467
53768 338467 332424 326586 321580 317419 313686 310131 306807 303791 301057 298614 296510 294662 292791 290564
53754 290564 287787 284597 281479 278921 276959 275255 273670 272518 272028 271832 271256 270022 268446 267043 266139
53739 266139 265763 265718 265739 265627 265230 264358 263037 261878 261794 263074 264965 266445 267170 267522 268027 269036 270657
53722 270657 272618 274358 275656 276981 278868 281165 283312 285114 286648 287596 287495 286833 287163 289633 293745
53707 293745 297992 301437 304299 307199 310364 313602 316619 319206 321368 323512 326349 330354 335303 340497
53693 340497 345416 349970 354081 357356 359434 360522 361254 362006 362599 362722 362397 361930 361624 361597 361694 361504 360658
53676C60658j471j701j629j532j444j302j223j259j056l00O55J157J060P03K19
53661C51535m21q34n08K22L96j57m40K04J065J148N59P5j26l67m47K51J589K486
53643C56230K204J236N70N52Q23J079J394J843K197K168J843J636J784K037K021
53628C79617J760J657J950K481K982L349L512L360L000K795K889K889K411J786
53614D16438J786K609L554L883L692L575L706L679L311L032L210L455L139K398
53600D61467K010K234K369J747O36k26n19l61J48Q16J115P13Q0m9L09M59K1q00
53582D72169j882l257m490m784m042l127k717k495j943j278j006j058r94q38r98
53567D37260j466j680j256m78N9N7k58l72J3O66J084J083R07P44N31L82P00J560
$$ plain form
53676 360658 359187 357486 355857 354325 352881 351579 350356 349097 348041 347741 348396 349553 350613 351316 351535
53661 351535 351114 350280 349772 349994 350390 350233 349793 349997 351062 352210 352769 352844 352718 352351 351904 352155 353744 356230
53643 356230 358434 359670 360240 360792 361615 362694 364088 365931 368128 370296 372139 373775 375559 377596 379617
53628 379617 381377 383034 384984 387465 390447 393796 397308 400668 403668 406463 409352 412241 414652 416438
53614 416438 418224 420833 424387 428270 431962 435537 439243 442922 446233 449265 452475 455930 459069 461467
53600 461467 463477 465711 468080 469827 470463 470237 469718 469357 469505 470321 471436 472149 472229 472180 472489 472948 472969 472169
53582 472169 470287 467030 462540 457756 453714 450587 447870 445375 443432 442154 441148 440090 439096 438258 437260
53567 437260 435794 434114 432858 432380 432439 432496 432238 431866 431879 432545 433629 434712 435619 436363 436894 437276 437976 439536
53549D39536K301K281J722J370J495J776K022K377K772K779K277J841K107L041
53535D69697M061M771N205N557N955O532P424Q534R492R994J0149J0349J0807
53522E68527J1419J2059J2811J3773J4760J5402J5528J5386J5488J6215J7452
53511G28820J8684J9539K0303K1539K3212K4576K5098K5106K5160K5155K4556
53500I81748K3286K1879K0850K0336K0223K0207J9813J8899J8033J7851J8077
53489A201202J7806J6838J6051J6223J7055J7685J7734J7500J7339J7254J7004
53478A389691J6442J5721J5091J4417J3164J1135Q873O903M959K570J02j714l130
53465A494224n114p714r741j0526j0930j2021j3584j4668j4904j4613j4191j4079
$$ plain form
53549 439536 441837 444118 445840 447210 448705 450481 452503 454880 457652 460431 462708 464549 466656 469697
53535 469697 473758 478529 483734 489291 495246 501778 509202 517736 527228 537222 547371 557720 568527
53522 568527 579946 592005 604816 618589 633349 648751 664279 679665 695153 711368 728820
53511 728820 747504 767043 787346 808885 832097 856673 881771 906877 932037 957192 981748
53500 981748 1005034 1026913 1047763 1068099 1088322 1108529 1128342 1147241 1165274 1183125 1201202
53489 1201202 1219008 1235846 1251897 1268120 1285175 1302860 1320594 1338094 1355433 1372687 1389691
53478 1389691 1406133 1421854 1436945 1451362 1464526 1475661 1484534 1491437 1496396 1498966 1499068 1497354 1494224
53465 1494224 1489110 1481396 1471655 1461129 1450199 1438178 1424594 1409926 1395022 1380409 1366218 1352139
53453A352139j4824j6426j7949j8465j8148j7851j7966j8156j8011j7393j6423
53442A160527j5515j5118j5004j4230j2240r596p183n176l340j815q77l31K05
53429A060307P24J197K111L838N896P469Q402Q992R253R287R896J1821J4555J6944
53415A170692J8706K0364K1917K2830K3338K4431K6321K8125K9406L0772L2528
53404A449430L3936L4549L5180L6703L8723M0365M1709M3462M5638M7542M8806
53393A896043M9667N0347N0928N1668N2714N3485N3088N1504M9797M8844M8302
53382B456387M7108M4822M2088L9772L7867L5520L2028K7579K2877J8301J3806
53371B818155R408N291J351k830p545j2753j8406k4488l0612l6017m0201m3206
$$ plain form
53453 1352139 1337315 1320889 1302940 1284475 1266327 1248476 1230510 1212354 1194343 1176950 1160527
53442 1160527 1145012 1129894 1114890 1100660 1088420 1078824 1071641 1066465 1063125 1061310 1060433 1060102 1060307
53429 1060307 1061031 1062228 1064339 1068177 1074073 1081542 1089944 1098936 1108189 1117476 1127372 1139193 1153748 1170692
53415 1170692 1189398 1209762 1231679 1254509 1277847 1302278 1328599 1356724 1386130 1416902 1449430
53404 1449430 1483366 1517915 1553095 1589798 1628521 1668886 1710595 1754057 1799695 1847237 1896043
53393 1896043 1945710 1996057 2046985 2098653 2151367 2204852 2257940 2309444 2359241 2408085 2456387
53382 2456387 2503495 2548317 2590405 2630177 2668044 2703564 2735592 2763171 2786048 2804349 2818155
53371 2818155 2827563 2832854 2834205 2831375 2823830 2811077 2792671 2768183 2737571 2701554 2661353 2618147
53359B618147m5223m6356m6968m7658m8532m8980m8521m7439m6193m4688m2717
53348B104872m0703l9330l8602l7936l7107l6530l6515l6724l6521l5611l4254
53337A695039l3014l2213l1439k9835k7114k4038k1555j9682j7774j5718j4149
53326A428508j3483j3405j3531j4004j5002j6070j6425j5842j4855j4111j3710
53315A268070j3229j2259j0891r597q573p398n556l255j294n8R12K164L561M657
53301A207254N561O844Q711J0677J2260J3567J5057J6949J9012K0771K1833K2189
53289A380685K2322K2812K3660K4214K3906K2817K1366J9716J7846J5969J4322
53278A609635J2599J0115O747L236L32j969m075o085p882r591j1476j3487j5350
$$ plain form
53359 2618147 2572924 2526568 2479600 2431942 2383410 2334430 2285909 2238470 2192277 2147589 2104872
53348 2104872 2064169 2024839 1986237 1948301 1911194 1874664 1838149 1801425 1764904 1729293 1695039
53337 1695039 1662025 1629812 1598373 1568538 1541424 1517386 1495831 1476149 1458375 1442657 1428508
53326 1428508 1415025 1401620 1388089 1374085 1359083 1343013 1326588 1310746 1295891 1281780 1268070
53315 1268070 1254841 1242582 1231691 1222094 1213521 1206123 1200567 1197312 1196018 1195960 1196872 1199036 1202597 1207254
53301 1207254 1212815 1219659 1228370 1239047 1251307 1264874 1279931 1296880 1315892 1336663 1358496 1380685
53289 1380685 1403007 1425819 1449479 1473693 1497599 1520416 1541782 1561498 1579344 1595313 1609635
53278 1609635 1622234 1632349 1639096 1642332 1642664 1640695 1636620 1630535 1622653 1613062 1601586 1588099 1572749
53265A572749j7107j9113k1487k3871k5768k6829k6884k6150k5419k5511k6362
53254A308248k7029k6880k6319k6027k5917k5329k4110k2899k2326k2394k2745
53243A036273k3160k3543k3669k3248k2246k0944j9661j8526j7548j6831j6479
53232H10418j6304j5745j4383j2461j0718r592q808p911p016o782p627r174j0548
53219F73349j1224j1510j2181j3563j5015j5591j5133j4434j4110j3786j2738
53208E24064j1060r626q881q353p512o606o256o588p226p866q430q739q527p859
53194D10535p108o516o053n748n781o025n974n366m590m165m055l782l185k599
53180C39588k390k598l009l360l390k982k329j788j577j734k204k751k907k388
$$ plain form
53265 1572749 1555642 1536529 1515042 1491171 1465403 1438574 1411690 1385540 1360121 1334610 1308248
53254 1308248 1281219 1254339 1228020 1201993 1176076 1150747 1126637 1103738 1081412 1059018 1036273
53243 1036273 1013113 989570 965901 942653 920407 899463 879802 861276 843728 826897 810418
53232 810418 794114 778369 763986 751525 740807 731215 722407 714496 707480 700698 693071 683897 673349
53219 673349 662125 650615 638434 624871 609856 594265 579132 564698 550588 536802 524064
53208 524064 513004 503378 494497 486144 478632 472026 465770 459182 451956 444090 435660 426921 418394 410535
53194 410535 403427 396911 390858 385110 379329 373304 367330 361964 357374 353209 349154 345372 342187 339588
53180 339588 337198 334600 331591 328231 324841 321859 319530 317742 316165 314431 312227 309476 306569 304181
53166C04181j565j086j026q45k80K35K24j71n47q24j051j056p90p30j314k060
53150B91295j959p83N12R25N04J7n2J52K82K08L0o7L9L57Q35J402J863J830J083
53131B98473L2n23k32M49R12J094J238J240P51r6n75j01J130K396L094L067K517
53114C14866J889J630J850K183K167J687R65K42l69p92j032j269j663k063k112
53099C18179j799j583j829k294k428k074j654j672k188k778k909k401j621j135
53085B89814j071j036o95k44o2j41j65MK44M96P79R04O54K22P3K03kr09j958k185
53065B84925j297k0O16K12p39j344j157n07k4N2o4j20n8N5P0k03o07m84O14K150
53045B82070K994K657J627N19m61j094j011l25K61L87M90Q81R97K05j152k142
$$ plain form
53166 304181 302616 301530 300504 299659 299379 299614 299838 299667 299120 298296 297245 296189 295399 294669 293355 291295
53150 291295 289336 288553 289065 289990 290494 290511 290459 290611 290893 291101 291131 291064 291103 291460 292295 293697 295560 297390 298473
53131 298473 298505 297982 297750 298199 299111 300205 301443 302683 303434 303338 302763 302662 303792 306188 309282 312349 314866
53114 314866 316755 318385 320235 322418 324585 326272 327237 327479 327110 326318 325286 324017 322354 320291 318179
53099 318179 316380 314797 312968 310674 308246 306172 304518 302846 300658 297880 294971 292570 290949 289814
53085 289814 288743 287707 287012 286768 286706 286565 286400 286404 286648 287144 287923 288827 289481 289703 289776 289979 289977 289068 287110 284925
53065 284925 283628 283608 284224 284436 283697 282353 281196 280689 280665 280717 280653 280533 280475 280530 280600 280397 279790 279306 279920 282070
53045 282070 285064 287721 289348 289867 289406 288312 287301 286976 287237 287624 288114 288995 289992 290197 289045 286903
53029B86903k323j852r40J68R53J059Q18P04N47m9p55q10j57M82P25R32J388J806
53011B89599J836J509J022O18P12J531K474K514J462K21m52p42r65p46K83J508
52995C02384J847J123K03j54p2m0j30R4J017K527L972M604M168L093K023J213
52979C27872M80l23j036j443j543j445j120m65L46Q80Q54M69J18J7K41R17J963
52962C26782K788K762K011J312J077R48N57Q4k22n32j061j583j856k071k427k641
52946C25928k423k073j979j882j320n30j53k23k26p2k54r00j400j174l53M59O95
52929C12120J97n40o80p3L30k92j298j471q67o53j090j090j74M76k59j630k020
52912C00986j122j30k3n20p03r3R40J552J228L77j48r7l0l53o86m98J53Q32J256
$$ plain form
53029 286903 284580 282728 281788 281956 282909 283968 284786 285490 286037 285988 285233 284423 284266 284748 285473 286405 287793 289599
53011 289599 291435 292944 293966 294584 295296 296827 299301 301815 303277 303498 303046 302304 301339 300593 300876 302384
52995 302384 304231 305354 305557 305403 305331 305291 305161 305255 306272 308799 312771 317375 321543 324636 326659 327872
52979 327872 328352 328029 326993 325550 324007 322562 321442 320977 321323 322203 323057 323526 323644 323661 323902 324819 326782
52962 326782 329570 332332 334343 335655 336732 337680 338237 338321 338099 337567 336506 334923 333067 330996 328569 325928
52946 325928 323505 321432 319453 317571 316251 315721 315568 315345 315119 315047 314793 313893 312493 311319 310966 311425 312120
52929 312120 312317 311777 311097 311024 311354 311062 309764 308293 307426 306773 305683 304593 304419 304895 304636 303006 300986
52912 300986 299864 299734 299711 299191 298488 298395 299335 300887 302115 302492 302344 302247 302217 301864 301178 300680 300833 301665 302921
52893C02921J276P96J15j03L77R98J171R97Q30N88M6n15n62j6P08J262J540J529
52875C13958J336J176J103R71R08J403K563L693M027L574K808J883O89n64j434
52860C38094j801j913j988k164k621l327l777l473k620j958j896k128k112j678
52846C04638j229j381k344l510l928l297k246j488j069o24J6P18J159Q94k41j552
52830B84516j905j080n9L99P95J778K763K597J288on55p12r26j014o83j32K30
52813B87294L02L04M34O08M33l09j120j034J51J369J484N99l96j152j911k495
52797B84561k283j290m18l52q18j169j142p76p2Q28J466J363M75o82j249n87R88
52780B78843K245K231J363Q14R38R57K05r40j667j716j431j141q56m65k3K01M9
$$ plain form
52893 302921 304197 304993 305108 305005 305382 306380 307551 308548 309378 309966 310012 309497 308935 308919 309627 310889 312429 313958
52875 313958 315294 316470 317573 318544 319452 320855 323418 327111 331138 334712 337520 339403 340092 339528 338094
52860 338094 336293 334380 332392 330228 327607 324280 320503 317030 314410 312452 310556 308428 306316 304638
52846 304638 303409 302028 299684 296174 292246 288949 286703 285215 284146 283522 283538 284256 285415 286309 286068 284516
52830 284516 282611 281531 281472 281871 282666 284444 287207 289804 291092 291086 290531 289819 288893 287879 287196 287064 287294
52813 287294 287596 287900 288334 288942 289375 289066 287946 286912 287063 288432 289916 290515 290119 288967 287056 284561
52797 284561 282278 280988 280570 280218 279400 278231 277089 276313 276241 277069 278535 279898 280373 279691 278442 277855 278843
52780 278843 281088 283319 284682 285496 286434 287391 287596 286656 284989 283273 281842 280701 279845 279380 279357 279558 279607
52763B79607j85l1M25N33J06j1R36K367K972K361J316N27l3l74j90M52Q61O64
52745B92303L55M69P76P39L94K83P27J536K259K486K113J479J040Q37O09L96O15
52728C09416J319J911J853J336R51R85J252J302O60p35k136k455j493l26m5n05
52712C13290p77n41l95q08j413j531j048m32o2J71N63J090J374J151N87J7m96
52695C10740j096j719j953j486n83J6k33j114j746j402k23R53J431J172N21j64
52679C03114n43m05L6K72J22j02k24m58p36m43O62J756J855J105M31K81M45P59
52661C07927J176J316Q12R8M8P61J474J636J446J296J447K143L317M162L821K503
52645C35383J124m2j369k621k921k196j411j041n66J23J17q72j566r34J47K18
$$ plain form
52763 279607 279422 279391 279816 280349 280455 280444 281380 283747 286719 289080 290396 290923 290890 290516 290326 290778 291639 292303
52745 292303 292658 293127 293903 294642 295036 295319 296046 297582 299841 302327 304440 305919 306959 307796 308405 308801 309416
52728 309416 310735 312646 314499 315835 316786 317771 319023 320325 320985 320250 318114 315659 314166 313840 313795 313290
52712 313290 312513 311972 311577 310769 309356 307825 306777 306345 306283 306454 307017 308107 309481 310632 311219 311236 310740
52695 310740 309644 307925 305972 304486 303903 303919 303686 302572 300826 299424 299201 300154 301585 302757 303278 303114
52679 303114 302571 302166 302202 302474 302596 302494 302270 301812 301076 300633 301295 303051 304906 306011 306442 306723 307168 307927
52661 307927 309103 310419 311231 311329 311377 312138 313612 315248 316694 317990 319437 321580 324897 329059 332880 335383
52645 335383 336507 336465 335096 332475 329554 327358 325947 324906 324340 324463 324580 323708 322142 321208 321355 321573
52629C21573m29k64J151K643L165K808K026Q58o48k024k775k866k599k281k043
52614C18295j819j447r45m87p0M21P12K87o76j118l98P49J226J031R55J180J136
52597C19032O86M87R18J429J255M16l86o00l59k20m68p28m52K86Q52R86J094J317
52579C25545J107K38l29M34K014K776J952M11n76n70J32J001J417R01l79j656
52563C34418k270k185j765j423j412j602j464p26J2j11j005j654j433p75k76J09
52547C16438O11R04N00m01j055j045n89rO20J200J407J017K91j68j5N29J004J206
52529C22445J261J253J076P18N00Q01J608K505L000K789J927R18N21J073K044
52514C44439K515K108J316R42J431K590L702L933K975J356n0r04j630k730m128
$$ plain form
52629 321573 321144 320880 322031 324674 327839 330647 332673 333531 332883 330859 328084 325218 322619 320338 318295
52614 318295 316476 315029 314084 313597 313527 313948 314660 314947 314271 313153 312755 313504 314730 315761 316716 317896 319032
52597 319032 319718 320205 321123 322552 323807 324223 323837 323237 322878 322658 322190 321462 321010 321296 322148 323134 324228 325545
52579 325545 326652 326890 326561 326995 329009 331785 333737 334148 333572 333002 333134 334135 335552 336453 336074 334418
52563 334418 332148 329963 328198 326775 325363 323761 322297 321571 321583 321472 320467 318813 317380 316605 316329 316438
52547 316438 317049 317953 318453 318052 316997 315952 315363 315354 315974 317174 318581 319598 319889 319721 319706 320235 321239 322445
52529 322445 323706 324959 326035 326753 327253 328054 329662 332167 335167 337956 339883 340801 341322 342395 344439
52514 344439 346954 349062 350378 351320 352751 355341 359043 362976 365951 367307 367257 366353 364723 361993 357865
52499C57865n225n478m808l570k280j329q40o90o38n54n70r63j641j983j474m74
52483C25348J36J25J59O59J084Q14L12N76J663K549K512J998J839K153K412K230
52467C46569J754J432J654K508L603M234L943K986K039J478J028K22r63k090k828
52452C67569l229l455l507l462l609m002m079l281j917q96n17k45J76J13r51k383
52436C32325l018k549j712j146p09N2J131J913J776P86j87k66M75J114J037N41
52420C31563K00J24J71L99Q48J201J182J031J151J571K116K805L606M143M233
52405C56344M385N249O722Q205R411J0272J0310Q947O371L422N98k143m630o289
52391D17174o931p064p177p154o590n318l510j673m88k55m14j21O90J356J535
$$ plain form
52499 357865 352640 347162 342354 338784 336504 335175 334335 333645 333007 332453 331883 330920 329279 327296 325822 325348
52483 325348 325484 325609 325768 326427 327511 328325 328637 329213 330876 333425 335937 337935 339774 341927 344339 346569
52467 346569 348323 349755 351409 353917 357520 361754 365697 368683 370722 372200 373228 373450 372487 370397 367569
52452 367569 364340 360885 357378 353916 350307 346305 342226 338945 337028 336132 335615 335370 335546 335659 334708 332325
52436 332325 329307 326758 325046 323900 323191 323243 324374 326287 328063 328849 328662 328396 328871 329985 331022 331563
52420 331563 331763 331887 332058 332457 333305 334506 335688 336719 337870 339441 341557 344362 347968 352111 356344
52405 356344 360729 365978 372700 380905 390316 400588 410898 419845 426216 429638 430236 428093 423463 417174
52391 417174 410243 403179 396002 388848 382258 376940 373430 371757 371269 371014 370600 370479 371169 372525 374060
52376C74060J595J867K203K487K978L801M586M938M862M458L644K488J434Q22
52362D16223M59p4q58j633k075j977j338n00Q3K78L15M30P34J329K140K650K341
52345D18527J537J218J826K719L108L019L048L546M404N339O049O340O344O465
52331D73489O886P394P896Q724J0148J1841J3128J3724J3988J4452J5206J5697
52319F12573J5308J4262J3698J4471J6055J7238J7685J8135J9000J9702J9753
52308G97880J9660K0162K1123K1791K1845K1619K1515K1678K2097K2533K2483
52297A034386K1579J9951J7933J5610J2832R657O460L736J815O07l92j637l022
52284A139515m133m896n503n783n358m475l974m128m308m094l855l714k878q60
$$ plain form
52376 374060 375655 377522 379725 382212 385190 388991 393577 398515 403377 407835 411479 413967 415401 416223
52362 416223 416682 416608 415750 414117 412042 410065 408727 408227 408310 408588 408903 409333 410067 411396 413536 416186 418527
52345 418527 420064 421282 423108 425827 428935 431954 435002 438548 442952 448291 454340 460680 467024 473489
52331 473489 480375 487769 495665 504389 514537 526378 539506 553230 567218 581670 596876 612573
52319 612573 627881 642143 655841 670312 686367 703605 721290 739425 758425 778127 797880
52308 797880 817540 837702 858825 880616 902461 924080 945595 967273 989370 1011903 1034386
52297 1034386 1055965 1075916 1093849 1109459 1122291 1131948 1138408 1142144 1143959 1144566 1144174 1142537 1139515
52284 1139515 1135382 1130486 1124983 1119200 1113842 1109367 1105393 1101265 1096957 1092863 1089008 1085294 1082416 1081556
52270A081556J380K594K989L788N335O793P580Q025Q540R117R874J1145J2804
52257A171520J4163J4914J5541J6561J7881J9117J9904J9708J8084J5526J3348
52246A356267J2145J0936Q474N021K045L64o56j933l431m456m780n008n845p357
52232A361786r099j0711j2072j2976j3094j2465j1693j1352j1402j1448j1322
52221A234152j0948r985q280o598o111o849p367o405m344k540j661j273p35J64
52207A161220J378K715L766M222M400M936N805O175N518M406L903M402N450O439
52193A224735P043P195P044O913O953O841O133M889L569K360R49r16l023m966
52179A275719o485p439p867q164q815r652r837q958p656o748o106n061l603k438
$$ plain form
52270 1081556 1082936 1085530 1088519 1092307 1097642 1104435 1112015 1120040 1128580 1137697 1147571 1158716 1171520
52257 1171520 1185683 1200597 1216138 1232699 1250580 1269697 1289601 1309309 1327393 1342919 1356267
52246 1356267 1368412 1379348 1387822 1392843 1394888 1395252 1394596 1392663 1389232 1384776 1379996 1374988 1369143 1361786
52232 1361786 1352687 1341976 1329904 1316928 1303834 1291369 1279676 1268324 1256922 1245474 1234152
52221 1234152 1223204 1213219 1204939 1198341 1192230 1185381 1178014 1171609 1167265 1164725 1163064 1161791 1161056 1161220
52207 1161220 1162598 1165313 1169079 1173301 1177701 1182637 1188442 1194617 1200135 1204541 1208444 1212846 1218296 1224735
52193 1224735 1231778 1238973 1246017 1252930 1259883 1266724 1272857 1277746 1281315 1283675 1284624 1283708 1280685 1275719
52179 1275719 1269234 1261795 1253928 1245764 1236949 1227297 1217460 1208502 1200846 1194098 1187992 1182931 1179328 1176890
52165A176890j889j457o27N55J827L037L942M193L812L289K879K244J094k39j257
52150A198293j964k618l045k760j642r8J415K673L474L603L165K704K661K807
52136A208668K411J133l23p30M21K405M258N956Q176J1005J3580J5166J5995J6743
$$ plain form
52165 1176890 1175001 1173544 1172917 1173472 1175299 1178336 1182278 1186471 1190283 1193572 1196451 1198695 1199789 1199550 1198293
52150 1198293 1196329 1193711 1190666 1187906 1186264 1186166 1187581 1190254 1193728 1197331 1200496 1203200 1205861 1208668
52136 1208668 1211079 1212212 1211889 1211159 1211580 1213985 1218243 1224199 1232375 1243380 1256960 1272126 1288121 1304864
$$ [...]
##END NTUPLES=NMR SPECTRUM
##END=
