##TITLE=AC1660_NUNAH14396_8531369_eUokH0n08S
##JCAMPDX= 6.0         $$ Bruker NMR JCAMP-DX V2.0
##DATA TYPE= NMR SPECTRUM
##DATA CLASS= NTUPLES
##ORIGIN= BRUKER
##OWNER= Administrator
$$ 1.72 TOPSPIN		Version 2.1
$$ 2015-08-08 02:29:59.984 -0700  Administrator@X
$$ Compression mode = diff/dup
##.OBSERVE FREQUENCY= 400.02188249412
##.OBSERVE NUCLEUS= ^1H
##.ACQUISITION MODE= SIMULTANEOUS (DQD)
##.ACQUISITION SCHEME= undefined
##.AVERAGES= 8
##.DIGITISER RES= 22
##SPECTROMETER/DATA SYSTEM= spect
##.PULSE SEQUENCE= zg30
##.SOLVENT NAME= COFFEE_meoh
##.SHIFT REFERENCE= INTERNAL, COFFEE_meoh, 1, 14.98509
##AUDIT TRAIL= $$ (NUMBER, WHEN, WHO, WHERE, PROCESS, VERSION, WHAT)
$$ ##TITLE= Audit trail, TOPSPIN		Version 2.1
$$ ##JCAMPDX= 5.01
$$ ##ORIGIN= Bruker BioSpin GmbH
$$ ##OWNER= Administrator
$$ $$ E:\/data/COFFEE/nmr/AC1660_NUNAH14396_8531369_eUokH0n08S/20/pdata/1/auditp.txt
$$ ##AUDIT TRAIL=  $$ (NUMBER, WHEN, WHO, WHERE, PROCESS, VERSION, WHAT)
(   1,<2015-08-08 02:29:52.531 -0700>,<Administrator>,<X>,<go>,<TOPSPIN 2.1>,
      <created by zg
	started at 2015-08-08 02:28:46.188 -0700,
	POWCHK enabled, PULCHK disabled,
       configuration hash MD5:
       21 0F 79 D6 B3 7B B4 F6 88 20 88 DB 03 48 BD 9F
       data hash MD5: 64K
       8B B2 A8 5B 96 F0 85 94 4B 12 8D 86 1E F1 3C E6>)
(   2,<2015-08-08 02:29:55.719 -0700>,<Administrator>,<X>,<proc1d>,<TOPSPIN 2.1>,
      <Start of raw data processing
       efp LB = 0 FT_mod = 6 PKNL = 1 PHC0 = 0 PHC1 = 0 SI = 32K 
       data hash MD5: 32K
       81 08 DF 14 7C 67 99 A4 2F 9C BD EE 4D 8D A9 F6>)
(   3,<2015-08-08 02:29:56.031 -0700>,<Administrator>,<X>,<proc1d>,<TOPSPIN 2.1>,
      <pk PHC0 = 114.2853 PHC1 = 0 
       data hash MD5: 32K
       86 73 04 01 DE CB 9C C7 3E D1 E3 60 FA 73 7D F5>)
(   4,<2015-08-08 02:29:56.141 -0700>,<Administrator>,<X>,<proc1d>,<TOPSPIN 2.1>,
      <abs ABSG = 1 
       data hash MD5: 32K
       92 76 29 71 4A 5B 99 5B EA 98 BA 2D 88 95 00 3A>)
(   5,<2015-08-08 02:29:56.203 -0700>,<Administrator>,<X>,<proc1d>,<TOPSPIN 2.1>,
      <abs ABSG = 2 
       data hash MD5: 32K
       07 9C 21 C2 B7 BD 38 F4 78 7D A1 76 5B 0F 1F 54>)
(   6,<2015-08-08 02:29:56.266 -0700>,<Administrator>,<X>,<proc1d>,<TOPSPIN 2.1>,
      <abs ABSG = 3 
       data hash MD5: 32K
       65 BB F9 32 0F 05 4B F3 52 F8 58 99 76 D2 A2 B9>)
(   7,<2015-08-08 02:29:56.359 -0700>,<Administrator>,<X>,<proc1d>,<TOPSPIN 2.1>,
      <abs ABSG = 4 
       data hash MD5: 32K
       29 42 B4 45 60 EC B1 E3 C9 F8 48 2C 6C 24 0A 85>)
(   8,<2015-08-08 02:29:56.422 -0700>,<Administrator>,<X>,<proc1d>,<TOPSPIN 2.1>,
      <abs ABSG = 5 
       data hash MD5: 32K
       6A C3 7A B3 84 DA A0 12 1F A6 19 28 96 5B 22 E8>)
$$ ##END=
$$ 
$$ $$ hash MD5
$$ $$ BB 38 36 EA F2 79 B2 58 9F AD 1D 37 AF C2 ED 27
##$RELAX= 
##$RELAX= 
##$RELAX= 
##$RELAX= 
##$RELAX= 
##$RELAX= 
##$RELAX= 
$$ Bruker specific parameters
$$ --------------------------
##$DU= <E:\>
##$EXPNO= 20
##$NAME= <AC1660_NUNAH14396_8531369_eUokH0n08S>
$$ [...]
150 150 150 150 150 150 150 150
##$TP07= 0
##$TPNAME0= <>
##$TPNAME1= <>
##$TPNAME2= <>
##$TPNAME3= <>
##$TPNAME4= <>
##$TPNAME5= <>
##$TPNAME6= <>
##$TPNAME7= <>
##$TPOAL= (0..7)
0.5 0.5 0.5 0.5 0.5 0.5 0.5 0.5
##$TPOFFS= (0..7)
0 0 0 0 0 0 0 0
##$TUNHIN= 0
##$TUNHOUT= 0
##$TUNXOUT= 0
##$USERA1= <user>
##$USERA2= <user>
##$USERA3= <user>
##$USERA4= <user>
##$USERA5= <user>
##$V9= 5
##$VALIST= <valist>
##$VCLIST= <CCCCCCCCCCCCCCC>
##$VD= 0
##$VDLIST= <DDDDDDDDDDDDDDD>
##$VPLIST= <PPPPPPPPPPPPPPP>
##$VTLIST= <TTTTTTTTTTTTTTT>
##$WBST= 2048
##$WBSW= 25
##$XGAIN= (0..3)
0 0 0 0
##$XL= 0
##$YL= 0
##$YMAX_a= 612756
##$YMIN_a= -541640
##$ZGOPTNS= <>
##$ZL1= 120
##$ZL2= 120
##$ZL3= 120
##$ZL4= 120
##$ABSF1= 14.98509
##$ABSF2= -5.573092
##$ABSG= 5
##$ABSL= 3
##$ALPHA= 0
##$AQORDER= 0
##$ASSFAC= 0
##$ASSFACI= 0
##$ASSFACX= 0
##$ASSWID= 0
##$AUNMP= <proc_prof1d_extract_pilot.lims>
##$AXLEFT= 0
##$AXNAME= <>
##$AXNUC= <1H>
##$AXRIGHT= 0
##$AXTYPE= 0
##$AXUNIT= <>
##$AZFE= 0.1
##$AZFW= 0.1
##$BCFW= 0
##$BC_mod= 0
##$BYTORDP= 0
##$COROFFS= 0
##$CY= 15
##$DATMOD= 1
##$DC= 0
##$DFILT= <>
##$DTYPP= 0
##$F1P= 0
##$F2P= 0
##$FCOR= 0.5
##$FTSIZE= 32768
##$FT_mod= 6
##$GAMMA= 0
##$GB= 0
##$INTBC= 1
##$INTSCL= 1
##$ISEN= 128
##$LB= 0
##$LEV0= 0
##$LPBIN= 0
##$MAXI= 10000
##$MC2= 0
##$MEAN= 0
##$ME_mod= 0
##$MI= 0
##$NCOEF= 0
##$NC_proc= -8
##$NLEV= 6
##$NOISF1= 0
##$NOISF2= 0
##$NSP= 0
##$NTH_PI= 0
##$NZP= 0
##$OFFSET= 14.98509
##$PC= 1
##$PHC0= 114.2853
##$PHC1= 0
##$PH_mod= 1
##$PKNL= yes
##$PPARMOD= 0
##$PPDIAG= 0
##$PPIPTYP= 0
##$PPMPNUM= 2147483647
##$PPRESOL= 1
##$PSCAL= 4
##$PSIGN= 0
##$PYNMP= <proc.py>
##$REVERSE= no
##$SF= 400.02
##$SI= 32768
##$SIGF1= 0
##$SIGF2= 0
##$SINO= 400
##$SIOLD= 32768
##$SPECTYP= <>
##$SREGLST= <1H.CDCl3>
##$SSB= 0
##$STSI= 32768
##$STSR= 0
##$SW_p= 8223.68421052631
##$SYMM= 0
##$S_DEV= 0
##$TDeff= 65536
##$TDoff= 0
##$TI= <>
##$TILT= no
##$TM1= 0
##$TM2= 0
##$TOPLEV= 0
##$USERP1= <user>
##$USERP2= <user>
##$USERP3= <user>
##$USERP4= <user>
##$USERP5= <user>
##$WDW= 1
##$XDIM= 32768
##$YMAX_p= 445051897
##$YMIN_p= -741600
##$CURPLOT= <Network HP LaserJet P1505>
##$CURPRIN= <$Network HP LaserJet P1505>
##$DFORMAT= <normdp>
##$LAYOUT= <+/1D_H.xwp>
##$LFORMAT= <normlp>
##$PFORMAT= <normpl>
##$SURQMSG= 1
$$ End of Bruker specific parameters
$$ ---------------------------------
##NTUPLES= NMR SPECTRUM
##VAR_NAME=  FREQUENCY,     SPECTRUM/REAL,   SPECTRUM/IMAG
##SYMBOL=    X,             R,               I
##VAR_TYPE=  INDEPENDENT,   DEPENDENT,       DEPENDENT
##VAR_FORM=  AFFN,          ASDF,            ASDF
##VAR_DIM=   32768,         32768,           32768
##UNITS=     HZ,            ARBITRARY UNITS, ARBITRARY UNITS
##FACTOR=    0.250966925370066, 1,           1
##FIRST=     8223.43324360094, -339154,      -180973
##LAST=      0,             -60172,          -80297
##MIN=       0,             -741600,         0
##MAX=       8223.43324360094, 445051897,    0
$$ Real data points
##PAGE= N=1
##DATA TABLE= (X++(R..R)), XYDATA
$$ [...]
$$ plain form
19551 79802 -232528 130802 96170 -78071 -111353 -374774 188801 -381844 -74415 -47172 83725
19539 -34057 77335 -62852 146479 -136846 -79586 -171901 -215576 213142 113910 -62881 217418
19527 -337889 166285 -309026 22334 155378 -54878 -282245 65996 -43500 -241479 -117887
19516 35888 92335 -219583 -37519 -46244 110413 -1542 45595 82701 -21807 -77224 -163228 193602
19503 45478 184264 -83798 160379 -36003 -147055 -290733 257592 -81625 -216304 -202934
19493 -202934 136595 -463318 -268175 -294528 29852 53020 -171109 -159119 -103803 -257199
19483 -257199 -261019 -141059 -129705 -274053 -281880 -17141 -41598 -3982 -31178 207108 -46717
19471 -183483 -207919 -599015 -25449 -160279 -208518 -219489 -193063 -32786 93261 -85891 116540
$$ packed form
19551G9802b32528A30802l4632g8071l3282k63421A88801c81844g4415K7243H3725
19539c4057G7335f2852A46479a36846N7260r2315m3675B13142r9232f2881B17418
19527c37889A66285c09026B2334J33044e4878k27367F5996d3500j97979a17887
19516C5888N6447b19583c7519q725A10413a542D5595L7106b1807n5417q6004A93602
19503D5478J38786h3798A60379c6003j11052j43678B57592h1625j34679J3370
19493b02934A36595d63318J95143k6353B9852K3168a71109J1990N5316j53396
19483b57199l820J19960J1354j44348p827a7141k4457c982k7196B07108d6717
19471a83483k4436l91096b5449j34830m8239j0971K6426c2786I3261h5891A16540
$$ plain form
19459 57979 236653 -180971 -246243 -258790 33336 70967 70570 -95438 -299551 -368088 -162592
19447 -97871 -38350 4459 -174858 -64155 -400093 -28706 -199751 198197 -70996 101403 53653
19436 53653 -148405 -214049 -203791 -43572 -9897 135222 -48486 248341 -269145 6343 187441
19425 187441 -14355 93530 -57310 -323674 -93797 -97576 315455 -90590 -326789 -169291 189865
19413 -12560 321318 77431 18113 -13303 -75680 202264 -150480 157039 173012 -295770 -120084
19401 -227718 -327437 -216540 -19923 -77822 216726 -199003 -528451 -93364 260794 -118478
19390 -61404 -12380 -158190 -167815 177840 -68820 85055 -71965 256036 63082 149385 -64356
19378 -38829 128828 153331 229202 -176078 -243314 -18537 -406547 -331354 -26813 -55172 -26601
$$ packed form
19459E7979J78674a80971o5272j2547C3336L7631l97i5438k04113o8537a62592
19447i7871c8350D459a74858f4155l35938b8706j71045A98197g0996A01403m7750
19436E3653a48405o5644J0258d3572i897A35222d8486B48341b69145F343J81098
19425A87441a4355I3530e7310k66364i3797l779C15455i0590k36199J57498A89865
19413a2560C21318G7431A8113a3303o2377B02264a50480A57039J5973b95770a20084
19401b27718r9719J10897a9923n7899B16726a99003l29448i3364B60794a18478
19390f1404a2380j45810r625A77840f8820H5055g1965B56036F3082Q6303f4356
19378c8829A28828K4503P5871a76078o7236a8537l88010P5193b6813k8359b6601
$$ plain form
19366 13102 -220722 -89299 -75834 61749 -343450 -243408 -164729 479679 -185838 -3964 5369
19354 -273595 -363985 166272 26810 -40265 -17402 55007 -107273 -227237 -88990 210269 16059
19342 -405574 -392248 -79012 -18856 -56999 54582 -14803 -19813 -268252 -68244 -153757 -83433
19331 -83433 15624 -147739 -231204 -32954 27078 -175569 -191037 -444180 -87019 67029 -276368
19319 -251203 -161889 -325343 33154 -213853 -238206 -189376 12998 119161 -97457 -6837 -42589
19308 -42589 193842 -125607 -232580 -379382 -120522 111250 2535 25660 -202524 104503
19297 -5813 157741 -262465 -159589 -138440 123179 -344011 263875 237526 -288458 -197877
19287 -197877 -82897 -4315 -89109 163913 180473 -27893 63191 107559 -135938 -52978 -200552
$$ packed form
19366A3102b20722h9299J3465F1749c43450J00042P8679D79679a85838c964E369
19354b73595r0390A66272B6810d0265a7402E5007a07273j19964h8990B10269A6059
19342d05574J3326g9012a8856l8143E4582a4803n010k48439f8244q5513P0324
19331h3433A5624a47739q3465c2954B7078a75569j5468k53143h7019F7029b76368
19319b51203Q9314j63454C3154b13853k4353M8830A2998J06163i7457f837l5752
19308d2589A93842a25607j06973j46802a20522A11250B535K3125b02524A04503
19297e813A57741b62465J02876K1149A23179c44011B63875k6349b88458R0581
19287a97877h2897d315q4794A63913J6560b7893F3191M4368a35938e2978j47574
$$ plain form
19276 -200552 -65112 -228850 -46416 25247 -42932 -88765 43224 -136020 -76911 -118794 -81402
19265 -81402 -36655 -489992 -41831 18478 117355 -173880 -80108 199653 -138633 64545 80777
19254 80777 -348310 8403 8090 -102031 5422 -80834 88141 -381514 -127329 -93148 -343671
19243 -343671 196360 -345344 221197 -123751 39915 139443 -50383 -61145 94763 -320507
19232 -121662 -134768 370553 128156 -329619 241497 -158908 48622 -182595 387568 62038
19221 -100247 198916 -186970 -396 -102164 -137534 -29500 -34226 247972 -310745 150593 -163285
19209 -198086 -47800 -121116 238751 84482 -25415 -188154 202012 -121530 -249023 95184
19198 -157873 -28329 466532 -264023 -122478 -226502 -55065 96004 -25752 -76592 95922 -279559
$$ packed form
19276b00552f5112j63738d6416B5247d2932m5833D3224a36020N9109m1883L7392
19265h1402c6655m53337d1831A8478R8877a73880h0108A99653a38633F4545J6232
19254H0777c48310H403l13a02031E422h0834H8141c81514a27329L4181k50523
19243c43671A96360c45344B21197a23751C9915R9528e0383j0762I4763c20507
19232a21662j3106C70553A28156c29619B41497a58908D8622a82595C87568F2038
19221a00247A98916a86970c96j01768l5370b9500m726B47972c10745A50593a63285
19209a98086d7800p3316B38751H4482b5415j62739B02012a21530j27493I5184
19198a57873b8329D66532b64023a22478j04024e5065I6004b5752n0840I5922b79559
$$ plain form
19186 -526069 -114546 163370 -190343 -120734 219279 -63739 -85946 23502 -118197 74622
19175 -14904 43412 93969 -103061 -37175 -153151 -194810 -152381 68388 -142239 124123 -109000
19163 -260178 -67125 -156304 -189344 -375860 30115 -74989 -433795 -188955 -82144 -55772 67445
19151 13222 -227553 -57751 189800 177436 141965 190921 -35343 -205032 23585 -225164 -18614
19139 -38328 -97816 -134965 -277986 -215369 12930 -312684 -217556 -399424 -61461 -66368 -134803
19128 -134803 -31455 -158105 -277946 -131002 -369088 32626 -284632 30164 -99862 -306076
19118 -306076 230051 -219411 -195251 -205985 399292 19856 -114672 -25887 -136213 -23424
19107 -61366 361222 135303 -161744 -90015 3824 -76272 -207420 -119232 -34756 -32225 -101739
$$ packed form
19186e26069a14546A63370a90343O9609B19279f3739k2207B3502a18197G4622
19175a4904D3412N0557a03061c7175j15976m1659M2429F8388a42239A24123a09000
19163b60178f7125q9179l3040j86516C0115g4989l58806a88955h2144K6372F7445
19151A3222b27553e7751A89800j2364l5471M8956c5343j69689B3585b25164a8614
19139c8328n9488l7149j43021O2617A2930c12684R5128j81868f1461m907o8435
19128a34803c1455j26650j19841a31002k38086C2626b84632C0164i9862k06214
19118c06076B30051b19411K4160j0734C99292A9856a14672b5887j10326b3424
19107f1366C61222A35303a61744P1729C824g6272j31148Q8188c4756K531o9514
$$ plain form
19096 -101739 -87778 126747 76969 67998 -193184 -166338 255866 46945 -13627 -72794 59615
19084 -426 -71609 -253740 70882 422602 -30971 23836 -62385 -22821 -48002 304891 124500
19072 112085 239069 -6149 70420 -18790 -479167 30937 319707 80487 -187578 275242 -110860
19060 -60264 25853 -243109 25949 139067 34641 -413375 29617 -45482 -46432 -233234 -127672
19049 -127672 -168790 -290848 -113884 67242 -43613 -123420 -103679 -41377 -59355 122716 152922
19038 152922 18365 -2726 99754 -20883 -247537 -66314 -164345 269407 -85151 -20654 -20446 -100224
19026 -100224 -83 -137043 -65467 168528 -106116 -86631 -166370 -16361 -16686 -155469 -308388
19015 -308388 -54466 111337 85496 -130314 -157298 -299978 79574 -290737 88121 -261707
$$ packed form
19096a01739J3961A26747m9778q971a93184K6846B55866D6945a3627n9167E9615
19084d26p1183j82131G0882L51720c0971B3836f2385b2821k5181C04891A24500
19072A12085J26984f149G0420a8790m60377C0937K88770H0487a87578B75242a10860
19060f0264B5853b43109B5949J13118C4641d13375B9617d5482r50j86802J05562
19049a27672m1118j22058a13884F7242d3613p9807J9741d1377j7978A22716L0206
19038A52922A8365b726I9754b0883k26654f6314r8031B69407h5151b0654K08p9778
19026a00224h3j36960f5467A68528a06116J9485p9739a6361l25j38783j52919
19015c08388e4466A11337k5841a30314k6984j42680G9574b90737H8121b61707
$$ plain form
19004 -198275 80295 60415 275717 101785 46936 -64334 -213417 -89110 -524873 121813
18993 -169982 103255 -65390 -367363 -87716 195357 -282615 -55225 -391392 127056 -240439
18982 44365 4291 -201088 202627 241016 -104313 -102034 -357035 496289 -43403 -178372 -394351
18971 -394351 63455 -172441 -103624 -142703 -206295 -227864 -96183 50231 63499 -210733 -280761
18960 -280761 123971 -71853 -33630 -330683 212809 -166786 235059 79604 -96469 -15548
18949 -342349 -99322 -28054 -226898 -111346 138035 -39043 51792 -61580 -304651 -49121 212742
18937 -508364 8767 -63424 -345525 146965 -24179 -131258 296864 192859 -129087 -109383
18927 -109383 159088 -152091 -321106 87552 -144153 -55498 63842 -91229 37110 150789
$$ packed form
19004a98275H0295j9880K15302A01785D6936f4334j49083h9110m35763A21813
18993a69982A03255f5390l01973h7716A95357b82615e5225l36167A27056b40439
18982D4365D291b01088B02627L8389a04313K279k55001D96289d3403j34969k15979
18971c94351F3455a72441O8817l9079o3592k1569i6183E0231J3268b10733p0028
18960b80761A23971g1853c3630k97053B12809a66786B35059G9604i6469a5548
18949c42349i9322b8054j98844a11346A38035c9043E1792f1580k43071d9121B12742
18937e08364H767f3424k82101A46965b4179j07079B96864j04005a29087J9704
18927a09383A59088a52091j69015H7552a44153e5498F3842i1229C7110J13679
$$ plain form
18917 150789 54550 139279 27637 -181704 -161693 -64956 -142697 -131953 30262 -77529 -146124
18906 -146124 -190161 -24698 93178 -38126 -193126 108291 -95280 250833 114213 -32678 60813
18894 58941 3927 -103223 144727 95369 13873 -50068 -247768 193123 119580 -318399 129906
18882 34036 13050 25202 74256 -103917 -317167 64312 -192091 116753 -271009 43883 6616
18870 65312 387559 -222603 -8927 24305 152519 -199334 265526 -125191 -142561 -150100 175128
18858 150218 -419242 -94838 74160 98827 10705 -26012 278248 -141081 -97471 306020 -179408
18846 212771 -283645 -324748 -6156 24218 67281 166934 -48791 -64588 226885 54421 -20573
18834 -316772 77178 -309215 -130625 -69589 9641 -268511 140029 -44004 219187 95299 -76010
$$ packed form
18917A50789E4550Q4729B7637a81704K0011f4956p7741J0744C0262g7529o8595
18906a46124m4037b4698I3178c8126j55000A08291i5280B50833A14213c2678F0813
18894E8941C927a03223A44727m9358A3873e0068j97700A93123p3543c18399A29906
18882C4036A3050J2152M9054a03917k13250F4312a92091A16753b71009D3883F616
18870F5312L22247b22603h927B4305J28214a99334B65526a25191j7370p539A75128
18858A50218d19242i4838G4160K4667A0705b6012B78248a41081M3610C06020a79408
18846B12771b83645m1103f156B4218M3063R9653d8791j5797B26885E4421b0573
18834c16772G7178c09215a30625O1036I641b68511A40029d4004B19187I5299g6010
$$ plain form
18822 163563 277079 -43777 -88814 93332 -264064 31669 81235 -347029 168002 -127464
18811 -140238 242743 146457 205228 46779 104005 -205493 -14026 -158896 -280546 -234623 95966
18799 -130443 -320096 150684 8762 -138688 -270758 -94111 40621 38759 20157 -149330 -415235
18788 -415235 87848 -67202 -26420 748 -181974 -375641 -35928 -89591 38545 -177693 -263837
18777 -263837 96893 -305396 -3802 -100477 75120 52835 -164286 -276666 -149292 -22804 34318
18765 117413 -36416 154205 -161113 98983 -158792 -271299 43719 246889 124107 -160082
18754 -228827 -179238 -313587 39249 300805 -165909 -19165 25382 140869 -159178 -255039
18744 -255039 278551 -16311 -171709 71196 111631 -148337 -172415 -1122 -243140 197207 -252157
$$ packed form
18822A63563J13516d3777m5037I3332b64064C1669M9566c47029A68002a27464
18811a40238B42743r6286N8771D6779N7226b05493a4026j44870j21650M5923I5966
18799a30443j89653A50684H762a38688j32070i4111D0621j862j8602a49330k65905
18788d15235H7848f7202b6420G48a81974j93667c5928n3663C8545a77693q6144
18777b63837I6893c05396c802r6675G5120k2285a64286j12380J27374b2804C4318
18765A17413c6416A54205a61113I8983a58792j12507D3719K03170j22782a60082
18754b28827M9589j34349C9249K61556a65909a9165B5382J15487a59178r5861
18744b55039B78551a6311j55398G1196M0435a48337k4078a122k42018A97207b52157
$$ plain form
18732 -294274 -269460 256192 -138689 -266555 -142582 -165777 64021 -118517 135643 75166
18722 75166 -101060 -247941 -476694 -251252 -506570 -59610 -13562 368395 -447146 -100483
18711 24325 -59968 -104894 -164744 125070 -192177 -91610 -375154 -134140 26669 -59234 79400
18699 -223063 -75125 270700 167482 -248897 -49444 -7485 -179309 -307248 -11459 -73334 -137787
18688 -137787 -329514 -93296 -33016 206466 -181070 45528 -100196 -210816 45369 -92032
18677 -45650 130152 -209305 -184660 26713 251011 -246640 -23396 -245088 4074 305055 3737
18665 -212109 -140184 -96741 169508 6865 25948 125438 -100862 304897 190106 -68159 388758
18653 -6753 182600 91383 -51598 -138217 -53124 -15153 -282836 -22036 -177647 66386 -244895
$$ packed form
18732b94274K4814B56192a38689j27866J23973k3195F4021a18517A35643o0477
18722G5166a01060j46881k28753K25442k55318e9610a3562C68395d47146a00483
18711B4325e9968m4926n9850A25070a92177i1610k83544a34140B6669e9234G9400
18699b23063g5125B70700j03218b48897d9444g485j71824j27939a1459o1875o4453
18688a37787j91727i3296c3016B06466a81070D5528a00196j10620D5369i2032
18677d5650A30152b09305K4645B6713K24298b46640b3396k21692D074L00981C737
18665b12109P1925M3443A69508F865J9083R9490a00862C04897j14791f8159C88758
18653f753A82600r1217e1598q6619e3124a5153k67683b2036j55611F6386b44895
$$ plain form
18641 -257401 283133 -71326 -145652 -82971 -235441 -190521 -26784 144992 -313746 231165
18630 -239952 -195735 -61185 -259682 -141887 -27988 -133440 30820 -37839 -107628 32780 87651
18619 87651 69319 128190 66902 -71640 -220112 -140686 -313130 -17583 -49057 116509 -68239
18607 -83673 -335129 111079 -46797 -204307 242763 -197033 309417 -120801 63755 -62378
18596 -200374 14943 -271505 -384262 -13523 -179965 150835 -355134 -29114 92223 -191741
18585 85267 -238898 -124526 204136 -111074 18133 -193239 41198 198556 -11574 -92783
18575 -92783 -174053 -154055 105205 -106234 -141135 25751 -317519 47856 -7907 208806 132346
18564 132346 254644 -295719 87978 -428151 106255 162491 -212413 -52776 203655 -177000
$$ packed form
18641b57401B83133g1326p4326O2681j52470M4920b6784A44992c13746B31165
18630b39952M4217f1185j98497J17795b7988j05452C0820c7839o9789C2780N4871
18619H7651j8332N8871o1288g1640j48472P9426j72444a7583l1474A16509f8239
18607h3673k51456A11079d6797j57510B42763a97033C09417a20801F3755f2378
18596b00374A4943b71505j12757a3523j66442A50835c55134b9114I2223a91741
18585H5267b38898J14372B04136a11074A8133a93239D1198J57358a1574q1209
18575i2783q1270J9998A05205a06234l4901B5751c17519D7856g907B08806p6460
18564A32346J22298b95719H7978d28151A06255N6236b12413e2776B03655a77000
$$ plain form
18553 -240512 -83891 182610 -130978 -268064 -373 -458326 -88232 24732 -100355 -88080 23038
18541 -208441 -135111 72914 -131597 -94239 -271664 -143867 125776 18201 -364570 261554
18530 -134398 46232 -270330 44282 224686 -50627 -141584 -153979 -197083 21482 -78876 -74021
18519 -74021 -47503 -53159 -121436 -45048 -48291 -59657 -79661 2482 249500 -363307 -64044 -80577
18507 -80577 -162799 183922 -20021 -33695 -32018 -126407 -115421 -116860 29948 -96922 -104470 79226
18494 -413528 62966 -8734 9731 -79525 -120758 -32156 79112 -27292 9641 42909 -126216 53136
18481 -37635 -154386 -38136 85575 -233888 107933 -105305 -89862 324098 147831 -225152
18470 110307 -214045 86129 -239642 -80259 226464 223729 264907 4147 159404 -75607 107862
$$ packed form
18553b40512h3891A82610a30978j37086c73m57953h8232B4732a00355J2275B3038
18541b08441P3330G2914a31597L7358j77425J27797A25776A8201c64570B61554
18530a34398D6232b70330D4282J80404e0627r0957j2395m3104B1482g8876M855
18519g4021K6518n656o8277d5048l243j1366k0004B482K47018c63307f4044j6533
18507h0577q2222A83922b0021j3674J677r4389J0986j439B9948i6922p548G9226
18494d13528F2966h734I731g9525m1233c2156G9112b7292I641L3268a26216E3136
18481c7635j16751c8136H5575b33888A07933a05305J5443C24098A47831b25152
18470A10307b14045H6129b39642h0259B26464k735M1178D147J55257g5607A07862
$$ plain form
18458 151308 87624 -106677 287046 27662 -59457 112045 31246 -385863 106699 193426
18448 193426 -90320 122762 56032 115706 -58007 21134 -1907 174328 290653 -48571 -46557
18437 -46557 77515 -214480 140829 103654 135144 -119371 -209687 -131871 -254213 237622 -123982
18425 -144021 8525 271493 56604 55532 -132486 81009 -130425 133807 74447 -8608 -110592
18414 -110592 -177386 -293083 -268827 342808 -188837 -201839 35976 289298 197320 -59555 -50821
18403 -50821 37358 213082 -143756 -43551 -165964 118351 -41265 116237 -27479 186836
18392 -202994 11481 307205 74632 -91777 -165220 -211053 118272 36569 -221236 -143875 95418
18380 -336331 -154834 114570 122066 -145169 103973 -94867 196829 -117334 -65948 -29716
$$ packed form
18458A51308o3684a06677B87046B7662e9457A12045C1246c85863A06699Q6727
18448A93426i0320A22762E6032N9674e8007B1134a907A74328J16325d8571K014
18437d6557G7515b14480A40829l7175L1490a19371r0316P7816j22342B37622a23982
18425a44021H525K62968E6604j072a32486H1009a30425A33807n9360h608j01984
18414a10592o6794j15697K4256C42808a88837j3002C5976K53322r1978e9555Q734
18403e0821C7358J75724a43756d3551j22413A18351d1265A16237b7479A86836
18392b02994A1481K95724G4632i1777p3443m5833A18272C6569b21236P7361I5418
18380c36331a54834A14570P496a45169A03973i4867A96829a17334N1386b9716
$$ plain form
18369 -219343 -13723 131964 133438 -44928 96887 1525 -237993 187742 316774 113891 -48651
18357 -47345 -915 -274561 -328824 12713 57260 218589 -64236 107217 232771 -500020 177062
18345 -344857 -71311 126824 88270 310745 295351 -11192 -82785 -204235 28590 -385181 -71344
18333 26523 -132045 -23637 -84210 152429 227592 -169653 -111733 -57026 37467 -116658 -228523
18322 -228523 143097 49133 55017 -74848 -187178 45037 -150707 -81324 -174796 -102643 -197278
18311 -197278 31001 -58011 -118119 -225869 -151943 82615 -245698 -135344 -13636 -214489 -359969
18300 -359969 -488391 -365021 201940 -26524 -242881 -165064 63235 143148 45406 -71170 -150724
18289 -150724 155652 -87677 81799 -181673 246498 -202956 14838 -62972 239996 267774
$$ packed form
18369b19343a3723A31964J474d4928I6887A525b37993A87742J29032A13891d8651
18357d7345i15k73646n4263A2713M4547J61329f4236A07217J25554e00020A77062
18345c44857g1311A26824l8554K22475j5394a1192p1593j21450B8590c85181g1344
18333B6523a32045b3637o0573A52429P5163a69653N7920N4707C7467a16658j11865
18322b28523A43097D9133N884g4848j12330D5037a50707O9383r3472P2153r4635
18311a97278C1001e8011o0108j07750P3926H2615b45698J10354a3636k00853j45480
18300c59969j28422J23370B01940b6524k16357P7817F3235P9913D5406g1170p9554
18289a50724A55652h7677H1799a81673B46498b02956A4838f2972B39996K7778
$$ plain form
18279 267774 -433139 205463 159321 172295 37057 -153023 177583 26855 -31121 -74685 -223964
18268 -223964 -80694 -141205 58643 -144531 -94782 246117 -7437 -146754 -192076 157687 223237
18257 223237 -63062 -255037 -81326 -83744 -246744 -140360 96001 -277588 -34992 151454 -52128
18245 -91384 91936 36456 -93584 -166375 -241172 -203518 285738 3916 -18949 -271427 -184925
18234 -184925 85890 162119 -19784 34751 -157362 201386 -55101 39639 -376453 -130530 145798
18222 -59866 11233 -259593 77592 -267699 -54688 -47789 -132439 -133044 130871 -444028 32514
18210 -285570 329599 -198777 -80525 242773 -239260 -106228 21892 34618 137241 197637
18200 197637 92080 214625 -59552 -145940 -26216 140866 265576 -59431 129698 -385205
$$ packed form
18279B67774d33139B05463m6142J2974C7057a53023A77583B6855c1121m3564j49279
18268b23964h0694o0511E8643a44531M9749B46117g437j39317m5322A57687O5550
18257B23237f3062j91975h1326k418j63000J06384I6001b77588c4992A51454e2128
18245i1384I1936C6456i3584p2791p4797L7654B85738C916a8949k52478Q6502
18234a84925H5890P6229a9784C4751a57362B01386e5101C9639c76453a30530A45798
18222e9866A1233b59593G7592b67699e4688O899q4650o05A30871d44028C2514
18210b85570C29599a98777h0525B42773b39260a06228B1892J2726J02623O0396
18200A97637I2080J22545e9552q6388b6216A40866J24710e9431A29698c85205
$$ plain form
18189 100095 176351 -50026 -11873 86263 68760 8177 27922 -305200 38058 -130689 -341157
18178 -341157 67385 243518 272275 -16349 -52072 -361868 64399 -144826 -92619 -155355 -39714
18166 63988 157086 -51913 -27235 60589 -103372 357137 -14765 -71531 -200228 89095 -264452
18154 81470 -78367 -203232 142209 21346 96852 -140482 73404 -290451 17770 -281096 -71152
18142 -253973 102028 66798 131750 296727 68979 15871 -96099 108844 -406039 36134 -119476
18130 -285006 -47266 88792 38676 149311 294306 -89628 -210966 -79095 -25154 29556 39190
18119 39190 -129598 -147447 139989 -129081 -224569 -50676 -335088 166577 47708 -204592
18108 82054 -54232 -51157 115100 61334 4712 376002 348343 -103646 -118769 -64407 -193302
$$ packed form
18189A00095P6256e0026a1873H6263j7503H177J9745c05200C8058a30689k10468
18178c41157F7385J76133K8757a6349l5723l09796F4399a44826N2207o2736c9714
18166F3988R3098e1913K4678F0589a03372C57137a4765n6766j28697H9095b64452
18154H1470g8367j24865A42209B1346P5506a40482G3404b90451A7770b81096g1152
18142b53973A02028l5230O4952J64977F8979A5871i6099A08844d06039C6134a19476
18130b85006d7266H8792C8676J10635J44995h9628j21338g9095b5154B9556R634
18119C9190a29598j7849A39989a29081r5488e0676k84412A66577D7708b04592
18108H2054e4232L075A15100n3766D712L71290k7659a03646j5123N4362j28895
$$ plain form
18097 -193302 -105733 13149 -415670 -56559 211517 -29862 125165 102997 -104324 -144217 -83169
18086 -83169 209191 92500 167991 -141774 52805 37725 -158738 -69149 -178417 213659 -141462
18074 -16953 206500 180623 121360 -243384 88431 -71503 -159602 -88687 -39836 222689 24717
18062 139330 -233703 123103 -150005 345090 84132 -510774 -10447 -122853 216777 -62360
18051 -117903 187868 -292601 -196247 13658 143332 -85669 -59628 -106443 -235173 -290139 65305
18039 126652 31527 91687 -37401 -169528 229596 166363 -128302 -26149 115249 -208871
18028 29175 -94146 54673 -146312 120872 -77583 -217181 101627 -130089 -69503 -79919 -109212
18017 -109212 -236097 33822 141847 -51992 -189604 254372 -124087 33913 -47620 104971
$$ packed form
18097a93302Q7569A3149d15670e6559B11517b9862A25165k2168a04324l9893O1048
18086h3169B09191I2500P5491a41774E2805j5080a58738f9149j09268B13659a41462
18074a6953B06500k5877n9263b43384H8431g1503q8099P0915c9836B22689B4717
18062A39330b33703A23103a50005C45090H4132e10774a0447j12406B16777f2360
18051a17903A87868b92601R6354A3658J29674h5669K6041m6815j28730n4966F5305
18039A26652C1527O0160c7401j32127B29596o3233a28302b6149A15249b08871
18028B9175i4146E4673a46312A20872g7583j39598A01627a30089O0586j0416k9293
18017a09212j26885C3822J08025e1992j37612B54372a24087C3913d7620A04971
$$ plain form
18006 -2842 225556 47998 -50781 -226844 47874 -41029 -105238 114344 67884 278659 -325492
17994 149457 -294990 95055 138356 -27058 -315567 53471 -354549 -162205 -152212 221768 -82359
17982 -21255 66221 -177039 -156513 -266849 165983 -66620 -174124 -19035 148506 -111907
17971 -276877 -116753 1313 -21080 -35166 149468 82565 183427 273882 145381 -70174 -19375
17959 139937 -156356 -181803 100838 -60628 -200152 -25578 -109148 -314970 293239 -120058
17948 -373466 -79779 61222 53918 124192 -68953 98424 -228863 -79169 -180795 -132650 93193
17936 77081 52153 241601 154512 -149285 244467 23306 -44384 31597 99605 175085 269295
17925 269295 350833 305470 321273 205131 -103390 -203645 -210530 -80756 399650 -26470 -492059
$$ packed form
18006b842B25556D7998e0781j76063D7874d1029o4209A14344m6460K10775c25492
17994A49457b94990I5055M3301b7058k88509E3471c54549a62205R993B21768h2359
17982b1255F6221a77039K0526j10336A65983f6620j07504a9035A48506a11907
17971b76877a16753A313b1080j4086A49468o6903J00862R0455j28501g0174a9375
17959A39937a56356k5447A00838f0628j39524b5578q3570k05822B93239a20058
17948c73466g9779F1222p304P0274f8953I8424b28863g9169j01626M8145I3193
17936G7081k4928J89448q7089a49285B44467B3306d4384C1597O8008P5480R4210
17925B69295Q1538m5363J5803j16142a03390j00255o885h0756C99650b6470m65589
$$ plain form
17914 -492059 16130 113430 -104754 -61868 148839 5444 -273223 -47976 32099 223649 161895
17903 161895 -137173 -154009 83330 178001 -292733 -108366 -26395 -137832 11060 -87908 59432
17891 -143079 28010 91436 116094 72778 -28290 -204237 90626 -28486 -12700 -58692 -67526
17880 -67526 -289067 -204800 -151117 -98346 -335728 119540 74914 108558 -290709 -89713 -61080
17869 -61080 -89312 126381 20211 -7453 118906 -77354 -148262 -310004 -494215 -122028 -89631
17858 -89631 4640 240952 198936 74011 -54106 141042 -139632 -12572 196680 120564 191483
17847 191483 63936 338961 124133 -171599 63595 43674 -20618 -115751 -240810 420730
17836 -223407 38612 439625 -80351 -76621 135687 -46288 32751 -85422 103341 -168391 1108
$$ packed form
17914d92059A6130R7300a04754M2886A48839E444b73223d7976C2099J91550o1754
17903A61895a37173j6836H3330R4671b92733a08366b6395j11437A1060h7908E9432
17891a43079B8010O3426K4658m3316b8290j75947I0626b8486a2700m5992q834
17880f7526k21541Q4267N3683N2771k37382A19540m4626L3644b90709h9713K8633
17869f1080k8232A26381B0211g453A18906g7354p0908j61742j84211a22028L2397
17858h9631D640K36312m2016G4011e4106A41042a39632a2572A96680p6116P0919
17847A91483F3936K75025A24133a71599F3595j9921b0618r5133j25059D20730
17836b23407C8612M01013h0351L730A35687d6288C2751h5422A03341a68391A108
$$ plain form
17824 87546 -37966 -238062 272071 -24205 -50412 -104936 -86788 2496 21738 4026 -34040 -170444
17812 -170444 -50362 -104665 -55501 201928 181557 20589 -57105 323466 -275471 -115012 -55801
17800 -163349 -252608 -246017 150536 -115555 124772 68744 -289527 137121 -297195 -110253
17789 -83495 -28685 -106706 85942 -131964 -50491 -176700 131710 -2286 -104384 -132256 57116
17777 117303 154712 170086 -74728 -8893 -16911 372780 -230780 242858 17004 -250760 -28741
17765 -42804 12620 102302 -105917 165758 58099 -52713 -40815 -138026 244953 96708 -375241
17753 -217273 227268 -10992 88947 47475 338049 164131 108997 -42278 27867 -118064 -563718
17742 -563718 46479 -136891 138689 107151 -11360 -71545 69178 -32437 -383709 -129636 214005
$$ packed form
17824H7546c7966k00096B72071b4205k6207n4524J8148B496J9242D026c4040j36404
17812a70444e0362n4303M9164B01928k0371B0589e7105C23466b75471a15012e5801
17800a63349q9259O591A50536a15555A24772n6028b89527A37121b97195a10253
17789h3495b8685p8021H5942a31964e0491j26209A31710b286j02098k7872E7116
17777A17303L7409J5374g4728h893q018C72780b30780B42858A7004b50760b8741
17765d2804A2620Q9682a05917A65758E8099e2713J1898r7211B44953I6708c75241
17753b17273B27268a0992H8947m1472K90574A64131n5134d2278B7867a18064m45654
17742e63718D6479a36891A38689l1538a1360o0185F9178c2437l51272a29636B14005
$$ plain form
17730 -137541 -241985 141249 -269814 -203708 -90191 -216899 218237 206138 -156434 -36324
17719 256914 -88271 -285928 26230 -66363 136199 -319899 229153 60035 -92883 -178558 20588
17707 -17384 -37361 78224 236457 95035 109851 -23524 -184127 86992 -201551 174112 -113202
17695 289663 -50139 -127421 28700 -27618 287272 74065 -56233 162312 -94327 9887 31775
17684 31775 37079 -249433 95585 -85844 -107094 12902 59171 -139020 108214 -119977 78557
17672 56531 271069 14469 -37456 308956 -79317 41122 -276162 -8334 12673 -3694 54317
17660 -394978 -62619 -136545 -288651 58611 187759 130390 18680 239374 186577 190043 -149480
17648 -43847 103860 214267 -312673 89979 -60156 -78323 -122541 217497 97544 41422 30781
$$ packed form
17730a37541j04444A41249b69814O6106i0191j26708B18237j2099a56434c6324
17719B56914h8271j97657B6230f6363A36199c19899B29153F0035i2883q5675B0588
17707a7384j9977G8224J58233I5035J4816b3524j60603H6992b01551A74112a13202
17695B89663e0139p7282B8700b7618B87272G4065e6233A62312i4327I887K1888
17684C1775N304b49433I5585h5844k1250A2902M6269a39020A08214a19977G8557
17672E6531K14538A4469c7456C08956g9317D1122b76162h334A2673c694E4317
17660c94978f2619p3926j52106E8611J29148n7369A8680K20694n2797L466a49480
17648d3847A03860J10407c12673H9979f0156j8167m4218B17497I7544D1422j0641
$$ plain form
17637 30781 170491 359148 141393 -129777 57362 -59531 167014 -136505 78372 91113
17627 91113 220342 -51711 -17215 150834 118409 110908 -5498 154294 222810 176439 -15676
17615 -200210 304785 -205834 -264221 130830 -166675 171865 235095 -101313 294509 146947
17604 198609 -216604 -15141 -21698 -10832 84617 -40669 155994 195790 -183114 41009 31872
17593 31872 -208144 263375 -43369 69549 -74239 43479 27702 -6105 20917 94682 192752
17582 192752 104182 111308 -38994 -78928 -235779 -260688 -46651 -157218 32647 364835 61181
17570 -260927 -294205 213801 -29392 -75867 191900 -429348 15665 46108 -232049 126386
17559 149008 366665 19876 52461 -87058 161005 233955 -176861 143578 -28546 430471
$$ packed form
17637C0781J39710J88657A41393a29777E7362e9531A67014a36505G8372J2741
17627I1113J29229e1711a7215A50834l2425p501e498A54294O8516m6371a5676
17615b00210C04785b05834n8387A30830a66675A71865O3230a01313B94509A46947
17604A98609b16604a5141o557a0832H4617d0669A55994L9796a83114D1009r137
17593C1872b08144B63375d3369F9549g4239D3479j5777f105B0917P3765R8070
17582A92752q8570P126c8994l9934j56851k4909d6651j10567C2647L32188F1181
17570b60927l3278B13801b9392m6475A91900d29348A5665L0443b32049A26386
17559A49008K17657A9876L2585h7058A61005P2950a76861A43578b8546D30471
$$ plain form
17548 224281 31048 138179 431424 30314 -70661 156403 317362 91324 146460 278034
17538 278034 -64309 -52345 193910 7681 178871 179999 19296 -8605 -54281 -102262 266277
17526 9409 -109743 -62271 60139 -34413 37764 -53434 -190370 221957 276254 108491 96026
17515 96026 112443 54821 219308 111560 311723 241337 -324831 61814 -53364 53921 -42456
17503 245678 239995 302882 287603 93521 -141869 -160116 -344492 52065 -84256 -154264 -2291
17491 95706 134047 51777 227389 145154 184950 326902 254944 353887 -44356 -206533 124066
17479 43355 156837 -17322 20141 -218040 -201635 375136 210419 217301 144417 419709 -19350
17467 51911 319959 158695 43825 209710 115895 40821 219473 64570 211797 177612 390144
$$ packed form
17548B24281C1048J07131K93245C0314g0661A56403J60959I1324N5136J31574
17538B78034f4309J1964A93910G681J71190J128A9296h605m5676m7981B66277
17526I409a09743M7472F0139c4413C7764e3434j36936B21957N4297A08491j2465
17515I6026J6417E4821J64487j07748K00163p0386c24831F1814e3364E3921d2456
17503B45678n683O2887j5279I3521a41869j8247j84376E2065h4256p0008b291
17491I5706L8341E1777J75612q2235L9796J41952p1958R8943d4356j62177A24066
17479D3355J13482a7322B0141b18040J6405C75136j64717O882p2884K75292a9350
17467E1911K68048A58695D3825J65885r3815D0821J78652F4570J47227l4185K12532
$$ plain form
17456 390144 126832 5100 342125 46347 182436 471154 119865 198605 33124 298464
17446 298464 654547 52188 260909 95731 42258 118047 78620 325651 607387 132742
17435 -99675 247432 179955 309682 -100073 255347 373652 124160 35630 46963 716081
17425 716081 181571 284236 399421 277611 209111 293120 276445 -103398 220539 278590
17415 278590 134471 60020 150690 61547 132304 12640 314197 300627 158280 619501 121060
17403 23806 280997 -104196 168776 -89632 362279 -27747 148177 449937 303501 241102
17393 241102 21246 385809 108377 169532 38981 -38618 258176 171954 5907 -189602 207432
17381 -266452 -160178 486726 71361 66807 301340 158128 87189 68621 265034 128004
$$ packed form
17456C90144A26832E100L37025D6347J36089K88718A19865P8740C3124K65340
17446B98464L56083E2188K08721I5731D2258P5789l9427K47031K81736A32742
17435i9675B47432o7477J29727a00073B55347J18305A24160C5630J1333O69118
17425G16081A81571J02665J15185j21810o8500Q4009j6675a03398B20539N8051
17415B78590A34471F0020R0670F1547P0757A2640L01557j3570j42347M61221A21060
17403B3806K57191a04196A68776h9632C62279b7747A48177L01760j46436o2399
17393B41102B1246L64563A08377O1155C8981c8618B58176q6222E907a89602B07432
17381b66452J06274D86726G1361m554K34533j43212p0939j8568J96413A28004
$$ plain form
17370 316080 385791 56288 152618 472676 43857 388727 113087 54529 212170 180143 221735
17359 221735 50428 278587 -4516 -148722 64116 134406 -278456 -77558 -95281 -122597 -107789
17348 -107789 -4692 145069 134217 -35287 319821 -5005 150887 193684 151631 -115361 107226
17336 145164 402554 363612 155248 133053 487595 457017 124431 -202071 243968 -13174
17325 458192 225394 82037 -17795 2148 108673 194536 217552 -109375 -35329 241547 39516
17313 355449 481583 311386 100880 269556 -105689 247674 146965 361563 -82244 -3732
17302 7533 135524 110813 226346 76090 202648 50453 8828 89342 158234 100119 197028
17291 197028 139509 488144 -114204 75358 253570 149054 311986 113104 508523 247083
$$ packed form
17370C16080O9711E6288R6330L20058D3857L44870A13087E4529J57641l2027M1592
17359B21735E0428K28159d516j44206F4116P0290b78456g7558j7723k7316J4808
17348a07789d692A45069j0852c5287C19821e005A50887M2797m2053a15361A07226
17336A45164K57390l8942A55248k2195L54542l0578A24431b02071B43968a3174
17325D58192B25394H2037a7795B148J06525Q5863K3016a09375c5329B41547C9516
17313C55449J26134j70197A00880J68676a05689B47674j00709K14598h2244c732
17302G533J27991k4711J15533G6090J26558E0453H828Q0514O8892n8115R6909
17291A97028n7519L48635a14204G5358J78212j04516J62932A13104L95419B47083
$$ plain form
17280 310614 238864 155152 354334 360967 -134427 45163 247460 427899 68880 -66438 215976
17268 -141494 150053 150821 403207 339691 317422 579657 96378 146076 631501 247417 197703
17257 197703 321984 288684 334372 241766 -163432 298061 302273 366807 50642 295196 389662
17246 389662 252568 -23232 555504 479736 203789 276431 482076 283456 101009 -3167
17235 83895 309499 185845 242466 -7528 295364 492596 331251 176888 3224 399531 48638
17223 211429 248367 372313 113305 340506 247244 153871 251856 224909 60733 215245 144094
17212 144094 135190 220697 521411 159084 346931 230077 326070 249636 253118 190733 467012
17201 467012 124648 437146 424169 508934 209817 543447 545531 262941 146089 263262
$$ packed form
17280C10614p1750q3712J99182O633a34427D5163K02297J80439F8880f6438B15976
17268a41494A50053P68K52386o3516k2269K62235I6378M9698M85425B47417m9714
17257A97703J24281l3300M5688r2606a63432B98061M212O4534E0642K44554R4466
17246C89662j37094b3232E55504p5768B03789P2642K05645j98620A01009c167
17235H3895K25604j23654N6621g528B95364J97232j61345j54363C224L96307D8638
17223B11429L6938J23946A13305K27201r3262r3373R7985k6947F0733J54512p1151
17212A44094q904Q5507L00714A59084J87847j16854R5993p6434L482o2385K76279
17201D67012A24648L12498j2977Q4765B09817L33630K084B62941j16852J17173
$$ plain form
17191 263262 154366 267013 231265 545273 372394 413344 207595 181929 506924 333892
17181 333892 263880 352703 516408 165080 312722 291497 178624 253343 351329 154188
17170 189564 331142 272543 463363 231875 277132 89886 624088 420817 -135348 474083
17159 120685 236578 545276 308311 455818 247037 175070 223883 453497 448689 592325
17149 592325 92753 197273 284193 444747 212036 417287 368032 344836 339428 220208 304561
17138 304561 554821 420229 375514 377618 109543 549975 503038 681626 377355 451907
17128 451907 528516 110354 362014 503025 551346 428802 623113 114557 278408 234734
17118 234734 307428 571639 615437 549793 574801 733087 41508 460978 189272 356206
$$ packed form
17191B63262j08896J12647l5748L14008j72879M0950k05749k5666L24995j73032
17181C33892p0012Q8823J63705A65080J47642k1225j12873P4719R7986A54188
17170A89564J41578n8599J90820k31488M5257H9886N34202k03271a35348D74083
17159A20685J15893L08698k36965J47507k08781p1967M8813K29614m808J43636
17149E92325I2753J04520Q6920J60554B12036K05251m9255k3196n408j19220Q4353
17138C04561K50260j34592m4715K104A09543M40432m6937J78588l04271P4552
17128D51907P6609A10354K51660J41011M8321j22544J94311A14557J63851m3674
17118B34734P2694K64211M3798o5644K5008J58286D1508M19470A89272J66934
$$ plain form
17108 356206 351896 228592 189511 458309 254797 441471 325221 487461 565714 323863
17098 323863 439939 574696 417282 594802 699382 186736 248246 664757 403675 426745
17088 426745 287952 304702 227095 347846 613377 605834 558734 170008 335400 678564
17078 678564 755653 212568 463220 261928 121343 517025 240390 493615 695761 503464
17068 503464 643532 409150 248921 800634 675724 793269 644556 528579 428029 487560
17058 487560 677184 484028 598571 791048 655884 239153 436351 689253 403092 720342
17048 720342 712915 840402 569000 523300 481475 800652 440046 543491 493764 823344
17038 823344 627546 505111 691984 722968 681819 458694 690908 538033 679808 548577
$$ packed form
17108C56206m310j23304l9081K68798k03512J86674j16250J62240P8253k41851
17098C23863J16076J34757j57414J77520J04580A86736O1510M16511k61082K3070
17088D26745j38793J6750p7607J20751K65531p543m7100A70008J65392L43164
17078F78564P7089B12568K50652k01292A21343L95682B40390K53225K02146j92297
17068E03464J40068k34382j60229N51713j24910J17545j48713j15977j00550N9531
17058D87560J89624j93156J14543J92477j35164B39153J97198K52902k86161L17250
17048G20342p427J27487k71402m5700m1825L19177l60606J03445m9727L29580
17038H23344j95798j22435J86873L0984m1149k23125K32214j52875J41775j31231
$$ plain form
17028 548577 965467 814615 579724 521635 519813 944655 934001 784053 757671 531979
17018 531979 626782 896274 761649 636958 988393 902792 924140 1057937 939217 873848
17008 873848 633125 786047 1107987 855545 853424 1028074 627771 858802 768817 746798
16998 746798 807438 763113 764992 861644 839296 925311 1275491 818708 527634 926055 771969
16987 771969 796506 927443 887721 846446 933630 962619 933115 970320 1201997 1145326 1094236
16976 1094236 942122 1088421 831508 828943 1219368 1257199 983904 1044132 902472 1075529
16966 1075529 1258695 1280309 1126653 1124124 764001 1316577 1221784 1234107 1042405 948950
16956 948950 1604447 1176841 1234179 1293887 1208012 1294662 1324822 1332190 1339820 1460298 1239934
$$ packed form
17028E48577M16890j50852k34891n8089j822M24842j0654j49948k6382k25692
17018E31979R4803K69492j34625j24691L51435q5601K1348J33797j18720o5369
17008H73848k40723J52922L21940k52442k121J74650m00303K31031q9985k2019
16998G46798O0640m4325J879R6652k2348Q6015L50180m56783k91074L98421j54086
16987G71969K4537J30937l9722m1275Q7184K8989k9504L7205K31677n6671n1090
16976A094236j52114J46299k56913k565L90425L7831k73295O0228j41660J73057
16966A075529J83166K1614j53656k529l60123N52576r4793J2323j91702r3455
16956I48950O55497m27606N7338N9708q5875Q6650L0160P368P630J20478k20364
$$ plain form
16945 1239934 1242421 1527139 1488628 1244678 1357184 1160365 1131047 1680235 1305852 1687174
16935 1687174 1345124 1640829 1501914 1687374 1389232 1080699 1447571 1294818 1620991
16926 1620991 1229264 1430652 1266950 1423014 1601909 1466325 1498045 1917974 1799121 1660556
16916 1660556 1754852 1486025 1768960 1858280 1611405 1725677 1789424 1532235 1710099 1785163
16906 1785163 1869918 1694801 1813962 1869862 1462471 1717211 1769637 2041883 1910265 1967067
16896 1967067 1961357 2250838 2355661 2225197 2178584 2238473 2337567 2281527 2107817 1832561
16886 1832561 2048142 2150871 2339661 2344790 2571525 2375623 2786722 2500902 2751680 2660309
16876 2660309 2566450 2442107 2911627 2384080 2564326 2867303 2666781 2678997 2847989 3145913
$$ packed form
16945A239934K487K84718l8511k43950J12506j96819k9318N49188l74383L81322
16935A687174l42050K95705j38915J85460k98142l08533L66872j52753L26173
16926A620991l91727K01388j63702J56064J78895j35584L1720M19929j18853j38565
16916A660556R4296k68827K82935Q9320k46875J14272O3747k57189J77864P5064
16906A785163Q4755j75117J19161N5900m07391K54740N2426K72246j31618N6802
16896A967067n710K89481J04823j30464m6613N9889R9094n6040j73710k75256
16886A832561K15581J02729J88790N129K26735j95902M11099k85820K50778r1371
16876B660309r3859j24343M69520n27547J80246L02977k00522J2216J68992K97924
$$ plain form
16866 3145913 2958331 3096123 3071318 2987647 3272599 3118113 3604695 3363531 3130269 3396176
16856 3396176 3586869 3398100 3478046 3472176 3655772 3316122 3867956 3667148 3640160 3734815
16846 3734815 3786417 3825659 4088789 4495535 4103454 4294771 4319114 3958353 4456463 4453414
16836 4453414 4521608 4275024 4738221 4700386 4794289 5032338 5202601 5000824 5228736 5399111
16826 5399111 5318240 5573955 5804745 5792788 5726966 5856437 5962490 5955826 6431989 6368394
16816 6368394 6462417 6430702 6759802 6860738 7122481 6829686 7112412 7325212 7925248 7755352
16806 7755352 7871846 8097471 8370305 8546928 8494787 8509259 8864856 9125150 9678817 9575675
16796 9575675 9703406 10028099 10270005 10559931 10963108 10829822 11187480 11518000 11709510
$$ packed form
16866C145913j87582J37792k4805q3671K84952j54486M86582k41164k33262K65907
16856C396176J90693j88769P9946n870J83596l39650N51834k00808k6988R4655
16846C734815N1602L9242K63130M06746l92081J91317K4343l60761M98110l049
16836D453414O8194k46584M63197l7835R3903K38049J70263k01777K27912J70375
16826E399111q0871K55715K30790j1957o5822J29471J06053o664M76163o3595
16816F368394R4023l1715L29100J00936K61743k92795K82726K12800O00036j69896
16806G755352J16494K25625K72834J76623n2141J4472L55597K60294N53667j03142
16796I575675J27731L24693K41906K89926M03177j33286L57658L30520J91510
$$ plain form
16787 11709510 12260973 12062863 12698672 13112943 13566421 13598839 14066159 14587978 14834151
16778 14834151 15371810 15696041 16365792 16783742 17029036 17984185 18454434 18686374 19569076
16769 19569076 19838221 20867401 21340636 22291381 23051215 23606732 24587904 25726575 26545339
16760 26545339 27382952 28504053 29825683 30691304 32310994 33113445 34343541 35971117
16752 35971117 37440899 38928071 40282575 42229403 43833694 45999074 48234599 49948996
16744 49948996 52868518 54917983 57740655 60327320 63134253 66398950 69589002 73308192
16736 73308192 77150493 80133308 84091383 88603407 92750071 97347334 102228850 107013363
16728 107013363 112039590 116746591 122083154 126875510 132251987 136877823 141364776 145763086
$$ packed form
16787A1709510N51463j98110O35809M14271M53478L2418M67320N21819K46173
16778A4834151N37659L24231O69751M17950K45294R55149M70249K31940Q82702
16769A9569076K69145J029180M73235R50745P59834N55517R81172J138671Q18764
16760B6545339Q37613J121101J321630Q65621J619690Q02451J230096J627576
16752C5971117J469782J487172J354504J946828J604291K165380K235525J714397
16744D9948996K919522K049465K822672K586665K806933L264697L190052L719190
16736G3308192L842301K982815L958075M512024M146664M597263M881516M784513
16728A07013363N026227M707001N336563M792356N376477M625836M486953M398310
$$ plain form
16720 145763086 149684014 152729894 155715063 157585212 158887636 159434970 159733386 158667303
16712 158667303 157078598 154360674 151206751 147507868 143823323 138901573 134340810 129014011
16704 129014011 123856008 118390908 113322108 107943269 102938374 97874695 92749592 88372830
16696 88372830 83938803 79597491 75664444 71745870 68384755 64820184 61283632 58467583
16688 58467583 55153148 52973754 50451882 48079477 45873827 43845623 41654151 39719953
16680 39719953 37932586 36414228 34703747 33395933 31991968 30561965 29389669 28419595
16672 28419595 26820818 26064298 25124319 24275040 23416899 22229793 21702941 20703603 20006073
16663 20006073 19255852 18953589 17941454 17602180 16916763 16264143 15839535 15383851 14963993
$$ packed form
16720A45763086L920928L045880K985169J870149J302424N47334K98416j066083
16712A58667303j588705k717924l153923l698883l684545m921750m560763n326799
16704A29014011n158003n465100n068800n378839n004895n063679n125103m376762
16696H8372830m434027m341312l933047l918574l361115l564571l536552k816049
16688E8467583l314435k179394k521872k372405k205650k028204k191472j934198
16680C9719953j787367j518358j710481j307814j403965j430003j172296r70074
16672B8419595j598777p56520r39979q49279q58141j187106n26852r99338o97530
16663B0006073p50221l02263j012135l39274o85417o52620m24608m55684m19858
$$ plain form
16654 14963993 14591244 14146895 13685848 13248358 12622860 12360595 12076927 11675733 11351821
16645 11351821 11092844 10959776 10625702 10160349 10106435 9792387 9549191 9264219 8860492
16636 8860492 8853661 8587982 8500943 8057993 8116359 7533966 7424500 7522173 7291678 7098366
16626 7098366 7013626 6786450 6637722 6584567 6592359 5756152 6184704 6052782 5764654 5944401
16616 5944401 5521877 5381032 5624831 5467541 5213035 4846911 5083152 5178693 4942864 4522635
16606 4522635 4470404 4519875 4251041 4023529 4482762 4411062 4148392 3874273 3738541 4088054
16596 4088054 3916910 3822290 3363302 3693391 3680657 3404181 3362877 3335446 3523504 3445692
16586 3445692 3220765 3024639 3171251 3083526 3099988 3172543 2947556 2982247 2503855 2857280
$$ packed form
16654A4963993l72749m44349m61047m37490o25498k62265k83668m01194l23912
16645A1351821k58977j33068l34074m65353n3914l14048k43196k84972m03727
16636H860492o831k65679q7039m42950N8366n82393j09466R7673k30495j93312
16626G098366q4740k27176j48728n3155P792q36207M28552j31922k88128J79747
16616E944401m22524j40845K43799j57290k54506l66124K36241R5541k35829m20229
16606D522635n2231M9471k68834k27512M59233p1700k62670k74119j35732L49513
16596D088054j71144r4620m58988L30089j2734k76476m1304k7431J88058p7812
16586C445692k24927j96126J46612q7725J6462P2555k24987L4691m78392L53425
$$ plain form
16576 2857280 2799987 2734816 2534687 2733208 2475876 2142977 2564806 2524530 2367013 2388670
16566 2388670 2022834 2224362 2184480 2289620 2061012 2091717 2408249 2240709 2150316 2161681
16556 2161681 1917156 1985470 2115458 2022516 2058025 2072414 1976107 1722421 1627241 2028623
16546 2028623 1678346 1571650 1936556 1873691 1866297 1748890 1919583 1489524 1603158 1495750
16536 1495750 1511223 1570351 1694717 1504245 1342109 1395893 1697218 1247077 1607955 1311201
16526 1311201 1323852 1308581 1229280 1374023 1080058 1368161 1354049 935428 1390249 940380
16516 940380 1199166 1116760 1053493 1215535 1264277 1237428 1035132 1066687 821717 1202132
16506 1202132 1274708 1037597 1346349 1096599 902339 1231940 856088 1049385 1211909 913372
$$ packed form
16576B857280n7293o5171k00129J98521k57332l32899M21829m0276j57517K1657
16566B388670l65836K01528l9882J05140k28608L0705L16532j67540r0393J1365
16556B161681k44525O8314J29988r2942L5509J4389r6307k53686r5180M01382
16546B028623l50277j06696L64906o2865p394j17407J70693m30059J13634j07408
16536A495750J5473N9128J24366j90472j62136N3784L01325m50141L60878k96754
16526A311201J2651j5271p9301J44743k93965K88103j4112m18621M54821m49869
16516I40380K58786q2406o3267J62042M8742k6849k02296L1555k44970L80415
16506A202132P2576k37111L08752k49750j94260L29601l75852J93297J62524k98537
$$ plain form
16496 913372 797907 868916 903547 740735 999111 996267 1153366 1081334 618443 934421
16486 934421 771333 561034 860614 800960 1016440 867578 688741 622580 907831 1073709
16476 1073709 784033 756925 788800 1159428 597466 565170 786485 923481 926453 841856
16466 841856 831302 759001 717173 949428 698815 527014 924003 760463 799680 688066
16456 688066 417523 560652 733878 653649 746783 726160 429904 459801 759954 571817
16446 571817 831779 746387 702251 641230 456163 703839 411818 758095 563363 572649
16436 572649 322623 767723 540942 423605 685347 560679 413996 423142 463205 718077
16426 718077 732456 523371 324550 520853 274606 343392 549871 316428 967607 243196
$$ packed form
16496I13372j15465P1009L4631j62812K58376k844J57099p2032m62891L15978
16486I34421j63088k10299K99580n9654K15480j48862j78837o6161K85251J65878
16476A073709k89676k7108L1875L70628n61962l2296K21315J36996K972q4597
16466H41856j0554p2301m1828K32255k50613j71801L96989j63540L9217j11614
16456F88066k70543J43129J73226q0229R3134k0623k96256K9897L00153j88137
16446E71817K59962q5392m4136o1021j85067K47676k92021L46277j94732R286
16436E72649k50026M45100k26781j17337K61742j24668j46683R146M0063K54872
16426G18077J4379k09085j98821J96303k46247O8786K06479k33443O51179B43196
$$ plain form
16415 756159 829420 388442 515087 72649 131435 404418 476068 333203 297958 365106 605870
16404 605870 425191 523502 205285 302982 183406 153064 819156 538025 608319 270634
16393 503840 474765 541858 585794 376822 439752 1461 196315 212349 106249 494575 246707
16381 437031 375437 397662 179212 429870 459117 238515 294863 288622 224422 237389 511842
16370 511842 357784 263921 499079 217311 158139 130703 176741 279520 343165 311762 443064
16359 443064 140788 249369 219936 309331 259424 118580 -81787 196440 82947 251896
16349 251896 250006 719020 224878 226190 273818 -78426 47992 721580 140799 271599 182181
16338 182181 236382 280190 145395 228352 385286 124531 394592 560434 -176660 156123
$$ packed form
16415G56159P3261C88442J26645G2649N8786K72983P1650j42865l5245O7148K40764
16404F05870j80679R8311B05285R7697j19576l0342O66092k81131P0294B70634
16393E03840k9075O7093M3936k08972O2930A461J94854J6034j06100L88326B46707
16381D37031o1594K2225A79212K50658K9247k20602N6348o241o4200J2967K74453
16370E11842j54058r3863K35158B17311n9172k7436M6038J02779O3645l1403J31302
16359D43064A40788J08581k9433Q9395m9907A18580h1787A96440H2947J68949
16349B51896j890M69014B24878J312M7628g8426D7992O73588A40799J30800q9418
16338A82181N4201M3808j34795Q2957J56934A24531K70061J65842a76660A56123
$$ plain form
16327 276576 159082 55067 272066 178839 279207 476089 -151482 441063 344991 -13074
16316 -60604 56685 110103 17156 139900 316894 253536 97402 188305 178988 36905 -31280
16304 311905 22005 -78445 245845 -31067 314709 225162 149351 297791 263808 335614 434019
16293 434019 99535 53524 296429 -53815 316420 245795 142225 268592 -115187 -69792
16283 -69792 252944 317175 428580 151431 126950 -149008 262834 372417 220517 131620
16273 131620 366068 -26013 375718 -18918 186252 69175 -152070 307264 207789 -140943
16262 -103239 186072 -38125 162171 419982 24666 -64224 43519 50123 304984 73848 -281855
16250 97086 -46044 75718 -64698 -84489 -32894 234151 150604 68512 -94404 135517 -18003
$$ packed form
16327B76576j17494E5067K16999r3227J00368J96882a51482D41063r6072a3074
16316f0604E6685N3418A7156J22744J76994o3358I7402R0903r317C6905c1280
16304C11905B2005g8445B45845c1067C14709q9547p5811J48440l3983P1806R8405
16293D34019I9535m6011K42905e3815C16420p0625j03570J26367a15187M5395
16283f9792B52944O4231J11405A51431k4481a49008B62834J09583j51900q8897
16273A31620K34448b6013C75718a8918A86252F9175a52070C07264r9475a40943
16262a03239A86072c8125A62171K57811B4666f4224D3519O604K54861G3848b81855
16250I7086d6044G5718f4698j9791c2894B34151q3547F8512i4404A35517a8003
$$ plain form
16238 -11786 155586 260949 24480 223584 168215 -14913 192271 -363380 158729 352040
16228 352040 1564 77525 -50540 213694 -300730 316299 389537 178642 164246 197306 -187113
16216 333521 16428 141600 -65070 388138 150859 45138 203779 -50162 124040 -124759
16205 44590 34971 -67646 -77690 -18886 99346 275585 -165359 32153 95350 33556 95276
16194 95276 168799 419649 -334308 -71362 382208 98820 81997 63319 34926 124310 -406254
16182 269651 -122059 -44196 393198 -364483 411366 168264 -256517 107590 131814 -207010
16171 73853 295180 70365 -86763 -224728 66481 -172418 222912 200704 -59090 -83573 6697
16159 20864 94093 222068 96963 31696 341628 175981 135366 -181691 -201718 -192624 -14305
$$ packed form
16238a1786A55586J05363B4480J99104n5369a4913A92271c63380A58729J93311
16228C52040A564P5961e0540B13694c00730C16299P3238A78642j4396L3060a87113
16216C33521A6428J25172f5070C88138A50859D5138J58641e0162A24040a24759
16205D4590r619f7646j0044a8886I9346J76239a65359C2153O3197C3556O1720
16194I5276P3523K50850c34308g1362C82208I8820j6823j8678k8393Q9384d06254
16182B69651a22059d4196C93198c64483D11366A68264b56517A07590K4224b07010
16171G3853K21327G0365h6763j37965F6481a72418B22912k2208e9090k4483F697
16159B0864P3229J27975I6963C1696L09932j65647m0615a81691k0027R094a4305
$$ plain form
16147 153517 32179 282849 129017 57772 85249 220617 -160645 -103592 97264 -76192 205228
16135 50034 242060 70750 -150647 -71704 -104097 363920 205855 -141019 78643 -122053
16124 114652 268950 -253106 260330 379453 148177 161906 -210502 122631 -238643 131039
16113 -466831 -41084 120424 -138422 -167052 600 -349825 308433 281091 -173057 -62526 196851
16101 51630 -193315 209853 -30948 -69293 34393 -171930 -19700 -65263 -228405 -31226 249690
16089 271250 60792 51236 292942 37968 61275 38061 3625 215646 223226 -325987 137508
16077 92226 -77234 -248471 62511 -98895 -90003 266411 -186150 296 -120021 215880 10039
16065 207495 -86614 -534386 309047 -90837 173176 48690 -118869 17669 -150925 106742
$$ packed form
16147A53517C2179K50670A29017E7772K7477J35368a60645N7053I7264g6192B05228
16135E0034J92026G0750a50647g1704l2393C63920j58065a41019G8643a22053
16124A14652J54298b53106B60330J19123A48177J3729b10502A22631b38643A31039
16113d66831d1084A20424a38422k8630F00c49825C08433k7342a73057f2526A96851
16101E1630a93315B09853c0948l8345C4393a71930a9700m5563j63142c1226B49690
16089B71250F0792r556K41706C7968K3307k3214C625K12021P580c25987A37508
16077I2226g7234j71237F2511i8895Q892B66411a86150B96a20021B15880A0039
16065B07495h6614m47772C09047i0837A73176D8690a18869A7669a50925A06742
$$ plain form
16054 185211 92893 2661 279905 126154 -209382 -57532 63387 -295525 -18528 47749 -113190
16042 87508 -294358 -147130 -37439 59526 -143932 206510 -206788 -58465 -79280 62624 -156679
16030 219950 -34229 73672 -138181 -14335 -119366 -299454 154608 -119473 -57516 -117483
16020 -117483 -55764 -42873 -53186 12397 21537 15323 -218536 91814 -124979 -77683 -132775
16009 -132775 -114605 174555 136966 -190093 103921 59578 176478 136141 -249762 -136398
15999 -136398 132220 -33953 -271857 28725 -73278 116107 -436010 -54019 -222242 227584
15988 221297 48219 -58016 192597 451190 115451 464505 274621 466644 76595 -79816
15977 -161798 -151635 53319 15202 -137662 -173686 -162185 -22481 129851 421842 -49155 -249533
$$ packed form
16054A85211r2318B661K77244A26154b09382e7532F3387b95525a8528D7749a13190
16042H7508b94358a47130c7439E9526a43932B06510b06788e8465k0815F2624a56679
16030B19950c4229G3672a38181a4335j05031j80088A54608a19473e7516n9967
16020a17483e5764J2891j0313A2397R140o214b18536I1814a24979M7296n5092
16009a32775J8170A74555l7589a90093A03921m4343J16900m0337b49762J13364
15999a36398A32220c3953k37904B8725g3278A16107d36010e4019j68223B27584
15988B21297D8219e8016A92597K58593A15451L49054j89884J92023G6595g9816
15977a61798J0163E3319A5202a37662l6024J1501b2481A29851K91991d9155k00378
$$ plain form
15966 -249533 195910 -151158 55915 161000 129521 72941 -393605 84218 -133556 205319
15955 -77161 82165 -102605 165720 -55678 38853 -70740 122200 278769 147607 86835 87853
15944 87853 -166644 73795 175256 -448643 48651 -145847 -45592 -2042 -335852 62518 -107746
15932 145211 17920 -325754 -16617 -336036 -336207 50788 -29 281962 -92927 -12353 266369 -78319
15919 368284 -112219 -172561 -27733 -53825 123503 129752 -5549 -25300 -29940 195544 22045
15907 -66310 -20738 -71681 223289 -86783 181621 14199 -5628 -223534 -72402 -60302 196886
15895 -46765 90281 -175392 -162431 -350672 -32521 -468117 27021 219014 1371 173423 30230
15883 81025 -289230 -305620 -22624 58317 152869 -4115 -79611 -264456 -53305 434777 -166369
$$ packed form
15966b49533A95910a51158E5915J05085l1479n6580c93605H4218a33556B05319
15955g7161H2165a02605A65720e5678C8853g0740A22200J56569j31162o0772J018
15944H7853a66644G3795J01461d48643D8651a45847d5592b042l33810F2518a07746
15932A45211A7920c25754a6617l19419j71E0788b9B81962i2927a2353B66369g8319
15919C68284a12219o0342b7733k6092A23503O249e549j9751m640A95544B2045
15907f6310b0738n0943B23289h6783A81621A4199e628k17906g2402J2100A96886
15895d6765I0281a75392J2961j88241c2521m35596B7021J91993A371J72052C0230
15883H1025b89230j6390b2624E8317R4552d115p5496j84845e3305D34777a66369
$$ plain form
15871 -298353 -87568 137254 179196 -244754 -32142 -14523 -190531 -133899 124949 208785 66775
15859 -379524 -148349 -25677 126646 -127495 100479 107236 6413 76514 27978 68782 -222207
15847 123100 -309435 120600 115262 -140322 -1103 -250413 64122 18773 28682 46579 -82553
15835 -126287 248248 -242378 -205408 40452 -291360 181288 -89635 -126254 -379388 299038
15824 24158 255935 -143602 197455 -132526 -217943 183446 -60153 -205451 13457 -204052
15813 34298 -26900 -147995 -67420 -302807 -291803 45688 -160754 169968 -135923 98864 312250
15802 312250 -161088 -95213 -28115 140971 -278032 233300 29763 -164064 86237 -222151
15791 220382 84278 43013 57168 -111616 31356 13765 -157403 -270033 -187295 133166 -349655
$$ packed form
15871b98353h7568A37254M1942b44754c2142a4523j76008N6632A24949Q3836F6775
15859c79524a48349b5677A26646a27495A00479O757F413P0101B7978M0804b22207
15847A23100c09435A20600n338a40322a103k49310F4122A8773R909J7897h2553
15835a26287B48248b42378L6970D0452b91360A81288h9635l6619k53134B99038
15824B4158K31777a43602A97455a32526q5417A83446f0153j45298A3457b04052
15813C4298b6900j21095f7420k35387J1004D5688a60754A69968a35923I8864K13386
15802C12250a61088O5875b8115A40971b78032B33300B9763a64064H6237b22151
15791B20382H4278m1265J4155a11616C1356A3765a57403j12630Q2738A33166c49655
$$ plain form
15779 -6753 35177 11975 191547 -37258 118250 -136125 103737 109662 160000 -191526 -132307
15768 -132307 180562 201664 200941 -280576 -212210 82943 102176 247369 99192 -74841 93157
15756 276500 120048 57831 372962 112051 -113165 37476 184009 27298 428720 -198989
15745 58197 -201728 180835 194784 257520 3128 -25229 -262925 -91825 270626 -17880 -264246
15734 -264246 -80004 271159 114388 -139323 39580 148966 -349415 -13125 -118450 14386
15723 -290980 -267223 -94570 -213647 -235785 -295365 38196 355252 -473786 -47174 52759 -64246
15711 -93698 -37747 -148390 -69548 85569 43640 120742 -94956 -299802 161196 -138546 169363
15699 -95153 -104569 -127569 4457 14856 -13035 52181 -115320 -355786 199946 572234 4823
$$ packed form
15779f753C5177A1975J79572c7258A18250a36125A03737N925N0338a91526N9219
15768a32307A80562K1102p23b80576O8366H2943J9233J45193I9192g4841I3157
15756B76500A20048E7831L15131A12051a13165C7476J46533B7298M01422a98989
15745E8197b01728A80835J3949O2736C128b5229k37696i1825B70626a7880k46366
15734b64246h0004B71159A14388a39323C9580J09386c49415a3125j05325A4386
15723b90980K3757i4570j19077k2138n9580C8196L17056d73786d7174E2759f4246
15711i3698c7747j10643f9548H5569m1929P7102i4956k04846A61196a38546A69363
15699i5153r416k3000D457J0399a3035E2181a15320k40466A99946L72288D823
$$ plain form
15687 -62999 -295039 227878 78900 -234511 243432 -245194 -356015 -113516 -115886 -120817 -38913
15675 -7488 204279 -292544 106822 280009 -134093 54130 -83550 192118 346055 85164
15664 -7281 153327 -60660 -53878 -118943 -65669 -102444 136451 -188450 50276 151403 -79860
15652 -1884 250877 -216569 31366 121957 -187239 -534117 215825 -92126 -61001 33563 117551
15641 117551 -24220 -118625 -365761 216802 -110836 -121862 238960 -219551 -16599 -48996
15631 -48996 36627 -47611 178036 121153 10273 69813 447372 -411119 -221086 -176993 10678
15619 66942 335054 47961 -302974 -205676 -21091 214619 -67151 -134762 -46701 -271488 31433
15607 -304901 20450 -320145 248179 -146794 -158815 -31838 1797 112709 -256522 259684
$$ packed form
15687f2999k32040B27878G8900b34511B43432b45194j10821a13516k370m931c8913
15675g488B04279b92544A06822J73187a34093E4130h3550A92118J53937H5164
15664g281A53327f0660O782o5065N3274l6775A36451a88450E0276J01127g9860
15652a884B50877b16569C1366R0591a87239l46878B15825i2126L1125C3563Q3988
15641A17551b4220r4405k47136B16802a10836j1026B38960b19551a6599l2397
15631d8996C6627d7611A78036n6883A0273N9540L77559d11119J90033M4093A0678
15619F6942K68112D7961c02974R7298b1091B14619f7151o7611d6701k24787C1433
15607c04901B0450c20145B48179a46794j2021c1838A797J10912b56522B59684
$$ plain form
15596 -156515 -262329 -96388 118377 129326 -180075 98449 168483 -3192 -14882 75088 60261
15585 60261 27967 127084 98034 156731 -36289 81286 -125594 -76035 -151700 402134 -220811
15573 -53051 -185986 -163526 -328403 -59031 65955 -46838 -183012 133040 -57340 103250 293225
15562 293225 -77988 -116612 136978 31914 20337 -113907 57012 -271749 -144580 257423
15551 -121895 105368 161530 -185958 -85712 102980 -70582 -86997 100099 167221 -183325
15540 -469282 103491 93004 -207468 405609 63748 -44138 -55084 -15478 -96971 -43667 -486639
15529 -486639 -192742 -126337 108472 -268159 63923 199926 37109 -94643 290483 49776
15518 6540 121027 154650 65638 -104168 39959 9845 58366 122014 -62123 -197027 311663
$$ packed form
15596a56515j05814i6388A18377J0949a80075I8449P0034c192j1690G5088j4827
15585F0261B7967R9117k9050N8697c6289H1286a25594M9559p5665D02134b20811
15573e3051j32935K2460j64877e9031F5955d6838j36174A33040e7340A03250J89975
15562B93225g7988l8624A36978C1914j1577a13907E7012b71749J27169B57423
15551a21895A05368N6162a85958h5712A02980g0582j6415A00099O7122a83325
15540d69282A03491j0487b07468D05609F3748d4138j0946a5478q1493d3667m42972
15529d86639a92742O6405A08472b68159F3923J36003C7109i4643B90483D9776
15518F540J14487L3623F5638a04168C9959I845M8521O3648f2123j34904C11663
$$ plain form
15506 -84670 -29704 -69949 10906 -39328 -254956 -293070 -98230 -43380 -156308 -150436 -222931
15495 -222931 133201 -89638 35441 -105424 10878 -24366 -35480 -130787 325998 -204591 73178
15483 49991 -81196 105122 107399 197077 -135312 -225979 156361 -83304 64575 11222 173867
15472 173867 81761 22630 241596 305612 -36554 -214126 140823 184983 3246 -185839 -44240
15460 -157003 -113583 -34589 249402 43228 318805 -183554 100886 -266630 -219798 165495
15449 -113694 -159054 146141 -106248 -19915 144383 52251 -260840 35175 -80462 6667 -73720
15437 95301 198359 164227 -53870 2143 63296 -331928 29730 51371 16836 112459 12870
15425 -127515 211969 288200 72360 -226563 182982 -25579 -44940 326994 -291550 -113508
$$ packed form
15506h4670b9704m0245A0906c9328k15628l8114i8230d3380j12928N872p2495
15495b22931A33201h9638C5441a05424A0878b4366j1114r5307C25998b04591G3178
15483D9991h1196A05122K277Q9678a35312r0667A56361h3304F4575A1222J62645
15472A73867H1761B2630K18966O4016c6554j77572A40823M4160C246a85839d4240
15460a57003M3420c4589B49402D3228K75577a83554A00886b66630M6832A65495
15449a13694m5360A46141a06248a9915A44383E2251b60840C5175h0462F667g3720
15437I5301J03058l4132e3870B143O1153c31928B9730K1641A6836R5623A2870
15425a27515B11969P6231G2360b26563A82982b5579j9361C26994b91550a13508
$$ plain form
15414 1753 123182 -64196 -226614 70228 50317 -195749 -48012 107520 -65230 -151914 32879
15402 -148466 -30032 -56099 -144268 -95398 80255 12576 182822 -234643 -49486 -110443 -117647
15391 -117647 -48863 -112853 -91002 -53886 -21901 -177902 -165804 -111824 -145072 5107 -280836
15379 59175 -47847 -234798 130269 -275302 5941 50334 -29142 233940 111887 196826 -94815
15367 76250 -45800 -119460 -75449 94932 237824 98885 110847 -87250 -292267 -780 -29608 -29875
15355 -29875 -49401 39094 19850 29426 41865 189065 162552 137159 -204973 -104320 75108
15343 -147056 28983 165603 -161894 147650 -113749 218222 -235582 22288 -138740 479106
15332 438399 -130965 221340 89898 -265132 -196205 -191120 5862 48715 -8241 164632 63952
$$ packed form
15414A753J21429f4196j62418G0228j9911a95749d8012A07520f5230q6684C2879
15402a48466c0032k6067q8169M8870H0255A2576J70246b34643d9486o0957p204
15391a17647d8863o3990K1851L7116b1901j56001J2098N3980l3248E107b80836
15379E9175d7847j86951A30269b75302E941M4393b9142B33940A11887Q4939i4815
15367G6250d5800p3660M4011I4932J42892I8885J1962h7250k05017g80k8828k67
15355b9875j9526C9094j9244R576J2439J47200k6513k5393b04973J00653G5108
15343a47056B8983J36620a61894A47650a13749B18222b35582B2288a38740D79106
15332D38399a30965B21340H9898b65132O8927N085E862M2853h241A64632F3952
$$ plain form
15320 174313 -130608 -10800 169739 -24975 -129667 113411 65058 102542 14907 -4258 -164930
15309 -164930 50047 234444 -221164 109017 35520 75637 -1477 41991 -132765 369565 138108
15297 12309 -73892 392105 34248 94228 177145 5756 183148 -169823 115113 -109936 94356
15285 429182 33056 40979 58408 -194062 355 279380 -194545 46288 218379 -298506 216433
15273 175155 394418 404608 -29285 168570 42504 -200298 -143435 107849 113815 -51838 226925
15261 86487 -68359 -36110 -2017 -38642 47286 -42864 -80980 -215077 62834 -31194 15291 -103024
15248 571207 1533936 977393 795938 1474996 521371 -97155 146646 -266743 140039 -130426
15237 85109 160457 -198348 -129219 370907 42864 56455 -128546 -203993 377251 321529 -72570
$$ packed form
15320A74313a30608a0800A69739b4975j04692A13411m8353L7484A4907d258j60672
15309a64930E0047J84397b21164A09017C5520M0117a477D1991a32765C69565A38108
15297A2309g3892C92105C4248N9980Q2917E756J77392a69823A15113a09936I4356
15285D29182C3056P923J7429a94062C55K79025a94545D6288J72091b98506B16433
15273A75155K19263J0190b9285A68570D2504b00298N6863A07849N966e1838B26925
15261H6487f8359L2249b017l6625D7286d2864l8116j34097F2834c1194A5291a03024
15248E71207R62729n56543j81455O79058E21371i7155A46646b66743A40039a30426
15237H5109P5348a98348O9129C70907D2864J3591a28546p5447C77251n5722g2570
$$ plain form
15225 84196 88578 73880 -183228 13283 -156528 293643 175998 369137 266850 -61230 -76849
15214 -76849 256841 -96025 94881 201267 -36373 393507 -54918 -59482 37094 20952 94196
15203 94196 -44787 -165629 19303 83614 200481 245462 -9038 62178 -424209 -95654 97738
15191 -370397 -70066 245627 135009 -116119 193554 -244767 -51183 182541 211329 -68150
15180 -24909 395846 108548 66004 196585 173712 109234 288718 -294652 -97550 -6064 -123229
15169 -123229 -100571 127699 389900 50817 183817 8857 -124529 163395 107 299909 94997
15157 -119634 -178086 209549 86784 130634 210106 27553 -22723 81117 13997 84659 233700
15146 233700 397331 168611 1707 163110 167582 311683 259694 340721 262881 67221 -73230
$$ packed form
15225H4196M382j4698a83228A3283a56528B93643j17645J93139j02287f1230j5619
15214g6849B56841i6025I4881J06386c6373C93507e4918m564C7094j6142P3244
15203I4196d4787j20842A9303O4311J16867M4981i038F2178d24209i5654I7738
15191c70397g0066B45627j10618a16119A93554b44767e1183A82541K8788f8150
15180b4909C95846A08548m2544J30581k2873o4478J79484b94652i7550f064j17165
15169a23229K2658A27699K62201E0817J33000H857a24529A63395A07K99802I4997
15157a19634n8452B09549H6784M3850P9472B7553b2723H1117A3997P0662J49041
15146B33700J63631A68611A707J61403M472J44101n1989Q1027p7840F7221g3230
$$ plain form
15134 415199 266818 38447 -25376 79393 461499 -103515 -47999 -25387 -71858 102188 377480
15123 377480 203929 -148251 223445 281656 163778 115442 281979 328405 76358 272117
15113 272117 -152053 30975 155183 86235 -176928 251789 315058 -81733 158546 103741
15103 103741 19415 208229 170475 -181079 -136148 -54645 -89092 292719 -42973 43754 -5450
15091 383 -29320 -86029 -98471 269659 175609 3015 94652 527779 -54819 -158210 121445
15079 64338 19589 71456 316455 -78949 467820 144454 156887 -113200 120349 -14508 -111693
15068 -111693 39459 113750 134512 194466 -44431 392286 -130645 -90351 -74556 255599 -15165
15056 -56915 -105272 53295 412092 172343 322457 119315 128206 244393 293765 381361 -61375
$$ packed form
15134D15199j48381C8447b5376G9393L82106a03515d7999K2612m6471A02188K75292
15123C77480j73551a48251B23445N8211j17878m8336J66537M6426G6358J95759
15113B72117a52053C0975J24208o8948a76928B51789O3269h1733A58546n4805
15103A03741A9415J88814l7754a81079M4931e4645l4447B92719d2973D3754e450
15091C83b9320n6709j2442B69659r4050C015R1637M33127e4819j03391A21445
15079F4338A9589N1867K44999g8949D67820A44454J2433a13200A20349a4508r7185
15068a11693C9459P4291K0762N9954d4431C92286a30645M0294J5795B55599a5165
15056e6915m8357E3295L58797A72343J50114A19315Q891J16187M9372Q7596f1375
$$ plain form
15044 -80249 51931 149290 -9507 80518 13347 -253929 264796 284254 416008 -69639 194294
15032 148016 -202199 -194475 -103844 166984 97577 1459 158039 200759 546913 188386 346566
15021 346566 370679 -396258 281587 117418 233909 330982 54548 129394 -26375 113897
15010 449430 181094 1438 -34668 130544 393974 384532 95229 329260 -29026 73606 435458
14999 435458 -98059 260661 260045 305078 129913 345481 34054 405052 223177 284751 5589
14987 143584 304681 -271639 563343 234174 169468 90331 233469 21788 157182 -146587
14976 -102306 -43489 -117838 189614 240937 -10452 96206 50073 83995 446569 111681 310125
14965 310125 382873 381470 -108846 229170 208981 287400 281513 289657 372012 180418 321281
$$ packed form
15044h0249E1931R7359i507H0518A3347b53929B64796J9458J31754f9639A94294
15032A48016b02199P724R0631A66984o9407A459J56580M2720L46154A88386J58180
15021C46566K4113c96258B81587A17418J16491R7073E4548P4846b6375A13897
15010D49430A81094A438c4668A30544K63430r442I5229K34031b9026G3606L61852
14999D35458i8059B60661o16M5033A29913K15568C4054L70998j81875O1574E589
14987A43584J61097b71639E63343B34174o4706p9137J43138B1788J35394a46587
14976a02306d3489p4349A89614N1323a0452I6206m6133L3922L62574A11681J98444
14965C10125P2748j403a08846B29170k0189P8419n887Q144Q2355A80418J40863
$$ plain form
14954 321281 358159 403275 411458 98012 253304 36214 137027 488319 286465 -78411 339898
14942 133201 261208 177592 1545 106638 194729 -137615 476039 41264 -72875 392016 237152
14931 237152 162366 110827 298681 376165 281791 134978 216571 626136 5584 336699 312567
14920 312567 375927 165356 342141 135834 450295 402045 -126811 52333 206249 31559
14909 727569 175335 189423 177471 364720 84646 542293 445107 688369 445858 152795
14898 510903 311030 147950 136277 691426 589979 379472 475697 131935 82774 116510
14888 116510 384335 327541 449804 76539 253253 306749 161134 50915 -200084 67797
14877 632861 386721 394401 606307 216956 55641 77491 321141 508493 310765 475563
$$ packed form
14954C21281L6878M5116Q183I8012J55292C6214J00813L51292k01854g8411C39898
14942A33201J28007q3616A545J05093Q8091a37615D76039D1264g2875C92016j54864
14931B37152p4786n1539J87854P7484r4374A34978Q1593M09565E584L31115k4132
14920C12567O3360A65356J76785A35834L14461m8250a26811E2333J53916C1559
14909G27569A75335J4088j1952J87249H4646M57647r7186K43262k42511A52795
14898E10903j99873A47950j1673N55149j01447k10507R6225A31935m9161L3736
14888A16510K67825n6794J22263G6539J76714N3496j45615E0915b00084F7797
14877F32861k46140P680K11906B16956E5641K1850K43650J87352j97728J64798
$$ plain form
14867 475563 423971 213677 367006 192940 486411 557793 439008 455028 305290 375075
14857 375075 422657 315240 296329 478192 298892 214550 726488 463229 244789 231807
14847 231807 374017 330707 457578 336609 300305 442020 671131 591533 567987 325389
14837 325389 271419 294003 150976 178246 293986 320500 486563 627034 71431 543341
14827 543341 325082 724810 654217 649977 470787 371948 474035 315381 387096 555641
14817 555641 306923 341099 642673 310661 832897 508191 188093 580374 529116 485443
14807 485443 197866 139185 857794 134600 604196 379394 491073 302124 730201 489518
14797 489518 515440 469699 621399 286867 440435 424977 243983 465265 346653 379180
$$ packed form
14867D75563n1592k10294J53329j74066K93471P1382j18785J6020j49738O9785
14857C75075M7582j07417j8911J81863j79300q4342N11938k63259k18440j2982
14847B31807J42210m3310J26871j20969l6304J41715K29111p9598k3546k42598
14837C25389n3970K2584j43027K7270J15740K6514J66063J40471G1431M71910
14827E43341k18259L99728p0593m240j79190r8839J02087j58654P1715J68545
14817E55641k48718L4176L01574C10661N22236l24706A88093L92281n1258m3673
14807D85443A97866n8681P18609A34600M69596k24802J11679j88949M28077k40683
14797D89518K5922m5741J51700B86867J53568j5458j80994K21282j18612L2527
$$ plain form
14787 379180 264334 461509 601224 403092 699802 521541 105264 477785 627596 333041
14777 333041 550931 618668 469183 335171 582532 524545 580865 94504 937418 317027
14766 687347 722544 678509 750883 943954 677475 398636 543312 509433 330738 553810
14756 553810 245057 466954 719553 554371 504791 969571 734647 801874 714785 497725
14746 497725 656358 646455 563151 611113 685090 900103 799707 525191 772274 669942
14736 669942 825893 638756 740094 511353 928411 837345 825103 334535 1043650 877835
14726 877835 692775 387503 473477 1092047 892465 900797 733719 888727 589993 616844
14716 616844 603362 868498 543483 791412 715179 921264 516281 839786 582620 833238
$$ packed form
14787C79180j14846J97175J39715j98132K96710j78261A05264L72521J49811k94555
14777C33041K17890O7737j49485j34012K47361n7987N6320I4504Q42914C17027
14766F87347L5197m4035P2374J93071k66479k78839J44676l3879j78695K23072
14756E53810B45057K21897K52599j65182m9580M64780k34924O7227q7089k17060
14746D97725J58633r903q3304M7962P3977K15013j00396k74516K47083j02332
14736F69942J55951j87137J01338k28741M17058r1066j2242C34535P09115j65815
14726H77835j85060l05272Q5974O18570j99582Q332j67078J55008k98734K6851
14716F16844j3482K65136l25015K47929p6233K06085m04983L23505k57166K50618
$$ plain form
14706 833238 772533 896244 1001225 884840 742493 537982 917412 616235 641791 1139355
14696 1139355 883821 638808 926246 763335 672810 779658 1076952 834903 671927 703042
14686 703042 844694 776818 932539 1030075 1004278 1073748 978288 668100 1083151 941175
14676 941175 781593 1056535 876070 759083 974062 1148300 1188075 835301 856181 1037220
14666 1037220 858663 690876 1137902 840624 854632 886095 684322 1103314 638680 1014696
14656 1014696 1116160 1091886 1102159 729886 1151253 1289853 1077605 1142851 874139 1092412
14646 1092412 1377142 1165337 1343266 1116648 1128519 1210036 1225465 920813 1243348 1325910
14636 1325910 1170690 1241969 948393 1287818 1128219 1130989 1348662 1137343 977589 1185794
$$ packed form
14706H33238o0705J23711J04981j16385j42347k04511L79430l01177K5556M97564
14696A139355k55534k45013K87438j62911r0525J06848K97294k42049j62976L1115
14686G03042J41652o7876J55721R7536k5797O9470r5460l10188M15051j41976
14676I41175j59582K74942j80465j16987K14979J74238L9775l52774K0880J81039
14666A037220j78557j67787M47026k97278J4008L1463k01773M18992m64634L76016
14656A014696J01464k4274J0273l72273M21367J38600k12248O5246k68712K18273
14646A092412K84730k11805J77929k26618J1871Q1517J5429l04652L22535Q2562
14636A325910j55220P1279k93576L39425j59599K770K17673k11319j59754K08205
$$ plain form
14626 1185794 1157840 1194720 986234 1335186 1362985 1306329 1409070 1310089 1082069 1529277
14616 1529277 1278031 1374089 1559405 1656112 1417286 1783050 1622543 1496910 1369802 1467232
14606 1467232 1382286 1454637 1468419 1492048 1501412 1522039 1312028 1595666 1775136 1720455 1417834
14595 1417834 1618008 1431128 1658731 1483955 1603522 1782426 1714596 1845610 1800899 1987120
14585 1987120 1697753 1839676 1571245 1726871 2097131 1730809 1671403 1988871 1845989 1825347
14575 1825347 1693856 2039427 1826033 2276778 2059312 1934100 2416143 2626167 2194942
14566 2194942 2254076 2136444 2398868 2339000 2575900 2352501 2833865 2762428 2610336 2683025
14556 2683025 3055101 3161583 3074243 3605335 3914322 4611592 4979665 6895518 10873751
$$ packed form
14626A185794k7954L6880k08486L48952K7799n6656J02741r8981k28020M47208
14616A529277k51246R6058J85316R6707k38826L65764j60507j25633j27108R7430
14606A467232q4946P2351J3782K3629R364K0627k10011K83638J79470n4681l02621
14595A417834K00174j86880K27603j74776J19567J78904o7830J31014m4711J86221
14585A987120k89367J41923k68431J55626L70260l66322n9406L17468j42882k0642
14575A825347j31491L45571k13394M50745k17466j25212M82043K10024m31225
14566B194942N9134j17632K62424n9868K36900k23399M81364p1437j52092P2689
14556B683025L72076J06482q7340N31092L08987O97270L68073J915853L978233
$$ plain form
14547 10873751 18642773 40987212 45592136 18613036 6506915 2811741 2416120 1878899
14539 1878899 1849911 1855561 1726236 1616344 1603398 1597954 1605154 1860140 1866479 2165269 1873539
14528 1873539 2289011 2086003 2286379 2045652 2149807 2239961 2478526 2322035 2409758 2236865
14518 2236865 2227432 2524143 2396158 2239877 2619122 2508799 2439905 2725444 2295990 3043939
14508 3043939 2377532 2728139 2676988 2662744 2746108 2736311 2848206 2579577 2987084 3226122
14498 3226122 3008484 3018075 2853767 3222104 3127785 3308118 3133637 3500784 3288752 3281858
14488 3281858 2923847 3490769 3654042 3358924 3474147 3483554 3470468 3295162 3613768 3683175
14478 3683175 3420746 3663245 3583260 3708877 3924302 3997652 4226557 3853043 3889980 4195315
$$ packed form
14547A0873751P769022K2344439M604924A8613036F506915B811741l95621n37221
14539A878899k8988N650j29325j09892j2946n444P200K54986O339K98790k91730
14528A873539M15472k03008K00376k40727J04155R0154K38565j56491Q7723j72893
14518B236865r433K96711j27985j56281L79245j10323o8894K85539m29454P47949
14508C043939o66407L50607n1151j4244Q3364r797J11895k68629M07507K39038
14498C226122k17638R591j64308L68337r4319J80333j74481L67147k12032o894
14488C281858l58011N66922J63273k95118J15223R407j3086j75306L18606O9407
14478C683175k62429K42499p9985J25617K15425P3350K28905l73514L6937L05335
$$ plain form
14468 4195315 4039089 4207723 3957732 3803177 4488297 4117947 4093286 4177069 4335715 4796499
14458 4796499 4784705 4651672 4849717 4683784 4809244 4949414 4980177 4947954 5134489 5161868
14448 5161868 4875663 5078530 5608188 5482995 5483296 5737882 5666304 5658747 5958446 5854112
14438 5854112 5577627 6146975 6012163 5868435 6101192 6182827 6267422 6072801 6374584 6344635
14428 6344635 6387249 6851394 6760334 6797334 6940609 7080826 7207958 7290234 7499114 7387688
14418 7387688 7396792 7749673 7734286 8064121 7763074 8386032 8505643 8472859 8610960 8410628
14408 8410628 9090066 9073862 9083614 9545569 9589780 9388020 9572952 9721428 10056531 9840867
14398 9840867 10208177 10542070 10764605 10504394 10920270 11305522 10987136 11498946 12007856
$$ packed form
14468D195315j56226J68634k49991j54555O85120l70350k4661Q3783J58646M60784
14458D796499j1794j33033J98045j65933J25460J40170L0763l2223J86535K7379
14448E161868k86205K02867N29658j25193L01K54586p1578p557K99699j04334
14438E854112k76485N69348j34812j43728K32757Q1635Q4595j94621L01783k9949
14428F344635M2614M64145r1060L7000J43275J40217J27132Q2276K08880j11426
14418G387688R104L52881j5387L29835l01047O22958J19611l2784J38101k00332
14408H410628O79438j6204R752M61955M4211k01760J84932J48476L35103k15664
14398I840867L67310L33893K22535k60211M15876L85252l18386N11810N08910
$$ plain form
14389 12007856 12055486 12216562 12420661 12684486 12810153 13352783 13238242 13387512 13792401
14380 13792401 13884308 13891322 14412628 14778735 15156083 15259012 15711812 16175373 16034610 16350432
14370 16350432 16933026 17363694 17680527 17840514 18340125 18463963 18898348 19301835 19283278
14361 19283278 19980460 20724387 20675268 21510527 22022336 22720950 23329800 23730823 24564487
14352 24564487 25027979 25438414 26101012 26597118 27322021 27915526 28893616 29778116 30311009
14343 30311009 31381776 31939233 33046990 33931029 34346878 35690100 36879935 37836670 38903157
14334 38903157 40028596 41214202 42395527 43349950 45041732 46484082 47973183 49444361
14326 49444361 51330256 52676745 54551873 56238347 58545344 60412413 62789276 64760649
$$ packed form
14389A2007856M7630J61076K04099K63825J25667N42630j14541J49270M04889
14380A3792401R1907P014N21306L66107L77348J02929M52800M63561j40763L15822
14370A6350432N82594M30668L16833J59987M99611J23838M34385M03487j8557
14361A9283278O97182P43927m9119Q35259N11809O98614O08850M01023Q33664
14352B4564487M63492M10435O62598M96106P24903N93505R78090Q84500N32893
14343C0311009J070767N57457J107757Q84039M15849J343222J189835R56735J066487
14334C8903157J125439J185606J181325R54423J691782J442350J489101J471178
14326D9444361J885895J346489J875128J686474K306997J867069K376863J971373
$$ plain form
14318 64760649 67128773 69625777 72112260 74965844 77989562 80865084 83814980 87434361
14310 87434361 90770995 94601595 98811271 102654121 107549646 112210776 117011809 122441915
14302 122441915 127970984 133811432 140364882 146783466 153726833 161577642 169393138 177541707
14294 177541707 186259848 195702660 205545528 216152783 227050267 238252418 250252860
14287 250252860 262800331 275675847 289037141 302674689 316755058 330769581 345413079
14280 345413079 359776079 373782975 387596370 400761526 412876152 423980256 433300082
14273 433300082 439582768 441852900 443077643 445051897 444606776 440396716 437926514 431181743
14265 431181743 421619571 410152895 397258148 382946985 368274129 352796434 337476857
$$ packed form
14318F4760649K368124K497004K486483K853584L023718K875522K949896L619381
14310H7434361L336634L830600M209676L842850M895525M661130M801033N430106
14302A22441915N529069N840448O553450O418584O943367P850809P815496Q148569
14294A77541707Q718141R442812R842868J0607255J0897484J1202151J2000442
14287B50252860J2547471J2875516J3361294J3637548J4080369J4014523J4643498
14280C45413079J4363000J4006896J3813395J3165156J2114626J1104104R319826
14273D33300082O282686K270132J224743J974254m45121m210060k470202o744771
14265D31181743r562172j1466676j2894747j4311163j4672856j5477695j5319577
$$ plain form
14258 337476857 321919262 306624900 291326969 277372322 264086091 250691537 237962969
14251 237962969 225834742 214199538 203363527 193370160 183274586 174193881 165611200
14244 165611200 158102201 150337183 143213694 136204875 129733803 123875348 118549510 113623635
14236 113623635 108284946 103569378 99142779 95251772 90992107 88186402 84392641 80872564
14228 80872564 77859711 74454261 71734335 69195287 66839476 64080239 61795499 59635439
14220 59635439 57844959 56114478 53978442 52501404 50856939 49021765 47761554 46417557
14212 46417557 45021404 43477239 41946897 40836975 39751076 39219773 38085476 36752436
14204 36752436 35543306 34767392 33313368 32746987 32361209 30937032 30377181 28994110 28690473
$$ packed form
14258C37476857j5557595j5294362j5297931j3954647j3286231j3394554j2728568
14251B37962969j2128227j1635204j0836011r993367j0095574r080705q582681
14244A65611200p508999p765018p123489p008819o471072n858455n325838m925875
14236A13623635n338689m715568m426599l891007m259665k805705l793761l520077
14228H0872564l012853l405450k719926k539048k355811k759237k284740k160060
14220E9635439j790480j730481k136036j477038j644465j835174j260211j343997
14212D6417557j396153j544165j530342j109922j085899n31303j134297j333040
14204C6752436j209130p75914j454024n66381l85778j424177n59851j383071l03637
$$ plain form
14195 28690473 28466278 27544095 26963680 25993346 25362151 24981226 24049982 24020928 23171973
14186 23171973 22465723 21965690 21689487 21032127 20632999 19996423 20072520 19721645 18987359
14177 18987359 18759480 18408054 17999309 17748548 17283288 16786426 16572810 16318580 16044730
14168 16044730 15327651 15273695 14910447 14831939 14764840 14341106 13851042 13714887 13346896 13086610
14158 13086610 13277417 12646093 12467946 12471903 12266089 12174328 11226641 11482189 11318255 11088397
14148 11088397 10935785 11020184 10820001 10731354 10342342 10301783 9980897 9704930 9730592 9545435
14138 9545435 9606654 9124079 9152078 8863941 8948028 8691261 8503860 8581761 8445856 8107366
14128 8107366 8242829 8030259 7981671 7985747 7932188 7635824 7210605 7128855 7174629 7430003
$$ packed form
14195B8690473k24195r22183n80415r70334o31195l80925r31244k9054q48955
14186B3171973p06250n00033k76203o57360l99128o36576P6097l50875p34286
14177A8987359k27879l51426m08745k50761m65260m96862k13616k54230k73850
14168A6044730p17079n3956l63248p8508o7099m23734m90064j36155l67991k60286
14158A3086610J90807o31324j78147L957k05814r1761r47687K55548j63934k29858
14148A1088397j52612Q4399k00183q8647l89012m0559l20886k75967K5662j85157
14138I545435O1219m82575K7999k88137Q4087k56767j87401P7901j35905l38490
14128H107366J35463k12570m8588M076n3559k96364m25219q1750M5774K55374
$$ plain form
14118 7430003 6984430 7233897 6933176 6765537 6717900 7044301 6471361 6313467 6246292 6517778
14108 6517778 6520676 6367203 6105033 5853704 5840949 5951791 5907016 5669452 5859847 5701316
14098 5701316 5694708 5341448 5493812 5739084 5366107 5268408 4820852 5385908 5121693 4984241
14088 4984241 4904112 5042505 4746652 4945530 4758075 4983742 4450133 4716034 4624082 4570350
14078 4570350 4481316 4479007 4327580 4285906 4264071 4384280 4308060 4172587 3804457 4140618
14068 4140618 4136242 4032955 3969689 3845226 3865045 3345812 3960858 3921700 3877018 4263535
14058 4263535 4139043 3846796 3967765 3759770 3608982 3804230 3712741 3659099 3656757 3613545
14048 3613545 3355186 3514274 3369866 3543252 3101799 3037457 3352425 3141481 2784981 3191048
$$ packed form
14118G430003m45573K49467l00721j67639m7637L26401n72940j57894o7175K71486
14108F517778K898j53473k62170k51329j2755J10842m4775k37564J90395j58531
14098E701316o608l53260J52364K45272l72977r7699m47556N65056k64215j37452
14088D984241q0129J38393k95853J98878j87455K25667n33609K65901r1952n3732
14078D570350q9034k309j51427m1674k1835J20209p6220j35473l68130L36161
14068D140618m376j03287o3266j24463J9819n19233O15046l9158m4682L86517
14058D263535j24492k92247J20969k07995j50788J95248r1489n3642k342m3212
14048C613545k58359J59088j44408J73386m41453o4342L14968k10944l56500M06067
$$ plain form
14038 3191048 3026530 3076666 3259009 2977529 3318368 3164958 3349433 2905532 3089487 2793011
14028 2793011 2684993 2721006 2807023 2866448 2588621 2636184 2681161 2526412 2505450 2396766
14018 2396766 2473265 3077087 2551522 2802900 2375630 2365650 2193680 2242403 2086218 2126723
14008 2126723 2220915 2042330 2305875 2069364 2235170 1987891 2139363 1986083 2068371 1979966
13998 1979966 2039283 2010767 2247445 2262586 2101384 2080750 2176730 2098420 2753892 3281751
13988 3281751 5483241 11039051 28975555 52334440 24270319 11283048 6685600 5230591
13980 5230591 4265278 3209744 3327732 3096247 2715431 2564863 2546786 2807906 2594234
13971 2594234 2489215 2222176 2249412 2422585 2263139 2339830 2037705 2213737 2138210 1969757
$$ packed form
14038C191048j64518N0136J82343k81480L40839j53410J84475m43901J83955k96476
14028B793011j08018L6013Q6017N9425k77827M7563M4977j54749k0962j08684
14018B396766P6499O03822n25565K51378m27270r980j71970M8723j56185M0505
14008B126723R4192j78585K63545k36511J65806k47279J51472j53280Q2288q8405
13998A979966N9317k8516K36678J5141j61202k0634R5980p8310O55472N27859
13988C281751K201490N555810J7936504K3358885B4270319A1283048m597448j455009
13980E230591r65313j055534J17988k31485l80816j50568j8077K61120k13672
13971B594234j05019k67039K7236J73173j59446P6691l02125J76032p5527j68453
$$ plain form
13961 1969757 1899900 1943285 1755110 1700527 1863389 1862753 1911115 1634685 1963008 1937261 1836610
13950 1836610 1562970 1868746 1594026 1635612 1644644 1393005 1475662 1777454 1605166 1595986
13940 1595986 2066281 1852734 1378172 1525092 1470440 1879143 1490537 1710930 1666060 1383588
13930 1383588 1459362 1593431 1447764 1642961 1629755 1514968 1394951 1499288 1403611 1356647
13920 1356647 1394157 1408811 1451087 1306733 1356371 1255051 1298096 1198747 1390019 1235182
13910 1235182 1586453 1159132 1394445 1330581 1397723 1340169 1249531 1190941 1465263 1101877
13900 1101877 1207152 1301963 1274728 1335544 1216514 1173102 1212358 1145820 1280150 1123237
13890 1123237 1193982 1462376 1417096 1422616 1126157 1243744 1128474 1383473 870544 962964
$$ packed form
13961A969757o9857M3385j88175n4583J62862o36M8362k76430L28323k5747j00651
13950A836610k73640L05776k74720M1586R032k51639Q2657L01792j72288r180
13940A595986M70295k13547m74562J46920n4652M08703l88606K20393m4870k82472
13930A383588P5774J34069j45667J95197j3206j14787j20017J04337r5677m6964
13920A356647L7510J4654M2276j44354M9638j01320M3045r9349J91272j54837
13910A235182L51271m27321K35313o3864O7142n7554r0638n8590K74322l63386
13900A101877J05275R4811k7235O0816j19030m3412L9256o6538J34330j56913
13890A123237P0745K68394m5280N520k96459J17587j15270K54999n12929R2420
$$ plain form
13880 962964 1529741 1382804 1275645 656136 1104266 1201690 967640 1001637 1106304 1175035
13870 1175035 1191563 919018 910711 1041927 1145123 926694 1050171 809719 760300 1069692
13860 1069692 1059624 1398379 1326538 1080206 959708 791886 1061992 885134 1018182 965393
13850 965393 790572 896222 1052470 989553 1154085 869702 939024 1017083 750328 912648
13840 912648 898104 1081311 907967 556062 678986 1046448 685403 1028927 925676 834251
13830 834251 1006908 756640 680053 611494 902348 847343 1037943 584593 1203110 914493
13820 914493 972952 835019 871652 669103 1122379 961291 724409 768179 647390 912027
13810 912027 948080 748465 845291 734774 612098 838037 820780 713558 683268 921598
$$ packed form
13880I62964N66777j46937j07159o19509M48130R7424k34050L3997J04667O8731
13870A175035J6528k72545q307J31216J03196k18429J23477k40452m9419L09392
13860A069692j0068L38755p1841k46332j20498j67822K70106j76858J33048n2789
13850I65393j74821J05650J56248o2917J64532k84383O9322P8059k66755J62320
13840I12648j4544J83207j73344l51905J22924L67462l61045L43524j03251r1425
13830H34251J72657k50268p6587o8559K90854n5005J90600m53350O18517k88617
13820I14493N8459j37933L6633k02549M53276j61088k36882M3770j20789K64637
13810I12027L6053j99615R6826j10517j22676K25939j7257j07222l0290K38330
$$ plain form
13800 921598 743897 728174 792059 557257 674927 631560 867861 676074 447426 429966
13790 429966 705207 831099 582019 841408 514548 576096 582040 701745 593159 481665
13780 481665 835890 883107 710394 844632 480336 812616 622150 811454 433909 472486
13770 472486 584056 599402 750869 598666 424185 1014365 664029 575178 932402 783712
13760 783712 512634 547914 645306 714666 498298 557328 458765 425430 526764 659901 815823
13749 815823 560326 210054 525763 497702 519675 392880 643309 896896 483933 513451
13739 513451 527845 850131 597266 380385 834202 490512 893187 604864 429645 353623
13729 353623 596602 913999 821470 564364 655178 445127 297908 405215 762725 717193
$$ packed form
13800I21598j77701j5723O3885k34802J17670m3367K36301j91787k28648j7460
13790D29966K75241J25892k49080K59389l26860O1548N944J19705j08586j11494
13780D81665L54225M7217j72713J34238l64296L32280j90466J89304l77545L8577
13770D72486J11570J5346J51467j52203j74481N90180l50336q8851L57224j48690
13760G83712k71078L5280R7392O9360k16368N9030r8563l3335J01334J33137J55922
13749H15823k55497B10054L15709k8061K1973j26795K50429K53587m12963K9518
13739E13451J4394L22286k52865k16881M53817l43690M02675k88323j75219p6022
13729C53623K42979L17397r2529k57106R0814k10051j47219J07307L57510m5532
$$ plain form
13719 717193 487015 690152 419988 879528 415178 629447 586764 470997 434764 657437
13709 657437 659164 261070 376282 542270 593521 540903 647316 386417 354980 373480 488466
13698 488466 645273 624326 1047685 494054 490787 288471 562788 353687 597180 523282
13688 523282 335318 653347 544649 615352 304754 351545 198901 392671 552871 439643
13678 439643 773103 446251 294858 318851 396890 589348 197556 249429 335661 334041 534976
13667 534976 507645 215185 791262 625174 323041 276399 488116 480079 281187 507233
13657 507233 506759 434762 636197 255048 544763 527886 378492 134593 395027 256000
13647 256000 280852 757184 698463 337358 593986 122546 511501 604738 310717 333252
$$ packed form
13719G17193k30178K03137k70164M59540D15178K14269m2683j15767l6233K22673
13709F57437J727B61070J15212J65988N1251n2618J06413k60899l1437J8500J14986
13698D88466J56807k0947M23359D94054l267k02316K74317k09101K43493p3898
13688E23282j87964L18029j08698P0703C04754M6791j52644J93770J60200j13228
13678D39643L33460l26852j51393K3993P8039J92458A97556N1873Q6232j620K00935
13667E34976k7331B15185N76077j66088l02133m6642K11717q037j98892K26046
13657E07233m74p1997K01435B55048K89715j6877j49394A34593K60434j39027
13647B56000K4852M76332n8721C37358K56628A22546L88955R3237k94021K2535
$$ plain form
13637 333252 413938 404280 472545 555224 748503 398254 324492 504521 456903 237470 647458
13626 647458 494750 531497 407400 359618 451090 392808 374948 237312 178192 475961 471774
13615 471774 667474 129226 694618 561781 421176 240577 85092 210261 278223 620027
13605 620027 469050 543745 333844 226881 232249 394435 382245 319958 168854 194130 280052
13594 280052 295381 578125 284469 46561 25381 292524 425619 306297 248717 312371
13584 312371 224393 362421 323223 -64873 411644 379167 561192 297058 147729 69129
13573 183910 373466 39602 221364 356486 311234 349585 305477 203174 411780 584738
13563 584738 -116268 337140 161841 164481 616223 53703 196042 289718 198882 235523 247634
$$ packed form
13637C33252Q0686r658O8265Q2679J93279l50249p3762J80029m7618k19433M09988
13626F47458j52708L6747j24097m7782R1472n8282j7860j37636n9120K97769m187
13615D71774J95700A29226N65392j32837j40605j80599H5092J25169O7962L41804
13605F20027j50977P4695k09901j06963N368J62186j2190o2287j51104K5276Q5922
13594B80052J5329K82744B84469D6561k1180K67143J33095j19322n7580O3654
13584C12371q7978J38028l9198f4873D11644l2477J82025k64134A47729F9129
13573A83910J89556C9602J81762J35122m5252L8351m4108j02303K08606J72958
13563E84738a16268C37140A61841K640M51742E3703J42339R3676r0836L6641J2111
$$ plain form
13552 247634 548533 20627 379906 375020 263327 178478 231124 254377 140874 268418 257692
13541 257692 289339 71091 -36020 172728 154795 -113240 359302 180954 248618 114531
13530 355821 153866 348740 340358 361406 225650 118725 419958 420825 159367 373590 330382
13519 330382 243098 356418 231948 375271 273259 424313 228532 316639 406635 -72965
13508 374223 325073 93369 321469 136937 -147674 97069 -66194 293306 89120 365626
13498 365626 434438 -102008 198303 305189 507966 347483 284539 236194 -307005 333215
13487 575312 35044 82906 353936 214129 -63116 77867 97859 100850 391009 407829 328606
13476 328606 317924 244733 306078 237205 48891 103502 284342 316625 514022 46758 178038
$$ packed form
13552B47634L00899B0627L59279m886j11693q4849N2646K3253j13503J27544j0726
13541B57692L1647G1091c6020A72728j7933a13240C59302j78348O7664A14531
13530C55821A53866J94874q382K1048j35756j06925L01233Q67A59367K14223m3208
13519C30382q7284J13320j24470J43323j02012J51054j95781Q8107Q9996g2965
13508C74223m9150I3369K28100A36937a47674I7069f6194B93306H9120K76506
13498C65626O8812a02008A98303J06886K02777j60483o2944m8345c07005C33215
13487E75312C5044M7862K71030j39807f3116G7867J9992K991K90159J6820p9223
13476C28606j0682p3191O1345o8873D8891N4611J80840L2283J97397D6758J31280
$$ plain form
13465 178038 393085 42323 242147 335098 309944 210806 450730 -19216 413762 -17741 115624
13453 627618 340300 174768 356803 155477 204881 83377 215247 234385 400594 170550
13442 274257 187969 268411 244546 391904 -116470 53174 358152 192546 631533 52658
13431 75774 227684 115294 133680 394496 -38720 241513 276011 170491 353177 133919
13420 394736 294823 -127070 199959 283427 522617 36336 193694 86900 111366 364562
13410 364562 282611 538808 176118 269782 87772 188187 94862 -90246 -154674 -47814 311839
13398 163791 42791 247134 192021 133982 87713 267953 280739 203522 343609 185205 224915
13387 224915 164592 75159 15545 308507 198870 -237325 202656 9328 221186 208143 57476
$$ packed form
13465A78038K15047D2323J99824R2951k5154r9138K39924a9216D13762a7741A15624
13453F27618k87318j65532J82035A55477M9404H3377J31870J9138J66209A70550
13442B74257q6288Q0442k3865J47358a16470E3174L04978j65606M38987E2658
13431G5774J51910j12390J8386K60816c8720B41513L4498j05520J82686A33919
13420C94736r9913a27070A99959Q3468K39190C6336J57358H6900K4466K53196
13410C64562q1951K56197A76118R3664H7772J00415r3325i0246o4428d7814C11839
13398A63791D2791K04343n5113n8039m6269J80240J2786p7217J40087j58404L9710
13387B24915o0323G5159A5545K92962j09637b37325B02656I328K11858j3043E7476
$$ plain form
13375 464160 27127 315753 99368 188135 295491 478471 318978 -166660 213832 584937
13365 584937 312025 168009 374533 79678 -38012 192887 -23610 372158 396692 223206
13355 223206 58727 352200 300208 10909 348772 -38216 145105 297262 -29702 192784
13344 231526 516760 -4991 143005 145418 96229 312937 415631 28199 281184 407081 33969
13332 427852 -19823 321148 284156 48370 147137 125684 185879 209237 537686 186349 -64169
13320 -17957 223025 -111874 354576 1189 192833 211662 306108 409570 349702 549147 461551
13309 461551 147437 12851 76921 114863 509599 11286 87678 166403 338427 3284 220812
13298 220812 350142 221913 147957 176551 333475 -287036 406229 203880 264627 245064
$$ packed form
13375D64160B7127K88626I9368Q8767J07356J82980j59493a66660B13832L71105
13365E84937k72912j44016K06524G9678c8012A92887b3610C72158K4534j73486
13355B23206E8727K93473n1992A0909L37863c8216A45105J52157b9702A92784
13344B31526K85234d991A43005K413m9189K16708J02694B8199K52985J25897C3969
13332D27852a9823C21148l6992D8370R8767k1453O0195K3358L28449A86349f4169
13320a7957B23025a11874C54576A189J91644J8829R4446J03462n9868J99445q7596
13309D61551A47437A2851O4070L7942L94736A1286P6392P8725J72024C284K17528
13298B20812J29330j28229p3956K8594J56924b87036D06229k02349O0747j9563
$$ plain form
13288 245064 410028 181620 288292 230725 14205 -57908 -102601 239030 197834 -50560 -99881
13277 -99881 33494 138630 306898 312725 18660 99044 372647 -125654 108711 216345 224640
13266 224640 272801 349463 -169379 -266136 11436 -2861 34429 21594 -394041 14497 263092
13255 263092 196671 -35948 209537 389506 150446 100055 83850 -18400 179845 -99480 170766
13243 -117621 267218 170433 -34702 92526 87403 -87707 59534 -167282 -109708 -26550 376153
13231 196620 46738 142334 361357 279702 363 158413 440096 -225438 205423 -261234 -101974
13219 215771 198800 -90010 161797 498747 89247 -9788 -17002 374615 -171283 68313 305742
13208 305742 220541 150645 128128 132587 219925 94181 198709 347255 -295396 -82008 169786
$$ packed form
13288B45064J64964A81620J06672n7567A4205e7908m4693B39030m1196e0560m9321
13277i9881C3494J05136J68268N827A8660Q0384K73603a25654A08711J07634Q295
13266B24640M8161P6662a69379r6757A1436b861C4429j2835c94041A4497K48595
13255B63092o6421c5948B09537J79969A50446n0391j6205a8400A79845i9480A70766
13243a17621B67218r6785c4702I2526n123h7707E9534a67282N7574b6550C76153
13231A96620D6738R5596K19023q1655C63J58050K81683b25438B05423b61234a01974
13219B15771j6971i0010A61797L36950H9247i788p214C74615a71283F8313K37429
13208C05742q5201o9896k2517M459Q7338I4181J04528J48546b95396h2008A69786
$$ plain form
13196 454358 18065 153304 111205 98655 171415 -100440 361325 114145 17784 -112515
13185 -2311 -120277 92080 177828 173592 69297 -115426 31921 206987 176099 440949 177117
13173 63437 181301 71654 224523 180594 157692 -169132 216240 233741 119293 -115621
13162 -126038 128677 105044 90340 -74202 234010 226548 45491 63146 100510 401881 101723
13150 52466 49702 -16427 -142353 -26088 86906 218195 268868 -109122 149014 -19211 74695
13138 68915 10379 -20096 209294 214688 -15160 35884 366730 9911 213756 -164168 46751
13126 65405 245405 11125 -106844 165818 5797 41323 -155225 168488 330443 -113184
13115 27292 -14589 140983 161637 -463 -104190 35179 82616 -181593 234769 200726 -250676
$$ packed form
13196D54358A8065J35239m2099j2550P2760a00440C61325A14145A7784a12515
13185b311j17966I2080Q5748m236F9297a15426C1921J75066l0888K64850A77117
13173F3437J17864G1654J52869m3929k2902a69132B16240J7501j14448a15621
13162a26038A28677k3633j4704g4202B34010p462D5491J7655L7364L01371A01723
13150E2466k764a6427j25926b6088H6906J31289N0673a09122A49014a9211G4695
13138F8915A0379b0096B09294N394a5160C5884L30846I911K03845a64168D6751
13126F5405J80000A1125a06844A65818E797L5526a55225A68488J61955a13184
13115B7292a4589A40983K0654d63j03727C5179M7437a81593B34769l4043b50676
$$ plain form
13103 190147 -24973 -231902 121519 -164368 16440 408719 24054 110013 143562 111010 492094
13092 492094 -359255 -133640 101071 169559 -163989 164401 198561 9809 -97864 -145510 -166147
13081 -166147 -16351 68874 9724 -8012 195079 208498 113189 -143312 -18235 -88947 309205
13069 131804 305771 157827 21527 15860 501704 258728 253669 154343 419255 8086 213185
13058 213185 -204065 298985 -20458 434524 162212 172381 155450 -131006 -200124 22786
13047 -236197 -72382 -238153 -78875 76379 83957 128448 118635 1717 4812 4430 -138228 101536
13034 -150195 -224817 51958 -25825 13519 208483 331374 78695 231326 193303 -255585 434465
13022 101759 169801 257519 -185773 197068 -58647 247092 95980 156978 196889 -181078 79638
$$ packed form
13103A90147b4973k06929A21519a64368A6440L92279B4054Q5959L3549l2552L81084
13092D92094c59255a33640A01071O8488a63989A64401L4160I809i7864m7646k0637
13081a66147a6351F8874I724h012A95079J3419r5309a43312a8235p0712C09205
13069A31804J73967j47944B1527n667M85844k42976n059r9326K64912H086K05099
13058B13185b04065B98985b0458D34524A62212J0169j6931a31006o9118B2786
13047b36197g2382j65771g8875G6379P578M4491r813A717L095l82a38228A01536
13034a50195p4622E1958b5825A3519J94964J22891G8695J52631l8023b55585D34465
13022A01759O8042Q7718a85773A97068e8647B47092I5980O0998L9911a81078G9638
$$ plain form
13010 144641 141745 -220893 76780 29036 -121460 -149611 196584 18584 -80903 250219 656
12998 263270 2078 49331 81230 107299 204717 -38089 -19199 -229725 80008 111650 252518
12987 252518 145364 122995 -219737 147135 41850 -107572 -117391 -21289 131678 66757 123047
12976 123047 44004 -17545 36021 89255 -173353 292735 165952 -89395 205457 -176532
12965 262872 -148849 105839 527151 -7930 195698 -52703 163284 -19538 42529 123996 136365
12954 136365 -40542 89276 144331 338117 156983 141433 1972 166228 159282 65369 83931
12943 83931 174725 97481 86763 176364 204198 148264 -52989 -13299 -99999 330982 -253482
12931 192843 -284479 147064 334337 -124827 -130368 137006 69608 19631 242301 -161228
$$ packed form
13010A44641k896b20893G6780B9036a21460k8151A96584A8584h0903B50219F56
12998B63270B078M7253L1899K6069R7418c8089J8890k10526H0008L1642J40868
12987B52518j07154k2369b19737A47135D1850a07572r819b1289A31678o4921N6290
12976A23047D4004a7545C6021N3234a73353B92735j26783h9395B05457a76532
12965B62872a48849A05839M21312g930A95698e2703A63284a9538D2529Q1467J2369
12954A36365d0542H9276N5055J93786A56983j5550A972J64256o946F5369J8562
12943H3931R0794p7244j0718Q9601K7834n5934e2989a3299q6700C30982b53482
12931A92843b84479A47064J87273a24827n541A37006o7398A9631K22670a61228
$$ plain form
12920 265583 84371 114929 -131182 -30492 212832 -241825 354163 60604 -174538 -21636
12909 116670 -52269 -55182 -3075 223798 39230 86436 -57064 444264 25953 20325 472063
12898 472063 -120266 22892 -337589 98387 81489 -40307 -98048 -64567 -261229 -125239 112736
12886 -85686 270912 376121 57477 219921 -110946 36416 -54322 109769 -5243 214115 227217
12875 227217 95816 -81096 28077 -133438 118579 -69617 96327 89133 -44059 -69438 5259
12863 162381 -157471 28408 -75458 -25273 -25675 271636 -138071 -108600 26970 -162578 -71875
12851 170579 18803 78122 360954 -292474 152763 -166888 -166844 164525 -107680 -39145 35846
12839 63222 230912 231848 -3543 -96777 137863 240042 155684 -36638 -273377 -198745 -23607
$$ packed form
12920B65583H4371L0558a31182c0492B12832b41825C54163F0604a74538b1636
12909A16670e2269k913c075B23798C9230M7206e7064D44264B5953n628M51738
12898D72063a20266B2892c37589I8387j6898d0307n7741L3481j96662a25239A12736
12886h5686B70912J05209E7477J62444a10946C6416e4322A09769e243B14115J3102
12875B27217I5816h1096B8077a33438A18579f9617I6327p194d4059k5379E259
12863A62381a57471B8408g5458b5273m02B71636a38071K9471B6970a62578g1875
12851A70579A8803N9319K82832b92474A52763a66888M4A64525a07680c9145C5846
12839F3222J67690R36c543r3234A37863J02179q4358c6638k36739P4632b3607
$$ plain form
12827 238222 -104588 -247492 -112000 -211256 161739 107822 -33368 346849 -122569 167744
12816 204485 -39809 84542 -165478 -449300 234027 -110129 -64709 201484 103784 87614
12806 87614 -81560 -179088 -13667 -62121 152963 -29823 82957 157767 1469 158020 -14267
12794 -242102 154732 148359 18471 133866 -58458 198889 -156058 56597 255534 132179
12784 132179 -482 -64175 126067 -92723 -257210 12821 52143 24604 -52683 -432784 -114598
12772 44664 -280379 224420 -120820 114349 160965 53219 165051 -170168 -236640 -5717 -364901
12761 -364901 59174 307610 -92160 31960 -181082 123602 -208223 94254 -95025 -88564 -137727
12750 -137727 -36663 -19063 -204377 -187861 85929 -57360 -96634 207206 -117792 193745 -385581
$$ packed form
12827B38222a04588j42904a12000r9256A61739n3917c3368C46849a22569A67744
12816B04485c9809H4542a65478k83822B34027a10129M5420B01484r7700j6170
12806H7614h1560r7528a3667m8454A52963b9823H2957P4810A469J56551a4267
12794b42102A54732o373A8471J15395e8458A98889a56058E6597J98937j23355
12784A32179d82o3693A26067i2723j64487A2821L9322B4604e2683l80101a14598
12772D4664b80379B24420a20820A14349M6616E3219J11832a70168o6472e717l59184
12761c64901E9174K48436i2160C1960a81082A23602b08223I4254i5025O461m9163
12750a37727c6663J7600j85314J6516H5929e7360l9274B07206a17792A93745c85581
$$ plain form
12738 356209 86655 142617 -126286 155022 337217 114982 70430 -73165 164029 -185738
12727 -77152 -1914 -48962 -38406 68261 -261837 108525 -50807 81141 -158241 123650 -96728
12715 -40185 32058 220520 469188 177905 401541 297912 645999 307256 -46933 305958
12704 227017 241933 283821 316919 30151 116566 -122614 -82082 -125134 240118 -208055 159825
12692 124783 -59618 83669 384012 237950 378245 -47282 89518 25611 -173351 94927 -99772
12680 158210 78006 30802 120721 -7741 156318 249415 18649 -290436 -112887 44919 -78647
12668 -228006 292878 59342 297596 75088 -133928 -9272 -187675 -20739 257526 139623
12658 139623 130154 -381013 181185 -34614 291613 6223 156973 188635 418057 -74891 -179572
$$ packed form
12738C56209H6655N5962a26286A55022J82195A14982m4552g3165A64029a85738
12727g7152a914m7048J0556F8261b61837A08525e0807H1141a58241A23650i6728
12715d0185C2058J88462K48668A77905K23636j03629L48087C07256d6933C05958
12704B27017J4916M1888L3098C0151Q6415a22614M0532m3052B40118b08055A59825
12692A24783e9618H3669L00343j46062J40295d7282H9518B5611a73351I4927i9772
12680A58210G8006C0802Q9919g741A56318R3097A8649b90436a12887D4919g8647
12668b28006B92878E9342K38254G5088a33928i272j78403b0739B57526j17903
12658A39623r469c81013A81185c4614B91613F223J50750L1662K29422g4891j04681
$$ plain form
12647 -179572 136980 41897 -3641 57257 218269 101122 80471 181312 81627 71567 310058
12636 310058 -385496 213703 80240 182726 13478 19410 81084 414317 501170 212259 579609
12625 579609 -18857 7060 245972 174530 199589 352714 59740 407542 -161640 196132 34217
12613 57411 -50822 124101 -4597 109412 62315 -309549 136065 248835 259670 -298621 -423070
12602 -423070 310002 315542 169060 -103680 82256 173365 -180506 -27020 73270 98939 133650
12591 133650 64051 -79098 -126588 228824 -84244 140594 -4964 252186 -21515 -89720 22721
12579 -179390 -18892 368379 90568 113777 -68983 168090 -20081 258660 -38197 -363724 339184
12567 215687 158508 16187 139762 -66288 -47666 -220764 -95503 361865 115716 171682 -136507
$$ packed form
12647a79572A36980D1897c641E7257J61012A01122k0651J00841H1627j0060K38491
12636C10058c85496B13703H0240J02486A3478N932O1674L33233Q6853B12259L67350
12625E79609a8857G060K38912p1442K5059J53125E9740L47802a61640A96132C4217
12613E7411e0822A24101d597A09412m7097c09549A36065J12770J0835b98621j24449
12602d23070C10002N540j46482a03680H2256R1109a80506b7020G3270K5669L4711
12591A33650F4051g9098m7490B28824h4244A40594d964B52186b1515o8205B2721
12579a79390a8892C68379I0568K3209f8983A68090b0081B58660c8197l25527C39184
12567B15687n7179A6187J23575f6288J8622j73098i5503C61865A15716N5966a36507
$$ plain form
12555 17611 267300 329378 -39979 -178346 -120129 -85947 -214473 102986 -235822 230127
12544 -67726 85389 -474012 127102 40211 -32796 147800 53460 97288 172885 -148257 126742
12532 289241 242218 -68360 -13421 -213271 378944 115815 121621 106491 -169602 43145 86576
12521 86576 187798 -232988 337027 23370 -5717 18376 177404 -167644 131283 -279177
12510 -54935 -242197 297091 -168133 70484 -26170 -99551 -29085 155351 23291 241001 -196324
12498 -77872 -54464 157192 -189050 -81328 236339 -38534 -317026 -242347 26011 -83303 -151570
12487 -151570 331 123338 -65233 -7286 -50004 -55353 31104 232044 -46849 73170 -144117 92172
12474 -191725 -146128 -182771 29450 190063 49810 23064 -113569 -342878 -361833 -219482 9813
$$ packed form
12555A7611K49689O2078c9979j38367N8217L4182j28526A02986b35822B30127
12544f7726H5389d74012A27102D0211c2796A47800E3460M3828P5597a48257A26742
12532B89241m7023f8360a3421j99850C78944A15815N806j5130a69602D3145M3431
12521H6576J01222b32988C37027B3370e717A8376J59028a67644A31283b79177
12510e4935j87262B97091a68133G0484b6170p3381b9085A55351B3291K17710a96324
12498g7872K3408A57192a89050h1328B36339c8534k78492P4679B6011h3303o8267
12487a51570C31J23007f5233g286m2718n349C1104K00940d6849G3170a44117I2172
12474a91725M5597l6643B9450J60613D9810B3064a13569k29309j8955J42351I813
$$ plain form
12462 -120970 110990 -160493 -89172 48662 140429 -100222 169009 -2365 182644 -127351
12451 -79156 15892 175638 273266 55773 88116 -185291 -108770 486573 143991 -100629 3960
12439 -106319 337822 272122 -266489 98911 70855 -63744 -19442 176731 -123952 258700
12428 -92813 -85319 191026 -243251 -362674 -52875 -68199 -28270 120618 -297324 24804 15002
12417 15002 -40407 -89187 216363 158947 112183 -304222 -227648 -203446 -23201 59954 -279830
12405 -144724 -89327 8356 -19313 -156704 25687 47795 149627 100694 24196 -515691 -24911
12393 230013 -216096 262663 162623 -59006 -34413 -70168 -34361 -44885 318252 1426 363811
12382 363811 146133 334363 27484 -92516 -227097 -120515 129193 69634 56827 65194 293430
$$ packed form
12462a20970A10990a60493P1321D8662R1767a00222A69009b365A82644a27351
12451g9156A5892J59746R7628E5773L2343a85291P6521D86573A43991a00629C960
12439a06319C37822o5700b66489I8911k8056f3744a9442A76731a23952B58700
12428i2813P494A91026b43251j19423e2875j5324b8270A20618b97324B4804r802
12417A5002d0407m8780B16363n7416m6764c04222P6574K4202b3201E9954b79830
12405a44724N5397H356a9313j37391B5687K2108J01832m8933B4196e15691b4911
12393B30013b16096B62663j00040e9006K4593l5755c4361j0524C18252A426L62385
12382C63811A46133J88230B7484i2516j34581J06582A29193n9559j2807Q367K28236
$$ plain form
12371 293430 8181 89680 105131 -42762 177521 68997 34842 -164877 -120946 176641 -32984
12359 -63806 -100495 149769 292348 81296 72742 -18963 79139 -71624 -120977 154293 73050
12347 129899 239193 238653 202862 42842 240601 178728 85862 94757 76434 -74788 -109711 -15307
12334 8254 171288 49285 224682 89240 17130 -38640 -110249 39452 28181 30579 29181 -76318
12321 6451 -277620 76652 170049 -185373 108294 104464 -37908 -159842 198995 267617 212955
12310 212955 133676 180037 156195 22552 -67699 -364151 -294975 -285008 194487 -135988 132158
12298 -133497 122808 -64939 111454 -105896 299308 121274 165262 97066 218743 -43805
12287 181796 301975 -227319 115831 49438 37506 24102 -135321 -86409 79670 148779 292959
$$ packed form
12371B93430H181Q1499J5451d2762A77521F8997l4155a64877M3931A76641c2984
12359f3806l6689A49769J42579H1296q554a8963G9139g1624m9353A54293G3050
12347A29899J09294n40l5791D2842J97759o1873H5862Q895j8323g4788l4923a5307
12334H254J63034D9285J75397H9240A7130c8640p1609C9452j1271K398j398g6318
12321F451b77620G6652R3397a85373A08294l830c7908j21934A98995O8622n4662
12310B12955p9279M6361k3842B2552f7699k96452O9176R967A94487a35988A32158
12298a33497A22808f4939A11454a05896B99308A21274M3988o8196J21677d3805
12287A81796J20179b27319A15831D9438j1932j3404a35321M8912G9670O9109J44180
$$ plain form
12276 292959 -141399 198732 159880 55632 54657 -101280 17174 -92573 149900 -21426 338868
12264 19564 102792 109626 376900 -75705 -237976 -280144 -63441 -171715 27479 242045 154019
12253 154019 -86921 -21936 -67307 -76891 359489 27985 204124 376442 195310 -213956 187847
12241 246732 174572 -143181 -64222 61831 -210921 263535 95164 132632 103547 183320 -5542
12229 90334 231579 139338 144861 211483 30532 281367 292880 -17306 118767 520548 38966
12217 -113010 181045 57956 -41491 -27562 181037 133559 119791 211609 226216 258606 127030
12205 510836 111696 163873 448668 386643 293475 -18304 218577 304681 87764 176460 133919
12194 133919 467135 36303 -152410 180159 30480 -28227 218411 257267 45553 -223640
$$ packed form
12276B92959a41399A98732l8852E5632r75a01280A7174i2573A49900b1426C38868
12264A9564Q3228O834K67274g5705j62271m2168f3441j08274B7479K14566q8026
12253A54019h6921b1936m5371r584C59489B7985J76139J72318j81132b13956A87847
12241B46732p2160a43181f4222F1831b10921B63535I5164L7468k9085P9773e542
12229I0334J41245r2241N523O6622C0532K50835J1513a7306A18767M01781C8966
12217a13010A81045E7956d1491J3929A81037m7478j3768R1818J4607L2390A27030
12205E10836A11696N2177K84795o2025r3168a8304B18577Q6104H7764Q8696m2541
12194A33919L33216C6303a52410A80159C0480b8227B18411L8856D5553b23640
$$ plain form
12183 -30671 -117427 -114768 -116685 43949 -17556 380952 64024 316804 35334 138830 49211
12171 -2732 -122128 -78818 172924 51537 392037 165140 154253 125455 -43226 190690 99211
12160 99211 -123027 -77957 115406 -50345 -78498 332024 -198176 -183894 -1693 4817 324817
12149 324817 356240 172224 122942 -114382 45752 139548 45694 40667 25484 155394 4743
12137 -110796 -52795 79220 42036 126301 -97493 162913 -161483 221548 274213 236445 200209
12126 200209 -190998 71127 11467 119644 109018 -17240 206693 43657 139368 70006 119401
12115 119401 19186 -99497 -34165 -133338 89744 45952 31932 82645 -49513 77772 -65937
12103 72199 128475 -209412 -76479 50088 23279 128675 180672 279704 214528 -166037 -135540
$$ packed form
12183c0671q6756K659j917D3949a7556C80952F4024K52780C5334J03496D9211
12171b732j19396M3310A72924E1537L40500A65140j0887k8798d3226A90690r1479
12160I9211a23027M5070A15406e0345k8153C32024a98176J4282a693D817L20000
12149C24817L1423A72224m9282a14382D5752R3796D5694n027j5183J29910D743
12137a10796e2795G9220l7184Q4265i7493A62913a61483B21548N2665l7768l6236
12126B00209a90998G1127A1467J08177j0626a7240B06693D3657R5711o9362M9395
12115A19401A9186i9497c4165r9173H9744m3792j4020N0713d9513G7772f5937
12103G2199N6276b09412g6479E0088B3279J05396N1997R9032o5176a66037L0497
$$ plain form
12092 -135540 195546 -307600 -101797 -75645 -221470 137831 -77877 -42706 210130 142838
12082 142838 1480008 2749647 1032242 407969 73320 -19890 -216568 17337 -70437 -138285
12072 -138285 133194 -71655 -231644 136908 15358 -195495 54645 -286553 -111984 8756
12061 77721 2436 240099 119653 -6280 130801 29250 -54607 30516 -212854 -66579 192785
12049 49138 265398 182462 -218820 87225 -63773 25135 -91913 301719 94536 221433 -118235
12037 95277 76377 -324565 -117654 162702 -177641 71932 112817 12275 -35959 154820 -385751
12025 22031 -170652 -376372 -150 55511 -217201 413865 138779 -146332 -37930 4568 -82872
12013 -165401 -47566 -137385 250363 -114916 -160480 -676 -43984 198906 188468 -28826 30132
$$ packed form
12092a35540A95546c07600a01797K6152j45825A37831g7877L5171B10130o7292
12082A42838J337170J269639A032242D07969G3320a9890j96678A7337g0437o7848
12072a38285A33194g1655j59989A36908A5358a95495E4645b86553a11984H756
12061G7721B436K37663A19653f280A30801B9250e4607C0516b12854f6579A92785
12049D9138K16260q2936b18820H7225f3773B5135i1913C01719I4536J26897a18235
12037I5277j8900c24565a17654A62702a77641G1932M0885A2275c5959A54820c85751
12025B2031a70652k05720a50E5511b17201D13865A38779a46332c7930D568h2872
12013a65401d7566q9819B50363a14916m5564f76m3308A98906j0438b8826C0132
$$ plain form
12001 22980 -100626 85125 -175992 44026 -12995 -155667 -235455 -18312 -27943 -282888 37246
11989 -357222 -199021 278194 -250166 47271 -44206 128063 7975 -8476 -177106 54937 92988
11978 92988 263445 88515 48007 -48437 173279 251837 307540 -110682 96051 72825 20334
11966 -117706 69054 -76207 305481 42054 -297842 -253195 -55680 105187 -32953 -43795 173331
11954 158194 -127741 -224201 11201 -5035 -36844 151329 267833 -86346 -9766 -49509 1230
11942 72862 28075 -254720 95882 74235 -159261 -122263 63824 -90951 175697 273790 -258776
11930 -183770 -237467 85908 123081 -183712 13440 -74148 -123174 -41364 59743 -27140 19857
11918 -16486 -41351 121051 -119331 -176508 -246611 -77216 -175047 -23356 -69196 -118903 -220346
$$ packed form
12001B2980a00626H5125a75992D4026a2995j42672p9788a8312r631k54945C7246
11989c57222J58201B78194b50166D7271d4206A28063G975h476j68630E4937L8051
11978I2988J70457H8515m0508d8437A73279P8558N5703a10682I6051k3226B0334
11966a17706F9054g6207C05481D2054b97842M4647e5680A05187c2953j0842A73331
11954A58194a27741r6460A1201e035l1809A51329J16504h6346i766l9743A230
11942G2862B8075b54720I5882k1647a59261L6998F3824i0951A75697R8093b58776
11930a83770n3697H5908L7173a83712A3440g4148m9026d1364E9743b7140A9857
11918a6486k4865A21051a19331n7177p0103g7216r7831b3356m5840m9707j01443
$$ plain form
11907 -220346 -169346 -171624 325525 56022 -361460 -61419 -6271 -18730 122781 151008 211221
11896 211221 30700 -20624 -39390 -86477 17578 -69926 -17598 37514 86802 12781 -389458
11884 -54773 63272 -54055 -102805 -281826 -147696 4252 -42809 -30042 484741 -134700 -173577
11873 -173577 125956 -25364 106098 -142293 -204507 -175975 176391 9230 -65485 -330755 228919
11861 140060 94505 -57286 197430 -85048 -20727 194101 68428 228609 183013 -446183 110184
11849 -11344 -120667 -116947 -27902 139935 74084 98669 -265877 146467 -75752 -152803 374545
11837 -99164 27361 -314539 246473 263083 -17600 175954 -143892 -127955 -198557 -235664 103615
11825 96237 -123730 -64768 30570 56082 -1187 212736 -261579 3457 -95211 149313 -105524
$$ packed form
11907b20346N1000k278C25525E6022c61460f1419f271j2459A22781K8227O0213
11896B11221C0700b0624j8766m7087A7578f9926a7598C7514M9288A2781c89458
11884e4773F3272e4055m8750j79021J34130D252d2809J2767D84741a34700l8877
11873a73577A25956b5364A06098a42293o2214K8532A76391I230f5485k65270B28919
11861A40060m5555e7286A97430h5048b0727A94101F8428J60181m5596d46183A10184
11849a1344j09323L720b7902A39935o5851K4585b65877A46467g5752p7051C74545
11837i9164B7361c14539B46473J6610a7600A75954a43892J5937p0602l7107A03615
11825I6237a23730N8962C0570K5512a187B12736b61579C457i5211A49313a05524
$$ plain form
11813 -19318 140507 171706 -196012 -382077 -80569 14432 175467 -61660 -168235 -188215 42270
11801 73229 -116242 -214607 -296703 -74226 25248 -217169 -28909 119338 170900 51539 -247041
11789 -321695 -9347 235009 249106 -241591 362750 101881 167213 -43568 -341320 -95472 -44473
11777 11755 140853 -114313 -142857 -30393 270455 -20777 -71761 306034 -46232 -201284 6407
11765 51931 -93476 -241462 157775 12678 123103 -112063 -116635 -200415 -168569 60271 208528
11754 208528 -32429 213786 141571 13586 73381 -126093 -25867 -275313 -49935 -335653 133266
11742 327878 93759 9389 115978 35412 88662 -46059 -131116 -137629 -211815 9454 38708 281988
11730 281988 92756 -319606 332779 -29347 1031 -33845 -23028 176473 -126978 -185606 97436
$$ packed form
11813a9318A40507L1199a96012j86065h0569A4432J61035f1660j06575j9980D2270
11801G3229a16242r8365q2096g4226B5248b17169b8909A19338N1562E1539b47041
11789c21695i347B35009J4097b41591C62750A01881O5332d3568k97752i5472d4473
11777A1755J29098a14313k8544c0393B70455b0777n0984C06034d6232j55052F407
11765E1931i3476j47986A57775A2678J10425a12063m572q3780L1846F0271J48257
11754B08528c2429B13786p2215A3586N9795a26093b5867k49446d9935k85718A33266
11742C27878I3759I389J06589C5412N3250d6059q5057o513p4186I454K9254K43280
11730B81988I2756c19606C32779b9347A031c3845J0817A76473a26978n8628I7436
$$ plain form
11718 -29861 340576 226534 125238 -43324 178707 92068 87901 -12155 -97416 -169119 16990
11706 -141765 5213 12993 -63789 -35306 -1056 -105522 -35936 78790 -19556 -312827 200822
11694 -37811 185038 -72374 69793 106155 73210 19326 -124875 -30573 43527 -20464 5153
11682 -14430 -27664 334618 -113634 81344 -269936 -34418 145612 153069 166214 25552 -243290
11670 -72039 7171 57997 38636 138308 266310 -13355 -208900 -149910 -203938 -106858 122021
11658 71624 -175544 165288 225217 120207 -11187 97362 138085 124425 -361208 -131910 67387
11646 -239542 -133369 199083 330170 111295 -84819 -229326 255871 243711 -49405 -111454
11636 -111454 80834 117876 -149278 -173694 -91091 140121 -42745 21105 393794 166322 58692
$$ packed form
11718b9861C40576j14042j01296d3324A78707q6639m167a2155q5261p1703A6990
11706a41765E213P780f3789K8483a056j04466c5936G8790a9556k93271B00822
11694c7811A85038g2374F9793L6362l2945A9326a24875c0573D3527b0464E153
11682a4430j3234C34618a13634H1344b69936c4418A45612P457J3145B5552b43290
11670g2039G171N0826j9361R9672J28002a3355j95545N8990n4028R7080A22021
11658G1624a75544A65288N9929j05010a1187I7362M0723j3660c61208a31910F7387
11646b39542J06173A99083J31087A11295h4819j44507B55871j2160d9405o2049
11636a11454H0834L7042a49278k4416Q2603A40121d2745B1105L72689A66322E8692
$$ plain form
11624 99543 121999 -85079 -162302 -100340 -39738 238123 -172213 -266803 172749 36095 120285
11613 120285 -191141 386583 -178439 90391 -287350 136577 -5607 22145 129228 -143621
11602 44263 165509 110658 48515 218157 134264 216369 282371 148861 74882 451835 32698
11590 -261982 165324 406701 -86388 -67897 67818 -80644 409093 105613 291025 -50819
11579 56533 -39012 152806 -36494 14888 206759 200509 229937 106861 39086 182230 51632
11567 81488 -109716 175740 -36264 63227 -96692 -252159 229937 86122 -193499 -131301 -70439
11556 -70439 177723 -171920 144223 -224296 -2079 86136 163416 98348 96804 -128524 -1640
11544 126226 -124355 -66212 27506 -11094 96532 351416 166679 58713 101602 175408 12216
$$ packed form
11624I9543K2456h5079p7223O1962c9738B38123a72213r4590A72749C6095Q4190
11613A20285a91141C86583a78439I0391b87350A36577e607B2145J07083a43621
11602D4263J21246n4851D8515J69642q3893Q2105O6002j33510p3979L76953C2698
11590b61982A65324K41377h6388J8491F7818h0644D09093A05613J85412e0819
11579E6533c9012A52806c6494A4888J91871o250K9428A06861C9086J43144E1632
11567H1488a09716A75740c6264F3227i6692j55467B29937H6122a93499O2198O0862
11556g0439A77723a71920A44223b24296b079H6136P7280o5068j544a28524a640
11544A26226a24355N8143B7506a1094I6532K54884A66679E8713M2889P3806A2216
$$ plain form
11532 -37516 67064 52285 168724 -134178 285357 149841 365904 115487 -225971 178403
11521 162873 88563 168275 -29283 -412718 -173069 101644 377092 44092 128509 105116 -14100
11509 299807 27274 192576 -36568 -73841 313931 58300 49617 280056 302750 256632 -171187
11497 118870 255973 223931 183557 293836 266296 -108083 1889 18004 127320 -22392 -156066
11486 -156066 111347 99964 315567 -6545 -23667 109940 451504 14356 256506 514664
11476 514664 219009 -68257 -132621 -192214 199757 179167 68278 146557 131168 162548 50229
11464 150246 410806 239087 112002 89943 -204889 64691 80447 14000 191837 146642
11454 146642 144720 -101216 -10625 291372 296811 113767 -5744 -386675 18741 -30123 161971
$$ packed form
11532c7516F7064j4779J16439a34178B85357j35516K16063A15487b25971A78403
11521A62873p4310P9712b9283l83435a73069A01644K75448D4092Q4417k3393a4100
11509B99807B7274J65302c6568l7273C13931E8300q683K30439K2694m6118a71187
11497A18870J37103l2042m0374J10279k7540a08083A889J6115J09316b2392j33674
11486a56066A11347j1383K15603f545j7122A09940L41564A4356K42150K58158
11476E14664B19009f8257o4364n9593A99757k0590F8278P8279j5389L1380E0229
11464A50246K60560j71719A12002k2059b04889F4691J5756A4000J77837m5195
11454A46642j922a01216a0625B91372N439A13767e744l80931A8741c0123A61971
$$ plain form
11442 230930 9618 40351 3063 116832 21053 -214301 41360 -125167 329334 -387242 105229
11430 -116256 125105 -143949 271418 -68785 52737 30118 228947 230683 -96738 109384 -49787
11418 37418 282967 -399 230497 -119051 256613 -79796 125124 -103867 -70954 -158899 -68066
11406 -181519 -21311 158183 -325331 92429 73807 15237 152325 67435 -165794 244047
11395 52867 78788 33340 144957 79380 -120673 -209737 315184 149744 88511 77392 -794
11383 182460 -203485 -238132 -95722 242910 -225515 -20158 -167663 130650 -52802 -217881
11373 -217881 88742 53913 -103046 331483 197219 -309522 -252459 58761 -129132 -330951
11363 -330951 -131259 36306 130051 -144129 -224916 -208 -97495 -52034 -27843 20258 70293
$$ packed form
11442B30930I618L0733C063J13769B1053b14301D1360a25167C29334c87242A05229
11430a16256A25105a43949B71418f8785E2737k2619J98829J736i6738A09384d9787
11418C7418K45549c99B30497a19051B56613g9796A25124a03867L2913q7945f8066
11406a81519b1311A58183c25331I2429j8622A5237J37088F7435a65794B44047
11395E2867K5921C3340J11617o5577a20673q9064C15184A49744o1233j1119g94
11383A82460b03485l4647i5722B42910b25515b0158j47505A30650e2802j65079
11373b17881H8742l4829a03046C31483j34264c09522N7063E8761a29132k01819
11363c30951a31259C6306R3745a44129q0787b08r7287M5461K4191B0258N0035
$$ plain form
11352 70293 54195 43416 8911 192384 -140426 -336975 -26133 83432 -457255 -191760 60844
11340 -208266 3403 275097 -217006 176200 143168 -144109 -410839 151779 229981 52223
11329 -416759 -338232 202532 9938 -18905 203885 -189828 -27682 65472 -47448 171959 132994
11318 132994 27826 -115190 56384 97714 -87520 -80506 130030 91680 85871 89915 -62114 -51599
11306 -51599 -162942 -43815 -200978 188024 112258 -130242 -63998 -354687 163450 170210 -93885
11294 -135996 -86213 -131193 132561 -338956 -34743 -240184 -205998 17902 -103912 166456
11283 -35301 -25501 -179380 96281 -344191 -351981 -68492 47662 -274685 220689 -18172 -195108
11272 -195108 7454 -1273 -256859 -126692 -96510 181062 -125043 77130 244695 -65084 151153
$$ packed form
11352G0293j6098j0779H911J83473a40426j96549b6133H3432d57255a91760F0844
11340b08266C403K71694b17006A76200l3032a44109k66730A51779P8202E2223
11329d16759P8527B02532I938a8905B03885a89828b7682F5472d7448A71959l8965
11318A32994B7826a15190E6384M1330h7520P014A30030l8350n809M044f2114J0515
11306e1599j11343d3815j57163A88024p5766a30242f3998k90689A63450O760i3885
11294a35996M9783m4980A32561c38956c4743k05441L4186A7902a03912A66456
11283c5301R800j53879I6281c44191p790f8492D7662b74685B20689a8172j76936
11272a95108G454a273k55586a26692L0182A81062a25043G7130J67565f5084A51153
$$ plain form
11260 457757 -127910 -330306 27649 110821 33362 -213144 -109286 115293 3741 -368774
11249 -182804 32599 46195 51996 110187 -28732 -80038 -20240 44635 272234 57431 -169217
11237 -124786 147422 -38026 295581 121907 -425241 -57771 -387793 231118 -28385 -70022
11227 -70022 -111538 67413 119399 387219 16123 107526 -274951 -235758 -28281 37919 -295376
11215 -164356 -69096 196719 122434 19649 -100414 -44315 -22098 -1876 -115273 -68493 154392
11203 -161170 -157009 -115650 141420 32145 -185120 -122490 12847 -61638 -54220 12153 -178264
11191 -125989 -40067 391547 -331738 131720 -190490 51925 -91565 27085 72910 -53491 138749
11179 19780 141819 70976 185302 307431 -231761 -204034 -112103 78228 65791 -108198 186509
$$ packed form
11260D57757a27910k02396B7649Q3172C3362b13144J03858A15293C741c68774
11249a82804C2599J3596N801N8191b8732n1306b0240D4635K27599E7431a69217
11237a24786A47422c8026B95581A21907d25241e7771l30022B31118b8385m1637
11227g0022m1516F7413N1986K67820A6123R1403b74951L9193b8281C7919b95376
11215a64356f9096A96719p4285A9649a00414d4315b2098a876j13397M6780A54392
11203a61170M161M1359A41420C2145a85120O2630A2847f1638P418A2153a78264
11191a25989d0067C91547c31738A31720a90490E1925i1565B7085M5825e3491A38749
11179A9780J22039p0843J14326J22129b31761K7727R1931G8228j2437a08198A86509
$$ plain form
11167 -143917 87173 85383 77109 -136005 101921 -110906 179335 -25192 151849 20208 309916
11156 309916 -89959 -302726 8751 192594 -12536 10863 -185448 109869 -116468 38912 -82778
11144 135390 -10387 -213619 -186093 -123070 85064 292611 -125092 -24824 -22397 -214897 -63365
11132 271000 181592 9859 107879 -37281 -127556 83589 96674 -156752 -110569 -425077 -136115
11120 -216608 313771 115318 -68913 -414 44443 -27544 88877 30909 198485 266411 -197069
11108 -119447 333166 282251 -155401 -78798 19833 326974 135073 312686 345279 285237
11098 285237 137557 153857 -43990 28192 -10787 183914 -84146 7042 -121782 -43171 -121134
11087 -121134 320987 123702 156361 15744 79372 -46405 323886 -19282 324408 62022 256636
$$ packed form
11167a43917H7173j790q274a36005A01921a10906A79335b5192A51849B0208K89708
11156C09916h9959k12767H751J83843a2536A0863a85448A09869a16468C8912h2778
11144A35390a0387k03232K7526O3023H5064K07547a25092b4824K427j92500f3365
11132B71000q9408I859R8020c7281r0275H3589J3085a56752M6183l14508a36115
11120b16608C13771A15318f8913d14D4443b7544H8877C0909J67576O7926a97069
11108a19447C33166n0915a55401P6603A9833L07141A35073J77613L2593o0042
11098B85237A37557J6300d3990B8192a0787A83914h4146G042a21782d3171p7963
11087a21134C20987A23702L2659A5744O3628d6405C23886a9282C24408F2022J94614
$$ plain form
11076 256636 59663 77996 28327 208929 106346 246532 109911 155741 126563 245708
11066 245708 209604 376089 292063 246471 457464 190054 413107 447119 449422 621737 359751
11055 359751 581621 267159 578403 593181 499429 549904 538654 563756 663185 523488 952291
11044 952291 576537 397081 498036 625234 737755 664699 715061 475509 646574 728331
11034 728331 674235 442580 440317 603920 395081 495284 1060808 569543 788016 622216
11024 622216 404242 531604 502275 448982 431562 433502 445756 330255 399379 608304 639008
11013 639008 494441 722545 414626 255813 769795 532493 502404 656174 202413 633784
11003 633784 341331 828876 572547 186423 477210 630942 743583 549717 351031 644716
$$ packed form
11076B56636E9663J8333B8327J80602j02583J40186A09911M5830k9178J19145
11066B45708l6104J66485q4026m5592K10993A90054K23053L4012K303J72315k61986
11055C59751K21870B67159L11244J4778r3752N0475j1250K5102R9429j39697M28803
11044I52291l75754j79456J00955J27198J12521p3056N0362k39552J71065Q1757
11034G28331n4096k31655k263J63603k08839J00203N65524m91265K18473j65800
11024F22216k17974J27362k9329n3293j7420J940J2254j15501O9124K08925L0704
11013F39008j44567K28104l07919j58813N13982k37302l0089J53770B02413M31371
11003F33784k92453M87545k56329A86423K90787J53732J12641j93866j98686K93685
$$ plain form
10993 644716 407869 655408 902343 660890 638797 659599 728525 611927 706961 653613
10983 653613 526169 652563 798387 1130690 900044 1399196 1368981 1458741 1163284 1845627
10973 1845627 1837635 2061583 1772713 2311453 2284174 2250883 2360444 2060869 1985523 1787542
10963 1787542 1495829 1514450 1230336 1740718 1444300 1794999 1543517 1543642 1916953 1030907
10953 1030907 1527823 1385092 1408334 1201506 705247 707293 556094 673769 359935 263712
10943 263712 525395 57973 148601 75435 250495 -111167 -89472 248369 202023 16146 216203
10932 216203 149964 210807 -63894 -183705 268692 46835 -21404 30161 -66910 -90729 157474
10920 136937 144746 -211469 414183 -39073 -28456 -112443 281343 245556 415753 1476 249436
$$ packed form
10993F44716k36847K47539K46935k41453k2093K0802O8926j16598R5034n3348
10983F53613j27444J26394J45824L32303k30646M99152l0215Q9760k95457O82343
10973A845627p992K23948k88870N38740k7279l3291J09561k99575p5346j97981
10963A787542k91713J8621k84114N10382k96418L50699k51482J25L73311q86046
10953A030907M96916j42731K3242k06828m96259K046j51199J17675l13834r6223
10943B63712K61683E7973R0628p3166J75060a11167K1695B48369m6346A6146K00057
10932B16203o6239O0843f3894j19811B68692D6835b1404C0161f6910k3819A57474
10920A36937P809b11469D14183c9073J0617q3987B81343l5787J70197A476K47960
$$ plain form
10909 249436 250897 -90617 66361 145902 -113689 -157875 196667 -62285 -177690 -1951 -177037
10898 -177037 -95421 -152523 -32710 64648 109287 -63796 -70294 -398930 -136222 -378492 -202931
10887 -202931 -38588 340212 -198407 367947 36571 -157472 -96983 -411855 -76578 88043
10876 -172010 146050 -27254 -133575 -57011 175114 -114994 194234 -274286 -170057 -16027
10865 228621 251411 142784 96683 122080 288096 20877 -218319 -17591 111250 -244640
10854 79501 2937 169386 187229 345867 -1776 15025 157121 -30217 -395899 -50530 10514
10842 135642 -242174 -273500 290081 160766 41590 -40862 -138807 -118032 13198 34772 -269435
10830 96502 -81084 -337126 -448460 108070 -264365 -327636 159221 -210141 93294 -106433
$$ packed form
10909B49436J461i0617F6361P9541a13689m4186A96667f2285j15405a951j75086
10898a77037Q1616n7102c2710F4648M4639f3796o498l28636a36222k42270J75561
10887b02931c8588C40212a98407C67947C6571a57472O0489l14872g6578H8043
10876a72010A46050b7254j06321e7011A75114a14994A94234b74286J04229a6027
10865B28621K2790j08627m6101K5397J66016B0877b18319a7591A11250b44640
10854G9501B937J66449J7843J58638a776A5025J42096c0217l65682e0530A0514
10842A35642b42174l1326B90081j29315D1590d0862r7945K0775A3198K1574b69435
10830I6502h1084k56042j11334A08070b64365o3271A59221b10141I3294a06433
$$ plain form
10819 -291019 -287883 14670 259678 175237 205527 -84695 -53470 224980 82381 132541 -196779
10807 -42364 44332 -121913 87536 -112121 -193107 34153 93070 -7786 160661 131470 41869
10795 179532 -222561 -143400 -290046 -103467 83319 -155699 -116108 -116628 -208392 164061 -23750
10783 69270 -21458 -126749 105646 -129609 148914 -143445 -72926 23795 119233 -170634
10772 -52007 122217 286974 54874 -231572 204425 25108 126217 -160441 -349160 120927
10761 221132 14442 -73109 -94431 -251321 -206989 106399 274066 -242185 -159262 -255478 39241
10749 -144994 -210446 153175 -147895 -255745 -186677 40749 25537 276908 -160783 -189350
10739 -189350 -134177 142415 120172 -5461 241816 97177 42908 -63120 130855 244545 170284
$$ packed form
10819b91019L136A4670K45008q4441L0290h4695L1225B24980H2381N0160a96779
10807d2364D4332a21913H7536a12121q0986C4153N8917g786A60661k9191D1869
10795A79532b22561P9161j46646a03467H3319a55699L9591n20r1764A64061b3750
10783F9270b1458j05291A05646a29609A48914a43445P0519B3795R5438a70634
10772e2007A22217J64757E4874b31572B04425B5108J01109a60441j88719A20927
10761B21132A4442g3109k1322j56890M4332A06399J67667b42185Q2923r6216C9241
10749a44994o5452A53175a47895j07850O9068D0749j5212K51371a60783k8567
10739a89350N5173A42415k2243e461B41816I7177D2908f3120A30855J13690p4261
$$ plain form
10728 170284 -270888 -154648 204166 -200827 -56416 -250025 -178922 478863 -175185 -340125
10718 -340125 -102128 -80020 -443742 -365166 -36333 -121152 110806 265132 -53122 -108720 -15702
10706 51102 -49664 129289 138558 -4700 73221 24170 -51609 -270631 -66575 138003 247659
10695 247659 -78050 -195846 34028 -15209 -6708 -152006 -258029 38782 173136 -117007 -71028
10684 -71028 229096 -92200 30010 -360086 -136262 88997 -113646 57176 188326 -40334 -217010
10673 -217010 20570 -153160 -169389 64519 253426 -16206 65916 33028 -143984 3459 38156
10662 38156 168083 -179937 -116116 -20231 -2579 84436 40522 -155336 -96088 -93395 -151545
10651 -151545 -237846 -78633 -100145 -42506 -70018 -127365 -9288 -46889 40574 191785 232278
$$ packed form
10728A70284b70888J16240B04166b00827e6416j93609P1103D78863a75185j64940
10718c40125a02128K2108l63722P8576c6333q4819A10806J54326e3122n5598a5702
10706E1102d9664A29289R269d700G3221B4170e1609k19022f6575A38003J09656
10695B47659g8050j17796C4028a5209f708j45298j06023C8782J34354a17007M5979
10684g1028B29096i2200C0010c60086a36262H8997a13646E7176J31150d0334j76676
10673b17010B0570a53160j6229F4519J88907a6206F5916l2888a43984C459L4697
10662C8156J29927a79937O3821b0231b579H4436D0522a55336N9248K693n8150
10651a51545q6301g8633k1512d2506k7512n7347i288l7601D0574J51211M0493
$$ plain form
10640 232278 103603 7878 163905 -5447 18902 -257063 2391 -170187 47084 44681 -11187
10628 -92403 -299692 -23273 344140 71947 106675 -183252 -165966 -46761 -259494 -343082 62787
10616 -218122 -50667 -106658 106587 -69485 -19351 -214914 205054 -132976 -42284 -379469
10606 -379469 414045 75616 21807 -325087 -313301 -44160 121552 66314 70813 -47321 -32928
10595 -32928 -49737 48144 32584 -188721 54139 -244685 -97094 -21776 80903 144196 5478
10583 -152519 -15342 50900 -238244 108535 -117391 -97515 -158908 -51736 158299 -176648
10572 -11382 -29387 -174645 -95354 73052 -362594 -116217 77468 5839 3707 -310697 1548
10560 -194516 16133 -321026 -248201 33507 -357129 183129 -31373 129263 -21420 -464439
$$ packed form
10640B32278A03603G878J56027e447A8902b57063B391a70187D7084k403a1187
10628i2403k07289b3273C44140G1947L4728a83252J7286d6761k12733q3588F2787
10616b18122e0667n5991A06587f9485a9351j95563B05054a32976d2284l37185
10606c79469D14045G5616B1807c25087J1786d4160A21552n5238M499d7321J4393
10595c2928j6809D8144j5560a88721E4139b44685i7094b1776H0903O3293E478
10583a52519a5342E0900b38244A08535a17391J9876o1393e1736A58299a76648
10572a1382j8005j45258P9291G3052c62594a16217G7468E839k132c10697A548
10560a94516A6133c21026P2825C3507c57129A83129c1373A29263b1420m43019
$$ plain form
10550 -464439 -24067 -268912 253673 -69188 -67427 -34372 -101796 -13140 -498417 139696 78400
10539 78400 50259 276885 61056 84692 -37040 -189173 10811 27922 33672 -106044 -26125
10527 149508 159128 297228 16845 -492367 -86982 24822 -103430 -155370 159635 4756 -229404
10515 -159625 -202457 -3187 -133367 -108983 -77365 -53074 64285 -254855 -292002 2323 -107473
10503 110174 15083 175252 -249947 197192 -52455 130438 -373844 -154368 -30866 108275
10492 -6390 330471 55719 -29999 -68196 -159688 -114582 289125 48137 47330 -112757 -25412 479355
10479 207568 218255 477555 638877 406951 380305 277669 176233 308127 -36893 35527
10468 -1373 212986 105336 -105245 -20348 6528 76679 232928 212095 -58057 87719 -87956
$$ packed form
10550d64439b4067k44845B53673f9188J761L3055o7424a3140m85277A39696o1296
10539G8400k8141K26626F1056K3636c7040j52133A0811J7111N750a06044b6125
10527A49508R620J38100A6845d92367h6982B4822a03430n1940A59635D756b29404
10515a59625m2832c187j30180K4384L1618K4291F4285b54855l7147B323a07473
10503A10174A5083J60169b49947A97192e2455A30438c73844a54368c0866A08275
10492f390C30471E5719b9999l8197r1492M5106B89125D8137q07a12757b5412D79355
10479B07568J0687K59300J61322k31926k6646j02636j01436J31894c6893C5527
10468a373B12986A05336a05245b0348F528P0151J56249k0833e8057H7719h7956
$$ plain form
10456 78854 79351 146405 -82131 131809 -31069 -107439 -150243 -3381 -189835 -479212 359219
10444 -199518 -245506 -42066 -185463 56013 -146402 19787 -173710 205649 -121826 -299735
10434 -299735 113687 -237749 321957 309364 -40345 -80481 -7374 -174891 63409 -101377 -118233
10423 -118233 82375 63738 93927 292085 -67313 -62830 -10189 173746 75320 126289 26652
10411 -76167 86363 -295775 102200 -110096 -153552 -107096 -43654 48606 32573 -45260 109409
10399 198694 256667 -19084 -42350 25486 -100202 -60242 99718 -45182 -118213 27702 -60346
10387 33089 -35128 146438 152702 -193180 -119676 194869 20146 34988 -195064 306587 299295
10376 299295 482014 81314 374230 203306 105102 247220 40231 162810 64042 296776
$$ packed form
10456G8854M97O7054h2131A31809c1069p6370m2804c381j86454k89377C59219
10444a99518m5988d2066j43397E6013a46402A9787a73710B05649a21826j77909
10434b99735A13687b37749C21957j2593d0345m0136g374j67517F3409a01377j6856
10423a18233H2375j8637L0189J98158f7313M483a0189A73746G5320N0969B6652
10411g6167H6363b95775A02200a10096m3456M6456d3654D8606j6033d5260A09409
10399A98694N7973a9084k3266B5486a00202L9960I9718d5182p3031B7702f0346
10387C3089c5128A46438O264a93180P3504A94869B0146J4842a95064C06587p292
10376B99295J82719H1314K92916j70924r8204J42118D0231J22579F4042K32734
$$ plain form
10366 296776 305290 258371 410445 -84587 153797 233484 289884 49843 390037 182935 43629
10354 -14251 97962 227568 116866 84296 317607 317535 490756 474914 448531 7157 206214
10343 206214 142107 101276 342615 279652 400221 82661 388787 -26111 126515 214646 250543
10332 250543 28654 -69008 69501 65737 116140 152377 121132 64878 107902 206585 47496 291473
10320 291473 -82373 63688 345157 491175 184156 89474 90379 28223 -141792 132412 208960
10309 208960 164874 -8920 55001 39305 -14437 -82811 -154747 -116253 101825 215400 99935
10297 94956 -318637 84275 -82249 -50175 130916 15298 -305172 410 64642 98844 52 -315449
10284 177632 -261510 -86714 -58524 -496921 15832 149711 -360806 -9720 -168552 74367 4930
$$ packed form
10366B96776Q514m6919J52074h4587A53797P9687N6400D9843L40194A82935D3629
10354a4251I7962J29606j10702l2570K33311p2J73221j5842k6383G157J99057
10343B06214o4107m0831K41339o2963J20569H2661L06126b6111A26515Q8131L5897
10332B50543B8654f9008F9501l764N0403L6237l1245n6254M3024R8683D7496K43977
10320B91473h2373F3688K81469J46018A84156H9474R05B8223a41792A32412P6548
10309B08960m4086h920E5001j5696a4437o8374p1936L8494A01825J13575I9935
10297I4956c18637H4275h2249L2074A30916A5298c05172D10O4232L4202E2c15449
10284A77632b61510h6714K8190m38397A5832J33879c60806i720j58832G4367D930
$$ plain form
10272 262925 -20543 -159138 -147666 191981 82172 202782 -3155 -269630 88494 -6108 49948
10260 361 -71231 44649 406548 374100 231342 253659 319745 53417 255465 -4198 75465 -191407
10247 343172 -25274 251589 22242 119340 -157417 128999 -97707 17981 -161264 -154610 -141686
10236 -141686 -27516 157290 96157 -23299 -211404 268854 -20269 426869 114698 -237279
10225 -62186 204964 -212287 -255641 8702 6307 -39257 -42167 -161268 193450 139057 -167926
10213 -234696 -36517 119540 -193121 -60266 -290384 -125598 99923 -456519 -71758 -15045
10202 100757 81218 84341 -11034 -227922 -135720 -234477 311406 -480830 113108 -308473 134196
10190 -18174 -213310 72582 -136593 -207909 -112547 232 46242 -61340 -153217 72113 -4496 73398
$$ packed form
10272B62925b0543j38595J1472A91981H2172J20610c155k66475H8494f108D9948
10260C61g1231D4649L61899l2448j42758K2317O6086E3417K02048d198G5465a91407
10247C43172b5274B51589B2242R7098a57417A28999i7707A7981a61264O654J2924
10236a41686b7516A57290o1133b3299j88105B68854b0269D26869A14698b37279
10225f2186B04964b12287m3354H702k395c9257k910j19101A93450n4393a67926
10213b34696c6517A19540a93121f0266k30118a25598I9923d56519g1758a5045
10202A00757j9539L123a1034k16888R2202r8757C11406d80830A13108c08473A34196
10190a8174j95136G2582a36593p1316R5362B32M6010f1340r1877G2113d496G3398
$$ plain form
10177 -175186 -116093 -112042 -234397 -177003 -63980 89557 -83296 40128 183255 124714 -99650
10165 -148190 222187 -267678 -27569 189049 -77000 -146090 -2373 -32051 -247469 144540 -160217
10153 168468 -118329 -85873 -91887 -81916 -33373 4962 240534 140987 -487113 -325276 -22058
10141 -186849 -207948 71357 82056 215 -26951 -305646 -10436 -76809 -100714 80380 83773 -80074
10128 -288668 -19452 -243035 53954 -94146 -40513 -525026 -110088 201585 85401 75502 65847
10117 65847 -327824 2215 312542 47676 -189571 -910 91965 -185427 198090 -116125 -216724
10106 -216724 -377757 356727 42519 1474 200600 -169682 -406638 -232336 -136560 -163073
10096 -163073 -143541 -387732 -38765 -114127 -155539 -288291 80897 -163592 70043 -193774 -225546
$$ packed form
10177a75186N9093M051j22355N7394f3980H9557h3296D0128J43127n8541i9650
10165a48190B22187b67678b7569A89049g7000o9090b373k9678k15418A44540a60217
10153A68468a18329L2456o014R971c3373D962K35572r9547d87113J61837b2058
10141a86849k1099G1357J0699B15b6951k78695a0436o6373k3905H0380L393h0074
10128b88668a9452k23583E3954i4146d0513m84513a10088B01585H5401r899r655
10117F5847c27824B215L10327D7676a89571i10I1965a85427A98090a16125j00599
10106b16724j61033C56727D2519A474J99126a69682k36956J74302R5776k6513
10096a63073J9532k44191c8765p5362m1412j32752H0897a63592G0043a93774l1772
$$ plain form
10085 -225546 -193747 -187125 -190508 -353677 227180 199932 35504 -133551 278172 -12921 -23884
10074 -23884 34264 50438 -95581 49947 -43354 -29525 -188513 -229434 -10196 59538 49853 -20024
10061 -60530 -32816 44283 19891 -73334 -162566 -160891 290081 -221181 373568 -228941 -369069
10050 -369069 -311722 -197606 -255419 -369239 -22143 -168012 -119747 -98123 -241973 -114463
10039 206324 7926 -394879 -184287 -89867 -31491 175696 58230 257928 54384 82943 351387
10028 351387 -6715 -100285 -16988 146959 -468177 -178463 27531 71354 -397258 -27650 -20266
10017 -20266 362411 159907 145550 92937 92475 -7013 -225194 99165 -135441 -143091 -170445 -13984
10004 -29029 56902 -32519 75186 59227 -161870 -213959 56021 88570 -83006 -124891 -41132
$$ packed form
10085b25546L1799O622l383j63169B27180k7248C5504a33551B78172a2921j0963
10074b3884C4264J6174i5581D9947d3354J3829j58988m0921a0196E9538r685b0024
10061f0530K7714D4283A9891g3334q9232J675B90081b21181C73568b28941j40128
10050c69069N7347J14116n7813j13820b2143j45869M8265K1624j43850a14463
10039B06324G926c94879a84287h9867c1491A75696E8230J99698E4384K8559K68444
10028C51387f715r3570a6988A46959d68177a78463B7531M3823c97258b7650P384
10017b0266C62411A59907j4357n2613m62g013k18181I9165a35441p650k7354a3984
10004b9029E6902c2519G5186j5959a61870n2089E6021L2549h3006m1885d1132
$$ plain form
9992 -166097 -246308 294463 -74446 50719 -78051 99483 66645 258788 9830 259802 -85198
9980 -55868 -144351 -196888 181937 -119547 527253 -370679 -190546 -92484 217678 -244101
9969 -40391 -293717 193739 25324 -327962 -203403 -128767 -159680 233624 117537 112631 -57714
9957 -277512 51183 -80183 -45062 -166851 -14461 -211675 -108518 -59683 -568547 -264781 -133231
9946 -133231 12544 -133528 109690 -88940 -39877 51843 317236 219797 -68811 -57276 19050
9934 72064 -267329 -416583 -1997 -123351 -187834 -155321 86270 -167391 -26694 -247713 -158060
9923 -158060 -65762 -2203 -291463 -19515 -257965 66146 44012 -265365 -117877 -232502 29009
9911 -185910 -226957 78075 111903 -55924 -210270 196666 -63274 115440 -244307 -144244 -191587
$$ packed form
9992a66097q0211B94463g4446E0719g8051I9483l2838J92143I830K49972h5198
9980e5868q8483n2537A81937a19547E27253c70679J80133i2484B17678b44101
9969d0391k53326A93739B5324c27962J24559P4636l0913B33624j16087m906e7714
9957b77512E1183h0183L5121j21789a4461j97214J03157M8835n08864b64781J31550
9946a33231A2544a33528A09690h8940c9877E1843K65393r7439f8811J1535A9050
9934G2064b67329j49254a997j21354o4483L2513H6270a67391b6694k21019Q9653
9923a58060f5762b203k89260a9515k38450F6146k2134b65365a17877j14625B9009
9911a85910m1047G8075L3828e5924j54346A96666f3274A15440b44307J00063m7343
$$ plain form
9900 -191587 291527 134014 -38858 -82591 71523 214689 -101925 -15193 -213091 -161702 172738
9888 -242367 98296 -227959 -210403 -242211 -107099 -69487 241087 -65942 -59311 119739 -180496
9876 -16399 -373045 -63661 -326927 305073 -517004 46749 -226057 201379 -230690 63086
9865 -60324 -119689 -280052 368735 25674 114004 -261065 -51049 114283 -225949 -81956 -139966
9854 -139966 -35059 14776 -273684 -158754 -298147 85188 -222902 24634 60220 -595110 37989
9842 12183 62835 -42787 -60486 42073 58792 -210554 -301547 3675 -165209 102022 216319
9831 216319 -202419 -156120 -95236 -12108 69723 43470 -276349 -221195 82133 -94053 -153879
9820 -153879 -187295 124092 -41800 -78234 -441 -19167 42039 9787 -17228 126367 -161156 -51265
$$ packed form
9900a91587B91527A34014c8858m3733G1523J43166a01925a5193j97898N1389A72738
9888b42367I8296b27959J7556l1808a07099L7612B41087f5942O631A19739a80496
9876a6399l56646f3661k63266C05073e17004D6749b26057B01379b30690F3086
9865f0324n9365j60363C68735B5674Q8330b61065e1049A14283b25949h1956n8010
9854a39966c5059A4776b73684J14930j39393H5188b22902B4634L5586e95110C7989
9842A2183N0652d2787j7699D2073J6719b10554r0993C675a65209A02022J14297
9831B16319b02419M6299O0884a2108F9723k6253b76349N5154H2133i4053n9826
9820a53879l3416A24092d1800l6434d41j8726D2039I787a7228A26367a61156e1265
$$ plain form
9807 15677 -115613 11089 -255405 -165497 -84239 -99645 -61117 -74224 318888 -7551 -27290
9796 -27290 -78984 -257761 -53937 -62574 239642 79640 228463 97195 -295906 -399159 -5741
9784 -84104 98221 32882 96823 -36061 -298621 -171273 134082 -23650 57593 306795 -137175
9772 -226054 -21857 -136117 -239311 -101234 220518 -156313 135523 -98438 7286 -16743 -82912
9761 -82912 145034 91541 -365528 -211274 -243173 17436 106828 -414251 -13915 -189137 4225
9749 -294532 56748 244531 48053 -43476 3868 -8436 -210501 -188118 -67490 -118942 -214763 -165971
9737 -165971 14581 -135377 -27968 -96563 -91254 -228840 5308 201495 -60917 -457324 -61317
9725 -40237 -148353 -349440 218997 -218955 -242117 -101036 101753 -83609 -147550 -178987 85751
$$ packed form
9807A5677a15613A1089b55405Q9908Q1258j5406L8528j3107C18888g551j9739
9796b7290n1694j78777e3937q637B39642G9640J48823I7195b95906j03253e741
9784h4104I8221C2882O3941c6061k62560J27348A34082b3650E7593K49202a37175
9772b26054b1857j14260j03194a01234B20518a56313A35523i8438G286a6743o6169
9761h2912A45034n3493c65528J54254l1899A7436Q9392d14251a3915j75222D225
9749b94532E6748J87783D8053d3476C868h436k02065K2383f7490n1452r5821M8792
9737a65971A4581a35377b7968o8595N309j37586E308J96187f0917l96407f1317
9725d0237j08116k01087B18997b18955k3162a01036A01753h3609o3941l1437H5751
$$ plain form
9713 52661 -128189 46245 -16369 -30922 72825 100498 113766 184672 -182293 -429182 -134623
9701 -492827 62502 40588 -5498 -312003 435967 -275180 75163 -67151 -93203 -145717 -55122
9689 237821 21754 -270357 -54805 -73296 -194444 -135827 -25804 -113329 -66424 -83126 -267296
9678 -267296 -256483 -95648 -18238 -353838 -490277 -71804 25752 -88711 10821 33765 256673
9667 256673 72704 -31063 -229334 31256 211753 -332748 -245501 332491 78073 -57461 -126083
9656 -126083 17564 -169683 105629 -550116 -184685 -439839 -105475 52442 10761 -175613
9645 12881 -281219 -137345 -51495 -139298 58970 -299199 -123273 -41798 -318848 -186497 -641265
9634 -641265 -126966 -112537 -271662 -33034 -26675 12820 96629 36290 -225059 -266434 -117454
$$ packed form
9713E2661a28189D6245a6369j4553G2825K7673J3268P0906a82293k46889a34623
9701d92827F2502k1914e498l06505D35967b75180G5163f7151k6052n2514e5122
9689B37821B1754b70357e4805j8491j21148N8617b5804q7525M6905j6702j84170
9678b67296J0813i5648a8238l35600j36439g1804B5752h8711A0821K2944K22908
9667B56673G2704c1063j98271C1256J80497c32748Q7247C32491G8073e7461o8622
9656a26083A7564a69683A05629e50116a84685k55154a05475E2442A0761a75613
9645A2881b81219a37345e1495q7803E8970b99199a23273d1798k77050J32351m54768
9634f41265a26966J4429j59125c3034O359A2820Q3809C6290b25059m1375a17454
$$ plain form
9622 -258992 305205 -548618 -84898 -85029 -136469 -274444 -61642 -100509 -241321 -1293 -251022
9611 -251022 -498642 -202284 -280129 -340487 -153701 223086 -133627 -197736 -266446 -27761 343265
9599 30771 -85721 -266455 -118303 78163 -163483 157670 -210391 -72064 -20033 119966 -255106
9587 -54516 14297 -290529 81541 100912 80287 -58512 64506 73474 -71839 -207620 -243240 31022
9574 -352188 -64406 -22608 -42552 -156679 -94421 -160474 315091 -273914 178836 -207458 -11394
9562 65178 -410877 -153041 39564 18509 229821 -306369 -76116 170584 48833 -96363 -126647
9551 -126647 402741 -267620 89897 -159286 87423 -256795 9263 -153311 34662 -98442 -192878
9540 -192878 -366445 28624 -490301 108607 -126992 -205008 -171083 260860 -170026 20283
$$ packed form
9622b58992C05205e48618h4898j31n1440j37975f1642l8867j40812a293k49729
9611b51022k47620b02284p7845o0358a53701B23086a33627o4109o8710b7761C43265
9599C0771h5721j80734a18303G8163a63483A57670b10391g2064b0033A19966b55106
9587e4516A4297b90529H1541J9371k0625e8512F4506Q968g1839j35781l5620C1022
9574c52188f4406b2608j9944j14127O2258o6053C15091b73914A78836b07458a1394
9562F5178d10877a53041C9564A8509K11312c06369g6116A70584D8833i6363l0284
9551a26647D02741b67620H9897a59286H7423b56795I263a53311C4662i8442r4436
9540a92878j73567B8624d90301A08607a26992p8016L3925B60860a70026B0283
$$ plain form
9529 -197647 -14378 -22926 172835 33671 59089 69298 195630 53179 -105796 -19835 48793
9517 -83895 116276 225823 -7140 -192193 -179727 17354 -536568 90927 -57046 320928 -251317
9505 185396 15030 -197274 110244 95253 114999 -259204 46817 7930 -12076 80243 -301137
9493 83637 -366487 178893 57633 -72633 27633 -95346 -241641 348941 98587 -96395 -39512
9481 -31064 447585 -169530 -288997 314677 234559 -173509 35783 -71257 -176752 -143367 35865
9469 271215 -28129 108315 -107226 -28406 63667 -88992 82193 -54715 104037 -3755 -110730
9458 -110730 -174897 289135 -15927 -188387 82737 -5822 40932 -113868 -22339 23775 41776
9447 41776 18197 -27813 109974 11093 -151859 -85267 -326878 -42555 -333193 -249523 -37606
$$ packed form
9529a97647a4378q548A72835C3671K5418J0209J26332E3179a05796a9835D8793
9517h3895A16276J09547g140j85053J2466A7354e36568I0927e7046C20928b51317
9505A85396A5030a97274A10244j4991J9746b59204D6817G930a2076H0243c01137
9493H3637c66487A78893E7633g2633B7633i5346j46295C48941I8587i6395c9512
9481c1064D47585a69530j19467C14677q0118a73509C5783g1257j05495L3385C5865
9469B71215b8129A08315a07226b8406F3667h8992H2193e4715A04037c755j06975
9458a10730o4167B89135a5927j72460H2737e822D0932a13868b2339B3775J8001
9447D1776A8197b7813A09974A1093a51859O6592k41611d2555k90638Q3670c7606
$$ plain form
9435 -143744 -11506 90919 -265526 -73704 -186899 -229622 -194422 47483 -273769 -3139 -129126
9424 -129126 -257865 -81586 -86174 -61674 -98907 -18538 -9664 83486 -130266 -266265 133212
9412 -88650 -201842 -81208 -166871 15729 169185 106015 -91670 13330 -234826 11534 -142107
9400 106171 -244122 7576 -42498 -149477 -176987 61304 -126269 -214561 -165620 123088 102956
9389 102956 130159 -94445 -90407 -287614 -195360 74337 -142190 -96939 69838 -8383 25811 -213166
9376 -14363 -121698 -19087 234675 -147747 96067 100705 -165547 -90867 -86220 -273440 -278309
9365 -278309 60110 -115237 -239407 -102496 16682 -197295 -185134 205589 518 -29174 160557
9353 -89188 -204089 -135547 233835 98709 -156517 -220320 -249466 -211208 -232519 -113150 -151679
$$ packed form
9435a43744a1506I0919b65526g3704j13195m2723L5200D7483b73769c139j25987
9424a29126j28739h1586m588K4500l7233a8538Q874H3486a30266j35999A33212
9412h8650j13192h1208q5663A5729J53456o3170i1670A3330b34826A1534a42107
9400A06171b44122G576d2498j06979k7510F1304a26269q8292M8941A23088k0132
9389A02956K7203i4445M038j97207R2254G4337a42190M5251F9838h383B5811b13166
9376a4363j07335a9087B34675a47747I6067M638a65547P4680M647j87220m869
9365b78309F0110a15237j24170a02496A6682a97295J2161B05589E18b9174A60557
9353h9188j14901O8542B33835I8709a56517o3803k9146L8258k1311a13150l8529
$$ plain form
9342 -151679 54111 56458 -279844 -196076 -305161 -131169 151518 -8042 -2772 -8976 -409985
9331 -409985 -48263 252387 -80986 -168333 112999 57325 -198834 31306 -131170 -70272 196302
9319 -130031 -52573 -124770 -112049 -172846 81099 16 192315 -286148 27470 73779 -44392 -322361
9307 -322361 -226531 -30214 -10596 -231732 -182052 -130571 14433 -88372 88417 -9072 174772
9295 25235 -294495 -204245 -131495 -398565 -46521 -65554 -195936 46973 159696 -460709 55223
9283 217959 -325281 -98073 -267086 -85816 169832 -201930 -289638 51373 -54519 116109 66795
9272 66795 -235521 -127571 110374 256773 -170976 -46284 -222638 -118067 183562 216487
9262 216487 -236971 -178279 -99412 -73215 -140535 -305742 159015 118446 -79897 155332 -138164
$$ packed form
9342a51679E4111K347b79844Q3768j09085a31169A51518h042b772o204m01009
9331d09985d8263B52387h0986q7347A12999n5674a98834C1306a31170O0898A96302
9319a30031e2573p2197J2721o0797H1099A6J92299b86148B7470M6309d4392k77969
9307c22361R5830c0214a0596k21136M9680N1481A4433h8372H8417i072A74772
9295B5235b94495R0250P2750k67070d6521j9033j30382D6973J12723d60709E5223
9283B17959c25281i8073j69013h5816A69832b01930q7708E1373e4519A16109m9314
9272F6795b35521J07950A10374J46399a70976d6284j76354J04571A83562L2925
9262B16487b36971N8692P8867K6197o7320j65207A59015m0569g9897A55332a38164
$$ plain form
9250 -139457 -368912 236486 146 -181175 -158778 222544 -139445 86779 -84967 -72096 -109370
9239 -109370 -36261 365369 -166669 -68775 -324524 -182628 -102091 -235961 -177477 169755
9228 131577 549293 -115389 -225387 -71119 -66662 -65969 -8337 108755 -29219 -6165 -96678 36912
9215 63691 341230 -58507 8254 -263952 -97724 69599 -224657 199593 -8623 -42925 -207426
9204 -207426 -169545 37991 -188040 179983 -292920 -92237 -51728 -15373 130169 37037 -72949
9192 94499 -44855 9624 -289272 168870 260843 -64798 -64895 175344 -27621 -165414 -121629 282112
9179 -227336 24404 -198002 169300 91753 -157878 73308 25514 -308510 -54158 -225545 -17254
9167 -385281 -111242 433036 25144 -277303 -102041 -393292 43151 -221622 15303 10139 175751
$$ packed form
9250a39457k29455B36486A46a81175K2397B22544a39445H6779h4967J2871l7274
9239a09370c6261C65369a66669f8775k55749J41896Q0537j33870N8484A69755
9228A31577M17716a15389j09998g1119M457O93h337A08755b9219f165r0513C6912
9215F3691K77539e8507H254b63952i7724F9599b24657A99593h623l4302j64501
9204b07426L7881C7991a88040A79983b92920i2237M0509a5373A30169C7037g2949
9192I4499d4855I624b89272A68870R1973f4798r7A75344b7621j37793M3785B82112
9179b27336B4404a98002A69300p7547a57878G3308B5514c08510e4158j71387a7254
9167c85281a11242D33036B5144b77303a02041k91251D3151b21622A5303n164J65612
$$ plain form
9156 175751 21316 -321224 64906 115919 88054 4991 -76534 -215653 389655 -6717 -177220
9145 -177220 -58790 46265 -242427 29238 114548 -203829 42137 207302 148686 -119757 -282819
9134 -282819 -107922 -42405 -123547 -226872 -100710 -148679 72296 -290672 -212112 89134 -372325
9122 -515004 -212967 -98606 40945 -108640 -339016 -377012 -239407 -115383 -74621 -38928 -35970
9111 -35970 -84775 -129123 154520 -8936 -217701 -154905 -210156 70607 -220270 -16979 167301
9099 -245199 -14061 -5746 73580 -4324 -155830 30501 -229871 22445 -533954 -262037 -273386
9088 -273386 -71115 40817 -260306 23378 -30725 -60224 -314795 -110626 -89268 -355003 -40818
9076 97029 114032 -164352 37318 45301 -25371 -60224 -2460 -89398 -61311 -139132 -17187 230415
$$ packed form
9156A75751B1316c21224F4906N1013k7865D991g6534j39119C89655f717j70503
9145a77220e8790D6265b42427B9238Q5310b03829D2137J65165n8616a19757j63062
9134b82819a07922d2405q1142j03325a00710m7969G2296b90672P8560H9134c72325
9122e15004b12967i8606D0945a08640k30376l7996J37605a15383M0762L5693K958
9111c5970m8805m4348A54520h936k08765O2796n5251G0607b20270a6979A67301
9099b45199a4061e746G3580d324j51506C0501b29871B2445e33954b62037j1349
9088b73386g1115D0817b60306B3378c0725k9499k54571a10626K1358k65735d0818
9076I7029J7003a64352C7318P983b5371l4853b460q6938K8087p7821a7187B30415
$$ plain form
9063 -260881 -124710 -260215 1520 35104 -342760 -26466 150814 27806 64653 -232567 101295
9051 82297 -247604 119716 -27603 313415 -260868 -111220 -96757 318499 -323644 -1739 -172694
9040 -172694 -113115 150298 99678 244819 -4780 203464 -243569 -229323 -234030 -330255 -213178
9029 -213178 -89757 104083 220194 105956 193964 318344 -181528 -174510 -35105 264765 326943
9018 326943 -20018 -133038 -95433 -77165 -3146 -16632 199386 109076 124491 -140237 -209369
9007 -209369 28398 -233523 85879 197966 -205067 -178165 -165843 -346066 -20686 -184651 -96270
8996 -96270 -198154 -84981 -176656 -255472 -14401 84227 -160251 -53733 89313 -253784 -241343
8985 -241343 -386713 204638 95285 118594 -83833 -23268 -215032 44578 276485 -270555 -141855
$$ packed form
9063b60881a24710j35505A520L3584c42760b6466A50814B7806L6847b32567A01295
9051H2297b47604A19716b7603C13415b60868a11220J4463C18499c23644a739j70955
9040a72694N9579A50298n0620J45141d780B03464b43569J4246m707r6225J17077
9029b13178h9757A04083J16111A05956Q8008J24380a81528P018c5105B64765O2178
9018C26943b0018j13020L7605J8268c146j3486A99386r0310J5415a40237o9132
9007b09369B8398b33523H5879J12087b05067K6902J2322j80223b0686j63965Q8381
8996i6270j01884h4981r1675p8816a4401H4227a60251e3733H9313b53784J2441
8985b41343j45370B04638I5285K3309h3833b3268j91764D4578K31907b70555J28700
$$ plain form
8974 -141855 13787 -3089 40746 -83962 -162406 62957 -349577 -237326 243532 133464 -31533
8962 -168185 108063 -248248 -88224 -159619 -203481 5323 -15535 -268162 208676 -30779 -458491
8951 -458491 22492 37307 -30455 287282 290209 -386288 -44349 23359 286988 151791 -91565
8939 -112765 68607 616797 341601 -174452 234288 44270 -19277 230707 -69301 -524079
8929 -524079 12375 -150195 9184 -32595 -92192 -339181 -13804 -179652 232091 256176 -13207
8917 -40532 140478 -141165 -64905 114777 -264108 -371448 66348 -15337 86255 182044 -300075
8905 118134 -121794 -166114 -128674 -283714 -57577 -139448 -196164 -6297 170676 -207925 -98339
8893 218276 -174279 146369 -294896 -32005 -175541 -152709 120978 -305147 73444 -29721
$$ packed form
8974a41855A3787c089D0746h3962p8444F2957c49577J12251B43532j10068c1533
8962a68185A08063b48248h8224p1395m3862E323a5535k52627B08676c0779m27712
8951d58491B2492J4815c0455B87282K927c86288d4349B3359K63629j35197i1565
8939a12765F8607N48190k75196a74452B34288D4270a9277B30707f9301m54778
8929e24079A2375a50195I184c2595n9597k46989a3804j65848B32091K4085a3207
8917d0532A40478a41165f4905A14777b64108j07340F6348a5337H6255R5789c00075
8905A18134a21794m4320L7440j55040e7577q1871n6716f297A70676b07925i8339
8893B18276a74279A46369b94896c2005j43536K2832A20978c05147G3444b9721
$$ plain form
8882 -105670 127378 -104460 1940 24159 -52116 -140544 141976 215130 -226292 -65883 45707
8870 86240 -169989 260943 19853 147356 160962 -99229 245392 122350 -293849 185980
8859 223031 -85650 -138581 -162219 55539 100576 -87513 -38258 -115190 94896 -181677 144040
8847 -165033 -131534 -162087 -109094 9536 -211470 -189204 -54426 -132611 224885 -127802 44374
8835 -93440 -227548 -293403 -14176 -169227 -294015 200471 -212029 -117981 -2919 282326 -38126
$$ packed form
8882a05670A27378a04460A940K2219e2116q8428A41976P3154b26292f5883D5707
8870H6240a69989B60943A9853J27503J3606i9229B45392A22350b93849A85980
8859B23031h5650n2931k3638E5539M5037h7513c8258p6932I4896a81677A44040
8847a65033L3499l0553N2993I536b11470K2266e4426p8185B24885a27802D4374
8835i3440j34108o5855a4176j55051j24788B00471b12029R4048b919B82326c8126
$$ [...]
##END NTUPLES=NMR SPECTRUM
##END=
