##TITLE=AC1660_NUNAH14396_8531369_eUokH0n08S
##JCAMPDX= 6.0         $$ Bruker NMR JCAMP-DX V2.0
##DATA TYPE= NMR SPECTRUM
##DATA CLASS= NTUPLES
##ORIGIN= BRUKER
##OWNER= Administrator
$$ 1.72 TOPSPIN		Version 2.1
$$ 2015-08-08 02:43:04.359 -0700  Administrator@X
$$ Compression mode = diff/dup
##.OBSERVE FREQUENCY= 400.02188249412
##.OBSERVE NUCLEUS= ^1H
##.ACQUISITION MODE= SIMULTANEOUS (DQD)
##.ACQUISITION SCHEME= undefined
##.AVERAGES= 64
##.DIGITISER RES= 22
##SPECTROMETER/DATA SYSTEM= spect
##.PULSE SEQUENCE= noesygpps1d.comp
##.SOLVENT NAME= COFFEE_meoh
##.SHIFT REFERENCE= INTERNAL, COFFEE_meoh, 1, 14.96147
##AUDIT TRAIL= $$ (NUMBER, WHEN, WHO, WHERE, PROCESS, VERSION, WHAT)
$$ ##TITLE= Audit trail, TOPSPIN		Version 2.1
$$ ##JCAMPDX= 5.01
$$ ##ORIGIN= Bruker BioSpin GmbH
$$ ##OWNER= Administrator
$$ $$ E:\/data/COFFEE/nmr/AC1660_NUNAH14396_8531369_eUokH0n08S/22/pdata/1/auditp.txt
$$ ##AUDIT TRAIL=  $$ (NUMBER, WHEN, WHO, WHERE, PROCESS, VERSION, WHAT)
(   1,<2015-08-08 02:42:58.969 -0700>,<Administrator>,<X>,<go>,<TOPSPIN 2.1>,
      <created by zg
	started at 2015-08-08 02:31:29.234 -0700,
	POWCHK enabled, PULCHK disabled,
       configuration hash MD5:
       21 0F 79 D6 B3 7B B4 F6 88 20 88 DB 03 48 BD 9F
       data hash MD5: 64K
       C0 7E 08 84 D0 DB E5 A7 F4 C2 56 85 1C 00 68 F3>)
(   2,<2015-08-08 02:43:02.219 -0700>,<Administrator>,<X>,<proc1d>,<TOPSPIN 2.1>,
      <Start of raw data processing
       efp LB = 0.3 FT_mod = 6 PKNL = 1 PHC0 = 0 PHC1 = 0 SI = 128K 
       data hash MD5: 128K
       D8 5A 32 98 59 7A A9 EA 86 62 F7 11 C7 ED D8 68>)
(   3,<2015-08-08 02:43:03.141 -0700>,<Administrator>,<X>,<proc1d>,<TOPSPIN 2.1>,
      <pk PHC0 = -86.07239 PHC1 = 0 
       data hash MD5: 128K
       61 77 B2 90 BB 12 BE 10 BA 0E 9F DF 68 4E 5D 04>)
(   4,<2015-08-08 02:43:03.516 -0700>,<Administrator>,<X>,<proc1d>,<TOPSPIN 2.1>,
      <abs ABSG = 1 
       data hash MD5: 128K
       24 03 22 E7 C2 1B AE 4B 42 44 B8 CD 68 E2 D9 D6>)
(   5,<2015-08-08 02:43:03.609 -0700>,<Administrator>,<X>,<proc1d>,<TOPSPIN 2.1>,
      <abs ABSG = 2 
       data hash MD5: 128K
       62 04 23 FD D5 21 90 B3 E7 F5 6F 43 77 B6 49 DA>)
(   6,<2015-08-08 02:43:03.703 -0700>,<Administrator>,<X>,<proc1d>,<TOPSPIN 2.1>,
      <abs ABSG = 3 
       data hash MD5: 128K
       9E 46 2B 67 6B FB B8 DC 8A 3C 56 16 C5 D2 9B 87>)
(   7,<2015-08-08 02:43:03.797 -0700>,<Administrator>,<X>,<proc1d>,<TOPSPIN 2.1>,
      <abs ABSG = 4 
       data hash MD5: 128K
       4C 19 87 C5 86 56 F2 6E ED 33 D2 5A 2D CF D7 22>)
(   8,<2015-08-08 02:43:03.875 -0700>,<Administrator>,<X>,<proc1d>,<TOPSPIN 2.1>,
      <abs ABSG = 5 
       data hash MD5: 128K
       09 98 BC BF C8 B7 8B 9E A5 F4 E8 F6 0B AE 37 4D>)
$$ ##END=
$$ 
$$ $$ hash MD5
$$ $$ 21 BB 21 74 B8 E6 F2 17 29 62 FF 82 3A 65 E1 C3
##$RELAX= 
##$RELAX= 
##$RELAX= 
##$RELAX= 
##$RELAX= 
##$RELAX= 
##$RELAX= 
##$RELAX= 
$$ Bruker specific parameters
$$ --------------------------
##$DU= <E:\>
##$EXPNO= 22
$$ [...]
##$TP07= 0
##$TPNAME0= <>
##$TPNAME1= <>
##$TPNAME2= <>
##$TPNAME3= <>
##$TPNAME4= <>
##$TPNAME5= <>
##$TPNAME6= <>
##$TPNAME7= <>
##$TPOAL= (0..7)
0.5 0.5 0.5 0.5 0.5 0.5 0.5 0.5
##$TPOFFS= (0..7)
0 0 0 0 0 0 0 0
##$TUNHIN= 0
##$TUNHOUT= 0
##$TUNXOUT= 0
##$USERA1= <user>
##$USERA2= <user>
##$USERA3= <user>
##$USERA4= <user>
##$USERA5= <user>
##$V9= 5
##$VALIST= <valist>
##$VCLIST= <CCCCCCCCCCCCCCC>
##$VD= 0
##$VDLIST= <DDDDDDDDDDDDDDD>
##$VPLIST= <PPPPPPPPPPPPPPP>
##$VTLIST= <TTTTTTTTTTTTTTT>
##$WBST= 2048
##$WBSW= 25
##$XGAIN= (0..3)
0 0 0 0
##$XL= 0
##$YL= 0
##$YMAX_a= 6658360
##$YMIN_a= -12763252
##$ZGOPTNS= <>
##$ZL1= 120
##$ZL2= 120
##$ZL3= 120
##$ZL4= 120
##$ABSF1= 14.96147
##$ABSF2= -5.596712
##$ABSG= 5
##$ABSL= 3
##$ALPHA= 0
##$AQORDER= 0
##$ASSFAC= 0
##$ASSFACI= 0
##$ASSFACX= 0
##$ASSWID= 0
##$AUNMP= <proc_prof1d_extract.lims>
##$AXLEFT= 0
##$AXNAME= <>
##$AXNUC= <1H>
##$AXRIGHT= 0
##$AXTYPE= 0
##$AXUNIT= <>
##$AZFE= 0.1
##$AZFW= 0.1
##$BCFW= 0
##$BC_mod= 0
##$BYTORDP= 0
##$COROFFS= 0
##$CY= 15
##$DATMOD= 1
##$DC= 0
##$DFILT= <>
##$DTYPP= 0
##$F1P= 0
##$F2P= 0
##$FCOR= 0.5
##$FTSIZE= 131072
##$FT_mod= 6
##$GAMMA= 0
##$GB= 0
##$INTBC= 1
##$INTSCL= 1
##$ISEN= 128
##$LB= 0.3
##$LEV0= 0
##$LPBIN= 0
##$MAXI= 10000
##$MC2= 0
##$MEAN= 0
##$ME_mod= 0
##$MI= 0
##$NCOEF= 0
##$NC_proc= -2
##$NLEV= 6
##$NOISF1= 0
##$NOISF2= 0
##$NSP= 0
##$NTH_PI= 0
##$NZP= 0
##$OFFSET= 14.96147
##$PC= 1
##$PHC0= -86.07239
##$PHC1= 0
##$PH_mod= 1
##$PKNL= yes
##$PPARMOD= 0
##$PPDIAG= 0
##$PPIPTYP= 0
##$PPMPNUM= 2147483647
##$PPRESOL= 1
##$PSCAL= 4
##$PSIGN= 0
##$PYNMP= <proc.py>
##$REVERSE= no
##$SF= 400.020009447528
##$SI= 131072
##$SIGF1= 0
##$SIGF2= 0
##$SINO= 400
##$SIOLD= 131072
##$SPECTYP= <>
##$SREGLST= <1H.CDCl3>
##$SSB= 0
##$STSI= 131072
##$STSR= 0
##$SW_p= 8223.68421052631
##$SYMM= 0
##$S_DEV= 0
##$TDeff= 65536
##$TDoff= 0
##$TI= <>
##$TILT= no
##$TM1= 0
##$TM2= 0
##$TOPLEV= 0
##$USERP1= <user>
##$USERP2= <user>
##$USERP3= <user>
##$USERP4= <user>
##$USERP5= <user>
##$WDW= 1
##$XDIM= 131072
##$YMAX_p= 456466854
##$YMIN_p= -11264
##$CURPLOT= <Network HP LaserJet P1505>
##$CURPRIN= <$Network HP LaserJet P1505>
##$DFORMAT= <normdp>
##$LAYOUT= <+/1D_H.xwp>
##$LFORMAT= <normlp>
##$PFORMAT= <normpl>
##$SURQMSG= 1
$$ End of Bruker specific parameters
$$ ---------------------------------
##NTUPLES= NMR SPECTRUM
##VAR_NAME=  FREQUENCY,     SPECTRUM/REAL,   SPECTRUM/IMAG
##SYMBOL=    X,             R,               I
##VAR_TYPE=  INDEPENDENT,   DEPENDENT,       DEPENDENT
##VAR_FORM=  AFFN,          ASDF,            ASDF
##VAR_DIM=   131072,        131072,          131072
##UNITS=     HZ,            ARBITRARY UNITS, ARBITRARY UNITS
##FACTOR=    0.0627417313425164, 1,          1
##FIRST=     8223.62146879497, 3866,         -55008
##LAST=      0,             6019,            -54812
##MIN=       0,             -11264,          0
##MAX=       8223.62146879497, 456466854,    0
$$ Real data points
##PAGE= N=1
##DATA TABLE= (X++(R..R)), XYDATA
$$ [...]
65078 176060 176437 177651 179030 179802 179884 179790 180079 181008 182332 183437 183933 184194 184955 186355 187681 188112 187393
65061 187393 185798 183833 182066 180862 180111 179473 178942 178822 179111 179341 179214 179022 179163 179512 179529 178818 177351
65044 177351 175309 172938 170495 168162 166054 164356 163318 162939 162726 161929 160151 157766 155709 154609 154141
65029 154141 153402 152070 150911 150842 151744 152613 152834 152875 153659 155562 158093 160303 161495 161806 162167 163420 165431
65012 165431 167350 168669 169694 170867 172083 172909 173219 173350 173771 174801 176529 178823 181435 184102 186536
64997 186536 188484 190049 191875 194597 197999 201065 203042 204159 205112 206179 207132 207701 207654 206570 204066
64982 204066 200398 196453 192943 189848 186850 184068 181954 180516 179087 177024 174416 171851 169705 167901
64968 167901 166234 164578 162819 160893 159022 157643 157059 157259 157999 158798 158968 158153 156830 155888 155596 155495
64952 155495 155330 155423 155881 156177 156031 156098 157091 158620 159685 160022 160196 160482 160482 159914 159124 158594 158417 158392 158283 157888
64932 157888 157155 156258 155298 154113 152733 151763 151788 152502 153066 153302 153863 155196 157027 159010 161192 163516 165490
64915 165490 166800 167890 169587 172360 176174 180712 185585 190610 196080 202394 209258 215674 220980 225554
64901 225554 230206 235181 239986 243858 246131 246419 244813 241761 237607 232408 226352 220052 214127 208730
64887 208730 203715 199120 195210 192162 189907 188245 187009 186184 185903 186245 187081 188250 189718 191313 192467
64872 192467 192690 192187 191526 190754 189427 187573 185900 184763 183547 181493 178620 175471 172426 169771 167945
64857 167945 167110 166795 166518 166524 167262 168332 168674 167859 166568 165656 165243 164973 164712 164602 164646 164631 164450 164247 164248 164632
64837 164632 165612 167407 169910 172539 174735 176628 178890 181838 185148 188685 193085 198976 205939 212952
64823 212952 219709 226759 234314 241690 248096 253263 257013 258851 258435 255992 251955 246608 240431 234200
64809 234200 228339 222564 216623 210925 206002 201798 198034 194874 192637 191158 190080 189461 189479 189767 189742 189457
64793 189457 189473 189942 190525 191146 192073 193195 193994 194507 195670 198347 202501 207590 213197 218842 223723 227392
64777 227392 230543 234440 239485 244841 249627 254054 258974 264551 269904 274187 277625 281130 285152 289343
64763 289343 293251 296690 299174 299541 296781 291102 283736 275701 267146 257885 248082 238224 228781 220157
64749 220157 212825 207160 203110 200167 197786 195822 194555 194249 194793 195890 197531 199987 203187 206368 208666
64734 208666 210022 211305 213541 217141 221710 226285 229815 231826 232849 234026 236040 238413 239959 239873 238278
64719 238278 235775 232745 229284 225668 222491 220121 218187 215904 212887 209433 205996 202692 199414 196208
64705 196208 193336 191043 189430 188502 188259 188710 189755 191044 192083 192686 193301 194738 197617 202189 208436
64690 208436 215961 223849 231199 237971 244962 252752 260945 268568 274791 279041 280795 279747 276099 270454
64676 270454 263500 255904 248267 240956 234141 228140 223496 220529 218982 218316 218130 218144 218084 217907 217937 218501 219579
64659 219579 221053 223067 225835 229277 233180 237647 243080 249767 257680 266622 276375 286763 297633 308549
64645 308549 318412 325784 330001 331792 332541 333152 333926 335211 337604 341462 346487 351745 355892 357686 356758
64630 356758 353844 349910 345140 339152 332073 324832 318284 312440 306689 300462 293557 286103 278393 270624
64616 270624 262769 254774 246865 239480 232984 227584 223369 220108 217173 214035 210836 208174 206376 205339
64602 205339 205050 205745 207437 209735 212367 215461 219003 222349 224802 226571 228688 231831 235483 238485 240182
64587 240182 240815 240882 240536 239780 238863 238051 237142 235675 233700 231869 230575 229447 227948 226081 224129 222030
64571 222030 219547 216898 214620 212853 211219 209524 208109 207360 207182 207103 206641 205453 203449 200983 198717
64556 198717 197070 195915 194985 194379 194417 195089 195986 196901 198250 200595 203868 207348 210438 213085 215241 216328
64540 216328 215757 213863 211807 210471 209842 209507 209214 208760 207855 206506 205276 204809 205274 206401 207773 208929
64524 208929 209633 210325 211869 214465 217317 219832 222708 227072 232864 238900 244513 250356 257340 265387 273495
64509 273495 280530 285617 288117 287697 284524 279271 272839 265981 259071 252261 245882 240438 236107 232595
64495 232595 229760 228013 227667 228166 228532 228488 228557 229060 229640 229928 230094 230357 230300 229144 226653 223539 220889 219270
64477 219270 218397 217677 216988 216750 217265 218332 219647 221183 222869 224219 224804 224850 224910 225042 224794 223923 222639
64460 222639 221140 219417 217663 216386 215849 215658 215173 214278 213671 214350 216690 219946 222875 224966 226760 228833
64444 228833 231011 232993 235234 238440 242454 246462 250263 254606 260150 266821 274369 282931 292652 303255
64430 303255 314435 326472 340231 356616 376085 398620 424282 454003 489596 532611 583503
64419 583503 642354 709822 786060 868393 951149 1028667 1098443 1161296 1219074 1272512 1320507
64408 1320507 1360464 1389187 1403895 1402920 1386179 1355682 1315399 1269404 1219186 1162872 1097609 1022849
64396 1022849 941477 858341 778050 703633 636376 576465 523758 478115 439244 406644 379752
64385 379752 357897 340076 325135 312352 301652 293195 286960 282639 279586 276844 273585 269567 264931
64372 264931 259701 254039 248862 245377 243706 242645 241135 239454 238586 238960 240359 242560 245474 248876 252539
64357 252539 256439 260435 263959 266484 268084 269003 268852 266886 263139 258751 254859 251565 248291 244896 241961
64342 241961 239905 238271 236251 233843 232046 231763 232884 234697 236839 239415 242448 245841 249857 255034
64328 255034 261462 268619 276004 283458 290651 296685 300545 301760 300493 297281 292793 287491 281338 274120
64314 274120 266220 258721 252550 247749 243719 239941 236286 232934 230216 228402 227521 227408 227880 228678 229399
64299 229399 229839 230315 231318 232949 235052 237676 240871 244197 247119 249821 252898 256305 259468 262578 266770
64284 266770 272624 279284 285602 291454 297283 302883 307318 309846 310457 309713 308314 306584 304215 300938 297504
64269 297504 295380 295236 296307 297457 298146 298015 296413 293001 288237 282713 276584 270164 264343 259652 255497
64254 255497 251068 246545 242622 239353 236308 233498 231276 229576 228060 226795 226018 225468 224713 223934 223594
64239 223594 223544 223296 223059 223581 224984 226578 227927 229289 230879 232398 233529 234327 234888 235099 234794 233809 231906
64222 231906 229167 226402 224570 223776 223374 223061 223190 223889 224603 224765 224395 223773 223046 222462 222536 223612 225536
64205 225536 228067 231343 235696 241112 247144 253305 259526 266284 274258 283749 294474 305919 317532
64192 317532 328354 336844 341696 342746 340704 336167 329407 321043 312194 303720 295664 287647 279576 271861
64178 271861 265103 259630 255209 251302 247741 244926 243133 241933 240681 239379 238644 238956 240363 242667 245378
64163 245378 247672 248986 249634 250316 251143 251700 251945 252328 253014 253655 254058 254440 254891 255167 255156 254925 254169 252348
64145 252348 249749 247726 247373 248364 249545 250298 250837 251482 252253 253120 254145 255343 256655 258136 259937 262117
64129 262117 264593 267322 270451 274212 278739 283957 289731 296096 303190 310918 318763 326074 332374 337372
64115 337372 340951 343363 345185 346805 348172 349283 350674 353048 356622 361194 366522 372159 377174 380680
64101 380680 382623 383557 383777 383287 382567 382593 383819 385685 387421 388954 390739 393054 395709 398184 399860 400280
64085 400280 399390 397427 394569 390855 386404 381523 376660 372409 369274 367110 364904 361552 356796 351208
64071 351208 345570 340667 337295 335708 335161 334706 334406 335099 336907 338821 339943 340539 341557 343717 347318
64056 347318 352405 358759 366115 374636 384818 396728 409739 423214 437026 451227 465687 480385
64044 480385 495617 511516 527533 542627 555822 566517 574526 579999 583164 584187 583439 581630 579251
64031 579251 576082 571761 566624 561308 555694 549140 541763 534512 527732 520670 512764 504478 496241 487465
64017 487465 477411 466481 455861 446316 438024 431150 425728 421209 416920 412951 410021 408500 408016 407955
64003 407955 407927 407804 407787 408414 410136 412829 415963 419214 422663 426483 430767 435670 441486 448432 456358 464660
63987 464660 472661 480287 488329 497721 508628 520537 533120 546496 560685 575532 591279 608527
63975 608527 627329 647003 667205 688571 711834 736921 763430 791428 821151 852475 885493
63964 885493 921297 961490 1007138 1058824 1117408 1184032 1259674 1345510 1443610 1556468 1685868
63953 1685868 1832968 1999522 2188052 2400380 2636566 2895604 3176522 3478142 3797981
63944 3797981 4132007 4475566 4824132 5172741 5514685 5841103 6142359 6410092 6638003
63935 6638003 6821078 6954919 7036267 7063691 7037113 6956910 6824084 6641301 6413356 6146737
63925 6146737 5849164 5529205 5195341 4854799 4513424 4176599 3849708 3537413 3242885
63916 3242885 2968094 2714566 2483487 2275237 2089192 1924018 1777980 1649146 1535756
63907 1535756 1436605 1350850 1277204 1213549 1157710 1108531 1065755 1028684 995498 964303 934506
63896 934506 906598 880816 856626 833442 811080 789367 767952 746906 727037 709217 693698
63885 693698 680290 668798 659044 650897 644629 640854 639883 641534 645793 652997 662929 674378 686342
63872 686342 699257 714298 731801 751142 771933 794415 818545 843473 868092 891598 913390
63861 913390 933048 950618 966487 980689 992585 1001367 1006616 1008314 1006642 1001848 994024 983030 968867
63848 968867 952118 933584 913441 891170 866414 839524 811152 781696 751403 720716 690200
63837 690200 660252 631066 602840 575898 550650 527468 506532 487780 471065 456230 442894
63826 442894 430389 418230 406640 396318 387672 380552 374658 369790 365608 361572 357356 353098 349029
63813 349029 345154 341537 338533 336244 333817 329883 323968 317165 311105 306421 302535 298807 295308 292285
63799 292285 289427 286240 282909 280153 278162 276279 273956 271537 269700 268497 267419 266207 265104 264310
63785 264310 263582 262485 260826 258802 256858 255419 254590 254094 253616 253173 252997 253071 252964 252235 250958 249745 249158
63768 249158 249109 248975 248334 247382 246464 245442 243981 242354 241464 241878 243163 244352 244866 244922 245282 246680 249238
63751 249238 252372 255452 258478 261739 264988 267567 269398 271121 273010 274403 274621 273941 273272 273307 274327
63736 274327 276278 278547 280196 281059 282178 284542 287734 290499 292367 293981 296038 298673 301839 305531
63722 305531 309422 312833 315325 317004 318113 318604 318238 317000 315307 313817 312903 312348 311832 311663 312477 314104
63706 314104 315467 316043 316731 318626 321555 324631 327719 331320 335305 338853 341668 344254 346776 348510 348720
63691 348720 347488 345484 343460 342070 341541 341311 340484 338774 336543 333942 330704 326921 323336 320549 318492
63676 318492 316956 316105 316162 317037 318546 320622 323039 325351 327339 329094 330493 331058 330604 329562 328322 326643
63660 326643 324122 320918 317656 314841 312617 310855 309179 307190 304927 302866 301265 299775 297991 296130
63646 296130 294883 294832 296223 299009 302745 306667 310261 313639 317062 320349 323191 325976 329743 335167 341914
63631 341914 349165 356505 364064 372034 380487 389706 400323 412857 427265 443108 459969 477430 494953
63618 494953 512399 530687 551277 574637 599636 624597 648256 669285 685668 695635 699127 697620
63606 697620 692620 684985 675585 665686 656403 648302 641565 635957 630553 624237 616657 608098 598290 586176
63592 586176 571309 554751 538086 522073 506828 492725 480323 469699 460611 453241 448051 444863
63580 444863 442732 440982 439902 440168 441908 444658 448070 452293 457616 463944 470708 477243 483213 488749
63566 488749 494300 500368 507286 515224 524379 535129 547903 562966 580393 600197 622311 646671
63554 646671 673622 703912 737381 771211 800075 818807 825208 820487 807676 790098 770738 751958
63542 751958 735257 721312 710117 701071 693411 686880 681573 676812 670807 662073 650701 637533 622601
63529 622601 605433 586596 567694 549710 532310 515054 498389 483060 469268 456778 445281
63518 445281 434306 423352 412438 402154 392988 385035 378400 373234 369161 365387 361649 358489 356277
63505 356277 354584 352848 351083 349465 347750 345618 343203 340850 338667 336699 335206 334408 334199 334381 334875
63490 334875 335492 335914 336187 336830 338135 339779 341459 343471 346261 349709 353338 356962 360658 364257 367281
63475 367281 369314 370223 370117 369271 368008 366513 364832 363070 361335 359611 358010 357064 357266 358249 359021 359163
63459 359163 359348 360524 363114 367126 372383 378361 384423 390606 397654 405939 414918 424001 433436 443914
63445 443914 455952 470229 487978 510247 536823 566112 595601 622113 642478 655027 660578 661503
63433 661503 660020 657687 656006 656598 660665 668708 680718 696311 714869 736005 759764 785824 812531
63420 812531 837097 856819 870088 876546 876768 871799 862796 851089 838462 826801 817032 808662 800636
63407 800636 792352 783524 773478 761154 745781 727323 706426 684105 661192 637898 614183 590674
63395 590674 568663 548938 531194 515039 500953 489588 480549 472682 465376 459017 454331 451850 451804
63382 451804 453906 457333 461423 466329 472513 479829 487672 495909 505034 515439 527141 540254 555151
63369 555151 571927 590188 609570 630232 652658 677137 703444 730760 757722 782684 804015
63358 804015 820334 830745 835104 834007 828489 819863 809688 799388 789665 780507 771874 763971 756769
63345 756769 749664 741776 732175 719809 703962 685122 664834 644289 623605 602824 582874 564967
63333 564967 549662 537104 527670 521740 519353 520632 525778 533649 540812 543094 538220 526595 510139
63320 510139 491254 472392 455288 440284 426911 415012 404768 396082 388828 383413 380153 378283
63308 378283 376565 374767 373574 373154 372830 372248 371756 371446 370803 369616 368299 366984 365131 362511 359854 358078
63292 358078 357411 357521 357930 357990 357127 355525 354054 353215 352620 351768 350754 349911 349341 349240 350117 352158 354698
63275 354698 356830 358313 359541 360814 361980 362695 362875 362936 363611 365279 367513 369603 371490 373762 376713
63260 376713 379955 383105 386325 389875 393561 396987 400160 403579 407848 413254 419506 425865 431774 437421
63246 437421 443433 450163 457594 465808 474968 484858 495088 505928 518410 533319 550521 569467 589932
63233 589932 611929 635269 659585 684605 710177 736070 761792 786528 809480 830630 851051
63222 851051 871970 893507 914734 934988 954628 974435 994859 1015962 1037563 1059126 1079795
63211 1079795 1098637 1114538 1125975 1131519 1130753 1124205 1112289 1094926 1072438 1046092 1017280 986625
63199 986625 954414 921591 889790 860468 834322 811439 791792 775582 763195 754755 749785 747587
63187 747587 747899 750948 756930 765772 777271 790997 806186 822249 839318 857713 876907 895770
63175 895770 913891 931807 949706 966838 982739 998234 1014409 1030997 1046491 1059601 1070019
63164 1070019 1077895 1083129 1085223 1083502 1077480 1067114 1052606 1033974 1011188 984820 956122 926258
63152 926258 895869 865533 836123 808357 782400 758305 736446 717108 700030 684793 671395
63141 671395 660034 650575 642669 636163 631045 627155 624321 622512 621548 620898 620156 619504 619373 619921 621200
63126 621200 623439 626618 630003 632752 634884 637063 639459 641455 642562 643058 643495 644076 644861 646158 648189
63111 648189 650475 652032 652313 651720 651075 650760 650520 649947 648867 647249 645105 642685 640502 638879 637549 636023
63095 636023 634310 633010 632689 633424 634954 637028 639531 642485 645945 649815 653767 657512 661067 664579 668055
63080 668055 671512 675224 679459 684062 688673 693290 698275 703922 710460 718307 727717 738102 748360 758077
63066 758077 768014 779253 792355 807553 825157 845302 867582 891421 916779 944307 974828 1008708
63054 1008708 1045624 1084936 1126386 1170250 1216665 1265057 1314695 1365568 1418114 1472118 1526487
63043 1526487 1580160 1632660 1683679 1732785 1779872 1825403 1869979 1913984 1957793 2001807 2046044
63032 2046044 2090017 2133077 2174383 2212397 2244907 2269818 2285657 2291318 2285909 2268977 2240416 2200154
63020 2200154 2148618 2087708 2020540 1949843 1877157 1803810 1731904 1663773 1601005 1544506 1495058
63009 1495058 1453207 1418888 1391644 1371078 1356900 1348903 1347104 1351503 1361433 1375617 1393144 1413993
62997 1413993 1438338 1465804 1495701 1527426 1560300 1593475 1626348 1658701 1690246 1720608 1749972
62986 1749972 1778938 1807292 1833631 1856666 1876109 1891629 1901685 1904341 1898761 1885104 1863375 1833330
62974 1833330 1795286 1750195 1699085 1643119 1584017 1523619 1463034 1402785 1343660 1286780 1232869
62963 1232869 1182144 1134928 1091763 1052714 1017007 983538 951607 921219 892934 867347 844483
62952 844483 823769 804711 787259 771378 756674 742778 729718 717532 705888 694520 683730
62941 683730 674033 665611 658404 652308 646901 641519 636204 632060 629939 629110 628035 626135 624032 622233
62927 622233 620539 618773 617223 616027 614680 612446 609025 604746 600428 596976 594706 592958 590653 587288
62913 587288 583247 579287 575953 573377 571337 569505 567708 565825 563537 560634 557640 555532 554567 553951 553034
62898 553034 552176 551949 552170 552386 552744 553540 554340 554397 553761 553207 553199 553527 553798 553714 553117 552277 551795 551647 550842 548796
62878 548796 546562 545686 546151 546547 546103 545404 545047 544806 544438 544307 544653 545005 544889 544645 545032 546320 548064 549591
62860 549591 550509 550978 551555 552628 554078 555641 557257 558718 559360 558743 557495 556800 557179 558253 559550 560840
62844 560840 561758 561841 561041 559651 557755 555311 552662 550319 548229 545991 543848 542754 543253 544859 546694
62829 546694 548209 549260 550056 551183 553191 555999 559087 562240 565581 569010 572251 575461 579058 582875
62815 582875 586173 588694 591058 593912 597256 600786 604288 607512 610262 612917 616346 621025 626615 632633
62801 632633 639097 646361 654759 664576 675964 688712 702495 717497 734395 753650 775325 799683
62789 799683 827395 858910 894044 932439 974066 1019077 1067621 1120037 1176951 1238968 1306418
62778 1306418 1379368 1457483 1539809 1625076 1712200 1800067 1886758 1969481 2045418 2112294 2168070
62767 2168070 2210645 2238179 2249513 2244242 2222721 2186145 2136316 2075163 2004600 1926712 1843697
62756 1843697 1757578 1670163 1583196 1498244 1416476 1338733 1265628 1197352 1133753 1074944 1021442
62745 1021442 973365 929938 890340 854530 822619 793917 767476 743164 721366 701998 684815
62734 684815 670337 659241 650897 643637 636525 629863 623981 618687 614091 610825 609164 608854 609965 612855
62720 612855 617069 621392 625445 630213 636675 644822 654470 665940 679385 694335 710487 728205 747818
62707 747818 769255 792843 819533 849808 883194 919437 959376 1004039 1053687 1108245 1167784
62696 1167784 1231853 1299099 1368207 1438503 1508912 1577142 1640694 1697988 1747664 1787478 1814978
62685 1814978 1828935 1829345 1816489 1790858 1753642 1706444 1650670 1587906 1520563 1451359 1382176 1313896
62673 1313896 1247139 1182611 1121018 1063182 1010055 962090 918822 879413 843421 810728 781113
62662 781113 754340 730337 708885 689468 671738 655746 641371 627995 615173 603174 592478
62651 592478 583169 575170 568526 563017 558053 553401 549472 546443 543692 540555 537015 533141 528629 523592
62637 523592 519040 515693 512883 509571 506010 503441 502496 502748 503605 504768 505971 507043 508113 509247 510128
62622 510128 510683 511563 513272 515192 516294 516600 517089 518422 520528 523304 526893 531348 536690 543215 551104
62607 551104 559932 569202 579205 590660 603760 618324 634683 653576 675233 699386 726164 756110
62595 756110 789204 824644 861832 900959 942417 985980 1030555 1074295 1114996 1150924 1181317
62584 1181317 1205817 1223650 1233822 1235866 1229859 1216002 1194852 1167680 1135895 1100270 1061418 1020754
62572 1020754 980047 940167 901178 863565 828365 795944 765744 737607 712392 690810 672353
62561 672353 655887 640744 626760 613813 601890 591275 582189 574425 567613 561601 556352 551784 547981
62548 547981 545304 543973 543646 543605 543234 542206 540418 537935 534984 531962 529458 528087 528063 528986 530274 531792
62532 531792 533876 536867 540854 545737 551301 557354 564110 572302 582572 594872 608774 624243 641689
62519 641689 661371 683222 707331 734202 764387 798098 835192 875286 917832 962194 1007618
62508 1007618 1053034 1097106 1138688 1177098 1211827 1242276 1268026 1289049 1305377 1316924 1324034
62497 1324034 1327866 1329702 1330120 1329359 1328299 1328594 1331864 1339008 1349750 1362000 1371857 1375332 1370806 1359784
62483 1359784 1345197 1328924 1310392 1286940 1255651 1215617 1168839 1118910 1068823 1020022 972921
62472 972921 927630 884256 843096 804682 769447 737541 709146 684605 663879 646281 631284
62461 631284 619136 610026 603055 596927 591470 587529 585452 584610 584575 585820 588829 593190 598038 602974 608197
62446 608197 614042 620688 628108 636079 644340 652710 660874 668150 673753 677275 678655 677821 674668 669247
62432 669247 661695 652181 641298 630179 619744 610019 600656 591842 584088 577385 571270 565669 560914
62419 560914 556915 553019 548904 545039 542099 540333 539569 539439 539486 539455 539538 540063 540987 542038 543232 544890 547279
62402 547279 550559 554867 560046 565618 571571 578789 588024 598656 609243 619190 629103 639625 650725
62389 650725 662142 673715 685075 695670 705271 713958 721591 727865 732855 736873 739803 741164 740903
62376 740903 739541 737560 735255 733197 732190 732731 735069 739681 747057 757107 769525 784659 803272
62363 803272 825556 851276 880839 915085 953769 995128 1037180 1078591 1117993 1153492 1183410
62352 1183410 1206966 1223958 1234535 1239568 1240459 1238023 1232130 1222646 1210022 1194590 1176156 1154795
62340 1154795 1131397 1106771 1080814 1053247 1024828 997223 971836 949098 928638 909783 892030
62329 892030 875290 859595 844617 829694 814212 797626 779413 759661 739576 720595 702969
62318 702969 685948 669365 654134 641029 629856 620139 611819 604988 599573 595542 592752 590439 587771
62305 587771 585133 583932 584764 586614 588279 589628 591041 592627 594667 597911 602599 607850 612708 617079
62291 617079 620975 623638 624469 624283 624635 626093 627966 629522 630765 632099 633847 636059 638458 640828 643670
62276 643670 648087 654626 662657 671260 680273 690078 700920 713059 727210 744245 764630 788502 815909
62263 815909 846607 880119 916478 956434 1000393 1047445 1095930 1144563 1192403 1238000 1279186
62252 1279186 1313774 1340339 1358628 1369469 1374001 1372812 1366046 1354154 1337752 1316611 1289742 1256921
62240 1256921 1219439 1179016 1136874 1094303 1053046 1014294 978046 944250 913760 887286 864186
62229 864186 843394 824902 809255 796162 784796 775019 767020 760033 752809 745385 739123 734776 731589
62216 731589 728580 725677 723153 720839 718490 716408 715144 714940 715713 717326 719567 722114 724703 727212 729575
62201 729575 731814 734155 736872 740034 743572 747464 751652 755907 760092 764426 769279 774774 780769 787024
62187 787024 793175 798849 804069 809264 814539 819197 822407 824153 825253 826731 829463 834159 841206 850644
62173 850644 862544 877235 894979 915766 939667 966881 996927 1028138 1058443 1086442 1111361
62162 1111361 1132331 1148282 1158458 1162678 1161331 1155442 1146458 1135430 1122435 1106954 1088578 1067183
62150 1067183 1042865 1016131 987899 959091 930511 903254 878569 856967 838053 821620 808288
62139 808288 798453 791205 784927 778566 771753 764251 756074 747835 740186 733014 725657 717692 709200 700757
62125 700757 693655 689543 689181 691865 696585 703174 711781 722005 733419 746237 760286 773734 784018
62112 784018 789949 792031 791057 787539 782490 777544 773839 771290 768984 765701 760255 752148 742071 731331
62098 731331 720920 711528 704031 699089 696454 695405 695691 697328 699826 702502 705433 709185 713740 718533
62084 718533 723436 728805 734653 740703 747273 755129 764430 774658 785666 797910 811595 826433 842354
62071 842354 859616 878092 897278 917053 937609 958495 978539 996814 1012766 1025345 1033034 1035164
62059 1035164 1032456 1025990 1016384 1004210 990300 975195 958921 941545 923250 903627 881752 857468
62047 857468 831964 806707 782357 759018 736861 716057 696621 678674 662388 647368 632738
62036 632738 618221 604612 592801 582821 574204 566706 560178 554120 547900 541237 534274 527433 521322
62023 521322 516342 512158 507920 503219 498455 494082 489974 485873 482071 479239 477700 477116 476853 476574 476541
62008 476541 477189 478359 479276 479606 480103 481722 484466 487701 491199 494935 498166 499800 499792 499150 498359 496656
61992 496656 493190 488050 481875 475169 468352 461776 455353 448745 442115 436044 430581 425221 420088 416199
61978 416199 414035 412602 410531 407564 404496 402161 400920 400608 400475 399578 397661 395374 393456 392177 391652
61963 391652 392001 392894 393646 394125 394958 396537 398564 400922 404128 408345 412782 416770 420804 425739 431609
61948 431609 438059 445396 454258 464579 475819 487982 501517 516304 531537 546650 561574 576097
61936 576097 589703 602302 614474 626646 638449 649108 658205 665750 671773 676133 678622 679065 677321
61923 677321 673426 667831 661397 655019 649284 644689 642068 642351 645725 651385 658509 667120 677627 689851
61909 689851 703063 716652 729990 741817 750631 755898 758241 758322 756190 751886 746039 739506 732774 725868
61895 725868 718424 709891 700220 690381 681582 673885 666271 658134 649921 642104 634385 626363 618247 610442
61881 610442 602978 595800 589066 582829 576976 571840 568232 566417 565658 565277 565586 567209 569986 573163 576332
61866 576332 579686 583666 588836 595796 604809 615746 628600 643555 660218 677426 694405 711753
61854 711753 730706 751770 774586 798753 824051 849937 875408 899452 921394 940833 957434
61843 957434 970705 979931 984618 985057 982119 976426 968216 958222 948133 939842 934553 932766 934626 939965
61829 939965 948320 959119 971503 983947 994697 1002827 1008331 1011038 1010142 1005046 995932 983192 967043
61816 967043 948103 927517 905941 883151 859282 835699 813891 794115 775890 759211 744412
61805 744412 731246 719016 707464 696889 687604 679800 673593 668571 663681 658231 652743 648209 644813
61792 644813 641937 639095 636198 633209 630269 627886 626300 624895 622942 620752 619369 619196 619627 619953 619954 619522
61776 619522 618438 616783 615217 614587 615256 616780 618183 618921 619728 622089 626593 632276 637917 643425 649406
61761 649406 655929 662424 668439 673695 677593 679436 679095 676901 672964 667188 659919 652008 644189 636769
61747 636769 629845 623480 617719 612737 608814 605928 603606 601427 599331 597157 594369 590812 587306 584885
61733 584885 583627 582736 581555 580009 578317 576838 576020 575946 576006 575346 573539 570607 566875 563191 560761 560105
61717 560105 560428 560603 560395 560169 559787 558641 556600 554218 551960 549757 547315 544418 540954 536944 532493
61702 532493 527569 522167 516828 512427 509131 506186 503199 500857 499728 499068 497713 495600 493423 491238
61688 491238 488497 485189 481895 478796 475587 472316 469418 466939 464559 462343 460609 459081 457042 454423
61674 454423 451937 450053 448548 447170 445981 444922 443693 442265 440972 440045 439549 439717 440681 441866 442348
61659 442348 441880 440987 439996 438705 437165 436114 436268 437583 439468 441444 443489 445967 449289 453466 458066
61644 458066 462673 467087 470868 473228 473800 473065 471541 469071 465478 461334 457282 453128 448554 444239 441202
61629 441202 439281 437432 435407 434002 433588 433486 433027 432270 431482 430789 430532 431122 432220 432737 431916 429887 427106
61612 427106 423903 420683 417882 415537 413356 411190 408899 405972 402050 397715 393935 390841 387890 385106
61598 385106 383121 381969 380908 379636 378651 378149 377582 376693 376035 376014 376181 375916 375126 373920 372303 370590 369455
61581 369455 369196 369470 369983 370825 371879 372599 372659 372293 371830 371494 371711 372805 374251 375063 375147 375429 376384 377339
61563 377339 377607 377486 377673 378445 379807 381673 383505 384551 384900 385554 387021 388562 389305 389341 389267 389418 390100
61546 390100 391815 394584 397668 400546 403513 406722 409371 410665 411029 411576 412810 414605 417050 420418 424382
61531 424382 427928 430104 430529 429397 427317 424990 422717 420374 417907 415407 412666 409358 405951 403663
61517 403663 403015 403041 402515 401365 400274 399446 398578 397680 397107 396935 396928 397007 397252 397514 397506 397228 396986 397070 397642 398735
61497 398735 400162 401732 403708 406658 410598 414663 417979 420515 422776 425049 427299 429432 431252 432405
61483 432405 432658 432026 430521 428197 425639 423883 423520 424296 425756 427729 429905 431620 432558 433168 433924 434697
61467 434697 435251 435804 436572 437296 437777 438346 439280 440266 441081 442245 444285 446813 449121 451232 453523 455726
61451 455726 457295 458630 460830 464215 467969 471330 474251 476700 478255 478917 479609 481310 484068 487310 490715
61436 490715 494241 497591 500292 502300 504079 505999 508044 510155 512426 514671 516196 516451 515718 514659 513319
61421 513319 511216 508382 505590 503243 500798 497748 494497 491615 488865 485794 482825 480751 479411 477868
61407 477868 475797 473699 471755 469537 466993 464749 463121 461631 459833 457919 456279 455133 454736 455193 455885
61392 455885 455889 455209 454831 455362 456438 457644 459066 460687 462216 463885 466368 469530 472373 474770 478051 483048
61376 483048 488610 493066 496328 499557 503482 508116 513500 519592 525693 530943 535179 538632 541231 543002
61362 543002 544765 547529 551380 555719 560387 565817 572230 579359 586906 594683 602293 609091 614438 617875
61348 617875 619360 619498 619062 618096 616022 612830 609384 606249 603039 599424 595848 592607 589145 585114 581339
61333 581339 578722 576812 574458 571373 568137 565206 562898 561855 562418 563858 565205 566505 568350 570576
61319 570576 572568 574621 577824 582636 588523 595050 602475 611250 621663 633879 647615 661917 675872
61306 675872 689306 702058 712998 720731 725111 727130 727542 726562 724731 722854 720932 718135 714065 709214
61292 709214 704043 698444 692294 685814 679148 672245 665342 659008 653590 649148 645902 644116 643519 643469 643781
61277 643781 644825 646775 649339 652253 655473 658853 662149 665389 668809 672613 677310 684036 693755 706099
61263 706099 719525 732586 744498 754648 762328 767036 768625 767256 763632 758916 753745 747604 739919
61250 739919 731411 723514 716715 710551 705062 701075 698946 698141 698345 699928 702835 705886 707800 708433 708598
61235 708598 709152 710624 713332 717464 723109 730151 737887 745003 750575 755057 759785 765507 771938 778677
61221 778677 785920 794246 804227 816181 829712 843478 856018 866856 876392 884967 892735 900242 908269
61208 908269 917069 926494 936844 948799 962485 977459 993688 1011726 1031705 1052906 1074574 1096476
61196 1096476 1118383 1139552 1158984 1175802 1189395 1199777 1207815 1214505 1219955 1223609 1225393 1225940 1225695
61183 1225695 1224537 1222412 1219616 1216305 1212422 1208310 1204825 1202611 1201650 1201475 1201417 1200865 1199940 1199762 1201377 1204576
61167 1204576 1208469 1212882 1218262 1224483 1230970 1237911 1246104 1255432 1264772 1273716 1283168 1293759 1304749
61154 1304749 1315011 1324146 1331958 1337693 1340443 1339661 1334812 1325288 1311278 1294186 1275650 1256632 1237693
61141 1237693 1219446 1202286 1186334 1172011 1160038 1150405 1142050 1134068 1126682 1120596 1115983 1112604 1110345
61128 1110345 1109079 1108496 1108554 1109726 1112320 1115857 1119526 1122951 1126299 1129948 1134252 1139249 1144491 1149493 1154307
61113 1154307 1159103 1163322 1166078 1167493 1168694 1170125 1170599 1168458 1163010 1154468 1143196 1129567 1114093
61100 1114093 1097154 1078820 1059120 1038248 1016543 994672 973687 954245 935932 918023 900730
61089 900730 884835 870366 856826 844578 834549 826396 818479 810131 802559 796804 792164 787431 782502
61076 782502 777856 773544 769676 766975 765815 765461 765120 764993 765514 766470 767801 770408 775011 780859 786649
61061 786649 792229 798407 805641 813915 823467 834592 847020 860323 874630 890114 906207 922170
61049 922170 938102 954548 971386 987943 1004033 1020144 1036738 1053916 1071616 1089699 1108084
61038 1108084 1127005 1146685 1166565 1185675 1204203 1223829 1246029 1270966 1298588 1329602 1364461
61027 1364461 1402438 1442706 1485264 1529799 1574948 1620311 1668240 1722036 1783180 1852026 1930263
61016 1930263 2020443 2123347 2237925 2363928 2503011 2657710 2831810 3032110 3267873 3548124
61006 3548124 3881131 4276368 4744715 5297228 5947944 6720088 7647641 8771396 10138273
60997 10138273 11799805 13783068 16022562 18301014 20280090 21641622 22249641 22208262
60989 22208262 21782498 21268801 20913194 20880544 21214872 21782689 22275409 22328748 21700930 20379373
60979 20379373 18547369 16463613 14355619 12376818 10610037 9084753 7795290 6718575
60971 6718575 5826961 5092927 4489878 3994062 3586556 3252372 2977985 2750547 2558925
60962 2558925 2394499 2251072 2124585 2012539 1912862 1823198 1741539 1667174 1600353 1541040
60952 1541040 1488440 1441576 1399570 1361102 1324130 1286579 1247277 1206259 1164595 1123975 1085819
60941 1085819 1050329 1016698 984516 954444 927135 902105 878471 856329 836403 818539 801621
60930 801621 785091 769510 755399 742521 730694 720360 711685 703898 696202 688687 681671 674811 667730
60917 667730 661080 656100 653294 652117 651691 651202 649967 647868 645567 643645 641698 638825 634834 630358 625998
60902 625998 621940 618233 614736 610944 606457 601588 596989 592792 588702 584732 581238 578277 575587 573171
60888 573171 571327 570116 569346 569101 569707 571131 572920 574792 576794 578820 580398 581049 580553 578862 576136
60873 576136 572811 569265 565490 561491 557853 555364 554059 553106 551783 550176 548892 548386 548646 549263 549738
60858 549738 549894 549928 549868 549234 547498 544742 541578 538628 536313 534789 533703 532306 530267 528107 526302 524267
60842 524267 520815 515490 508886 501744 494340 486715 479062 471791 465497 460677 457188 454243 451345 448879
60828 448879 447367 446564 445933 445616 446153 447416 448661 449520 450210 450785 450995 450946 451189 451919 452618 452650 451851 450573
60810 450573 449560 449602 450762 452072 452532 452178 451593 450669 448810 446211 443925 442462 441188 439348 436890 434055
60794 434055 430903 427627 424668 422146 419691 417099 414611 412370 410153 407926 406057 404669 403321 401704
60780 401704 400134 398973 397993 396770 395372 394253 393666 393500 393539 393696 394135 395209 397058 399230 401014 402248
60764 402248 403437 405071 407156 409455 411731 413703 415174 416310 417448 418600 419648 420998 423408 426964
60750 426964 430903 434807 439372 445409 452379 458507 462261 463404 462711 461039 458761 455882 452518 449121
60736 449121 446122 443482 440854 438130 435554 433310 431277 429249 427090 424670 421970 419373 417492 416531
60722 416531 415962 415028 413424 411398 409275 407063 404587 401927 399560 397846 396471 394725 392406 390070 388263
60707 388263 386924 385776 384847 384246 383762 383134 382400 381623 380576 379085 377437 376030 374966 374348 374608 376025
60691 376025 378222 380589 382840 384761 386011 386840 388417 391563 395567 399202 402551 406721 411895 416874
60677 416874 420722 423874 427294 431334 435644 439527 442109 442792 441864 440232 438425 436267 433505 430231 426724
60662 426724 423415 420938 419637 419138 419003 419578 421380 423836 425638 426387 426935 427984 429335 430754 432522
60647 432522 434606 436053 435808 433688 430239 426126 421990 418360 415371 412869 410856 409436 408399 407441 406784
60632 406784 406870 407502 408087 408705 410005 411877 413258 413571 413464 413702 414283 415084 416496 418674 420824 421949 421898
60615 421898 421171 420102 418736 417156 415514 413997 412971 412734 412992 413070 412825 412784 413159 413410 413069 412390 411868
60598 411868 411747 412280 413822 416233 418827 421370 424506 428725 433445 437666 441046 443841 446242 448304 450176
60583 450176 451932 453375 454419 455385 456621 458075 459472 460687 461802 463116 465185 468448 472727 477488
60569 477488 482586 488311 494744 501732 509452 518236 527775 537317 546730 556422 565991 573949 579210 581948
60555 581948 582635 581247 578092 574471 571575 569330 567065 564809 563249 562921 564154 567430 573135 581110 590866
60540 590866 601966 614043 627065 641869 659777 681230 705434 731714 760312 791197 822766
60529 822766 852525 878413 898759 911718 916013 912177 902219 888043 870783 851442 831396 812076
60517 812076 794473 778966 765392 753422 743108 734954 729374 726364 725699 727054 729948 734177 740386
60504 740386 749537 761744 776453 794000 816063 844174 878575 918910 964988 1016234 1071238 1128535
60492 1128535 1187058 1245202 1300441 1350850 1396279 1437084 1472295 1499906 1518308 1526407 1522939 1506865
60480 1506865 1478263 1437898 1386341 1324515 1255021 1181894 1109001 1039145 974322 915809 863912
60469 863912 818209 778084 742754 711282 683210 658835 638274 620667 604965 591018 579071
60458 579071 568628 558758 549312 540966 534186 528871 524781 521531 518331 514600 510704 507390 504652 501961
60444 501961 499354 497371 495914 494156 491719 489218 487423 486518 486318 486606 487026 487119 486675 485784 484590 483343
60428 483343 482592 482862 484082 485629 486874 487424 487100 486180 485555 486157 488246 491439 495211 498987 502056 503977
60412 503977 505034 505892 506791 507347 507075 505956 504635 504093 504831 506334 507749 509076 511073 513957 517038 519871
60396 519871 522812 526000 528812 530954 533152 535941 538686 540743 542777 545794 549568 553207 556680 560490
60382 560490 564295 567279 569686 572603 576196 579465 581975 584636 588338 592754 596941 600485 603635 606711
60368 606711 609641 611915 613070 613465 614280 616259 618874 621325 623927 627682 632828 638806 645544 653752 663770
60353 663770 674891 685996 696242 705014 711772 716132 717805 716580 712728 707150 700621 693165 684718
60340 684718 676024 668142 661333 655154 649434 644358 639815 635488 631501 628201 625323 622110 618292 614342
60326 614342 610854 608242 606846 606644 606977 607279 608009 610155 614022 619206 625600 633525 642786 652337 661032
60311 661032 668175 673349 676262 676843 675166 671468 666649 662407 660238 660440 662413 665521 669120 672379 674844
60296 674844 676747 677952 677079 672651 664787 654868 643906 632277 620703 610189 600941 592272 583731
60283 583731 575610 568432 562640 558606 556175 554398 552381 550128 547938 545614 543146 541497 541476 542378 542969
60268 542969 543357 544515 546394 548111 549693 551939 554610 556510 557523 558889 561153 563474 565388 567612
60254 567612 570394 572502 572735 571329 569154 566519 563471 560375 557524 554923 552841 551712 551115 549882 547751
60239 547751 545955 545635 546563 548005 549906 552535 555704 559079 562764 566948 571464 576139 581184 586912 593391
60224 593391 600477 607716 614315 619943 625511 632279 640152 647768 654368 660533 666909 673273 679211 684759
60210 684759 689945 694530 698603 702604 706455 709445 711177 711867 711578 710128 707903 705690 703412 700088 695342
60195 695342 689911 684317 678249 671707 665631 660762 656850 653539 651048 649396 647942 646382 645375 645554
60181 645554 646669 648150 649696 650874 651142 650814 651099 652561 654412 655828 656995 658242 659119 659093 658410 657558
60165 657558 656597 655606 655022 654939 654828 654506 654633 655749 657607 659936 662936 666423 669434 671339 672589 673808
60149 673808 675023 676378 678610 682085 686183 690239 694219 697931 700735 702819 705696 710468 716549 722979
60135 722979 729901 737576 744895 750214 753105 754136 753525 751274 748215 745639 743902 742256 739958 736894
60121 736894 733370 729911 726995 724471 721562 717836 713660 709425 705121 701145 698494 697326 696188 693637
60107 693637 689973 686512 683796 681534 679707 678623 678220 678212 678694 679872 681546 683507 685999 689157 692419
60092 692419 695163 697436 699410 700740 701185 701304 701770 702470 702931 703075 702901 702111 700759 699503 698362 695893
60076 695893 690633 682751 673436 663306 652550 642030 632956 625605 619378 613932 609427 605914 603313
60063 603313 601720 600986 600296 598965 597412 596601 596853 597860 599443 601584 604105 607017 610757 615309 619680
60048 619680 623035 625814 628795 631585 633054 632897 631733 629949 627457 624402 621130 617587 613589 609597
60034 609597 606428 604290 602668 600929 598449 594511 588855 582081 574936 567552 559917 552531 545870 539734
60020 539734 533954 529209 526176 524321 522500 520528 519224 519130 520012 521316 522353 522339 521158 519848 519528 520017
60004 520017 520208 519562 518578 518095 518756 520807 523710 526308 527978 529264 530926 532965 535186 537862 540994
59989 540994 543636 544976 545390 545440 544573 542052 538583 535681 533741 532013 530198 528850 528276 528148 528174 528297
59973 528297 528382 528431 528831 529743 530760 531986 534695 539833 546484 553007 559156 565786 572989 579888 585859 590536
59957 590536 592966 592303 589253 585474 581604 577110 571918 566758 561970 557347 553221 550326 548442 546450
59943 546450 543973 541838 540827 541084 542833 546448 551516 556934 562261 568116 575022 582628 590063 596221
59929 596221 599774 599940 597323 593224 588272 582552 576715 571835 568302 565977 565271 566857 570426 574937 580065
59914 580065 586241 593406 600971 608860 617203 625093 631217 635835 640487 645415 648782 649045 646767 643455
59900 643455 639859 636137 632657 629741 627204 624686 622050 619308 616753 615194 615272 616588 618337 620709 624678
59885 624678 630424 637103 644225 652041 660328 667944 673987 678522 681971 684668 687146 689841 692359 693938
59871 693938 694740 695677 696957 697847 697948 697573 696751 695041 692458 689449 685823 680903 674882 668826 663165 657510
59855 657510 652155 648365 646760 646719 647830 650617 655301 661152 667735 675633 685159 695191 703896 709964
59841 709964 712966 713490 713295 714412 717772 723378 731550 742485 754499 764341 769865 771181 768953 763199
59827 763199 754431 744335 734274 724238 714083 704689 697087 691487 687887 686481 686659 686775 685863 684613
59813 684613 683852 683050 681277 678674 676121 674214 673326 673753 674900 675221 673818 671371 668779 665854 662247
59798 662247 658650 655935 653763 651140 647820 644266 640689 637020 633460 630309 627576 625278 623628 622467
59784 622467 621134 619425 618133 618107 619431 621915 625544 629892 633956 637366 641023 645826 651428 656968 662357
59769 662357 668057 674234 680912 688436 696962 705877 714391 722351 729983 737288 744197 750905 757542 764002
59755 764002 770485 777688 785962 794712 803017 810490 817331 824016 831061 838445 845138 849898 852618 854165
59741 854165 854899 854375 852561 850132 847323 843697 839402 835376 831918 828354 824614 821720 820023 818394 816053
59726 816053 813877 812829 812339 811385 810131 809287 808744 808088 807702 808217 809439 810814 812361 814296 816421 818792
59710 818792 822295 827566 833917 840189 846057 851646 856545 860200 862873 865389 868358 872126 876779 881513
59696 881513 884764 885752 885202 883976 881865 878547 874808 871780 869574 867526 865160 862155 858077 852971 847574
59681 847574 842280 836644 830471 824346 818420 811847 804443 797726 793056 789737 786296 782784 780435 779723
59667 779723 780166 781538 783934 787027 790406 794352 799184 804270 808724 812635 816569 820294 822973 824261
59653 824261 824280 822977 820350 816753 812114 805461 796152 785034 773493 762130 751292 741948 734673 728393
59639 728393 721583 714345 708122 703704 700575 697788 694353 689220 682021 673564 664657 654982 644119 633024
59625 633024 623249 615192 608277 602380 597806 594235 590961 587892 585230 582533 579309 576167 574255 573814
59611 573814 574350 575784 578292 581364 584235 586921 589748 592236 593670 594383 595300 596517 597491 598246 599151 599890
59595 599890 599938 599736 600091 600752 600890 600705 601134 602189 603001 603367 603910 604746 605307 605485 605727 606041 606085 606073 606388
59576 606388 606488 605549 604040 603230 603178 602706 601433 600290 599752 599060 597717 596476 596189 596621 596896 596431 595173
59559 595173 593651 592910 593552 594820 595513 595762 596872 599320 602099 604315 606376 609137 612843 617478 623452
59544 623452 631391 641624 654322 669866 688630 710052 731567 748635 756925 755401 747082 736423
59532 736423 726479 718667 713771 711772 711427 711332 711116 710783 709735 707620 705341 703798 702214 699098 694264
59517 694264 688410 681433 672925 663894 655977 649067 641609 633306 625716 620005 615879 613023 611777 611874 612148
59502 612148 612192 612935 614889 617089 618405 618841 618913 618758 618438 618291 618495 618952 619832 621377 623120 624237 624796
59485 624796 625652 626988 628100 628839 630087 632438 635508 638959 643175 648375 653853 658581 661977 663855 664408
59470 664408 664470 665118 666736 668993 671686 674967 678870 683429 689083 696064 703496 710141 715983 722065 728814
59455 728814 735537 741569 746832 751239 754630 757388 760074 762396 763488 763223 762288 760997 759187 757211 755876
59440 755876 755263 754792 754568 755568 758259 762109 766578 771609 776987 782263 787527 793340 799829 806719 814270
59425 814270 823266 834021 846227 859588 873724 887665 900597 913148 927197 944548 966017 990495
59413 990495 1013476 1027826 1028456 1016484 997574 976892 957310 941294 931462 928974 933613 945380
59401 945380 963297 982224 993856 992599 979119 957738 932505 906589 882847 862825 846196 832378
59389 832378 821724 814386 809437 806071 804433 804413 804843 804851 804842 805374 806107 806564 806775 806559 805400 803652 802550
59372 802550 802431 802299 801772 801868 803078 804257 804500 804724 806197 808715 811450 814560 818765 824136 830305 837199
59356 837199 844877 853345 863110 874921 888504 902580 916614 931277 946657 961484 974774 986711
59344 986711 996950 1003618 1005296 1002763 997481 989443 977860 963114 946687 929724 912712 895984
59332 895984 879574 863078 846541 831033 817715 806794 797722 789711 781754 773204 764800 758134 753609
59319 753609 749928 746048 742354 739331 736378 732876 729327 726558 724654 723455 723206 724022 725571 727889 731616
59304 731616 736967 743496 751278 761161 773442 787589 803608 821867 840601 855164 861231 858083 848222
59291 848222 835071 821772 810660 802434 796436 792432 791153 792685 795791 799683 805071 812585 821515
59278 821515 831085 841632 853408 865512 877113 888566 900240 911351 921025 929388 936655 942293
59266 942293 946074 948750 950694 951098 949477 946692 943441 939069 932968 925802 918146 909251 898446 886573
59252 886573 874831 863451 852726 843910 837685 832910 828349 824488 822212 820847 819062 816764 814622
59239 814622 812517 809815 806436 802518 797870 792724 788016 783901 779098 772722 765587 758735 752045 745377
59225 745377 739484 734500 729095 722565 716237 711320 706971 702119 697563 694290 691212 686707 681231 676354
59211 676354 672266 668183 664142 660424 656223 650964 645996 642969 641417 639906 638572 638443 639157 639598 640073
59196 640073 641646 643905 645540 646635 648293 650438 652051 653244 655123 657888 660844 663919 667446 670891
59182 670891 673501 675714 678203 680187 680524 679891 679970 680975 681912 682775 684460 686884 689075 690797 692363 693387
59166 693387 693495 693599 694520 695054 693577 690805 688639 686837 683458 678350 673481 669766 666091 661804 657736
59151 657736 654247 650475 646152 642230 639080 635805 631900 627989 624432 620703 616567 612556 608975 605732
59137 605732 603268 602336 602761 603690 605033 607299 610158 612682 614966 618017 622117 626679 631562 637028 642664
59122 642664 648011 654130 662803 674181 686814 699939 714028 729098 744200 758838 773400 788043
59110 788043 802456 816641 830503 842803 851965 857837 861247 862126 859641 853945 846206 837114 826935
59097 826935 816670 807436 799018 790789 783652 779183 777178 776105 775682 776780 778898 780082 779516 778038
59083 778038 775877 772109 766729 761153 756182 751332 746545 742541 739094 734881 729660 724778 721031 717724
59069 717724 714265 710907 707479 703201 698312 694171 691154 688109 684449 681198 679339 678574 678296 678402 678722
59054 678722 678946 679460 680962 683029 684432 684959 685469 686114 686187 685833 686234 687787 689731 691720 694141 696769
59038 696769 698938 701313 705676 712580 720863 729740 739693 750994 763162 776298 791154 807284 822684
59025 822684 835767 846340 854400 859424 861182 859879 855452 848072 839205 830546 822113 813154 804584 798396
59011 798396 794808 792284 790416 790455 792795 796337 800766 807110 815440 824174 832167 839462 845560 849218 850541
58996 850541 851080 851305 850187 847769 845802 845049 844177 842168 839726 837602 835761 834941 836745 841157 846110
58981 846110 850516 855701 862979 871952 882193 894435 908855 924072 938920 953424 967145 978630
58969 978630 987566 995570 1003775 1011509 1018291 1025093 1032378 1038789 1043027 1045432 1046586 1045966 1042943 1037598
58955 1037598 1029725 1018732 1005260 991198 977415 963292 948949 935817 924373 913589 903467
58944 903467 895844 891713 889919 889330 889945 890988 890566 888553 887345 888389 890240 891376 892453 894266 895883
58929 895883 896480 896762 896861 895106 890691 885516 881609 878752 876347 875408 876697 878872 880582 882784 887130
58914 887130 893711 902063 912569 925036 937636 949169 960806 973933 987889 1001456 1014722 1027703
58902 1027703 1039054 1048116 1056519 1065727 1074576 1081225 1086090 1090999 1097038 1105049 1116552 1131960 1149209
58889 1149209 1166050 1182468 1199103 1214814 1227738 1237371 1243802 1246274 1244406 1239490 1232819 1224059 1212982
58876 1212982 1201319 1191067 1182295 1174352 1167743 1162913 1158648 1153574 1147947 1142195 1135154 1125635 1114443
58863 1114443 1103000 1091160 1078052 1063779 1048719 1032631 1016066 1001080 988790 977751 966268
58852 966268 954530 942759 929308 912827 894619 876730 859253 841602 824785 810176 797444
58841 797444 785761 775608 767455 760286 753457 748291 745744 744351 742679 741908 743565 746545 749027 751509
58827 751509 755211 759173 761885 764336 768372 773217 776649 778586 780666 783171 785077 786320 787372 787418 785499
58812 785499 782641 780431 778405 775183 771087 767134 762628 756387 749362 743348 738052 732074 725780 720452
58798 720452 715488 709307 702298 696207 691277 686674 682946 681316 681161 680938 681076 683303 687493 691732 695165
58783 695165 698443 701847 705210 709175 714327 719735 724381 729131 735077 740977 744642 745836 745456 743065
58769 743065 737933 731475 725927 721459 717131 713529 711629 710177 707204 703292 700348 698029 694466 689735
58755 689735 685461 681637 677005 672063 668597 666643 664958 664034 665603 669500 674041 679200 686450 695758
58741 695758 705582 715563 726459 737781 748334 758633 769962 781591 791751 800738 810031 818996
58729 818996 825662 830199 834397 838310 840757 842588 845794 849685 851636 851561 852038 853976 855778 856951 858844
58714 858844 861337 862258 860675 857581 852910 845103 834093 821573 807801 791225 771714 751105 730149
58701 730149 708086 685765 665967 649848 635943 623315 612779 604399 596686 589068 582511 577081
58689 577081 571525 565757 561146 557901 554763 551625 549813 549402 548947 548182 548318 549490 550653 552215 555954
58674 555954 562085 569229 577339 587731 600099 612589 625102 639364 655370 670751 683922 694762
58662 694762 702011 703377 698804 690603 679954 666472 651476 638140 627596 618061 608535 600268 593987
58649 593987 588884 585078 583846 584672 585116 584384 584051 584717 585069 584837 585406 586784 587064 585636 583888 582207
58633 582207 579508 576302 574842 575502 576220 576159 576634 577855 578200 577534 577836 579771 581945 584138 587829 592887
58617 592887 597359 601118 605981 611508 614691 614708 614052 613993 613022 610924 610132 611462 612578 612326 612644 614439
58601 614439 615474 614342 612874 612641 612634 612334 613643 617692 622951 628371 635294 644585 655121 666701 680990
58586 680990 697818 713952 727376 739551 751688 762219 769815 775612 780642 784292 787065 791605 799265
58573 799265 808859 820303 835961 856698 880207 905097 933011 964756 997815 1029579 1059492 1086133
58561 1086133 1105955 1117185 1121663 1121059 1114888 1104096 1092606 1082927 1073868 1064705 1057694 1053995 1050865
58548 1050865 1045562 1038499 1030163 1018613 1002708 984388 965177 943907 920339 897408 877198 858185
58536 858185 839071 821780 807922 795826 783914 773588 766024 759463 752461 746481 742610 739138 735061
58523 735061 732454 732581 733135 732099 730836 730622 729735 726883 723852 721882 719052 714210 709776 707604 705847
58508 705847 702984 701080 701749 702726 701892 700894 701257 700784 697676 694638 694945 697721 700801 704961 711567 719332
58492 719332 727136 736869 749819 763506 775735 788470 804124 821421 838575 856889 877238 896432
58480 896432 911199 922586 932492 939180 940269 936930 931126 921950 908785 894885 883755 875024 867575
58467 867575 863252 863457 865605 867178 869865 875626 882313 887570 893397 902249 912050 919694 925970 932241
58453 932241 935737 933134 925727 916418 904896 890555 876716 866685 858628 849326 839972 833358 828529
58440 828529 823324 819112 817851 817416 815013 812425 812897 815708 818647 822719 829440 836674 842133 847725 855405
58425 855405 862219 864727 864734 865207 864237 858922 851681 846582 842672 836994 830942 827382 824580 819311 813047
58410 813047 808890 805427 799966 794799 793765 795450 796284 797483 802332 809404 815181 820721 829018 838362
58396 838362 845057 850193 857064 864531 869620 874028 881170 889423 895178 899968 907562 916604 923241 928447
58382 928447 935610 943426 948420 952099 958301 965928 971413 975745 981789 987474 989276 989762 994020 1001329
58368 1001329 1008030 1015558 1027354 1040664 1050004 1056257 1063848 1071490 1074479 1073804 1074014 1074254 1070359 1063836
58354 1063836 1059879 1058427 1056042 1054421 1057897 1064629 1069591 1074261 1083910 1097332 1108997 1119458 1133719
58341 1133719 1151016 1166208 1179710 1195996 1213759 1227654 1238364 1250738 1263492 1271180 1274963 1280874
58329 1280874 1288636 1292863 1294013 1297335 1302262 1303965 1304268 1309591 1318976 1325565 1329162 1335861 1346089 1354805
58315 1354805 1362813 1375815 1392612 1406322 1416961 1430757 1447446 1460738 1471193 1485855 1505005
58304 1505005 1521899 1535832 1552733 1572570 1589134 1602658 1619751 1640506 1658672 1674678 1695134
58293 1695134 1719320 1739943 1757466 1779587 1806285 1829864 1850238 1875285 1905477 1933329 1958896
58282 1958896 1990334 2028077 2064269 2099060 2141352 2191908 2241907 2289663 2342179 2398625 2449573
58271 2449573 2494708 2543977 2599034 2651060 2698953 2751522 2809241 2862426 2910122 2961886 3018280
58260 3018280 3069121 3114023 3164500 3222479 3277357 3327929 3385979 3454137 3521872 3587753 3663440
58249 3663440 3750874 3838225 3923500 4018958 4126920 4235106 4341522 4459330 4591081 4723458
58239 4723458 4853862 4996181 5153665 5313013 5472243 5646479 5838875 6034834 6232669
58230 6232669 6449737 6690052 6937442 7189542 7465575 7771190 8090311 8421870 8788194
58221 8788194 9195963 9627021 10079712 10579177 11133929 11724811 12351126 13043148 13813986
58212 13813986 14646830 15546527 16553300 17687866 18937661 20317354 21885206 23679425
58204 23679425 25703377 27998779 30666587 33794541 37446598 41754716 46931613 53156761
58196 53156761 60548939 69294594 79701613 92106853 106900278 124724933 146519225
58189 146519225 173343796 206371638 246827848 294809228 346922901 395076857 428936182
58182 428936182 441083264 430671649 402663275 364108617 321058468 277731627 236896986
58175 236896986 200183348 168246042 141100649 118455296 99817574 84547167 72022617
58168 72022617 61760927 53359777 46429030 40646718 35807728 31756156 28324494 25378242
58160 25378242 22854380 20705097 18849851 17217882 15787017 14542174 13438343 12437122
58152 12437122 11537978 10741399 10018696 9346701 8735670 8194843 7703948 7244447 6826237
58143 6826237 6458122 6122508 5803703 5512333 5258068 5025133 4797197 4580894 4383440
58134 4383440 4191982 3996310 3808835 3641678 3485679 3330981 3186836 3062185 2947017
58125 2947017 2831299 2723013 2629967 2542623 2452117 2367183 2296504 2231563 2163058 2097499 2041829
58114 2041829 1988033 1928512 1871001 1823170 1777610 1726700 1677379 1636813 1598032 1554064 1512114
58103 1512114 1479513 1449417 1414554 1381844 1359320 1341216 1319727 1299288 1285659 1272812 1254095
58092 1254095 1235037 1222049 1209578 1191315 1173107 1161846 1152100 1136521 1119253 1106303 1092501
58081 1092501 1070821 1045368 1022821 999994 972082 944397 923665 905910 884763 863815 849146
58070 849146 837441 823000 808993 800473 793547 782565 770933 763951 758066 748085 738040 733827 731609
58057 731609 724486 714497 707313 700983 690663 678995 671269 665371 656513 646971 641411 637462 630337 621915
58043 621915 616117 610248 600116 588860 581698 576654 569373 562216 559638 559323 556797 554193 555517 557728
58029 557728 555443 550299 546986 544269 538593 532387 530027 529356 525675 520346 517261 514772 509510 504259
58015 504259 503559 505179 504328 502654 504657 508690 510061 509848 512198 515911 516972 516530 518247 520543 519565
58000 519565 517115 517581 519647 519003 516753 517094 518978 517983 514386 511666 509086 503363 495778 490173 485795
57985 485795 479418 472632 469646 469638 468456 466195 465980 467016 465883 463197 462109 461833 459387 455962 454766
57970 454766 454384 451137 446244 443688 442732 439622 435091 432983 432838 430973 427768 426840 427972 427838 426767
57955 426767 427930 430589 431036 429532 429678 431533 431963 431242 432710 436271 438680 440054 443804 450344 456925
57940 456925 463449 472473 483626 493818 502695 512258 521537 527379 530048 532393 533985 531716 525572 518110
57926 518110 508981 495913 480448 466672 454758 441845 428749 419446 414153 409264 404168 401839 402449
57913 402449 402565 401128 400315 400126 398047 394573 393177 394133 394059 392167 391281 392024 391747 390079 389919 391834 392862
57896 392862 391996 391680 392854 393556 393480 394915 398054 400155 400373 400770 401713 400966 398218 395868 394514 392262
57880 392262 389178 387766 388271 388145 386777 386161 386387 385358 383525 383861 386376 387793 387557 389021 393621 399039
57864 399039 404391 412029 422590 433226 442503 452363 463552 473755 482091 491007 501766 512268 521056
57851 521056 529380 537558 543475 546549 549160 552358 553973 552789 550787 549500 547809 544954 542121 539471
57837 539471 535291 529646 525254 523196 521372 518650 516794 516748 516786 516026 516126 517707 518638 517683 516485 516193
57821 516193 515444 513407 511631 511193 511098 510964 512158 514814 516784 516899 516170 514720 510976 505221 500482 498367
57805 498367 497319 496268 496594 498979 501740 503825 506318 509547 511976 513212 514761 516583 516472 514190 512506
57790 512506 512683 512665 511405 511109 513202 515661 516566 516876 517567 517276 515031 512349 510509 508523 505612 502727
57774 502727 499920 495284 488255 480959 474557 467472 458934 450961 444905 439355 433456 428919 426510 423870
57760 423870 419285 414585 411891 410332 408348 406463 405446 404426 403096 403151 405372 407908 409536 411910 416445
57745 416445 421759 426392 431303 437471 443668 448820 453855 459065 462475 463135 463323 465137 467612 469432 471604
57730 471604 475006 478158 480104 482798 487901 493820 498646 503460 509867 516686 522052 526629 531841 536924
57716 536924 540493 543092 545581 546968 546398 545243 544738 543592 540523 537008 534864 533233 530787 528832 529290
57701 529290 531386 533215 534951 537681 540647 542369 543088 543543 542833 540010 536314 533443 531176 528943 527925
57686 527925 529086 530907 531682 532445 535124 539587 545178 553360 565901 581883 599366 618722 641743
57673 641743 668877 700110 737246 782571 836522 899348 973355 1059685 1152556 1238761 1302717
57662 1302717 1331717 1319734 1270521 1196714 1112883 1028588 948298 875203 811979 759042 715141
57651 715141 679332 650574 626554 605231 586648 571272 557808 544723 532579 522568 514078 505979
57639 505979 498981 494255 490930 487355 483751 481312 479913 478916 478928 480392 481788 481681 481252 482285 483978
57624 483978 484376 483668 483347 483305 482576 481875 482564 483968 484410 484077 484254 484635 484138 483540 484504 486630 488068 488435
57606 488435 488638 488581 487617 486652 487207 488993 490671 492254 494425 496463 497333 497907 499559 501544 502424 503044 505141
57589 505141 507941 509226 509094 509507 510593 510593 509266 508232 507951 507276 506068 505503 505575 504961 503567 502845 503356
57572 503356 504226 505025 506044 506746 506089 504408 503084 502581 502628 503699 506171 508688 509697 510122 512118 515764
57556 515764 519391 522667 526680 531380 535603 539412 543860 548639 552447 555478 559095 563369 567419 571807
57542 571807 577956 585418 592344 598396 604569 610423 614382 616621 618837 621261 622742 623720 626054 629739
57528 629739 632834 634974 637993 642577 647191 650991 654991 659617 663736 666999 670675 675284 679722 683521
57514 683521 687852 693423 699381 705016 710700 716591 722205 727681 733687 739863 745207 750008 755417 761148
57500 761148 765811 769481 773514 777806 780838 782659 785152 788868 792219 794367 796408 799001 801293 802934
57486 802934 804840 807251 809300 811178 814390 819143 823786 827583 831702 836680 841280 844920 849004 854672
57472 854672 861191 867600 874074 880732 886924 892702 899285 907175 915361 923019 930421 937642 944168 950349
57458 950349 957396 965382 973018 979922 987238 995525 1003933 1012039 1020602 1029886 1039018 1047564 1056039 1064568
57444 1064568 1072822 1081422 1091419 1102213 1112163 1121392 1131599 1142929 1153591 1162983 1172555 1182954 1192985
57431 1192985 1202071 1211145 1220323 1228411 1235627 1244118 1254693 1265668 1275989 1286827 1298828 1310556
57419 1310556 1321135 1331854 1343522 1354682 1364151 1373072 1382785 1392917 1403242 1415128 1429131 1443260
57407 1443260 1455610 1467009 1479080 1491458 1502902 1513702 1525034 1537103 1549588 1562817 1577110
57396 1577110 1592068 1607619 1624389 1641999 1658623 1673406 1687666 1702592 1717608 1732282 1747877
57385 1747877 1765334 1783448 1800757 1817717 1835359 1853275 1870669 1888055 1906279 1924966 1943448
57374 1943448 1962053 1981211 2000492 2019784 2040103 2061928 2084048 2105310 2126192 2147451 2168649
57363 2168649 2189316 2210089 2231350 2252154 2271928 2291906 2313479 2336319 2359394 2382540 2405855
57352 2405855 2428850 2451383 2474137 2497166 2519439 2540813 2562728 2585838 2608787 2630711 2653046
57341 2653046 2677301 2702753 2728026 2753308 2779219 2805040 2829913 2854568 2880215 2906832 2933977
57330 2933977 2961901 2990471 3018469 3045522 3073232 3102840 3133252 3163031 3192814 3223936 3255993
57319 3255993 3287669 3318857 3350304 3382171 3414409 3447419 3481073 3514424 3547611 3582427 3619538
57308 3619538 3656923 3692683 3727620 3763261 3799230 3834680 3870562 3908161 3946829 3985396 4024407
57297 4024407 4064663 4104954 4143725 4181801 4221035 4261276 4301167 4340949 4381899 4423709 4464915
57286 4464915 4505516 4546847 4589229 4631830 4674516 4717888 4761851 4805909 4850422 4895798 4941004
57275 4941004 4984686 5027344 5070782 5115916 5162665 5211191 5261418 5311929 5361135 5409136 5456994
57264 5456994 5504825 5552104 5599056 5646126 5692850 5738840 5785034 5832387 5880243 5927656 5975320
57253 5975320 6024338 6074097 6123296 6172308 6222510 6274048 6326184 6379109 6433348 6488009 6541644
57242 6541644 6594358 6647140 6699632 6750450 6799222 6846467 6891985 6935205 6976716 7017640 7057856
57231 7057856 7096438 7133446 7169735 7205612 7241171 7277331 7314961 7353661 7392863 7433235 7475422
57220 7475422 7518471 7561271 7604530 7649426 7695387 7741291 7787809 7836166 7885423 7933463 7980104
57209 7980104 8026784 8073515 8118602 8161317 8202638 8243271 8282845 8321032 8357718 8392105 8423315
57198 8423315 8451754 8478469 8503531 8526541 8548216 8569828 8591451 8612320 8632414 8652172 8671213
57187 8671213 8688902 8705596 8721817 8736941 8750299 8762820 8775974 8789769 8803368 8816837 8830674
57176 8830674 8844530 8858096 8872298 8887885 8903819 8918714 8932794 8946625 8959210 8969317 8977464
57165 8977464 8984520 8989560 8991292 8990330 8987667 8982072 8971575 8956619 8939296 8920376 8899580 8878000 8857775
57152 8857775 8839839 8823850 8809106 8793196 8771157 8739047 8698086 8653309 8609140 8568387 8533921
57141 8533921 8508106 8490960 8481266 8478714 8482813 8490892 8499603 8507228 8512228 8511188 8501072 8482257 8456637
57128 8456637 8424303 8385166 8342393 8300963 8263991 8233429 8212859 8206119 8214139 8236066 8272090 8322169
57116 8322169 8383728 8454247 8534978 8629229 8738934 8866274 9016752 9197145 9412439 9668261
57106 9668261 9974043 10340179 10775059 11289591 11902889 12640455 13531088 14611304 15930609
57097 15930609 17548497 19530185 21949454 24889235 28431110 32646491 37601593 43361966
57089 43361966 49980828 57484274 65868117 75090892 85051492 95579365 106451037 117378586
57081 117378586 127928810 137460588 145222458 150597458 153296957 153351132 150964843 146408406
57073 146408406 139996829 132086826 123047531 113236920 103004744 92691114 82601008
57066 82601008 72979769 64010237 55817128 48465535 41965352 36288669 31385112 27186086
57058 27186086 23609792 20573795 18003344 15829132 13985749 12417281 11080189 9937852
57050 9937852 8956439 8107967 7372305 6732948 6173928 5682243 5249060 4866230 4524729
57041 4524729 4217895 3942635 3695914 3473111 3270875 3088344 2924484 2777177 2645642
57032 2645642 2530499 2430866 2344586 2271867 2215537 2177521 2158436 2159951 2181679 2213402 2234559
57021 2234559 2224949 2175352 2088576 1974716 1847018 1718085 1595949 1483788 1383330 1296124
57011 1296124 1221216 1154984 1094927 1041518 995424 955377 919933 888991 862465 839504 820006
57000 820006 804807 793475 783888 774831 767087 761292 756737 752983 750568 749289 747712 745310 743395 743245
56986 743245 744949 748749 755949 767558 782767 798492 809230 808286 791723 761560 723632 682667
56974 682667 641119 601636 567268 538833 514724 493941 477140 464460 454753 447514 443480 442927
56962 442927 445432 451605 463005 480257 503383 533694 572124 614670 651869 674171 676838 660211
56950 660211 628237 587522 545060 504999 468370 435857 408792 387317 370061 356441 347421 343448
56938 343448 343743 348243 358203 374137 395132 421145 454405 497506 550601 609714 665824 706241
56926 706241 720320 705761 668728 618210 561736 505259 453195 407088 366302 330912 302148
56915 302148 279819 261678 246069 233106 222691 213653 205587 199400 195181 191565 187948 185425 184747
56902 184747 185237 186443 188992 193110 198042 203574 210387 218457 226902 235757 246029 257777 270298 284499
56888 284499 302738 325819 352373 381391 412356 441969 463685 472319 467532 452060 428945 401700
56876 401700 374603 350743 330842 314934 303610 296872 293736 294060 299080 309296 323755 342429
56864 342429 367383 400548 442259 493202 555717 630991 715132 798254 866529 906202 909472 879055
56852 879055 826224 763441 699306 639252 587290 545296 512789 489153 474877 470016 473443 484587
56840 484587 504174 532595 569665 616845 677674 755205 850946 965820 1097391 1232986 1348467
56829 1348467 1418319 1428717 1382073 1292428 1178437 1057578 942006 837653 746795 670467
56819 670467 608386 558939 520968 494564 479394 473897 477179 490196 514143 549333 596803 659360
56807 659360 739172 834092 935500 1027915 1091899 1112193 1086448 1025478 944480 855370 766512
56796 766512 684684 613932 554447 505019 465398 435172 412582 396276 386423 382732 383598 388794
56784 388794 400745 421367 449979 486070 530894 582830 632835 667949 679278 665423 630343
56773 630343 580844 524937 469220 416940 369313 327557 292352 262798 237813 217608 202308
56762 202308 190382 180173 171769 165681 160917 156055 151112 146687 142480 138214 134744 132531 130248 126672
56748 126672 122721 119939 118143 116356 114834 114315 114285 113762 112880 112161 111306 110170 109753 110669 111847 112264 112639
56731 112639 113838 114998 114995 114513 114868 115970 117095 118417 120156 121508 122183 123623 126929 130894 133850 136044
56715 136044 138386 140308 140929 140969 141425 141595 140506 139133 139066 140069 140974 141889 143451 144972 145421 145330 145766
56698 145766 146384 146421 146566 147830 149553 150455 150732 151296 152004 152454 153384 155421 157516 158483 158887 159616 159953 159014
56680 159014 157714 157237 156920 155732 154435 154080 153864 152743 151697 151879 151988 150122 147011 144730 143425 142015
56664 142015 140940 141248 141960 141270 139646 138980 139413 139724 140091 141613 143754 145046 145825 147578 150126 152110
56648 152110 153678 155998 158719 160663 162512 165949 170494 173918 175478 176051 175512 172862 168775 165225 162550
56633 162550 159443 155727 152618 150331 147899 145313 143486 142206 140396 138226 136758 135900 134954 134669 136280
56618 136280 138973 140819 141743 143020 144379 144381 143213 142352 141751 140213 138240 137613 138316 138696 138560 139201 140461
56601 140461 140694 139730 139108 139281 139354 139517 140904 142992 144039 144169 145109 146838 147556 147197 147814 149969 151762
56584 151762 152077 151954 152086 151666 150547 149922 150133 150163 149879 150471 152091 153423 154089 155244 157348 159602 161892
56567 161892 165006 168622 171469 173738 177059 181905 187330 193253 200437 208143 214461 219203 223831 228435
56553 228435 231470 232668 233405 234031 233659 232774 232994 233935 233339 230808 228411 227115 225700 223739 222506 222164
56537 222164 221139 219084 217471 216455 214254 210562 207503 206125 204879 202746 200976 200512 200424 200143 200616
56522 200616 202036 202978 202856 202783 202968 201867 198917 195586 192714 189382 185334 181842 179180 175951 171936
56507 171936 168922 167613 166381 164208 162184 161011 159707 157960 157117 157666 158303 158557 159703 162057 164060
56492 164060 165145 166680 169008 170479 170667 171604 174356 177212 178714 179706 180901 181206 180098 179037 178952 178784
56476 178784 177904 177444 177869 177865 177042 177081 178762 180467 181046 181531 182611 183111 182391 181578 181098 179803 177917 177802
56458 177802 180183 182552 182992 182699 183120 183559 183419 183828 185145 185715 184961 184850 186407 187745 187498 187213 188221
56441 188221 189106 188555 187897 188468 189148 188763 188314 188628 188462 187164 186517 187641 188749 188292 187669 188433 189517
56424 189517 189672 190092 191969 193919 194312 193903 193778 193108 191328 190143 190970 192658 193953 195721 198488 200422
56408 200422 200283 199866 201045 202830 203803 204849 206911 208591 208632 208369 209174 209850 209080 207964 207656 207113 205764
56391 205764 205650 208201 211504 213476 215036 217373 219037 218828 218717 220599 222835 223320 223320 224795 226510 226456
56375 226456 225846 226950 229029 230030 230346 231391 232348 231904 231399 232875 235609 237786 239780 242612 245065
56360 245065 245589 245311 246016 246978 246832 246573 247597 248896 249329 250496 253980 257930 259817 260458 261870 263374
56344 263374 263457 263372 265108 267665 269026 269932 272055 274401 275299 276017 278552 281653 282949 283285 285090 288078
56328 288078 290384 292302 295100 297818 299034 300209 303494 307868 311134 313923 317904 321909 323895 324981
56314 324981 327494 330702 332519 333730 336401 339800 342095 344448 349194 355511 361097 366519 373650 381394
56300 381394 387373 392355 398703 405932 412167 418384 426655 435716 442879 448963 456722 465770 473795 481438
56286 481438 491186 502547 513060 522959 534174 545856 555673 564468 574984 587047 598768 611236
56274 611236 627117 645650 664006 682648 704458 729574 756058 784604 817478 853801 891227
56263 891227 931529 979207 1035101 1096553 1163309 1238026 1321434 1412335 1512107 1624102 1748704
56252 1748704 1883750 2029297 2186971 2355085 2529445 2708484 2892530 3078456 3260113
56243 3260113 3433429 3595987 3742260 3864799 3959911 4027209 4064405 4068191 4039812 3984202 3903985
56232 3903985 3799727 3675435 3537809 3390261 3233329 3070609 2908294 2748953 2591678
56223 2591678 2438226 2292928 2156501 2025991 1901099 1784729 1677327 1576690 1483405 1400204
56213 1400204 1325772 1255505 1188796 1129277 1077522 1029882 985051 945238 910102 876010 842296
56202 842296 812053 785805 760653 736487 716660 701367 686651 671173 657845 647602 637682 627276
56190 627276 618857 612751 606258 599177 594249 591379 587450 582539 580056 580063 578953 576409 575928 577685 577909
56175 577909 576313 577023 580914 584180 585869 589589 596207 602092 606328 612504 621524 629855 636764 646059
56161 646059 658623 670435 680165 691641 706550 721769 736156 752985 773456 794836 817144 844537
56149 844537 877902 913271 949796 992116 1042839 1100148 1164968 1242694 1335303 1439176 1552685
56138 1552685 1677598 1810215 1939225 2055497 2156819 2241336 2305685 2353054 2394297 2436565
56128 2436565 2477723 2514307 2546220 2570455 2579586 2571387 2552432 2528559 2499566 2466072 2431926 2395082
56116 2395082 2344935 2273939 2184573 2081388 1965263 1840202 1716738 1602803 1498447 1403726
56106 1403726 1323354 1258853 1204557 1156438 1117110 1087750 1063550 1041801 1025935 1016983 1009647 1001404
56094 1001404 996546 996613 996183 993059 993071 999458 1007020 1012128 1018851 1029539 1039227 1045315 1053012 1065139 1076424
56079 1076424 1084024 1093635 1108851 1124626 1137699 1153064 1173335 1192323 1206251 1220660 1238886 1254535
56067 1254535 1263131 1270447 1281336 1291133 1296321 1302768 1314799 1326848 1334674 1344073 1359676 1375950 1388289
56054 1388289 1402108 1421821 1441842 1457756 1475276 1498728 1522018 1540460 1559936 1584754 1608549
56043 1608549 1627285 1648799 1678960 1710911 1738799 1769220 1807691 1847034 1881102 1916801 1960126
56032 1960126 2003718 2041190 2080274 2128377 2178626 2223935 2271141 2326858 2383220 2432525 2482249
56021 2482249 2540429 2600202 2654360 2710844 2777590 2846454 2908888 2973061 3048346 3127662 3202798
56010 3202798 3282088 3374590 3472023 3565204 3662811 3774555 3891822 4004991 4123576 4258503
56000 4258503 4401200 4541438 4688300 4851271 5018779 5178926 5343036 5524708 5714971
55991 5714971 5903421 6103518 6329927 6571498 6814930 7073820 7364781 7677197 7997960
55982 7997960 8342949 8730934 9150411 9587296 10060176 10590950 11167022 11772404 12428811
55973 12428811 13163899 13968238 14829418 15778182 16852255 18047424 19357478 20828269 22516338
55964 22516338 24433618 26597546 29097372 32046268 35518353 39612383 44524709 50467937
55956 50467937 57573126 65975310 75939513 87806877 101927470 118820949 139340582
55949 139340582 164555149 195645074 234023008 280777294 334497086 388833518 433013521
55942 433013521 456466854 454336950 429341040 389034305 341593303 293302820 248135395
55935 248135395 208145767 173948967 145300592 121641848 102322706 86609835 73781439
55928 73781439 63274765 54672196 47590699 41685370 36725100 32563388 29047312 26024852
55920 26024852 23411087 21167491 19230361 17521774 16009448 14691643 13537542 12498246
55912 12498246 11560490 10735273 10006371 9339405 8728717 8187903 7705320 7253197 6830016
55903 6830016 6451837 6111461 5786034 5475794 5197217 4946138 4703811 4471484 4264226
55894 4264226 4077807 3894870 3717067 3559310 3418768 3280180 3145564 3028898 2927175
55885 2927175 2825610 2726215 2643307 2575400 2508188 2440573 2381660 2326498 2260588 2184903 2112235
55874 2112235 2042599 1966028 1885807 1815132 1753729 1690586 1626865 1573649 1529573 1482748 1432904
55863 1432904 1390472 1355622 1318814 1280424 1249632 1225265 1197372 1166520 1142437 1124735 1103789
55852 1103789 1079772 1062253 1051464 1037887 1019999 1005008 992379 973883 949927 929232 912216
55841 912216 890839 864922 842784 825567 806435 785427 769807 759339 746213 730007 718180
55830 718180 711404 702731 691716 685173 683373 679459 673129 671169 673640 673000 667737 663773 661730 655984
55816 655984 647209 642831 643907 644118 642645 645393 652411 656684 656736 658146 661245 659472 651563 643428 636339
55801 636339 625008 609216 595742 586618 576485 563498 552040 542798 530949 516245 504490 497219
55789 497219 490078 482906 480858 483674 484270 479966 475130 471019 463418 452416 444149 440407 436333 430682
55775 430682 428398 430474 431002 427094 422437 418438 411151 399759 389081 380882 371355 359770 350786 345562
55761 345562 339279 330289 323227 320337 318044 314806 313914 315614 314661 308730 301621 295537 287981 278727 271865
55746 271865 268218 263560 256860 252431 251376 249077 243970 240673 241285 241530 238837 236531 236604 235945 233338
55731 233338 232810 236228 239420 239272 238084 237568 235281 230459 226822 226092 224955 221619 219093 218909 217978 214852
55715 214852 212726 213060 212562 209693 207869 208917 209641 208215 207829 210572 213740 215562 218551 223736 227557
55700 227557 228027 228195 229973 230298 227095 223494 222416 222230 221271 221414 223738 225665 225755 226358 228593 229853
55684 229853 229207 229892 233413 236625 237720 239588 244047 248351 250756 253863 258860 262052 261003 258807 258391
55669 258391 257756 254856 252116 251997 252807 252777 253705 256723 259083 258925 258652 259846 259479 254948 248331 241915
55653 241915 234183 224158 215033 209296 204538 198157 191925 187936 184304 179054 174139 171436 168859 164602
55639 164602 161245 161353 162793 162615 161920 162696 163446 162188 160460 160227 160049 158159 156075 155382 154342 151465
55623 151465 148928 148603 148198 145367 142188 141450 141809 140802 139436 139577 139791 138054 135839 135443 135857 135139
55607 135139 134177 134356 134218 132218 130051 129623 129485 127927 126632 127488 128752 128300 127764 129340 131262 130699
55591 130699 128648 127799 127856 127100 126342 127311 129052 129728 130037 131409 133000 133925 136017 140749 145917 149149
55575 149149 152236 158004 165256 171062 176031 182967 191915 200565 208127 215033 220162 222042 221619 220572
55561 220572 218254 213351 206971 201068 195504 189620 184779 182213 180277 177011 173514 171643 170459 168223
55547 168223 165935 165527 166377 166892 167652 169694 171600 171570 170546 170093 169166 166231 162537 159982 157713 154142
55531 154142 150242 147512 144840 140822 136977 135063 133481 130125 126548 125223 124815 122438 118828 116875
55517 116875 116530 115521 113837 113293 113602 112961 111669 111400 111794 111329 110631 111349 112767 112964 112271 112144 111891
55500 111891 110007 107514 106405 106048 104706 103284 103768 105174 104975 103479 102951 103420 103215 102666 103311 104272
55484 104272 103464 101729 101833 103776 104857 104050 102741 101578 100092 99020 99561 100698 100462 99265 98840 98844
55468 98844 97848 96725 97354 98831 98803 97810 98405 100545 101794 101755 102341 103894 104888 105334 106725 108602 108867
55451 108867 107549 106705 106638 105752 104149 103727 104612 105029 104874 105869 107991 109189 109001 109090 109887 109982 109205 109113 110038
55432 110038 110730 111187 112755 115164 116504 116450 116512 116982 116675 115926 116636 119028 121402 123425 126617 131191 135507
55415 135507 139147 143539 148932 153516 156118 157206 156858 154398 150418 146574 143029 138569 133392 129181
55401 129181 126277 123385 120200 117716 115918 113843 111973 111806 112942 113288 112272 111263 110877 110589 110818
55386 110818 112427 114201 113831 111487 109494 108507 107077 104983 103763 103690 103384 102641 102602 102899 101865 99863
55370 99863 99156 100068 100457 99447 98393 97650 95732 92434 89675 88451 87831 87529 88400 89855 90002 89006 89150
55353 89150 90883 92075 91933 92318 94200 96136 97363 99117 101620 102964 102430 101924 102653 103217 102498 101690
55337 101690 101932 102457 102498 102624 102848 101895 99656 98033 98050 98448 98176 97845 97663 96529 94430 93233 93755 94430
55319 94430 94132 93918 94677 95438 95369 95236 95568 95591 95139 95412 96676 97461 97159 97069 97758 97805 96480 95270 95365 95873
55299 95873 95844 95860 96310 96352 95927 96566 98820 101025 101954 102513 103479 103783 102579 100935 99997 99389 98720 98707 99491
55280 99491 99820 99145 98547 98473 97718 95922 94769 95253 95929 95449 94757 95129 95973 96252 96378 97166 98445 99956
55262 99956 102025 104245 105262 104907 104682 105204 105266 104402 104049 104897 105435 104584 103503 103300 103096 102014 100916
55245 100916 100548 99961 98484 97332 97590 98443 98931 99556 100603 100876 99777 98746 99001 99691 99862 100284 101571
55228 101571 102453 101792 100560 100056 99868 99346 99324 100509 101834 102203 102351 103227 104134 104172 103992 104440 105002 105156
55210 105156 105651 106798 107230 106038 104479 103834 103320 101945 100672 100734 101342 101104 100402 100407 100993 101374 101611 101886
55192 101886 101551 100459 99848 100443 101095 100798 100360 100588 100591 99635 98885 99414 100141 99737 98974 99256 100319 101334
55174 101334 102743 104957 106716 106809 106116 106006 106086 105444 104670 104601 104505 103536 102568 102569 102641 101770 101023 101728 102956 103179
55154 103179 103054 104049 105528 105848 105313 105449 106128 105957 104929 104310 104337 104234 104026 104278 104522 103894 102871 102584
55136 102584 102974 103330 103949 105474 107299 108386 109044 110215 111682 112561 112718 112273 110760 108369 106757 106870
55120 106870 107205 106106 104427 103810 103823 103220 102766 104074 106533 108141 108757 109839 111407 111963 111311 110990 111785
55103 111785 112931 113804 114537 115000 114955 115065 116104 117462 118036 118124 118779 119834 120411 120856 122216 124175 125382
55086 125382 125565 125527 125425 124737 123670 122944 122522 122027 121881 122512 123116 122838 122426 123032 124186 124742 124976 125740
55068 125740 126379 125656 124079 123139 122770 121804 120481 120217 121132 121979 122349 122873 123420 123123 122135 121468 121200 120601
55050 120601 119789 119428 119093 117791 115879 114604 113988 113056 111919 111721 112630 113660 114387 115208 116078 116568 116898
55033 116898 117448 117735 117316 116941 117165 116820 114832 112573 112147 113096 113320 112609 112673 114000 115311 116042 116834 117597
55015 117597 117469 116766 116702 117127 116790 115842 115738 116579 116866 116105 115432 115446 115606 115956 117298 119376 120923 121686
54997 121686 122454 123077 122595 121361 120774 120833 120291 119347 119704 121588 123139 123271 122859 122514 121574 120065 119493 120783
54979 120783 123146 125620 127994 129828 130466 130526 131456 133164 133994 133424 132801 132953 133173 133124 133625 134871 135854
54962 135854 136252 136928 137957 138146 137245 136602 136846 136885 136045 135309 135483 135963 136256 137000 138517 140006 141020 142223
54944 142223 143911 145376 146516 148374 151294 154162 156324 158631 161789 165323 169089 174200 181420 190022
54930 190022 199036 208243 217128 224290 228751 230644 230039 226510 220441 213247 205661 197273 188292 180116
54916 180116 173469 167637 162225 157939 154869 151784 148142 145110 143548 142571 141209 139990 139716 139983 140133
54901 140133 140503 141683 143499 145661 148424 151905 155727 159938 165132 171138 176849 181916 187380 194080
54887 194080 201683 209691 217916 225435 230594 232689 232324 229727 224354 216625 208255 200223 192111 184087
54873 184087 177597 173203 169530 165383 161239 157737 154435 151109 148619 147355 146398 145185 144396 144238 143620
54858 143620 142132 140984 140786 140204 138277 136277 135681 135888 135579 134892 134605 134390 133599 132666 132171 131539 130118
54841 130118 128510 127423 126228 124114 121713 120226 119827 120214 121745 124638 127906 130394 132104 133433 134084
54826 134084 133906 133733 134175 134496 133877 132813 132068 131307 129975 128474 127227 125670 123569 122270 123096 125333
54810 125333 127253 128397 129483 130851 132423 134513 137238 139681 140904 141268 141617 141859 141560 141236 141754 142943
54794 142943 144042 145027 146379 148031 149624 151380 153760 156667 159815 163361 167411 171530 175496 179885
54780 179885 185259 191545 198799 207651 218206 229518 240807 252111 263044 272277 279292 285325 291387
54767 291387 296515 299183 299262 297369 293620 288546 284067 281770 280821 278960 274791 267961 258206 245932 232998
54752 232998 221252 210739 200671 191453 184345 179671 176779 175225 174756 174663 174462 174764 176344 178923 181911
54737 181911 185602 190453 196002 201725 208129 215639 223150 229125 233436 236676 238269 236845 232095 224910
54723 224910 216154 206563 197311 189294 182185 175327 169068 164101 160167 156622 153598 151314 149010 145991
54709 145991 143057 141399 140669 139686 138503 138155 138732 139255 139194 138735 137861 136585 135771 136243 137271 137242 135730
54692 135730 133723 132097 131025 130601 130832 131282 131693 132575 134218 135785 136459 136743 137378 137844 137379 136680 136918
54675 136918 137690 137707 137008 136638 136527 135565 133695 132125 131441 131063 130632 130403 130269 129851 129559 130158 131314 131991
54657 131991 132191 132829 133871 134205 133543 133016 133541 134794 136004 136692 136495 135374 134085 133489 133378 132910 131965
54640 131965 130983 129894 128476 127516 128106 129870 131262 131646 131707 131896 131870 131581 131524 131732 131759 131745 132221 132813 132531
54621 132531 131543 131235 132159 133199 133260 132676 132410 132751 133338 133773 133917 134026 134683 136048 137399 138039 138322 138949
54603 138949 139618 139438 138431 137504 137126 137066 137249 137772 138202 138010 137556 137602 138016 138062 137771 137830 138249 138352 138046 137868
54583 137868 137874 137635 137287 137379 137710 137556 137039 137045 137667 137962 137435 136677 136377 136642 137398 138498 139368 139407 138768 138061
54563 138061 137526 137291 137948 139811 141988 143318 143859 144368 144908 145290 146273 148680 151677 153694 154788 156320
54547 156320 158347 159295 158463 157082 156431 156449 156632 156768 156273 154208 150677 147164 144958 144070 143917 144117 144381
54530 144381 144536 144796 145304 145570 145280 145227 146247 147618 147877 146960 146019 145404 144464 143246 142646 142833 143174 143749
54512 143749 145190 146943 147525 146815 146276 146570 146757 146252 145764 145716 145534 145126 145408 146569 147449 147440 147505 148409 149371
54493 149371 149363 148557 147631 146813 146381 146983 148697 150689 152358 153818 154852 154639 153133 151597 151220 152166 154268
54476 154268 157388 160691 162921 163934 164765 165773 166119 165515 164952 165042 165038 164251 163066 161839 160199 158254 157155
54459 157155 157465 158121 157925 157030 156145 155342 154530 154102 154284 154665 154971 155404 155720 155086 153387 151605 150380 149342
54441 149342 148321 147941 148452 149318 150468 152546 155221 156781 156317 154940 153961 153231 152244 151457 151359 151512 151597
54424 151597 152289 153942 155510 155985 155863 156076 156444 156329 155961 155988 156479 157321 158774 160721 162267 162987 163691
54407 163691 165086 166640 167655 168463 169542 170390 170304 169464 168336 166884 165250 164214 164027 163767 162809 161956
54391 161956 162089 162708 162875 162637 162430 162065 161481 161566 163024 165207 167237 169410 172385 175826 179053 182202
54375 182202 185557 188500 190405 191816 193542 195293 196477 197609 199539 201791 202985 202530 200868 198559
54361 198559 196158 194428 193562 192709 191229 189720 188793 187675 185301 182089 179268 177071 174958 173107 172232
54346 172232 172217 172245 172072 171994 171875 171408 171110 171816 173338 174649 175284 175587 175785 175757 175558 175295 174775 173990 173556
54327 173556 173850 174238 174061 173793 174120 174428 173477 171291 169138 167801 166981 166321 165894 165636 165227 164625 164076 163630
54309 163630 163285 163382 164177 165260 165963 166149 166101 166062 166367 167438 168973 169809 169354 168557 168640 169475 170112 170258 170235
54290 170235 170030 169424 168729 168409 168323 168137 168044 168277 168464 168307 168306 168901 169580 169814 170206 171550 173379 174690 175567
54271 175567 176836 178546 180094 181504 183181 184674 185034 184370 183831 184062 184708 185390 186112 186726 186931 186815 186532
54254 186532 185694 183920 181777 180231 179351 178522 177692 177396 177682 178009 178186 178524 179088 179544 179697 179565 179150 178760
54236 178760 179086 180278 181411 181684 181577 181911 182432 182420 182111 182226 182514 182079 180896 179685 178457 176534 173998
54219 173998 171929 171003 170846 170859 170842 170813 170934 171489 172223 172117 170664 168926 168297 168614 168624 167951 167318 167076 166835
54200 166835 166512 166517 166892 167356 168168 169754 171504 172115 171275 170030 169378 169467 170173 171480 173137 174862 176908
54183 176908 179639 182581 184747 185811 186154 185898 184868 183363 181990 180813 179517 178274 177460 176735 175440
54168 175440 173877 173177 173867 175474 177424 179419 181089 182248 183450 185374 187762 189837 191576 193600 195998
54153 195998 198190 199785 200633 200293 198517 196020 193785 191854 189811 188053 187342 187364 187053 186163 185342 184852
54137 184852 184489 184580 185662 187294 188491 189332 190912 193802 197831 203172 210072 217431 223152 226170 226973
54122 226973 226176 223932 220786 217613 214512 211030 207541 204951 202985 200331 196736 193442 191206 189371
54108 189371 187357 185590 184450 183584 182855 182790 183567 184633 185657 186809 187841 188122 187881 188135 189044 189591 189286
54091 189286 188854 188868 189006 189075 189460 190061 190125 189678 189825 191032 192377 193135 193825 194992 196165 196824 197296 197917
54073 197917 198308 198261 198410 199324 200647 201689 202095 201614 200171 198515 197682 197453 196505 194541 193025 193249 194903
54056 194903 197153 199825 202772 205323 207302 209537 212484 215326 217298 218937 221118 223761 226412 229311
54042 229311 232885 236820 240450 243620 246624 249827 253809 259140 265536 271951 277852 283612 289377 294593
54028 294593 299069 303426 307931 312033 315532 318984 322297 324240 324252 323566 323476 323531 322541 320464 318085 315532
54012 315532 312294 308267 303846 299285 294703 290329 286156 281800 277170 272749 268910 265675 263396 262697
53998 262697 263255 263775 263770 264335 266471 269773 273676 278935 286735 297008 308403 319121 327004 329846 326858
53983 326858 319435 309734 299094 288339 278500 270155 262856 256173 250643 246761 243858 241048 238543 236969
53969 236969 236005 234848 233562 232848 232844 233072 233257 233379 233339 233378 234324 236586 239300 241297 242499 243628 244968
53952 244968 246210 247149 247840 248360 248980 250167 251959 253875 255840 258503 262194 266437 271009 276512 283163
53937 283163 290025 296290 302391 308898 315326 321096 326769 333072 339530 345449 351661 359831 370334 381922
53923 381922 393133 402885 410141 414426 416712 418763 421584 425296 430235 437153 446268 456739 466982
53910 466982 475090 479469 479908 477770 474557 470643 465813 460282 454422 448254 442085 436969 433506 430742
53896 430742 427292 422989 418391 413263 406841 399252 391466 383942 376387 368641 360886 353098 345192 337534
53882 337534 330519 323907 317331 311125 305837 301341 297246 293682 290766 287752 283823 279371 275438 272205
53868 272205 269084 265987 263400 261348 259320 257094 254719 251979 248841 246120 244574 243590 241918 239562
53854 239562 237720 236884 236212 234968 233486 232372 231649 231003 230216 229166 227975 227202 227304 227923 228250 228029 227639
53837 227639 227349 227105 226909 226787 226595 226413 226795 227979 229237 229801 230107 231196 233111 234799 235513 235493 235366
53820 235366 235597 236449 237768 238926 239563 240182 241503 243630 246403 249942 254034 257644 260184 262815 267223
53805 267223 273343 279471 284565 289243 294513 300664 307522 314806 321917 328142 333204 337105 339573 340408
53791 340408 340235 340072 340197 340169 339814 339432 339085 338443 337279 335522 333070 330206 327834 326447 325168 322677
53775 322677 318784 314223 309339 304014 298585 293668 289231 284918 281083 278338 276233 273615 270337 267431
53761 267431 265489 263993 262418 260879 259438 257776 255910 254369 253386 252611 251814 251182 250756 250230 249436 248495
53745 248495 247548 246906 247193 248578 250088 250576 250201 250079 250638 251284 251584 251773 252050 252277 252361 252176 251210 249180
53727 249180 246854 245417 245163 245659 246863 248956 251347 253112 254437 256425 259474 262903 266157 269184 271661
53712 271661 273069 273699 274454 275561 276646 278075 280844 284875 288755 291581 293918 296440 298763 300195 300753
53697 300753 300976 301448 302784 305263 308172 310278 311126 311199 310888 310301 310070 311143 313493 316048 318135 320051
53681 320051 322061 323926 325598 327293 328686 329121 328863 328935 329456 329377 328244 326923 326077 325172 323729 322434
53665 322434 322191 322880 323797 324655 325560 326543 327587 328579 328996 328286 326774 325477 324895 324784 325127 326308 328141
53648 328141 329801 331037 332434 334221 335871 337217 338865 341036 343060 344436 345514 346744 348212 350184
53634 350184 353068 356518 359552 361806 363591 364654 364260 362773 361586 361012 359856 357717 356021 355800 356069
53619 356069 355693 355425 356600 358887 360958 362650 364947 368192 371596 374319 376134 377268 378364 380227 382977
53604 382977 385808 388106 390266 392874 395815 398764 401784 404733 406879 407930 408830 410642 413158 415312
53590 415312 416440 416487 415588 414236 413290 413119 413164 412878 412476 412215 411702 410598 409329 408323 407196 405516 403726
53573 403726 402512 401755 400857 399572 397880 395659 393273 391852 392151 393533 394777 395410 395591 395318 394517 393472
53557 393472 392434 391277 390102 389584 390067 390868 391196 391107 390903 390350 389351 388725 389329 390916 392664 394323 395956
53540 395956 397179 397741 398423 400310 403394 406744 409778 412571 415309 418370 422612 428573 435527 442228 448494
53525 448494 455223 462948 471201 479329 487306 495632 504912 515487 527068 538858 550404 562046 574203
53512 574203 586554 598480 609979 621688 634167 647508 661401 675300 688924 702861 718203
53501 718203 735311 753440 771765 790073 808194 825680 842625 859923 878017 896132 913434
53490 913434 930211 947146 964132 980662 996775 1012773 1028553 1043993 1059455 1075137 1090540
53479 1090540 1105314 1120019 1135214 1150419 1164911 1178903 1192987 1206964 1220249 1232927 1245293
53468 1245293 1256782 1266454 1274252 1280661 1285429 1287718 1287402 1285130 1281088 1274707 1265761 1255063 1243931
53455 1243931 1233408 1223864 1214832 1205306 1194674 1183203 1171380 1159256 1146779 1134152 1121321 1107733
53443 1107733 1093267 1078731 1064774 1050990 1036852 1022826 1009652 997146 984814 973153 963410
53432 963410 956364 952167 950751 951438 952712 953480 954182 955756 958109 960660 963697 967847 972644 977051 981136
53417 981136 985870 991431 997128 1003020 1010266 1019649 1030844 1043307 1056847 1071219 1086127 1101910 1119367
53404 1119367 1138706 1159377 1180981 1203646 1227491 1252407 1278410 1305606 1333963 1363696 1395584
53393 1395584 1430157 1466847 1504660 1543357 1583189 1623943 1665265 1707568 1751466 1796513 1841482
53382 1841482 1885762 1929410 1972070 2013015 2052177 2090050 2126589 2161233 2193956 2225146 2254398
53371 2254398 2280497 2302802 2321770 2338033 2351798 2363129 2371898 2377354 2378514 2374942 2366466 2352434
53359 2352434 2332236 2306405 2276290 2242864 2206723 2168947 2130696 2092141 2052859 2013119 1973685
53348 1973685 1934653 1895838 1858055 1822598 1789491 1757701 1726954 1697707 1669300 1639939 1608942
53337 1608942 1577435 1546384 1515593 1485255 1456798 1431228 1407858 1385662 1364712 1345395 1327263
53326 1327263 1309769 1293382 1279067 1267159 1257344 1249068 1241316 1232656 1222171 1209893 1196116 1181071
53314 1181071 1165596 1151049 1137933 1125437 1112970 1101229 1091059 1082166 1073887 1066497 1060795 1056807
53302 1056807 1053855 1051611 1050309 1050082 1050737 1052096 1054152 1057041 1061144 1066971 1074648 1083786 1094019 1105364
53288 1105364 1117937 1131789 1147171 1164416 1183250 1202678 1221795 1240270 1257852 1274017 1288513
53277 1288513 1301817 1314630 1327166 1339107 1349986 1359411 1367191 1373265 1377299 1378509 1376351 1371289 1364372
53264 1364372 1356123 1346386 1335071 1322346 1308190 1292478 1275418 1257187 1237325 1215427 1192401 1169987
53252 1169987 1148869 1128206 1107151 1085823 1064545 1043259 1022132 1001872 982907 964959 947767
53241 947767 931484 916008 900617 884658 867977 850528 832318 814033 796807 781002 765862
53230 765862 750664 735509 720782 706716 693783 682605 673088 664451 656385 649327 643267 637298 630757
53217 630757 623853 616652 608491 599062 589149 579443 569381 558021 545486 532739 520362 508271 496343
53204 496343 484705 473616 463412 454303 446056 438214 430721 423797 417184 410240 402847 395429 387945
53191 387945 379849 371281 363265 356297 349658 342601 335320 328311 321721 315870 311406 308270 305410 302225
53177 302225 299425 297743 296617 294986 292700 290343 288198 286143 284113 282038 279792 277643 276211 275560
53163 275560 274970 273947 272720 271390 269589 267538 266369 266647 267444 267651 267320 266892 266090 264619 263232 262964
53147 262964 263746 264683 265229 265280 264678 263498 262404 261892 261631 261197 260892 261142 261669 262055 262500 263309 264206 264980
53129 264980 266118 267978 270032 271873 274194 277677 281533 284392 286186 287936 290014 291810 292956 293741
53115 293741 294331 294565 294505 294422 294337 294222 294367 294761 294505 292750 289946 287245 284889 282176 278929 276044 274482
53098 274482 274389 275141 275690 275082 273347 271657 270987 270917 270413 269359 268450 267944 267584 267549 268334 269656 270428 269994
53080 269994 268670 267005 265246 263568 262159 260934 259691 258538 257686 256957 256073 255205 254647 254142 253221 252010
53064 252010 250999 250217 249394 248804 249043 250006 250868 251160 251133 251034 250796 250577 250874 251852 253146 254555 256440 259071
53046 259071 261915 263860 264108 262879 261317 260596 260986 261922 262953 264126 265326 265960 265793 265527 265953 266892
53030 266892 267565 267605 267178 266496 265790 265384 265246 264850 264043 263546 263988 264947 265672 266257 267283 268653 269656 269966
53012 269966 269842 269580 269393 269589 270248 271048 271910 273304 275282 276782 276751 275494 274178 273504 273587 274479 275862
52995 275862 276850 277137 277732 279470 281496 282481 282643 283053 283553 283175 282347 282745 284788 287051 288456 289409 290346
52978 290346 290804 290609 290586 291260 292037 292402 292929 294287 296170 297911 299382 300643 301451 301795 302176 302705 302547
52961 302547 300963 298402 295991 294339 293367 292908 292916 293342 294100 294940 295283 294601 293160 291899 291420 291532 291872
52944 291872 292354 292823 292855 292245 291301 290491 290107 290276 290807 291054 290505 289466 288618 288033 287404 287050 287663 288940
52926 288940 289591 289050 288222 288039 288160 287637 286152 283997 281530 279257 277939 277986 279077 280682 282526 284236
52910 284236 285203 285306 285249 285654 286229 286319 285883 285379 284989 284523 283949 283544 283571 284042 284779 285581 286408 287408 288579
52891 288579 289500 289725 289337 288653 287513 285452 282715 280445 279616 280209 281568 283050 284185 284783 285219 286168
52875 286168 287786 289511 290877 292061 293419 294916 296300 297510 298605 299609 300603 301637 302344 301951 300007
52860 300007 296951 293779 291223 289236 287150 284341 280879 277432 274455 271772 269152 266824 265003 263354
52846 263354 261499 259728 258566 257962 257563 257449 257784 258067 257678 256964 256832 257424 258198 259206 261099 263696 265706
52829 265706 266176 265376 264033 262690 262083 263068 265661 268912 272174 275703 279723 283667 286776 288673 289075
52814 289075 287729 285059 282074 279258 276292 273147 270514 268688 266967 264824 262858 261913 261873 261983 261778
52799 261778 261103 259828 258154 256711 255865 255380 255148 255572 256710 257705 257734 257040 256437 256295 256566 257313 258547
52782 258547 259838 260605 260628 260043 259234 258839 259275 260002 259952 258963 258062 258001 258363 258580 258869 259474 259851 259502 258922
52763 258922 258837 259028 258849 258439 258582 259683 261662 264421 267545 269943 270820 270917 271905 274460 277610 280021 281356
52746 281356 282267 283525 285326 287223 288680 289670 290520 291300 291884 292614 294132 296273 297952 298599 298892 299453
52730 299453 299677 298713 296897 295165 293541 291361 288717 286600 285607 285439 285641 286006 286231 286023 285742 286214 287662
52713 287662 289363 290516 290941 290851 290493 290223 290429 291070 291555 291349 290500 289439 288407 287303 286010 284723 283837
52696 283837 283501 283449 283439 283676 284472 285610 286456 286738 286710 286536 286002 284948 283459 281574 279360 277374 276324
52679 276324 276051 275636 274842 274616 275679 277421 278856 279944 281155 282337 282973 283194 283646 284487 285282 285781 286138
52662 286138 286429 286598 286908 287929 289939 292564 294951 296197 295966 294935 294305 294588 295199 295439 295318 295097 294666
52645 294666 293957 293418 293419 293630 293608 293549 293781 293955 293579 293056 293353 294780 296821 299015 301287 303388 304730 304882
52627 304882 303853 301920 299559 297434 295966 295021 294326 293980 294173 294727 295398 296309 297529 298494 298539 297840 297244
52610 297244 297224 297602 298176 299007 300005 300770 300985 300663 299988 299171 298411 297813 297366 297153 297335 297830 298348 298875 299724
52591 299724 300851 301654 301751 301439 301080 300633 300216 300400 301311 302112 302112 301863 302327 303425 304278 304549 304618 304694 304591 304248
52571 304248 303646 302450 300515 298646 297959 298491 299155 299041 298136 296862 295640 294923 294943 295329 295417 294938 293984 292553
52553 292553 290733 289162 288571 288883 289346 289451 289219 288700 287881 287027 286566 286625 287087 287902 288895 289574 289734 290004
52535 290004 291102 292821 294391 295606 296805 298018 298936 299698 300862 302628 304709 306868 308982 310739 311988
52520 311988 313170 314667 316024 316672 317156 318596 321040 323514 325654 328124 331153 333779 334999 334725 333197
52505 333197 330365 326394 322088 318199 314793 311665 308930 306782 305151 303888 302928 302044 300880 299548 298805
52490 298805 299336 301086 303387 305474 306850 307563 308210 309379 311050 312812 314469 316028 317297 318090 318704
52475 318704 319582 320562 321120 321339 321936 323280 325033 326838 328771 330987 333453 336032 338253 339060 337543 334044
52459 334044 329891 325931 321982 317818 313900 310780 308427 306571 305303 304959 305622 306861 307806 307591 306096
52444 306096 304153 302670 301729 300948 300290 299896 299477 298744 298157 298344 298933 299018 298693 298951 300021 300977 301254 301402
52426 301402 301916 302421 302617 303014 304051 305292 306272 307475 309690 312847 316218 319424 322657 326084 329586
52411 329586 333093 336929 341909 348985 358394 369023 378956 386685 391430 392549 389505 382718 373800 364613
52397 364613 356355 349517 344089 339639 335777 332676 330741 329832 329448 329566 330501 331886 332722 332569 331912 331187
52381 331187 330373 329752 330057 331481 333371 335305 337640 340654 344002 347389 350890 354143 356170 356592 356259
52366 356259 356117 356216 356327 356638 357198 357519 357454 357689 358640 359658 360166 360813 362516 364977 367158 368787 370398
52349 370398 372239 374139 376171 378499 380753 382425 383817 385757 388405 391107 393469 395840 398637 401850
52335 401850 405424 409548 414269 419155 423689 427949 432718 438853 446452 454735 462867 470762 478760 486752
52321 486752 494261 501409 509057 517780 527352 537523 548607 560886 574074 587865 602372 617573
52309 617573 632895 648078 663939 681574 701134 721950 743521 765646 787805 809159 829233
52298 829233 848124 866066 883114 899184 914119 927778 940226 951641 961933 970769 978154 984602
52286 984602 990543 995902 1000420 1003907 1006044 1006507 1005597 1004188 1002747 1000997 998812 996686 994809 992399 988635
52271 988635 983730 978466 973193 968002 963360 959815 957380 955930 955911 957950 961982 967435 974135 982493 992936
52256 992936 1005590 1020270 1036266 1052420 1067863 1082462 1096168 1108413 1118738 1127625 1136030 1144384
52244 1144384 1152635 1160905 1169266 1177036 1183138 1187241 1189979 1192021 1193428 1193912 1193265 1191463 1188641 1184942
52230 1184942 1180158 1173807 1165834 1156967 1148005 1139058 1129931 1120879 1112400 1104515 1096816 1089108 1081508 1074043
52216 1074043 1066634 1059415 1052666 1046509 1040943 1036037 1031826 1028278 1025650 1024519 1025102 1026904 1029424 1032798
52202 1032798 1037293 1042555 1047866 1052790 1057075 1060296 1062181 1062954 1062823 1061462 1058598 1054827 1051181 1048113
52188 1048113 1045445 1043037 1040915 1038961 1037074 1035471 1034275 1033104 1031554 1029760 1027925 1025704 1022783 1019652
52174 1019652 1016965 1014398 1011045 1006793 1002491 998880 996189 994700 994705 995783 996976 997907 999029 1000563 1001921
52159 1001921 1002467 1002270 1001822 1001546 1001788 1002802 1004418 1006080 1007409 1008461 1009295 1009654 1009288 1008268 1006876 1005344
52143 1005344 1003793 1002171 1000217 997738 995001 992722 991587 991858 993327 995549 998273 1001688 1006117 1011470
52129 1011470 1017421 1024192 1032525 1042500 1052923 1062431 1070866 1079088 1087830 1097347 1107877 1119732 1132974
52116 1132974 1147421 1162857 1178878 1194788 1210100 1225006 1239999 1255298 1270909 1286840 1302723
52105 1302723 1317695 1331229 1343887 1356712 1370050 1383387 1396023 1407513 1417826 1427526 1437310 1446910
52093 1446910 1455012 1460827 1465176 1469304 1473241 1476124 1477540 1477502 1475563 1471152 1464617 1456916 1448332 1438450
52079 1438450 1427260 1415325 1402956 1390164 1377449 1365699 1355294 1346158 1338680 1333664 1331268 1330791
52067 1330791 1331621 1333642 1336724 1340611 1345372 1351151 1357415 1363217 1368326 1373405 1379047 1385282 1392012 1399144
52053 1399144 1406352 1413409 1420721 1428785 1437263 1445402 1453183 1461093 1468884 1475627 1480981 1485384 1488955 1491321
52039 1491321 1492539 1492982 1492127 1488697 1482304 1473749 1463377 1450469 1434845 1417864 1401034 1384553 1367979
52026 1367979 1351426 1335279 1319455 1303780 1288545 1274032 1259985 1246111 1232528 1219149 1205252
52015 1205252 1190331 1174880 1159703 1144879 1130040 1115277 1101140 1088018 1076017 1065208 1055520
52004 1055520 1046594 1038038 1029594 1020866 1011229 1000236 987740 973492 957229 939329 920736 901842
51992 901842 881996 860551 837850 814745 791655 768644 746075 724653 705024 687627 672696
51981 672696 660163 649829 641728 635957 632137 629585 628143 628205 629709 631805 633800 635761 637767 639301
51967 639301 639938 640142 640777 642246 644593 648159 653687 662097 674439 691670 714092 741244 772432 806600
51953 806600 841219 871895 893844 903905 901330 887517 865539 839290 812078 785811 761479 739860
51941 739860 721342 705563 691844 679858 669575 660760 652909 645433 637743 629375 620260 610578 600307
51928 600307 589303 577873 566730 556259 546372 537259 529591 523684 519128 515626 513554 513254 514303
51915 514303 515957 517816 519617 520900 521335 520854 519011 514721 507256 497174 485862 474568 464223 455594
51901 455594 448837 443193 437735 432349 427630 424047 421568 419868 418610 417772 417899 419740 423481 428754 435421
51886 435421 443673 453183 462860 471891 480319 488205 494880 499596 502306 503318 502794 501133 499213 497553
51872 497553 495818 493757 492098 491745 492576 493764 494891 495975 496750 496727 495785 494100 491667 488348 484109 478717
51856 478717 471650 462840 453071 443137 433137 423201 414258 407165 401580 396713 392818 390890 391021 392157
51842 392157 393519 395274 397581 399852 401376 402129 402665 403548 405055 407086 409183 410861 411951 412564 412867
51827 412867 413126 413707 414722 415877 416921 417900 418669 418565 417026 414262 410940 407506 404219 401453 399490
51812 399490 398282 397828 398422 400152 402543 405145 407991 411067 413974 416718 420166 424913 430199 434814 438573
51797 438573 441898 444444 445312 444529 443145 441812 440185 437872 435036 432000 429008 426574 425297 425208 425951
51782 425951 427663 430940 435830 441601 447623 453713 459350 463354 464738 463472 460187 455576 450317 445076
51768 445076 440288 436116 432598 429482 426065 421871 417509 414245 412547 411629 410509 408864 406684 403888
51754 403888 400776 398272 397075 396828 396563 395751 394533 393123 391571 390145 389446 389801 390672 391020 390351 389209
51738 389209 388485 388498 389082 390305 392430 395087 397180 398022 398099 398365 399258 400835 403319 406829 410761 414091
51722 414091 416272 417499 418249 418896 419657 420569 421674 423261 425639 428598 431698 435187 439754 444952 448819
51707 448819 449913 448902 447297 445418 442839 440180 438884 439363 440766 442561 444995 447674 449044 447978
51693 447978 445075 441843 439202 437238 435740 434413 432880 430859 428214 424733 420201 414762 408932 403282
51679 403282 398328 394517 391846 389683 387523 385817 385520 386965 389714 393308 397608 402612 408625 416334
51665 416334 425867 435967 444969 452511 459403 465989 471754 476655 481548 486762 491248 493828 494690 495029
51651 495029 495514 495501 493453 488013 479025 467632 455228 442490 429792 418030 408122 399960 392874 387086
51637 387086 383566 382332 382091 381907 382142 383289 384873 386197 387272 388264 388641 387597 384967 381290 377381
51622 377381 374142 372192 371246 370322 368894 367333 366064 365036 364374 364720 366351 368640 370972 373615 377063
51607 377063 381076 385033 388867 393125 398466 405595 415304 427981 443221 460061 477087 492018 502045
51594 502045 505454 502779 495999 487007 477308 468475 461910 458135 456806 457411 459700 463725 469782 478018
51580 478018 487691 497266 505765 513753 522484 532236 541886 549859 555075 557284 557195 556397 556805 560077 567492
51565 567492 580034 598109 621217 648020 676708 705405 732751 758316 782084 803286 820123
51554 820123 830922 835215 833426 825894 812589 793473 768859 739730 707938 675789 645064 616571
51542 616571 590647 567583 547420 529913 515017 502903 493174 484680 476564 469001 462500 457025 452299
51529 452299 448389 445278 442294 438772 435036 432083 430404 429692 429508 429655 429964 430245 430390 430200 429328 427803
51513 427803 426315 425415 424703 423447 421842 420924 421244 422300 423353 424158 424578 424076 422101 418861 415407 412883
51497 412883 411667 411127 410211 408365 405900 403469 401370 399498 397786 396337 395130 393783 391810 389095 386079
51482 386079 383393 381322 379780 378817 378754 379485 380047 379504 378125 377062 376909 377286 377833 378747 380060 381228 381889
51465 381889 382467 383579 385407 388016 391678 396394 401710 407466 414089 421485 428280 433038 435902 438288
51451 438288 441306 445242 450168 455968 461692 465780 467307 466619 464767 462855 461924 462749 465285 468470 470719
51436 470719 470579 467151 460376 451094 440603 430077 420334 411883 404888 399173 394511 390860 388222 386501
51422 386501 385630 385587 386148 386918 387761 388830 390053 391093 392065 393654 396096 398585 400275 401369 402596 404091
51406 404091 405631 407581 410624 414606 418487 421552 423988 426196 428238 430195 432517 435622 439450 443574
51392 443574 447629 451599 455938 461357 468320 476851 487069 499650 515322 534114 555563 579528 606302
51379 606302 635885 667543 699982 731501 760024 783583 801106 812626 818731 819934 816359 807656
51367 807656 793317 773459 749278 722423 694055 664819 635484 607062 580289 555369 532246
51356 532246 510823 491067 473276 458132 445973 436055 426998 418079 409642 402302 396177 391049 386809
51343 386809 383491 381054 379322 378071 377120 376385 375771 375027 373922 372671 371838 371581 371389 370888 370525 370904 371815
51326 371815 372578 373167 374272 376266 378761 381335 384128 387479 391344 395317 399028 402399 405617 408736 411188
51311 411188 411918 410409 407367 404051 401141 398713 396974 396181 395862 394916 392810 390159 387874 386198 384771
51296 384771 383214 381326 379133 377089 375997 376402 378147 380657 383533 386739 390429 394764 399777 405218
51282 405218 410496 414852 417659 418693 418238 416923 415415 414221 413664 413808 414403 415260 416760 419639 424064
51267 424064 429230 434065 437962 440605 441588 440785 438808 436561 434412 432083 429158 425344 420535 415032 409556
51252 409556 404708 400618 397338 395107 393809 392672 391148 389680 388928 388666 388265 387970 388652 390359 392106
51237 392106 393248 394160 395306 396452 397208 397735 398423 399249 399876 400145 400252 400636 401740 403686 406151 408717
51221 408717 411184 413307 414539 414576 413944 413526 413653 414195 415275 417156 419537 421850 424251 427496 431684 435944
51205 435944 439501 442283 444184 444622 443359 441101 438797 436734 434704 432570 430247 427542 424439 421239
51191 421239 418171 415222 412616 410953 410472 410514 410113 408942 407458 406393 406341 407443 409156 410532 411014 410828
51175 410828 410496 410261 410136 410199 410597 411464 412955 415130 417715 420236 422424 424254 425567 426078 425793 425043 424029
51158 424029 422675 420951 418933 416567 413832 411122 408889 406908 404561 401965 400133 399707 400209 400838 401386
51143 401386 401979 402590 403328 404702 406976 409570 411601 412787 413477 414143 415197 416996 419553 422484 425571
51128 425571 428990 432625 435564 436843 436475 435269 433800 432102 430249 428635 427587 427110 427166 427945 429616
51113 429616 431921 434130 435491 435811 435601 435565 436025 436969 438498 440813 443728 446531 448475 449242 448942 447982
51097 447982 446959 446383 446443 447203 448887 451566 454679 457419 459573 461500 463304 464711 465790 467081 468816
51082 468816 470712 472755 475466 479083 483246 487911 493856 501663 510798 520339 530142 540682 552123 564111
51068 564111 576056 587032 595815 601795 605635 608438 610453 611123 610085 607428 603128 596980 589086 579965
51054 579965 570251 560843 553211 548771 547674 548641 550214 551933 554220 557454 561362 565152 568066 569832
51040 569832 570648 570975 571705 574406 580629 590401 601706 611941 619757 625289 629099 631587 633233 634656
51026 634656 636197 637832 639490 641134 642559 643485 643864 643819 643283 642020 639933 637054 633306 628690 623699
51011 623699 619164 615661 613384 612552 613402 615638 618319 620652 622673 624902 627571 630474 633480 636765 640473
50996 640473 644431 648476 652974 658736 666319 675630 686324 698380 712041 727335 744016 761933 781074
50983 781074 801143 821399 841109 860020 878393 896860 916409 938265 963564 993085 1027171
50972 1027171 1065704 1108268 1154634 1205060 1259830 1318604 1380582 1445268 1512553 1581918 1651944
50961 1651944 1720686 1786237 1846994 1901958 1950854 1993509 2029047 2056265 2074952 2086221 2091435
50950 2091435 2091461 2087239 2080353 2072611 2065526 2060315 2057542 2056162 2053665 2047875 2038294 2025406 2009528 1991012
50936 1991012 1970768 1949434 1926294 1899891 1869553 1835611 1798413 1757970 1714392 1667886 1618424
50925 1618424 1566198 1512360 1458574 1405856 1354529 1305249 1259167 1216900 1178049 1142000 1108695
50914 1108695 1078397 1051185 1026935 1005425 986301 969232 954080 940632 928265 916474 905671
50903 905671 896862 890353 885352 881000 877246 874455 872671 871618 871108 871058 871406 872295 874201 877584 882458
50888 882458 888377 894743 901100 907397 914119 921939 931074 941097 951468 962091 973262 985281 998264
50875 998264 1012223 1027148 1042991 1059681 1077164 1095435 1114565 1134802 1156677 1180970 1208403
50864 1208403 1239282 1273627 1311844 1355165 1405099 1462514 1527511 1600143 1680809 1769906 1867617
50853 1867617 1974191 2090015 2215116 2348923 2490628 2639287 2793233 2949847 3106301
50844 3106301 3260185 3408950 3548971 3675619 3784314 3871599 3935840 3977444 3998220 4000184
50834 4000184 3985081 3954988 3912825 3861984 3806086 3749415 3696751 3651864 3616328 3590187 3573113
50823 3573113 3564129 3560615 3558515 3553512 3541600 3519224 3483997 3435305 3373425 3298212 3209407 3108035
50811 3108035 2996502 2877260 2752239 2623683 2494614 2368134 2246794 2132695 2027421
50802 2027421 1931690 1845693 1769905 1704847 1649895 1603181 1563118 1529386 1502084 1480574 1463663
50791 1463663 1450445 1440389 1432943 1427520 1423681 1420988 1418833 1416629 1413968 1410386 1405290 1398404 1390166
50778 1390166 1381471 1373025 1364945 1356792 1347970 1338215 1327640 1316205 1303391 1288798 1272836 1256390
50766 1256390 1239914 1223396 1207190 1192320 1179852 1170350 1163931 1160367 1159120 1159814 1162742 1168398 1176532
50753 1176532 1186217 1196866 1208493 1220922 1233601 1246618 1261231 1278867 1300003 1324427 1352175
50742 1352175 1383779 1419976 1461645 1509766 1564954 1627023 1695226 1768735 1846697 1928067 2011617
50731 2011617 2096029 2179924 2262048 2341539 2417693 2489324 2554559 2611286 2657448 2690845 2709225
50720 2709225 2711143 2696723 2667603 2626491 2576934 2523014 2468693 2417235 2371136 2332248 2301699
50709 2301699 2279753 2265838 2258665 2256445 2257306 2259501 2261080 2259518 2252126 2236813 2212172 2177110 2131129
50696 2131129 2075059 2010897 1940737 1866388 1790211 1715519 1645498 1581897 1524989 1474496 1430258
50685 1430258 1392350 1360941 1335979 1316969 1303318 1294895 1291914 1294244 1301348 1312989 1329359 1350179
50673 1350179 1374187 1399836 1426079 1452136 1477060 1500062 1521000 1540081 1557249 1572253 1585141
50662 1585141 1596353 1606395 1615618 1624178 1631990 1638865 1644711 1649446 1652777 1654532 1655268 1656046 1657495 1659679
50648 1659679 1663078 1669048 1678827 1692619 1710092 1731287 1756520 1785742 1818575 1854628 1893164 1932658
50636 1932658 1971296 2007996 2042657 2075608 2107139 2137480 2167053 2196920 2228811 2263505 2298123
50625 2298123 2325412 2337110 2328952 2302796 2264648 2221327 2178370 2139374 2105983 2078446 2056559
50614 2056559 2040242 2029439 2023863 2022964 2025897 2031446 2038157 2044643 2049531 2051017 2046688 2034042 2011470
50601 2011470 1978892 1937445 1888393 1832436 1770345 1704189 1637241 1572274 1510312 1451309 1395514
50590 1395514 1343594 1295842 1252093 1212329 1176740 1145202 1117354 1093283 1073506 1058131 1046593
50579 1046593 1038369 1033327 1031105 1030811 1031989 1035521 1042892 1054584 1069644 1086711 1104961 1123937 1143094
50566 1143094 1161973 1180714 1199981 1220296 1241668 1263992 1287546 1312786 1339634 1367240 1394657
50555 1394657 1421628 1448475 1475256 1501240 1525310 1546646 1564939 1580236 1593016 1604452 1616251
50544 1616251 1629942 1646311 1665524 1687591 1712483 1739973 1769729 1801662 1836063 1873345 1913903
50533 1913903 1958373 2007880 2063768 2126914 2197219 2273717 2355189 2440649 2529143 2619185 2708820
50522 2708820 2796431 2880995 2960998 3033389 3094450 3141756 3174742 3193401 3197278 3185931 3159487
50511 3159487 3118281 3062779 2994562 2916926 2833864 2748885 2665187 2586131 2514547 2451947 2399183
50500 2399183 2357403 2327457 2308839 2300299 2301296 2311796 2330894 2356890 2388775 2426267 2467846 2509531
50488 2509531 2545877 2571416 2581073 2570577 2537664 2482800 2408590 2318956 2218854 2113650 2007884
50477 2007884 1904759 1806718 1715687 1632415 1556436 1487276 1425247 1370728 1323347 1282341 1247183
50466 1247183 1217421 1192487 1172159 1156663 1145856 1138792 1134509 1132658 1132886 1134313 1136382 1139824 1145958
50453 1145958 1155169 1166576 1179064 1192186 1206227 1221823 1239481 1259254 1280920 1304325 1328972
50442 1328972 1353157 1374210 1390061 1400242 1405254 1405700 1402444 1396938 1390581 1383951 1377026 1369824 1362513
50429 1362513 1355336 1348822 1343703 1340339 1338655 1338814 1341333 1346300 1353322 1362692 1375763 1393531 1415652
50416 1415652 1441542 1471621 1506519 1545692 1587893 1632583 1679860 1729266 1779604 1829722 1878600
50405 1878600 1924845 1967010 2004293 2036178 2061514 2078757 2086994 2085897 2074740 2052394 2018553 1974337
50393 1974337 1921566 1862048 1797694 1730747 1663560 1598306 1536873 1480737 1430936 1388354 1353879
50382 1353879 1328073 1310948 1302288 1301860 1309111 1323189 1343603 1370233 1402130 1436872 1471697 1504771
50370 1504771 1534780 1560127 1579540 1592781 1599361 1596718 1581023 1550148 1505303 1450072 1388857 1326081
50358 1326081 1265374 1208609 1156030 1107439 1062850 1022173 985139 951779 922432 897132 875500
50347 875500 857191 841939 829265 818729 810377 804248 799595 795430 791846 789969 790465 792833 796304
50334 796304 800711 806291 813258 821797 831824 842556 852873 862381 871721 881740 892779 904777 917541
50321 917541 930751 944025 957012 969163 979788 988795 997002 1005044 1012362 1018102 1022642 1027252 1032437
50308 1032437 1037735 1042984 1048523 1054079 1058700 1062062 1064633 1066185 1065415 1061636 1055766 1048920 1041029 1031584
50294 1031584 1020894 1009667 998020 985817 973490 961646 950245 939039 928648 920448 915323 913021
50282 913021 912779 914260 917892 924509 934632 948133 964773 984899 1009107 1037170 1067781 1099395
50270 1099395 1130855 1161239 1189922 1217044 1243258 1268701 1292868 1315745 1338236 1360851 1382535
50259 1382535 1401292 1415445 1423823 1425387 1419631 1407251 1389807 1368829 1345676 1322102 1300432 1282976
50247 1282976 1271158 1264655 1260872 1255450 1243932 1223539 1194094 1157952 1119095 1081458 1047393 1017626
50235 1017626 992407 972086 956450 944359 934599 926773 920998 917147 914789 913523 912968 912646 912229 911659
50221 911659 910820 909374 907116 904150 900494 895916 890388 884272 877747 870527 862497 854222 846368 838911
50207 838911 831330 823341 815067 806719 798483 790586 783163 776120 769292 762642 756289 750574 746053 743069
50193 743069 741218 739593 737659 735613 733919 732912 732802 733517 734492 735201 735929 737310 739089 740228 740567 741493
50177 741493 744377 749000 754084 758766 762940 766678 770100 773628 777825 783024 789327 796635 804503 812484
50163 812484 820966 831207 844198 860071 878968 901877 929902 963050 1000181 1039773 1080295 1120367
50151 1120367 1159166 1196482 1232024 1265161 1295828 1325124 1354322 1383529 1411699 1437351 1458554
50140 1458554 1472709 1477458 1472015 1457110 1433734 1402503 1364230 1320549 1273763 1226169 1179413 1134379
50128 1134379 1091869 1053321 1020192 992330 967560 943410 918892 894363 870462 847909 827719
50117 827719 810570 796037 783110 771413 761451 753920 749240 747347 747280 747287 746093 744023 742363 741811 742094
50102 742094 742751 743533 744134 744273 744126 744184 744662 745354 745898 745848 744795 742865 740810 739110 737401 735329 733449
50085 733449 732478 732062 731270 730196 730116 732017 735777 740822 746818 753541 760810 768764 777692 787448 797559
50070 797559 807969 819101 831075 843363 855363 866839 877731 887960 897538 906467 914537 921535
50058 921535 927499 932371 935680 937241 937998 939336 941498 943426 944278 944379 944611 945695 948363 953376 960814
50043 960814 969850 979766 990837 1003897 1019447 1037618 1058659 1082897 1110301 1140340 1172073 1204085
50031 1204085 1234642 1262454 1287428 1310476 1332527 1353839 1374192 1393300 1410699 1425250 1435176
50020 1435176 1438852 1435424 1424473 1405525 1378623 1345398 1308748 1271016 1232965 1194737 1157114 1121269
50008 1121269 1087841 1056934 1028605 1002709 978727 956521 936979 920971 907829 895652 883063
49997 883063 869948 856653 843392 830514 818427 806955 795375 783328 771181 759546 749112
49986 749112 740881 735546 732322 729253 725186 720800 717289 714687 712070 708910 705559 702660 700599 699355
49972 699355 698517 697595 696606 696207 697025 699088 702120 706104 711159 717032 723048 728592 733438 737609 741030
49957 741030 743327 744041 743101 740988 738267 735015 730945 725906 719956 713054 705163 696771 688949 682725 678543
49942 678543 676191 674882 673393 670589 666118 660515 654636 649158 644506 640832 637951 635504 633253 631139
49928 631139 629256 627964 627812 628978 631012 633530 636934 641838 647935 654031 659292 663897 668555 673871
49914 673871 680208 687447 694708 700849 705491 709127 712210 714697 716615 718410 720379 722180 723115 722530 719768
49899 719768 714324 706384 696911 687001 677428 668873 661923 656521 651853 647200 642610 638584 635488 633466
49885 633466 632443 631852 630792 628863 626541 624428 622529 620650 619169 618786 619664 621289 623218 625656 629204
49870 629204 634209 640380 647012 653644 660445 667707 674998 681240 685785 689044 691763 694008 695285 695459
49856 695459 695054 694515 693483 691095 686999 681897 676935 672631 668675 664798 661411 659021 657363 655638 653511
49841 653511 651403 649829 649034 649300 651014 654107 657829 661350 664461 667512 670907 674669 678337 681291 683497
49826 683497 685833 689259 693607 697611 700296 701925 703491 705616 708088 710122 710893 710077 708048 705391 702226
49811 702226 698312 693771 689350 685795 683191 680945 678252 674716 670755 667252 664481 661682 658176 654553
49797 654553 652036 650826 649998 649004 648357 648548 649218 649887 650857 652804 655876 659663 663782 668209 673287 679497
49781 679497 686803 694084 699738 703077 704731 705622 706146 706479 706856 707106 706517 704661 701888 698581 694390 688662
49765 688662 681278 672761 663949 655852 649296 644323 640272 636649 633420 630293 626587 622261 618395 616016
49751 616016 615013 614751 615052 615849 616488 616385 616049 616536 618031 619756 621156 622416 623864 625655 628077 631516
49735 631516 635954 641054 646785 653363 660439 666953 672064 675934 679342 682848 686490 690009 693034 695180
49721 695180 696260 696456 696150 695476 694088 691538 687894 683828 679960 676440 673373 671298 670634 670853 670853 670285
49705 670285 669930 670686 672679 675527 678895 682594 686658 691559 697863 705465 713672 722040 730492 738546 745331
49690 745331 750738 755722 761050 766558 772046 777923 784277 790300 795533 800879 807318 814270 820277 824738
49676 824738 827726 828657 826646 822157 816906 811928 806865 801402 796268 792363 789794 788327 787976 788504 788855
49661 788855 787756 784659 779777 773523 766312 758694 751275 744532 738820 734371 731092 728471 725934 723406
49647 723406 721555 721376 723289 726522 729547 731276 731653 731062 729580 727076 723649 719567 715054 710468 706398
49632 706398 703116 700178 697045 693950 691709 690766 690774 691004 690793 689782 688130 686405 685034 684044 683491 683637
49616 683637 684307 684651 684225 683850 684581 686168 687351 687474 686849 685689 683792 681524 680032 679990 680802 681561 682242
49599 682242 683407 685159 686912 688002 688156 687486 686373 685343 684822 684928 685508 686317 687251 688429 689930 691413
49583 691413 692271 692325 692070 691968 691895 691662 691750 692949 695488 699083 703585 709010 715056 721284 727802 735154 743533
49566 743533 752674 762525 773347 785003 796751 807867 817905 826161 831575 833598 832791 830197 826450
49553 826450 821725 816287 810731 805774 801965 799457 797959 796976 796097 794970 793261 791057 789188 788673 789803
49538 789803 792065 794993 798645 803242 808845 815594 823979 834746 848730 866735 889103 915202 943530
49525 943530 972364 1000125 1025211 1046013 1061449 1071348 1076264 1077067 1074791 1070771 1066745 1064429 1064459 1065542
49511 1065542 1065165 1061501 1054361 1044228 1031190 1015571 998892 983116 969030 956265 944709 934840
49499 934840 926582 918969 911381 904358 898770 894837 892362 891312 891641 892904 894549 896398 898543 900998
49485 900998 903615 906155 908434 910687 913688 918011 923137 927836 931518 934678 937905 941080 943831 946194
49471 946194 948411 950416 951822 952158 950982 948189 944419 940780 937964 935880 934148 932447 930296 927134
49457 927134 923008 918799 915444 913201 911787 910844 910148 909765 910109 911422 913105 914150 914371 914614 915597 917260
49441 917260 919617 923443 929502 937542 946585 955748 964255 971077 975285 976680 975810 973764 972239 973056 976589
49426 976589 980782 982498 980000 973865 965792 957291 949511 943467 939812 938536 939172 941282 944683 949319
49412 949319 955082 961779 969329 977922 987780 998784 1010575 1023154 1037128 1053132 1071098 1090260
49400 1090260 1109727 1128891 1147475 1165424 1182819 1199832 1216706 1233570 1249979 1264631 1275872
49389 1275872 1282720 1285335 1284543 1281086 1275337 1267395 1257265 1245090 1231371 1216918 1202611 1189262 1177557
49376 1177557 1167884 1160273 1154688 1151168 1149499 1149008 1149158 1150142 1152418 1155758 1159204 1161786 1162776 1161440 1157317
49361 1157317 1150714 1142276 1132087 1119979 1106702 1093886 1082683 1073296 1065963 1061303 1059192 1058407 1058164
49348 1058164 1059253 1062909 1069324 1078179 1089914 1105080 1122339 1138000 1147817 1149108 1141665 1127570 1110259
49335 1110259 1093036 1077964 1065915 1057147 1051314 1047266 1043631 1039787 1035967 1032406 1028716 1024120 1018090
49322 1018090 1010763 1002852 994977 986970 978111 968252 958390 949842 943116 937908 933910 931252 930245 931028
49308 931028 933356 936581 940037 943572 947413 951452 955111 958109 960774 963266 965013 965369 964323 962059
49294 962059 958367 953185 947391 942319 938685 936511 935748 936165 936836 936691 935776 935388 936721 939866 944269 949754
49278 949754 956820 966120 977682 990541 1003226 1014811 1025370 1035328 1044706 1053194 1060450 1065906 1068890
49265 1068890 1069744 1070413 1072927 1077328 1081974 1085902 1089850 1094612 1099287 1101882 1101138 1097115 1090267 1080653 1068233
49250 1068233 1053671 1038647 1025289 1015012 1007687 1001954 996437 990705 985233 980808 978061 977314 978532
49237 978532 981374 985362 990141 995674 1002221 1010039 1019143 1029473 1041249 1054800 1069851 1085272 1099739
49224 1099739 1112483 1123224 1131719 1137815 1141792 1144255 1145688 1146347 1146503 1146528 1146867 1148203 1151526 1157616 1166378
49209 1166378 1176974 1188721 1201689 1216349 1232741 1250048 1267047 1283084 1298663 1314930 1332526
49198 1332526 1351064 1369630 1387396 1403713 1418172 1430993 1443087 1455271 1467543 1479315 1490172
49187 1490172 1500181 1509718 1519235 1529029 1539116 1549711 1562003 1577949 1598945 1625149 1656324 1692366
49175 1692366 1731961 1771125 1804374 1827793 1840787 1845247 1843850 1839023 1832422 1824801 1816581 1808564 1801672
49162 1801672 1796168 1791831 1788947 1788356 1790333 1794152 1799114 1805451 1813812 1824362 1836777 1850684 1865665
49149 1865665 1881160 1896837 1912898 1929653 1946938 1964184 1980948 1997192 2013317 2030114 2048316
49138 2048316 2067871 2087835 2107280 2126058 2144347 2161814 2177852 2192566 2206877 2221526 2236488
49127 2236488 2251634 2267546 2285207 2305102 2326991 2350498 2375586 2402565 2432142 2465647 2504844
49116 2504844 2551311 2606449 2672532 2753129 2850789 2962729 3078823 3185889 3276833 3357148 3441063
49105 3441063 3538002 3640152 3723425 3762822 3749693 3696321 3625174 3553241 3483925 3410353 3324740
49094 3324740 3225717 3119204 3014151 2917882 2834442 2765300 2710140 2667212 2634187 2609152 2590432
49083 2590432 2575803 2563010 2551274 2541362 2533712 2527328 2520974 2514639 2509182 2505138 2502488 2501002 2500096
49070 2500096 2498882 2497064 2495430 2494783 2494805 2494708 2494632 2495502 2497629 2500316 2503000 2506158 2510715 2516663 2522218 2524216
49054 2524216 2519763 2508027 2490530 2469710 2447591 2425757 2405581 2387567 2370939 2354704 2339043
49043 2339043 2325100 2313708 2304910 2298447 2293987 2290999 2289125 2288674 2290271 2294036 2299566 2306528 2314760 2323896
49029 2323896 2333358 2342635 2351220 2358549 2364410 2369078 2372634 2374637 2375023 2374818 2375107 2375701 2375750 2375362 2375574 2376758
49013 2376758 2378107 2378876 2379268 2379865 2380912 2382376 2384146 2385940 2387561 2389341 2391877 2395304 2399319 2403912 2409437
48998 2409437 2415906 2422728 2429232 2435072 2440228 2445154 2450720 2457331 2464135 2469670 2473211 2474817 2474357 2471395
48984 2471395 2466060 2459125 2451014 2441529 2430679 2419019 2406946 2394352 2381219 2367886 2354584 2341338
48972 2341338 2328567 2317134 2307627 2300156 2294956 2292470 2292646 2294880 2298887 2304982 2313255 2323175 2334293
48959 2334293 2346655 2360255 2374695 2389670 2405146 2420757 2435706 2449615 2462853 2475747 2488141
48948 2488141 2500095 2512279 2525141 2538276 2551240 2564489 2578939 2594894 2611933 2629673 2648213
48937 2648213 2667939 2689181 2711956 2735950 2760981 2787436 2815846 2846053 2877348 2909501 2943116
48926 2943116 2978863 3016961 3057494 3100453 3145152 3190351 3235515 3281484 3329442 3379601 3431290
48915 3431290 3483899 3537252 3591258 3645512 3699002 3750077 3797060 3839259 3877217 3912036 3944784
48904 3944784 3976419 4007542 4037988 4067158 4094947 4121835 4148017 4173065 4196719 4219363 4241429
48893 4241429 4262872 4283495 4303248 4321920 4339060 4354417 4367978 4379406 4388078 4393880 4397215 4397934
48881 4397934 4394980 4387517 4375827 4360748 4342845 4322422 4299626 4274135 4245415 4213717 4180136 4145337
48869 4145337 4109015 4071072 4032367 3993642 3954554 3914613 3874263 3834040 3793328 3751125 3707694
48858 3707694 3664281 3621388 3578492 3535565 3493834 3454558 3417719 3382391 3348085 3315389 3285412
48847 3285412 3258777 3235182 3213903 3194663 3177830 3163859 3152801 3144293 3137600 3131692 3125865 3120421
48835 3120421 3116319 3114085 3113605 3114993 3118857 3125455 3134389 3145471 3159088 3175161 3192497 3209850 3227098
48822 3227098 3244753 3262840 3280918 3298780 3316442 3333792 3350835 3368015 3385709 3403678 3421480
48811 3421480 3439155 3457091 3475517 3494437 3513752 3533097 3551996 3570506 3589154 3607901 3625812
48800 3625812 3642254 3657806 3673390 3689021 3704087 3718361 3732099 3745521 3758784 3772026 3784862
48789 3784862 3796371 3806187 3815100 3823830 3831711 3837444 3840814 3842844 3844469 3845799 3846478 3846017 3843903 3840002
48775 3840002 3834816 3828879 3822019 3813610 3803208 3790589 3775567 3758329 3739519 3719488 3697884 3674460
48763 3674460 3649705 3624029 3596938 3567844 3537191 3505875 3473878 3440435 3405290 3368962 3331934
48752 3331934 3294500 3257384 3221755 3188480 3157741 3129149 3101764 3074410 3046695 3019565 2994328
48741 2994328 2971426 2950663 2932174 2916397 2903457 2893324 2886309 2882678 2882069 2883948 2888246 2894863 2903015
48728 2903015 2911970 2921977 2933551 2946180 2958767 2971071 2983709 2996978 3010631 3024584 3038737
48717 3038737 3052215 3063886 3073607 3081948 3088772 3093259 3095458 3096715 3098261 3100250 3102388 3104585 3106727
48704 3106727 3108592 3110288 3112151 3114057 3115467 3116201 3116458 3116043 3114336 3111211 3107285 3103203 3099329 3096173 3094341
48689 3094341 3093940 3094596 3096084 3098205 3100153 3100852 3100090 3098628 3097247 3096386 3096613 3098373 3101187 3104108 3107254
48674 3107254 3111986 3119270 3128615 3138890 3149213 3158616 3165661 3169056 3168258 3163139 3153497 3139192 3120400
48661 3120400 3097563 3071492 3043502 3014844 2985910 2956505 2926889 2897904 2870061 2843256 2817416
48650 2817416 2792659 2768720 2745071 2721880 2700052 2679987 2660939 2641920 2622580 2602847 2582399
48639 2582399 2560965 2538741 2516076 2493036 2469485 2445376 2420912 2396687 2373547 2351835 2331011
48628 2331011 2310562 2291107 2273810 2258832 2245233 2232387 2220561 2209970 2200184 2190740 2181520 2172220
48616 2172220 2162186 2151147 2139484 2127547 2115373 2103318 2092281 2082964 2075410 2069352 2064327 2059330
48604 2059330 2053227 2045869 2038138 2030620 2022940 2014634 2005961 1997460 1989389 1981933 1975301 1969270 1963194 1956813
48590 1956813 1950449 1944162 1937448 1930118 1922828 1916257 1910272 1904376 1898523 1893090 1888456 1884986 1883090 1882899
48576 1882899 1884141 1886540 1890140 1895122 1901455 1908607 1915245 1919452 1919831 1916390 1909956 1900947 1889395 1875909
48562 1875909 1861790 1848211 1835990 1825904 1818261 1812118 1805908 1799037 1792091 1785504 1778944 1772067 1764902
48549 1764902 1757336 1749094 1740340 1731418 1721976 1711414 1700295 1690161 1681677 1674088 1666770 1660171 1654798
48536 1654798 1650480 1647263 1646002 1647319 1650693 1655204 1660635 1667495 1676671 1689348 1706713 1729479 1758147
48523 1758147 1793066 1832537 1870577 1898332 1909079 1901791 1880159 1849597 1815430 1781947 1751488
48512 1751488 1724618 1701562 1682804 1668248 1657099 1649097 1644771 1644060 1646127 1651193 1661257 1678201
48500 1678201 1702267 1732668 1767501 1801486 1825571 1831420 1816699 1785374 1743827 1697762 1651615
48489 1651615 1608485 1569852 1536095 1507383 1483677 1464275 1448147 1434593 1423212 1413619 1405598 1399059
48477 1399059 1393536 1388302 1383280 1379107 1376012 1373516 1371543 1370817 1371660 1373432 1375637 1378440 1381496 1383539
48463 1383539 1383940 1383538 1383044 1381878 1379579 1377182 1375855 1375065 1373365 1370243 1365998 1360476 1353219 1344421 1334628
48448 1334628 1323829 1311751 1298695 1285362 1272281 1260034 1249352 1240319 1232051 1223765 1215545 1207620
48436 1207620 1199836 1192454 1186445 1182259 1179168 1176450 1174265 1172747 1171382 1170025 1169360 1169547 1169563 1168630 1167130
48421 1167130 1165305 1162468 1158479 1154599 1151759 1149293 1146438 1143719 1141669 1139604 1137015 1134815 1133874 1133556
48407 1133556 1133106 1133204 1134660 1136735 1138200 1139028 1139821 1140763 1142326 1145634 1150844 1156567 1162114 1168710 1177123
48392 1177123 1185923 1193714 1201373 1210275 1220050 1229923 1240581 1252742 1265586 1278604 1293378 1311562
48380 1311562 1332846 1356725 1383933 1413517 1440524 1459582 1469586 1472734 1471010 1466316 1462053 1461298
48368 1461298 1464564 1471657 1483876 1501881 1523701 1547804 1575878 1609562 1646963 1685882 1728027 1776361
48356 1776361 1830786 1890267 1956595 2032024 2115971 2208327 2313118 2434576 2573066 2729755
48346 2729755 2911586 3126686 3379808 3678592 4039051 4477476 5002543 5623886 6362584
48337 6362584 7244917 8295916 9553540 11082352 12962276 15280387 18145555 21649127
48329 21649127 25690928 29781961 33086989 34796144 34557437 32608135 29544052 25987188
48321 25987188 22400872 19069580 16134994 13633465 11540646 9812820 8401877 7253805
48313 7253805 6315465 5546041 4915560 4395951 3961582 3595559 3287706 3027564 2804635
48304 2804635 2612799 2448538 2306430 2181013 2070907 1976335 1894365 1820812 1754894 1697735
48294 1697735 1647945 1602844 1562508 1528549 1500085 1474673 1452158 1434028 1419794 1407376 1396400
48283 1396400 1388068 1382465 1378896 1378217 1381953 1389620 1399535 1411924 1428714 1450479 1475590 1501649 1525471
48270 1525471 1542382 1548480 1544095 1533363 1520477 1507751 1496564 1487841 1481368 1476221 1472072 1468984 1466404
48257 1466404 1463661 1461008 1458879 1456681 1453765 1450950 1449499 1449021 1447997 1446017 1443889 1441829 1439212 1436103
48243 1436103 1433530 1432039 1431173 1430488 1430072 1430021 1430234 1430653 1430992 1430563 1429110 1427298 1425519 1422783 1417787 1410602
48227 1410602 1402221 1392950 1382313 1369993 1355672 1338463 1317859 1294898 1271111 1246638 1220707 1193715
48215 1193715 1167283 1142299 1118272 1094750 1072048 1050316 1029102 1008225 988119 968988 950519
48204 950519 932702 916127 901090 887147 873835 861186 849286 837913 826892 816345 806361 796807
48192 796807 787578 778725 770403 762978 756972 752414 748442 744142 739625 735744 732870 730522 728096 725331
48178 725331 722211 719021 716484 715224 715041 715215 715486 716175 717347 718441 718885 718693 718316 718140 718159 717989 717338
48161 717338 716570 716435 717063 717677 717656 717364 717431 717758 717977 718415 719755 721932 724196 726191 728216 730412 732373
48144 732373 733646 734121 733946 733503 733422 734097 735276 736544 738050 740220 742892 745337 747046 747986 748199 747736
48128 747736 746961 746368 746040 745710 745327 745188 745603 746737 748579 750655 752065 752362 752207 752727 754485 757474 761649
48111 761649 766736 771856 776271 780426 785544 792199 799884 807834 815591 822924 830003 837639 846674 857164
48097 857164 868697 881290 895218 910205 925708 941867 959192 977352 995298 1012681 1030054
48086 1030054 1047564 1064621 1081177 1098153 1115962 1133589 1149889 1165060 1180124 1195614 1211494
48075 1211494 1227825 1244707 1261856 1278833 1295555 1312184 1328707 1344789 1359700 1372330 1381959
48064 1381959 1389345 1396372 1404154 1412030 1418773 1423980 1427651 1429248 1428195 1424944 1420620 1415853 1410766 1405892
48050 1405892 1402075 1399303 1396316 1391515 1383891 1373277 1360439 1346952 1334205 1322236 1309992 1296812
48038 1296812 1283082 1269257 1254862 1238970 1221329 1202593 1183608 1164807 1146156 1127346 1108012
48027 1108012 1088018 1067627 1047348 1027551 1008240 989224 970467 952233 934832 918307 902527
48016 902527 887546 873604 860697 848404 836335 824552 813316 802666 792541 783080 774428 766381
48004 766381 758696 751712 746070 741673 737440 732542 727548 723865 722122 721525 720816 719520 718115 717270 717163
47989 717163 717407 717449 717019 716324 715774 715501 715189 714492 713519 712675 712038 711115 709387 706909 704245 701891 699903
47972 699903 698110 696473 695151 694217 693414 692306 690752 689136 687903 686927 685553 683342 680537 677728 675436
47957 675436 674118 674179 675597 677822 680424 683619 687693 692171 696149 699420 702746 707014 712630 719684 728013
47942 728013 736933 745552 753687 761946 770732 779787 789097 799419 811190 823392 834397 843759 852426
47929 852426 861265 870127 878358 885520 891337 895539 898133 899530 900122 899932 898765 896493 893066 888541 883197
47914 883197 877352 871016 863961 856185 847954 839314 830051 820325 810909 802360 794311 786110 778010 771272
47900 771272 766944 764883 763992 763208 762196 761377 761435 762648 764622 766755 768987 771860 775787 780445 785198
47885 785198 790036 795764 803069 811636 820494 829169 838118 847868 858063 867680 876044 883329 890199 897218
47871 897218 904474 911355 916705 919668 920495 920168 919157 917033 913452 908960 904352 899617 894035 887116 878985
47856 878985 869995 860473 850762 841108 831498 821938 812803 804517 796971 789730 782772 776597 771607 767841
47842 767841 765295 763946 763409 763150 763236 764280 766438 769072 771737 774888 779109 784154 789395 794876 801300
47827 801300 809126 818235 828307 838904 849291 858874 867943 877507 888315 900422 913681 928080
47815 928080 943351 958742 973530 987469 1000545 1012526 1023001 1031703 1038566 1043586 1046717 1047756
47803 1047756 1046283 1041912 1034619 1024709 1012504 998505 983805 969841 957334 945804 934474 923497
47791 923497 913967 906851 902267 899773 898950 899528 901172 903433 905986 908884 912458 916891 921871 926731 930909
47776 930909 934242 936898 939096 940829 941690 941052 938615 934707 929891 924399 918290 912008 906245 901070 895714
47761 895714 889509 882757 876312 870628 865592 861071 857136 853796 850879 848291 846157 844693 844102 844509 845801
47746 845801 847630 849894 853095 857778 863573 869265 874135 878883 884867 892595 901356 910320 919552 929798
47732 929798 941601 954918 969356 984362 999229 1013369 1026828 1040260 1054148 1068171 1081551
47721 1081551 1093804 1104838 1114432 1122108 1127607 1131113 1132800 1132409 1129498 1123912 1115820 1105502 1093387
47708 1093387 1080198 1066683 1053101 1039098 1024260 1008774 993426 978948 965478 952842 941242
47697 941242 931300 923244 916403 909937 903852 898877 895478 893621 893510 895802 900741 907639 915712 925022
47683 925022 936055 948710 962349 976675 991855 1007729 1023514 1038582 1053143 1067866 1083061
47672 1083061 1098382 1113100 1126466 1138053 1147975 1156656 1164125 1169679 1172484 1172526 1170701 1167874 1163968
47659 1163968 1158164 1149886 1139414 1127490 1114559 1100661 1085932 1070944 1056361 1042502 1029353 1016945
47647 1016945 1005578 995678 987508 980971 975767 971845 969662 969757 972101 976184 981848 989638 1000026 1012632
47633 1012632 1026590 1041495 1057493 1074462 1091616 1108036 1123223 1136932 1148725 1157980 1164195 1167015
47621 1167015 1166050 1160890 1151430 1138047 1121368 1101916 1080088 1056441 1031773 1006788 981791 956933
47609 956933 932630 909442 887573 866923 847734 830761 816517 804610 794103 784348 775229 766935
47597 766935 759772 753935 748983 743800 737648 731188 725907 722491 720217 717913 714953 711214 706781 702140
47583 702140 698144 695207 692741 689792 686128 682359 679197 676966 675679 675051 674362 672773 670031 666682 663494
47568 663494 660814 658528 656354 654028 651406 648660 646250 644483 643103 641490 639320 636849 634523 632412
47554 632412 630188 627538 624481 621187 617671 613789 609624 605709 602644 600461 598600 596640 594845 593683
47540 593683 592955 591932 590429 589208 588924 589090 588675 587490 586380 586079 586550 587544 589025 590620 591257 590095
47524 590095 587622 585293 584145 584184 584967 586130 587210 587588 587037 586144 585870 586724 588436 590271 591503 591762
47508 591762 591193 590333 589688 589344 589045 588669 588547 589192 590735 592762 594785 596737 598764 600638 601737 601784 601372
47491 601372 601503 602617 604226 605408 605564 604812 603868 603536 604174 605566 607287 609119 611139 613571 616638 620371
47475 620371 624432 628280 631667 634852 638237 641927 645822 649910 654252 658765 663271 667730 672206 676602
47461 676602 680528 683529 685550 687187 689344 692347 695561 698259 700760 704128 708756 714015 719623 726462
47447 726462 735340 745596 755870 765780 775834 785938 795167 803136 810508 817785 824468 829872 833931
47434 833931 836718 837876 837238 835460 833370 831061 828304 825482 823333 821887 820446 818722 817364 817147 818145
47419 818145 819926 822187 824864 827797 830542 832512 833278 832816 831505 829699 827312 823922 819242 813278 806077
47404 806077 797651 788355 779049 770564 763032 755987 749106 742645 737084 732639 729270 726904 725334 724021
47390 724021 722449 720808 719987 720663 722589 725031 727670 730775 734613 739141 744341 750504 757906 766314 774996
47375 774996 783236 790842 798171 805685 813496 821328 828792 835420 840472 843087 842970 840740 837380 833426
47361 833426 828849 823442 816958 809116 799907 789846 779478 768691 756967 744323 731575 719534
47349 719534 708351 697740 687489 677577 668058 659036 650549 642464 634740 627763 622041 617501 613487
47336 613487 609542 605785 602429 599425 596803 594883 593798 593144 592445 591707 591304 591620 592997 595617 599084
47321 599084 602496 605323 607940 610924 614193 617237 619902 622380 624665 626538 627954 628969 629467 629441 629415
47306 629415 629968 630960 631839 632706 634435 637691 642450 648633 656552 666476 678405 692578 709430 728194
47292 728194 745876 758441 763291 760453 751817 739888 727181 715858 707192 701336 697766 695878 695278
47279 695278 695858 697872 701716 707413 714448 722253 730724 740064 750214 760620 770499 779166 786275 792004
47265 792004 796974 801715 806188 809998 813031 815551 817681 819165 819764 819557 818688 817146 814973 812332 809115
47250 809115 804848 799404 793527 788151 783305 778234 772550 766821 761944 758272 755447 752822 749980 747098
47236 747098 744779 743341 742456 741795 741780 743138 745841 749135 752645 756739 761588 766612 771310 776127 782039
47221 782039 789628 798871 809374 820343 830720 839932 848331 856467 864149 870657 875666 879449 882291
47208 882291 884183 885055 884795 883012 879210 873380 866170 858403 850511 842415 833772 824484 815195 807074 800792
47193 800792 795844 791240 786749 782990 780351 778423 776783 775866 776667 779665 784337 789731 795390 801661 809197
47178 809197 818261 828584 839876 852279 866175 881678 898466 916047 934033 952182 970321 988246
47166 988246 1005653 1022174 1037488 1051327 1063434 1073728 1082507 1090187 1096691 1101333 1103416 1102709 1099329
47153 1099329 1093638 1086516 1079240 1072472 1065567 1057342 1047462 1036690 1025958 1015687 1005991 997058 989107
47140 989107 982140 975838 969714 963633 958355 955154 954471 955259 956126 956916 958530 961470 965330 969742 974927
47125 974927 981051 987740 994638 1001878 1009567 1017253 1024354 1030766 1036581 1041470 1044819 1046259 1045678 1042885
47111 1042885 1037732 1030528 1021967 1012573 1002483 991702 980328 968489 956278 943789 931087 918133
47099 918133 904860 891328 877696 864119 850791 837977 825842 814268 803059 792324 782509 774029
47087 774029 767030 761495 757380 754518 752525 751057 750140 750095 751023 752537 754185 756046 758683 762446 767086
47072 767086 772111 777266 782393 787091 790935 794075 797242 801012 805315 809814 814497 819569 824814 829357
47058 829357 832254 833293 833167 832953 833454 834916 837065 839268 840886 841837 842876 845099 849102 854744 861561
47043 861561 869010 876343 882788 888229 893390 899082 905507 912487 919933 927694 935337 942588 949751 957189
47029 957189 964633 971623 978408 985715 993681 1001757 1009674 1017819 1026464 1035342 1044267 1053528 1063313 1073249
47015 1073249 1082863 1091948 1100161 1106864 1111886 1115897 1119369 1121554 1121222 1118196 1113493 1108036 1101981 1095372
47001 1095372 1088747 1082782 1077694 1073306 1069396 1065725 1061928 1057727 1053300 1049354 1046717 1045729 1045973 1046717 1047719
46986 1047719 1049443 1052363 1056265 1060553 1065039 1070005 1075547 1081411 1087674 1095132 1104491 1115306 1126152
46973 1126152 1135955 1144924 1154048 1163930 1174325 1184694 1194834 1204781 1214368 1223207 1231110 1238302 1245132
46960 1245132 1251720 1257916 1263434 1267993 1271506 1274236 1276622 1278845 1280604 1281385 1280850 1279038 1276458 1274081
46946 1274081 1272940 1273411 1274959 1276722 1278307 1279909 1281882 1284413 1287574 1291484 1296360 1302440 1309711 1317647
46932 1317647 1325423 1332619 1339570 1346911 1354892 1363405 1372416 1382015 1392076 1402259 1412399 1422584 1432834
46919 1432834 1442999 1453023 1462951 1472522 1481080 1488080 1493445 1497206 1499047 1498545 1495670 1490747 1484000 1475472
46905 1475472 1465339 1454011 1441915 1429473 1417334 1406262 1396662 1388465 1381636 1376562 1373811 1373790 1376842
46892 1376842 1383285 1392974 1405029 1418518 1433334 1449931 1468242 1487466 1507097 1527530 1549144 1571133
46880 1571133 1591830 1610153 1626322 1641153 1654966 1667290 1677390 1684967 1690436 1694535 1697694 1699962
46868 1699962 1701629 1703622 1706883 1711431 1716376 1720939 1725297 1730441 1737386 1746489 1757315 1769174 1781906
46855 1781906 1795988 1811640 1828068 1844009 1858886 1872936 1886151 1897765 1907063 1914205 1919825 1924072
46843 1924072 1926517 1926878 1925401 1922430 1917911 1911520 1903237 1893676 1883792 1874187 1864741 1854968 1844741 1834615
46829 1834615 1825512 1818222 1813095 1810006 1808596 1808704 1810621 1814862 1821742 1831280 1843307 1857379 1872748
46816 1872748 1888833 1905769 1924134 1944028 1964658 1984866 2003743 2020724 2035533 2048209 2058885
46805 2058885 2067359 2073157 2076085 2076385 2074185 2069232 2061453 2051431 2039985 2027544 2014224 2000283 1986141
46792 1986141 1972141 1958537 1945596 1933452 1922057 1911442 1901820 1893222 1885364 1878170 1872087 1867491
46780 1867491 1864039 1861073 1858510 1856816 1856255 1856611 1857606 1859071 1860695 1862088 1863210 1864372 1865770 1867325 1869030
46765 1869030 1871019 1873198 1875223 1877019 1879012 1881721 1885484 1890778 1898299 1908221 1919566 1930865 1941515
46752 1941515 1952170 1963719 1976202 1988984 2001814 2015277 2029980 2045379 2059740 2071495 2080619
46741 2080619 2088488 2096384 2104317 2111337 2116724 2120530 2123120 2124700 2125550 2126302 2127510 2128981 2130043 2130614 2131523
46726 2131523 2133573 2136757 2140801 2146004 2152920 2161369 2170527 2179954 2189901 2200484 2211230 2221668 2231737
46713 2231737 2241251 2249548 2256091 2260979 2264384 2265861 2264691 2260583 2253556 2243522 2230572 2215409 2198836
46700 2198836 2180846 2160832 2138640 2114869 2090095 2064369 2037670 2010409 1983275 1956816 1931259
46689 1931259 1906520 1882289 1858307 1834615 1811473 1789199 1768202 1748856 1731048 1714122 1697650
46678 1697650 1681959 1667380 1653368 1639152 1625138 1612810 1603085 1595511 1589274 1584183 1580286 1577229
46666 1577229 1574680 1573014 1572997 1575018 1579026 1584969 1592875 1602646 1614126 1627264 1641866 1657380 1673201
46653 1673201 1689051 1704716 1719602 1733008 1744781 1755268 1764538 1772009 1777053 1779765 1780876 1780982 1780023
46640 1780023 1777640 1773910 1769570 1765507 1762256 1760111 1759476 1760755 1764035 1769296 1776945 1787748 1802054 1819360
46626 1819360 1838743 1859526 1881499 1904767 1929448 1955119 1980421 2003590 2023645 2040715 2055061
46615 2055061 2066215 2073391 2076321 2075150 2069830 2060226 2046732 2030264 2011572 1990968 1968736 1945413
46603 1945413 1921532 1897345 1872909 1848323 1823849 1799993 1777445 1756747 1738015 1721072 1705718
46592 1705718 1691711 1678688 1666446 1655170 1644982 1635392 1625668 1615749 1606197 1597095 1587574 1576899
46580 1576899 1565641 1555221 1546418 1538799 1531551 1524385 1517483 1511022 1505098 1499883 1495427 1491281 1486726
46567 1486726 1481604 1476782 1473521 1472365 1472795 1473907 1475090 1475981 1476189 1475570 1474661 1474379 1475088 1476264 1477179 1477689
46551 1477689 1478209 1479219 1481091 1484115 1488269 1493006 1497698 1502383 1507773 1514427 1522195 1530636 1539691 1549603
46537 1549603 1560401 1571817 1583729 1596367 1610023 1624767 1640514 1657170 1674651 1692993 1712551
46526 1712551 1733804 1756775 1780846 1805384 1830439 1856537 1883943 1912425 1941663 1971403 2001111
46515 2001111 2029884 2057103 2082914 2107681 2131024 2151807 2169150 2183140 2194443 2203548 2210676 2216153
46503 2216153 2220350 2223232 2224356 2223542 2221304 2218403 2215159 2211438 2207126 2202265 2196771 2190395 2183090 2175184
46489 2175184 2167098 2158992 2150674 2141578 2130908 2118210 2103949 2089077 2073768 2056977 2037593 2015635
46477 2015635 1991797 1966103 1937877 1907116 1875163 1843586 1812781 1782083 1750981 1719827 1689488
46466 1689488 1660745 1634047 1609544 1587213 1567109 1549568 1535047 1523723 1515398 1509861 1507227 1507771
46454 1507771 1511487 1517955 1526648 1537247 1549567 1563343 1578213 1593810 1609668 1625127 1639548 1652609
46442 1652609 1664169 1673915 1681513 1687210 1691844 1695978 1699370 1701578 1702727 1703170 1702684 1700695 1697315 1693538
46428 1693538 1690248 1687530 1685181 1683401 1682637 1683123 1685026 1688839 1695130 1703976 1715026 1728184 1743922 1762783
$$ [...]
##END NTUPLES=NMR SPECTRUM
##END=
