##TITLE=AC1661_NTAAH14397_8531551_JirI67dpmB
##JCAMPDX= 6.0         $$ Bruker NMR JCAMP-DX V2.0
##DATA TYPE= NMR SPECTRUM
##DATA CLASS= NTUPLES
##ORIGIN= BRUKER
##OWNER= Administrator
$$ 1.72 TOPSPIN		Version 2.1
$$ 2014-03-14 18:46:34.795 -0800  Administrator@X
$$ Compression mode = diff/dup
##.OBSERVE FREQUENCY= 400.02188249412
##.OBSERVE NUCLEUS= ^1H
##.ACQUISITION MODE= SIMULTANEOUS (DQD)
##.ACQUISITION SCHEME= undefined
##.AVERAGES= 64
##.DIGITISER RES= 22
##SPECTROMETER/DATA SYSTEM= spect
##.PULSE SEQUENCE= noesygpps1d.comp
##.SOLVENT NAME= COFFEE_meoh
##.SHIFT REFERENCE= INTERNAL, COFFEE_meoh, 1, 14.961
##AUDIT TRAIL= $$ (NUMBER, WHEN, WHO, WHERE, PROCESS, VERSION, WHAT)
$$ ##TITLE= Audit trail, TOPSPIN		Version 2.1
$$ ##JCAMPDX= 5.01
$$ ##ORIGIN= Bruker BioSpin GmbH
$$ ##OWNER= Administrator
$$ $$ E:\/data/COFFEE/nmr/AC1661_NTAAH14397_8531551_JirI67dpmB/12/pdata/1/auditp.txt
$$ ##AUDIT TRAIL=  $$ (NUMBER, WHEN, WHO, WHERE, PROCESS, VERSION, WHAT)
(   1,<2014-03-14 18:46:29.873 -0800>,<Administrator>,<X>,<go>,<TOPSPIN 2.1>,
      <created by zg
	started at 2014-03-14 18:35:00.451 -0800,
	POWCHK enabled, PULCHK disabled,
       configuration hash MD5:
       C8 4E 4E 5D D3 5C D8 9E 9F 52 82 E0 59 8A DE 15
       data hash MD5: 64K
       E1 31 12 5B 35 3F ED A9 22 0A A3 41 FE BD 11 E2>)
(   2,<2014-03-14 18:46:32.873 -0800>,<Administrator>,<X>,<proc1d>,<TOPSPIN 2.1>,
      <Start of raw data processing
       efp LB = 0.3 FT_mod = 6 PKNL = 1 PHC0 = 0 PHC1 = 0 SI = 128K 
       data hash MD5: 128K
       0B 69 BD 13 EC 1A 53 B1 0B 1C 50 D8 00 36 2C AC>)
(   3,<2014-03-14 18:46:33.779 -0800>,<Administrator>,<X>,<proc1d>,<TOPSPIN 2.1>,
      <pk PHC0 = -83.06213 PHC1 = 0 
       data hash MD5: 128K
       DF F8 F3 1B BC 9A 14 28 16 F9 AF 1D 19 88 AB A7>)
(   4,<2014-03-14 18:46:34.201 -0800>,<Administrator>,<X>,<proc1d>,<TOPSPIN 2.1>,
      <abs ABSG = 1 
       data hash MD5: 128K
       0B 46 8A D4 81 B0 AE F8 9D 84 85 9D 92 95 01 EF>)
(   5,<2014-03-14 18:46:34.310 -0800>,<Administrator>,<X>,<proc1d>,<TOPSPIN 2.1>,
      <abs ABSG = 2 
       data hash MD5: 128K
       97 17 12 E9 0A C5 6B A9 84 7E 93 43 7F F5 D5 E0>)
(   6,<2014-03-14 18:46:34.404 -0800>,<Administrator>,<X>,<proc1d>,<TOPSPIN 2.1>,
      <abs ABSG = 3 
       data hash MD5: 128K
       74 49 73 F0 96 3B AB DF ED C4 7E 9E FC 66 EC 51>)
(   7,<2014-03-14 18:46:34.498 -0800>,<Administrator>,<X>,<proc1d>,<TOPSPIN 2.1>,
      <abs ABSG = 4 
       data hash MD5: 128K
       76 75 0B 14 AB 6D 79 F9 43 EE F4 6F D5 11 EB 08>)
(   8,<2014-03-14 18:46:34.607 -0800>,<Administrator>,<X>,<proc1d>,<TOPSPIN 2.1>,
      <abs ABSG = 5 
       data hash MD5: 128K
       67 46 24 0F 69 79 28 FC 3C 3E 83 FE EF 26 99 B8>)
$$ ##END=
$$ 
$$ $$ hash MD5
$$ $$ 5E AD 99 2F 92 9B DE 0C E1 84 34 C1 9E 38 16 3F
##$RELAX= 
##$RELAX= 
##$RELAX= 
##$RELAX= 
##$RELAX= 
##$RELAX= 
##$RELAX= 
##$RELAX= 
$$ Bruker specific parameters
$$ --------------------------
##$DU= <E:\>
##$EXPNO= 12
$$ [...]
150 150 150 150 150 150 150 150
##$TP07= 0
##$TPNAME0= <>
##$TPNAME1= <>
##$TPNAME2= <>
##$TPNAME3= <>
##$TPNAME4= <>
##$TPNAME5= <>
##$TPNAME6= <>
##$TPNAME7= <>
##$TPOAL= (0..7)
0.5 0.5 0.5 0.5 0.5 0.5 0.5 0.5
##$TPOFFS= (0..7)
0 0 0 0 0 0 0 0
##$TUNHIN= 0
##$TUNHOUT= 0
##$TUNXOUT= 0
##$USERA1= <user>
##$USERA2= <user>
##$USERA3= <user>
##$USERA4= <user>
##$USERA5= <user>
##$V9= 5
##$VALIST= <valist>
##$VCLIST= <CCCCCCCCCCCCCCC>
##$VD= 0
##$VDLIST= <DDDDDDDDDDDDDDD>
##$VPLIST= <PPPPPPPPPPPPPPP>
##$VTLIST= <TTTTTTTTTTTTTTT>
##$WBST= 1024
##$WBSW= 4
##$XGAIN= (0..3)
0 0 0 0
##$XL= 0
##$YL= 0
##$YMAX_a= 6652014
##$YMIN_a= -11199555
##$ZGOPTNS= <>
##$ZL1= 120
##$ZL2= 120
##$ZL3= 120
##$ZL4= 120
##$ABSF1= 14.961
##$ABSF2= -5.597181
##$ABSG= 5
##$ABSL= 3
##$ALPHA= 0
##$AQORDER= 0
##$ASSFAC= 0
##$ASSFACI= 0
##$ASSFACX= 0
##$ASSWID= 0
##$AUNMP= <proc_prof1d_extract.lims>
##$AXLEFT= 0
##$AXNAME= <>
##$AXNUC= <1H>
##$AXRIGHT= 0
##$AXTYPE= 0
##$AXUNIT= <>
##$AZFE= 0.1
##$AZFW= 0.1
##$BCFW= 0
##$BC_mod= 0
##$BYTORDP= 0
##$COROFFS= 0
##$CY= 15
##$DATMOD= 1
##$DC= 0
##$DFILT= <>
##$DTYPP= 0
##$F1P= 0
##$F2P= 0
##$FCOR= 0.5
##$FTSIZE= 131072
##$FT_mod= 6
##$GAMMA= 0
##$GB= 0
##$INTBC= 1
##$INTSCL= 1
##$ISEN= 128
##$LB= 0.3
##$LEV0= 0
##$LPBIN= 0
##$MAXI= 10000
##$MC2= 0
##$MEAN= 0
##$ME_mod= 0
##$MI= 0
##$NCOEF= 0
##$NC_proc= -2
##$NLEV= 6
##$NOISF1= 0
##$NOISF2= 0
##$NSP= 0
##$NTH_PI= 0
##$NZP= 0
##$OFFSET= 14.961
##$PC= 1
##$PHC0= -83.06213
##$PHC1= 0
##$PH_mod= 1
##$PKNL= yes
##$PPARMOD= 0
##$PPDIAG= 0
##$PPIPTYP= 0
##$PPMPNUM= 2147483647
##$PPRESOL= 1
##$PSCAL= 4
##$PSIGN= 0
##$PYNMP= <proc.py>
##$REVERSE= no
##$SF= 400.020009636734
##$SI= 131072
##$SIGF1= 0
##$SIGF2= 0
##$SINO= 400
##$SIOLD= 131072
##$SPECTYP= <>
##$SREGLST= <1H.CDCl3>
##$SSB= 0
##$STSI= 131072
##$STSR= 0
##$SW_p= 8223.68421052631
##$SYMM= 0
##$S_DEV= 0
##$TDeff= 65536
##$TDoff= 0
##$TI= <>
##$TILT= no
##$TM1= 0
##$TM2= 0
##$TOPLEV= 0
##$USERP1= <user>
##$USERP2= <user>
##$USERP3= <user>
##$USERP4= <user>
##$USERP5= <user>
##$WDW= 1
##$XDIM= 131072
##$YMAX_p= 308563306
##$YMIN_p= -99231435
##$CURPLOT= <Network HP LaserJet P1505>
##$CURPRIN= <$Network HP LaserJet P1505>
##$DFORMAT= <normdp>
##$LAYOUT= <+/1D_H.xwp>
##$LFORMAT= <normlp>
##$PFORMAT= <normpl>
##$SURQMSG= 1
$$ End of Bruker specific parameters
$$ ---------------------------------
##NTUPLES= NMR SPECTRUM
##VAR_NAME=  FREQUENCY,     SPECTRUM/REAL,   SPECTRUM/IMAG
##SYMBOL=    X,             R,               I
##VAR_TYPE=  INDEPENDENT,   DEPENDENT,       DEPENDENT
##VAR_FORM=  AFFN,          ASDF,            ASDF
##VAR_DIM=   131072,        131072,          131072
##UNITS=     HZ,            ARBITRARY UNITS, ARBITRARY UNITS
##FACTOR=    0.0627417313425164, 1,          1
##FIRST=     8223.62146879497, 595,          -53386
##LAST=      0,             2679,            -53962
##MIN=       0,             -99231435,       0
##MAX=       8223.62146879497, 308563306,    0
$$ Real data points
##PAGE= N=1
##DATA TABLE= (X++(R..R)), XYDATA
$$ [...]
63910C726787k50156k39352k27631k15048k01471j86918j71673j56179j40934
$$ 3726787 3476631 3237279 3009648 2794600 2593129 2406211 2234538 2078359 1937425
63901A937425j26510j13437j01886r1504q1773p2568o4284n7454n2268m8401m5150
$$ 1937425 1810915 1697478 1595592 1504088 1422315 1349747 1285463 1228009 1175741 1127340 1082190
63890A082190m1821l8213l4763l2061l0212k8771k7229k5356k3148k0756j8464
$$ 1082190 1040369 1002156 967393 935332 905120 876349 849120 823764 800616 779860 761396
63879G61396j6460j4454j1898q754n718l423j662L14K921N923Q799J1105J2686
$$ 761396 744936 730482 718584 709830 704112 700689 699027 699341 702262 708185 716984 728089 740775
63866G40775J3855J5218J6995J8691J9719K0115K0280K0222J9648J8642J7586
$$ 740775 754630 769848 786843 805534 825253 845368 865648 885870 905518 924160 941746
63855I41746J6439J4772J2625J0585Q790O500L176o05l846o348q659j1150j3750
$$ 941746 958185 972957 985582 996167 1004957 1011457 1014633 1014028 1010182 1003834 995175 984025 970275
63842I70275j6436j9251k1848k3619k4455k5013k5945k7141k7928k7841k7024
$$ 970275 953839 934588 912740 889121 864666 839653 813708 786567 758639 730798 703774
63831G03774k6025k5330k5093k5181k5297k5028k3877k1687j9023j6877j5716
$$ 703774 677749 652419 627326 602145 576848 551820 527943 506256 487233 470356 454640
63820D54640j5056j4186j3035j1974j1086j0085q917p959p516p460p347o739n418
$$ 454640 439584 425398 412363 400389 389303 379218 370301 362342 354826 347366 340019 333280 327862
63807C27862l649k215j799k220k625k486k099k001k255k593k859l042l058k818
$$ 327862 324213 321998 320199 317979 315354 312868 310769 308768 306513 303920 301061 298019 294961 292143
63793B92143k457k269k414k778l058k930k303j509j094j340k032k741l190l307
$$ 292143 289686 287417 285003 282225 279167 276237 273934 272425 271331 269991 267959 265218 262028 258721
63779B58721l141k819k392j677m78Q88J584J057l29j624k161j936j363r14q11
$$ 258721 255580 252761 250369 248692 248214 249102 250686 251743 251414 249790 247629 245693 244330 243416 242605
63764B42605q69p03k61O8J9j48j40k25q06j574j744j145n18m81p27n13L91J534
$$ 242605 241736 241033 240772 240840 240859 240711 240571 240346 239540 237966 236222 235077 234559 234078 233351 232838 233229 234763
63746B34763K338K482K036J459J333J822K490K828K767K510K117J655J487J953
$$ 234763 237101 239583 241619 243078 244411 246233 248723 251551 254318 256828 258945 260600 262087 264040
63732B64040K814L380L305K850K379J988J789K112L097M305N067N172M918M562
$$ 264040 266854 270234 273539 276389 278768 280756 282545 284657 287754 292059 297126 302298 307216 311778
63718C11778L981K994J792Q76N78P64J020J048Q48N27J77p4o6J27R0m70j177j250
$$ 311778 315759 318753 320545 321421 321999 322763 323783 324831 325679 326206 326383 326309 326243 326370 326460 325990 324813 323563
63700C23563m07O87J112O75K2p9N94J682K595K919K721K475K533K643K214J125
$$ 323563 323156 323843 324955 325630 325652 325573 326167 327849 330444 333363 336084 338559 341092 343735 345949 347074
63684C47074J3m36l21l37q07j223r81k75P4k82p11l80O60J503J469Q35L63L90
$$ 347074 347087 346651 346330 345993 345186 343963 342982 342707 342781 342499 341788 341408 342068 343571 345040 345875 346238 346628
63666C46628N89N21J74j43k59l87q81j781k739l407l777m023m093l795l256k909
$$ 346628 347217 347738 347912 347769 347510 347123 346242 344461 341722 338315 334538 330515 326422 322627 319371 316462
63650C16462k905k841k393j865j694j655j128j67L75M6m54j78Q02J588J707J535
$$ 316462 313557 310716 308323 306458 304764 303109 301981 301814 302189 302235 301781 301603 302405 303993 305700 307235
63634C07235J497J567J819K796M692O540O991N961M831M832N687O241O035N736
$$ 307235 308732 310299 312118 314914 319606 326146 333137 339098 343929 348761 354448 360689 366724 372460
63620C72460O211P651R611J1481J2837J3672J4402J5422J6630J7649J8593K0131
$$ 372460 378671 386322 395933 407414 420251 433923 448325 463747 480377 498026 516619 536750
63608E36750K2573K5192K6811K6904K5817K4112K2078J9809J7400J4889J2193
$$ 536750 559323 584515 611326 638230 664047 688159 710237 730046 747446 762335 774528
63597G74528R215N996K780n6k253l964n609p289q592r280r902j1234j3259j5158
$$ 774528 783743 789739 792519 792463 790210 786246 780637 773348 764756 755476 745574 734340 721081 705923
63583G05923j6452j7494j8641j9387j8935j7325j5488j4119j3016j1648r973q377
$$ 705923 689471 671977 653336 633949 615014 597689 582201 568082 555066 543418 533445 525068
63571E25068p048n741m235k642j226j03P24J226J483J856K652L642M225M219M204
$$ 525068 518020 512279 508044 505402 504176 504073 504797 506023 507506 509362 512014 515656 519881 524100 528304
63556E28304M887O357Q190J0084J2064J4214J6515J8934K1499K4257K7233L0248
$$ 528304 533191 539548 547738 557822 569886 584100 600615 619549 641048 665305 692538 722786
63544G22786L2599L3213L1576K8307K4484K0500J6126J1478P182L507J6l475o313
$$ 722786 755385 788598 820174 848481 872965 893465 909591 921069 928251 931758 931774 928299 921986
63531I21986p836q432r091j0188j1342j2379j3761j5880j8375k0515k2012k3245
$$ 921986 914150 905718 896627 886439 875097 862718 848957 833077 814702 794187 772175 748930
63519G48930k4681k6241k7260k7110k5822k4040k2370k0853j9210j7371j5596
$$ 748930 724249 698008 670748 643638 617816 593776 571406 550553 531343 513972 498376
63508D98376j4106j2884j1792j0806r958r178q260p101n965n319n259n297m967
$$ 498376 484270 471386 459594 448788 438830 429652 421392 414291 408326 403007 397748 392451 387484
63495C87484m489m368m424l789k170m99J15k65o69n24j09J97N13J091J820K325
$$ 387484 382995 378627 374203 370414 368244 367745 367860 367595 366926 366402 366293 366490 367003 368094 369914 372239
63479C72239K379K099J882K099K706L173L058K465J730Q80j62j048j285j074j216
$$ 372239 374618 376717 378599 380698 383404 386577 389635 392100 393830 394710 394548 393500 392215 391141 389925
63464C89925k012k848l076k774k307j763j218j072j464j706r47O87K189K775K477
$$ 389925 387913 385065 381989 379215 376908 375145 373927 372855 371391 369685 368738 369425 371614 374389 376866
63449C76866J805J403J868L270M826N613N645N757O402P328Q401R922J1877J3697
$$ 376866 378671 380074 381942 385212 390038 395651 401296 407053 413455 420783 429184 439106 450983 464680
63435D64680J5292J7431K0422K3097K4051K3392K2322K1321J9863J7811J5853
$$ 464680 479972 497403 517825 540922 564973 588365 610687 632008 651871 669682 685535
63424F85535J4361J2907J1381J0698J1706J4020J6561J8753K0637K2262K3574
$$ 685535 699896 712803 724184 734882 746588 760608 777169 795922 816559 838821 862395
63413H62395K4587K5092K4507K2470J9353J5775J1944P975M275J057k164n660
$$ 862395 886982 912074 936581 959051 978404 994179 1006123 1014098 1018373 1019430 1017266 1011606
63401A011606q552r754r724j0224j2275j5257j8154k0665k2740k4094k4720k5214
$$ 1011606 1003054 993300 983576 973352 961077 945820 927666 907001 884261 860167 835447 810233
63389H10233k5942k6521k6569k6354k6074k5112k2871j9890j7364j5682j4181
$$ 810233 784291 757770 731201 704847 678773 653661 630790 610900 593536 577854 563673
63378E63673j2254r979p672n466l502k014j001k8J392L323N365P033Q263R566
$$ 563673 551419 541440 533768 528302 524800 522786 521785 521757 523149 526472 531837 538870 547133 556699
63364E56699J1452J3680J5409J6315J7165J8928K1661K4654K7342K9529L0940
$$ 556699 568151 581831 597240 613555 630720 649648 671309 695963 723305 752834 783774
63353G83774L1152L0065K8034K5478K2626J9594J6413J2976R200N270J559j591
$$ 783774 814926 844991 873025 898503 921129 940723 957136 970112 979312 984582 986141 984550
63341I84550l966n632p069q787j0669j2166j3358j5203j8141k1134k2830k3216
$$ 984550 980584 974952 967883 959096 948427 936261 922903 907700 889559 868425 845595 822379
63329H22379k3312k3603k3685k3269k2417k0900j8359j5213j2479j0487q739p190
$$ 822379 799067 775464 751779 728510 706093 685193 666834 651621 639142 628655 619916 612726
63317F12726o605p229q120q577r295j1258j4044j6108j6481j5503j4053j2680
$$ 612726 606121 598892 590772 582195 572900 561642 547598 531490 515009 499506 485453 472773
63305D72773j1415r986q283o735o011o150o333n858m906m070l569l314l321l533
$$ 472773 461358 451372 443089 436354 430343 424193 417860 412002 407096 403026 399457 396143 392822 389289
63291C89289l619l417l336l740m277m311l791l184k714k284j921j814j882j859
$$ 389289 385670 382253 378917 375177 370900 366589 362798 359614 356900 354616 352695 350881 348999 347140
63277C47140j742j730j803j710j347p02K98J481K149J683M17o07o97L3J108K065
$$ 347140 345398 343668 341865 340155 338808 338106 338404 339885 342034 343717 344134 343527 342830 342863 343971 346036
63261C46036K447K098J554J585K244K920L290L648M154M492M551M811N566O375
$$ 346036 348483 350581 352135 353720 355964 358884 362174 365822 369976 374468 379019 383830 389396 395771
63247C95771O706O786P178P877Q415Q749R381J0581J2015J3386J4943J6984J9126
$$ 395771 402477 409263 416441 424318 432733 441482 450863 461444 473459 486845 501788 518772 537898
63234E37898K0567K1098K1453K2430K3965K5368K6266K6843K7223K7215K6851
$$ 537898 558465 579563 601016 623446 647411 672779 699045 725888 753111 780326 807177
63223H07177K6624K6823K7065K6991K6976K7485K8052K7743K6632K5882K6088
$$ 807177 833801 860624 887689 914680 941656 969141 997193 1024936 1051568 1077450 1103538
63212A103538K6276K5005K1918J7746J3269Q802M389r4m967j0405j6049k1198
$$ 1103538 1129814 1154819 1176737 1194483 1207752 1216554 1220943 1220849 1215882 1205477 1189428 1168230
63200A168230k5277k8011k9320k9448k9026k8599k8064k6896k4877k2317j9549
$$ 1168230 1142953 1114942 1085622 1056174 1027148 998549 970485 943589 918712 896395 876846
63189H76846j6628j3538j0422p346m127o38K845N834Q165J0195J2312J4411J5942
$$ 876846 860218 846680 836258 828912 824785 824147 826992 832826 840991 851186 863498 877909 893851
63176H93851J6557J6575J6707J7345J8269J8999J9186J8667J7407J5645J3880
$$ 893851 910408 926983 943690 961035 979304 998303 1017489 1036156 1053563 1069208 1083088
63165A083088J2412J0892Q603N261J359k423o003r843j4151j8396k1814k4274
$$ 1083088 1095500 1106392 1114995 1120256 1121615 1119192 1113189 1103346 1089195 1070799 1048985 1024711
63153A024711k6277k8054k9133k9081k8318k7667k7228k6335k4714k2977k1680
$$ 1024711 998434 970380 941247 912166 883848 856181 828953 802618 777904 754927 733247
63142G33247k0479j8767j6671j4774j3140j1350r459q108p500o972n909m520l317
$$ 733247 712768 694001 677330 662556 649416 638066 628607 620499 612999 606027 600118 595598 592281
63129E92281k264r78N34J874K782L231L163K713K569L399M808N528M954L913L536
$$ 592281 590017 589039 589573 591447 594229 597460 600623 603336 605905 609304 614112 619640 624594 628507 632043
63114F32043L826L945L512K915K477K099J834K023K546K589J686N18L2J01k08
$$ 632043 635869 639814 643326 646241 648718 650817 652651 654674 657220 659809 661495 662013 662045 662146 661938
63099F61938j144j893j846j512j636k012j809q80k8M9m82j010j173r14k26P20
$$ 661938 660794 658901 657055 655543 653907 651895 650086 649206 649178 649227 648745 647735 646562 645648 645422 646142
63083F46142J520J927K197K692L259L438L220L150L590M361N216O198P228P880
$$ 646142 647662 649589 651786 654478 657737 661175 664395 667545 671135 675496 680712 686910 694138 702018
63069G02018Q031Q332R461J1095J2315J2905J3610J5039J7030J9244K1708K4404
$$ 702018 710049 718381 727842 738937 751252 764157 777767 792806 809836 829080 850788 875192
63057H75192K6928K9103L1490L4749L8726M2725M6373M9754N2863N5553N7910
$$ 875192 902120 931223 962713 997462 1036188 1078913 1125286 1175040 1227903 1283456 1341366
63046A341366O0187O2291O3842O4753O5380O5963O6321O6181O5488O4347O2987
$$ 1341366 1401553 1463844 1527686 1592439 1657819 1723782 1790103 1856284 1921772 1986119 2049106
63035B049106O1818O1119O0647N9769N8078N5467N1703M6388L9505L1477K2562
$$ 2049106 2110924 2172043 2232690 2292459 2350537 2406004 2457707 2504095 2543600 2575077 2597639
63024B597639J2620J709r563k0580l1210m1426n0850n9015o5712p0693p3363p3345
$$ 2597639 2610259 2611968 2602405 2581825 2550615 2509189 2458339 2399324 2333612 2262919 2189556 2116211
63012B116211p1188o7998o4409o0298n5426m9904m3927l7450l0337k2718j5155
$$ 2116211 2045023 1977025 1912616 1852318 1796892 1746988 1703061 1665611 1635274 1612556 1597401
63001A597401q426k940J771O662J2004J6851K0131K2009K3677K5861K8206L0156
$$ 1597401 1588975 1586035 1587806 1594468 1606472 1623323 1643454 1665463 1689140 1715001 1743207 1773363
62989A773363L1750L3191L4105L3856L2344L0077K7434K4244K0171J5150R360
$$ 1773363 1805113 1838304 1872409 1906265 1938609 1968686 1996120 2020364 2040535 2055685 2065045
62978B065045K890m290j2047j9901k7235l3693l9333m4404m9006n2967n5977n7816
$$ 2065045 2067935 2063645 2051598 2031697 2004462 1970769 1931436 1887032 1838026 1785059 1729082 1671266
62966A671266n8493n8197n7109n5355n3206n1067m9076m6822m3958m0961l8784
$$ 1671266 1612773 1554576 1497467 1442112 1388906 1337839 1288763 1241941 1197983 1157022 1118238
62955A118238l7521l6124l3794l1116k9161k7981k6748k5144k3679k2632k1549
$$ 1118238 1080717 1044593 1010799 979683 950522 922541 895793 870649 846970 824338 802789
62944H02789k0108j8689j7666j6769j5629j4431j3490j2578j1221r507p994o993
$$ 802789 782681 763992 746326 729557 713928 699497 686007 673429 662208 652701 644707 637714
62932F37714o375o011n881n734n156m096l039k424k181j929j506j134j197j892
$$ 637714 631339 625328 619447 613713 608557 604461 601422 598998 596817 594888 593382 592248 591051 589159
62918E89159l040m147m699m532l869l084k464k144k166k506l025l459l577l416
$$ 589159 586119 581972 577273 572741 568872 565788 563324 561180 559014 556508 553483 550024 546447 543031
62904E43031l253l219l121k802k506k508k592k281j692j460j780k031j714j136
$$ 543031 539778 536559 533438 530636 528130 525622 523030 520749 519057 517597 515817 513786 512072 510936
62890E10936p96n68j18L47L87J92K89N89M90n9l41oL69J99j74k5N97Q57K22q50
$$ 510936 510140 509572 509454 509801 510188 510380 510669 511258 511748 511689 511348 511342 511711 511910 511736 511711 512308 513165 513387 512537
62870E12537j454j295r90j260j942k189j690j166j329j839j869j400j101j092
$$ 512537 511083 509788 508798 507538 505596 503407 501717 500551 499222 497383 495514 494114 493013 491921
62856D91921p87OP33J070J381J799J718P64l90q43n63p0L88P13N63j77r43j230
$$ 491921 491134 491140 491873 492943 494324 496123 497841 498605 498215 497372 496809 496739 497127 497840 498403 498226 497283 496053
62838D96053j366j800k066j459m10j09p81j386j170m84J23P32J486K031K043J812
$$ 496053 494687 492887 490821 489362 488952 488843 488062 486676 485506 485022 485145 485877 487363 489394 491437 493249
62822D93249J779J957K161K428K786K973K778K446K409K784L350L841M154M402
$$ 493249 495028 496985 499146 501574 504360 507333 510111 512557 514966 517750 521100 524941 529095 533497
62808E33497M821N414N781N681N612O321P731Q919R234Q886Q387Q072Q333R517
$$ 533497 538318 543732 549513 555194 560806 567127 574858 583777 593011 601897 610284 618356 626689 636206
62794F36206J1301J2834J3840J4976J6785J9027K1482K4546K8445L2553L6304
$$ 636206 647507 660341 674181 689157 705942 724969 746451 770997 799442 831995 868299
62783H68299M0146M4813N0184N5666O1212O7025P2761P7996Q3148Q8769R4120
$$ 868299 908445 953258 1003442 1059108 1120320 1187345 1260106 1338102 1421250 1510019 1604139
62772A604139R7642R8829R8522R7171R3990Q8237Q0278P0744N9500M6188L1290
$$ 1604139 1701781 1800610 1899132 1996303 2090293 2178530 2258808 2329552 2389052 2435240 2466530
62761B466530J5927Q81j3664k7628m0812n2984o3862p3076q0344q5593q8776q9836
$$ 2466530 2482457 2483338 2469674 2442046 2401234 2348250 2284388 2211312 2130968 2045375 1956599 1866763
62749A866763q9005q6951q4417q1751p8858p5500p1690o7821o4239o0575n5922
$$ 1866763 1777758 1690807 1606390 1524639 1445781 1370281 1298591 1230770 1166531 1105956 1050034
62738A050034n0135m4525m0551l8004l5342l1743k7915k4732k2086j9554j7211
$$ 1050034 999899 955374 914823 876819 841477 809734 781819 757087 735001 715447 698236
62727F98236j5233j3382j1549j0181r492q813p433n658m168k818j010J018K399
$$ 698236 683003 669621 658072 647891 638399 629586 622153 616495 612327 609509 608499 609517 611916
62714F11916L113M184O186Q425J0049J1256J2890J5339J8393K1777K5290K8651
$$ 611916 615029 619213 625399 633824 643873 655129 668019 683358 701751 723528 748818 777469
62702G77469L1711L4728L8072M1722M5466M9390N3719N8201O2207O5590O8876
$$ 777469 809180 843908 881980 923702 969168 1018558 1072277 1130478 1192685 1258275 1327151
62691A327151P2198P4609P4925P3017O9566O4773N8053M9221L9067K8424J7282
$$ 1327151 1399349 1473958 1548883 1621900 1691466 1756239 1814292 1863513 1902580 1931004 1948286
62680A948286N395o793j8507k9465l9634m8465n5309o0431o4666o8063o9750o9403
$$ 1948286 1953681 1946888 1928381 1898916 1859282 1810817 1755508 1695077 1630411 1562348 1492598 1423195
62668A423195o7899o6166o4155o1470n8308n5134n1917m8319m4400m0565l7042
$$ 1423195 1355296 1289130 1224975 1163505 1105197 1050063 998146 949827 905427 864862 827820
62657H27820l3822l0850k8009k5165k2531k0637j9602j8798j7626j6224j5047
$$ 827820 793998 763148 735139 709974 687443 666806 647204 628406 610780 594556 579509
62646E79509j4081j3012j1788j0569r342q045o850n830m745l540k693k496k380
$$ 579509 565428 552416 540628 530059 520717 512672 505822 499992 495247 491707 489014 486518 484138
62633D84138j681p55n50j229j985k214k086j921j752j624j678j769j547j020m56
$$ 484138 482457 481702 481152 479923 477938 475724 473638 471717 469965 468341 466663 464894 463347 462327 461871
62618D61871J92J188K251K722K633K837L752M725N109N214N602O017N849N349
$$ 461871 462063 463251 465502 468224 470857 473694 477446 482171 487280 492494 498096 504113 509962 515311
62604E15311N577P136R567J2001J4014J5738J7534J9772K2660K6077K9602L2806
$$ 515311 520888 528024 537591 549592 563606 579344 596878 616650 639310 665387 694989 727795
62592G27795L5564L8096M0710M3441M5924M7659M8366M7981M6400M3374L8779
$$ 727795 763359 801455 842165 885606 931530 979189 1027555 1075536 1121936 1165310 1204089
62581A204089L2812K5947J8663J1205L552m236j1615j7836k2815k7281l1770l5790
$$ 1204089 1236901 1262848 1281511 1292716 1296268 1292032 1280417 1262581 1239766 1212485 1180715 1144925
62569A144925l8479l9798m0408m0562l9933l8584l7242l6312l5267l3445l0915
$$ 1144925 1106446 1066648 1026240 985678 945745 907161 869919 833607 798340 764895 733980
62558G33980k8149k5318k2374j9488j6971j4898j3181j1775j0577r383q183p227
$$ 733980 705831 680513 658139 638651 621680 606782 593601 581826 571249 561866 553683 546456
62546E46456o581n907n056m428m371m469m007k923j848j268j058q62n21r2K44
$$ 546456 539875 533968 528912 524484 520113 515644 511637 508714 506866 505598 504540 503678 503157 503065 503309
62531E03309K51r1l80p4J002K559M235N804P136Q249R445J1124J3344J5780J8229
$$ 503309 503560 503469 503089 503015 504017 506576 510811 516615 523751 532000 541445 552569 565913 581693 599922
62516E99922K0891K3995K7239K9947L1845L3503L5717L8553M1259M3181M4422
$$ 599922 620813 644808 672047 701994 733839 767342 803059 841612 882871 926052 970474
62505I70474M5298M5501M4327M1599L7864L3583K8712K3244J7656J2544Q158M624
$$ 970474 1015772 1061273 1105600 1147199 1185063 1218646 1247358 1270602 1288258 1300802 1308960 1313584
62493A313584K263J301J496K382L763N770Q582J2322J6932K1961K6677L0571L3538
$$ 1313584 1315847 1317148 1318644 1321026 1324789 1330559 1339141 1351463 1368395 1390356 1417033 1447604 1481142
62480A481142L5487L6160L5574L4082L1679K7691K1630J3964N553l282j2474k1477
$$ 1481142 1516629 1552789 1588363 1622445 1654124 1681815 1703445 1717409 1722962 1719680 1707206 1685729
62468A685729k9609l6949m4020n0625n5859n9291o1361o2432o2315o1001n9066
$$ 1685729 1656120 1619171 1575151 1524526 1468667 1409376 1348015 1285583 1223268 1162267 1103201
62457A103201n6846n3919m9911m5304m0802l6382l1650k6871k2854j9942j7685
$$ 1103201 1046355 992436 942525 897221 856419 820037 788387 761516 738662 718720 701035
62446G01035j5538j3311j0840p884m690k159r70o50J7J581L274L925L292K183
$$ 701035 685497 672186 661346 653462 648772 646613 645643 644993 645010 646591 649865 653790 657082 659265
62432F59265J299M81p66k318l556m294n042o212p523q481r070r592j0074j0285
$$ 659265 660564 661045 660279 657961 654405 650111 645069 638857 631334 622853 613783 604191 594117 583832
62418E83832j0169r833r204q178p146o856p491q244q165p185o009n189m686m251
$$ 583832 573663 563830 554626 546448 539302 532446 524955 516711 508546 501361 495352 490163 485477 481226
62404D81226l826l472l161k844k568k359k102j576o46O05J839K656K922K882K845
$$ 481226 477400 473928 470767 467923 465355 462996 460894 459318 458672 459277 461116 463772 466694 469576 472421
62389D72421K810K597K291K229K575L103L556L891M091M132M243M839N872O634
$$ 472421 475231 477828 480119 482348 484923 488026 491582 495473 499564 503696 507939 512778 518650 525284
62375E25284O649O391O716P750Q896R716J0234J0444J0272J0133J0880J2894J5673
$$ 525284 531933 538324 545040 552790 561686 571402 581636 592080 602352 612485 623365 636259 651932
62362F51932J8483K1063K3501K5912K8513L1647L5407L9428M3157M6084M7706
$$ 651932 670415 691478 714979 740891 769404 801051 836458 875886 919043 965127 1012833
62351A012833M7762M6629M4903M2476L8636L3346K7629K2245J6711J0391L869
$$ 1012833 1060595 1107224 1152127 1194603 1233239 1266585 1294214 1316459 1333170 1343561 1347430
62340A347430j669o040j0127j4427j8506k1811k4311k6151k7352k8012k8240k7807
$$ 1347430 1345761 1339721 1329594 1315167 1296661 1274850 1250539 1224388 1197036 1169024 1140784 1112977
62328A112977k6471k4730k3590k3393k3413k2937k2215k1969k2379k2903k2980
$$ 1112977 1086506 1061776 1038186 1014793 991380 968443 946228 924259 901880 878977 855997
62317H55997k2541k1996k1817k2024k2077k1410k0038j8398j6751j5087j3536
$$ 855997 833456 811460 789643 767619 745542 724132 704094 685696 668945 653858 640322
62306F40322j2338j1360j0178q689p259o157n372m952m945m793l639j548K44Q61
$$ 640322 627984 616624 606446 597757 590498 584341 578969 574017 569072 564279 560640 559092 559336 560197
62292E60197R75J812L489N083O081O834P654Q244Q323Q213Q439R049R609R742
$$ 560197 561172 562984 566473 571556 577637 584471 592125 600369 608692 616905 625344 634393 644002 653744
62278F53744R505R224R100Q948Q488P857P555P747P872P328O358N823O190P129
$$ 653744 663249 672473 681573 690521 699009 706866 714421 722168 730040 737368 743726 749549 755739 762868
62264G62868Q121R073J0157J1468J3114J5468J9017K3843K9334L4513L8704M1952
$$ 762868 770989 780062 790219 801687 814801 830269 849286 873129 902463 936976 975680 1017632
62252A017632M4728M7160M8687M8497M6258M2284L7219L1721K6259K0838J4931
$$ 1017632 1062360 1109520 1158207 1206704 1252962 1295246 1332465 1364186 1390445 1411283 1426214
62241A426214Q037L50p336j4412k0872k6871l2219l6545l9741m2031m3625m4472
$$ 1426214 1434251 1434601 1427265 1412853 1391981 1365110 1332891 1296346 1256605 1214574 1170949 1126477
62229A126477m4288m2848m0403l7755l5593l3656l0980k7307k3792k1787k1132
$$ 1126477 1082189 1039341 998938 961183 925590 891934 860954 833647 809855 788068 766936
62218G66936k0322j8362j5748j3497j1884j0551r338q333p459o540n625m758l631
$$ 766936 746614 728252 712504 699007 687123 676572 667234 658901 651442 644902 639277 634519 630888
62205F30888k024m25M72P58J151J756J901J385J040J562K538L327M183N638P222
$$ 630888 628864 628439 628911 629669 630820 632576 634477 635862 636902 638464 641002 644329 648512 654150 661372
62190F61372P811P243O611O816P579Q126Q229Q216Q377Q677Q850Q537P633O515
$$ 661372 669183 676426 683037 689853 697432 705558 713787 722003 730380 739057 747907 756444 764077 770592
62176G70592N725N393N283N361N833O653P569Q810J1069J4459J8032K0869K3189
$$ 770592 776317 781710 786993 792354 798187 804840 812409 821219 832288 846747 864779 885648 908837
62163I08837K5823K8857L1451L2972L3614L3704L2883L0404K6138K0929J5833
$$ 908837 934660 963517 994968 1027940 1061554 1095258 1128141 1158545 1184683 1205612 1221445
62152A221445J1231O857K572j369m839q265j2061j5936j9228k1728k3631k4773
$$ 1221445 1232676 1239533 1242105 1240736 1235897 1227632 1215571 1199635 1180407 1158679 1135048 1110275
62140A110275k4668k3431k1978k0959k0029j8579j6614j4576j2736j1321j0734
$$ 1110275 1085607 1062176 1040198 1019239 999210 980631 964017 949441 936705 925384 914650
62129I14650j0984j1183j0344q644p265o976p330p351o480m825k903j332m85j96
$$ 914650 903666 892483 882139 873495 866230 859254 851924 844573 838093 833268 830365 829033 828548 828352
62115H28352j2L44Q87J701K817L756L620K013l89k436l542l928m005l927l689
$$ 828352 828340 828684 829571 831272 834089 837845 841465 843478 843089 840653 837111 833183 829178 825251 821562
62100H21562l403l232l168l079k940k880k901k783k386j933j740j763j645j160
$$ 821562 818159 814927 811759 808680 805740 802860 799959 797176 794790 792857 791117 789354 787709 786549
62086G86549m03M10J083J410J436J713K900M931P004Q540R747J1049J2469J3833
$$ 786549 786146 786556 787639 789049 790485 792198 795098 800029 807033 815573 825320 836369 848838 862671
62072H62671J5155J6318J6823J6427J5806J5971J7131J8635J9943K1109K2243
$$ 862671 877826 894144 910967 927394 943200 959171 976302 994937 1014880 1035989 1058232
62061A058232K3070K3242K2733K1737K0403J8787J6834J4323J0996O869K391j821
$$ 1058232 1081302 1104544 1127277 1149014 1169417 1188204 1205038 1219361 1230357 1237226 1239617 1237796
62049A237796n421q610j1984j5891j9908k3292k5951k8504l1159l3154l3808l3581
$$ 1237796 1232375 1223765 1211781 1195890 1175982 1152690 1126739 1098235 1067076 1033922 1000114 966533
62037I66533l3397l3353l2924l2099l1361l0521k8705k5779k2878k1022j9957
$$ 966533 933136 899783 866859 834760 803399 772878 744173 718394 695516 674494 654537
62026F54537j8835j7417j5980j4566j2995j1384j0029q932p931p137o745o528
$$ 654537 635702 618285 602305 587739 574744 563360 553331 544399 536468 529331 522586 516058
62014E16058n993m989l832k841k081j589j432j467j291o17M57J587K494L125L578
$$ 516058 510065 505076 501244 498403 496322 494733 493301 491834 490543 489926 490383 491970 494464 497589 501167
61999E01167L903L954L521K701K018K008K630L216L018J804L2j612k767l600m367
$$ 501167 505070 509024 512545 515246 517264 519272 521902 525118 528136 529940 529972 528360 525593 521993 517626
61984E17626m993n236n239n516o321p207p439o726n512m638m641n238n473m707
$$ 517626 512633 507397 502158 496642 490321 483114 475675 468949 463437 458799 454158 448920 443447 438740
61970D38740l410k624k644k717k261j721j844k508k948k846k551k303j893j199
$$ 438740 435330 432706 430062 427345 425084 423363 421519 419011 416063 413217 410666 408363 406470 405271
61956D05271n13j29QO7J05K22O05J226J787K167K599L267L992M611N303O273P320
$$ 405271 404758 404629 404637 404704 404809 405031 405636 406862 408649 410816 413415 416682 420674 425285 430588 436861 444181
61939D44181Q103Q669R309J0062J0740J1351J2020J2517J2371J1505J0344R196
$$ 444181 452284 460953 470262 480324 491064 502415 514435 526952 539323 550828 561172 570368
61927E70368Q037P002O502O458O024M622K797J471O52l33j576k369k256j511l62
$$ 570368 578405 585407 591909 598367 604391 609013 611810 613281 613933 613600 612024 609655 607399 605888 605526
61912F05526J358L446M953N260M993N262O243P096P162O588N871N207M430L311
$$ 605526 606884 610330 615283 620543 625536 630798 637041 644137 651299 657887 663758 668965 673395 676706
61898F76706J831K82r72j867k555k978k915k627k874l917m962n097m434l788l589
$$ 676706 678537 678819 677847 675980 673425 670447 667532 664905 662031 658114 653152 648055 643621 639833 636244
61883F36244l758m269n097n865o255o665p655q888r451r186q763q408p591o219
$$ 636244 632486 628217 623120 617255 611000 604335 596680 587792 578341 569155 560392 551984 544393 538174
61869E38174n111m701m201k781r31J61J89j4L83J478K882M254N533O887Q425R910
$$ 538174 533063 528362 524161 521380 520449 520610 520799 520785 521168 522646 525528 529782 535315 542202 550627 560537
61853E60537J1034J1942J3066J4393J5416J5949J6353J6776J6905J6747J6817
$$ 560537 571571 583513 596579 610972 626388 642337 658690 675466 692371 709118 725935
61842G25935J6964J5971J3117R504O784N111L365J040j244k954m168m759m218
$$ 725935 742899 758870 771987 781491 788275 793386 796751 797791 796547 793593 789425 784666 780448
61829G80448k619r26J80J085K446M131N407N797N382M591L837L185K203M95j694
$$ 780448 777829 776903 777083 778168 780614 784745 790152 795949 801331 805922 809759 812944 815147 815642 813948
61814H13948l812n840q097j0207j1156j0819j0482j1237j2478j2841j2126j1314
$$ 813948 810136 804296 796199 785992 774836 764017 753535 742298 729820 716979 704853 693539
61802F93539j0933j0480r598q866q949r575r889r458q474p300o236n601n536n737
$$ 693539 682606 672126 662528 653662 644713 635138 625249 615791 607317 600017 593781 588180 582644 576907
61788E76907n748n499n226m931m369l568k910k526k117j658j665k297k726k176
$$ 576907 571159 565660 560434 555503 551134 547566 544656 542130 540013 538355 536690 534393 531667 529491
61774E29491j186q97j242j012J67J088P22l16q15o01j69N27J796L109L540L209
$$ 529491 528305 527408 526166 525154 525321 526409 527131 526815 526000 525399 525230 525757 527553 530662 534202 537411
61758E37411L116L562L850L719L934M922N764N232L241P13j506l044l784l865
$$ 537411 540527 544089 547939 551658 555592 560514 566278 571510 574751 575464 573958 570914 567130 563265
61744E63265l689l549l367l134l165l601l978l758l060k471k287k291k099j499
$$ 563265 559576 556027 552660 549526 546361 542760 538782 535024 531964 529493 527206 524915 522816 521317
61730E21317o40k7r1n47o11r7K28k05q11o54K28J017J402J800K351K509J899Q70
$$ 521317 520677 520650 520559 520012 519401 519304 519532 519327 518516 517862 518090 519107 520509 522309 524660 527169 529068 529938
61712E29938K4l93m51l49n37j450k868l883l853l133k595k683l210l838m347m592
$$ 529938 529962 529569 529118 528769 528232 526782 523914 520031 516178 513045 510450 507767 504557 500719 496372 491780
61696D91780m506m208l895l675l544l496l498l499l568l915m557n096m983m094
$$ 491780 487274 483066 479171 475496 471952 468456 464958 461459 457891 453976 449419 444323 439340 435246
61682D35246k870j892j388j163r82r21j181j608j646j015k67k41r46j511j353
$$ 435246 432376 430484 429096 427933 426951 426030 424849 423241 421595 420580 420313 420072 419126 417615 416262
61667D16262q91p89r42p66j73L57N51N84N82M88N12J043J882K219J778J384J777
$$ 416262 415371 414582 413640 412874 412701 413058 413609 414193 414775 415263 415775 416818 418700 420919 422697 424081 425858
61650D25858K417K239J302P31J025J397J071M21K78O63R16O96K97R7K52P39J225
$$ 425858 428275 430514 431816 432547 433572 434969 436040 436461 436739 437402 438318 439014 439311 439408 439660 440399 441624
61633D41624J089R1j005j145l73J72k65j171j659j627j528j507j387j250j374
$$ 441624 442713 442804 441799 440654 440281 440453 440188 439017 437358 435731 434203 432696 431309 430059 428685
61618D28685j625j572j242j230j852k657l056l140l439m105m656m620m109l698
$$ 428685 427060 425488 424246 423016 421164 418507 415451 412311 408872 404767 400111 395491 391382 387684
61604C87684l755m031l978l430k833k691k906k936k492j810j219q49q34j373k323
$$ 387684 383929 379898 375920 372490 369657 366966 364060 361124 358632 356822 355603 354754 353920 352547 350224
61589C50224l020k921k233j591j305j251j309j374j132l89L87M72m9l01Q5L91
$$ 350224 347204 344283 342050 340459 339154 337903 336594 335220 334088 333699 334086 334558 334509 334208 334293 334684
61573C34684l8p16p68k62Jk37n04n64o79q19m55N12J354J455J102Q86Q67P79O66
$$ 334684 334646 333930 333162 332900 332901 332664 332160 331596 330917 330098 329643 330155 331509 332964 334066 334952 335819 336598 337264
61554C37264P18P91O79O22R60J444J492J049O16M05J05l42m25J68R48J209R70
$$ 337264 337982 338773 339452 340074 341034 342478 343970 345019 345635 346040 346145 345803 345378 345546 346494 347703 348673
61537C48673Q46J173J705K131K493K891L116K817J923P55k57q69j059j008j040
$$ 348673 349519 350692 352397 354528 357021 359912 363028 365845 367768 368523 368266 367397 366338 365330 364290
61522C64290j385j863j991j556r40o85q92j260j506j458r43k4P11O87J35j88q1
$$ 364290 362905 361042 359051 357495 356555 355870 354978 353718 352212 350754 349811 349787 350498 351185 351320 351132 351051
61505C51051q7m19n34j12L13K75J98O03J065Q76L16K55P52J048Q57O60O80N65
$$ 351051 350964 350545 350011 349899 350212 350487 350685 351288 352353 353229 353545 353800 354552 355600 356457 357117 357797 358362
61487C58362K98M49J138J598J234M49J8K18R67K112L149L293K466J574J296J147
$$ 358362 358660 359109 360247 361845 363079 363528 363546 363764 364731 366843 369992 373285 375751 377325 378621 379768
61471C79768M36m36n08K57R41R81O32J95l37p36m72M06R68N19m32p69j18Q24J268
$$ 379768 380204 379768 379260 379517 380458 381439 382071 382266 381929 381193 380721 381127 382095 382614 382182 381413 381295 382119 383387
61452C83387J159R64R79J113J262J486J724J601Q85j1l68l1M30N27M44N87Q79
$$ 383387 384546 385510 386489 387602 388864 390350 392074 393675 394560 394549 394181 394150 394580 395107 395551 396138 397017
61435C97017R24O50M66P25J244J457J012K18j71K75J164J763J818J616J354R93
$$ 397017 397941 398591 399057 399782 401026 402483 403495 403713 403542 403817 404981 406744 408562 410178 411532 412525
61419D12525O00L54J04m18q58m56P07J440R25j99q19q32q92j193j308j011m77
$$ 412525 413125 413479 413583 413165 412307 411851 412558 413998 414923 414724 413905 413073 412181 410988 409680 408669 408192
61402D08192J49P34R01M13l61r60j487k079k161j199Q7M22j49k94N13J186Q67
$$ 408192 408341 409075 409976 410389 410028 409068 407581 405502 403341 402142 402229 402651 402502 402208 402721 403907 404774
61385D04774M23J205L031M335L997K353O01k41P4R66J642J906K192K688K905K395
$$ 404774 405197 406402 409433 413768 417765 420118 420719 420478 420552 421518 423160 425066 427258 429946 432851 435246
61369D35246J479Q93R71J480J965K045J687J416J850K802L378L238L130L690M459
$$ 435246 436725 437618 438589 440069 442034 444079 445766 447182 449032 451834 455212 458450 461580 465270 469729
61354D69729M708M634M849N151M867M213M200N070N923O079N910N843N463M317
$$ 469729 474437 479071 483920 489071 493938 498151 502351 507421 513344 519423 525333 531176 536639 540956
61340E40956K926K215K221K170J644R82N33J71k19m19l22l30q62j676k166k239
$$ 540956 543882 546097 548318 550488 552132 553114 553647 553818 553599 553180 552858 552528 551666 549990 547824 545585
61324E45585k430l010l477l171k145r98p0P60J585K332L168M431N965P097P646
$$ 545585 543155 540145 536668 533497 531352 530354 530284 531044 532629 534961 538129 542560 548525 555622 563268
61309E63268Q414J0098J2134J3371J3612J3641J3793J3486J2411J1226J0458R475
$$ 563268 571682 581780 593914 607285 620897 634538 648331 661817 674228 685454 695912 705387
61297G05387P403M556K058K56j527l665n622o881p613p960p548o427n766o617
$$ 705387 712790 717346 719404 719660 718133 714468 708846 701965 694352 686392 678844 672417 666651 660034
61283F60034q237q806p801o589o353o472n633l787k045j084n41N3O48J102J566
$$ 660034 651797 642991 635190 628601 622248 615776 610143 606356 604311 603227 602686 602739 603387 604489 606055
61268F06055K093K401K333K194K358K816L372M016M835N722O421O783O792O456
$$ 606055 608148 610549 612882 615076 617434 620250 623622 627638 632473 638195 644616 651399 658191 664647
61254F64647N837N025L986K611J078o9m74m67p29j495k352k748k509j822j045
$$ 664647 670484 675509 679495 682106 683184 683115 682641 682174 681445 679950 677598 674850 672341 670519 669474
61239F69474n76o91j319k004k277k001j308l24Q19J768K093J871J880K799M320
$$ 669474 668898 668207 666888 664884 662607 660606 659298 658974 659793 661561 663654 665525 667405 670204 674524
61224F74524N444N684N523N617O026O502P021P574P849P698P498P511P233O185
$$ 674524 679968 685652 691175 696792 702818 709320 716341 723915 731764 739462 746960 754471 761704 767889
61210G67889N059M949N580N421L931K502K572L759M714N046N401O161P136Q313
$$ 767889 772948 777897 783477 788898 792829 795331 797903 801662 806376 811422 816823 822984 830120 838433
61196H38433R882J1592J2895J3795J4717J5491J5293J3812J1768R927Q236O310
$$ 838433 848315 859907 872802 886597 901314 916805 932098 945910 957678 967605 975841 982151
61184I82151M182K145K70j393k509k874l000l715n194o798p945q795r848j1165
$$ 982151 986333 988478 988748 987355 984846 981972 978972 975257 970063 963265 955320 946525 936677 925512
61170I25512j2283j2939j3449j4237j5119j5505j5203j4673j4328j4050j3612
$$ 925512 913229 900290 886841 872604 857485 841980 826777 812104 797776 783726 770114
61159G70114j3168j2902j2529j1669j0492r400q227o414m009j844n53%J34j76
$$ 770114 756946 744044 731515 719846 709354 699954 691727 685313 681304 679460 678907 678907 679041 678865
61145F78865q92j561j903k317l199m108m222l582l148l514m055l751k506j202
$$ 678865 677973 676412 674509 672192 668993 664885 660663 657081 653933 650419 646364 642613 640107 638905
61131F38905m57K28J795M310O765Q329R343J0707J2602J4418J5860J7420J9466
$$ 638905 638448 638676 640471 644781 651546 659875 669218 679925 692527 706945 722805 740225 759691
61118G59691K1464K2594K2857K3103K4078K5739K7342K7964K7171K5468K3917
$$ 759691 781155 803749 826606 849709 873787 899526 926868 954832 982003 1007471 1031388
61107A031388K3024K2238K0849J8931J6988J4958J2415R469O702M099R06l145
$$ 1031388 1054412 1076650 1097499 1116430 1133418 1148376 1160791 1170260 1176962 1181061 1181967 1178822
61095A178822p240j0571j3339j6112j8740k0644k1846k2862k3750k3969k3274
$$ 1178822 1171582 1161011 1147672 1131560 1112820 1092176 1070330 1047468 1023718 999749 976475
61084I76475k2066k0763j9411j8095j7090j6298j5108j3193j1054r376q172p077
$$ 976475 954409 933646 914235 896140 879050 862752 847644 834451 823397 814021 805849 798772
61072G98772o017n056l863k031J33J798K679L332M196N056N655O357P644R316
$$ 798772 792755 787699 783836 781805 781938 783736 786415 789747 793943 798999 804654 811011 818655 827971
61058H27971J0729J1718J2774J4280J5917J7082J7667J8274J9574K1550K3526
$$ 827971 838700 850418 863192 877472 893389 910471 928138 946412 965986 987536 1011062
61047A011062K4997K6186K7557K8997K9955L0334L0689L1399L2146L2523L2657
$$ 1011062 1036059 1062245 1089802 1118799 1148754 1179088 1209777 1241176 1273322 1305845 1338502
61036A338502L2824L2849L2392L1577L0846L0380L0126L0125L0320L0313K9853
$$ 1338502 1371326 1404175 1436567 1468144 1498990 1529370 1559496 1589621 1619941 1650254 1680107
61025A680107K9420K9649L0316L0623L0478L0582L1178L1564L1356L1449L3087
$$ 1680107 1709527 1739176 1769492 1800115 1830593 1861175 1892353 1923917 1955273 1986722 2019809
61014B019809L6446M0825M5830N1636N8305O5660P4042Q4587R8489J16350J38514
$$ 2019809 2056255 2097080 2142910 2194546 2252851 2318511 2392553 2477140 2575629 2691979 2830493
61003B830493J65913K00262K43419K96788L61572M39989N36495O57396Q07552
$$ 2830493 2996406 3196668 3440087 3736875 4098447 4538436 5074931 5732327 6539879
60994F539879R84526J173348J347032J475440J538073J531097J463161J345993
$$ 6539879 7524405 8697753 10044785 11520225 13058298 14589395 16052556 17398549
60986A7398549J190828J012979Q34757O77806N50120M41715L34278K14461P7564
$$ 17398549 18589377 19602356 20437113 21114919 21665039 22106754 22441032 22655493 22733057
60977B2733057p9090k61547m74593p11439r49789j159723j316852j410010j440014
$$ 22733057 22653967 22392420 21917827 21206388 20256599 19096876 17780024 16370014 14930000
60968A4930000j414562j345016j245201j129604j010500q96191p91270o97674
$$ 14930000 13515438 12170422 10925221 9795617 8785117 7888926 7097656 6399982
60960F399982o15579n44176m82288m28370l80312l36174k95469k59165k27992
$$ 6399982 5784403 5240227 4757939 4329569 3949257 3613083 3317614 3058449 2830457
60951B830457k01139j77057j55175j36131j20462j07695r6888q7515p9485p2707
$$ 2830457 2629318 2452261 2297086 2160955 2040493 1932798 1835910 1748395 1668910 1596203
60941A596203o7072o2710n9769n7811n5820n3019m9508m5924m2638l9541l6510
$$ 1596203 1529131 1466421 1406652 1348841 1293021 1240002 1190494 1144570 1101932 1062391 1025881
60930A025881l3683l1133k8655k6079k3614k1603j9997j8332j6285j4128j2502
$$ 1025881 992198 961065 932410 906331 882717 861114 841117 822785 806500 792372 779870
60919G79870j1766j1633j1425j0682r467q068o652n309m299l844l692l256k319
$$ 779870 768104 756471 745046 734364 724897 716829 710177 704868 700569 696725 693033 689777 687458
60906F87458j377j059j434k062k446k328j823j462j857l006m187m822n155n691
$$ 687458 686081 685022 683588 681526 679080 676752 674929 673467 671610 668604 664417 659595 654440 648749
60892F48749o267o290n772n451n728o089n880n266m980n345n939o175n976n711
$$ 648749 642482 636192 630420 624969 619241 613152 607272 602006 597026 591681 585742 579567 573591 567880
60878E67880n620n553n323n186n540o192o319n474m252l532l355l127k665k372
$$ 567880 562260 556707 551384 546198 540658 534466 528147 522673 518421 514889 511534 508407 505742 503370
60864E03370k320j956r37L25J313K034K700L198L315L168K975K689K324K313L011
$$ 503370 501050 499094 498157 498482 499795 501829 504529 507727 511042 514210 517185 519874 522198 524511 527522
60849E27522L988M331L718K774K272K333K506K335J744R46J58o62j726l074m367
$$ 527522 531510 535841 539559 542333 544605 546938 549444 551779 553523 554469 554627 553965 552239 549165 544798
60834E44798n104n017m267l434l246l970m923m978l850k570k319l089l915m159
$$ 544798 539694 534677 530410 526976 523730 519760 514837 509859 506009 503439 501120 498031 494116 489957
60820D89957l996l723l370l046l106l621m175m443m631m987n243m956m182l409
$$ 489957 485961 482238 478868 475822 472716 469095 464920 460477 455846 450859 445616 440660 436478 433069
60806D33069k936k750k883l404l930l710k535j268r85j678k231j832q69k38r5
$$ 433069 430133 427383 424500 421096 417166 413456 410921 409653 408668 406990 404759 402927 402058 401820 401725
60791D01725J15N53O62J48k79K64J574K481K235J282N53L96M44L25J53L31R09
$$ 401725 401840 402393 403055 403203 402924 403188 404762 407243 409478 410760 411313 411709 412153 412478 412631 412962 413871
60774D13871J356J068J80m40j62O66J235J297J242J359J506J573J653J663J306
$$ 413871 415227 416295 416475 416035 415873 416539 417774 419071 420313 421672 423178 424751 426404 428067 429373
60759D29373N90n8m14o96r38p16N8N82R4j011j604j216l63L41P01O08m9r40j405
$$ 429373 429963 429905 429491 428795 427857 427141 427199 427781 427875 426864 425260 424044 423681 424022 424723 425331 425282 424342 422937
60740D22937j292j226j761k698l544m169m630m774m470l953l551l215k718k143
$$ 422937 421645 420419 418658 415960 412416 408247 403617 398843 394373 390420 386869 383654 380936 378793
60726C78793j727j377p86j5M82M56J94Q0J41P7l63j074j558j319m07N65J172J669
$$ 378793 377066 375689 374903 374888 375370 375826 376020 376100 376241 376318 375955 374881 373323 372004 371597 372162 373334 375003
60708C75003K431L151L192K622K207K303K364J873J163Q32Q32P06M29M24Q03J165
$$ 375003 377434 380585 383777 386399 388606 390909 393273 395146 396309 397141 397973 398679 399108 399532 400335 401500
60692D01500J170R18O80N43M39L41L10L87M83L61l3k48K87J366J972J556Q62R51
$$ 401500 402670 403588 404268 404811 405250 405591 405901 406288 406771 407132 407099 406851 407138 408504 410476 412032 412894 413845
60674D13845J685K031J661J315J482J647J228N07M1k34p40j507k191k558k504
$$ 413845 415530 417561 419222 420537 422019 423666 424894 425401 425442 425208 424468 422961 420770 418212 415708
60659D15708j952j190r16j361j793j476p76n82q89q73k57L16M08M07P07J026R64
$$ 415708 413756 412566 411650 410289 408496 407020 406244 405662 404773 403900 403643 403959 404367 404774 405481 406507 407471
60642D07471O15K40k15p92j198j245j223j414j617j562j455j616j871j833j517
$$ 407471 408086 408326 408111 407319 406121 404876 403653 402239 400622 399060 397605 395989 394118 392285 390768
60627C90768j161o77J22R37J237J032P90O40L15j06j32K73M22q9o87o06P0O83
$$ 390768 389607 388930 389052 389989 391226 392258 393048 393688 394003 393897 393765 394038 394460 394371 393684 393078 393148 393831
60609C93831J014J389J896K097J631P00k30q94j238j162o11J61O96Q45J008J683
$$ 393831 394845 396234 398130 400227 401858 402558 402328 401434 400196 399034 398423 398584 399280 400125 401133 402816
60593D02816K731L345K907J760Q60P45J091J352J480J798K343K690K384J431K83
$$ 402816 405547 408892 411799 413559 414419 415164 416255 417607 419087 420885 423228 425918 428302 429733 430016
60578D30016m64m13M56J770K882L240K841K408K808M146N635O583P291Q482J0133
$$ 430016 429552 429139 429595 431365 434247 437487 440328 442736 445544 449690 455325 461908 469199 477681 487814
60563D87814J1456J2085J2467J2804J2430J0843Q757P248O189M513J968l81j612
$$ 487814 499270 511355 523822 536626 549056 559899 568656 575904 582093 586606 588574 588193 586581
60550E86581k119k790l728m325m237l587k501r83P31K201L240M113N299P240J0089
$$ 586581 584462 581672 577944 573619 569382 565795 563294 562311 563042 565243 568483 572596 577895 585135 595224
60535E95224J3342J5891J6987J7181J7787J9210K0349J9902J7894J5415J3120
$$ 595224 608566 624457 641444 658625 676412 695622 715971 735873 753767 769182 782302
60524G82302J0643P489L912N82k233m754p104q985r998j0108r673r169q908q837
$$ 782302 792945 800434 804346 804928 802695 797941 790837 781852 771854 761746 752073 742904 733996 725159
60510G25159q601p873o691n328l892k190n0K452N121P891J0780J3885J7443K1646
$$ 725159 716558 708685 701994 696666 692774 690584 690534 692986 698107 705998 716778 730663 748106 769752
60496G69752K6175L0290L3728L7134M1087M4924M7239M7533M6621M5297M3347
$$ 769752 795927 826217 859945 897079 938166 983090 1030329 1077862 1124483 1169780 1213127
60485A213127M0254L6169L1546K6373K0391J3809P055N9p510j5362k2702k9193
$$ 1213127 1253381 1289550 1321096 1347469 1367860 1381669 1388724 1388783 1381273 1365911 1343209 1314016
60473A314016l5212m0844m5402m8192m9308m9285m8423m6780m4510m1757l8499
$$ 1314016 1278804 1237960 1192558 1144366 1095058 1045773 997350 950570 906060 864303 825804
60462H25804l4891l1501k8845k6809k4895k2894k1012j9399j7910j6289j4396
$$ 825804 790913 759412 730567 703758 678863 655969 634957 615558 597648 581359 566963
60451E66963j2319j0407r016q032o915n541m635m870n726n964n189m258l967m035
$$ 566963 554644 544237 535221 527189 520274 514733 510098 505228 499502 493538 488349 484091 480124 476089
60437D76089l770l177k756k608k325j733j180r95j078j154j204j408j801k086
$$ 476089 472319 469142 466386 463778 461453 459720 458540 457545 456467 455313 454109 452701 450900 448814
60423D48814j871j100k33J75J14R0L83O57O19O53J310K304K738K387K041K296
$$ 448814 446943 445843 445610 445785 445899 445989 446372 447029 447648 448301 449611 451915 454653 457040 459081 461377
60407D61377K568J977P38ML33J036J179P23L63O64J637K897L819L784K735J487
$$ 461377 463945 465922 466660 466664 466997 468033 469212 469935 470298 470962 472599 475496 479315 483099 485834 487321
60391D87321J080J720K662L165L228L161K895K211J445J383K294L466L936L448
$$ 487321 488401 490121 492783 495948 499176 502337 505232 507443 508888 510271 512565 516031 519967 523415
60377E23415K467J547J038J176J975K916L230K677J850J438J469J484J336J395
$$ 523415 525882 527429 528467 529643 531618 534534 537764 540441 542291 543729 545198 546682 548018 549413
60363E49413J992K880L442L251K410J422Q40R07J451K089K629L231M189N544O945
$$ 549413 551405 554285 557727 560978 563388 564810 565650 566557 568008 570097 572726 575957 580146 585690 592635
60348E92635P866Q054P742P370P045O441N283L805K469J324l6j827l661m957n571
$$ 592635 600501 608555 616297 623667 630712 637153 642436 646241 648710 650034 649998 648171 644510 639553 633982
60333F33982n805n905n847n569n245n167n442n824n829n163m067l186k923l001
$$ 633982 628177 622272 616425 610856 605611 600444 595002 589178 583349 578186 574119 570933 568010 565009
60319E65009k828k242j652j356j016m8J582L239M305M832N442O698Q674J1002
$$ 565009 562181 559939 558287 556931 555915 555867 557449 560688 564993 569825 575267 581965 590639 601641
60305F01641J3195J4976J6402J7668J8717J9103J8307J6210J3164R655O048K574
$$ 601641 614836 629812 646214 663882 682599 701702 720009 736219 749383 759038 765086 767660
60293G67660o53l726o755r500j1452j2445j2912j3238j3197j2446j1365j0751
$$ 767660 767007 763281 756526 747026 735574 723129 710217 696979 683782 671336 659971 649220
60281F49220j0686j0436r569q566p968p601p069o549o350o187n561m742m554n164
$$ 649220 638534 628098 618529 609963 601995 594394 587325 580776 574426 568239 562678 557936 553382 548218
60267E48218n772n632m812l781k827k190k163k716l238l104k275j178k65J41q4
$$ 548218 542446 536814 532002 528221 525394 523204 521041 518325 515087 511983 509708 508530 508265 508406 508322
60252E08322o16p83j94Q02J565J801J636J304J023R57J031R47N90J86p1k29k30
$$ 508322 507706 506923 506729 507531 509096 510897 512533 513837 514860 515817 516848 517795 518385 518571 518500 518271 518041
60235E18041J55P45Q16J23m08K81J935L384M067M332M370L924L145K781L136L649
$$ 518041 518196 518941 519757 519880 519472 519753 521688 525072 529139 533471 537841 541765 544910 547691 550827 554476
60219E54476M010M760O223P579P845P295P073P636Q402Q788Q831Q750Q583Q408
$$ 554476 558486 563246 569469 577048 584893 592188 599261 606897 615299 624087 632918 641668 650251 658659
60205F58659Q440Q680Q836Q680Q263P739P158O526N783M835L754K804K023J040
$$ 658659 667099 675779 684615 693295 701558 709297 716455 722981 728764 733599 737353 740157 742180 743220
60191G43220l35j605k254k635l449m471m687l919l371m062n454o286o261o110
$$ 743220 742885 741280 739026 736391 732942 728471 723784 719865 716494 712432 706978 700692 694431 688321
60177F88321o298o480o165n305m127k918k052j810j991k065j810j538j569j840
$$ 688321 682023 675543 669378 664073 659946 657028 654976 653166 651175 649110 647300 645762 644193 642353
60163F42353k087k208k229k131j845j336o48KK69Lm00k88N41J625K361K509K161
$$ 642353 640266 638058 635829 633698 631853 630517 629869 629871 630140 630143 629743 629455 629996 631621 633982 636491 638652
60146F38652J607J386K053L539M968N532N401N425O023O816P302P476P657Q064
$$ 638652 640259 641645 643698 647237 652205 657737 663138 668563 674586 681402 688704 696180 703837 711901
60132G11901Q716R499J0060R924Q930P440N936M612L516K855K727K724K268J427
$$ 711901 720617 730116 740176 750100 759030 766470 772406 777018 780534 783389 786116 788840 791108 792535
60118G92535R63J347K117K436K059J400Q60M67R0l58r98j958l131m132m660m708
$$ 792535 793498 794845 796962 799398 801457 802857 803717 804184 804274 803916 802918 800960 797829 793697 789037 784329
60102G84329m432m064l984m560n651o450o191m973l692l094l119l144k675j722
$$ 784329 779897 775833 771849 767289 761638 755188 748997 744024 740332 737238 734119 730975 728300 726578
60088G26578o31K73Q94J264J444J555J915K782L914M574M312L538K959K504J293
$$ 726578 725947 726220 727114 728378 729822 731377 733292 736074 739988 744562 748874 752412 755371 757875 759168
60073G59168j151m072o246p324q033r074j0306j1136j1317j1060j0561r887r272
$$ 759168 758017 753945 747699 740375 732342 723268 712962 701826 690509 679449 668888 659001 649729
60060F49729r024q972q425p093n718n270n543n272l746j734l73K78J006K106L046
$$ 649729 640705 631733 623308 616215 610497 605227 599684 594412 590666 588932 588559 588837 589843 591949 594995
60045E94995L392L433L675M311N309O474P219O850N451M067L509L345K552R84
$$ 594995 598387 601820 605495 609806 615115 621589 628808 635658 641109 645176 648685 652030 654582 655566
60031F55566m69j132j357j864k734l426l650l838m598n879o950p305p346p833
$$ 655566 655097 653965 652608 650744 648010 644584 640934 637096 632498 626619 619669 612364 605018 597185
60017E97185q744r184q576p429o643o459o539o608o456n628l979k381j996k691
$$ 597185 588441 579257 570681 563252 556609 550150 543611 537003 530547 524919 520940 518559 516563 513872
60003E13872l001k036o14M6M0L78J298J956J802J370J513K379L503M390M739M499
$$ 513872 510871 508835 508221 508267 508307 508685 509983 511939 513741 515111 516624 519003 522506 526896 531635 536134
59987E36134M066M110M769N205M501K905J611J247J118L29r14j719j924k251l008
$$ 536134 540200 544310 549079 554284 558785 561690 563301 564548 565666 565995 565081 563362 561438 559187 556179
59972E56179l434k794j554p01l40L13J573K771L334L720M716O251P436P644P083
$$ 556179 552745 549951 548397 547696 547356 547669 549242 552013 555347 559067 563783 570034 577470 585114 592197
59957E92197O319N630M918L959K637J085l31j257j691j991k518l256l783l681
$$ 592197 598516 604146 609064 613023 615660 616745 616414 615157 613466 611475 608957 605701 601918 598237
59943E98237l037k469k560l216l775l756l319k926k776k741k588k141j353m75
$$ 598237 595200 592731 590171 586955 583180 579424 576105 573179 570403 567662 565074 562933 561580 561105
59929E61105J29M72J051K184L468M266M532M706M971N130N180N382N620N372M542
$$ 561105 561234 561706 562757 564941 568409 572675 577207 581913 586884 592014 597194 602576 608196 613568 618110
59914F18110L859M000M716N334N730O254O943P446P633P692P499O594M955L277
$$ 618110 621969 625969 630685 636019 641749 648003 654946 662392 670025 677717 685216 691810 696765 700042
59900G00042K079J071j20j030q37L33J377J612J555J992K768L101K802K522K823
$$ 700042 702121 703192 703072 702042 701205 701538 702915 704527 706082 708074 710842 713943 716745 719267 722090
59885G22090L499M121M748N712O875P567P356O588O000N966O214O227N731M762
$$ 722090 725589 729710 734458 740170 747045 754612 761968 768556 774556 780522 786736 792963 798694 803456
59871H03456L469K017O37l50p72q12r11j399k249l202m109n089o294p535q275
$$ 803456 806925 808942 809579 809229 808457 807645 806734 805335 803086 799884 795775 790686 784392 776857 768582
59856G68582q145p428o838o736o737o266n252m133l241k467j487r7J604L168M030
$$ 768582 760437 753009 746171 739435 732698 726432 721180 717047 713806 711339 709852 709755 711359 714527 718557
59841G18557M139M200M855N713N715M643L537L297L509L219K390J764J613J404
$$ 718557 722696 726896 731751 737464 743179 747822 751359 754656 758165 761384 763774 765538 767151 768555
59827G68555Q00Q5n50j513l151n101o701p701q217q296q021p802q003q331q065
$$ 768555 769355 769440 768890 767377 764226 759125 752424 744723 736506 728210 720189 712387 704384 696053 687988
59812F87988p025n928n589n950o155n548m403l585l545l822l673l012k465k426
$$ 687988 680963 675035 669446 663496 657341 651793 647390 643805 640260 636438 632765 629753 627288 624862
59798F24862k471j996j167p74j162j704j565o97K14N94M53J7o18j274j461q37
$$ 624862 622391 620395 619228 618454 617292 615588 614023 613326 613540 614134 614587 614604 613986 612712 611251 610414
59782F10414J54O01J69n01p12n89o83r87r92n59j52j1K25Q64J623K126K484K925
$$ 610414 610568 611169 611338 610837 610125 609536 608853 607866 606874 606315 606163 606152 606377 607241 608864 610990 613474 616399
59764F16399L312L529M050N390P084Q052P993P791Q286R289J0192J0979J2016
$$ 616399 619711 623240 627290 632680 639764 647816 655809 663600 671886 681175 691367 702346 714362
59751G14362J3232J4145J4581J4836J5112J5256J5093J4623J3827J2689J1418
$$ 714362 727594 741739 756320 771156 786268 801524 816617 831240 845067 857756 869174
59740H69174J0196Q659O122K687l82j933k211k415l149l964m341m411m521m716
$$ 869174 879370 888029 894151 896838 896456 894523 892312 889897 886748 882784 878443 874032 869511 864795
59726H64795m966n456o205o785o883o774o798o687o019n152m892n241n280m569
$$ 864795 859829 854373 848168 841383 834500 827726 820928 814241 808222 803070 798178 792937 787657 783088
59712G83088l838l840m188l966l099k276j827j442r01l90N4O75J353J598J459
$$ 783088 779250 775410 771222 767256 764157 761881 760054 758612 757711 757321 757375 758050 759403 761001 762460
59697G62460J804L066M304M258L013J892J758K146K187J703J073N61R3n34j511
$$ 762460 764264 767330 771634 775892 778905 780797 782555 784701 786888 788591 789664 790225 790318 789784 788273
59682G88273k747l668l632k847k397l037m299n193n464n628n993o321o388o302
$$ 788273 785526 781858 778226 775379 772982 769945 765646 760453 754989 749361 743368 737047 730659 724357
59668G24357o103n576m642l625k896k495k214j802j079j14P39J212J529K077K780
$$ 724357 718254 712678 708036 704411 701515 699020 696806 695004 693925 693811 694550 695762 697291 699368 702148
59653G02148L270L556L897M077L591K650K130K109J444n86l059m670n456o277
$$ 702148 705418 708974 712871 716948 720539 723189 725319 727428 728872 728286 725227 720557 715101 708824
59639G08824p101p113o269n535n490n716n764n683n439m787m065m179n250o135
$$ 708824 701723 694610 688341 682806 677316 671600 665836 660153 654714 649927 645862 641683 636433 630298
59625F30298n882m952m378m363m396m265m180m194m163m150m269m293l919l164
$$ 630298 624416 619464 615086 610723 606327 602062 597882 593688 589525 585375 581106 576813 572894 569730
59611E69730k188r17N84J699J756R37J08j47N8L83O99J019J325J540J489J073
$$ 569730 567542 566625 567209 568908 570664 571601 571709 571562 571620 572003 572702 573721 575046 576586 578075 579148
59595E79148N50L75M77J81p69j521j110J41R51O67j30o44q15j103j803k761l459
$$ 579148 579698 580073 580550 580731 579962 578441 577331 577472 578423 579090 578960 578316 577501 576398 574595 571834 568375
59578E68375l417k789k417k802l255k708j227J5K60o3k47j88j05r5l10r59j736
$$ 568375 564958 562169 559752 556950 553695 550987 549760 549775 550035 549972 549725 549537 549432 549337 549027 548068 546332
59561E46332j796p93N41J209R46P5j011j797j633m89O90J020P94Q91J381J555
$$ 546332 544536 543743 544284 545493 546439 546514 545503 543706 542073 541584 542274 543294 544088 544979 546360 547915
59545E47915J215J112J840L137M546O239Q564J1157J3060J3729J3518J3043J2343
$$ 547915 549130 550242 552082 555219 559765 566004 574568 585725 598785 612514 626032 639075 651418
59532F51418J0944Q662O054L885K353J140J38l09j8N32O25M4p59j219j232j261
$$ 651418 662362 671024 677078 680963 683316 684456 684594 684285 684267 684799 685424 685468 684709 683490 682258 680997
59516F80997j928l270m509m918m851n388o814q092q253p691p414p544p364o608
$$ 680997 679069 675799 671290 666372 661521 656133 649319 641227 632974 625283 617869 610325 602961 596353
59502E96353n737m969l862k252q17k97n70r51j094j174j374j528j265m02Q10J790
$$ 596353 590616 585647 581785 579533 578716 578419 577849 576898 575804 574630 573256 571728 570463 570061 570871 572661
59486E72661K193K334K790L583M082L888L405L290L630L984M028L889L868M078
$$ 572661 574854 577188 579978 583561 587643 591531 594936 598226 601856 605840 609868 613757 617625 621703
59472F21703M344M355L955L330K794K433K123J885J844J814J386O43L64J113K453
$$ 621703 626047 630402 634357 637687 640481 642914 645037 646922 648766 650580 651966 652609 652973 654086 656539
59457F56539L504M044M563N396O324P066P614Q023Q192Q018P435O312M613K736
$$ 656539 660043 664087 668650 674046 680370 687436 695050 703073 711265 719283 726718 733030 737643 740379
59443G40379J222N1j377l272m939n596n386n148n317n540n349m767m129l631l208
$$ 740379 741601 741652 740275 737003 732064 726468 721082 715934 710617 705077 699728 694961 690832 687201 683993
59428F83993k710j969q28P60K624M474O129P683R382J1280J3049J4368J5531J7347
$$ 683993 681283 679314 678486 679246 681870 686344 692473 700156 709538 720818 733867 748235 763766 781113
59414G81113K0117K2870K4047K3008K0545J7849J5293J2329Q416L818l78k940
$$ 781113 801230 824100 848147 871155 891700 909549 924842 937171 945587 949405 949027 946087
59402I46087l352k188n83P12J659K393K713K255R46r77l299n916q697j1415j3742
$$ 946087 942735 940547 939964 940676 942335 944728 947441 949696 950642 949665 946366 940450 931753 920338 906596
59387I06596j5196j5354j4283j2664j1198j0004q835p700o845o236n484m403l317
$$ 906596 891400 876046 861763 849099 837901 827897 819062 811362 804517 798281 792797 788394 785077
59374G85077k631k429k538k755k769k213j037K25Q87P70M18N74J480K635L295
$$ 785077 782446 780017 777479 774724 771955 769742 768705 768930 769817 770587 771005 771579 773059 775694 778989
59359G78989L311L380M306O042P803R017R842J0696J1689J2762J3954J5240J6333
$$ 778989 782300 785680 789986 796028 803831 812848 822690 833386 845075 857837 871791 887031 903364
59346I03364J7006J7448J7980J8492J8507J7701J6144J4034J1565Q975O431L779
$$ 903364 920370 937818 955798 974290 992797 1010498 1026642 1040676 1052241 1061216 1067647 1071426
59334A071426O89k866o422r441j1722j3363j4547j5472j6344j7183j7733j7693
$$ 1071426 1072115 1069249 1062827 1053386 1041664 1028301 1013754 998282 981938 964755 947022 929329
59322I29329j7074j6176j5245j4312j3382j2551j1811j0899r680q587q313q896
$$ 929329 912255 896079 880834 866522 853140 840589 828778 817879 808199 799612 791299 782403
59310G82403r479r221q189o978n798m472l171k434k310k126j411n26M2M95J371
$$ 782403 772924 763703 755514 748536 742738 738266 735095 732661 730351 728225 726814 726288 726330 726825 728196
59295G28196K739M329O108Q103R717R988Q645O391M014J669p54l059m855n966
$$ 728196 730935 735264 741372 749475 759192 769180 777825 784216 788230 789899 789145 786086 781231 775265
59281G75265o375n971m670k752p31J123K989N198P807J0508J2828J4336J4769
$$ 775265 768890 762919 758249 755497 754766 755889 758878 764076 771883 782391 795219 809555 824324
59268H24324J4182J3090J2206J1809J1373J0136Q047N824M035K515Q19j111l045
$$ 824324 838506 851596 863802 875611 886984 897120 905167 910991 915026 917541 918360 917249 914204
59255I14204m822o250o993o921o377n624m446k806j519j453k177k303j261N6O34
$$ 914204 909382 903132 896139 889218 882841 877217 872771 869965 868446 866993 864816 862513 861252 861308 861942
59240H61942N37M12N65R58J573K173K154J262J71j99J98M83k41k198m922p505
$$ 861942 862479 862891 863456 864414 865987 868160 870314 871576 871747 871548 871746 872229 871988 869790 864868 857363
59224H57363r174r979j0696j1716j2449j2202j1257j0480j0114r723r093q452
$$ 857363 848189 838210 827514 815798 803349 791147 779890 769410 759296 749573 740480 732028
59212G32028p787o771n500m639m535m717m588m087l383k423j164M7P73J028J203
$$ 732028 724241 717470 711970 707331 702796 698079 693491 689404 686021 683598 682434 682481 683254 684282 685485
59197F85485J582K130K634K903K970L143L656M269M524M462M637N246N738N589
$$ 685485 687067 689197 691831 694734 697704 700847 704503 708772 713296 717758 722395 727641 733379 738968
59183G38968M990M421L949L397K882K589K320J836J445J584J976J882J189N86
$$ 738968 743958 748379 752328 755725 758607 761196 763516 765352 766797 768381 770357 772239 773428 774014
59169G74014N71R58J437J918K107J492K17p62q70p95j518k943m148m693m981n463
$$ 774014 774585 775543 776980 778898 781005 782497 782714 781952 781082 780287 778769 775826 771678 766985 762004 756541
59153G56541o213p148q093q662q636q471q773r337r320q472p487o997o843o624
$$ 756541 750328 743180 735087 726425 717789 709318 700545 691208 681888 673416 665929 658932 652089 645465
59139F45465o295n905n299m486l744l069k078p67J66L60M66J196K201K685K736
$$ 645465 639170 633265 627966 623480 619736 616667 614589 613822 613988 614348 614814 616010 618211 620896 623632
59124F23632L068L806M398M761N502O887Q443R707J0679J1277J1142J0346R610
$$ 623632 626700 630506 634904 639665 645167 652054 660497 670204 680883 692160 703302 713648 723258
59111G23258R429R513R456R363R266Q556O678M160K251J552J481J081M0j185j985
$$ 723258 732687 742200 751656 761019 770285 778841 785519 789679 791930 793482 794963 796044 796084 794899 792914
59096G92914k278k519l019l441l245k538j960j767j650j541j879k714l328l279
$$ 792914 790636 788117 785098 781657 778412 775874 773914 772147 770497 768956 767077 764363 761035 757756
59082G57756l166l712m617n145n344n831o606p084p137p217p380p135o402n762
$$ 757756 754590 750878 746261 741116 735772 729941 723335 716251 709114 701897 694517 687382 680980 675218
59068F75218n478n080m260l502l320l444l310k873k496k342k356k551k898l145
$$ 675218 669740 664660 660400 656898 653578 650134 646824 643951 641455 639113 636757 634206 631308 628163
59054F28163l098k911k789k622k245j799j498j213p01o6L04K33j60o84j106j092
$$ 628163 625065 622154 619365 616743 614498 612699 611201 609988 609287 609221 609525 609758 609598 608914 607808 606716
59038F06716m28O54J625K158K374K679L498M972O745Q224R267J0359J1894J3588
$$ 606716 606288 606942 608567 610725 613099 615778 619276 624248 630993 639217 648484 658843 670737 684325
59024F84325J4937J5924J6784J7297J6937J5710J4127J2334R842O501L134P34
$$ 684325 699262 715186 731970 749267 766204 781914 796041 808375 818217 824718 827852 828586
59012H28586o85k001l873o079p888q761q665p910o862n746m642l530k305q19Q33
$$ 828586 827901 825900 822027 815948 808060 799299 790634 782724 775862 770116 765474 761944 759639 758820 759653
58997G59653K182K764K676K522K689K942K828K210J302L76k86m52k11o3l65p88
$$ 759653 761835 764599 767275 769797 772486 775428 778256 780466 781768 782144 781858 781406 781195 781132 780767 779979
58981G79979o29L12J492K328K891L752N278P167Q741R606J0058J0721J1798J2826
$$ 779979 779350 779662 781154 783482 786373 790125 795403 802570 811311 820917 830975 841696 853494 866320
58967H66320J3274J3173J2940J2757J2415J1701J0624R286P833O495N286L681
$$ 866320 879594 892767 905707 918464 930879 942580 953204 962490 970323 976818 982104 985785
58955I85785J027k489n776p985r415j0929j2748j4311j5148j5380j5316j5000
$$ 985785 986812 984323 978547 970562 961147 950218 937470 923159 908011 892631 877315 862315
58943H62315j4325j3259j1814j0019q117o550n578m966m211l011j486n8Q47J122
$$ 862315 847990 834731 822917 812898 804781 798231 792653 787687 783476 780465 778979 778921 779768 780890
58929G80890J088J205J550J699J188oj487k786l583l766l505l209l210l448l573
$$ 780890 781978 783183 784733 786432 787620 787614 786127 783341 779758 775992 772487 769278 766068 762620 759047
58914G59047l369k928k442j963j405p38j0P93J821L248N062P000Q787J0397J1976
$$ 759047 755678 752750 750308 748345 746940 746202 746192 746985 748806 752054 757116 764116 772903 783300 795276
58899G95276J3488J4532J4722J4145J3407J3154J3612J4562J5623J6563J7395
$$ 795276 808764 823296 838018 852163 865570 878724 892336 906898 922521 939084 956479
58888I56479J8267J9193J9899J9991J9269J7885J6151J4256J2171R789P109M319
$$ 956479 974746 993939 1013838 1033829 1053098 1070983 1087134 1101390 1113561 1123350 1130459 1134778
58876A134778J692o22k704m722o614q030q706q878r110r636j0107j0121r788r501
$$ 1134778 1136470 1135848 1133144 1128422 1121808 1113778 1105072 1096194 1087084 1077448 1067341 1057220 1047432 1037931
58862A037931r291q882q361q235q582q673p937o917o629p112p412p009o460o346
$$ 1037931 1028640 1019758 1011397 1003162 994580 985907 977970 971053 964424 957312 949900 942891 936431 930085
58848I30085o376o154o222p437r477j0954j1145j0878j1318j2440j3289j3403
$$ 930085 923709 917555 911333 903896 894419 883465 872320 861442 850124 837684 824395 810992
58836H10992j3289j3438j3521j2871j1410r710q233o946n728m740m094l390k061
$$ 810992 797703 784265 770744 757873 746463 736753 728520 721574 715846 711106 707012 703622 701561
58823G01561j32J668K664K801K445J990J842K357L381M116L863K838J849J269
$$ 701561 701429 703097 705761 708562 711007 712997 714839 717196 720577 724693 728556 731394 733243 734512
58809G34512P90J07o06j066j273j326j246j232j726k918m388n548o231o623o790
$$ 734512 735302 735409 734803 733737 732464 731138 729892 728660 726934 724016 719628 714080 707849 701226 694436
58794F94436o656o282n843n382m830m271l829l387k712j783p03O46K386M099N040
$$ 694436 687780 681498 675655 670273 665443 661172 657343 653956 651244 649461 648758 649404 651790 655889 660929
58779F60929N048M837N055N464N369M547L337K036O35q82k380l672m549m859m773
$$ 660929 665977 670814 675869 681333 686702 691249 694586 696622 697257 696375 693995 690323 685774 680915 676142
58764F76142m775n004m847l710k009q24n06l08M50J470K002J732P67o73k072k525
$$ 676142 671367 666363 661516 657806 655797 654973 654467 654159 654609 656079 658081 659813 660580 659907 657835 655310
58748F55310j572P1J170J321J204J583K532L630M490N012N362N790O250O291N589
$$ 655310 653738 653809 654979 656300 657504 659087 661619 665249 669739 674751 680113 685903 692153 698444 704033
58733G04033M508L770L680L946M208M290M068L501K901K780L301M137M834N087
$$ 704033 708541 712311 715991 719937 724145 728435 732503 736004 738905 741685 744986 749123 753957 759044
58719G59044M807M228L919M217M709M691M048L281K695K146J520Q80M3j315l065
$$ 759044 763851 768079 771998 776215 780924 785615 789663 792944 795639 797785 799305 800185 800228 798913 795848
58704G95848m693o110p801r930j1939j3296j4040j4350j4227j3888j3850j4211
$$ 795848 791155 785045 777244 767314 755375 742079 728039 713689 699462 685574 671724 657513
58692F57513j4390j3936j3043j1984j0683r284q325p845p082n730m725m895n566
$$ 657513 643123 629187 616144 604160 593477 584193 575868 568023 560941 555211 550486 545591 540025
58679E40025n466m471l469k937k680k624k682k177n59J413K435K614L440N580
$$ 540025 534559 530088 526619 523682 521002 518378 515696 513519 512960 514373 516808 519422 522862 528442
58665E28442P864Q886Q627Q018P722P756P684O758M528J631o62j949l066m705
$$ 528442 536306 545192 553819 561837 569559 577315 584999 591757 596285 597916 597254 595305 592239 587534
58651E87534o410p393p626p567p355o799n812m449k879j574j097j404j852j986
$$ 587534 581124 573731 566105 558538 551183 544384 538572 534123 531244 529670 528573 527169 525317 523331
58637E23331j799j141K57J829K268J203n7j68N16P63L31o1j72m90j068j268q02
$$ 523331 521532 520391 520648 522477 524745 525948 525891 525723 526239 527002 527333 527272 527100 526610 525542 524274 523472
58620E23472k10M4K96J085K302L351L916M231M661N243N649N593N116M522M012
$$ 523472 523262 523306 523602 524687 526989 530340 534256 538487 543148 548391 554040 559633 564749 569271 573283
58605E73283L633L394L255K959K285J420P15R3p82j738k099j641r03k70O10K036
$$ 573283 576916 580310 583565 586524 588809 590229 590944 591037 590255 588517 586418 584777 583874 583604 584214 586250
58589E86250L555M601N361O342P514Q529R433J0473J1431J1812J1484J0647R437
$$ 586250 589805 594406 599767 606109 613623 622152 631585 642058 653489 665301 676785 687432 696869
58576F96869Q095P235P252P670P769P672Q142R458J1218J3202J5630J8496K1336
$$ 696869 704964 712199 719451 727121 734890 742562 750704 760162 771380 784582 800212 818708 840044
58563H40044K3777K5779K7196K7694K7236K6135K4474K1972J8518J4437J0088
$$ 840044 863821 889600 916796 944490 971726 997861 1022335 1044307 1062825 1077262 1087350
58552A087350N702J754j067k474k891k953l051l467m497o110p838r288j0665j2555
$$ 1087350 1093052 1094806 1093739 1091265 1088374 1085421 1082370 1078903 1074406 1068296 1060458 1051170 1040505 1027950
58538A027950j5216j8244k0898k2717k3751k4176k3845k2539k0636j9003j7960
$$ 1027950 1012734 994490 973592 950875 927124 902948 879103 856564 835928 816925 798965
58527G98965j6805j4772j2087r625p908o921o577o673o637o055n277m925m930
$$ 798965 782160 767388 755301 745676 737768 730847 724270 717597 710960 704905 699628 694703 689773
58514F89773m652l904l097k522k191k313l113m060m116k980j477m78o0O2k5k82
$$ 689773 685121 681217 678120 675598 673407 671094 667981 663921 659805 656825 655348 654870 654810 654872 654847 654565
58498F54565m89n67o75p74m94L35J402K275K749K816K759L214M596O499Q201R732
$$ 654565 654076 653509 652834 652060 651566 651901 653303 655578 658327 661143 663902 667116 671712 678211 686412 696144
58482F96144J1669J3916J5626J6463J7065J7862J8365J8005J6856J5046J2301
$$ 696144 707813 721729 737355 753818 770883 788745 807110 825115 841971 857017 869318
58471H69318Q642M770J242k081n173p254p828p579p398p140o133m461k674p03
$$ 869318 877960 882730 883972 881891 876718 869464 861636 854057 846659 839519 833386 828925 826251 825548
58457H25548J917M976P657R579J0928J1675J1480J0346Q635O389L398p3l313o027
$$ 825548 827465 832441 840098 849677 860605 872280 883760 894106 902741 909130 912528 912455 909142 903115
58443I03115q432j0499j1744j2000j1727j1302j0519r072p131n179l586k460j661
$$ 903115 894683 884184 872440 860440 848713 837411 826892 817820 810689 805510 801924 799464 797803
58430G97803q29K74J472K533L656N148O653P311O846N919N179M425L049R41j438
$$ 797803 796974 797248 798720 801253 804909 810057 816710 824021 830867 836786 841965 846390 849439 850380 848942
58415H48942l550n126o165o910p740q861j0074j0956j1176j0653r568q274p098
$$ 848942 845392 840266 834101 827191 819451 810590 800516 789560 778384 767731 758163 749889 742791
58402G42791o189n598n387n427n216m342l046j998j411q14R3Q05N77m95j439j420
$$ 742791 736602 731004 725617 720190 714974 710632 707586 705588 704177 703363 703456 704261 704838 704343 702904 701484
58386G01484o50m5j05k38O98L128O271Q968J0770J1954J2694J2718J1905J0760
$$ 701484 700834 700789 700684 700446 701144 704272 710543 719511 730281 742235 754929 767647 779552 790312
58372G90312R953R629R432R193R245R940J1037J1821J1874J1604J1820J2802J4002
$$ 790312 800265 809894 819326 828519 837764 847704 858741 870562 882436 894040 905860 918662 932664
58359I32664J4663J4510J3685J2336J0509Q370O177M083K261J051O73P96P54L06
$$ 932664 947327 961837 975522 987858 998367 1006737 1012914 1016997 1019258 1020309 1020982 1021778 1022532 1022838
58345A022838q2J55J063K297L555M685N569O166O725P600Q897J0381J1763J2920
$$ 1022838 1022756 1022911 1023974 1026271 1029826 1034511 1040080 1046246 1052971 1060571 1069468 1079849 1091612 1104532
58331A104532J3806J4275J4136J3390J2261J0931R362P516N692M359L591K899
$$ 1104532 1118338 1132613 1146749 1160139 1172400 1183331 1192693 1200209 1205901 1210260 1213851 1216750
58319A216750J836O62Q9M62J440K494L452M365N163N752O304P109Q125Q964R471
$$ 1216750 1218586 1219248 1219337 1219799 1221239 1223733 1227185 1231550 1236713 1242465 1248769 1255878 1264003 1272967 1282438
58304A282438J0032J1111J2575J3764J4191J4022J3843J4029J4346J4182J3323
$$ 1282438 1292470 1303581 1316156 1329920 1344111 1358133 1371976 1386005 1400351 1414533 1427856
58293A427856J2512J2836J4378J5863J6157J5743J5975J7115J8102J8423J9082
$$ 1427856 1440368 1453204 1467582 1483445 1499602 1515345 1531320 1548435 1566537 1584960 1604042
58282A604042K1080K3826K5940K6973K7533K8120K8882L0192L2356L4792L6312
$$ 1604042 1625122 1648948 1674888 1701861 1729394 1757514 1786396 1816588 1848944 1883736 1920048
58271A920048L6433L5737L5078L5064L6205L8605M1440M3620M5107M6763M8801
$$ 1920048 1956481 1992218 2027296 2062360 2098565 2137170 2178610 2222230 2267337 2314100 2362901
58260B362901N0371N0927N1031N1350N1697N1670N1525N1788N2512N3499N4846
$$ 2362901 2413272 2464199 2515230 2566580 2618277 2669947 2721472 2773260 2825772 2879271 2934117
58249B934117N6751N9171O2018O5402O9339P3632P8197Q3169Q8462R3795R9222
$$ 2934117 2990868 3050039 3112057 3177459 3246798 3320430 3398627 3481796 3570258 3664053 3763275
58238C763275J05157J11733J18741J26259J34597J43460J52120J60638J70043
$$ 3763275 3868432 3980165 4098906 4225165 4359762 4503222 4655342 4815980 4986023
58229D986023J80933J92852K05444K19256K34794K51702K69617K89144L11262
$$ 4986023 5166956 5359808 5565252 5784508 6019302 6271004 6540621 6829765 7141027
58220G141027L36347L64288L95110M29092M66842N09469N58044O12856O74139
$$ 7141027 7477374 7841662 8236772 8665864 9132706 9642175 10200219 10813075 11487214
58211A1487214P43462Q23300R15399J021324J144751J291665J468340J681874
$$ 11487214 12230676 13053976 13969375 14990699 16135450 17427115 18895455 20577329
58203B0577329J943892K271869K685691L204732L849069M641451N607928O782236
$$ 20577329 22521221 24793090 27478781 30683513 34532582 39174033 44781961 51564197
58195E1564197Q217934J0000728J2240853J5019470J8279600K1709512K4730276
$$ 51564197 59782131 69782859 82023712 97043182 115322782 137032294 161762570
58188A61762570K6670704K7055462K5787530K3070854J9169147J4259002Q512202
$$ 161762570 188433274 215488736 241276266 264347120 283516267 297775269 306287471
58181C06287471K275835l880335r321041j3572186j6445977j8015103j8505010
$$ 306287471 308563306 304682971 295361930 281789744 265343767 247328664 228823654
58174B28823654j8193337j7356210j6248311j5085206j4015391j3100536j2326786
$$ 228823654 210630317 193274107 177025796 161940590 147925199 134824663 122497877
58167A22497877j1641657j0987812j0317169r595050q807175p965731p104529
$$ 122497877 110856220 99868408 89551239 79956189 71149014 63183283 56078754
58160E6078754o264663n480831m774443m153151l614941l153653k761768k429686
$$ 56078754 49814091 44333260 39558817 35405666 31790725 28637072 25875304 23445618
58152B3445618k145656j898886j682681j493931j330408j189347j067689r62416
$$ 23445618 21299962 19401076 17718395 16224464 14894056 13704709 12637020 11674604
58144A1674604q70658p90003p18444o53885n94228n38287m86232m38866l96746
$$ 11674604 10803946 10013943 9295499 8641614 8047386 7509099 7022867 6584001 6187255
58135F187255l59872l27557k98624k72334k49052k29435k13146j99124j86803
$$ 6187255 5827383 5499826 5201202 4928868 4679816 4450381 4237235 4038111 3851308
58126C851308j76022j66070j56002j45892j36586j28153j19820j11526j04134
$$ 3851308 3675286 3509216 3353214 3207322 3070736 2942583 2822763 2711237 2607103
58117B607103r7893r1964q5940q0477p5912p1506o6781o2469n9293n6811n4296
$$ 2607103 2509210 2417246 2331306 2250829 2174917 2103411 2036630 1974161 1914868 1858057 1803761
58106A803761n1918n0178m8848m7403m5885m4559m3180m1355l9296l7522l6046
$$ 1803761 1751843 1701665 1652817 1605414 1559529 1514970 1471790 1430435 1391139 1353617 1317571
58095A317571l4514l2868l1395l0203k8986k7235k4655k1694j9520j8925j9305
$$ 1317571 1283057 1250189 1218794 1188591 1159605 1132370 1107715 1086021 1066501 1047576 1028271
58084A028271j9367j8815j8408j8446j8288j7707j7467j7951j8350j7982j7428
$$ 1028271 1008904 990089 971681 953235 934947 917240 899773 881822 863472 845490 828062
58073H28062j7454j7661j7207j6193j5255j4369j3084j1556j0340r478q752q448
$$ 828062 810608 792947 775740 759547 744292 729923 716839 705283 694943 685465 676713 668265
58061F68265q898r473r132p945o998o834o943o922p088p650q135q179q135q355
$$ 668265 659367 649894 640762 632817 625819 618985 612042 605120 598032 590382 582247 574068 565933 557578
58047E57578q411p651o200m876m216m053m075m322m950n679n876n326m644m684
$$ 557578 549167 541516 535316 530440 526224 522171 518096 513774 508824 503145 497269 491943 487299 482615
58033D82615n524o449o860o887o926p054p153p287p510p607p368o991o807o746
$$ 482615 477091 470642 463782 456895 449969 442915 435762 428475 420965 413358 405990 398999 392192 385446
58019C85446o464n923n471n340n357n171m590l736k979k695k902l175l073k543
$$ 385446 378982 373059 367588 362248 356891 351720 347130 343394 340415 337720 334818 331643 328570 326027
58005C26027j807j078n34l95p07j113j103m92M03J064J165Q87Q85J740L319M936
$$ 326027 324220 323142 322608 322213 321506 320393 319290 318798 319201 320265 321430 322317 323202 324942 328261 333197
57989C33197O145P026P508P020N228K805Q48k44q56j335j730k234l149m236m629
$$ 333197 339342 346368 353876 360896 366124 368929 369777 369533 368677 367342 365612 363378 360229 355993 351364
57974C51364l794k201p67K6K19n0o26j149j290j201j277j492j386q83o47j204
$$ 351364 347570 345369 344602 344628 344847 344797 344171 343022 341732 340531 339254 337762 336376 335493 334846 333642
57958C33642k015k095j383q91j353k343k980k990k611k032j430j248j681k086
$$ 333642 331627 329532 328149 327258 325905 323562 320582 317592 314981 312949 311519 310271 308590 306504
57944C06504j520J12J977L298L899L940L778M096N377P110Q131Q047P609P495
$$ 306504 304984 305096 307073 310371 314270 318210 321988 326084 331461 338571 346702 354749 362358 369853
57930C69853P318O367M669K834J150n77k482m382n968o965p243o947o472o154
$$ 369853 377171 383538 388207 391041 392191 391614 389132 384750 378782 371817 364574 357627 351155 345001
57916C45001o093o263o517o470n802m697l672k914k182j382p72n08m42m73n43
$$ 345001 338908 332645 326128 319658 313856 309159 305487 302573 300391 299009 298237 297729 297287 296814 296271
57901B96271l19N27J608K081J779J392J377J538J813K500L310L338K595K497L939
$$ 296271 295952 296479 298087 300168 301947 303339 304716 306254 308067 310567 313877 317215 319810 322307 326246
57886C26246N807O392N505M152K846J454J21r03j999l465m402l673j831p35j196
$$ 326246 332053 338445 343950 348102 350948 352402 352523 351620 349621 346156 341754 338081 336250 335515 334319
57871C34319k293l096l688m166l969k859j538o47L7Q45J482J638J620J772J898
$$ 334319 332026 328930 325242 321076 317107 314248 312710 312063 312100 312945 314427 316065 317685 319457 321355
57856C21355J869K162L128M225M715M697M761M959M791M053L048K051J177O16
$$ 321355 323224 325386 328514 332739 337454 342151 346912 351871 356662 360715 363763 365814 366991 367607
57842C67607M85N23L95L40Q75J824K178J206o49k262k984k981k710k398k104j869
$$ 367607 368092 368615 369010 369350 370225 372049 374227 375433 374784 372522 369538 366557 363847 361449 359345 357476
57826C57476j659j344r58q08j090j580j945k242k701l111k991k437k244k842l654
$$ 357476 355817 354473 353515 352707 351617 350037 348092 345850 343149 340038 337047 334610 332366 329524 325870
57811C25870l886l555l224l200l449l981m667m979m558l923l947m714n489n767
$$ 325870 321984 318429 315205 312005 308556 304575 299908 294929 290371 286448 282501 277787 272298 266531
57797B66531n688n408m801l906l104k617k314k081j919j627r12K2O54J001J714
$$ 266531 260843 255435 250634 246728 243624 241007 238693 236612 234693 233066 232154 232176 232830 233831 235545
57782B35545L101M619N646O255O816P330P564P486P203O700N990N246M560L788
$$ 235545 238646 243265 248911 255166 261982 269312 276876 284362 291565 298265 304255 309501 314061 317849
57768C17849K897K121J571J047M44K2l3j5l69j140k051k790l080k755k040j489
$$ 317849 320746 322867 324438 325485 325929 325951 325918 325903 325534 324394 322343 319553 316473 313718 311678 310189
57752C10189j341j229q08l47k80n02n38k91r7j60l09l92n32q77j336j695j833
$$ 310189 308848 307619 306811 306464 306184 305682 305144 304853 304756 304596 304287 303895 303363 302486 301150 299455 297622
57735B97622j753j458r89n82n71r83j211n41Q98K058K157J600J251J157P86K50
$$ 297622 295869 294411 293422 292840 292269 291286 290075 289534 290432 292490 294647 296247 297498 298655 299441 299691
57719B99691L67J307K117K009J349Q53N22O3k78q6L08J21p86j774k337k550k644
$$ 299691 300058 301365 303482 305491 306840 307693 308215 308278 308000 307914 308222 308343 307557 305783 303446 300896 298252
57702B98252k711k884l300l746l779l346k938k962l239l358l222l098l186l358
$$ 298252 295541 292657 289357 285611 281832 278486 275548 272586 269347 265989 262767 259669 256483 253125
57688B53125l302k850k152j539j150q03k12P21J914L301M872O608Q547J0908J4064
$$ 253125 249823 246973 244821 243282 242132 241329 241117 241838 243752 247053 251925 258533 267080 277988 292052
57673B92052J8281K3559K9712L6591M4003N1273N6904N9137N7075N1118M2110
$$ 292052 310333 333892 363604 400195 444198 495471 552375 611512 668587 719705 761815
57662G61815L0451J6485J391j2992k5262l4896m1685m5383m6093m4418m1066l6712
$$ 761815 792266 808751 810142 797150 771888 736992 695307 649924 603831 559413 518347 481635
57650D81635l2299k8742k6100k3593k0738j7951j5758j4037j2399j0775r206p635
$$ 481635 449336 420594 394494 370901 350163 332212 316454 302417 290018 279243 270037 262402
57638B62402o269n583n451m978l743k605k465k811k500j557j135j719k421k205
$$ 262402 256133 250550 245099 240121 236378 233773 231308 228497 225997 224440 223305 221586 219165 216960
57624B16960j047L05J036O55o69k009k490k308k338k754k802k170j687k157l085
$$ 216960 215913 216218 217254 217909 217240 215231 212741 210433 208095 205341 202539 200369 198682 196525 193440
57609A93440l292k485j504j212j615k155k417k340k037j649j316j124r82p61n79
$$ 193440 190148 187663 186159 184947 183332 181177 178760 176420 174383 172734 171418 170294 169312 168551 167972
57594A67972q35j630k350k264j620j484k320l229l147k257j562j470j593j752
$$ 167972 167137 165507 163157 160893 159273 157789 155469 152240 149093 146836 145274 143804 142211 140459
57580A40459k202k806k865k142j384j442k243k998l081k499j776j538j948k452
$$ 140459 138257 135451 132586 130444 129060 127618 125375 122377 119296 116797 115021 113483 111535 109083
57566A09083k412j975j832k131k289k062k042k574k880k042m13P21P66L12O3O8
$$ 109083 106671 104696 102864 100733 98444 96382 94340 91766 88886 86844 86431 87152 87918 88230 88293 88361
57550H8361K29Q72K198L553L849K752J144K14K66N54K21p70j656j720r48J04R26
$$ 88361 88590 89462 91660 95213 99062 101814 102958 103172 103438 103992 104213 103443 101787 100067 99119 99223 100149
57533A00149J350J334P74k46j208j448q95k20j3oM78J374J751J060Kk91L31J006
$$ 100149 101499 102833 103607 103361 102153 100705 99810 99590 99577 99571 100049 101423 103174 104234 104236 103945 104276 105282
57515A05282J112R42J038J343J369R11L11mJ9N8j70n92r28j080j171j246j148
$$ 105282 106394 107336 108374 109717 111086 111997 112308 112304 112323 112381 112211 111619 110691 109611 108440 107194 106046
57498A06046q56o68q33j270j817k509l261l619l303k782k707k914k612j653q52
$$ 106046 105190 104522 103689 102419 100602 98093 94832 91213 87910 85128 82421 79507 76895 75242 74390
57483G4390q37j163j045n10k89p74j547j955j792j377j139j225j432j529j553
$$ 74390 73553 72390 71345 70835 70546 69772 68225 66270 64478 63101 61962 60737 59305 57776 56223
57468E6223j683j855j755j269o97l92l37k27Q8L65K10m56j176j323p51RL51K21
$$ 56223 54540 52685 50930 49661 48964 48572 48235 48008 48096 48461 48671 48215 47039 45716 44965 44974 45325 45546
57450D5546k9k12m02n85o15n15m76n25n12m16l70l96m61p21j247j584j144j38
$$ 45546 45517 45305 44903 44318 43703 43188 42712 42187 41675 41259 40889 40493 40032 39311 38064 36480 35336 35198
57432C5198N02L48L3J92M51L9r26j497j101j96L16J7p95j466j562j201q78q97
$$ 35198 35700 36048 36081 36273 36724 36763 35837 34340 33239 33043 33359 33376 32581 31115 29553 28352 27474 26577
57414B6577j099j177j053q19n09j27K40N23P31P23K14q18j901k535k677k563k259
$$ 26577 25478 24301 23248 22429 21920 21793 22033 22556 23287 24010 24224 23406 21505 18970 16293 13730 11471
57397A1471j713j051m60J31Q59J455J428P60N9j14K25P36J271J835K291K419K223
$$ 11471 9758 8707 8247 8378 9237 10692 12120 12880 12939 12825 13050 13786 15057 16892 19183 21602 23825
57380B3825J937J686J345Q15K82rj08l25p97j321j657j810j825j567r60l60l61
$$ 23825 25762 27448 28793 29608 29890 29881 29773 29448 28651 27330 25673 23863 22038 20471 19511 19151 18790
57363A8790j168k290k938k575j282K67J220J240P28K68l6m15q65j125j146j111
$$ 18790 17622 15332 12394 9819 8537 8804 10024 11264 11992 12260 12224 11809 10944 9819 8673 7562
57347G562j009o45j37J36J16J11J82L0l78o32o01p07j181A260b81j302j231j182
$$ 7562 6553 5908 5771 5907 6023 6134 6316 6346 5968 5336 4735 4028 2847 1260 -281 -1583 -2814 -3996
57329c996j009j107j765k464k551k266k215k171j397r8N02k10j457k228k441k489
$$ -3996 -5005 -6112 -7877 -10341 -12892 -15158 -17373 -19544 -20941 -21039 -20537 -20747 -22204 -24432 -26873 -29362
57313b9362k377j906j293r51r06q68p30o10o08q21j345j971k124j557q70q33j345
$$ -29362 -31739 -33645 -34938 -35889 -36795 -37663 -38393 -39003 -39611 -40432 -41777 -43748 -45872 -47429 -48299 -49132 -50477
57296e0477j583j195p57q22j065p63J44R26R44K52o69j435j884j998j975k182
$$ -50477 -52060 -53255 -54012 -54834 -55899 -56662 -56518 -55592 -54648 -54396 -55065 -56500 -58384 -60382 -62357 -64539
57280f4539k731l204l068k408j862j796j844j559j157j253j934k522k318j293
$$ -64539 -67270 -70474 -73542 -75950 -77812 -79608 -81452 -83011 -84168 -85421 -87355 -89877 -92195 -93488
57266i3488j4Q91J095O67km62n55m59l37j06L37Q22J057J032J060J362J752J883
$$ -93488 -93502 -92611 -91516 -90849 -90851 -91313 -91868 -92327 -92664 -92770 -92433 -91611 -90554 -89522 -88462 -87100 -85348 -83465
57248h3465J679J391J203R58M13l20p67n64J31Q13J131J110R52P72O15O06Q67
$$ -83465 -81786 -80395 -79192 -78234 -77821 -78141 -78908 -79472 -79341 -78528 -77397 -76287 -75335 -74563 -73948 -73342 -72475
57231g2475J364J875K281K740L494M549N671O640P373P852Q150Q621b101I596
$$ -72475 -71111 -69236 -66955 -64215 -60721 -56172 -50501 -43861 -36488 -28636 -20486 -11865 -2101 9596
57216B3428J5284J5632J5121J4300J3640J3408J3680J4403J5546J7050J8600J9693
$$ 23428 38712 54344 69465 83765 97405 110813 124493 138896 154442 171492 190092 209785
57204B09785K0170K0576K1562K3065K4540K5932K7847L0426L2603L2998L1448
$$ 209785 229955 250531 272093 295158 319698 345630 373477 403903 436506 469504 500952
57193E00952K9198K7450K6094K3979K0258J5220R892N149J399j158k359k223r04
$$ 500952 530150 557600 583694 607673 627931 643151 653043 658192 659591 658433 656074 653851 652947
57180F52947J593N251R489J3247J5936J7916J9588K0554K0241J8941J7419J5802
$$ 652947 654540 659791 669280 682527 698463 716379 735967 756521 776762 795703 813122 828924
57168H28924J3834J2033J1468J2138J2727J2410J1940J2245J2831J2528J1208
$$ 828924 842758 854791 866259 878397 891124 903534 915474 927719 940550 953078 964286
57157I64286R803Q906Q270P597O920O099M667K406k97k940n383p771j0193j2607
$$ 964286 974089 982995 991265 998862 1005782 1011881 1016548 1018954 1018657 1015717 1010334 1002563 992370 979763
57143I79763j4904j6961j8751k0406k2143k4140k6500k9215l2122l5014l7853
$$ 979763 964859 947898 929147 908741 886598 862458 835958 806743 774621 739607 701754
57132G01754m0734m3726m6998n1071n6447o2925o9680p6253q3042H0307a8348
$$ 701754 661020 617294 570296 519225 462778 399853 330173 253920 170878 80307 -18348
57120a24977j13976j20603j26691j32746j39572j47793j57424j68067j79479j92036
$$ -124977 -238953 -359556 -486247 -618993 -758565 -906358 -1063782 -1231849 -1411328 -1603364
57110a603364k06900k25801k50424k81983l21412l69536m26759m93355n71105
$$ -1603364 -1810264 -2036065 -2286489 -2568472 -2889884 -3259420 -3686179 -4179534 -4750639
57101d750639o64626p80751r27720j116349j361120j678119k082182k587255l206829
$$ -4750639 -5415265 -6196016 -7123736 -8240085 -9601205 -11279324 -13361506 -15948761 -19155590
57092a9155590l947535m798258n724260o666084p533139q196175q504033q336682
$$ -19155590 -23103125 -27901383 -33625643 -40291727 -47824866 -56021041 -64525074 -72861756
57084g2861756p663401o559461n173239l679206k245495j008462m0415O73873
$$ -72861756 -80525157 -87084618 -92257857 -95937063 -98182558 -99191020 -99231435 -98557562
57076i8557562J223029J717671K236297K801215L388539L954995M462686M890376
$$ -98557562 -97334533 -95616862 -93380565 -90579350 -87190811 -83235816 -78773130 -73882754
57068g3882754N229484N473446N613092N642079N564067N392096N140476M817901
$$ -73882754 -68653270 -63179824 -57566732 -51924653 -46360586 -40968490 -35828014 -31010113
57060c1010113M428692L981023L494512K999783K529416K107410J744898J442926
$$ -31010113 -26581421 -22600398 -19105886 -16106103 -13576687 -11469277 -9724379 -8281453
57052h281453J197067R99891Q42152P14458O08942N19680M42298L73877L13008
$$ -8281453 -7084386 -6084495 -5242343 -4527885 -3918943 -3399263 -2956965 -2583088 -2270080
57043b270080K59280K12471J72212J38157J10099Q7766P0679N8286N0082M5451
$$ -2270080 -2010800 -1798329 -1626117 -1487960 -1377861 -1290095 -1219416 -1161130 -1111048 -1065597
57033a065597M3383M2666M2600M3220M4543M5757M5715M4080M1474L8569L5760
$$ -1065597 -1022214 -979548 -936948 -893728 -849185 -803428 -757713 -713633 -672159 -633590 -597830
57022e97830L3773L3484L4617L5317L3957L0953K8232K7136K7394K7756K6889
$$ -597830 -564057 -530573 -495956 -460639 -426682 -395729 -367497 -340361 -312967 -285211 -258322
57011b58322K3942J8984J3157P919M104J746N78K76M49Q90J721K975M255N096
$$ -258322 -234380 -215396 -202239 -194320 -190216 -188470 -187892 -187616 -187167 -186277 -184556 -181581 -177326 -172230
56997a72230N500N761O072O646P842R727J1754J3365J4644J5914J7024J7583J7577
$$ -172230 -166730 -160969 -154897 -148251 -140409 -130682 -118928 -105563 -90919 -75005 -57981 -40398 -22821
56984b2821e646A0510J4269J1985J0158Q870P357N176K850J173L55L3k72q51j700
$$ -22821 -5646 10510 24779 36764 46922 55792 63149 68325 71175 72348 72703 72736 72464 71613 69913
56969F9913k528l087l313l077k042k06J714K890L334L784M800O389Q228R786J0368
$$ 69913 67385 64298 60985 57908 55866 55660 57374 60264 63598 67382 72182 78571 86799 96585 106953
56954A06953R706Q358P036N666L740J377p14k259l623m866n333m450k504l93J038
$$ 106953 116659 125017 132053 137719 141459 142836 142122 139863 136240 131374 126041 121591 119087 118694 119732
56939A19732J519J642K573M944Q061J0742J2644J4167J5218J5170J3896J1904
$$ 119732 121251 122893 125466 130410 138471 149213 161857 176024 191242 206412 220308 232212
56927B32212R257N498R96k825n139o744q658j0548j1415j1181j0636j0178r552
$$ 232212 241469 246967 247963 245138 239999 233255 224597 214049 202634 191453 180817 170639 161087
56914A61087q651p799p165o606o113n896n900n632m670l170j786j121j153j212
$$ 161087 152436 144637 137472 130866 124753 118857 112957 107325 102655 99485 97699 96578 95425 94213
56900I4213o75L31J173J683K401L670N048N915O355O969Q062R383J0546J1343
$$ 94213 93538 93869 95042 96725 99126 102796 107844 113759 120114 127083 135145 144528 155074 166417
56886A66417J1740J1709J1074R553P192M678K794J513J23j645l243m183m609m621
$$ 166417 178157 189866 200940 210493 217685 222363 225157 226670 226793 225148 221905 217722 213113 208492
56872B08492l735j634J079L496N440P317R433J2099J5946K1256K6986L1271L2980
$$ 208492 204757 203123 204202 207698 213138 220455 229888 241987 257933 279189 306175 337446 370426
56859C70426L2349L0091K6532K1696J5793R338K998k683p545j1661j4838j6529
$$ 370426 402775 432866 459398 481094 496887 506225 509223 506540 498995 487334 472496 455967
56847D55967j6495j5191j3136j0333o676k491J962P124J3525K0883K8464L5972
$$ 455967 439472 424281 411145 400812 394136 391645 393607 400731 414256 435139 463603 499575
56835D99575M3129M8647N0772M9004M4330L7678K9081J8654P296m019j4783k4225
$$ 499575 542704 591351 642123 691127 735457 773135 802216 820870 828166 824147 809364 785139
56823G85139l0970l4203l4623l3554l1591k8658k4909k0756j6305j1422o083j91
$$ 785139 754169 719966 685343 651789 620198 591540 566631 545875 529570 518148 512065 511874
56811E11874O596J4124K1126K6108K8680K9321K8020K4101J7492R346J030o946
$$ 511874 518470 532594 553720 579828 608508 637829 665849 689950 707442 716788 717818 710872
56799G10872j4701k2025k8094l1928l3105l2084k9845k7007k3468j9197j4989
$$ 710872 696171 674146 646052 614124 581019 548935 519090 492083 468615 449418 434429
56788D34429j1775r299o300k128K513O616R874J2310J3547J3112J1003P540L006
$$ 434429 422654 413355 407055 404927 407440 414056 423930 436240 449787 462899 473902 481442 484448
56775D84448k066o764j0567j3932j7442k0614k2242k1865k0272j8539j7181j6249
$$ 484448 482382 475618 465051 451119 433677 413063 390821 368956 348684 330145 312964 296715
56763B96715j5575j4767j3442j1794j0552j0140j0160r836q785p273n931n280
$$ 296715 281140 266373 252931 241137 230585 220445 210285 200449 191664 184391 178460 173180
56751A73180n237n132m448l461k793k457j923j078m35k51j17K53N15L07j02l32
$$ 173180 167943 162811 158363 154902 152109 149652 147729 146651 146216 145965 145848 146101 146616 146923 146821 146489
56735A46489n60j130j801j940j284j68Q69J365J164O75N97J049J361J025M19J25
$$ 146489 145929 144799 142998 141058 139774 139606 140475 141840 143004 143679 144276 145325 146686 147711 148130 148255
56719A48255K1k82n43k45M90J096J449J755J771J139L72M70J388J904J342M94
$$ 148255 148276 147994 147451 147206 147696 148792 150241 151996 153767 154906 155278 155748 157136 159040 160382 160876
56703A60876L36O94P57L08k80p94j246j409r33J53J350K102K117J510Q10N82Q87
$$ 160876 161212 161906 162663 162971 162691 161897 160651 159242 158309 158462 159812 161914 164031 165541 166351 166933 167820
56686A67820J299J447J243O48k40q04l21R78J949J948J585J560J581J088M08K44
$$ 167820 169119 170566 171809 172457 172217 171413 171092 172070 174019 175967 177552 179112 180693 181781 182189 182433
56670A82433M52K89k90n48k21P2j26m24k76K47P61J208J697J995J625M89q19j454
$$ 182433 182885 183174 182884 182336 182115 182187 182061 181637 181361 181608 182369 183577 185274 187269 188894 189383 188564 187110
56652A87110j078j82M34N19N21P85R30L95o45j438j604j447j223o58N11J861K532
$$ 187110 186032 185850 186284 186803 187324 188109 189039 189434 188789 187351 185747 184300 183077 182419 182930 184791 187323
56635A87323K018N48j203k605l311l278k652j670n70M26J112J309R30J59n29p53
$$ 187323 189341 189889 188686 186081 182770 179492 176840 175170 174600 175026 176138 177447 178377 178536 178007 177254
56619A77254o52o96j001j180j022r33j315j827j671o22O55J319J175P07N23P74
$$ 177254 176602 175906 174905 173725 172703 171770 170455 168628 166957 166335 166990 168309 169484 170191 170714 171488
56603A71488J039Q61L87K24N73Q75N86p8n38o76p68q13n46l1L25L99M46N54N02
$$ 171488 172527 173388 173775 173999 174572 175447 176033 175955 175417 174741 173973 173160 172614 172583 172908 173307 173753 174307 174809
56584A74809L29M53R69J308R70K56j19N5L22K39r0k24L8M72P80J049J653K707
$$ 174809 175138 175591 176560 177868 178838 179094 178975 179030 179352 179591 179501 179277 179315 179787 180567 181616 183269 185976
56566A85976L794M440M689M998N652O543P347P761P693P438P498P842P661O241
$$ 185976 189770 194210 198899 203897 209549 216092 223439 231200 238893 246331 253829 261671 269332 275573
56552B75573L972J909N25n65j610k278k354k187k111j960j571j304j576k205k620
$$ 275573 279545 281454 281979 281414 279804 277526 275172 272985 270874 268914 267343 266039 264463 262258 259638
56537B59638k565k201j773j503j616k100k534k466j924j334j050j123j345j380
$$ 259638 257073 254872 253099 251596 249980 247880 245346 242880 240956 239622 238572 237449 236104 234724
56523B34724r95m55l38q20j388j573j626j954k289j957r61o5J97Q5j5k01o88j212
$$ 234724 233729 233274 232936 232116 230728 229155 227529 225575 223286 221329 220368 220303 220500 220585 220570 220369 219681 218469
56505B18469j303r96q24j145j746k150k111j760j481j603k050k322j963j136m80
$$ 218469 217166 216170 215346 214201 212455 210305 208194 206434 204953 203350 201300 198978 197015 195879 195399
56490A95399l16k12M12J412K000J696R09M63P54J480J930J488J47j206j363k5
$$ 195399 195083 194871 195283 196695 198695 200391 201300 201763 202517 203997 205927 207415 207562 206356 204993 204968
56474B04968J658K204J344R2n42m49l1M22O77L83m77j225j046M4J117J315O74
$$ 204968 206626 208830 210174 210266 209724 209275 209244 209666 210343 210726 210249 209024 207978 208022 209139 210454 211128
56457B11128p7l81k82q5J62N84J043J198J086J254J948K525K152R67l9k71j16
$$ 211128 211051 210670 210388 210303 210465 211049 212092 213290 214376 215630 217578 220103 222255 223222 223183 222912 222796
56440B22796j78m97p79r25r33o75j70K04J18k23m14m54o34r49j007n52K11Q46
$$ 222796 222618 222121 221342 220417 219484 218809 218639 218843 218961 218738 218324 217870 217236 216287 215280 214728 214939 215785
56422B15785J026O75J3n50p03m51n4K07J42k25n19k63N66J387J671J554J541J787
$$ 215785 216811 217486 217499 216949 216246 215795 215741 215948 216090 215865 215346 215083 215649 217036 218707 220261 221802 223589
56404B23589J990J888J505R51K57m89j087j309j015j99R07J866K294K098J439
$$ 223589 225579 227467 228972 229923 230180 229691 228604 227295 226280 226081 226988 228854 231148 233246 234685
56389B34685O59K56N51J196J387Q17J08pM33R45J362J697J643R70J93O9M72N93
$$ 234685 235344 235600 236151 237347 238734 239551 239659 239652 240085 241030 242392 244089 245732 246702 246895 246964 247436 248029
56371B48029K48J00M82Q82R82J269K019K492J898O14l44o48o41m14J94Q49R50
$$ 248029 248277 248377 248859 249741 250723 251992 254011 256503 258401 259015 258671 258023 257382 256968 257162 258011 258961
56354B58961O47P78J573K231K069J475J221J432J705J810J774J571J247J149J530
$$ 258961 259608 260386 261959 264190 266259 267734 268955 270387 272092 273902 275676 277247 278494 279643 281173
56339B81173K041K078J565R98P43P82J124J907K916L474L177K517K329K823L419
$$ 281173 283214 285292 286857 287855 288598 289380 290504 292411 295327 298801 301978 304495 306824 309647 313066
56324C13066L503K987K200J583J498J998K603K587J697M12o14j217j519j375m46
$$ 313066 316569 319556 321756 323339 324837 326835 329438 332025 333722 334134 333520 332303 330784 329409 328963
56309C28963J122K486K822K127J177P81J189K092L042L810M417M873N016M767
$$ 328963 330085 332571 335393 337520 338697 339478 340667 342759 345801 349611 354028 358901 363917 368684
56295C68684M421M412M766N050N011M938N217N765O216O404O423O398O542P231
$$ 368684 373105 377517 382283 387333 392344 397282 402499 408264 414480 420884 427307 433705 440247 447478
56281D47478Q498R656J0010R851J0147J1112J1861J1782J1559J2203J3655J5005
$$ 447478 455976 465632 475642 485493 495640 506752 518613 530395 541954 554157 567812 582817
56269E82817J5875J6767J8108J9701K1225K2783K4650K6928K9654L2999L7170
$$ 582817 598692 615459 633567 653268 674493 697276 721926 748854 778508 811507 848677
56258H48677M2222M8017N4240O0536O6926P4031Q2547R2491J03208J14060J24740
$$ 848677 890899 938916 993156 1053692 1120618 1194649 1277196 1369687 1472895 1586955 1711695
56247A711695J34943J44252J52412J59377J64870J68324J69269J67374J62119
$$ 1711695 1846638 1990890 2143302 2302679 2467549 2635873 2805142 2972516 3134635
56238C134635J52977J40123J24383J06268Q5610O2474L7867J3064j1211l4438
$$ 3134635 3287612 3427735 3552118 3658386 3743996 3806470 3844337 3857401 3846190 3811752
56228C811752n5786p4596r1037j05472j17490j26336j32091j35618j37369j37151
$$ 3811752 3755966 3681370 3590333 3484861 3367371 3241035 3108944 2973326 2835957 2698806
56218B698806j35145j32292j29267j25713j20962j15058j08691j02461r6547r0857
$$ 2698806 2563661 2431369 2302102 2176389 2055427 1940369 1831678 1729217 1632670 1541813
56208A541813q5142p9108p2770o6624o1323n7148n3788n0513m6629m2059l7468
$$ 1541813 1456671 1377563 1304793 1238169 1176846 1119698 1065910 1015397 968768 926709 889241
56197H89241l3574l0394k7468k4721k2608k1301k0233j8701j6625j4350j2152
$$ 889241 855667 825273 797805 773084 750476 729175 708942 690241 673616 659266 647114
56186F47114j0221q905q437q460q205p268n993n046m704m643m381l791l176k838
$$ 647114 636893 627988 619551 611091 602886 595618 589625 584579 579875 575232 570851 567060 563884 561046
56172E61046k697k425j875j206n83Q1R73K006K780L000K977L432M661O105P062
$$ 561046 558349 555924 554049 552843 552260 552341 553314 555320 558100 561100 564077 567509 572170 578275 585337
56157E85337P653Q516R648J0333J0371J0589J1689J3354J5155J7600K1373K6125
$$ 585337 592990 601506 611154 621487 631858 642447 654136 667490 682645 700245 721618 747743
56145G47743L1077L6562M3697N2609O2102P1217Q0018Q8446R5394R9499J00226
$$ 747743 778820 815382 859079 911688 973790 1045007 1125025 1213471 1308865 1408364 1508590
56134A508590R7892R3226Q7266Q1025P4821O8376O1678N5157M8892M2483L5939
$$ 1508590 1606482 1699708 1786974 1867999 1942820 2011196 2072874 2128031 2176923 2219406 2255345
56123B255345K9765K3869J7282R490J089p391j6352k6085l5898m5167n4391o4027
$$ 2255345 2285110 2308979 2326261 2335751 2336840 2329449 2313097 2287012 2251114 2205947 2151556 2087529
56111B087529p2990p9637q3780q6434q7835q7047q3611p8249p1818o4619n7139
$$ 2087529 2014539 1934902 1851122 1764688 1676853 1589806 1506195 1427946 1356128 1291509 1234370
56100A234370n0385m4868l9995l5039l0201k6166k3075k0441j7868j5299j2705
$$ 1234370 1183985 1139117 1099122 1064083 1033882 1007716 984641 964200 946332 931033 918328
56089I18328r986p275n068l746l098k410j197L37J722K858L909M749N088N218
$$ 918328 908342 901067 895999 892253 889155 886745 885548 885885 887607 890465 894374 899123 904211 909429
56075I09429N914P354Q756R460R754J0165J0572J0698J0945J1874J3200J4084
$$ 909429 915343 922697 931453 940913 950667 960832 971404 982102 993047 1004921 1018121 1032205
56063A032205J4286J4281J4351J4262J3834J3202J2476J1718J1228J1285J1650
$$ 1032205 1046491 1060772 1075123 1089385 1103219 1116421 1128897 1140615 1151843 1163128 1174778
56052A174778J1745J1378J0833J0302R779R466R777J0830J2315J3888J5434J6981
$$ 1174778 1186523 1197901 1208734 1219036 1228815 1238281 1248058 1258888 1271203 1285091 1300525 1317506
56040A317506J8558K0151K1570K2558K3169K3717K4213K4354K4284K4714K5819
$$ 1317506 1336064 1356215 1377785 1400343 1423512 1447229 1471442 1495796 1520080 1544794 1570613
56029A570613K6784K7019K7199K8200K9654L0602L1103L2062L3736L5528L7167
$$ 1570613 1597397 1624416 1651615 1679815 1709469 1740071 1771174 1803236 1836972 1872500 1909667
56018A909667L9020M1216M3521M6073M9265N2762N5614N7532N9170O1020O2856
$$ 1909667 1948687 1989903 2033424 2079497 2128762 2181524 2237138 2294670 2353840 2414860 2477716
56007B477716O4534O6513O9252P2630P6277P9962Q3647Q7561R2162R7578J03329
$$ 2477716 2542250 2608763 2678015 2750645 2826922 2906884 2990531 3078092 3170254 3267832 3371161
55996C371161J09129J15523J23006J30987J38623J46225J54737J64156J73732
$$ 3371161 3480290 3595813 3718819 3849806 3988429 4134654 4289391 4453547 4627279
55987D627279J83548J94615K07472K21990K38443K57404K78594L01236L25628
$$ 4627279 4810827 5005442 5212914 5434904 5673347 5930751 6209345 6510581 6836209
55978F836209L53032L83964M17977M55265M97034N44169N97058O57046P26627
$$ 6836209 7189241 7573205 7991182 8446447 8943481 9487650 10084708 10741754 11468381
55969A1468381Q08014R02887J013763J144402J299433J485754J714758K001882
$$ 11468381 12276395 13179282 14193045 15337447 16636880 18122634 19837392 21839274
55961B1839274K364399K821453L395258M109423M986543O051837P343862Q926930
$$ 21839274 24203673 27025126 30420384 34529807 39516350 45568187 52912049 61838979
55953F1838979J0895910J3350693J6309967J9579479K2678672K4946345K5808505
$$ 61838979 72734889 86085582 102395549 121975028 144653700 169600045 195408550
55946A95408550K5015178K2656094J8979225J4224277Q627067K531869l564785
$$ 195408550 220423728 243079822 262059047 276283324 284910391 287442260 283877475
55939B83877475r113478j3667494j6974873j8978639j9775603j9575679j8658825
$$ 283877475 274763997 261096503 244121630 225142991 205367388 185791709 167132884
55932A67132884j7316889j5794036j4255200j2793576j1457522j0269793r231098
$$ 167132884 149815995 134021959 119766759 106973183 95515661 85245868 76014770
55925G6014770q320234p502341o743277o021198n330746m680105m082692l547860
$$ 76014770 67694536 60192195 53448918 47427720 42096974 37416869 33334177 29786317
55917B9786317l077010k666799k313539k013227j759509j544652j362559j209314
$$ 29786317 26709307 24042508 21728969 19715742 17956233 16411581 15049022 13839708
55909A3839708j080996r72710q79970p99685p29463o66983o10450n58858n11425
$$ 13839708 12758712 11786002 10906032 10106347 9376884 8709901 8099451 7540593 7029168
55900G029168m67219m25545l86311l49952l17181k88506k63609k41402k21045
$$ 7029168 6561949 6136404 5750093 5400141 5082960 4794454 4530845 4289443 4068398
55891D068398k02607j86367j71980j58926j47228j37058j27963j19242j10800
$$ 4068398 3865791 3679424 3507444 3348518 3201290 3064232 2936269 2817027 2706227
55882B706227j02943r5475q7775p9715p1906o5077n9695n6051n4114n3300n2896
$$ 2706227 2603284 2507809 2420034 2340319 2268413 2203336 2143641 2087590 2033476 1980176 1927280
55871A927280n2655n2691n2967n3285n3558n3595n2906n1245m9134m7281m5677
$$ 1927280 1874625 1821934 1768967 1715682 1662124 1608529 1555623 1504378 1455244 1407963 1362286
55860A362286m3798m1493l9007l6342l3320l0275k7934k6499k5422k4204k2912
$$ 1362286 1318488 1276995 1237988 1201646 1168326 1138051 1110117 1083618 1058196 1033992 1011080
55849A011080k1808k0961k0395k0212k0312k0406k0409k0536k0835k0966k0543
$$ 1011080 989272 968311 947916 927704 907392 886986 866577 846041 825206 804240 783697
55838G83697j9579j8435j7445j6653j5771j4510j2985j1676j0815j0076r165q364
$$ 783697 764118 745683 728238 711585 695814 681304 668319 656643 645828 635752 626587 618223
55826F18223q068q024p621o837o327o464o869p082p213p614q249q613q206o942
$$ 618223 610155 602131 594510 587673 581346 574882 568013 560931 553718 546104 537855 529242 521036 514094
55812E14094n245l786k906k269j288N0J118J499J643K320L650M978N678N740N391
$$ 514094 508849 505063 502157 499888 498600 498650 499768 501267 502910 505230 508880 513858 519536 525276 530667
55797E30667M507K743K37k272m226n790p330q667r325r315r079q706p908o814
$$ 530667 535174 537917 538154 535882 531656 525866 518536 509869 500544 491229 482150 473444 465536 458722
55783D58722o084n968n920n524n144n137n110m639m078l795l068q91K295M782
$$ 458722 452638 446670 440750 435226 430082 424945 419835 415196 411118 407323 404255 403364 405659 410441
55769D10441N708N952O494O832N704K825q78m462p685j0553j2733j3665j3128
$$ 410441 416149 422101 428595 435427 441131 443956 443078 438616 430931 420378 407645 393980 380852
55756C80852j1486r508p866o698n677m465l108j893j002m23j91n37j616l083m150
$$ 380852 369366 359858 351992 345294 339617 335152 332044 330151 329149 328726 328535 327998 326382 323299 319149
55741C19149m303l868l651l953m242l908l054k332k130k259k332k204k075k297
$$ 319149 314846 310978 307327 303374 299132 295224 292170 289838 287708 285449 283117 280913 278838 276541
55727B76541l049m041m681m588m006l552l619m043m236l636k246p67N7K48N11
$$ 276541 273492 269451 264770 260182 256176 252624 249005 244962 240726 237090 234844 234077 234134 234382 234893
55712B34893J270K235K982L475L719L431K519J443O68O5o47j274j561j876k789
$$ 234893 236163 238398 241380 244855 248574 252005 254524 255967 256635 256700 256053 254779 253218 251342 248553
55697B48553m117n082n304n028m484l764l229l216l217k250l37J179J284O10N14
$$ 248553 244436 239354 234050 229022 224538 220774 217545 214329 211112 208862 208525 209704 210988 211598 212112
55682B12112J365K421L056L406L769M021L841L163K202J197L03l55o64p06p47
$$ 212112 213477 215898 218954 222360 226129 230150 233991 237154 239356 240553 240856 240501 239837 239131 238384
55667B38384r11q60j46J010J688J289L27k10nM70P94R11Q05N35N46J269K215K261
$$ 238384 237473 236613 236467 237477 239165 240454 240781 240571 240566 241036 241830 242741 243546 244081 244627 245896 248111 250372
55649B50372J075l62j030j061j202j719k444l433m771n953o211n536m743m426
$$ 250372 251447 251085 250055 248994 247792 246073 243629 240196 235425 229472 223261 217725 212982 208556
55635B08556m354m030l415k791k280j856j639j813k216k395k137j781j746j886
$$ 208556 204202 200172 196757 193966 191686 189830 188191 186378 184162 181767 179630 177849 176103 174217
55621A74217j711j163p99r98j408j541j544j825k168j942j168o41p92j115j057
$$ 174217 172506 171343 170544 169546 168138 166597 165053 163228 161060 159118 157950 157309 156517 155402 154345
55606A54345q86j126j622j811j664j660j933k011j533p98l69m14n79m55k7L03
$$ 154345 153459 152333 150711 148900 147236 145576 143643 141632 140099 139301 138932 138518 137939 137484 137457 137760
55590A37760J26m89j032j095p47l00M7K07R6k45n03l45K43J015J691K040J899
$$ 137760 137886 137397 136365 135270 134523 134223 134270 134477 134573 134328 133825 133480 133723 134738 136429 138469 140368
55573A40368J406J050J229J816K379K704K881L022L111L092K843K216J337O78
$$ 140368 141774 142824 144053 145869 148248 150952 153833 156855 159966 163058 165901 168117 169454 170132
55559A70132M86L27l53j318j780j548j358j798k490k751k520k184j835j317p76
$$ 170132 170618 170945 170592 169274 167494 165946 164588 162790 160300 157549 155029 152845 151010 149693 148917
55544A48917m96k54M64J483J902J354O72P62J267J113J33o07k51P43J244P16n25
$$ 148917 148421 148167 148631 150114 152016 153370 154042 154804 156071 157184 157317 156710 156459 157202 158446 159162 158637
55527A58637j863k742k782k082j353j364k171l132l658l649l315k891k585k469
$$ 158637 156774 154032 151250 149168 147815 146451 144280 141148 137490 133841 130526 127635 125050 122581
55513A22581k290j683p03J44M67L26q9p94j695k246j876p76J87M68M67Q21J339
$$ 122581 120291 118608 117905 118049 118516 118842 118753 117959 116264 114018 112142 111366 111553 112021 112488 113309 114648
55496A14648J110j99j678k178j615p83j08O45J411J527Q02R8J42L99l7r17j199
$$ 114648 115758 115559 113881 111703 110088 109305 109197 109842 111253 112780 113582 113680 113822 114221 114184 113267 112068
55479A12068o99k18p3L50J198J549P55m15q39n69m81q47j134j015p90p70q43p47
$$ 112068 111369 111151 111078 111428 112626 114175 114930 114515 113676 113107 112626 111779 110645 109630 108840 108070 107227 106480
55461A06480l83J48N43M66p3n89o39k85J70O02R57J060Q94P15N45l6j094j829
$$ 106480 106097 106245 106788 107254 107181 106592 105953 105668 105838 106440 107397 108457 109351 110066 110611 110575 109481 107652
55443A07652j525o92l76o40o39q6L86L91L52N74O59K75k42m92n93o60l80L58R73
$$ 107652 106127 105435 105059 104419 103780 103694 104080 104471 104823 105397 106056 106331 106089 105597 105004 104344 103964 104322 105295
55424A05295R43N49L47L56L55M45O58M97l00r83p07Q8K94j00k0Q27J395R90L55
$$ 105295 106238 106787 107134 107490 107845 108290 108948 109445 109145 108162 107455 107543 107837 107737 107717 108544 109939 110929 111284
55405A11284M32R54J094P00J10o55j509j693o57P59J080J02r42j122p18l18m4
$$ 111284 111716 112670 113764 114464 114574 113919 112410 110717 110060 110819 111899 112001 111059 109937 109219 108901 108857
55388A08857Jm87j268j394m55P35J253J233J184R29O7r16j090m79jp3j90j7J0
$$ 108857 108858 108371 107103 105709 105254 105989 107242 108475 109659 110588 110655 109739 108649 108170 108169 108096 107906 107889 107899
55369A07899m61j047j251j181j222j362j345j135q68m94J08P93J193J091O29K10
$$ 107899 107438 106391 105140 103959 102737 101375 100030 98895 98027 97533 97641 98434 99627 100718 101347 101557
55353A01557K17O19Q69M53m30r40m89O37J565J612Q26n3k04M19J007Q81L79K21
$$ 101557 101774 102393 103262 103715 103285 102345 101856 102493 104058 105670 106496 106443 106239 106658 107665 108546 108925 109146
55335A09146L55J75k77k51M12Q79N52j29n61q36j188j260p25jK98K06L2l13q70
$$ 109146 109501 109676 109399 109148 109560 110439 110991 110862 110301 109465 108277 107017 106292 106291 106589 106795 106827 106514 105644
55316A05644j080n29J76J27m61n78M7O37O06K45N0P1J45J38o9l95l85J78P25N92
$$ 105644 104564 104035 104211 104338 103877 103299 103346 103983 104589 104834 104884 104955 105100 105238 105169 104774 104389 104567 105292 105884
55296A05884R9K8L03J69k80o1R55J543R07j41n18l59l15l10NK63ol24j8L40l93
$$ 105884 105983 106011 106314 106483 106203 106142 107097 108640 109547 109406 108888 108529 108214 107904 107909 108172 108166 107842 107824 108164 107771
55275A07771j867k238o28J567K415J661N09j90n99j019j244j003m88j55k10n13
$$ 107771 105904 103666 103038 104605 107020 108681 109190 109000 108401 107382 106138 105135 104647 104492 104282 103769
55259A03769q09q61m82L33J296J992K190J917J255L60l76n08j05K21J38J02O30
$$ 103769 102960 102099 101617 101950 103246 105238 107428 109345 110600 110960 110584 110076 109971 110192 110330 110432 111062
55242A11062J342J399P30J06l7j10m74p93p16n85q96j420j511r65j26O38J085
$$ 111062 112404 113803 114533 114639 114602 114492 114018 113225 112509 111924 111028 109608 108097 107132 107006 107644 108729
55225A08729R71L45j81l6M98O14O8o03r38j062j185j176q38k86J98M76N51M64
$$ 108729 109700 110045 109864 109828 110326 110940 111008 110405 109467 108405 107220 106044 105206 104920 105118 105594 106145 106609
55207A06609L17J84l3l68n09j08N41O43n2p89p41l9N46P15Q05R84Q66J67o59q66
$$ 106609 106926 107110 107077 106709 106200 106092 106633 107276 107224 106435 105694 105655 106201 106916 107721 108705 109571 109738 109079 108213
55187A08213l37K85M29K69M11R95J396R87J1o34m83m5J9j43J08P40R54L82k36
$$ 108213 107876 108161 108590 108859 109270 110265 111661 112648 112659 112025 111542 111497 111516 111373 111481 112221 113175 113557 113321
55168A13321j27L04R1p14j055n48j30n60j119p14L52P70K17k46J24O85N61K6k9
$$ 113321 113194 113498 113589 112875 111820 111272 111142 110582 109463 108749 109101 109871 110088 109842 109966 110651 111212 111238 111209
55149A11209N11Q58M46m43j122j137n30K28O14N58M62N08L38k54p10l96L73O96
$$ 111209 111720 112578 113024 112581 111459 110322 109792 110020 110634 111192 111654 112162 112500 112246 111536 111140 111513 112209
55131A12209L87J60M43P35M74j41n51n98m26l2N93J079R85M07j35l52l69l07j24
$$ 112209 112596 112756 113199 113934 114408 114267 113716 113118 112692 112660 113253 114332 115317 115724 115589 115237 114868 114561 114437
55112A14437J34K17k6m72q54q87l20Q02J876K157J602R72R16J189J163P50L85
$$ 114437 114571 114788 114762 114290 113436 112549 112229 113031 114907 117064 118666 119638 120554 121743 122906 123656 124041
55095A24041K40L3l58n43j65N88J272J754K139K343K083J262J51p78j145r13m51
$$ 124041 124281 124314 123956 123413 123248 123836 125108 126862 129001 131344 133427 134689 134840 134062 132917 132004 131553
55078A31553k23k30n8L82N12p0p56o02L24R60P17J90R9K96J94k71p30r95j068
$$ 131553 131330 131100 131042 131424 131936 131866 131110 130508 130832 131792 132509 132699 132798 133094 133288 133017 132287 131292 130224
55059A30224p53M9Q87J101O40P1k50m60o49o01l11k66q10j500j525p27J18J63
$$ 130224 129471 129520 130407 131508 132148 132219 131969 131509 130860 130259 129948 129682 128872 127372 125847 125120 125238 125401
55041A25401o03j395j530j087o32m65m12k11J55O46J302J989K236J677N65m35
$$ 125401 124798 123403 121873 120786 120154 119689 119277 119066 119221 119867 121169 123158 125394 127071 127636 127201
55025A27201r09r62q93q22o20r0P14J310J112J45q19j064p04l34j83K1M77J054
$$ 127201 126292 125330 124437 123615 122995 122905 123619 124929 126041 126186 125367 124303 123599 123265 123082 123103 123580 124634
55007A24634J532J741J503Q90L96M02N45J67n83p83m6Q75J105P54N26O99R81J136
$$ 124634 126166 127907 129410 130300 130696 131098 131643 131810 131227 130444 130398 131273 132378 133132 133658 134357 135338 136474
54989A36474J164R62L67m94j189j450j366j115p44k77J45K85j2n87r36o51K2L40
$$ 136474 137638 138600 138967 138473 137284 135834 134468 133353 132609 132332 132477 132762 132750 132163 131227 130576 130598 130938
54971A30938kl90r5O63R71M83j12l6O29J177J204Q68M65Q2k29l26j69N2J52K23
$$ 130938 130936 130546 130451 131114 132085 132568 132456 132420 133049 134226 135430 136298 136763 136845 136616 136290 136121 136173 136325 136548
54951A36548M41O90O12J31l67m96l63l67o82j118j410j368q59O1R46J252R88P62
$$ 136548 136989 137679 138291 138422 138055 137559 137196 136829 136147 135029 133619 132251 131392 131453 132399 133651 134639 135401
54933A35401J069J735K221K283K137K094K308K807L620M733N951O830O925O264
$$ 135401 136470 138205 140426 142709 144846 146940 149248 152055 155675 160408 166359 173189 180114 186378
54919A86378N458N073M966M544L625K611J755P98m70j738k688l474m305m907m987
$$ 186378 191836 196909 201875 206419 210044 212655 214410 215208 214738 213000 210312 206838 202533 197626 192639
54904A92639m902n173n463m872l339j998j733k027j816j044o79j257k095k136
$$ 192639 187737 182564 177101 172229 168890 166892 165159 163132 161316 160272 159593 158336 156241 154105
54890A54105j215n7P55J335J975K434K258J681J695K898M702N985O363O301O191
$$ 154105 152890 152833 153588 154923 156898 159332 161590 163271 164966 167864 172566 178551 184914 191215 197406
54875A97406N860N126M158L112J827K58j204k227l015l858m513m559m170l936
$$ 197406 203266 208392 212550 215662 217489 217747 216543 214316 211301 207443 202930 198371 194201 190265
54861A90265l993l958l740l752m092m229l828l326l197l122k536j628j069r50
$$ 190265 186272 182314 178574 174822 170730 166501 162673 159347 156150 153028 150492 148864 147795 146845
54847A46845p71m47n16j094j450j050m37m55j104j668j746j518j205q96p81r95
$$ 146845 146074 145627 145111 144017 142567 141517 141080 140625 139521 137853 136107 134589 133384 132488 131707 130712
54831A30712j231j056o56o72j201j532j096k00N31R28J207J426J507J547J662
$$ 130712 129481 128425 127769 127097 125896 124364 123268 123068 123599 124527 125734 127160 128667 130214 131876
54816A31876J633J114K08n38p12m19j9K84N66J023J713K411K686K201J015m08
$$ 131876 133509 134623 134831 134293 133581 133162 133143 133427 133993 135016 136729 139140 141826 144027 145042 144634
54800A44634j441j680j233o56l87l30j41J48J95kj9L31O71P62R57J563K110J841
$$ 144634 143193 141513 140280 139624 139237 138907 138766 138914 139109 139107 139088 139419 140090 140852 141809 143372 145482 147323
54782A47323Q04j28k54L11J005J372J315J106J261K028L022L688L981M273M694
$$ 147323 148127 147999 147745 148056 149061 150433 151748 152854 154115 156143 159165 162853 166834 171107 175801
54767A75801N025N202N460N802N871N450M667L594K075K23j390k311k744l204
$$ 175801 180826 186028 191488 197290 203161 208611 213278 216872 218947 219170 217780 215469 212725 209521
54753B09521l932m850n715o089n515m154k933k620k960l072k592j932j541j397
$$ 209521 205589 200739 195024 188935 183420 179266 176333 173713 170753 167681 165089 163157 161616 160219
54739A60219j288j175j106r91o67p8O69J370J856K119K265K328K284K326K842
$$ 160219 158931 157756 156650 155659 154992 154914 155583 156953 158809 160928 163193 165521 167805 170131 172973
54724A72973L912N039N660N751N592N120M006K337P72k00p09j152j680k290l094
$$ 172973 176885 181924 187584 193335 198927 204047 208053 210390 211162 210962 210253 209101 207421 205131 202037
54709B02037m141n135n610n379m662l838l182k741k354j889j541j679k257k604
$$ 202037 197896 192761 187151 181772 177110 173272 170090 167349 164995 163106 161565 159886 157629 155025
54695A55025k093r32OJ09m53j119j516j621j567j486j420j270r23m56p9J32K38
$$ 155025 152932 152000 152006 152115 151662 150543 149027 147406 145839 144353 142933 141663 140740 140284 140205 140337 140575
54678A40575K54J18n5oK45K98p0n07n29j83N4mn8J71N58Q13P73L84l31j152j732
$$ 140575 140829 140947 140892 140886 141131 141429 141359 140852 140323 140140 140194 140190 140132 140303 140861 141674 142447 142831 142500 141348 139616
54657A39616j938j942j855j493o58N18J633K268K136J231K2q03r49p19m83k60
$$ 139616 137678 135736 133881 132388 131730 132248 133881 136149 138285 139516 139538 138735 137786 137067 136584 136324
54641A36324J6K15L25O45J211J364M91r79j922j789j009j93L97N55J03n84o78
$$ 136324 136340 136555 136880 137525 138736 140100 140591 139612 137690 135901 134892 134699 135096 135651 135754 135170 134492
54624A34492J9O28L33m77p02L8J022J412J155Q75J118J800K264J923Q69k59r96
$$ 134492 134511 135139 135472 134995 134293 134331 135353 136765 137920 138795 139913 141713 143977 145900 146769 146510 145514
54607A45514j408j696j784j509r20k15M22Q21R13R24J108J154M78p08j275o27
$$ 145514 144106 142410 140626 139117 138197 137982 138404 139225 140138 141062 142170 143324 143802 143094 141819 141192
54591A41192L47M90n0k81LJ29q2J1O17R85N77r8l19k42n10j280k136k620k393
$$ 141192 141539 142029 141979 141698 141701 141830 141748 141759 142376 143361 143938 143840 143521 143279 142769 141489 139353 136733 134340
54572A34340j224O06K110K368J471L58k16k15K7L00N67Q02R37R01P01M48K07r3
$$ 134340 133116 133722 135832 138200 139671 140029 139813 139598 139625 139925 140492 141294 142231 143132 143833 144281 144488 144395
54554A44395m02l43L37J152J244N21q3J52P22O29k14q94o44M01J528K087J874
$$ 144395 143993 143650 143987 145139 146383 146904 146821 146973 147695 148324 148110 147216 146572 146973 148501 150588 152462
54537A52462J234P74P23O96L61L3K05O46O28j5o43o99l80k25m93j035j499j444
$$ 152462 153696 154470 155193 155889 156250 156283 156488 157134 157762 157747 157104 156405 156025 155800 155307 154272 152773 151329
54519A51329o65M44J159J158P62L40r7n97r59j025r48r06q17n75l56l44l78j46
$$ 151329 150664 151108 152267 153425 154187 154527 154430 153833 152874 151849 150901 149995 149178 148603 148247 147903 147525 147379
54501A47379L33O65M93j83r70j310r38k28J60P6K4L69P57O75K52O5L17O81Q33
$$ 147379 147712 148377 148870 148687 147717 146407 145469 145241 145401 145477 145501 145870 146627 147302 147554 147619 147936 148617 149450
54482A49450P80O86P01R24J228J212P00J68K37P48R37N32J34K83P25J022J304
$$ 149450 150230 150916 151617 152541 153769 154981 155681 155849 156086 156834 157771 158303 158437 158720 159445 160467 161771
54465A61771J890K413K073P20q06j555j251k16J009J758J453J56j267j873j516
$$ 161771 163661 166074 168147 168867 168061 166506 165255 165039 166048 167806 169259 169415 168148 166275 164759
54450A64759p72j62J57P5n49j467j996j719j038o47o37n22j2O71J219J538J504
$$ 164759 163987 163825 163982 164057 163508 162041 160045 158326 157288 156641 156004 155482 155470 156141 157360 158898 160402
54433A60402R23l9p54p96m55k66k86k17oJ60K93N25O82N16L27P42J661K136J621
$$ 160402 161325 161286 160532 159736 159281 159015 158729 158512 158506 158666 158959 159484 160166 160682 161009 161751 163412 165548 167169
54414A67169P41L31K56j18p09p79j51N12P11O81O53L66l07p88m93K29N44K58m0
$$ 167169 167910 168241 168497 168379 167670 166891 166740 167252 167963 168644 169297 169663 169356 168568 168075 168304 168848 169106 169066
54395A69066O6L57M85M69M58M53M08L21Q6l42o11k50M96P05J2o74l10P67J237
$$ 169066 169132 169489 169974 170443 170901 171354 171762 172083 172169 171827 171216 170966 171462 172167 172179 171505 171195 171962 173199
54376A73199N51m67q72o38j97L91J154J665J511J171J653L152M606M931M250L529
$$ 173199 173750 173283 172411 171773 171576 171967 173121 174786 176297 177468 179121 182273 186879 191810 196060 199589
54360A99589L235K877J939P84K64N81R64N82n43j765k663l227l389k916j997j385
$$ 199589 202824 205701 207640 208424 208688 209269 210233 210815 210272 208507 205844 202617 199228 196312 194315 192930
54344A92930j581k135k212j664j093r76j181j430j648j677j087J98J418J596O62
$$ 192930 191349 189214 187002 185338 184245 183269 182088 180658 179010 177333 176246 176444 177862 179458 180120
54329A80120m44r32r56j074j260r86k37J47n24j767k293j420K27J477J746J306
$$ 180120 179676 178744 177788 176714 175454 174468 174231 174378 173854 172087 169794 168374 168601 170078 171824 173130
54313A73130O74R9m14q38r88o71P3Q42J068M78n77j319j140r8J032J352O37m58
$$ 173130 173804 173903 173489 172651 171663 170992 171065 171907 172975 173453 172876 171557 170417 170319 171351 172703 173340 172882
54295A72882j075j051q90r54j036p98k62L55R02J152Q16J0n38l07K64L53j01l74
$$ 172882 171807 170756 169866 168912 167876 167078 166816 167171 168073 169225 170041 170051 169513 169206 169470 169823 169722 169348
54277A69348m3N48R51J126J098P00on07m96l38m77p30o04r7L09M33N94J043J541
$$ 169348 169305 169853 170804 171930 173028 173728 173722 173215 172719 172381 171904 171174 170570 170473 170782 171215 171809 172852 174393
54258A74393J718J562J407J485J659J572J074M27M0j5o1l52p92j142j308j261
$$ 174393 176111 177673 179080 180565 182224 183796 184870 185297 185337 185322 185261 184909 184117 182975 181667 180406
54242A80406j014p64q18j116j140o28r8j85o63o64R5Q86R73N48L87Q10J384J562
$$ 180406 179392 178628 177810 176694 175554 174926 174828 174643 173980 173316 173411 174297 175270 175818 176205 177015 178399 179961
54224A79961J348J224J502J816J489M39n08n42P3K92l34j119j208n90J37N61N54
$$ 179961 181309 182533 184035 185851 187340 187779 187271 186729 186802 187094 186760 185641 184433 183843 183980 184541 185095
54207A85095K4q57j383r81j17J34m47q77l90M54O46K08k7K04K69j16k59L86J208
$$ 185095 185119 184262 182879 181898 181781 181915 181468 180591 180201 180655 181301 181509 181482 181686 181955 181839 181580 181966 183174
54188A83174J214M70J3L80R54R76N17J22j3l4Q8N01R36Q38J39n54p20n98p45j086
$$ 183174 184388 184858 184871 185251 186205 187181 187698 187820 187807 187773 187861 188362 189298 190136 190275 189721 189001 188403 187658 186572
54168A86572r32K3J121J382N70o85j707k334k658k623k156j418o94j73l6m41j104
$$ 186572 185640 185663 186784 188166 188736 188051 186344 184010 181352 178729 176573 175155 174461 174288 174252 173811 172707
54151A72707j210l32P80R27P0n44n7Q32Q92Lq70j040p73o12p00q39q02m32K91
$$ 172707 171497 171165 171945 172872 172942 172398 172341 173173 174065 174068 173198 172158 171385 170773 170073 169234 168432 168000 168291
54132A68291J124J691J830J652J255O50k5m51m23l0N17J083J597J973K097J835
$$ 168291 169415 171106 172936 174588 175843 176493 176468 176017 175594 175564 176081 177164 178761 180734 182831 184666
54116A84666J172M10J10N53J364J846J818J675J784K012K029J776J490J423J672
$$ 184666 185838 186248 186358 186911 188275 190121 191939 193614 195398 197410 199439 201215 202705 204128 205800
54101B05800K177K763L244L536L634L487L008K189J100j65j403k267k598k665
$$ 205800 207977 210740 213984 217520 221154 224641 227649 229838 230938 230773 229370 227103 224505 221840
54087B21840k808k898k556j880j492j662j848j416m36N42J268J878K419K737K877
$$ 221840 219032 216134 213578 211698 210206 208544 206696 205280 204844 205386 206654 208532 210951 213688 216565
54072B16565L037L108K670J694Q20O12P17K13j147k444k540j295K95J114Q66Q4
$$ 216565 219602 222710 225380 227074 227894 228506 229223 229436 228289 225845 223305 222010 222305 223419 224285 224369
54056B24369n20o56n28m44l82l3P02J422J601J220P40N15N29P24J272K261L412
$$ 224369 223849 223193 222665 222221 221839 221806 222508 223930 225531 226751 227491 228006 228535 229259 230531 232792 236204
54039B36204M269M580M435M258M635N780P091P662P432P273P702Q094P682O727
$$ 236204 240473 245053 249488 253746 258381 264161 271252 278914 286346 293619 301321 309415 317097 323824
54025C23824N980N439M572L537L174L640L966L347K164J311R56N27m05j610k511
$$ 323824 329804 335243 339815 343352 346526 350166 354132 357479 359643 360954 361910 362437 362032 360422 357911
54010C57911k812k817l127l956m878n403n517n399n009m479m412n081n667n193
$$ 357911 355099 352282 349155 345199 340321 334918 329401 324002 318993 314514 310102 305021 299354 294161
53996B94161m063l526l706l385k043q70j089k324l336l574l213k467j686j495
$$ 294161 290098 286572 282866 279481 277438 276568 275479 273155 269819 266245 263032 260565 258879 257384
53982B57384k004k407k063j411j093q79l42N3l68j193j457j202j243j582j239
$$ 257384 255380 252973 250910 249499 248406 247527 247185 247238 246870 245677 244220 243018 241775 240193 238954
53967B38954J47J662K389K436K398K499K668K922L404M301N714P272Q165Q049
$$ 238954 239101 240763 243152 245588 247986 250485 253153 256075 259479 263780 269494 276766 284931 292980
53953B92980P619P555P258N677L147J261P81Q32M06m68j400k382l218l128j688
$$ 292980 300599 308154 315412 321089 324236 325497 326278 327110 327516 327048 325648 323266 320048 316920 315232
53938C15232M01K049K794K678J821O60J4K65Q87J292J641K351L232L737L717L490
$$ 315232 315633 317682 320476 323154 324975 325635 325649 325914 326801 328093 329734 332085 335317 339054 342771 346261
53922C46261L538M339O028P861Q636Q071P152O758O687O578O860P859Q739Q528
$$ 346261 349799 354138 360166 368027 376663 384734 391886 398644 405331 411909 418769 426628 435367 443895
53908D43895P647P310P610P486O399M940L733K770J999J494Q53n37k343l358l129
$$ 443895 451542 458852 466462 473948 480347 485287 489020 491790 493789 495283 496136 495599 493256 489898 486769
53893D86769k668l037m017m829n436o321p478q396q876r143r322r286r027q689
$$ 486769 484101 481064 477047 472218 466782 460461 452983 444587 435711 426568 417246 407960 398933 390244
53879C90244q233p431o265n083m365m420n179o089o429n947n058m326l957l949
$$ 390244 382011 374580 368315 363232 358867 354447 349268 343179 336750 330803 325745 321419 317462 313513
53865C13513m410n258n890n677m728l717l006k377j698j290j407j781k014k127
$$ 313513 309103 303845 297955 292278 287550 283833 280827 278450 276752 275462 274055 272274 270260 268133
53851B68133k315k480k374k138k149k370k295j673r21n84p33j055j260j189q01
$$ 268133 265818 263338 260964 258826 256677 254307 252012 250339 249418 248834 248101 247046 245786 244597 243796
53836B43796l64l41p82j021m80M58R06O45K78K09K04R7K04O45Q55L84k70k49M44
$$ 243796 243432 243091 242309 241288 240808 241266 242172 242817 243095 243304 243508 243605 243809 244454 245309 245693 245423 245174 245618
53817B45618R93R08N55M34N41N76M84N08R47J909L165M196M595M556M670N187
$$ 245618 246611 247519 248074 248508 249049 249625 250109 250617 251564 253473 256638 260834 265429 269985 274655 279842
53801B79842N695N694N321N237N813O650O980O504N655N093N044N269N459N429
$$ 279842 285537 291231 296552 301789 307602 314252 321232 327736 333391 338484 343528 348797 354256 359685
53787C59685N004M076K795J477K80p19j255j129q33j208k284l033k839k530l243
$$ 359685 364689 368765 371560 373037 373317 372598 371343 370214 369381 368173 365889 362856 360017 357487 354244
53772C54244m683n454n019m386m629n571o269o199n571m860m460m508m762m774
$$ 354244 349561 344107 339088 334702 330073 324502 318233 312034 306463 301603 297143 292635 287873 283099
53758B83099m415l955l520k791j599n07l09j032j769j723j113q11j230j813j833
$$ 283099 278684 274729 271209 268418 266819 266312 266003 264971 263202 261479 260366 259555 258325 256512 254679
53743B54679j365j088j234j288q87m26l57l76M4O36O30m7o29o38m80o31q74o49
$$ 254679 253314 252226 250992 249704 248817 248391 248034 247658 247702 248338 248968 248921 248292 247654 247174 246543 245669 245020
53725B45020K15J397K377K655K084J134M68K05nj43K87J305K115K156J871J923
$$ 245020 245235 246632 249009 251664 253748 254882 255350 255555 255550 255407 255694 256999 259114 261270 263141 265064
53709B65064K169K072J711J631J874J902J494J119J313K070K964L552L679L583
$$ 265064 267233 269305 271016 272647 274521 276423 277917 279036 280349 282419 285383 288935 292614 296197
53695B96197L689M033M062L335K264J722J971K363K187J431O15Q9k56p14j257
$$ 296197 299886 303919 307981 311316 313580 315302 317273 319636 321823 323254 323869 323958 323702 322988 321731
53680C21731j459j008k82j7l21m93q8K75k08j228j622q78K70Q30O19J18k47l45
$$ 321731 320272 319264 318982 318965 318644 318151 318063 318338 318130 316902 315280 314402 314672 315502 316121 316239 315992 315647
53662C15647j65K99R48J503J571R49%n15k66J62m7q65j399r47K76J423J735J066
$$ 315647 315482 315781 316729 318232 319803 320752 320752 320237 319971 320133 320086 319221 317822 316875 317151 318574 320309 321375
53644C21375L6m17J3O20N84J01K7O62J505K170K737L083K784J947J417J648K045
$$ 321375 321411 320994 321007 321627 322211 322312 322339 323001 324506 326676 329413 332496 335280 337227 338644 340292 342337
53627C42337J926J620J893K743L408L354K777K228K269L147M399N061M722M096
$$ 342337 344263 345883 347776 350519 353927 357281 360058 362286 364555 367702 372101 377162 381884 385980
53613C85980M008M191L817K969K640L290M180M401L834K914K046J589J859K666
$$ 385980 389988 394179 397996 400965 403605 406895 411075 415476 419310 422224 424270 425859 427718 430384
53599D30384L275L180K630K085J541Q19J20j77j06o8k42n00p79j126j371j192
$$ 430384 433659 436839 439469 441554 443095 443914 444034 443857 443751 443683 443441 442941 442162 441036 439665 438473
53583D38473o41k81n98j463k340k854k912k503j684q42o21j345k539l329l323
$$ 438473 437832 437551 436953 435490 433150 430296 427384 424881 423197 422355 421734 420389 417850 414521 411198
53568D11198k879k480k125j581r29m69k17Q5M56O71P94J179J734J719P03o97j458
$$ 411198 408319 405839 403714 402133 401204 400735 400518 400603 401059 401730 402524 403703 405437 407156 407859 407162 405704
53551D05704j357r66o85l39K87J021J609K029K381K658K734K452J803J206J376
$$ 405704 404347 403381 402696 402357 402644 403665 405274 407303 409684 412342 415076 417528 419331 420537 421913
53536D21913K515L768M094L633L514M281N230N650N936O835Q139Q956Q950Q687
$$ 421913 424428 428196 432290 435923 439437 443718 448948 454598 460534 467369 475508 484464 493414 502101
53522E02101Q806R438J0319J1011J1136J0906J1215J2617J4374J5236J5091J5032
$$ 502101 510907 520345 530664 541675 552811 563717 574932 587549 601923 617159 632250 647282
53510F47282J5794J6979J8017J8972K0001K0845K1355K1862K2430K2452K1654
$$ 647282 663076 680055 698072 717044 737045 757890 779245 801107 823537 845989 867643
53499H67643K0835K0704K0560J9252J7131J5840J6159J7138J7582J7401J7038
$$ 867643 888478 909182 929742 948994 966125 981965 998124 1015262 1032844 1050245 1067283
53488A067283J6529J5782J5143J5075J5564J6317J7154J7814J7871J7277J6544
$$ 1067283 1083812 1099594 1114737 1129812 1145376 1161693 1178847 1196661 1214532 1231809 1248353
53477A248353J5916J4886J3154J1521J0898J0844J0055Q238O365M951L218N33
$$ 1248353 1264269 1279155 1292309 1303830 1314728 1325572 1335627 1343865 1350230 1355181 1358399 1358932
53465A358932k354m262n118n716o348o678o785p387q847j0647j2024j2678j2671
$$ 1358932 1356578 1352316 1347198 1341482 1335134 1328456 1321671 1314284 1305437 1294790 1282766 1270088 1257417
53452A257417j2255j2019j2694j4340j6042j6787j6483j5881j5667j5882j6046
$$ 1257417 1245162 1233143 1220449 1206109 1190067 1173280 1156797 1140916 1125249 1109367 1093321
53441A093321j5551j4115j2138j0411r283q311p036n737m980m660m122l125k031
$$ 1093321 1077770 1063655 1051517 1041106 1031823 1023512 1016476 1010739 1005759 1001099 996977 993852 991821
53428I91821j046P1J347K294K640K870L633M958O384P600Q590R483J0534J2012
$$ 991821 990775 990846 992193 994487 997127 999997 1003630 1008588 1014972 1022572 1031162 1040645 1051179 1063191
53414A063191J3755J5205J6199J7285J8872K0509K1618K2524K3954K5727K6940
$$ 1063191 1076946 1092151 1108350 1125635 1144507 1165016 1186634 1209158 1233112 1258839 1285779
53403A285779K7391K7986K9485L1595L3624L5281L6583L7572L8597M0238M2467
$$ 1285779 1313170 1341156 1370641 1402236 1435860 1471141 1507724 1545296 1583893 1624131 1666598
53392A666598M4339M5111M5257M5780M6875M7882M8287M8100M7370M6050M4455
$$ 1666598 1710937 1756048 1801305 1847085 1893960 1941842 1990129 2038229 2085599 2131649 2176104
53381B176104M3215M2492M1657L9995L7510L4814L2323K9776K6500K2159J7246
$$ 2176104 2219319 2261811 2303468 2343463 2380973 2415787 2448110 2477886 2504386 2526545 2543791
53370B543791J2728R124N999K442k092p449j2992j7982k2022k5390k8710l2101
$$ 2543791 2556519 2565643 2571642 2574084 2571992 2564543 2551551 2533569 2511547 2486157 2457447 2425346
53358B425346l4913l6632l7607l8491l9306l9641l9545l9454l9334l8650l7335
$$ 2425346 2390433 2353801 2316194 2277703 2238397 2198756 2159211 2119757 2080423 2041773 2004438
53347B004438l6061l5353l5002l4623l4220l3926l3624l3150l2470l1380k9590
$$ 2004438 1968377 1933024 1898022 1863399 1829179 1795253 1761629 1728479 1696009 1664629 1635039
53336A635039k7339k5458k4348k3401k1868j9976j8559j7912j7555j6977j6119
$$ 1635039 1607700 1582242 1557894 1534493 1512625 1492649 1474090 1456178 1438623 1421646 1405527
53325A405527j5206j4554j4508j5137j6016j6609j6795j6743j6459j5814j4829
$$ 1405527 1390321 1375767 1361259 1346122 1330106 1313497 1296702 1279959 1263500 1247686 1232857
53314A232857j3619j2205j0717r522q762q045p027n980n219m332k749q08O18J482
$$ 1232857 1219238 1207033 1196316 1186794 1178032 1169987 1162960 1156980 1151761 1147429 1144680 1143872 1144490 1145972
53300A145972K553M037N239N898O812Q583J0636J2173J3370J4859J6539J7823
$$ 1145972 1148525 1152562 1157801 1163699 1170511 1179094 1189730 1201903 1215273 1230132 1246671 1264494
53288A264494J8644J9442K0276K0686K0373J9490J8335J7199J6337J5603J4390
$$ 1264494 1283138 1302580 1322856 1343542 1363915 1383405 1401740 1418939 1435276 1450879 1465269
53277A465269J2356R952P745N601L171P61j148k953n425q209j0026j0584j1183
$$ 1465269 1477625 1487577 1495322 1500923 1504094 1504855 1503707 1500754 1495329 1487120 1477094 1466510 1455327
53264A455327j2921j5256j7025j8056j8989k0065k0976k1587k2049k2352k2396
$$ 1455327 1442406 1427150 1410125 1392069 1373080 1353015 1332039 1310452 1288403 1266051 1243655
53253A243655k2328k2308k2063k1349k0654k0743k1541k2112k1897k1313k0940
$$ 1243655 1221327 1199019 1176956 1155607 1134953 1114210 1092669 1070557 1048660 1027347 1006407
53242A006407k0691k0202j9620j9455j9763j9922j9301j7916j6346j5117j4281
$$ 1006407 985716 965514 945894 926439 906676 886754 867453 849537 833191 818074 803793
53231H03793j3531j2609j1522j0457r685r425r644r927r810r339r058r380j0196
$$ 803793 790262 777653 766131 755674 745989 736564 726920 716993 707183 697844 688786 679406 669210
53218F69210j1211j2332j3452j4213j4368j4144j3884j3493j2714j1772j1176
$$ 669210 657999 645667 632215 618002 603634 589490 575606 562113 549399 537627 526451
53207E26451j0920j0468r636q965q944r282r286q650p644o723o256o421p096p901
$$ 526451 515531 505063 495427 486462 477518 468236 458950 450300 442656 435933 429677 423256 416160 408259
53193D08259q501q762q585p847o684n621n149n293n752o305o766o784o057m783
$$ 408259 399758 390996 382411 374564 367880 362259 357110 351817 346065 339760 332994 326210 320153 315370
53179C15370l638l128l088k902k179j230q35j424k466k857k102q70k10l75p64
$$ 315370 311732 308604 305516 302614 300435 299205 298370 296946 294480 291623 289521 288651 288441 288066 287302
53164B87302q71q20q76r06o55k38J4K8m9k72q38j566j922j757j569j720j776j197
$$ 287302 286431 285611 284735 283829 283174 282936 282950 282978 282929 282657 281819 280253 278331 276574 275005 273285 271509 270312
53146B70312l87l21j130j806j616j048q75q49j95R93J663J230K78l42m54l03R2
$$ 270312 269925 269604 268474 266668 265052 264004 263129 262280 262085 263078 264741 265971 266249 265907 265453 265150 265242
53129B65242Q32J681K212K280K076J795J537J333J104P09K58J83P62J630K103
$$ 265242 266074 267755 269967 272247 274323 276118 277655 278988 280092 280801 281059 281242 282004 283634 285737
53114B85737J909J342P70K97l8m0M34J092J286N82p20j805k121j876j633j608
$$ 285737 287646 288988 289758 290055 290017 289977 290411 291503 292789 293371 292651 290846 288725 286849 285216 283608
53098B83608j601j483j387j321j053n24r4j11n11r53j252j407j483j591j735j613
$$ 283608 282007 280524 279137 277816 276763 276239 276145 276034 275523 274570 273318 271911 270428 268837 267102 265489
53082B65489q92J54O97L90j10m6M06N33K43K0mk22o67p53k03L25N5q25j355r46
$$ 265489 264597 264751 265448 265838 265728 265682 266088 266621 266864 266884 266880 266658 265991 265238 265035 265360 265415 264590 263235 262289
53062B62289NO35N05r8o09p40o05l76o1L43P02R13J013R99P30K41q1K3L23M89
$$ 262289 262294 262929 263434 263336 262727 261987 261382 261006 260945 261288 261990 262903 263916 264915 265645 265886 265805 265828 266151 266640
53042B66640N80P62P94L72k68o48p89j062j395j340r15n89m09J04R35J331R31
$$ 266640 267220 267982 268776 269148 268880 268232 267443 266381 264986 263646 262731 262142 261733 261837 262772 264103 265034
53025B65034L54K06J92j39m35n1Q52J534J691J517J084L37l44l69K39Q32J026
$$ 265034 265388 265594 265786 265647 265212 265161 266013 267547 269238 270755 271839 272176 271832 271463 271702 272534 273560
53008B73560J051J149J128P38J63j65l6L31M65R2m80o17j71K12q1p19q19j16P24
$$ 273560 274611 275760 276888 277626 277789 277624 277588 277919 278384 278476 277996 277379 277208 277420 277339 276620 275801 275685 276409
52989B76409J018Q25P38J190K138L149L744L782L495L057K400J573R39O57L27
$$ 276409 277427 278252 278990 280180 282318 285467 289211 292993 296488 299545 301945 303518 304457 305114 305441
52974C05441l26p35k41P53J112M87l32o84p54p73l67P40J944K367J874J054M21
$$ 305441 305115 304380 304139 304892 306004 306491 306159 305475 304721 303948 303581 304321 306265 308632 310506 311560 311981
52957C11981O7j73n20j028j351j027k17K23k85j359k244k645k597k029j026j98
$$ 311981 312048 311875 311355 310327 308976 307949 307732 307955 307670 306311 304067 301422 298825 296796 295770 295572
52941B95572j87q48j432j453r51k16L51K41o40j633j980j718j376j005k20Q03
$$ 295572 295385 294537 293105 291652 290701 290485 290836 291077 290437 288804 286824 285106 283730 282725 282505 283308
52925B83308J268Q67L13L00O20O89M92M22N11M06Kl78m96n01o09p43o75l58N2
$$ 283308 284576 285443 285756 286056 286676 287365 287857 288279 288790 289196 289198 288820 288324 287823 287214 286471 285796 285438 285490
52906B85490M59R01J236R93j21j548k188j594n57j55m47o33k90J55K00m0j48O5
$$ 285490 285949 286850 288086 289079 288958 287410 285222 283628 283071 282916 282469 281836 281546 281701 281901 281861 281713 281778
52888B81778N44J090J340R87K61k21k40k10l87l95N5N00L66k9J69J113K085K525
$$ 281778 282322 283412 284752 285739 286000 285779 285539 285329 284942 284547 284602 285102 285468 285439 285608 286721 288806 291331
52870B91331K634K783K917K842K687K635K501J978J180N50K08k64j211k293k746
$$ 291331 293965 296748 299665 302507 305194 307829 310330 312308 313488 314038 314246 313982 312771 310478 307732
52855C07732k308j607j466j993k593k834k884l023l106k851k404k194k344k541
$$ 307732 305424 303817 302351 300358 297765 294931 292047 289024 285918 283067 280663 278469 276125 273584
52841B73584k486k165j728j340j131j046p69p6P19J016O66J80R0L62N46K62n14
$$ 273584 271098 268933 267205 265865 264734 263688 262919 262843 263562 264578 265244 265424 265514 265876 266422 266684 266170
52824B66170j389j713j095M8P48N01k54p67p93n56j70L95R72J247J201J130J209
$$ 266170 264781 263068 261973 262021 262769 263270 263016 262249 261456 260900 260730 261125 262097 263344 264545 265675 266884
52807B66884J269J187J173J478J921J932J103l95j910k793k818k199j340n67m1
$$ 266884 268153 269340 270513 271991 273912 275844 276947 276552 274642 271849 269031 266832 265492 264925 264884
52792B64884K02J68j43o83j241j505j360j049q18n28P6P44R03N51N00J215J941
$$ 264884 265086 265254 265111 264428 263187 261682 260322 259273 258455 257927 258003 258747 259650 260201 260701 261916 263857
52775B63857J588L15n14o4R51J244M18q45j694j740j093k30K33K5n16q97j027
$$ 263857 265445 265760 265246 265182 266133 267377 267795 266950 265256 263516 262423 262193 262426 262451 261935 261038 260011
52758B60011j069r51m62K07N97P04J063J862K498K418J985J882J980J479K78n96
$$ 260011 258942 257991 257529 257736 258333 259037 260100 261962 264460 266878 268863 270745 272725 274204 274482 273886
52742B73886k71Q30J631J777J807K085K307K130J724J428J206Q24K91j09j47K22
$$ 273886 273615 274445 276076 277853 279660 281745 284052 286182 287906 289334 290540 291364 291655 291546 291399 291621
52726B91621Q73J453J493Q37j50r74j519j938k167j983j404p51k96j33l27p95
$$ 291621 292494 293947 295440 296277 296127 295153 293634 291696 289529 287546 286142 285391 285095 284962 284635 283840
52710B83840j058o17K96Q17M95j81o02q41j197j397r20M7O73O10L98N71Q77P94
$$ 283840 282782 282165 282461 283278 283773 283592 282990 282149 280952 279555 278635 278682 279355 279965 280363 280934 281811 282605
52692B82605L56J1j18l23o77p78l17L76O50L06k05l85l04l39m83k54N17J164Q85
$$ 282605 282961 282972 282854 282531 281854 281076 280759 281135 281785 282091 281886 281501 281197 280858 280375 280121 280638 281802 282687
52673B82687k26j226j453j140p81m16J12N72N91L00K29N45Q58Q65Q10J076J651
$$ 282687 282461 281235 279782 278642 277861 277445 277557 278129 278720 279020 279249 279794 280652 281517 282327 283403 285054
52656B85054K233K607K632K121J076M7k08M96J489J938J672J193R56Q26L62n15
$$ 285054 287287 289894 292526 294647 295723 295770 295562 296058 297547 299485 301157 302350 303306 304132 304494 303979
52640C03979j357j706j588j291q30N4J236K016J825R34J14k61l90m05j10M24N61
$$ 303979 302622 300916 299328 298037 297207 297261 298497 300513 302338 303272 303386 303125 302735 302330 302220 302644 303205
52623C03205j86j301j734j205n86p40j365j388l79Q55J191M25o96j421j584j299
$$ 303205 303019 301718 299984 298779 298193 297453 296088 294700 294321 295176 296367 296792 296096 294675 293091 291792
52607B91792n67M59J168R98J97l14n1M96N50j0o58q69m73L99J302J622J143L99
$$ 291792 291225 291684 292852 293850 294047 293733 293682 294178 294728 294718 294060 293191 292718 293117 294419 296041 297184 297583
52589B97583Q7K52M55O37J165J968K361J992J356R66N13m54j469j559o29K78L07
$$ 297583 297670 297922 298377 299014 300179 302147 304508 306500 307856 308822 309335 308881 307412 305853 305224 305502 305809
52572C05809k57o10n51n35q22j012n59L94R66M52p35j395r85l13m13j055j066
$$ 305809 305552 304942 304391 303856 303034 302022 301463 301857 302823 303275 302540 301145 300160 299847 299434 298379 297313
52555B97313m9J001R93J7j067j738j992j843j297n98p9K43N30P17O44M70N30Q78
$$ 297313 297264 298265 299258 299275 298208 296470 294478 292635 291338 290740 290661 290904 291434 292151 292795 293265 293795 294673
52537B94673J269J561J749J631R76N8m44k59J42K02k6j06K21Q85J691K325K314
$$ 294673 295942 297503 299252 300883 301859 301917 301473 301214 301356 301558 301532 301426 301647 302532 304223 306548 308862
52520C08862J379j09j201j106J39J697K701K965K951L028L086K923K687K546K193
$$ 308862 310241 310132 308931 307825 307964 309661 312362 315327 318278 321306 324392 327315 330002 332548 334741
52505C34741J230o6r51j222j443j949k279k008j577j720k379k810k643k256k148
$$ 334741 335971 335905 334954 333732 332289 330340 328061 326053 324476 322756 320377 317567 314924 312668 310520
52490C10520k324k442k186j536p81l25k55k47o3O4j00k46J21Q68J359J361J265
$$ 310520 308196 305754 303568 302032 301251 300926 300671 300424 300361 300425 300325 300079 300200 301068 302427 303788 305053
52473C05053J288J092M53j19O1R86J983K543K756K974L288L427L115K442J781
$$ 305053 306341 307433 307886 307767 307828 308814 310797 313340 316096 319070 322358 325785 328900 331342 333123
52458C33123J280O81j98j028j405j549k040k860l352l242l020k970k554j398k81
$$ 333123 334403 335084 334886 333858 332453 330904 328864 326004 322652 319410 316390 313420 310866 309468 309187
52443C09187l15j338k011j557o19k05m42p45p51o15o22q45j134j233j008o59n60
$$ 309187 308872 307534 305523 303966 303347 303142 302700 301955 301204 300589 299967 299122 297988 296755 295747 295088 294528
52426B94528p63q64n02K25R69J514J803J759J452J234J430J911K288K411K393
$$ 294528 293765 292901 292399 292624 293593 295107 296910 298669 300121 301355 302785 304696 306984 309395 311788
52411C11788K202J690J139J253K336L798M845N422O012O684O942O535N876N362
$$ 311788 313990 315680 316819 318072 320408 324206 329051 334473 340485 347169 354111 360646 366522 371884
52397C71884M718L378J314q69k545l488l834l916m018m089l810l138k551k411
$$ 371884 376602 379980 381294 380425 377880 374392 370558 366642 362624 358535 354725 351587 349036 346625
52383C46625k348j790q58j48L08J068K180K825K466J723J557K071K688L118L496
$$ 346625 344277 342487 341629 341481 341789 342857 345037 347862 350328 352051 353608 355679 358367 361485 364981
52368C64981L764L593K938K155J495Q50J38m78p69p27n83n85p45o93j04P06R33
$$ 364981 368745 372338 375276 377431 378926 379776 379914 379436 378667 377940 377357 376772 376027 375334 375230 375936 376869
52351C76869L15m32n39j31K63O62J359K110K431K560L145L955L935K832J805J956
$$ 376869 377184 376752 376213 376082 376345 377007 378366 380476 382907 385467 388612 392567 396502 399334 401139 403095
52335D03095L035M103M828N442O039O601P413Q745J0266J1321J1704J1781J1976
$$ 403095 406130 410233 415061 420503 426542 433143 440556 449301 459567 470888 482592 494373 506349
52322E06349J2433J3016J3395J3326J3110J3370J4224J5004J5214J5218J5615
$$ 506349 518782 531798 545193 558519 571629 584999 599223 614227 629441 644659 660274
52311F60274J6365J7133J7996J9144K0207K0720K1015K1849K3210K4264K4508
$$ 660274 676639 693772 711768 730912 751119 771839 792854 814703 837913 862177 886685
52300H86685K4249K3837K3209K2237K0973J9393J7510J5792J4718J3767J1736
$$ 886685 910934 934771 957980 980217 1001190 1020583 1038093 1053885 1068603 1082370 1094106
52289A094106Q354M845K505J342O19l9o68j524k794m050m674m664m504m421m317
$$ 1094106 1102460 1107305 1109810 1111152 1111771 1111732 1111064 1109540 1106746 1102696 1098022 1093358 1088854 1084433 1080116
52274A080116m199m110l786k915j684n88K13R46J714K448L248M336N646O914Q102
$$ 1080116 1075917 1071807 1068021 1065106 1063422 1062834 1063047 1063993 1065707 1068155 1071403 1075739 1081385 1088299 1096401
52259A096401R325J0490J1498J2683J4426J6328J7452J7518J7233J7213J7222
$$ 1096401 1105726 1116216 1127714 1140397 1154823 1171151 1188603 1206121 1223354 1240567 1257789
52248A257789J6737J5661J4031J1676Q775O310N213N112M562K573m39l214m859
$$ 1257789 1274526 1290187 1304218 1315894 1324669 1330979 1336192 1341304 1345866 1348439 1348000 1344786 1339927
52235A339927n446n837o894q658j0239j0724j0146r455r533j0494j1829j2924
$$ 1339927 1334481 1328644 1321750 1313092 1302853 1292129 1281983 1272528 1262995 1252501 1240672 1227748
52223A227748j3420j3277j2685j1884j1060j0395r993r664q993p815o422n151
$$ 1227748 1214328 1201051 1188366 1176482 1165422 1155027 1145034 1135370 1126377 1118562 1112140 1106989
52211A106989m043l100k434j877q67P07J976K164J831K170L228L922L874M012
$$ 1106989 1102946 1099846 1097412 1095535 1094668 1095375 1097351 1099515 1101346 1103516 1106744 1110666 1114540 1118552
52197A118552M902N733N727N521O090P025P109O185N212M701M268L763L567L516
$$ 1118552 1123454 1129187 1134914 1140435 1146525 1153550 1160659 1166844 1172056 1176757 1181025 1184788 1188355 1191871
52183A191871K647N42j872l495m316n007n845o628p263p782p967p507o420n076
$$ 1191871 1194518 1195060 1193188 1189693 1185377 1180370 1174525 1167897 1160634 1152852 1144885 1137378 1130958 1125882
52169A125882l937l425l640m009l668k470j214n13m7O51J211J021L52J04N57J103
$$ 1125882 1121945 1118520 1114880 1110871 1107203 1104733 1103519 1103006 1102959 1103610 1104821 1105842 1106194 1106298 1106855 1107958
52153A107958J159O91j26r94j292n29Q34J710J745J655J954K139J596O53R8P1
$$ 1107958 1109117 1109808 1109682 1108688 1107396 1106867 1107701 1109411 1111156 1112811 1114765 1116904 1118500 1119153 1119251 1119322
52137A119322J38J43K85N46P12R85J916L583N381O833Q157R796J1764J3796J5786
$$ 1119322 1119460 1119603 1119888 1120434 1121146 1122131 1124047 1127630 1133011 1139844 1148001 1157797 1169561 1183357 1199143
52122A199143J7699J9232K0053K0364K0764K1478K2066K2071K1641K1299K1301
$$ 1199143 1216842 1236074 1256127 1276491 1297255 1318733 1340799 1362870 1384511 1405810 1427111
52111A427111K1520K1745K1735K1179K0018J8812J8374J8867J9612J9908J9705
$$ 1427111 1448631 1470376 1492111 1513290 1533308 1552120 1570494 1589361 1608973 1628881 1648586
52100A648586J9350J8913J8106J6665J4539J1815Q700N502K527o9k283m320o535
$$ 1648586 1667936 1686849 1704955 1721620 1736159 1747974 1756674 1762176 1764703 1764634 1762351 1758031 1751496
52087A751496r073j1514j3282j4434j5528j6649j7207j6950j6493j6267j5746
$$ 1751496 1742423 1730909 1717627 1703193 1687665 1671016 1653809 1636859 1620366 1604099 1588353
52076A588353j4400j2876j2094j1590r923o809l697j943j340q16K55J930M139
$$ 1588353 1573953 1561077 1548983 1537393 1527470 1520661 1516964 1515021 1513681 1512865 1513120 1515050 1519189
52063A519189O621Q840J0516J1925J3329J4535J5298J5744J6114J6465J6837J7164
$$ 1519189 1525810 1534650 1545166 1557091 1570420 1584955 1600253 1615997 1632111 1648576 1665413 1682577
$$ [...]
##END NTUPLES=NMR SPECTRUM
##END=
