##TITLE=AC1664_GALAH14355_8570617_Uh1Ts7uQdr
##JCAMPDX= 6.0         $$ Bruker NMR JCAMP-DX V2.0
##DATA TYPE= NMR SPECTRUM
##DATA CLASS= NTUPLES
##ORIGIN= BRUKER
##OWNER= Administrator
$$ 1.72 TOPSPIN		Version 2.1
$$ 2014-04-11 19:29:43.644 -0700  Administrator@X
$$ Compression mode = diff/dup
##.OBSERVE FREQUENCY= 400.02188249412
##.OBSERVE NUCLEUS= ^1H
##.ACQUISITION MODE= SIMULTANEOUS (DQD)
##.ACQUISITION SCHEME= undefined
##.AVERAGES= 8
##.DIGITISER RES= 22
##SPECTROMETER/DATA SYSTEM= spect
##.PULSE SEQUENCE= zg30
##.SOLVENT NAME= COFFEE_meoh
##.SHIFT REFERENCE= INTERNAL, COFFEE_meoh, 1, 14.98509
##AUDIT TRAIL= $$ (NUMBER, WHEN, WHO, WHERE, PROCESS, VERSION, WHAT)
$$ ##TITLE= Audit trail, TOPSPIN		Version 2.1
$$ ##JCAMPDX= 5.01
$$ ##ORIGIN= Bruker BioSpin GmbH
$$ ##OWNER= Administrator
$$ $$ E:\/data/COFFEE/nmr/AC1664_GALAH14355_8570617_Uh1Ts7uQdr/10/pdata/1/auditp.txt
$$ ##AUDIT TRAIL=  $$ (NUMBER, WHEN, WHO, WHERE, PROCESS, VERSION, WHAT)
(   1,<2014-04-11 19:29:36.191 -0700>,<Administrator>,<X>,<go>,<TOPSPIN 2.1>,
      <created by zg
	started at 2014-04-11 19:28:30.035 -0700,
	POWCHK enabled, PULCHK disabled,
       configuration hash MD5:
       C8 4E 4E 5D D3 5C D8 9E 9F 52 82 E0 59 8A DE 15
       data hash MD5: 64K
       68 57 42 05 39 A6 9B 34 83 DF A5 19 84 CF 00 1D>)
(   2,<2014-04-11 19:29:39.254 -0700>,<Administrator>,<X>,<proc1d>,<TOPSPIN 2.1>,
      <Start of raw data processing
       efp LB = 0 FT_mod = 6 PKNL = 1 PHC0 = 0 PHC1 = 0 SI = 32K 
       data hash MD5: 32K
       16 59 D6 2C 67 7F AA F6 27 68 2E AD FF 9F 87 03>)
(   3,<2014-04-11 19:29:39.566 -0700>,<Administrator>,<X>,<proc1d>,<TOPSPIN 2.1>,
      <pk PHC0 = 95.84473 PHC1 = 0 
       data hash MD5: 32K
       EB 21 59 D0 72 BA 78 0C F6 EE 03 A4 99 9B 00 B3>)
(   4,<2014-04-11 19:29:39.691 -0700>,<Administrator>,<X>,<proc1d>,<TOPSPIN 2.1>,
      <abs ABSG = 1 
       data hash MD5: 32K
       9B 62 B5 B9 52 FB D4 96 CE 83 26 D8 83 9A 77 0B>)
(   5,<2014-04-11 19:29:39.769 -0700>,<Administrator>,<X>,<proc1d>,<TOPSPIN 2.1>,
      <abs ABSG = 2 
       data hash MD5: 32K
       8E 3A 3B CB 4A B6 0D 6B D0 D7 7F F1 5B 5A E2 35>)
(   6,<2014-04-11 19:29:39.879 -0700>,<Administrator>,<X>,<proc1d>,<TOPSPIN 2.1>,
      <abs ABSG = 3 
       data hash MD5: 32K
       81 FC 50 25 6F 2C F7 BD 7D A7 90 2D B6 36 85 2F>)
(   7,<2014-04-11 19:29:40.004 -0700>,<Administrator>,<X>,<proc1d>,<TOPSPIN 2.1>,
      <abs ABSG = 4 
       data hash MD5: 32K
       A8 C3 E8 90 63 5C BF 4B A2 10 89 98 50 A7 7D 62>)
(   8,<2014-04-11 19:29:40.160 -0700>,<Administrator>,<X>,<proc1d>,<TOPSPIN 2.1>,
      <abs ABSG = 5 
       data hash MD5: 32K
       53 9C FB CA 3D F8 BE C1 0F 29 CB 40 2E C3 73 09>)
$$ ##END=
$$ 
$$ $$ hash MD5
$$ $$ 28 41 F8 F7 99 21 0E 69 1D 0E 95 C5 84 40 6E 0C
##$RELAX= 
##$RELAX= 
##$RELAX= 
##$RELAX= 
##$RELAX= 
##$RELAX= 
##$RELAX= 
$$ Bruker specific parameters
$$ --------------------------
##$DU= <E:\>
##$EXPNO= 10
##$NAME= <AC1664_GALAH14355_8570617_Uh1Ts7uQdr>
$$ [...]
150 150 150 150 150 150 150 150
##$TP07= 0
##$TPNAME0= <>
##$TPNAME1= <>
##$TPNAME2= <>
##$TPNAME3= <>
##$TPNAME4= <>
##$TPNAME5= <>
##$TPNAME6= <>
##$TPNAME7= <>
##$TPOAL= (0..7)
0.5 0.5 0.5 0.5 0.5 0.5 0.5 0.5
##$TPOFFS= (0..7)
0 0 0 0 0 0 0 0
##$TUNHIN= 0
##$TUNHOUT= 0
##$TUNXOUT= 0
##$USERA1= <user>
##$USERA2= <user>
##$USERA3= <user>
##$USERA4= <user>
##$USERA5= <user>
##$V9= 5
##$VALIST= <valist>
##$VCLIST= <CCCCCCCCCCCCCCC>
##$VD= 0
##$VDLIST= <DDDDDDDDDDDDDDD>
##$VPLIST= <PPPPPPPPPPPPPPP>
##$VTLIST= <TTTTTTTTTTTTTTT>
##$WBST= 1024
##$WBSW= 4
##$XGAIN= (0..3)
0 0 0 0
##$XL= 0
##$YL= 0
##$YMAX_a= 644459
##$YMIN_a= -547346
##$ZGOPTNS= <>
##$ZL1= 120
##$ZL2= 120
##$ZL3= 120
##$ZL4= 120
##$ABSF1= 14.98509
##$ABSF2= -5.573092
##$ABSG= 5
##$ABSL= 3
##$ALPHA= 0
##$AQORDER= 0
##$ASSFAC= 0
##$ASSFACI= 0
##$ASSFACX= 0
##$ASSWID= 0
##$AUNMP= <proc_prof1d_extract_pilot.lims>
##$AXLEFT= 0
##$AXNAME= <>
##$AXNUC= <1H>
##$AXRIGHT= 0
##$AXTYPE= 0
##$AXUNIT= <>
##$AZFE= 0.1
##$AZFW= 0.1
##$BCFW= 0
##$BC_mod= 0
##$BYTORDP= 0
##$COROFFS= 0
##$CY= 15
##$DATMOD= 1
##$DC= 0
##$DFILT= <>
##$DTYPP= 0
##$F1P= 0
##$F2P= 0
##$FCOR= 0.5
##$FTSIZE= 32768
##$FT_mod= 6
##$GAMMA= 0
##$GB= 0
##$INTBC= 1
##$INTSCL= 1
##$ISEN= 128
##$LB= 0
##$LEV0= 0
##$LPBIN= 0
##$MAXI= 10000
##$MC2= 0
##$MEAN= 0
##$ME_mod= 0
##$MI= 0
##$NCOEF= 0
##$NC_proc= -8
##$NLEV= 6
##$NOISF1= 0
##$NOISF2= 0
##$NSP= 0
##$NTH_PI= 0
##$NZP= 0
##$OFFSET= 14.98509
##$PC= 1
##$PHC0= 95.84473
##$PHC1= 0
##$PH_mod= 1
##$PKNL= yes
##$PPARMOD= 0
##$PPDIAG= 0
##$PPIPTYP= 0
##$PPMPNUM= 2147483647
##$PPRESOL= 1
##$PSCAL= 4
##$PSIGN= 0
##$PYNMP= <proc.py>
##$REVERSE= no
##$SF= 400.02
##$SI= 32768
##$SIGF1= 0
##$SIGF2= 0
##$SINO= 400
##$SIOLD= 32768
##$SPECTYP= <>
##$SREGLST= <1H.CDCl3>
##$SSB= 0
##$STSI= 32768
##$STSR= 0
##$SW_p= 8223.68421052631
##$SYMM= 0
##$S_DEV= 0
##$TDeff= 65536
##$TDoff= 0
##$TI= <>
##$TILT= no
##$TM1= 0
##$TM2= 0
##$TOPLEV= 0
##$USERP1= <user>
##$USERP2= <user>
##$USERP3= <user>
##$USERP4= <user>
##$USERP5= <user>
##$WDW= 1
##$XDIM= 32768
##$YMAX_p= 456312793
##$YMIN_p= -698605
##$CURPLOT= <Network HP LaserJet P1505>
##$CURPRIN= <$Network HP LaserJet P1505>
##$DFORMAT= <normdp>
##$LAYOUT= <+/1D_H.xwp>
##$LFORMAT= <normlp>
##$PFORMAT= <normpl>
##$SURQMSG= 1
$$ End of Bruker specific parameters
$$ ---------------------------------
##NTUPLES= NMR SPECTRUM
##VAR_NAME=  FREQUENCY,     SPECTRUM/REAL,   SPECTRUM/IMAG
##SYMBOL=    X,             R,               I
##VAR_TYPE=  INDEPENDENT,   DEPENDENT,       DEPENDENT
##VAR_FORM=  AFFN,          ASDF,            ASDF
##VAR_DIM=   32768,         32768,           32768
##UNITS=     HZ,            ARBITRARY UNITS, ARBITRARY UNITS
##FACTOR=    0.250966925370066, 1,           1
##FIRST=     8223.43324360094, -123960,      -37006
##LAST=      0,             124397,          -251553
##MIN=       0,             -698605,         0
##MAX=       8223.43324360094, 456312793,    0
$$ Real data points
##PAGE= N=1
##DATA TABLE= (X++(R..R)), XYDATA
$$ [...]
23827 -280294 -72455 285890 87572 -63826 65076 -1512 5472 184120 -114480 115293 -315018
23815 -37939 32772 -142203 -310872 161668 84079 6625 -31330 -336585 154004 -106202 -59035
23804 -59035 105034 -200861 -231533 -85257 104918 416013 108971 -87608 127249 -119199
23793 -29970 -107194 258303 328335 -51999 139041 44919 39052 242674 -176383 78447 -58890
23781 21296 62602 -216428 -115543 16418 111689 -152560 -48587 -166103 105286 -96528 -179695
23770 -179695 -354930 -127661 -152756 -294877 141113 289572 230726 53204 -141529 -198989
23760 -198989 73618 -48031 -234615 -62775 -122467 64224 27857 108854 149523 -245266 71189
23748 56092 -400775 -399993 -191740 163457 -178298 -219179 -26290 169686 -233247 -46501 -204129
23737 -204129 285276 151170 -49151 110410 159196 241991 -259704 781 9934 -221075 -152833
23726 -152833 -312062 -190850 12130 -19907 79545 -256092 277182 113957 94247 -114577
23715 -46563 -54069 -92468 34222 -6177 -221564 -242070 -13832 177869 231482 24799 -112907
23703 70989 -133204 177305 -93764 -10433 -133447 -63710 -240415 2981 -150116 -322740 2780
23691 138847 132796 -10244 285083 270902 60648 -135385 265694 -9332 -135874 114715 -57512
23679 52503 55569 -164166 -232171 -112897 -89425 104792 -128953 -45287 -22247 -50491 -249548
23668 -249548 -114889 56326 -229225 -4415 -271053 -41079 17456 -1863 -158472 103768 -195332
23656 -211816 -145738 142139 203645 102881 -80804 -90078 -362230 -81749 -42816 -91075 -136348
23645 -136348 254354 -305351 -68153 -92265 -99246 335448 109977 -199288 262411 -334409
23634 -40755 105267 85021 -11868 -5598 -255251 73077 74011 -70437 -19675 -15133 -55737 188724
23621 -221798 285036 -338475 -360533 8045 -236469 -80362 -50212 11093 257337 182555 -302220
23609 86332 119350 202124 -81745 -94046 204249 1171 156940 407761 -171979 -245025 341761
23597 -382829 -49983 -104239 -77399 124498 34228 -75362 315927 381688 -55095 39889 368727
23586 368727 -64377 150469 -126792 -1695 257954 -209070 -311025 111071 274058 -103509
23575 188492 -252323 111014 -192689 293139 -81253 -116725 193282 -314854 -81556 -316606
23565 -316606 113157 110309 9973 102472 -82227 74456 80521 354762 -229154 -204459 93214
23553 -90089 -28456 -6571 -41557 23148 82140 45541 44994 -475882 -154926 -17830 -114479 -39506
23540 -128962 90210 -144685 228736 -223012 102347 -377023 -24638 78637 142810 -286709
23529 -166931 -86574 -105961 -179810 103227 95184 240168 11579 -71064 37731 103678 55295
23518 55295 84845 187185 -149539 317924 175113 -152134 46045 -17060 52748 -133652
23507 -54498 103741 -148581 126732 -150694 68863 134375 -160383 15566 107342 -58747 -216543
23496 -216543 -294012 -87835 37385 -187326 4925 366538 13381 2008 -49677 -189282 131771
23484 323426 132364 -100568 129622 -33265 71501 -46317 39427 -2502 20188 92138 -149964
23472 163088 27880 -23809 104490 26873 -42677 -11126 -323204 -224317 22521 -150887 -113575
23461 -113575 43302 -8653 4882 280683 -493433 93117 -31441 10618 279523 152063 -41452
23449 -89017 41814 173503 -162721 297693 -203467 -214714 46247 -9310 341842 -46740 -108027
23438 -108027 -156192 122367 -37575 81304 -368354 300581 64395 434700 193410 -79885
23427 265015 -119629 -240974 -51551 91728 250904 398490 -114916 340910 -51032 65844
23416 255904 105572 -155199 -135752 -270373 61856 -200439 -184015 -339907 24640 -154923
23405 425748 52836 -118955 -14796 -180912 241405 9256 -39363 -403714 -124184 -59161 -79894
23394 -79894 -299225 102287 220964 150942 -245448 -172200 117164 4455 145845 19969 -240986
23382 -354006 200886 -1089 67233 -89061 4344 -47932 82430 111906 -70647 208686 36080
23370 -309518 -45745 -90213 -100145 63337 -124761 17948 46280 173917 49681 -88615 -83084
23359 -83084 -262953 -115471 -345174 1382 -165885 178062 -66361 176098 36967 -98523 -308994
23348 -308994 -35127 -148942 -197196 223459 -231878 98281 -282420 -214819 27919 321 -154899
23336 35804 -12246 -274681 -100167 -261909 195814 -100684 39720 17315 -86941 148576
23325 -75641 -406950 -64109 103690 -300639 114740 396541 120942 -48289 176491 -263279
23314 47402 228724 -148556 141050 -290702 -312536 10860 3016 -248812 -173332 -259644 78401
23302 -152373 43953 -237346 -164616 294035 79894 48807 -171378 -126528 -118718 -507084 -208971
23290 -377778 138606 -40232 42363 -15161 -18092 138204 -7959 -288056 -63673 302523 -81588
23278 78757 40735 109943 -70612 114308 -125701 -101145 414772 123290 -21110 138571 -220661
23266 -413253 -395944 21826 -306183 -341378 312717 -4311 287141 318020 -206311 -45442 -34553
23255 -34553 -185771 40150 39109 117331 160768 -112913 213455 -185402 -95749 -67012 -26267
23243 -128463 83602 -79725 -50115 333759 -229657 -310510 -138976 -39546 -17765 -122340 45337
23231 -200579 -59932 14021 -210527 -158633 -15691 -32629 2149 123910 130635 207867 -75409
23219 248180 -176538 -231825 -20137 118809 -352464 -42144 -112841 -276253 -150066 33929
23208 183835 -30264 -210800 -8912 294796 225082 -5122 159649 -282739 -1627 309765 -356661
23196 -68502 267647 35530 231843 -189363 279208 -168576 -179903 9105 189216 -28387 102610
23184 203185 -150498 -29768 40928 -116376 -147708 -96898 54804 142687 107460 -81347 194699
23172 -87315 64974 -288632 -146676 -298832 -132934 31964 54472 -46611 159792 -147585
23161 -68244 73083 344497 -246775 51762 232825 123533 -239955 -29875 120481 80375
23151 80375 109246 -348732 -279807 37060 269698 -38309 -297403 182385 -118068 -148004 283815
23139 36649 -92436 1670 270856 -319889 -93876 -37714 16073 107373 -315197 262713 8409
23127 356718 -167031 -113773 19128 42225 148874 -114164 4366 130048 43571 -392551 -301516
23116 -301516 -218129 -7836 147552 195615 -18850 195322 -141577 -77918 -196650 -62552 23200
23104 42557 260457 -141108 9367 -114510 39766 -138089 40946 236171 -175906 77627 -49387
23092 -19039 -80559 23988 -48096 219915 23850 -75780 62327 27143 -300572 370871 74755
23080 142147 -385667 -129156 -160630 -129519 -21194 -40290 -81622 -40244 203065 -34729 -247267
23069 -247267 -229459 -170093 -140030 178238 -201309 -378322 235935 -19881 120888 -242560
23058 -127748 172524 6996 99937 100136 -235742 233211 259935 6810 111475 -167592 374513
23046 -98718 -55729 -225548 -119001 159092 -290466 62402 -268022 -400483 69171 72742 58192
23035 58192 -8882 -60918 3360 152515 -68170 144472 206437 114592 -131402 133342 60886
23023 152764 93433 119852 -241901 251953 96874 12522 155358 228096 -78620 -28562 -35820
23012 -35820 -36217 -105958 1303 131896 -12425 -231263 176709 58086 -32061 90005 -87413 176192
22999 53410 -222723 -128386 -11020 -29206 -112217 -90993 78959 -339602 105796 18344 -327571
22987 -57041 129196 4566 116108 90112 99268 133913 -150701 21093 -225460 -54233 341046
22975 -34813 -107096 -87662 96535 15486 -120983 -82556 94877 -167820 -304242 147021 -137958
22963 143879 -122704 -53906 -32895 -72704 38365 200454 -5254 -103344 -1800 -109290 -48968
22951 -2115 231312 -295330 12908 -17543 -199971 -64462 221937 268948 -151659 -38932 -61589
22940 -61589 -90805 20632 -84692 79667 -252007 105568 -118250 54373 78630 -108008 -184640
22929 -184640 -94474 -19584 -442 -62012 -88044 98633 -278961 -206606 -95150 -16585 281868
22917 -81238 104481 -316372 8811 236061 -131670 -19550 51616 -204575 -15265 -102085 -156282
22906 -156282 -157098 -126018 -348576 -82144 17234 -38661 -310501 -136699 -36836 -25985 -144519
22895 -144519 -92227 88153 73553 51274 -87386 -153150 42787 58320 215332 -331319 73133
22883 -336440 330182 -251342 -3991 -9493 -187573 -46749 -53368 533013 12304 59388 -48534
22871 75547 136910 -126174 -389278 -177563 144475 -465668 -439610 -156009 95131 12948
22860 -94823 84295 -153199 -64361 -339539 -203244 -30792 5310 -260638 163711 -201965 -441458
22849 -441458 -98347 225251 158380 -189267 149641 -65804 -102330 -236224 -47519 -56528 -68118
22838 -68118 113823 -202446 -206072 -190500 -239292 452784 49851 99859 411547 10340 -370257
22826 -557600 32965 -24848 34565 -172305 -165710 128570 -25897 -185063 -213624 -372405 173648
22814 65319 -290800 32165 121424 314138 187723 73704 180042 -124791 -155026 -43163 10165
22802 -35097 -86675 222354 -78764 -170026 -55021 -195767 -328693 65097 162108 -108720 139650
22790 -319408 -217397 367110 188667 -25893 -197140 49319 -109744 61579 172994 -201559
22779 -89103 -205801 -27143 268907 156534 -54003 -294034 -362026 -148620 -218060 11928 -133650
22767 -43313 16464 -57434 -170195 -106366 -24507 -15807 -41605 346247 -117130 -63686 155152
22755 201652 -77009 119519 -159288 -19213 267332 -123193 -246338 -86382 282771 172035
22745 172035 -5694 -240837 178637 -123234 157737 28953 225621 -202069 75357 186265
22735 186265 -198961 -102784 -330998 201025 114563 -392830 -62146 180015 158448 176356
22725 176356 -144655 204243 -107122 -36232 129731 90228 445490 64319 -121738 -7480
22714 -113123 120687 -363296 294632 4584 -177596 228489 -58359 35364 -64659 -304137
22704 -304137 -109153 -116237 -227335 -80416 91294 -178618 -96995 -133714 -77882 -529238 -138056
22692 264020 -36490 175895 -38087 35292 -37992 8912 -303904 103407 177562 -39980 -112700
22681 -112700 -265004 -71161 -92637 -59221 42864 44530 19911 -86849 451996 -291079 -536126
22670 -536126 81813 -22627 -20499 -123489 -20201 130583 316408 -38789 -26287 -107979 121363
22658 150585 143933 173012 127603 -55217 152740 -338339 -156596 70529 -34934 -22325 21867
22646 -71214 -235430 187397 66577 -209991 145595 25358 10606 -114174 -194420 -31349 -255358
22635 -255358 118894 265784 -174966 34430 -154995 -142262 -92815 205085 -154151 50290
22624 135458 118753 105422 -104900 206715 -18944 19194 21237 -357556 -70661 -127352 448210
22612 8157 -210766 -44325 -63633 -179228 -319774 19668 -51655 159780 -31763 -150115 9259
22600 -297386 -2054 -49771 -27922 -158134 120732 380845 -143059 -107193 -219313 105590
22589 -211795 -57837 -191647 87394 -74406 -171595 209482 153028 -148137 -26179 -14670 -121912
22578 -121912 101397 148692 96714 -229710 178787 83256 -167595 -238298 -17552 -321110
22568 -321110 192246 40516 173652 201746 -4260 5378 -304243 -128164 15678 -202981 -349104
22557 -349104 -314676 -99370 -13661 -136066 -165909 -172954 -38780 96132 -158451 -334369 -151805
22545 -235071 154468 -81245 174492 75105 101742 -24944 -27856 159287 -5939 -38016 109344
22533 -135518 -37076 16852 -114300 -148185 -38103 198531 86209 -172867 85894 300031 -196768
22521 -31507 87049 -5897 -246523 183765 -10384 -62647 -307113 -1281 -267801 195024 208462
22510 208462 -18230 -317413 12359 -351454 -303790 -11429 -212113 -1978 -72538 38509 -351599
22498 123006 -54126 -104572 -214379 -423669 -475304 -97605 14334 -97281 -52837 70699 -107392
22486 -379597 -39282 -480897 46020 -16697 -178698 -312676 -121131 -240357 -284074 114604
22475 37466 -98516 20429 22908 -133803 -251194 304921 138305 200802 67683 167081 -17509
22463 -219576 221024 -4286 -146504 -6046 426097 -171327 -81444 -110890 -84706 63313 14487
22451 140693 -8580 -162275 -367583 -111258 -325880 74623 14153 -90854 127296 6457 -210234
22439 -107386 -165496 -116368 288883 199306 -99975 -223037 -13720 26233 29281 -87949 -45220
22428 -45220 -242587 -68556 -123955 -82252 -203048 -26962 -187618 161054 236252 -102237 8739
22416 6789 -341266 -106421 -15306 83722 29250 -71186 -93468 -288852 -247162 -169586 97815
22404 35558 -197097 72604 62230 -278428 -180821 199149 -45436 -83091 -144594 -162266 289677
22392 -44467 664618 -166093 106229 -105048 137838 98317 -22015 -23032 -350005 161896
22381 126781 68675 -452184 157090 -136949 -59505 255108 -43139 69485 -101324 106018
22370 -278941 168301 -144442 92168 -222332 258435 47298 122926 -110371 102160 -177600
22359 171298 98247 316390 74570 128720 90551 -120670 173170 -21372 -90747 93822 -91858
22347 -19997 201436 154105 -209144 -1546 164808 274682 -24959 -170306 115951 178290 -4784
22335 322468 153101 101771 -173454 78803 -74739 -125297 20663 27259 206734 161238 -217107
22323 -110482 -361444 102675 220392 164188 29544 -124320 445533 169295 -98397 44703
22312 20072 122887 158586 -50036 -164745 167275 218023 51813 -75613 -35473 -145054 -388688
22301 -388688 -113219 -232914 -140687 -242599 -118602 40316 -297040 -112427 96393 -172770
22290 -11105 164548 -131024 55380 268298 75317 -163734 -395160 90162 103999 -225732
22279 185571 -317869 -140537 -128382 -160261 65725 -142886 -195891 -187505 70148 -163576 -87167
22268 -87167 66839 39150 13958 111494 -235234 -88743 -54168 74263 46590 -135218 129806
22256 -359063 99726 50105 105195 -156039 53718 68945 -415983 61281 -32859 222792 -176560
22244 -382097 166198 -42504 -18845 -74285 14322 -241971 -27549 156074 -109310 -305884
22234 -305884 -242862 -289720 -31828 -123789 26263 20032 -67724 -80277 -190411 16601 -224608
22222 -159650 -235676 72116 -100085 -104368 36919 -177602 -164102 -106948 -394691 82885 5320
22210 -177485 8882 10698 -22684 -355773 -410820 92764 -289828 -114592 190285 37645 240638
22199 240638 -182189 279055 171041 -89621 40259 -185790 -134189 98552 -233785 193155
22188 -203871 -193698 -315629 163668 36862 -150203 -228567 -431340 -105160 -237642 -139168
22178 -139168 -79862 329421 -231245 46791 -35180 -195765 -119029 96915 38415 -144239 22700
22166 -7812 254062 104489 171743 116489 -209730 -117245 138172 -328391 -213704 33928 -214508
22154 -143882 178197 -85315 287947 87255 -77853 -194161 -190994 165073 -46398 -252751 89456
22142 -209372 341020 -230604 -291930 -85041 -198030 -2876 -150770 -159379 -250805 127586 -140212
22130 117612 46008 164191 -209066 -174617 140925 -134461 178066 44565 -203576 -115996
22120 -115996 30672 76487 169288 -15663 -77167 146688 -53373 -130495 10007 -15425 -100849
22109 -100849 -45172 159209 -230908 -227444 -209012 60928 -107063 -177979 -9143 -168742 -107994
22098 -107994 -38812 64220 6648 -295860 -199890 -273418 -44298 53916 116905 19366 -132433
22086 -190957 17869 -260658 133723 17088 -125339 362909 -67726 179433 -278011 -244348
22076 -244348 63972 233037 -198902 125434 -49752 -4045 -35934 127798 -225127 58652 -296071
22064 -139302 -133008 -239843 -217388 -193709 42689 183484 288390 67534 -144154 48255 -79848
22052 141182 -348056 -340487 -240822 90928 92914 235624 -106961 109259 -102716 34944 65465
22041 65465 129234 228990 135039 -65239 -25233 187196 128789 262747 -82020 -205754 -146295
22030 -146295 250429 12937 -9137 -270727 799 318192 -49594 -201079 -245903 -84777 185670
22018 -308452 -182490 -257027 -358910 86729 18422 -280513 170116 50501 -171466 75462
22007 199226 -243546 -1738 104451 -136802 -405815 -154805 -80597 -133720 102443 -168645
21996 -248060 -303295 -453344 -63921 50792 -245116 -30 3848 25900 -162253 176757 76029
21984 94862 -68875 47242 -273687 220513 -131535 -70695 -53522 5375 -104393 45009 62273
21973 62273 -148137 -73538 -249369 13161 280494 -249476 -125093 211440 -65987 -23060
21962 -102002 7097 72413 -463115 171147 -157980 -209317 147478 42028 49941 -95059 -92961
21951 -92961 63072 95803 -205925 57675 114904 21870 83308 -81148 55744 49562 -223522
21939 -382529 125443 294338 299218 -160655 -53330 -47704 -5643 -12718 136521 162219 -194310
21927 -167976 121492 -19807 128787 -47510 28298 -444414 -59910 -3546 78472 31544 -203264
21915 122439 -48214 -122016 94728 180644 137777 -185856 62335 88469 -270090 165627 249543
21904 249543 39308 61517 -180366 -50380 -137095 -170183 254670 -153891 -160781 -273916 -65651
21892 -30241 203891 -181410 -292384 -191013 -282342 -97011 -13813 -192861 -81149 27238 213920
21881 213920 -182287 -106943 -273969 154998 137092 -12842 -176151 -64450 -162024 -107339 -170860
21870 -170860 -59276 279013 -9292 -16974 -105106 -129267 -316624 56933 -25439 -236109 90358
21858 -155227 75996 -166041 -206028 -97402 141551 -13628 -219289 -259893 33603 -263355 83285
21846 99138 -286551 24039 85037 -77082 222641 125641 58781 -39790 227031 -219522 -155387
21835 -155387 -93287 298330 96334 93352 81539 -74977 44965 58899 257912 -471287 -73571
21823 -27077 -86624 -101555 23559 256693 30499 -369474 116494 101724 276660 116194 162116
21812 162116 -70055 -40199 48581 -321975 -384810 -332175 128691 -7774 -55595 -9192 -15528 81980
21799 315028 -191106 68183 178966 -224387 234856 225147 -151370 -33943 -259155 -128142
21788 -138207 -130895 -49615 -81348 -262397 146684 42169 -41094 -294613 -251258 -257899 11942
21776 -358488 -109591 139255 102910 293433 3352 -81433 -359134 -17100 -70004 -193678 -194601
21765 -194601 16063 -323200 -298273 -116270 9710 -332689 70170 69410 338404 215582 523548
21754 523548 -149509 -362738 -231067 102793 -189165 -267411 6253 -51854 -122132 -84990 30370
21742 -38354 -100909 -244661 62609 -78604 134597 -149941 -86667 218722 -183867 -136736 23775
21730 -130640 67605 -36988 -30366 -195805 140858 -498030 -150816 -105129 -29786 -285344 -329938
21719 -329938 8501 19856 19351 71709 7498 66449 -2088 -219404 -76154 -143219 141913 -74397
21706 72929 122773 40333 -261602 -206492 -45561 77698 -83701 -182542 26333 277646 -226400
21694 -377691 328139 -225812 19772 -165179 -55954 142890 -85932 -151291 180543 -7689 -1936
21682 136910 90824 -48078 187556 -316692 101751 9994 -202586 92753 32155 13532 49648
21671 49648 -202049 -219351 54973 33004 103800 -46526 8514 -224328 273448 -235405 185956
21659 -228336 -196797 -28140 -121905 -219400 -22223 -1661 -91838 154589 195605 88887 -150587
21647 -278775 -403513 -22200 -90718 -186863 238488 -264352 -254895 -103620 264939 -107660
21636 -236660 45554 -204404 286829 -244963 -232583 -33546 63371 -3994 161486 -115101 -67045
21625 -67045 154307 -309306 -46340 -101326 232346 -170556 -412059 304594 -193429 -35493
21614 -204995 48391 53900 60253 33347 -319334 -267085 143326 -249573 -74034 -164548 8697
21602 33688 361612 -26333 -457041 -413670 -276784 93111 -5160 273652 108696 -28793 -115610
21591 -115610 -293168 -367051 -285242 -58275 -10806 -15815 54144 -376578 -183064 58793 42730
21580 42730 -323435 -308344 104083 67255 -327225 172456 -124596 213413 76483 -101713
21569 -91527 -108312 -297234 -128397 -37514 -272655 29153 -117894 -176457 102024 13383 164299
21558 164299 239343 -54667 39809 -320758 -251043 -259199 -8271 -96471 39183 -187078 -352748
21547 -352748 50534 79775 39697 -60949 -353756 161012 -233330 -268206 -244619 -87934 57191
21535 -55707 -15827 148042 35174 212800 465371 118991 -178081 101043 -188280 143146
21524 -78266 -448801 450752 -85769 -50977 232444 -181777 319220 114845 1276 -130630
21513 137464 -52381 100491 -112338 83359 -132504 -310280 -70172 -286084 -179622 -262624
21503 -262624 69109 -14676 437135 -271629 -165735 -215097 -227998 380489 214368 -142721
21492 -290228 -138278 -70958 125350 -328708 174151 -138329 138819 -181819 -46075 17922
21481 -90207 56478 -136742 172340 134794 15510 -133204 -177311 258000 -36593 169651 61429
21469 -88555 -112070 -224983 201876 -175298 56517 150965 -155917 -101763 166099 -59759 -137446
21458 -137446 273211 -92986 -173782 -58690 -414161 204155 -111449 -89319 126071 30768
21447 38685 165218 -104740 106561 -137138 -90575 -288770 -86976 111157 1060 117461
21437 117461 284859 156127 213847 168132 199708 -63969 158813 -65094 -136872 -163632 -351268
21426 -351268 144088 -296176 -27990 14993 54231 349475 151093 114638 31901 239158
21416 239158 4884 27399 -79078 -21683 42183 166788 -294911 6351 276613 22605 -39315
21404 -105140 -177546 -218605 -232444 -98265 -122375 -78586 79015 -80698 236200 -143964 -1520
21392 -382547 -36346 -170831 -63263 -174445 57055 -199864 -190869 11284 -155350 -204851 -123540
21381 -123540 -196150 163232 193582 -47049 -275796 -88622 194683 186264 -65861 -182730 -90963
21369 57648 -181355 300804 258066 -37969 -56875 100550 -399475 -186555 18599 -27077 28252
21357 -44945 -23584 -111547 44211 -2215 -45160 -55953 -246771 172038 -118095 -218824 -276724
21346 -276724 -127766 -102447 217373 -260743 -233531 92244 -61213 218831 221226 -223241 13801
21334 46226 -365520 -66034 -178761 325558 -158515 178568 50820 -202613 -169358 37575
21323 -217098 -69752 -26429 -101471 -288864 202963 -41568 -88453 -325964 -15940 -272083 58012
21311 -339822 1700 63986 176049 7922 -181928 176704 -50029 -36536 145649 -212510 -127323
21300 -127323 163185 40851 21458 -208020 -84509 -235295 -197039 -253210 14189 251148 59601
21288 -30956 -317826 -49290 130829 -39678 -23483 -224407 -210916 68308 247472 -104827 313706
21276 -267865 -115777 34731 -18400 -279655 -330919 -64479 -9331 28284 242484 18358 67990
21265 67990 -371545 -154130 134072 101282 -211569 11423 282188 -280853 64088 -252709
21254 -98817 -61804 -283255 -268491 638 -289597 292356 -60701 -77442 -147625 -166367 -82637
21242 -217270 -131001 219033 120963 4289 38696 -30107 52606 -235754 63265 192938 88703
21230 -131281 -125218 -77984 34787 205733 -14393 2852 -232945 144230 21345 38787 114762
21219 114762 -84481 -220173 74203 -297010 -5982 -15717 63911 186968 67477 -72853 209558
21207 -122419 -133015 25951 70957 -68303 213177 237294 125529 -47346 -62909 135513 -30363
21195 73779 -280904 -57512 -42710 303398 -141305 -116037 56199 -4244 -231363 320691 164629
21184 164629 -14035 57245 244328 87001 198767 -271765 5162 -22919 104080 100407 -185742
21172 -31158 51059 -267465 42897 -36884 58135 107650 72000 -255469 -229536 -178896 -166493
21161 -166493 106824 -291 -162991 -65090 -211630 198816 -18802 -119042 -149458 -103577 246754
21149 -149378 112888 -212243 -33715 -191971 147613 -24606 54731 -583160 -225524 -44800
21138 -8725 -69460 -150631 -241936 -168054 -328731 173241 188793 -343459 274426 -251086 101985
21126 -120193 70589 -197162 -130341 -75000 12824 -83269 411788 -135492 -158971 -131515 88758
21114 96703 70942 134965 -133513 -148092 59008 -72802 -393899 -196354 -322121 85659 -205059
21102 264926 -160598 262993 -87017 -67592 -192559 -201566 35605 131041 22017 -131755 315204
21090 -6609 -19448 114637 -254024 -61376 -25920 -203820 -270016 23330 -58151 -246488 -314224
21079 -314224 217790 21410 -172228 -130493 -162766 -180919 129736 -328208 -559622 -233168
21068 -171992 226204 -98814 77761 -297369 96620 -62139 -36250 -12341 18302 307697 268365
21057 268365 -51162 316697 -257192 23432 -97228 40375 200027 248801 -340543 31549 86555
21046 86555 369723 -427427 -95971 -203863 52704 -299787 -158254 73645 110945 -9148 146451
21034 56267 -202322 -250548 26598 3430 7787 79520 -154147 -313101 -42366 -6848 -44299 -397052
21022 -397052 -65787 -177064 -32858 190211 8521 -184281 280781 -86607 26037 -100635 192626
21010 139739 -151932 -93344 -85832 -30012 -275903 395441 -21522 -5311 -246249 -5139 355081
20998 103069 20040 -91178 -86761 19804 -167245 84201 -240952 -61623 -649594 -51821 -15444
20986 95219 20714 159925 116001 -2184 -270487 -7022 -217083 -79617 -22383 -56393 -223502
20975 -223502 97098 -34802 -22232 3698 -59145 -43721 -2324 -267536 -133253 215655 -118619
20963 28559 150165 118352 97027 -156518 -223798 -28839 -180181 97061 -129086 -156697 20741
20951 -240948 60325 -34781 14601 -75342 -3837 -190890 -134979 -161615 -93773 -164815 -431880
20940 -431880 -8041 152514 -217309 -57588 309621 43092 -127776 -201059 -419741 79137 72328
20929 72328 76004 -130568 -131528 280200 -292411 -43779 9024 182227 572692 -210177 3934
20917 51359 90153 -60740 -196660 -178306 -15994 -63496 -339656 -237005 14370 -168677 -56146
20905 -235124 142732 -29468 -135476 86119 -294319 -229592 -183543 -22827 2131 -310171 -237973
20894 -237973 -69106 -260642 -72190 53531 132632 -180088 -243467 -197191 -225797 -89504 -141434
20883 -141434 -16955 376264 -88863 -561466 -35154 -240319 240039 -25036 50728 272545
20873 272545 -123726 -130146 -264207 82910 -242240 227562 -133682 24639 -65823 43528 106616
20862 106616 -13042 331681 60260 24601 10668 200881 180662 59716 282525 -100810 -105339
20851 -105339 -107452 -111216 -364994 107294 192281 -114813 -267556 6751 -331815 282394 249809
20840 249809 46080 56339 -174080 -134101 -149784 12697 -131565 121545 185912 -305134 80436
20828 17520 -180990 -157748 -172303 -198096 85740 -475349 -281013 -213585 245429 15284 202276
20817 202276 171165 125751 -83623 56281 251284 -86378 52165 -4142 228366 -298022 -292415
20806 -292415 -294498 -273655 -98125 54122 336726 -32270 137701 -187810 -342161 206821 -41975
20794 -48898 -37388 -30166 151581 -175702 -289145 -308821 -175025 230252 -212045 -244612 -136874
20783 -136874 108692 -17539 108224 -59172 -18999 -85404 -23242 -233604 -72137 -26917 -402072
20772 -402072 68721 -114808 -37277 -11716 -216627 -108533 -38350 216406 -289821 -127271
20761 6300 -40697 232191 -56720 -168832 28295 -213716 -49740 -19868 -12317 -128806 -202090
20750 -202090 -254830 216371 -230527 16265 -254052 -56725 -23526 -546573 -103458 99277
20739 -300063 -161428 -123566 -7802 -252966 -97689 1390 225388 6424 103136 -107935 -22421
20727 -75583 -4114 -137488 -14596 5183 158302 -276793 -121459 -9182 109457 -173697 154538
20715 -159074 106459 -134522 237639 158609 -13388 -275834 31645 312967 -158147 138110
20704 214542 23024 105480 -137963 -119563 132660 -34123 -257580 -56589 -498052 293043
20693 9802 -53622 24215 195292 -274292 83190 -53410 -47463 -409257 -456421 -289213 -198900
20682 -198900 -58591 132504 127643 219708 -148046 -97668 249826 -151856 -31028 53162 -67849
20670 -69660 -44923 -22581 -44384 -115279 -5431 -134033 35819 -19707 40770 290328 168760
20659 168760 -122357 -1723 242132 -198764 -170784 -218121 -283046 292091 102036 113460 -35570
20647 -105667 -29583 -70617 -38960 5759 212412 -186689 -148454 120024 -293307 99896 127388
20636 127388 -349750 272896 -142628 75505 -137486 -248369 -196032 -149532 -228500 -172802
20626 -172802 398755 -298566 -84400 88078 41851 -366173 -52976 -12636 -150628 37327 -406660
20614 91736 145326 -373808 -181664 -44792 -82621 -70439 -6392 48413 -217923 -96413 -329388
20603 -329388 -39481 347071 26463 -163613 -44193 10645 170230 -207841 -454759 6398 -23856
20591 -84127 -72056 -55193 48969 -285364 171676 198053 -109023 197519 216224 -43280 -177370
20580 -177370 264299 -195914 332055 19342 -52979 -139848 -173508 -167634 280785 -224449 27607
20568 21715 -77893 -172234 -143451 36326 -201098 -302640 -24091 240201 -43898 -159353 -257614
20557 -257614 -10927 -502017 57313 -99488 -140413 -33663 -24137 51906 7690 143270 -73967
20545 -198798 -5601 -54347 -95083 -330999 113496 48048 126078 250598 -100282 50888 -14283
20533 -152241 8481 -143492 -138419 -353166 -194700 -79892 -97715 -55720 6501 -11919 7033 -246927
20520 472367 -247000 -55208 243716 96232 -127262 -174979 235432 131654 -126321 -33492
20509 -108983 174205 -105891 -59176 -96591 -28851 -377039 -163741 35978 54056 163456
20499 163456 179364 -191741 71596 57496 71076 65494 6067 -59383 144079 -45347 110614
20487 -167293 -10142 184717 -59987 -177164 77170 287761 -118263 80739 -79087 -86917 -70479
20476 -70479 -62654 -421135 270366 -161376 -51851 265617 -33019 -104485 -118244 -228943 -136984
20465 -136984 -94837 137126 116822 277396 127259 -59338 -17660 206522 184739 -59762 -45040
20454 -45040 -96378 -375011 148318 93872 134732 134752 14475 -293308 321946 91538 -219462
20442 -113218 128336 -67314 86147 176505 9134 20073 -89655 -237998 206846 -361613 -356098
20431 -356098 148029 -41052 -209241 96236 -130898 99436 -71022 -153063 62440 79986 73748
20420 73748 -41944 52301 107384 -94439 169764 -277549 -184452 -285988 -30896 7998 -100981
20408 -255539 -201039 -295593 246912 96129 -239399 305202 -161909 -217284 -170556 -157496 20486
20396 19739 -511076 -135028 8565 -541980 122147 41759 75134 -293167 12303 260139 -253092
20384 75091 -280608 240369 -261968 -137995 37488 150742 -160964 -68437 -228590 -178823
20374 -178823 277948 -34859 84880 -16685 -86123 127916 -28460 -197088 180089 94679 -180994
20362 -303987 -201287 74212 21621 -89779 81022 -430283 -95730 -63311 181725 -140589 -144276
20351 -144276 164226 -131708 -43577 -75897 -289996 88654 -207064 -359249 -185628 3957
20340 146442 -907 -183062 89373 172848 228272 -277930 -81534 -371611 147980 -186169 -5070
20328 -35317 -245243 14960 -108143 69611 224203 -279260 -170640 116566 -442024 128352
20317 -88879 -197544 -355395 -27636 -51986 -46015 -47387 162539 193547 -101514 -45631 156393
20305 188275 -112782 85761 -42918 -189976 60676 186751 51843 102139 282188 109956
20294 159604 -98497 64713 184812 84224 -33292 -24922 163756 239238 -153789 -58625 -199346
20283 -199346 -188607 -138610 -8788 -26173 -435429 -23592 -127435 -237674 86648 -65267 63440
20271 9593 73069 -275994 151512 48283 -136164 50437 -88225 -7281 -39872 -160745 -216887
20260 -216887 -144566 22411 -146211 106801 -414128 -260024 58022 -60237 151939 -214535
20249 41976 -35431 -118624 119265 51324 -83323 -167877 -255035 -175074 136689 -377299 50062
20237 -194894 2483 389596 -100633 -54096 -65004 111844 108784 22315 9017 -95698 -131484
20226 -131484 5358 -106379 -193396 44819 -232577 -160601 -218264 -21597 -169731 154606 -200240
20214 -153462 23985 -38736 -16714 -96611 -47623 -55985 23561 -331860 -126189 79570 -144746
20202 174174 -312485 25114 99994 -191503 88311 -116038 -84982 -286765 -379674 -288524 55049
20190 -138660 7727 -312462 -96458 -160713 -54196 -130873 84687 -185330 -138196 -184446 123991
20178 -108852 255386 -50522 -105175 151578 -388753 28485 -95970 94983 99419 -27145 70660
20166 -375938 120744 -37084 -161157 -121769 -4715 -164094 -92173 107567 -292098 -179783
20156 -179783 -390733 -199869 233968 -57114 -336527 174868 -54070 39280 64592 -35904
20145 -76174 -212908 -13838 349448 261223 389994 48184 -59332 -90632 -101983 201822 -49284
20133 133376 -639 -9441 159417 -246693 177072 55435 -184930 -112363 -1425 -146230 35457
20121 -152869 -39219 -42224 34654 -26977 433705 -39456 -206841 -135810 -74314 -74595 -81271 -132499
20109 -132499 3610 -70621 -61390 35732 -388426 -23541 203603 1632 -245679 102915 -141705
20097 -192691 143782 -142112 184485 -183741 -67832 44147 -66674 -261478 -174707 9601 -174206
20085 -26172 -127942 71140 -180038 -181121 -400307 -37585 -218377 101956 -190398 -481074
20075 -481074 35675 244552 -164397 25364 -67818 117657 272051 -349582 -5923 -114015
20065 -114015 -163360 206448 -117517 99356 88426 -57247 19982 -83252 -320369 66328 23686
20053 135674 -11938 -222650 -240668 67610 -92612 -248390 10221 -16320 55309 -89677 122744
20041 -80924 -111813 -57345 217023 -130866 -49521 -129296 -106072 9340 -202448 -140859 -180030
20030 -180030 -348047 -61158 -246731 -153097 -441197 -130643 -236457 106036 53261 60765
20020 60765 -105041 189957 -92273 -3257 -234613 175597 -165846 -333504 -36032 63963 -94088
20008 -59589 -141976 137916 88971 -72727 31299 -171307 207075 8924 -126241 100861 -41836
19996 -90193 155317 -141927 148841 -60716 -189106 329897 -101192 -155657 6143 133355
19986 133355 -84397 -34782 12079 -24168 -149326 39487 -74990 -397834 -111660 -346846 404103
19974 101260 -133728 -188524 77540 74389 -266219 4732 1642 -72232 -181238 -167786 -180711
19963 -180711 45022 -273977 -30183 61121 -90776 -241947 -30961 -224867 -183199 -16176 -158818
19952 -158818 304976 -131472 -145820 -195422 -221015 109535 68144 -300422 -215257 -94477 -164853
19941 -164853 36642 -95312 97050 -51630 -195365 120008 136027 52332 -213608 -330815 6359
19929 -62800 -8542 -85488 112264 -245353 -118311 252513 -119521 -168264 -62199 -74587 -182097
19918 -182097 -91657 216086 96141 -125122 -19065 79119 -175160 18159 -91359 30145 -145268
19906 -175125 -22936 -8166 72719 128452 -226925 37364 -302860 17296 -54148 158715 -48188
19894 -147597 -303676 -230079 -85043 181929 -132560 150703 11738 -331341 118778 -356312
19883 -68669 116129 -104498 -72313 -185393 -4974 -388135 -20534 105914 -140329 -369553
19873 -369553 163668 -162546 147487 -189794 129595 88567 -173601 -188748 -2021 -25713
19863 -25713 -43677 34247 -248565 -14477 -91479 -126700 -305530 -50500 -90193 68347 -60795
19851 -343579 -170673 9572 105206 136472 -292484 -571223 -38758 121902 -52309 -410634 -152093
19839 11619 37653 -199622 283702 -175946 -114168 -99682 -5888 110827 -142997 -89811 -139883
19828 -139883 95843 85971 -55863 40407 -239189 -228977 -159099 901 6227 -328846 15089 103303
19816 103303 -91923 -32668 -15049 92854 -147306 -206844 -347810 -235960 8622 -111616 60064
19804 52134 -137320 -143523 -252390 -110365 179558 -88220 -198890 -118650 -80759 146357 -48464
19792 -296423 67353 -128591 -99831 -185913 -105018 -116964 -85048 196251 -49558 -117970 192054
19780 -77683 27083 181865 -359546 144170 -154431 -50241 -3716 -406088 36424 -161576 -472119
19769 -472119 51758 -479445 -127819 -153697 416625 181561 -136131 -159074 -129561 -224562
19759 -224562 -76650 -69438 182019 -251994 10536 -2812 -358005 -114827 16834 -95534 93342
19747 19265 -40400 -13727 -232692 314686 244000 -140737 -106566 137927 -264706 -18036 91327
19735 -216041 -32457 -72028 -94821 -183479 -241299 -37378 264553 106324 223595 -61169 124684
19723 355447 28704 -86237 130219 279033 -216422 139100 104316 28735 268068 275692 99148
19711 -200531 -40665 10588 98087 -170034 -180045 45948 -119026 144199 1816 35082 -239342
19699 -314508 27414 -70483 -100453 77878 200994 -181805 139102 -163358 244576 17615
19688 -261609 -49429 -85933 -117750 -8333 33974 227253 -76656 28023 58992 44570 -68896
19676 -147268 -221075 -116964 -491523 -341072 -253597 102710 68081 -199062 -484136 158499
19665 28232 -167262 67418 37434 27704 198048 87122 -246615 -153329 -194449 -123842 -252292
19654 -252292 92811 -1174 -75898 -179080 -151567 -202471 167246 5297 -50403 -360150 -231702
19643 -231702 -185382 -121846 -50993 205709 276543 50527 61479 26461 242739 11855 -45645
19631 87901 -22372 97423 -414889 -281640 297287 166120 55603 134564 -152511 -231130 57029
19619 113464 -5676 -234847 -133663 151132 32653 300964 -237705 55450 -241903 -133869
19609 -133869 63210 -123473 -3867 -202133 -176520 113534 -185325 123100 89036 -149166
19598 160506 111128 -208694 -188575 -39813 -12649 89701 -356843 -132680 -81431 -125298 -204634
19587 -204634 -1405 -191543 73142 -171885 -163374 -194812 -107246 306281 74757 -42844 33136
19575 -75634 -338599 -199228 83012 335371 -197098 -327914 -84803 -253900 -391699 -154662
19564 -319946 -34445 -435955 -197172 -390176 -433943 -271448 -288643 26502 -313760 86828
19553 -476151 -110410 -223673 72784 -390801 24035 -124374 266943 -43244 -87219 68587
19542 134819 296674 -324815 -117957 47674 48639 -107192 -95587 -48497 262532 -167815 -102227
19531 -102227 -210403 -69377 -350544 -43893 29817 -197327 -384877 103884 45277 -291463
19520 39513 -206275 102089 -234422 -30380 125924 112893 31199 -196546 -45090 167537
19509 -573567 221158 -187491 161765 -136571 -81036 92205 -65397 -121683 -237736 -305560
19499 -305560 94518 -165457 -226822 -164144 -114419 -205779 -267638 14216 88835 151873 33306
19487 -53849 -145342 266588 -148541 1626 -71446 151861 5861 25620 -108631 -36433 154149
19475 144291 56604 277 -259062 -341546 -9983 -90716 37688 26209 78841 107706 -55829 -83583
19463 -83583 -65631 74247 11560 342598 150190 -256467 -207210 -45597 20901 11751 -338750
19451 -122291 -17892 45749 168014 -77644 -196754 13358 29032 -82771 -267060 -37036 53449
19439 -114936 272843 -34237 31471 313204 -73979 -180919 -291647 -129569 266091 -145834
19428 97787 63156 -450026 136081 277031 84057 -270692 178631 -89695 -253347 -94395
19417 21633 -129248 -446501 195329 -100089 69869 -319133 68907 -53356 296968 59930
19406 -284903 -15183 -64165 -51010 43037 -35594 37592 63676 179459 68715 -236097 121027
19394 55530 -21942 266751 -147899 53959 -292175 -31541 48947 -103319 52057 68293 -168753
19382 -228746 -153799 -93276 -81188 -50261 -178689 -29877 -41823 206611 -74805 -16582 -154982
19371 -154982 -113685 -363291 -53201 46669 7788 -136786 38880 125920 108946 -103419 -60694
19360 -60694 31556 -134808 -178856 -204455 -171440 -106885 -225913 78837 -44618 231593 -127874
19348 -167874 126132 34777 -360254 -252177 -67579 -20069 -17626 -566141 154436 253076 -119021
19336 -348329 17710 56772 -137272 182677 -78727 104213 -162593 -138180 -164243 -9150 -53116
19325 -53116 -417884 811 26847 83954 166551 -141614 -91327 -207892 -122531 -200021 -134189
19314 -134189 -285880 25967 -253941 -165998 -169113 22968 66670 -175528 194228 -220092 64114
19302 -112425 3800 173972 -82385 -97042 -168376 229362 146224 -74264 58307 -318442 -640
19290 -155418 7459 105709 -203643 165003 -147457 -297379 116747 -91182 -53180 391991
19279 101058 -300982 -36042 -51456 142873 -206381 24660 -128145 -92645 -548008 159350
19268 153754 -236694 -698350 22424 -118228 -253666 -441409 238328 -222364 384 105086
19258 105086 -359615 -58634 -241006 122312 -82572 194773 -698 -289751 -114754 -403232
19248 -403232 -270651 -21366 -122992 256561 -60250 -22553 54507 245827 79561 138114 -96809
19236 -235722 -174672 -207658 -54400 324875 -16213 30500 -40981 -375152 -41976 -316973 -167971
19225 -167971 2346 -74530 -137341 92168 -133479 -18220 -64685 51806 33947 -399627 -51144
19213 118071 -149736 26934 -252097 -229635 108078 -240427 69130 -223323 113189 -274 -228244
19202 -228244 -187520 82758 -51490 50222 -60514 -220019 -46730 -141308 -29711 139485 119630
19191 119630 -127146 175403 -273935 -288146 -20043 -23880 -212925 -196493 -138579 35149 -52445
19179 -2038 -48836 -175023 -82694 145739 -78840 -150749 9844 239950 -118397 -296218 199498
19167 -135793 -331184 -141085 -165766 -345855 124238 -154915 -1597 -119350 -275403 50935
19156 -34693 357785 -263342 -43932 33123 112707 85866 -303286 -64850 -95956 57802 -68984
19144 -325581 -76787 388440 -44666 -200096 -83580 -17993 27504 -605773 210950 -469682
19133 58453 -217581 -367314 75393 -84044 190063 -304281 -206714 307245 76200 -228719
19122 -51830 55375 41693 -275074 -23740 -93842 72044 235136 121123 -104827 -8990 -40826
19111 -40826 -144156 354168 121270 21670 -44791 -94514 752 -48178 -275899 -79997 -52378
19100 -52378 -208274 -346965 71048 -86931 -236062 312176 -62588 112699 294703 -91827
19089 -251480 -174999 361542 6851 151930 -382457 -48571 -113908 -86767 -12610 -15345 -397515
19078 -397515 28823 -161443 -152679 -43138 48938 -301649 -45517 -202973 17270 -62519 72156
19066 75611 -85428 -76555 52135 -379810 -296772 10601 94870 -119048 -103976 -45707 189105
19054 650 73202 -492711 13883 -3598 -38809 -192873 111683 -16734 -198207 -74415 -230428
19043 -230428 75220 -254613 -348792 -7713 79602 -212131 -124531 212489 -4376 1587 -14056
19031 301814 88367 290703 -21721 82411 -60429 -72022 169864 135854 130312 -124029 125731
19019 100195 -27626 114650 -94469 -28226 -288241 -119476 -232113 -21318 -254148 -244622 -110714
19007 -241317 100241 52758 -204187 -56920 -56029 68610 120883 -139777 79665 170109 -26005
18995 16248 -84511 -179159 172786 -20151 -14216 29165 101332 -132335 170491 384174 50023
18983 72326 -378728 -91288 -254031 -18325 54388 -69136 -43849 -230978 235078 18501 255965
18972 255965 -39534 -33904 492458 69721 23951 -267544 87507 -91214 -272401 -83996 32453
18960 -126910 58211 106704 -63061 -174181 -157419 7145 46623 -16189 -297869 -72153 332443
18948 -3396 281993 245794 -2397 -212870 35698 -205072 -203698 167679 -122787 -300451 14700
18936 -46387 -137346 -136071 -123815 -190452 -570332 167157 -102972 -37099 -241275 -89859 -31756
18924 94052 -29576 3635 216606 -324702 -149372 -42244 76890 -93537 3790 -295223 -52415
18912 -283557 37885 313058 -378452 -243222 -223514 125030 -250451 9804 121612 -275362
18901 -47436 -57547 7922 -39777 -132645 -139239 149142 -141157 -30388 -90270 248767 -189021
18889 136832 30244 -30731 109755 -104133 -179215 -153995 -304645 -278448 -270777 -226617 8368
18877 -137430 158100 -131688 -95561 -203189 217481 -8848 161413 -225159 171981 -232811
18866 -866 63960 120043 209557 -115787 -312804 19773 -155116 -108679 150124 -42364 225679
18854 -143344 -135581 -78295 -205683 -77610 -113830 -101089 379483 -186899 162226 -109964 -57474
18843 -57474 -185208 175230 227137 196785 -131364 -55613 41872 -186180 -12972 -48420 37547
18831 145358 -123902 9721 -225308 -218870 60865 23695 164945 179138 331950 -102374 116102
18819 -8976 104055 -134103 77995 183195 -50032 100808 36022 249476 162109 -124623 10641
18807 124020 359683 -155176 202600 -109209 49487 -286927 21394 165378 230442 -178370
18796 420 -76948 -74483 167467 -204108 149497 -132023 -5568 -116369 361213 311448 212723
18785 212723 -23227 60137 -173310 155281 -256843 306449 198664 52479 -164342 -20995
18774 -222798 7007 85504 -356181 38333 132548 -126389 -40622 -68225 304070 -174574 -32059
18762 32966 -82976 37552 -185533 -93138 289855 21483 8041 246040 82873 -38253 70429
18750 -135057 266339 -366322 -48853 -20416 -118870 -1534 -127844 -83411 -236996 256719 -117623
18738 -184749 -369883 75348 -174583 -176837 50535 -176155 50912 -105862 -106520 89709 122859
18727 122859 -242193 200498 -362701 -222161 -199014 27322 -276229 41337 127178 216096
18717 216096 -106430 -297037 123912 33707 349230 69970 26702 -123875 -20079 -284917
18707 -284917 -105164 23971 -387189 61353 18942 -12844 359567 -212252 5435 159268 -2811
18695 -76879 -113235 112012 -82422 -64975 -174546 -2981 -145589 -156084 -134417 173831 -181757
18683 -225870 -69997 14216 -183473 -91711 -168072 -201669 106364 -231883 19192 -152106 -360870
18672 -360870 -4646 -113577 249580 113869 -188286 -14167 -115233 9758 -222720 -239407 -178390
18661 -178390 -186205 -282885 -58742 -113095 46779 77904 47278 -36804 113301 -80928 161675
18649 239213 -91198 147134 95363 221093 -134833 -57352 50725 18083 79294 -126307 -176495
18638 -176495 -241864 -132496 -18596 9158 -86668 -86092 354255 95676 173135 -85627 27388 139459
18626 139459 -34426 169194 -153837 127244 226730 285942 17045 -27909 -112331 -288038 -242331
18615 -242331 28377 -126219 -409411 -447697 -63632 -1608 -312707 -15088 54693 -279077 5756
18603 54447 -278223 248191 216140 -267864 -39157 -38649 -70324 -239199 -135441 -159812 70329
18591 -74059 -196403 71439 -119519 -64053 -371249 -484546 -282012 -202906 -155713 -376445
18581 -376445 148351 1970 -35560 -167866 -263398 -13796 93387 -55962 -133490 -94139 105143
18569 -117963 -245010 138221 -235074 -145923 -61483 -112004 130042 88360 -117191 -13756
18558 -242113 -161667 29478 -35852 136903 -317491 -258858 -192167 128095 -62611 290209 263936
18547 263936 135069 -349299 -84144 150224 -151103 -53309 -188014 97668 44759 -31411
18536 125017 -164348 -119267 144264 179141 -462156 -363937 224742 -122379 -47125 -39754 -105052
18525 -105052 -378279 -24410 -80054 -39590 17370 38117 -128834 193062 244100 170779 239091
18514 239091 -187143 -53835 -21532 48525 28779 -141555 158605 287218 -294453 -173508
18504 -173508 92407 -98581 -156360 139872 -151070 -44100 27865 -53808 -38792 167111 -113275
18492 32471 240504 -103956 -119121 -100734 314988 -33496 -155680 -41164 51070 -272926 -378964
18481 -378964 -214358 -1242 -208277 -94601 203690 193098 -86019 -168558 66925 279330 -48294
18469 -14019 44797 309448 47436 -261566 69144 -233278 41510 289226 -55950 193674 -60437
18457 -211915 -143517 -91974 -203240 -13273 154201 -92333 -99505 -196235 257124 87908 33319
18445 -297303 42481 -205768 -307677 123995 -92365 -300075 -471862 -44265 -156853 -178712
18435 -178712 -384854 26467 -294531 -107611 -157131 15644 -28350 -110714 -146178 -14089 178974
18423 242895 -179907 -246183 -34387 -255055 -35553 -46504 78941 36841 214647 39697 -37865
18411 -217607 252790 -153870 121025 -29819 362193 -14566 127529 -207405 31552 41497
18401 41497 116809 -222750 -189715 73006 -26989 106800 -124757 45632 -17018 -552934 298430
18389 -98468 -47624 -201194 205928 59774 119301 -12672 -79493 131979 -220854 -87983 -173331
18378 -173331 -132728 70336 -257845 -193554 -236324 -45764 -9179 -42189 27439 -68733 156651
18366 223160 -188033 26504 122968 51076 -110617 136256 213986 -515462 38190 -13292 74370
18354 149224 -249577 34168 255931 -268262 -44275 -150714 55192 6582 -260615 265411
18343 61071 182580 200125 135843 10426 154990 -248414 233491 151059 -67396 -20067 7132
18331 20509 233380 116731 -106325 -59696 -177830 -85844 210892 184005 -85218 -55086 -109253
18320 -109253 -157415 2390 -374843 -73855 -8615 53130 -137031 -192709 -46587 159053 196542
18309 196542 -226986 62082 384278 -218151 -144199 -159407 -113941 -298268 130078 -171798
18298 -183011 -98670 -133254 8817 131322 30799 -341449 -421918 -208696 -308588 204312 152752
18287 152752 -124640 -255240 -111970 -129820 158635 -600771 26866 -366670 -144080 -156336
18277 -156336 -184278 -116388 -72151 -113932 21272 -165880 98640 200898 -62278 -272549 140804
18265 247368 79124 161812 -26636 -309583 -14812 -19852 -119529 -161253 -149990 256624 52815
18253 -141297 -210371 -283295 -184201 -42806 -17796 72911 -124754 175359 -298996 93258 -96217
18241 171186 57883 81966 -4760 -44527 -115959 -328475 -275666 -126606 180612 -74406 217698
18229 -577 -344137 -138187 -75104 353402 100853 66837 -123581 -118234 -325001 -78517 -131448
18218 -131448 -15039 -201030 57376 52276 -161369 169955 -204952 101149 160908 356451
18208 356451 124065 -175843 -197504 182309 -87695 92643 -187485 -35819 315 3789 3204 -121338
18195 25290 126601 -110175 101085 -278347 -165894 287970 267614 -87594 318970 -85142
18184 -106358 68363 -45687 -98763 -251175 -316208 -78116 16252 236457 80511 -74509 -230757
18173 -230757 -2906 99568 -144174 -54777 -526828 -65006 37506 -112172 -101114 -269805 -66704
18161 -261563 -209902 -285304 -71010 -16528 152573 34187 -98720 -147518 -54943 158524 90584
18150 90584 123706 -214316 5755 -131165 67085 -278107 6397 -197119 -68420 10198 -42668
18138 -314914 194130 -38008 -116665 16141 51093 19149 -78941 -213660 -15887 -155858 -98331
18127 -98331 205669 -193670 -206061 -176288 166566 28911 -402878 -73342 -22921 -481833 -66155
18115 31241 -34774 146670 -27196 23868 -117 235741 -114256 -228534 -135531 -320355 -257419
18104 -257419 -183980 150562 317446 -38217 275059 88238 259620 115024 -349882 -225605
18094 -225605 -213046 -133090 551 -203930 6849 -112552 20355 -213444 146961 88129 15323
18082 -14170 1442 -113843 167754 158463 39518 -69833 -189060 94596 -330198 -93597 254231
18070 -32872 84072 53175 81419 -49928 126184 96687 -110863 37729 -188995 3310 -278955
18058 -345047 -257973 -72958 -7596 -164989 32179 388028 32382 -201578 -197299 -556097 58684
18046 59727 -10786 -5980 200064 -182935 -103741 351971 -65430 212766 -35454 128581 -11423
18034 -137756 -197524 -76602 119044 163133 -370782 4401 -152073 66481 -25595 -146443 -231456
18023 -231456 -14470 -191642 -444687 -65820 118419 95548 -541506 58882 151764 -8668 90866
18011 -352086 130836 105904 -201960 39217 103127 71379 7251 186602 -284523 79185 29498
17999 22745 -147286 -12204 -175587 158517 336766 -77240 358689 47997 -116665 65898
17988 67921 -2221 189991 179420 -242925 -132661 90665 63861 -120294 189221 65022 -10826
17976 -166242 -13557 -75258 -270029 95418 256732 25397 -138968 -291584 -48603 187269
17965 -121609 -468681 109487 -135390 -96691 -91347 -248036 -60348 120477 -279704 74674
17954 -89071 69729 -58518 -104786 -191341 52222 266133 -205609 138534 -192738 -213269 -95674
17942 55351 172291 168339 95290 -212213 192369 25261 29442 -95541 -13336 -219301 142043
17930 64509 -115691 -19314 -333783 24491 104826 -58208 -199552 15576 -115622 -58498 230329
17918 313659 -63978 -45141 -212660 -234852 -246888 -70069 138109 147593 -213116 76400 170313
17907 170313 17338 -295768 -172228 250512 -193229 -277263 10586 -71652 22841 144509
17897 144509 105871 20412 167715 -27765 112516 -168379 -53600 686 -100585 -223249 -161233
17886 -161233 30117 -67458 -124452 -429347 -145778 -206359 -266007 35245 49350 -5870 -457948
17875 -457948 -183276 37472 -55174 -211171 134262 -223308 -99383 -211463 -34109 69963
17864 -157680 -60272 -162915 -28912 20592 -6903 -339611 7553 -38792 130506 8162 -38789
17852 -235162 -189919 66600 -109386 -330294 -61598 -146112 212192 -300333 8142 53712 -93091
17840 -140361 -327638 -174061 -100277 -159822 -147221 -248250 46049 -227421 35443 -155102
17829 -275491 -152400 -96853 99694 109760 -94579 70261 -376757 52266 -175303 74200 -92367
17817 112226 -111427 -38681 65974 103923 -31883 -102303 -373276 451396 209900 73514 3453
17805 31028 -154717 -113891 76639 95402 111414 -428619 -267908 -68584 169284 32692 -85931
17793 -4430 -93010 -367033 70979 46812 50729 -120809 33068 200579 136022 -161004 -150498
17782 -150498 129748 221112 -131503 116753 -277353 -59168 -127656 233794 101573 68718
17772 68718 202382 -144664 59348 -122806 95859 293710 192913 28954 -161903 -432268
17762 -432268 277183 115762 -35000 -259845 249256 -45252 -146108 198478 -149246 240574
17751 277209 298486 -267165 401294 -93401 -12356 47159 -386868 115625 241780 -110173
17740 129755 359854 23094 -103375 32718 -61226 -5485 169819 8940 -224839 -114362 39774
17728 31528 90123 -62296 -56167 -96686 -85260 -23598 180767 206076 273762 124932 179364
17717 179364 -321760 139765 43679 149584 -30490 17792 -220202 -30744 -108217 280309
17706 -16279 196574 -107010 -81421 -358388 -193368 313736 -180599 204415 28236 -85429
17695 -173327 83998 85029 235532 105973 159177 38284 -60174 -4536 -100619 19467 122511
17684 122511 2115 97572 115815 -16340 16537 224444 -132210 -228146 -88258 10446 -343682
17672 -255810 -93345 103880 -95319 316129 -46298 -91624 -26930 231800 110088 -226814
17661 -154888 64274 -168603 -254705 -211178 43283 -35180 -108905 -262658 -107939 -185530 38161
17649 103429 -400076 229563 -230734 -108006 -94867 -78213 -28283 7607 -11338 118639 86082
17638 86082 99073 157472 215773 150881 28094 44885 384943 -305276 -155245 59434 145474
17627 145474 -106308 -13865 105437 -77218 233686 -37051 -252830 72349 -6503 21909 -94368
17615 141657 -332592 -26808 -202454 36962 203890 -189903 259290 222486 -130634 171198
17604 211150 -282086 91634 -6050 -78099 76034 26367 125708 248526 187371 62463 158568
17593 158568 -16790 -20460 578474 263449 -21288 -24374 -86359 168535 56355 551288 -73694
17581 240315 -108299 245940 165731 144809 -6321 80591 -6177 86934 -124699 35163 47592
17570 47592 -121322 19254 180208 99757 255550 -34187 -12197 71058 -75327 217261 -59584
17558 -120301 -244863 188649 157622 31504 315274 207028 24746 115750 -4844 154868 -8683
17546 345188 49615 -5248 193383 117473 117144 56544 98160 409951 47624 -299502 31444
17534 257734 -79258 135379 320633 -37689 -159379 303422 12440 -333224 8606 126364
17524 126364 -177260 133566 215193 31224 32013 236863 -125663 350885 346760 401735 -102650
17512 -150141 199185 70617 126885 -247678 -271096 -24376 57923 -219807 200231 200625 229620
17501 229620 -3491 60729 123920 -212949 115134 298124 13494 -132505 -455563 -11396 -48582
17490 -48582 90396 -25682 352 253924 -102481 229773 44277 -5844 230263 -87752 -79074 226330
17477 107929 203017 148324 22491 499858 -9197 369399 14565 389366 168509 123891 169694
17466 169694 120079 142282 36070 165693 132615 165083 293257 266982 -49518 23372 181719
17455 181719 192590 253771 -139754 -99761 358944 277208 322306 31711 157042 410998 415227
17444 415227 64834 10798 91168 -147 335251 228386 406603 248495 127819 -22441 356608
17432 11120 457392 286115 294684 -232525 350416 219757 283645 -132862 415357 189260
17421 390926 -71234 320000 306725 363313 189699 55141 241404 261457 60703 214632 -15224
17409 182775 52827 344172 23589 190202 313528 389295 -35903 499475 398019 238407
17399 238407 -58080 46610 38109 55011 -205724 18361 94251 293010 183314 397613 345252
17388 345252 211804 294544 -103283 73287 318008 -274923 -114305 194674 -161034 194260
17377 247726 241925 180807 -61670 21621 255118 129161 195932 241490 -4592 118846 271211
17366 271211 34747 251788 -115536 161075 51363 64130 99198 310215 -22170 119646
17355 -160726 175176 -123548 306494 -14585 -42257 274379 212163 43247 246470 199381
17345 199381 257848 -1372 461949 169391 -10829 401092 -107341 343587 279067 318900 126957
17333 345228 167549 269332 208657 259308 192003 -140107 -209283 212382 -151398 78795
17322 59996 422797 329711 45790 178845 558249 -99938 170389 114437 323344 86486 85331
17311 85331 93818 -83183 100506 223418 -239931 151560 219858 411867 23854 25851 143255
17300 143255 278419 380263 -158571 259159 -63509 70542 -19021 131954 209065 232311
17290 232311 85896 149187 27215 178983 125962 214650 117061 317668 -4979 124389 159932
17279 159932 232508 107053 -57793 259972 -13177 320949 70302 102761 253313 190296 337538
17268 337538 198094 141259 100654 184713 350900 -68152 -89255 102347 57338 79022 67767
17257 67767 -15673 233149 60444 538749 325237 36075 264409 -61323 112049 226326
17247 226326 416775 -69327 272431 432026 114013 137425 191390 235143 109995 139786
17237 139786 248959 235723 -242331 208709 152277 -122836 653931 314093 361782 53514
17226 600134 208989 134751 427830 262410 101853 114742 173744 168594 -3323 480457 261778
17215 261778 41814 496487 -156395 245099 353261 141438 129140 232235 -36915 -91069
17205 -91069 22625 -130945 275122 111357 217325 337039 403711 -2703 120526 52290 292143
17194 292143 33837 378494 184348 511783 237431 77042 153837 277464 89393 195028
17184 195028 340933 180657 39110 270188 118306 462101 150569 204624 16287 288162
17174 288162 149915 436916 155332 160499 439048 170584 9731 477086 206419 413169
17164 413169 173434 126794 -12651 288309 276747 368430 106411 338805 420616 -97165 397958
17152 192320 148970 533941 263171 531289 113828 544668 477628 273719 585186 319937
17142 319937 383439 509427 536768 133593 609380 418605 397290 396288 85960 -62272 319510
17130 701341 253923 390832 383420 403602 394272 315133 439369 146058 49788 -60230 271105
17118 346531 99177 75648 268885 256272 302427 352215 5833 -3384 -3978 159596 531430 608724
17106 608724 300933 218007 371576 369593 523795 404798 179629 503760 231324 348574
17096 348574 101431 372930 539310 467351 156959 744707 556425 328020 389352 335527
17086 335527 525946 437185 136855 401266 375426 423331 455643 446117 575926 292613 38744
17074 427288 684492 419502 475132 255146 425302 541849 498583 307815 586428 359275
17064 359275 311915 286999 503263 396996 292461 442241 470240 398075 604701 686060
17054 686060 521513 248561 688969 863385 396009 571047 800135 539953 706365 149747
17043 335613 618648 660695 656957 524011 535813 571823 742459 687657 687810 495577 346171
17032 346171 651014 810712 594642 529395 912175 728825 375121 578376 548264 312756
17022 312756 575853 556906 479433 728934 814404 451776 693841 742033 338244 582100
17012 582100 576672 547055 358555 783605 737580 828940 677827 388076 744059 684512 365502
17001 365502 526498 626922 690839 976366 684035 795805 316424 364253 936965 706044
16991 706044 718992 792458 877189 704110 626899 489560 493640 895043 979366 767524 973437
16980 973437 652062 926912 746400 569822 789418 890613 1083564 903456 664333 949079
16970 949079 776400 1048153 928686 748329 691785 758239 984628 998171 930610 822350
16960 822350 885554 1061813 973991 1194829 973266 938975 947957 959705 969600 984338 722366
16949 722366 705268 1077976 905537 1106743 1117037 797227 999041 1146065 928140 1421872
16939 1421872 1348055 1288820 1162831 1226812 1194113 1316484 1160710 1126129 1189453 1428651
16929 1428651 1430453 1503895 1294008 1116281 1154475 1149757 1293767 1299929 1490085 1124159 1386362
16918 1386362 1542698 1328009 1193931 1436376 1623089 1657249 1443695 1359037 1642385 1857537
16908 1857537 1270817 1611133 1677352 1467062 1614683 1386904 1519402 1749041 1664502 1743882
16898 1743882 1927040 2034231 1680472 1699101 1554147 2006697 1767901 1967259 1882319 1954242
16888 1954242 1863272 2387042 2109731 1827688 1897533 2481295 2014975 2020645 2299755 2006470
16878 2006470 2194615 2599301 2335417 2481282 2337929 2195240 2385733 2467238 2468547 2689611
16868 2689611 2378841 2441179 2492105 2933652 2914726 2737043 2851731 2793275 2883858 2942709
16858 2942709 3030666 3026511 2940344 3148492 3088313 2945820 3374789 3459168 3440034 3085832 3535637
16847 3535637 3342620 3377172 3712974 3834771 3622654 3713492 3537984 3944664 4000770 4106499
16837 4106499 3964239 4018428 4448668 4367258 4344943 4461264 4458629 4604730 4966279 4681484
16827 4681484 4713141 4964039 4741546 5533686 5466202 5388192 5426518 5384468 5607798 6061926
16817 6061926 5911536 6170362 5960614 6034248 6552821 6633223 6766478 6912839 6905690 6941111
16807 6941111 7315884 7621002 7736382 7976295 8442223 8191015 8260920 8619714 8728638 9167399
16797 9167399 9203298 9416162 9451929 9716080 10137876 10023071 10566206 10579304 11195413 11380819
16787 11380819 11577391 12232303 12222500 12851237 13110394 13429318 13732927 14322187 14542687 15205948
16777 15205948 15375219 15948340 16506405 17668092 17753084 18424246 19250650 19327951 20294364
16768 20294364 21203421 22148071 22634189 23477627 24206377 25663609 26467759 27181442 28495788
16759 28495788 29139084 30591142 32013208 33695990 35241145 36627761 38293812 39661785
16751 39661785 42260262 43843800 46110409 48152388 50728631 53395390 55995544 59097923
16743 59097923 62336165 65328341 69112212 72884397 76903012 81278404 85640203 90786241
16735 90786241 95929075 101481223 106623184 113034094 119034611 125193113 131961145 138303546
16727 138303546 144715843 151493338 157726190 163373722 168720204 173341874 177316201 180594486
16719 180594486 182583673 183678693 183523128 182474183 180566861 177197811 172969160 168179680
16711 168179680 162574565 156854588 150340756 143353039 136656946 129922019 123240657 116414629
16703 116414629 110343957 103955788 98256188 92574973 87126170 82646843 77952475 73742972
16695 73742972 69195392 65904002 62143920 58674410 55720468 52893331 50513170 47479460
16687 47479460 45107789 43041056 41064263 39466884 37220937 35481155 33921022 32664266
16679 32664266 31114940 29921378 28498054 27521657 26103263 25394229 24176047 23206528
16671 23206528 22801027 21564522 20607147 19963890 19467601 18639497 18146879 17440973 16595609
16662 16595609 16239475 15708532 15407199 14647378 13892787 13570822 13521244 13020322 12318108
16653 12318108 12110043 11957813 11672073 11070049 10836669 10822769 10001362 10152249 9552244
16644 9552244 9468489 9366973 8966176 8624347 8657227 8005977 8063302 7973183 7558421 7728878
16634 7728878 7263751 7295259 6938013 6677491 6358466 6626882 6359245 6190029 5867194 5888301
16624 5888301 5764262 5871199 5849616 5492743 5445797 5206418 5042947 5359306 4675007 4924370
16614 4924370 4662895 4588904 4392331 4473322 4010897 4413062 4196426 4347367 3948957 3893646
16604 3893646 3902962 3942990 3930335 3741602 3631370 3440579 3322949 3695868 3493422 3522227
16594 3522227 3402186 3281985 3369308 3302996 3012849 3065314 2946563 3075601 2984458 3183596
16584 3183596 2681290 2957516 2993693 2609443 2606160 2568634 2562806 2636205 2613109 2465488 2333602
16573 2333602 2296583 2320254 2286679 2402618 2477559 2220554 2533391 2389183 2153201 2083722
16563 2083722 1931766 1833400 1916977 2016988 2269456 2001264 1961167 2058740 1881079 1977451
16553 1977451 1872472 1716856 1766889 2070029 1953419 1600676 1853946 1749984 1660739 1872693
16543 1872693 1783491 1526128 1557301 1690235 1322175 1322951 1707221 1548293 1421873 1373031
16533 1373031 1672039 1273451 1415841 1233167 1752960 1309616 1452736 1419495 1631229 1549573
16523 1549573 1073920 1259382 1321330 1366626 1264800 1160411 1462276 1313770 1752892 1318355
16513 1318355 1090701 957025 1168631 1103134 1453649 1183243 1290939 980197 1230261 1378222
16503 1378222 995029 1304443 1265679 1157060 1193503 1136958 930033 1008053 884535 909944
16493 909944 830600 992209 909060 963820 928085 1135061 571324 860737 808267 1097679
16483 1097679 880444 1047115 1048933 812838 914440 810988 1024988 941971 705251 1023514
16473 1023514 406289 1036827 897072 853628 924576 620848 875161 672123 791753 611132
16463 611132 644486 887431 532420 647919 528485 455418 760427 925673 766796 994030
16453 994030 838888 413638 450499 662086 570403 729967 384249 619481 740119 316191
16442 650761 676873 691963 262556 557211 340993 418878 721285 529644 587540 756828
16432 756828 655472 311317 412313 467253 463412 667980 344826 627513 381209 456718
16422 456718 650917 765994 374373 300219 614943 741442 421111 300115 493694 257012
16412 257012 622711 464580 434114 493827 317006 581387 650540 196265 479923 408640
16402 408640 493237 384718 714310 444137 357200 442665 90443 229605 285550 502318
16392 502318 153759 433511 777130 280283 757686 176377 320839 486714 207443 310067
16382 310067 464804 330594 359975 469790 220183 457356 243642 194013 588532 443343
16372 443343 617027 396491 208717 299528 96397 189660 433353 42884 482986 421912
16362 421912 168188 112030 399534 291726 378747 242027 658141 204080 78633 161454
16352 161454 711649 234375 338165 -13694 162899 -48425 544870 298737 337632 214884
16342 214884 314067 195486 301360 265644 415295 449612 164197 -2205 -23464 320367 293142
16331 293142 314227 133661 204055 -48506 180444 78815 505913 477759 132794 240760
16321 240760 166637 245903 264027 153820 198895 368409 -317060 336398 136409 135953 -361924
16309 382510 254629 362002 -75726 236216 85702 396073 126930 204317 89378 345695
16299 345695 423842 499391 389247 284356 403603 301726 161242 269891 420609 217115
16289 217115 155267 348217 195470 -158999 409287 -84874 483239 -125224 145498 398918
16279 398918 198312 302951 141835 391372 461960 436884 256115 -279231 241656 359708
16269 359708 70222 263804 49303 142559 356951 143348 384892 13937 117449 -18457
16258 67909 236051 292230 146582 245618 109447 311285 386192 -23881 -112075 187779 136219
16247 136219 237077 263265 86304 282733 40447 37377 294116 28496 248494 -183659 23238
16235 200401 -32888 285558 34841 -34293 170128 367237 280865 224081 95842 149538 413556
16224 413556 164130 17607 -48305 124616 381809 92879 236219 20198 292101 36106
16213 252296 -65152 -45302 -171711 147565 -245507 156894 120713 -79282 -55498 104347
16202 37004 203998 293386 206526 5904 5427 -132560 263701 -46601 -70004 -29654 -119889 114432
16189 81801 333177 247456 19097 286954 94859 -54137 383733 113650 -52822 39483 -35053
16177 -75584 119632 178776 -382099 -45380 435609 310234 28622 259850 -291784 247868
16166 -120764 -48137 94181 27931 -8007 141193 17923 -109378 143729 259904 -10119 -87683
16155 -87683 -207619 102594 -103816 -91824 -44348 192706 95845 185134 -124958 157210
16144 -124351 56125 143695 11965 -42481 -23627 224471 83414 -43361 -129874 -316164 -36679
16132 -191716 230416 -118250 249670 184902 -28866 202632 -69905 202999 138992 -71528
16121 120199 -68508 71708 98542 -101686 -131980 77629 180980 -105836 -129992 -85135 50569
16109 231508 -42206 303805 -339344 -168648 262979 -57842 613178 173027 150759 350888
16099 350888 145146 -6653 -182012 19449 357470 112781 -251764 258720 -181994 -53774
16088 80038 209745 61422 50792 -127183 101329 184791 -21597 -20475 327580 -68885 8869
16076 54156 -69130 69835 -64184 145278 -8597 -376142 -233584 226408 -76135 -184118 -205710
16065 -205710 2597 -63329 -207582 -51571 46990 107708 -69695 60182 98558 -118062 -16657
16053 -6470 -56064 265715 -193665 29327 -70179 78932 -200598 -372858 92444 169081 243566
16042 243566 59776 -114938 50096 205212 14013 40126 363117 -54018 27544 -92267 -69552
16031 -69552 -19740 -21247 -182727 -230629 61129 236853 -30888 -30949 48946 142311 88903 -55147
16018 23054 125410 27704 163110 -103143 2602 407744 37139 -53866 165200 15608 179305
16007 179305 -105020 -192114 167881 -153564 169530 -2179 -81270 -442568 -34222 -114153 -342719
15996 -342719 -39991 -215957 -40628 45175 -94250 25131 169246 83301 -153666 181885 191007
15985 191007 77932 81505 149187 431118 17277 349511 125464 160845 -121381 218565 -144346
15973 -182101 -59156 -9148 -102724 -98128 -181918 90850 169440 -165272 -354049 -191047 -40073
15961 -13271 222670 -197042 -26884 -33939 -3753 226873 -200943 -340159 -302806 6192 13551
15950 13551 273576 -115789 -88769 -124079 25336 119933 -130810 -131129 190327 -160114 -90682
15939 -90682 -257170 219368 -38353 -183804 69019 -141091 -188186 -177967 10713 98614 -21400
15927 -186465 -199268 -88094 122587 -296414 173800 -218138 -19836 -126012 -152304 77818
15916 -78528 115356 -35592 -145606 146764 -12235 -115148 -265156 -116533 -303695 -43955
15905 -290574 161283 31261 45922 -77359 200906 50385 -145229 -168509 9924 37227 -124231
15893 -62395 -63645 97324 -43958 -138175 -17224 -80310 -40252 27631 -290891 -139245 262085
15881 -33758 -190030 -57980 73327 -73462 -341219 -191126 -198399 -135674 -60740 -125351 -57237
15869 213437 -100580 -78299 -142113 147281 114892 100281 103701 -13131 23426 -83222 -254355
15858 -254355 -140510 -180511 208452 146016 -109840 -141391 4493 73815 298237 147517 -3552
15846 229755 31978 136776 -286827 -239718 115919 -275550 -44160 227262 -206798 420945
15835 -145108 -47499 22540 410986 -265387 -136938 112468 57864 53573 373857 -11866 24845
15823 -471741 -157690 -15989 43884 21033 101564 -112231 196313 115424 -182524 40253 -458301
15811 42234 -293400 27161 -125054 -230728 -80502 -269351 -22240 -174246 155865 104171
15801 104171 -118832 -37696 -103443 -27270 -73180 57250 -197545 11037 -401606 105525 -57316
15789 200782 -73746 163998 90669 109767 -204174 -202882 -91081 -237190 -139944 -28600 80788
15777 23392 141595 -291359 -22219 -53563 -123026 231337 118659 -93801 21223 -125766 20524
15765 -66438 101234 -93447 268475 -132830 40773 -324526 -142124 -59986 293052 -174556
15754 35228 -4965 262186 48267 -195545 235062 -77205 197982 321153 59614 22887 -41289
15742 50388 171752 -322405 -491003 -118931 -178926 229690 -101090 21080 -17769 -117940
15732 -117940 86695 177910 170382 -73636 -146664 -27391 29298 -281012 -51466 -116589 53527
15720 -102300 -190117 173659 -157795 75498 124511 223927 -271359 -31231 268500 195985 -83983
15708 -184139 111661 5381 169316 144274 -192005 -199159 -84420 -279723 -78865 -231062 189580
15696 -29920 62490 260380 -36120 -126357 -178925 79858 50404 73898 -30882 -28202 -210988
15685 -210988 -182105 92481 -186443 -248716 -60263 14769 82536 -181034 -19744 99227 -132014
15673 381930 75418 -136387 157843 -86201 -185044 -19985 124752 112499 -123326 -226471
15663 -226471 -43488 -123525 134318 -162028 -151170 145104 171232 -30020 -117674 -231810 -73390
15651 11887 -170407 -487037 38955 -277966 10979 -255481 142185 -49332 38584 -116804
15640 162977 38429 -48410 18983 -46393 -123018 -84876 -4566 107412 15865 -67900 -222812
15629 -222812 -193767 -27735 154616 212436 121404 -142084 13435 21056 -297725 21245 141998
15618 141998 374291 136936 -144387 -155517 -276779 -103317 92374 -69513 -149625 125787
15607 77478 -252777 -47369 -42506 -164191 -204251 -44986 -289359 49781 -110562 -268396 64162
15595 302484 51025 -75675 192562 238101 -323748 67706 33507 79502 45333 -193616 -415701
15584 -415701 82077 47381 -17704 268976 -43997 230325 170597 272996 -132050 18895 154044
15573 154044 -146173 13300 101242 -508 108796 -57687 115991 187061 -385118 -152449 -2933
15561 -327798 204739 205822 10762 208115 -74631 -36105 -18195 93457 -195845 -6445 18421
15549 -320504 -310222 63177 237829 66484 -236763 -73428 60516 44705 -86156 -101962 -180877
15538 -180877 102667 -251576 144390 75829 -262862 104313 165558 16067 56330 61975 -618882
15526 -75383 -42210 -307253 184009 93355 -159281 162679 -66017 160262 52220 36857 290451
15515 290451 -241579 -29331 57155 193695 71560 211772 -65116 -144921 125344 139929 -32718
15503 159684 -130655 -76336 103719 -397466 334883 -421549 -17495 -214518 -155767 -143721
15493 -143721 104818 52708 -31460 100502 220151 -160795 -11592 466613 -154335 203088
15482 -278572 98975 277266 48437 -226137 22259 -62525 -160319 -109501 -112040 97328 189105
15471 189105 -171928 69484 100169 -40417 -148798 -66923 -179006 -14847 -26543 172101 75310
15459 174064 -272102 152578 -29282 124498 47979 -64225 -139113 37945 222396 -63116 -271638
15448 -271638 -11341 -148541 -158205 141664 -75575 -31853 288276 -176153 113174 215846
15438 215846 -33836 -276305 79648 -86058 298068 -43804 -90402 54373 -284808 94468 22886
15426 7974 39421 372389 26831 -145849 -75377 -279848 79855 -95684 14716 -115952 103047
15414 6756 193863 -168140 -85914 24228 -101701 -262899 221879 59907 21023 -199508 -74954
15402 -235898 -131912 50532 28326 -161565 -26270 -247312 -310652 -67884 -136362 -119435 192441
15390 124664 -182523 -28028 173173 138766 -79062 -153743 -409255 156000 -164769 -125914
15380 -125914 -323058 -165372 93172 47489 -100789 -9832 57215 185514 23361 151840 -234750
15368 250116 108961 -43576 -114007 38380 -96047 339268 -105363 59666 88270 -70071 -131933
15357 -131933 78488 -401385 303492 108609 -198498 -47945 38846 71355 287181 28374
15346 -199275 90679 46751 -211614 62380 -39284 -105208 -4080 101811 -234322 -32918 93675
15334 -152276 -73026 -229346 -263706 -81420 -227299 -121413 -184090 -165638 -90149 -8566 -65206
15323 -65206 -64539 -69122 -85240 61258 256674 44364 144536 197910 -99275 -11224 -137141 -21674
15310 -361406 -160900 120687 348 -349225 -138012 -111012 273796 -26366 -128034 -114105 217655
15298 -11529 118394 68680 55154 178064 181901 86543 160319 123055 254002 -78577 107000
15286 -9548 343209 101906 -148196 -66253 40373 19749 74467 -6068 124110 151685 -279111
15274 -117858 128647 59865 310727 -435508 110815 -70428 173770 -329399 136209 -133918
15263 -244452 207506 -273999 -3155 -55485 -257204 42891 152723 -6717 160236 261566 230567
15252 230567 94220 63228 299118 526001 1209909 1676414 775756 964867 607890 -1538
15241 228159 347347 20774 348701 214976 -84899 85314 237713 -170842 126325 -73661
15230 24905 38769 -68269 38484 -72481 24425 -149091 119427 55803 248528 -10136 -195636
15219 -195636 315463 35341 429007 207210 168646 -26455 -142193 -29284 95322 284927
15209 284927 141281 -320706 161808 40482 -234953 308589 222720 27643 107151 -55601
15198 -7873 -5907 2344 -9280 227674 7347 165698 -4001 -15563 -133773 54197 -281475 147330
15185 -326070 34827 388242 -35447 38351 298547 -85397 72142 9526 105175 237017 -117071
15173 318077 -107069 -6943 -117513 196234 125993 52298 135328 97981 320530 92766 120278
15162 120278 16778 160946 -35906 157647 130259 223972 -34832 338376 -100580 224455
15151 279192 241718 -180028 226371 -91317 -45696 -356581 349453 102757 35730 288085
15141 288085 -221669 113643 182014 -106239 -55098 170922 38334 -66024 315979 -22861
15130 -182250 -799 207720 -25035 184747 -238742 -200321 295778 28052 307783 201572 -91520
15118 -53583 185108 -225732 159699 149545 -136174 96831 110905 306584 -61900 -50945 454535
15106 148380 229546 -345107 39406 -22389 -196094 -81860 -284830 95401 119670 24822 5196
15094 208261 243983 141228 101964 -74351 -181452 329085 401906 165552 464438 389025
15084 389025 287065 184978 182375 111725 173503 -24616 197534 -69894 254183 323497 6724
15072 106573 349310 -314801 -92018 469214 254194 169014 40005 -71277 50400 -342245
15061 92990 168156 83252 207375 5473 -54710 153440 217391 323789 139743 119891 211457
15050 211457 256147 49405 -31532 398876 134413 233700 150940 123878 -150457 -122228 506220
15038 237363 97466 152978 210486 100079 179900 337173 -44893 475585 280281 80114 288476
15027 288476 4741 374482 347224 431977 355868 82797 -56204 311334 97500 290686 -9546
15015 100276 -78325 263325 -34658 297744 314561 15219 45312 339905 93519 392457 286500
15004 286500 -209908 81104 468304 -5789 -314971 33761 398127 194374 173367 303859
14994 303859 123640 291919 187514 98757 120437 189261 303497 28335 246835 101251
14983 -104325 182634 141213 -21791 406242 -152252 178238 161071 238027 302025 254112 214086
14972 214086 -72 163584 201853 -53008 119696 336504 -155566 -200559 -149915 395189 55917
14960 208563 149961 228858 76963 232914 168879 323045 109750 288278 27339 440154
14950 440154 170417 326669 421254 -157104 221292 455368 188736 306245 416493 228534
14940 228534 -108990 6713 101147 -103 -36603 350394 247786 334803 496822 116362 415287
14929 415287 398270 516271 209634 284118 168235 209875 153279 4615 620374 352614 272669
14918 272669 144897 331741 549025 273367 168346 314193 191028 37855 -220999 302904
14907 499443 154629 116845 168117 38294 459058 352053 432760 387599 427886 -24898 203695
14895 68539 805063 -62982 440977 588643 133431 329620 287380 352373 263835 -64626 259781
14883 304258 93956 33056 134317 174213 707915 402322 235528 455615 16700 347991
14873 347991 587850 607717 278729 332487 376297 201964 335793 385292 172039 268735
14863 268735 120300 303799 231921 317594 196602 485911 189748 384138 404242 714133
14853 714133 258020 123489 298833 171468 611002 350652 233286 241847 580006 131895
14842 297774 349067 542796 692833 560090 373603 230187 574033 556650 352921 367720
14832 367720 107775 401037 427224 164569 669297 656774 372294 250948 367813 561988
14822 561988 522369 108488 707538 201175 728737 366388 516873 731377 274446 303073
14812 303073 341648 622047 445312 497427 433609 454578 597612 384113 656214 333252
14802 333252 583484 758366 447326 385714 202573 468382 282944 705824 527492 497059
14792 497059 216386 335839 548204 600830 307869 541867 487056 424951 283817 629071
14782 629071 369334 766161 582385 523495 566087 454682 390975 654876 777036 648454
14772 648454 266586 872638 555653 466915 617909 408313 529120 811041 610653 408665
14762 408665 727201 132005 381448 893612 386655 627818 425679 613670 641531 518005
14752 518005 727821 749517 569371 309513 845932 859056 738262 581352 767777 642496
14742 642496 741731 443906 567988 626081 577117 554977 557474 1035578 29295 698842 792320
14731 792320 558739 439049 451459 720672 1163193 683066 820637 1111062 787566 695485
14721 695485 506012 722051 743729 647331 924807 474139 835486 455559 764356 663700
14711 663700 571052 834700 901877 681463 936338 845760 658192 742665 1070926 682619
14701 682619 1015131 853416 689809 745948 768619 558711 705498 708438 1116222 969546
14691 969546 736311 852620 1214981 823699 885677 888491 969820 1190316 715307 913238
14681 913238 1082165 878938 1117556 944979 1221967 1184644 749531 1394263 957798 772013
14671 772013 952556 1210676 1121465 1198168 990550 1004537 918135 1167217 1008942 900450
14661 900450 608339 857039 919441 574781 1223974 1142831 1047374 806236 892860 864678
14651 864678 1021336 1150779 1086762 1291300 1273258 1128454 1328462 1464887 1361027 995058
14641 995058 1024743 1292855 1129728 1214185 825698 987454 1210294 1103074 1135870 1203444
14631 1203444 1311476 1169887 1254039 1407637 858683 1115734 1430616 1143601 1512850 1240268
14621 1240268 1419308 1205283 1362139 1312851 1579663 1746583 1247807 1236923 1339276 1682143
14611 1682143 1411893 1650259 1539941 1285573 1664053 1418187 1372237 1500891 1476646 1443926
14601 1443926 1523867 1819301 1358962 1503696 1685566 1361081 1800353 1897652 1768835 1806753
14591 1806753 1704324 1849975 1918292 1439493 2109792 1747454 1613058 1720163 1865050 1703188
14581 1703188 2126364 2132438 1864483 1992569 1910106 2084520 2109153 2341245 1861398 2296304
14571 2296304 2035547 2157925 1907446 2343750 2351146 2196223 2443989 2609968 2822626 2503857
14561 2503857 2727389 2760073 2477881 2758232 3063255 2929394 3117547 3790165 3988538 4559956
14551 4559956 6515920 8828123 12225144 15598919 19752943 30382577 38681543 20775186
14543 20775186 9749066 4830235 2851861 2406933 1963027 1840992 1796735 1914064 2127810
14534 2127810 1880491 2192226 2044315 1937367 1830948 2472178 2033450 2102949 2267826 2144389
14524 2144389 1950432 2481957 2209672 2121544 2311632 2399558 2158651 2318889 2449062 2707553
14514 2707553 2837426 2565160 2557814 2851920 2684332 2827386 2736691 2752198 2798731 2839128
14504 2839128 3244400 3008136 2880001 3074811 2986827 3002019 2843123 3266241 3150784 2854925
14494 2854925 3080807 3421409 3122321 3490313 3121528 3562847 3479927 3431806 3413450 3392476
14484 3392476 3514944 3794854 3782797 3654687 3832320 3743053 3471791 3766070 3941413 4039163
14474 4039163 3870231 3927460 3902284 3931528 4120093 4266091 4380299 4499291 4546080 4358330
14464 4358330 4543413 4606816 4482178 4768879 4803850 4532154 4771964 5112852 4628488 4901125
14454 4901125 4863445 5347029 5124865 5174732 5389753 5262373 5340443 5480611 5655972 5913776
14444 5913776 5475404 5634154 5873383 5931322 5805493 6219923 5791858 6207377 6243698 6475740
14434 6475740 6630689 6685461 6391153 6697556 6749906 6755589 6982826 6950930 7102153 7175933
14424 7175933 7596742 7850923 7710424 7913927 7445648 7788897 8238028 8243252 8588578 7983852
14414 7983852 8893744 8607916 9112233 8844844 9083292 9176351 9313666 9441221 9453453 9487400
14404 9487400 9737282 10158815 10373297 10455575 10892490 10482123 11129543 11056375 11436568 11348254
14394 11348254 11666482 11940319 11948030 12159139 12175204 13240782 12974788 12865452 13560250 13593245
14384 13593245 14145134 14191401 14067158 14629393 15131302 15128597 15649192 16052649 16144085 16208461
14374 16208461 16752203 16945711 17492523 17855129 18268701 18341478 18922943 19092353 19608483
14365 19608483 20045720 20495430 21310009 21749168 22076109 22754750 22828484 23217151 24053503
14356 24053503 24767116 24689818 25595569 26433611 27097697 27164397 28089784 28952699 29640754 30379668
14346 30379668 31143010 31886245 32702216 33620098 34180930 35235337 36016523 37475734 38461371
14337 38461371 39570364 40711366 41551606 43236784 44495201 45561119 47273278 48608284
14329 48608284 50107850 51513539 53333281 54799606 57009938 58486368 60776118 62876591
14321 62876591 64849176 67383424 69730657 72214666 74701588 77428859 80544299 83461858
14313 83461858 87038542 90340661 94208450 98086036 102034319 106666708 110593242 115885266
14305 115885266 121018877 126470082 132202789 137711804 144413004 151064420 158128321 165764059
14297 165764059 173962284 181984228 190865652 200236219 209639971 219514125 230512291 241865340
14289 241865340 253402920 265990822 278760812 292272743 305986098 320654394 335409022
14282 335409022 350089073 364788308 379870240 394217177 408403182 421269181 433014796
14275 433014796 440001755 439925788 438081860 438437083 443237957 451614690 456312793 454762376
14267 454762376 452212742 446102886 437669573 427479013 415565269 401735209 386594215
14260 386594215 371012080 355040771 339430399 323621633 308183198 293215208 279541700
14253 279541700 265839853 252620666 239545738 227871808 216725534 205573445 195442525
14246 195442525 186070337 177179006 168723012 160850098 153343259 146029278 139305854 133170282
14238 133170282 127599769 122247242 116714125 111661833 107074917 102381489 98557935 94833233
14230 94833233 90825129 87684505 83921627 80689158 77543550 74756785 72326066 69526685
14222 69526685 67251196 64897576 62804291 60640858 58507205 56306172 54887978 52977811
14214 52977811 51804215 50328383 48728793 47126912 45558206 44253056 43100826 41956243
14206 41956243 41196229 39695066 38488409 37263595 36453446 35628230 34812767 34002385 32788088
14197 32788088 31773261 31187818 30232009 29575744 28818970 28273855 27543404 26947396 26262900
14188 26262900 25798766 24900927 24554263 23883136 23592422 22550437 21994243 21725132 21285663
14179 21285663 21146357 20589321 19877590 19870547 19277438 18986141 18903430 18091498 17730424 17780616
14169 17780616 17212706 16729451 16529516 16275444 16276274 15592914 15330861 14986419 14856882 14559413
14159 14559413 14159769 13914778 13965427 13603701 13651798 12854015 12945331 12613403 12780704 12478737
14149 12478737 11891434 11980281 11945650 11350866 11577096 11306858 11073281 10932846 11068334 10659639
14139 10659639 10484787 10237748 10320551 10228136 9676087 9776803 9546122 9705795 9206384 9083942
14129 9083942 9335552 9021020 8863337 8578312 8236848 8520090 8316038 8178626 7888943
14120 7888943 8025247 7688276 7516549 7824922 7606796 7990854 7462088 7250320 7213189 7132935
14110 7132935 6890981 6995502 6917065 6670451 6650217 6473278 6289489 6454344 6669563 6428017
14100 6428017 6078667 6246493 6020770 6124107 6228656 5657481 6131675 5779550 5886659
14091 5886659 5618027 5492826 5469985 5519870 5200633 5154469 5568750 5286588 5282126 5255167
14081 5255167 5291374 5443602 5170827 4844852 4748306 4736446 4790313 4477693 4873527 4678343
14071 4678343 4837835 4350458 4233722 4682570 4406499 4292255 4204551 4467108 4538004 4281460
14061 4281460 4036174 4224323 4358590 4084751 4144502 4183100 4122060 4235980 3976511 4081191
14051 4081191 3987938 3603052 3715065 3546791 3588846 3592051 3434156 3428522 3486274 3326916 3404266
14040 3404266 3275924 3438325 3490610 3690129 3587563 2987242 3496033 3426630 3359720 3205213
14030 3205213 3418171 3150371 3027831 3388215 3089379 3088515 2989891 2701288 2651369 3020742
14020 3020742 2915734 2656015 2620553 3010596 2522227 2852899 2871194 2272465 2729266 2619857
14010 2619857 2620972 2726038 2570625 2393245 2673359 2612697 2624096 2573504 2403348 2486047
14000 2486047 2484281 2509598 2225350 2429253 2326776 2147772 2408333 2370950 2962115 3576342
13990 3576342 5446754 8776325 11632305 14968567 25276502 39781652 24880801 13151148
13982 13151148 7730821 5881298 4963856 4153519 3835802 3372668 2987545 3102858 2904195
13973 2904195 2520141 2546336 2935032 2310857 2427144 2392350 2241836 2306214 2215179 2168942
13963 2168942 2278042 2274523 2161133 2317180 2421312 2030097 2054778 2294071 1990782 2041105
13953 2041105 1854406 2117848 2075253 1695550 1936022 2060045 1847432 2177949 1799096 1736572
13943 1736572 2262765 2166239 1852652 1657945 1896229 1756240 1702637 1819409 1475789 1589496
13933 1589496 1728245 1769386 1935267 2058231 1644804 1402850 1864612 1708935 1403208 1676492
13923 1676492 1619021 1533058 1691831 1402172 1347316 1598313 1355062 1730169 1553646 1553714 1760993
13912 1760993 1560540 1485709 1481691 1477039 1214666 1426986 1401790 1505969 1182618 1593103
13902 1593103 1433906 1417816 1350216 1561680 1410769 1564604 1566366 1616032 1544465 1575136 1477983
13891 1477983 1479534 1430384 1577246 1470708 1515820 1271749 1488158 1106322 1230280 1460875
13881 1460875 1174047 1235621 1074068 1120744 1192426 1310865 1182300 961856 1073238 1174935
13871 1174935 1209165 1564665 1060896 1046242 1038685 738035 1207483 1432267 992024 1222229
13861 1222229 1025165 1041068 991345 1184488 1095910 1343314 1305564 1157598 880553 1195862
13851 1195862 1123608 699800 1382926 1127590 1119579 1145682 826334 1161055 1095969 1140132
13841 1140132 914530 1183018 1418293 1104723 881308 1020019 1050037 986002 1114132 945824
13831 945824 1164761 1000893 808633 949860 1413694 858276 994631 1307157 1061015 1074763
13821 1074763 923456 685921 877929 1088176 807274 1268555 708126 952121 825413
13812 825413 701954 1033462 694011 1029518 809592 749169 858451 1266939 839179 754548
13802 754548 337586 1331498 726024 868253 722779 1018076 657049 952875 879657 633306
13792 633306 664724 825924 817296 799091 1046344 1056845 564596 394881 1058096 1193285
13782 1193285 668588 785136 783892 851935 787222 715225 721192 818750 881730 810892 565485
13771 565485 654971 685162 449586 1040189 801303 879990 894389 935410 707658 923900
13761 923900 924387 608312 767226 1036779 903787 1110053 829519 825948 527670 751900
13751 751900 443567 696332 709289 860875 583241 666317 744746 760851 612533 410263
13741 410263 854679 716147 1063224 462682 1039878 430962 571046 798776 515055 932778
13731 932778 268406 751920 463635 573368 783195 634673 742821 535367 423940 635775
13721 635775 422645 556263 582475 625843 550273 506511 597623 410763 592789 411223
13711 411223 570383 648951 544888 724869 532276 707289 580749 602120 489926 1010871
13701 1010871 610539 356051 375752 571920 582822 569233 500054 562149 405213 248411
13691 248411 410290 708848 568588 628113 624415 554265 538684 188361 900385 335963
13680 480200 -22509 797369 717977 353219 383263 723199 744202 575479 467752 539573
13670 539573 598413 630585 555557 568008 894178 763893 374625 685240 358610 701913
13660 701913 705418 446815 534193 479939 441349 403782 332331 670416 659205 427516 491169
13649 491169 26218 628869 407857 417041 478943 489053 659426 475381 401561 285007 483495
13638 483495 166929 540184 399960 593943 428923 740135 709700 761518 372134 180951
13627 520307 620818 461536 353114 339234 385831 256233 596654 345980 267457 138047
13617 138047 396478 414774 456655 269803 554959 434796 473760 174097 630761 -34160
13606 156228 281130 431315 527292 374267 269026 553786 453087 436937 507472 356365
13596 356365 500755 371344 56279 523146 413129 455700 518871 276942 685189 716413
13586 716413 578578 667659 371366 725272 484877 312074 560805 177645 284074 285819
13576 285819 348507 457185 65622 319923 598727 288381 329447 112251 440011 62603
13565 402245 181960 522198 161334 244064 464953 -287511 483939 707999 165513 -41401
13554 299948 747025 220221 224459 100479 308281 431807 323224 352360 131460 621383
13544 621383 496112 -51205 370909 626330 349415 702195 328839 193573 130324 318165
13534 318165 413328 549585 125056 427668 181675 479513 595085 269287 536727 306707
13524 306707 502083 330807 253517 210556 162216 74458 375147 76558 512856 600201 270265
13512 295326 557398 230823 281330 239176 702785 336859 350854 582318 8952 -218220
13501 -72167 332988 427556 299412 246307 149463 104118 327843 263822 374618 171990 747329
13490 747329 380978 480246 92707 224488 180000 179599 207052 276073 288402 144056 466592
13479 466592 392703 108178 235027 355794 469292 22659 357616 153159 94011 412790
13469 412790 83646 304283 535849 221470 239577 340183 300074 67890 279380 107747
13458 230689 518956 191641 163432 296835 325913 366074 246023 162710 159910 -1956 452552
13446 84141 186805 176936 378443 235329 503715 693273 304862 152235 173424 181644 472763
13435 472763 107493 189142 90582 451755 13606 -79059 252879 395415 314810 295280 172524
13424 172524 54074 650 405969 387051 657301 306227 277713 511813 -18494 339008 248194
13413 248194 310354 321186 402277 461502 402962 615370 267439 253739 554351 378023 226184
13402 226184 360432 289082 215904 568129 269127 178773 77193 160492 -99541 -174673 218061
13390 -110805 -126279 304050 413961 113313 396812 216877 422565 18942 99973 39027
13379 344004 321903 316348 203951 480603 666569 462839 157542 70302 302590 -32370
13368 404655 358910 185479 227730 145144 265953 -64622 264076 341943 32336 -55225 245927
13356 347668 227416 91386 145509 481537 131193 -89739 481429 282486 73790 216908
13346 216908 238424 235740 247419 146415 73525 585527 163403 89762 498562 231853 28000
13334 438856 52490 67785 272587 186462 282144 86633 45194 391001 -104094 6059 200564
13323 200564 -100502 326372 136009 68657 57009 235405 225833 -69040 209361 362021
13313 362021 -50479 146549 322801 -27795 -58762 -271338 481241 354657 217606 188854
13303 188854 543770 323624 415205 9563 -260565 -64961 289023 541524 -211999 181286
13292 35196 147840 71770 306748 277965 133111 174991 -85577 393532 359237 -68765 15803
13280 135314 318355 226215 257866 421033 331429 177319 287941 689044 187594 -152559
13269 214219 -161743 16071 13394 182444 289288 -65921 92117 81218 307092 19086 401865
13258 401865 -1159 12383 -21025 198747 -57977 169036 171255 183136 -15965 133313 290189
13247 290189 205823 -74255 105276 401795 -167066 238519 612645 97048 -6265 513632
13236 345769 326452 367653 266159 4341 -58927 99627 352373 251539 288390 104839 336247
13225 336247 170966 -224613 -174186 -171699 260617 -122116 212692 97585 270309 -167133
13214 -23028 89920 -46774 -28384 186749 -68853 168937 152122 103817 291895 343832 -95170
13202 52432 -109388 -106787 89026 76730 93520 132616 27774 148663 151804 145502 135425 19979
13189 73514 304951 -132883 88029 -58238 135595 34900 236095 -41369 -44352 -22257 194700
13177 453165 127392 -199905 221738 107780 289722 223162 280701 178591 -96299 388299
13166 -114031 66338 95950 107051 358184 74876 170574 -1346 213885 12359 176341 254233
13155 254233 231488 3403 61436 278389 -192983 184092 -38954 42629 188229 -58270 -695
13143 73530 262411 -20901 150003 76404 94704 68641 -100937 76067 84794 271961 -24333
13131 80165 389767 -394397 41277 -60710 86747 -262595 203395 279807 186454 239620 239941
13120 239941 278966 150212 467007 195220 160734 -263383 1842 42350 -153748 17056 349731
13109 349731 -147822 399940 185187 108399 158732 58487 106943 -106255 3689 115026 -97152
13097 -27868 22502 225985 74759 33990 -145962 242855 97980 -30291 145463 374336 239730
13086 239730 181230 -97071 31676 -218129 308982 -129324 -29395 508267 109181 -231468
13075 110733 507739 222351 271567 187034 188000 -127608 31298 -98186 78499 1101 54551
13064 54551 381359 219387 -244800 15105 462711 52440 50610 107838 -139548 25614 -264821
13052 287209 19561 184007 414604 94127 -76979 73222 59616 125594 100082 120868 86184
13041 86184 212789 49762 138461 -59804 277338 380078 301574 260864 -68098 -14436 40505
13029 3010 195779 389260 134467 199178 -72549 -305966 281850 612605 -58038 340604
13018 -75192 209412 -224365 218180 18991 132208 312641 103642 100016 309154 278822
13008 278822 83863 338617 115029 -20143 129288 506208 -13092 261119 442848 -26188
12997 -173379 -251645 203027 -106934 205428 307235 49603 -203913 24547 -236455 56558
12986 108142 240764 55482 -41219 126616 86226 -181569 87159 -237123 186194 106500
12976 106500 95905 127799 -81526 471028 415847 348910 -80375 554199 193941 -72335 -255598
12965 -255598 -166773 -175729 243680 -46767 207486 -43049 252049 137147 -100732 -88061 2203
12953 -318586 65179 -150155 -73823 -104477 208705 48885 -12565 244526 236924 -30045 189084
12941 -47515 -59484 171266 -307822 -6352 228467 29199 -134837 22948 356843 -287543 285619
12929 58030 81507 230902 134104 132072 20057 149465 81684 175777 -156538 161271 186225
12918 186225 -90190 53606 -186666 347124 -75042 145719 135587 47779 -105111 274162
12907 201463 132922 118323 303752 -251737 -57777 30079 -81415 499925 143743 -312332
12896 119566 332109 71543 298912 44046 299257 598187 70877 158608 -146409 109842
12885 -7333 381094 66249 51616 4064 -131897 -16892 336749 181871 376446 522123 423309
12874 423309 127675 -173626 -42222 17142 14409 82979 182688 426667 23788 -77042 -8922
12862 17682 -46752 -126362 690 268015 317565 -202032 407553 -38329 174855 -104251 248897
12850 97502 105949 -38878 60245 124564 135969 -305882 -149225 -113655 114074 -56308 88397
12838 105909 -60735 -96827 36199 -168396 424003 -36469 240603 55940 -234069 -333812 177996
12826 -144632 217243 -201963 -43045 -180010 -164861 -86662 -212983 -281170 -111908 81407
12815 153250 -11046 5611 144486 59705 337838 -212662 -4900 -196101 -232975 -59770 98798
12803 129296 -228608 2510 -90425 -17018 10805 -1302 -46214 82349 246999 -89987 127418
12791 195904 50587 162491 -355314 -123117 253144 317702 -223875 -29073 -3113 8319 -146981
12779 -267563 -83828 -151082 198887 236245 -76990 112023 52166 -240459 243217 31936 150497
12768 150497 237389 245248 22497 -212100 190429 -151384 226635 -20507 -15271 -16870 -101980
12757 -101980 173646 11470 -77425 -16683 -128373 13251 190525 -132211 -320044 53495
12746 -12874 11524 -200488 -70055 -20176 205749 -205669 163534 72516 -30611 -94447 184040
12734 133025 -114939 -148752 -341183 -170052 89920 -61089 19928 -44665 8460 -122430 -324222
12723 -324222 -47898 246814 17580 63271 -150219 95185 92816 19105 -179573 -209029 -193819
12712 -193819 78344 114830 238658 63830 193141 319826 183842 370533 -143471 210481
12701 132305 261404 92494 -107630 142284 124023 -88457 -106656 350883 -198431 -57098
12690 133429 67703 -137324 43169 -140759 163720 278550 -144733 -124126 327492 -104858
12679 70511 272275 183548 248729 401811 90043 314450 -18180 42162 197365 9171 -102208
12667 119477 212939 141971 64676 292633 244823 389660 73105 102639 9668 -31292 356940
12655 154767 548991 -6628 -43565 113455 -83917 26287 33788 75942 138447 221216 71580
12643 -158625 -3877 200423 -119852 407806 146682 -272307 40110 203818 -128201 57716
12632 -127327 162763 -222651 220034 264842 91518 259624 494568 119632 -14983 245895
12621 10966 354929 113433 139310 48097 59621 138133 3608 108822 248472 88041 26470
12609 -10623 70502 351824 -1689 -161472 -128113 151882 251991 145548 23982 381169 260455
12598 260455 210606 459085 99543 145433 133475 307943 516244 -60995 498899 122337
12587 -24585 3668 -116894 -83316 -272605 247029 221197 155731 -56334 182667 206756 -91667
12575 217849 -222380 83268 91287 -172586 167958 89610 22654 51923 376086 355779 -242386
12563 -162071 533189 86934 25946 126777 262266 -105410 -109294 78869 -477194 74827 95786
12552 95786 -15099 -220915 191896 -15107 -185959 168536 -164538 200920 -27187 39503
12541 22818 76000 -210916 144319 -282891 -72614 71697 99122 -63852 -116815 110448 -55418
12529 -71095 29284 -157419 -93349 268011 -36307 114536 -125146 241024 -7168 -161544 79125
12517 330163 261535 145809 159082 375790 131836 -126002 197727 341030 -304661 44928
12506 -118310 154892 241702 469785 -109755 37664 103679 -147289 55973 207365 55517
12495 -17915 16809 -99464 -173920 407387 136104 282756 -478979 70707 -57479 -67697 242148
12483 257617 -190926 -67935 -90067 -9822 -57203 -7314 358459 211641 179721 142425 280628
12472 280628 123612 -180192 -159994 75234 -36816 -358044 -43422 -267892 52897 -229992
12461 -121081 -344935 -58849 -8098 198078 86571 -165687 54618 -222763 119492 106007 139042
12450 139042 400287 -277216 -121757 -120196 -42093 168447 -357713 222404 307851 -205826
12439 -28092 -63458 112859 -79216 -13085 245221 -12756 -125797 -39784 -291768 175881 17584
12427 -177376 -60100 287509 72632 -169719 146877 -201184 -234296 -118812 -208081 -280353
12417 -280353 -393086 351396 9869 198318 -246778 370672 110079 158786 -102883 92254
12406 -227324 -252910 -120681 185210 -134383 -232524 226134 94266 93345 -113952 37909 -227828
12394 156207 280771 -268448 -72891 -103990 385493 -26500 158167 -109360 54255 -322377
12383 -397131 99224 -355603 3866 245694 77545 523856 -249108 156258 -11795 -99974 -191470
12372 -191470 78270 94369 129021 -89581 -58134 61405 87839 -236926 114560 -144687 486965
12360 41588 95231 18315 196841 -206630 -259043 -61824 -149129 -119281 95815 -101205 -14200
12348 166487 -118550 34252 -46223 -50267 303005 -331352 -124470 -102175 90930 121822 50170
12336 50801 3514 59281 208591 -207151 276726 -23330 -207544 41594 98346 -98647 132552
12324 -94891 193630 -189271 340942 -125520 23127 138126 7113 49944 226450 -69365 -116484
12313 -116484 126079 160258 -165884 94672 -143730 -101122 -51656 -400894 223345 -193749
12302 -185959 61197 185186 -130459 82343 -41676 -134085 -157339 369777 -8969 251623 293026
12291 293026 180451 -430269 112659 236531 -197273 125101 54134 71400 -48137 -146172
12281 -146172 23346 32387 10919 64543 61279 384280 274825 -32916 148745 386525 270390
12270 270390 312311 331505 -406112 -67426 266280 34106 83832 -6373 -11590 136906 231795
12259 231795 529759 -157916 -37523 154005 -10651 69038 46366 39376 -147616 -178680 -130009
12248 -130009 -95448 311887 48194 -117475 140834 228529 60636 425110 255688 -70370
12237 90225 -292964 137864 22487 -9920 322663 240688 83247 43708 296859 -31185 343954
12225 377925 193199 445339 75034 11162 97647 514437 240269 102246 299131 277618
12215 277618 198675 172118 46699 72657 161010 101680 13465 399145 294057 256503 259411
12204 259411 186889 105472 268827 318966 195421 -25 -26205 156477 175424 61226 352729
12193 352729 -32441 481138 444626 288133 143927 417973 -269699 418255 196908 31448
12182 -234 -90757 178509 146701 343084 240761 38302 -159458 185503 74973 -36124 35031
12170 441865 166396 42 101550 343023 10687 34228 236813 80178 34699 233365 160177
12159 160177 22850 -40322 -181187 54851 -26228 341158 -188850 273793 340702 206070
12149 206070 194939 -108023 106753 -193313 565246 247306 15624 -93819 27016 -61955
12138 150005 -235628 78313 245461 251496 168994 647307 41253 -3647 71261 -160857 -224706
12127 -224706 -345133 -2250 -123010 -50569 -212941 -327485 203186 72828 -53763 261555
12116 223962 -8318 -176858 -44780 -93523 -82432 162634 273928 -144574 175429 -142959
12105 136798 -101383 -136867 -198872 28157 72448 -164878 93164 -98196 -232602 33965 469780
12094 469780 11595 -283329 53481 -110238 190158 1700 -88292 -37816 170847 134538 69999
12083 69999 79713 273045 431437 416444 415627 6364 -48515 -152330 166757 442792 237708
12072 237708 192630 682104 461632 1170878 1031215 335652 -169453 150180 -342935 53561
12061 -102640 117341 -94569 39037 -29039 -259290 -357705 141951 -61591 -200958 149606
12050 172305 353917 230363 238795 -61755 -81504 109797 115284 61319 219954 247598 233939
12039 233939 -18514 -64226 29443 204358 -179369 -219946 51034 5516 309213 -51281 -209949
12028 -209949 -312097 31336 280709 -39942 92918 -297531 -117250 -163402 -67819 428485
12017 197774 -108695 -288713 103843 -12938 23150 -427541 77335 -1302 144782 -287461
12006 -108451 112463 -110183 56558 -83581 -224048 -372006 -174840 -155316 276974 30126
11995 -65243 -83097 -115264 -71134 -227788 270002 232294 37166 -188303 93254 -122345 -70065
11984 -70065 21659 -72549 112390 184510 34114 -63711 -238411 -64983 -127859 -168196 255259
11972 -46756 211608 31795 246671 60101 3180 -195235 306902 5573 89600 -105316 -32417
11960 -59202 -166013 -194714 81819 -254536 -51693 65912 -219654 135513 112340 -33257 100657
11948 -8259 -191719 -399606 -4113 227204 195154 -32225 -136505 -45904 -157229 112976 282639
11937 282639 -166614 -4120 -312486 -174048 150829 -54241 11487 110724 -10477 151642 -17423
11925 -16891 -145671 -85118 -56454 309188 298669 -77256 -40630 80994 3859 371301 192114
11914 192114 -148517 -36077 -168965 -243227 -19066 -78281 -78328 284258 517689 -207597 -159614
11903 -159614 -125795 101549 -166567 187656 437931 125761 19463 157117 -60519 185990
11892 59707 25178 -191321 -190926 28336 238932 212126 -280983 627 -128845 -45762 -197867
11881 -197867 267763 207546 105900 -22248 5171 162925 -181334 81982 -83168 -70280 -13874
11869 64637 162334 171303 33470 -186433 140940 19651 -252588 47132 -286635 107226 -56971
11857 -269022 -32776 -74402 23584 28832 179542 126397 -46643 79706 172897 -188323 108713
11845 -160188 -561 -278922 -201234 106354 73495 98205 228403 -93342 -214889 157678 -111860
11833 -219853 73509 45442 -131909 89670 114345 -279735 -7692 -32479 -389886 240667 -132843
11821 -62038 -52811 128824 -170025 86739 322676 219341 40135 127430 -180221 -8048 -143484
11810 -143484 -326445 -105563 126761 -75860 -374627 39492 -38425 145074 212739 126087
11800 126087 96747 181949 -434147 -34529 -203806 32924 -25149 89344 -349690 -146108 -267641
11789 -267641 -99506 83713 -61781 162100 -129928 91827 64624 37753 -179539 -15410 133005
11777 -261865 184019 116978 14683 -146783 -92460 165433 5577 -82095 -205729 -60379 -301599
11766 -301599 -17440 -78843 -184462 203733 -343198 62848 -89002 26194 -54492 -40281 -159145
11755 -159145 -117957 161655 136210 -209772 -156578 -152870 12313 -37554 127611 -329090 -64631
11743 5539 -38318 298429 169940 -188167 187325 -17266 98082 144723 -78772 -41198 -44190
11732 -44190 361666 -203256 -38948 10902 -239871 33826 -514600 -137334 -470555 -23339
11721 251779 165494 87935 -313842 188533 176673 218727 86791 297921 140359 -79980 117635
11709 193678 -130756 54338 43703 157754 206077 162711 158094 -25870 124478 -140381 -99565
11698 -99565 112135 -80499 76168 1100 121102 82421 152150 141068 51236 155227 143113
11687 143113 88472 186836 10575 366233 60659 239569 71078 -19225 40200 170405 273166
11676 273166 -195267 -134859 -81344 155292 -16365 -107879 172266 -11565 121673 17835 -48652
11664 49991 33902 211106 -5614 310468 30366 199058 -278458 21253 317824 176886 223932
11653 223932 54320 249493 298463 -59204 100162 48585 17058 -136233 -112730 -73573 434300
11641 187881 -66492 -137207 164271 -26622 154105 -126726 9024 -200717 55877 192844 352262
11630 352262 -81739 -13532 120151 57269 -58919 1845 49946 -384971 312939 -67598 -30004
11618 -77531 47301 -127764 50559 144856 -29770 -86948 -95820 -145476 -159784 242349 53533
11606 -187210 532091 238572 13358 74169 -130227 206325 71713 314281 -45567 -64969
11596 -64969 162894 46156 42870 -50672 -25434 132347 321717 314055 -10960 8628 138713
11585 138713 47929 233200 234271 208142 -186966 274454 42363 344515 -59635 19449 382991
11574 382991 89877 280894 385349 115423 -111913 240387 -116696 -20888 -60470 163504
11563 3887 -86287 -60266 102555 -115853 169356 246524 207684 -154108 123804 217816 174762
11552 174762 -153836 -183728 -74225 158612 2126 -117370 -213993 382126 134313 89325 213581
11541 213581 73199 176593 123920 68417 317949 379528 104519 -22116 152485 147230 243489
11530 243489 38136 301329 130184 241434 41063 329450 -172163 -13676 -236908 178859
11519 -208586 40369 322630 -52263 322474 23927 165837 56296 -44251 102035 391331
11509 391331 193283 -72065 -58522 -149183 -141206 165135 176842 237288 16806 74241 377824
11498 377824 181073 167982 79128 139401 149254 83209 248386 248821 304805 89354 240696
11487 240696 -250841 -169245 74020 -108957 -24622 -59193 197559 153264 198538 101050 71672
11476 71672 343479 343923 -143284 139909 189072 264528 249368 323960 123081 206037 347889
11465 347889 259619 185240 -11588 283740 -43699 -39454 -49977 49697 142094 -117890 -103314
11454 -103314 4053 279830 198739 85541 101494 119120 134187 -152514 17843 -120238 -44800
11442 113659 345293 -4367 143756 74576 183975 -92637 4091 -24948 -182634 99178 -117448
11430 270676 273571 113234 -97555 387589 -120510 -212019 322520 -82424 293875 -14262 429763
11418 -7487 98269 -199643 -10469 228509 137815 -104588 223469 -98670 260422 29248 -19380
11406 -44270 250635 -59729 436847 186350 -91918 -96714 36639 270138 380238 198331 -62895
11394 251613 82755 -142601 38085 -322143 -176155 -6080 36411 31181 -92539 -197678 29866
11382 228093 -354481 432831 186322 54123 138407 -388 -120812 21115 262274 145123 249259
11371 249259 25299 313269 98888 -69160 -197331 -244564 131772 -41364 -64788 -133136 -104256
11360 -104256 236413 -32761 272369 -55819 -124932 -151825 -122232 -465286 -355709 52789 95020
11349 95020 242017 69972 260713 -35376 -340317 -8754 11420 -188061 155375 -63022 -194048
11338 -194048 -143657 16637 226870 -101111 170917 110148 -142567 262220 119005 -104702
11327 -34110 147959 248204 73406 -93788 -55239 73267 -89981 -70912 -86387 -200728 143101
11315 17884 122487 -25111 -124668 -200381 -10347 -130559 83045 -245806 -52235 -64734 -215252
11304 -215252 -161430 -9635 -150963 -122704 20527 -185958 29588 43940 17716 -64655 82311
11292 -56287 -222718 -94706 -56776 -55107 -78054 8416 377411 -103445 109714 -154721 -19708
11280 87370 -158958 -190746 -79462 -61999 -162847 -82709 -80030 141433 150004 -302235 -4149
11268 -229124 -269474 -125557 22080 -231770 -102802 230339 -211584 71292 -188324 -129712
11258 -129712 -112193 43610 114141 -138163 -106541 43811 -90863 49502 52483 71364 12559
11246 -132469 -52855 -25394 242896 -134092 -43001 -155045 148087 75719 -16096 220983
11235 370972 -136431 -37450 -112357 -14322 -222458 -344314 41705 196065 -16759 -136733
11225 -136733 -192480 -127624 32547 -33586 95836 -278321 -4036 42543 -19662 548939 110329
11213 133054 -190782 -273400 -21155 -123583 172139 42574 -17903 98895 -82343 -98155 69972
11201 68236 287215 -232395 -144064 -21030 -51313 107047 -127833 217539 -195593 409622
11190 -90825 -58174 218366 126543 -220476 -115937 7909 -173565 -201 412304 -53260 -238536
11179 -238536 177349 -339478 52151 9946 73401 -169588 260442 -313207 -375652 247074
11168 -306368 -205271 12426 286698 73590 154635 40460 332367 96701 -299260 23119 74765
11157 74765 -194198 -134372 214191 25457 4876 -147381 45711 -193555 348266 282877 150909
11146 150909 -51924 135968 16514 -48720 49475 112380 -273245 89661 46673 7745 102532
11135 102532 280045 -337812 82791 -115263 64151 179872 251901 241015 -9467 389857 249163
11124 249163 -76234 5536 -188589 -72081 -127461 174607 463549 -41024 -478495 36008 210791
11113 210791 271319 43823 135767 -35747 120193 -48573 -181476 198657 77153 267483 302932
11102 302932 239710 -144311 -242054 315280 263326 194874 155747 55595 217986 391718 420363
11091 420363 300768 175892 195051 -76688 484683 335670 424669 256807 221428 244326
11081 244326 296140 318555 264734 172673 487663 19962 295167 277704 322683 210531 53267
11069 289212 252628 347881 161531 241190 283393 377826 383344 640469 387429 546016 564539
11058 564539 426318 607140 586833 339364 515294 404563 764132 825980 622571 741307
11048 741307 541553 704701 919377 1066692 867566 652430 937473 555752 639717 525065
11038 525065 938432 548838 744037 629419 400631 336379 620848 637138 1032382 748046
11028 748046 727706 555194 810816 662062 874910 796487 855417 569358 696123 750859
11018 750859 527029 595756 734798 555466 700318 495367 302719 624752 687769 635702
11008 635702 677023 725045 631677 494153 954431 545098 468887 534604 686942 634582 493041
10997 493041 544872 491151 508136 546104 606323 582631 959683 903834 895345 888259 843740 799494
10985 799494 1335165 1229163 947037 1173811 1256209 1258111 1925003 1406797 2084410 1884301
10975 1884301 1970012 2519177 2297291 2544584 3089078 2746087 2785397 2360748 2414937 2111700
10965 2111700 2226061 1742481 1833848 1744908 1902861 1710175 1903832 2335668 1859761 1914595
10955 1914595 1744583 1508593 1637680 1102299 1267728 1162981 732701 448539 721542
10946 721542 273979 279009 408298 516119 346651 19822 582068 324260 -204747 337637
10935 21481 -25281 -10014 265720 -25533 16576 99879 299909 108118 189799 141406 54303
10923 219020 177495 -75673 -32609 140567 -387168 -67638 278741 -56205 263406 -203511
10912 212677 -46630 -166561 154822 73808 -152800 -98469 298643 -173497 -22676 -218440
10902 -218440 -69080 -80101 -65284 -65112 -14789 -55374 -129 148840 236914 -237297 54557 548891
10890 548891 36819 -237236 -161793 66064 307170 114094 -265953 -2405 -57760 23621 93217
10879 93217 23867 -247200 55117 -290069 19858 -317102 52688 -53336 259849 18188 60431
10868 60431 303018 11861 179300 443827 -24708 107580 -293359 214840 -120082 258692
10857 138181 83196 -91011 -299646 -182751 -38206 170094 -364153 -76162 248040 -113838
10846 105479 45642 165026 412873 -5452 -111881 155408 286746 -27471 27445 -152214
10835 -37802 -154838 145727 -234714 -139867 -103442 -145269 -32329 -272641 -288113 -53300 73236
10823 -72347 -92010 -245223 -287135 66221 -5392 -161698 -373677 109670 -264612 318496 120758
10811 -34482 173191 131889 -136408 55280 311799 213248 57111 1362 106199 155227 38162
10799 73945 -35020 178060 461509 -34002 105702 -106704 315831 -137145 84089 301868
10789 301868 294455 -113313 164610 -47475 31228 5252 36599 -118902 -105712 -105616 -220897 -46607
10776 -306353 108870 161077 -33695 79737 -88801 20703 -164286 -368747 -67366 -606861 122004
10764 35549 -67304 6739 -209440 -136262 14735 197621 4181 -131177 103044 -101842 -66175
10753 -66175 -174553 -217048 85113 -106126 -152190 -7293 159035 69086 -267796 -193019 -86431
10741 -290097 -4374 52360 47550 80189 251937 -118720 -179608 52531 30312 160935 -174235
10729 -19534 -157614 -11260 -109763 -38299 -61928 -130738 -120802 -120795 -82746 69644 3594 -177953
10716 -204962 -30410 -363067 205943 -74294 37908 170105 -92852 173085 -238383 -264165
10706 -264165 -175576 258005 -286892 10291 -118588 184898 -72711 311413 -395914 -8715
10695 -6422 8415 -158445 -7435 -64462 21239 104044 371798 39737 -456157 -20869 -119248 86210
10682 -123712 -264016 20676 19127 -42517 -82240 -103291 -105659 30460 132630 76025 -218652
10670 49875 -322717 205180 -83277 -7121 -70453 -37758 271470 65957 -173480 18283 -142298
10658 -39421 218158 -47592 -230519 -133319 54514 24822 107206 -136629 3822 -263541 -115461
10646 -235515 -102139 -4249 405542 48291 -45008 239043 74138 -27203 -81333 72855 -431417
10634 -151699 169128 -46719 -133506 -141955 -4345 9291 -300315 -102386 344925 75289 77073
10623 77073 280934 -59658 -91940 -79850 110455 1569 -246202 -159745 -199487 -122261 -34759
10611 -69203 -24556 134992 2882 74590 55018 84967 131808 23004 15729 22484 333630 -269492
10598 -80026 -116336 -113326 -291384 -107509 -19346 -107024 -228891 146213 -150551 72545 -165837
10586 403597 -322186 87307 122790 -130761 205465 -77411 -4630 79431 59840 204323 -89151
10574 71263 -127491 -118070 -148388 396584 -229054 -212563 171738 340387 -71458 -158930 -607
10562 -38254 -157251 -329930 306358 261799 -126654 -108512 -65143 179713 -62917 -236346
10552 -236346 -242904 -295790 -134366 233659 -275252 -528885 -174883 -94963 117582 221139
10542 221139 -56654 -5667 -425863 224982 32352 65707 -20633 -293069 203594 -297100 -111982
10530 83227 115918 -147747 -310053 -198341 -112559 -93997 143962 -62877 -74044 -35332 -96862
10519 -96862 -27061 119006 147514 112562 326615 -211544 67565 -223552 -95888 -378142 42818
10507 -63784 41936 -164595 -161645 91520 29479 -160556 -6583 -120613 -17824 -84655 -150811
10496 -150811 -36079 -64132 -187355 75101 312779 -222125 63114 -177736 221142 76452
10485 220171 326302 159921 105134 27784 401337 269248 622691 177545 68576 31839
10474 -67429 -237832 -60182 117898 140742 -525684 60649 90524 -3777 49158 22671 -60606
10462 244315 -107171 139395 -121372 -9259 4967 -192527 117423 -24695 -41473 132011 52515
10450 86851 -80632 -216496 256060 -112969 -105796 182911 95230 -142611 -327832 51333 34243
10439 34243 50388 -196551 10977 -81843 -40594 229081 195272 -36598 -353259 318630 76993
10427 184617 -181397 -6736 251927 74466 -44158 -217145 -23107 215167 166748 -166786 -171633
10416 -171633 -180321 -21524 -37521 -153291 -66353 24291 358030 38233 87938 -98038 -30927
10404 -102161 -225961 85033 -202126 113389 -50691 150143 -105537 31720 -20941 148550
10393 -224591 46014 115343 49066 286561 13529 137835 266078 61456 -90368 137233 178059
10382 178059 23750 193895 -20697 98292 -859 -62352 324193 235804 256613 369940 53900
10370 -19442 252881 418826 263695 409480 169514 491877 240524 134741 38493 299275
10360 299275 464380 182355 359558 368952 31372 92526 531200 397551 490450 182906
10349 388050 616106 222260 242215 1829 -108741 419094 577504 319536 -63011 17633
10338 228117 55813 142950 50998 130657 70515 313037 70588 -14919 -38999 648029 255184
10326 31589 215889 246381 218317 292081 218009 156727 421051 526388 79164 168714 56577
10314 330882 -143073 -10341 -348433 39827 -169456 -154604 84502 297458 490431 333127
10304 333127 -113935 -481595 -116316 3607 224359 200728 -49968 52622 234364 -109853
10293 12564 195252 -342271 -89977 -364741 -275347 -237783 -269270 -359351 -363787 8491 -244748
10281 280985 258415 127435 -173182 -109863 178553 81715 97035 110499 -243629 -47553 58124
10269 -18122 -41040 -278460 -142348 -191957 -32270 283309 -1833 253640 116033 611038 338542
10258 338542 547044 364317 600038 63358 -84341 -95626 -40559 -274936 -54923 -112452 9311
10246 -17578 -7909 -151509 -91661 -145385 -134483 -301961 -363265 -61341 -474482 -116236 -229654
10235 -229654 -377640 -201133 -384705 91929 -132460 -205129 -270016 203896 3058 79984 -412385
10223 84593 -136715 116436 -168663 201220 122696 -450671 -298048 73457 -72194 -119581
10213 -119581 168934 -14204 -220651 82431 34658 -459166 -89578 73324 250908 223372 -278240
10201 48174 -16927 47037 -70854 -104617 -157985 44120 85510 -97093 598609 48067 -109869
10189 -72418 -141388 -261959 58143 -271875 147629 -27256 -132015 117728 -199761 88791
10178 -254293 -403848 236805 -60256 -223977 -43342 -354320 -6454 461552 3078 -224561 188096
10166 16689 -245063 -305978 263142 -35062 166138 -87602 -76295 38799 79392 -124806 -85165
10155 -85165 -381913 72841 -92303 273654 287211 97530 -232753 133490 145135 -193665 -215654
10144 -215654 -209958 5598 -223453 -20002 -46928 -20368 -206509 -331015 78026 -46719 -50106
10133 -50106 102123 19256 -89889 -254197 15055 -81112 194920 244325 -169659 332526 -182568
10121 163633 -40307 -247115 -109418 -236552 -208112 -155187 -124603 -24629 38720 -485269 -65863
10109 7233 -333417 -211220 -149505 162372 166358 -104005 -108478 -35455 40454 252962 -192476
10097 114820 -249889 7365 428517 -351975 19599 88633 -143040 -294879 -236330 -307472 31580
10085 -192849 -309198 -60554 71185 -136423 -197561 168434 120105 193179 183477 137437 14495
10073 -429479 80542 -107147 73180 -179196 -244119 -412279 -138469 -222587 39252 -231167
10062 -36190 -133031 144395 -104935 126873 85862 64995 139284 441360 16356 -78957 -167429
10051 -167429 -42689 -126038 -145414 -164817 -94857 -179507 -291592 -100464 -9180 -92193 -73121
10040 -73121 -46891 -101720 169186 306258 96016 -84864 -145498 272002 42862 -359888 25468
10028 -240946 -184444 123996 -20476 170259 167202 -21916 -21728 -561981 -157615 -180319 -171408
10017 -171408 26490 -55395 -121392 87041 28572 -222198 -162459 61712 -25838 -49003 143668
10005 139676 97436 -340355 -13448 -246709 397260 3286 -8166 -237833 98439 -41727 99829
9993 136430 -112149 -245096 -150685 -595766 -282149 -66102 -209004 -196670 -160690 210237
9982 14832 -637648 -96136 -127982 -24382 126440 -126869 1629 105158 194097 188289 -271951
9970 21995 -146038 99817 280947 -328452 55426 -81826 60050 -237560 -184985 -139563 -6182
9958 -144089 -229566 -319777 129686 -403741 -102268 105658 77376 -276176 -29973 82200 -132394
9946 32478 -77456 -510312 -358174 -179567 -101137 70655 -255647 53368 -285592 66407 172262
9935 172262 28563 -106486 86389 -139892 207558 420 188005 -80799 -15169 -171731 303363
9923 -189625 -54058 -351609 -16064 401944 -372766 -189875 -5768 188847 -100662 -223740
9913 -223740 -123946 336709 77519 80049 -98703 59086 -123591 -127027 -111226 36100 188810
9902 188810 -393038 -386130 56405 42702 161436 -240525 -39019 -39084 71155 111866 -124734 163526
9889 120027 156244 -45473 -166945 -135121 -366417 45775 372559 -176257 131195 -135132
9878 -24751 -58031 37931 73918 -114335 60817 -6209 55956 -77843 6437 -210676 -189254 -416280
9866 -416280 -279914 -238472 -178265 25565 -52894 -275849 -256538 -218557 -133173 84068 -46903
9854 -299688 -329836 -10006 247892 -152348 28817 61292 -216331 -46653 -148310 -123421 8008
9842 -71361 -4892 71490 -339130 135505 130172 -55042 -195714 161524 -127983 -156139 -152064
9831 -152064 -105885 72646 -171990 -145912 208828 -41370 -57950 -528 -85818 57188 -30738 -21268
9819 -21268 -226730 -369018 102529 -121420 -291317 -428056 158390 -139661 144209 -82552
9808 47125 -115966 77615 27439 -178494 169303 -142072 160998 54824 272162 77175 -178362
9796 -246586 -264552 -295464 -136413 -420096 -47371 51769 -51757 -201484 355623 281739 93763
9784 -191380 71600 -17178 -226884 93035 -114031 -274297 -295031 -26208 -240279 14313 -3807
9772 11872 -289353 -154434 -101305 106873 198830 81327 150047 -108773 291887 -234591 17434
9760 -243029 181755 255451 -399445 92771 218260 -250509 -386160 -411551 -67169 560863
9749 -21700 -245546 15999 -221931 -140478 136308 224784 -3756 -435568 -380670 -157177 -30564
9737 -252750 -241645 -312533 184373 93315 -194870 -151066 -150151 -125441 -363329 132835 -183911
9725 -53870 -85407 -164063 -113986 45329 -9094 -176044 -2993 -192481 17941 48298 290663 -119310
9712 -49856 -145152 -34326 100941 -71060 -85082 -14004 419061 -19408 77717 -128764 -203842
9701 -203842 -55548 -421745 -117440 118420 42048 -177771 68996 122835 -110784 -68633 153827
9689 55646 -96907 -185521 164950 3188 -152923 269211 -217207 97499 -131528 141698 100034
9678 100034 -27170 261212 -95787 -202198 108378 -63444 38956 -100310 -336740 194830
9667 -222994 -113840 -277921 -133923 127461 -76938 -82262 5584 -288274 41020 -157995 -279959
9656 -279959 -98778 96861 -178006 -147155 285489 6660 -259813 -474585 56545 90850 159463
9645 159463 -95383 21992 -47586 233826 204723 -23062 154557 -117579 -43955 -167300 156147
9633 126660 16107 348783 -319425 143416 -72294 -47666 389 45088 274627 -443710 319094
9621 -393294 -193473 -231176 -273493 7852 17767 -171957 43648 -321876 -58875 -85056 -309354
9610 -309354 -116104 -51121 -264701 246948 23274 -152051 -224388 183275 180255 -21839 -16829
9599 -16829 166672 -26907 -174880 430052 -50587 -102101 -50214 -122825 -230716 -93717 70817
9587 28071 -221659 -136025 -79548 -187388 -154302 110249 223537 108032 527828 118527
9576 279648 -169302 -104956 -146825 109769 -181942 171656 -292618 -282616 -175 -161979 -261549
9565 -261549 -294712 -307473 28772 -100473 92732 -212506 1438 -166063 151937 141154 -35236
9553 -402202 -108963 -330295 -116388 -426580 -112570 -234763 -107894 108567 -493167 -138577
9542 215478 233937 -169730 -42892 -93464 -29468 -40279 -253738 62688 -372336 233975 -96525
9530 2943 -49077 -277380 -25671 -317422 -157081 300533 12877 -391787 -94409 -219521 -97790
9518 244467 -220203 199705 -232605 107461 308318 -79519 -287679 220389 59380 83677
9508 83677 -238381 -6812 -372834 83177 30356 -88735 -205499 112148 -300399 -154089 -321892
9497 -321892 878 -21817 -303253 -133780 26030 -126187 17751 99310 -330463 16771 4998
9485 -121819 223696 126966 69089 -327347 52391 -204793 -365544 60747 -56327 -204507 -89546
9473 -223036 219103 -216799 -34137 -362677 49805 -201446 339359 -263248 -79939 -60184
9463 -60184 -14269 -137799 -58509 209095 34130 97749 -63208 -18029 121986 239107 -308072
9451 69956 41742 165282 193068 -172745 -241821 17707 -73190 -157126 -53880 -322991 -197020
9440 -197020 -124315 158475 -289834 -103505 -462425 36170 -2449 73964 -22010 24922 58807
9429 58807 80351 262085 187984 -399198 -259335 -25696 12668 -68311 169576 -129036 -364166
9418 -364166 182412 -110982 -42653 24339 14253 103041 -72057 -33243 119901 -77603 47905
9406 -10203 -70952 -157533 -52706 -247417 41063 -110189 -342286 147353 -100170 -19451 -304393
9395 -304393 125952 -133146 -329842 92586 -277271 3573 -19243 -215564 311215 46043 69063
9384 69063 -299603 19256 15883 218594 -199849 -288748 14874 -36184 40034 -56697 -31547
9373 -31547 -252156 -432981 37075 -154181 97319 4280 101121 -78714 61795 33042 -52820
9361 -269874 -5812 -170616 -172263 291467 -131643 223174 -167735 -96054 60181 42674 -115703
9349 26786 85332 406286 -165403 350359 -248553 22716 -278030 -21628 -41087 -436337 -62152
9337 -150197 -206088 165754 -85951 -150694 -145152 245735 67791 76973 -16269 60701 -29632 113906
9324 -446418 283752 -11823 -130617 -162614 62105 169097 38892 -4402 111694 66600 -73751
9312 -260178 255356 -30191 -137769 92638 -107982 -348146 132656 21721 55504 -72682 65998
9300 105870 62435 53666 27551 -267563 -143024 -111425 -29313 -299980 233546 -138901 -245419
9289 -245419 75286 -57817 49130 -135144 30909 -185263 -93471 -6510 91962 -265667 -95973
9277 -60032 -369577 283637 -96224 -121017 -97857 -41009 -5467 337087 -188797 163939 -209989
9265 -133997 -65571 48090 -179444 300064 -10048 97096 -44889 -2588 -37712 -161133 36252
9253 220276 13904 22373 -144190 -141725 118047 -26689 -55934 -85172 -62274 -74745 -322954
9242 -322954 -313223 -27945 -51068 -119537 231141 17117 -22645 86398 -216432 24708 -47276
9230 88872 -255467 -42054 98026 -407382 -66320 -156253 72888 101290 184223 151941 -182857
9218 -337136 26447 -246807 39034 82447 -188448 -275189 -80098 9823 -12069 -216695 168801
9206 46619 -212505 -238807 -3654 -104542 -74796 72811 -40822 176157 -191849 23692 -4164
9194 -202078 -147742 -239457 -390899 164358 79006 -183020 -62261 -281747 -267158 106104 -60675
9182 137960 8689 -41353 -6120 83243 18303 -153722 147431 -52216 -168691 1158 69546 226696
9170 226696 -65004 131773 115699 99956 -85120 -29314 -216133 -74363 -104913 24441 -373058
9158 74126 38241 -86074 -73892 -261924 -130319 -92156 -73196 40794 345315 134403 132612
9147 132612 -51104 -39336 -346949 235014 120720 -257605 -31855 22646 -71299 -54611 248763
9135 44754 -149463 -14551 -279199 -39573 70666 140012 -72706 -290427 440014 -95881 -64242
9124 -64242 -222259 217164 150803 -275151 283647 -20279 223207 61807 -26340 -122797 -25615
9112 -115324 139491 -192501 5026 -108929 -377849 140991 -141462 -29281 -172043 5331 211984
9101 211984 70112 88245 44660 3769 -60425 -72827 96685 -196115 -174708 -45620 -108879 78809
9088 -28700 76754 55326 -59211 -97889 -234008 -68548 127415 -132645 -100780 102841 -162102
9076 -433398 -202441 -206414 19521 -294116 -165096 65540 -3048 -78444 30953 40861 -196179
9064 16352 -66495 60203 -302505 169126 -151615 181098 -142395 -118752 -82383 58834 292372
9053 292372 -20361 -5195 -13103 60363 -333827 -120844 62296 54580 -316552 -116099 -315970
9042 -315970 -355459 -63869 32585 -175334 96211 -78166 -224666 234233 -87611 -118878 48129
9030 337421 -148570 -149682 -70891 -193708 48638 209817 10560 -134633 -309152 -168405 -173858
9019 -173858 -189106 -332308 -406916 -325990 254011 -242947 -160093 21714 -26774 -341919 128011
9007 15261 -17239 -195220 -184080 22711 -163652 -331019 -229237 -420578 -89207 -324776 92565
8995 239311 -68976 101079 14968 364999 -108715 -129357 -207092 23524 108052 -239780 106692
8983 -64693 -111087 66155 281818 -255219 79490 317960 -223970 -56031 -40770 -11175 -79013
8972 -79013 71070 -313394 74974 -43342 56333 -50826 -85628 -47704 166655 29716 -140804
8960 -116915 14080 -99221 -110740 144707 -268338 -113856 -141488 -271527 76448 8219 -250238
8948 119069 -327044 -335933 -231625 97915 -272294 -389130 -292528 75244 -55371 78329 114520
8937 114520 -131067 38799 28284 217813 104799 187961 -26767 405738 -142171 -44545 158997
8925 518731 818993 1032362 1299498 2726126 4954694 1389450 419120 545121 -28572
8915 411025 211435 -140442 358524 -11195 -15801 -283921 242912 136995 -550098 8930 -157266
8903 -319468 150401 136632 -92119 1874 -326520 212272 -13982 335738 -11991 -61707 202864
8891 4032 3261 54668 -367595 66966 22324 35669 20564 -196945 -196563 -142778 180830 -73558
8878 -54981 -287318 247346 -263685 -4669 92654 44443 -34504 73600 -494735 -19531 -92386
8867 -92386 -125292 -235243 40978 -73838 -53227 30460 -57484 -67014 138847 -130898 -134819 12033
8854 6277 -222344 56024 15188 -342343 -171314 179976 -82973 188304 -17335 196455 292693
8843 292693 -148822 -300071 72322 58103 -81066 -150818 5720 204377 156948 -37786 -64030
8832 -64030 -76778 -169825 -317160 -8007 -112100 -47209 -54968 -187922 -322181 35305 -189473
8820 93171 -38237 -282531 201770 19789 -58755 -33490 -223679 -6163 -157673 -413070 -151929
8808 -173827 -304800 -48250 -149445 89643 -53430 157033 -205968 51624 -209742 -91125 290211
8796 31184 71205 12135 158896 -299 131815 96502 -237852 -45006 -193820 -145019 -133196
8785 -133196 -176819 -50430 -222068 69012 26346 -192306 -62640 -77171 88599 61607 -30924
8773 299525 -161469 -46851 -42346 -183395 112045 -78634 -109054 69385 -86494 -71898 234439
8761 -248059 -441285 -309647 -338641 -101243 -86236 148427 35110 166195 335 -237369 29250
8749 -507272 -128129 -475401 162216 -42880 -309801 5809 -341039 -186187 -127021 -247317
8739 -247317 -197415 -465614 -191002 -161508 -54300 114622 -124518 336238 123381 25896
8728 96406 274902 202483 -94764 -132497 -148636 1832 233573 62659 -263953 -45788 54597
8716 49235 10788 277247 -77836 273086 85409 -43165 239556 147444 -25495 -16339 150863
8704 397945 -70476 -152478 -305176 -224523 -322770 30203 -54389 237816 -56350 -154077 -350491
8693 -350491 274397 -150763 103768 111325 -268215 21955 -165808 -44896 -32502 47691 -171094
8681 -95738 -330963 119988 -377913 -100965 -22846 73826 118207 -59263 221489 -51863 -63759
8670 -63759 -114575 219614 -263870 -363984 -70343 -99655 -65764 17805 -115669 -154304 -25439
8658 94463 -260771 -126011 42270 219683 -126864 -194563 -124743 104558 -97147 -67375 141182
8646 -2257 -55290 -84449 -6362 -69292 -485985 253057 34768 -277805 -45828 138599 207987
8635 207987 64807 -117219 -55787 119975 -17722 -41027 -135318 -157348 -13704 -357133 -101964
8623 -106508 -38367 -266609 189969 -135292 250401 -266595 -179440 77897 -38017 -452201
8613 -452201 -327246 -117959 -8389 -2181 -188695 64553 -97665 -71455 98611 21585 -164007
8601 221950 147252 17389 206115 -107439 -168292 -167469 -4019 -28129 -254888 -69112 236896
8589 17240 -14282 -82893 -7580 -194853 289850 -389485 -119236 -187078 -78429 154576 -225612
8577 -347947 -110950 -127397 -189222 38469 -191975 32366 111140 232376 -25708 -1105 -189548
8566 -189548 -184532 44490 145435 -151984 -197956 217728 69857 63014 -196345 -210229 204109
8554 -63037 -53153 24547 -50745 2260 24572 -205750 -115916 258555 -51958 169771 116871 -187634
8541 -103679 107461 -435093 -111070 48241 172404 270249 -55239 -329759 -71864 -173325
8531 -173325 -58398 -101445 53306 -165779 -51723 -201606 -256647 46220 100046 -325086 25296
8519 -189023 -54770 -267884 -329659 70372 284818 -175298 -24884 41381 249726 270836 -131287
8507 -168410 9987 -169601 -76552 -382807 -57979 28780 -179283 22182 41918 -104616 163550
8495 62594 -88591 90702 -21330 -82198 151934 -328596 -78499 119162 -222502 283572 148018
8484 148018 334637 -106885 77398 -247165 -212735 -67292 -211992 -161942 97139 -345295 262396
8472 232606 201696 29273 -61715 -212433 -194394 -80335 4929 119461 386402 178406 -352169
8460 -260027 62190 -22076 193708 -25066 272756 -16956 -10603 -59196 -104849 52114 -39868
8448 -148588 373619 58682 -23860 311916 -78378 -6542 -173928 193211 222683 254900 165427
8437 165427 -338534 -385597 300027 -216116 -923 109804 -220687 -178616 45992 -72692 144899
8425 245402 37348 4931 -192563 305727 -91657 45208 40434 120906 -249416 -281075 -275353 -26788
8412 58086 -64532 -53369 -72491 -160522 -24086 -14646 51126 -224533 -322187 206217 -431486
8400 -138602 127683 -147707 256541 -50179 -14932 11160 30392 -50326 -17463 83817 -257024
8388 281259 27621 -136051 111466 140219 -497 -84651 -82134 -425399 232225 -10699 211511
8376 -159667 49891 313522 -288586 56618 -9141 -233187 -164621 48239 -39899 -112163 -77113
8365 -77113 -468810 -183129 450914 36359 -234002 -49457 -102693 -72397 354951 -15568 -141588
8354 -141588 -163715 -110950 86371 65279 -272544 -196932 164295 -34989 -84374 -143286 -144182 -17613
8341 168185 -49938 63496 -27494 -46923 -81882 124363 50372 -362209 -76091 -520 -101665
8330 -101665 -158235 -90605 -48393 -46377 -72528 -255753 -371845 119116 -36839 55536 59263
8319 59263 -262097 218258 -158544 -206349 -26006 -200989 -298525 164358 -73180 -79603 -291132
8308 -291132 -116381 22111 -93984 13948 180769 -31569 -209204 -78113 -152659 -53860 -252264
8297 -252264 -1332 99676 131972 -499790 -54142 164607 -121047 52555 -42068 28780 103111
8286 103111 215294 -48695 915 -239854 -146265 -24749 -33273 -87896 143860 -196607 58408
8274 -276074 98327 44001 46061 -12255 -426992 -73597 -10177 93773 50363 57824 -113536 -141935
8262 -141935 70629 -245292 -28415 -344859 -13220 183113 -57176 -106020 1045 -205134 -35442
8250 -189556 -107149 8207 -63476 -538088 -191374 -125195 114449 -56423 -136230 -151416 -419661
8239 -419661 40082 36348 -169629 -105346 -116054 31992 -61670 -398365 -240085 45081 143533
8228 143533 -144666 137446 -160102 -21514 -170214 298626 -272075 9600 22320 -109467
8217 -36233 -285438 -155522 -394694 -198340 218625 149244 9417 50261 -169699 191584 -53066
8205 3974 -514637 46800 -98581 13713 36169 -463675 -41404 12032 151339 -189132 13538
8193 -17940 298060 24990 -394633 -38292 174847 179884 -145120 84944 -92012 -53533 340358
8181 -527954 69293 19181 -66323 226638 -188590 -97021 -156919 -106548 -69118 -45576 194259
8169 -38958 25120 153137 -199065 104987 16408 8770 48952 214569 -203996 -415898 37445
8157 -161233 -198081 209398 -151023 65160 -332004 -266999 -367731 -241316 50146 -38011 83250
8145 157001 -2046 68442 -499506 -125767 -124934 -179086 -27895 -271578 -161380 51540 -40566
8133 242294 -262422 -515735 -100349 -33769 -254426 -105463 36654 363203 -26379 -216541
8123 -216541 -234567 -135983 -159171 380293 174965 171031 72617 -154793 -83262 -55322 9312
8111 173352 -329208 -241926 343281 -45919 214807 -5354 51453 222466 -74204 89139 124957
8100 124957 115781 75483 88584 -167442 10457 -257738 -418692 -345222 -562 -223722 -174251
8089 -174251 -167785 -470505 153227 -138672 -93469 -317144 -126742 188236 -76135 74837 4964
8077 225846 -99118 -55175 -154319 71946 -1673 230578 -136598 -133512 -163546 101461 36909
8065 -64702 173973 -12602 -178723 -68456 -97748 -112813 -30406 -10538 -61116 23365 190313
8054 190313 -265854 86901 -102750 20065 78730 -7251 -8105 -238874 213450 -275356 4277
8042 -259784 -39589 -354609 -111374 -22683 112873 35480 125943 -16002 193842 -81074 291506
8030 9455 -123485 -52314 1577 -311351 -74132 -315445 -181930 -134339 78180 53307 -228826
8018 121599 -180259 214500 3255 -76414 -430348 184671 -145926 48665 51475 -68755 370437
8006 14207 104209 -176863 -29022 118444 72012 -144570 36413 -93898 -117365 -320256 168375
7994 151666 79277 306927 14205 -102534 -68999 -38928 -133190 153114 -102718 -82305 -59465
7983 -59465 -337483 26847 337180 277163 -356803 -20330 -248702 -135829 -121849 -106982 -261717
7972 -261717 -219398 -80401 -345220 -386579 -25260 173864 -302903 56509 -94050 59146 81705
7961 81705 7193 124698 52266 -22523 -226012 7770 63195 -364825 33485 -257337 -147968
7950 -147968 176544 -84956 -231826 -69414 -200996 -52764 270668 -10406 132009 -10242 337555
7938 -253655 -76857 23041 -336185 29878 -59764 -67764 -9336 194910 155197 -444512 82309
7926 -178733 -124672 140618 125493 71648 126035 231522 -116568 181558 -15152 -211182 -308826
7915 -308826 90793 -402877 -42274 -75931 211725 -1476 -83698 39500 -260817 -93481 68557
7903 -264280 212929 34625 13613 46294 92553 131347 -61308 160918 64632 -32473 235954
7891 -435978 152272 13078 23862 -158422 -114307 -246301 162803 -69553 113651 37149 -301030
7879 35049 -304474 -315472 135590 -212921 -358136 114436 201069 328334 -174706 -161738
7869 -161738 -16415 256213 258639 38669 311733 -9172 -160947 -118885 -330940 -39030 -282026
7858 -282026 -386244 -178382 37464 102524 -452228 39048 -66110 -54874 17097 -53841 -81423
7847 -81423 -204387 -111310 -3961 87702 -227715 -73978 99962 -85519 -115401 73420 -53611 -10921
7834 -308816 -165003 -254938 -146252 34400 23536 -220475 46277 120039 14842 -64249 -146239
7823 -146239 -385056 -239465 35656 69400 -71370 298171 118046 6033 -209349 197156 -8811
7811 37258 19651 -204692 -141247 63434 -219361 42585 -172616 -163251 119244 147571 128777
7800 128777 250853 -42547 500838 -243007 -99900 21853 -606245 -223664 -335884 -52037
7789 -125046 -297315 111484 167575 -198235 -214741 -152126 -381137 -36319 -21543 69988 -253221
7777 -102825 7219 -419986 -49294 -163347 -92020 -217782 255726 -14847 -42200 -66740 180633
7765 -98213 -17171 -8236 -102257 -159781 73312 150831 2160 -269612 30888 471057 188225 139136
7753 139136 -214369 -49707 -307332 194891 125635 -242742 8288 430838 -118651 -156041 -287811
7742 -287811 -96763 -145421 -106721 -23783 86022 -55946 -49814 -447 263345 66271 -61849 -416425
7730 -416425 24471 -78945 -146308 -69782 103231 -77121 -29577 -191088 -31728 -270973 -17328
7718 -285649 -400514 511773 -236752 -79442 264084 -71316 -365198 -149333 134826 -24856
7707 -220508 -245457 -41555 207822 -80904 -47250 -67313 78194 335031 -255063 68162 -264314
7695 46611 -62573 -89561 242511 79024 1717 -77331 -225835 71079 -114312 -244749 96225
7683 -30391 92173 66378 110077 -16081 118143 -132406 -280887 -114578 -181056 -8386 284885
7671 24853 -255092 -143814 -332982 96377 -34288 180813 199359 70204 6054 -41238 -224201
7660 -224201 87568 179309 65028 -2692 337066 184874 43485 -44808 -180764 -10259 -434397
7649 -434397 -257042 22512 202600 86492 66430 73306 47728 -106567 -168174 36688 -139561
7637 -122907 252566 34561 173853 99537 16486 68432 39793 -185422 279027 -81286 -147551
7626 -147551 -154479 241006 216734 26248 -318514 136011 367278 -453601 -57036 -86916 -29960
7614 164213 -36640 -258725 -251266 -305348 -158152 201453 132570 -63220 -270376 45577 -23800
7602 -157935 -80908 12078 -309923 -230769 63954 286050 81013 -54462 103954 95794 -160900
7590 -716 27950 -7508 -13069 -28119 153652 475531 64008 19985 80580 25326 -165027 338041
7577 -248607 -231061 -185497 -85265 297458 -272510 -145725 -60249 -29293 17704 -208219 80464
7565 -152281 -236339 -196332 215262 -53909 178797 208318 -27996 -209695 -207970 219724 -218283
7553 -58508 48315 204013 -175481 -349896 -260074 147988 98710 93010 28212 -332389 230220
7541 -112345 144916 -118924 -111161 -95891 -20129 -460790 -312294 61333 -367244 196253 -111199
7529 -334158 -250857 223899 243200 -319895 -381241 -173708 -233605 -249899 -86471 430156 -241680
7517 38820 -154958 -211248 59388 -3531 7289 -176023 -55592 461773 -77178 41909 -266047
7505 -61710 -215021 -107269 96896 230029 -247857 -122079 -162296 -236795 188076 -178066
7494 169567 69754 -58999 -76735 -2405 -208378 -307303 -78629 96794 2366 134714 -41954 -358527
7482 -358527 -96797 248193 -298808 -60348 -125770 185778 72838 -73750 116239 166395 -192035
7470 225599 -225724 -190702 105781 -228161 63526 -212425 405617 90622 9068 2746 184959
7459 184959 17407 -901 60202 -53500 -14536 -131585 -2464 227779 240372 -69341 -212347 -10193
7446 64552 121414 5297 -483219 -143247 164989 -208183 -124781 -578965 127162 -72402 -58062
7435 -58062 124919 47326 -167407 69273 45983 -33854 -69582 -153537 141941 197970 -20079
7423 -69055 10048 -231609 -125818 81242 58932 -379005 60750 -59661 -79250 149049 -344011
7411 -131806 58112 -283569 72170 58395 -181775 98453 210041 -303359 -56045 144975 -211515
7399 163766 -291322 -143562 -304987 283607 -62192 135262 199139 -226372 -178029 254741
7388 52394 -245263 9441 163319 -257630 167851 -57661 -20477 -68004 188816 29993 -352142
7376 127384 -334021 -245269 52146 -21948 -8387 -179400 116675 -429643 199647 -266058 -69415
7364 91018 -245217 81362 -175133 -76453 -195726 -93832 14996 133025 -52045 -115810 -36357
7352 -159351 -59055 -72738 -2548 40454 -6195 143324 -25638 -79243 313557 298855 17033 175967
7340 175967 -36485 225180 -6110 34498 102749 -182687 -42227 -289628 -135570 71579 -277999
7328 6622 149420 238703 -161884 219198 28417 -38901 -183150 -140265 1417 67455 55339
7317 55339 -38403 -169979 103225 58243 159887 -68066 -193883 -476830 183146 295752
7307 295752 -184072 13422 215790 -67694 -122234 154673 448413 -199500 171101 -204567
7296 58417 -29056 316936 20162 -64473 135500 -226126 -248911 213332 -35657 192541 -287645
7284 -149338 38001 -226203 -155223 -111816 -105821 -287832 -139238 125889 2544 219943 -20856
7272 -213637 116674 -107222 -118902 -278245 34946 156177 106297 173944 -166350 43436 167315
7261 167315 32567 55178 -50744 82834 -303039 -55225 -134522 -326422 161094 -218741 -17329
7249 -192680 -189707 -76579 -47357 -225177 219382 221459 -56877 205282 -60613 144123 63424
7237 532773 60184 -29968 -150893 6613 134854 93669 -324480 160593 -249253 -114058 195466
7225 -106905 -254475 391166 65480 -198371 -77025 -252395 -14696 80255 -116773 6314 -330843
7213 -99088 42281 239975 34267 -95057 -266300 -321493 -53338 17155 -96198 -103034 25685 -420633
7200 211635 102258 113211 78396 -207468 60154 95367 322393 -101797 -131068 7169 343545
7189 343545 -109770 119613 -19434 25907 -156958 -208193 78176 -15916 -393052 135934 30484
7177 -317133 -256466 -29213 -85176 19479 -49037 12861 2219 15965 -48606 301622 255393 -119205
7164 -298217 -179839 -77500 42559 102322 319121 88760 35721 159152 -149612 -220601 -180251
7153 -180251 -74513 104431 -6507 56741 21723 96123 -282298 40455 -45484 -22459 -297042
7142 -297042 66931 -110487 -290662 -46772 73011 171621 51714 -86142 -226085 57190 -386397
7130 -284828 104548 -178233 -91363 -28320 107716 -289889 392379 -73418 84793 -8034 91571
7118 128045 -20454 101171 -17419 -160154 -61904 -173583 143573 -112175 -462817 214496
7107 -165780 3599 181489 169817 -271195 93919 -254329 374566 -172191 -308851 -148708
7096 -210627 5844 84796 -76147 110888 183743 -119530 -47033 -83677 -263063 -235718 35074
7084 -221865 -353006 -255687 -118493 -101806 140942 159050 58574 -216402 -88862 28481 251381
7073 251381 42010 -230073 24496 -471097 -293144 9301 -83276 -284512 -168032 9334 38802
7062 38802 91068 -27334 159964 -191527 103908 213565 -237283 161218 -37607 230715
7051 -182949 -43375 -164992 -332306 10327 -206616 -37523 -38412 -134214 -444376 133123 77173
7040 77173 -310931 -113746 -231629 -117891 -89973 49353 -6205 -240127 -121598 -108276 -268544
7029 -268544 -367956 232892 80050 39201 -46445 -68316 -145794 -91888 -195088 1084 82266
7018 82266 20327 -16937 -108634 30971 -35862 16553 126428 309207 -141583 24369 155079
7007 155079 184443 -68472 59758 -183704 189874 158917 95316 126353 -263255 -10189 72781
6995 44613 -93156 -12003 -224858 143146 78222 -77765 -179276 75402 -14696 17112 -138202
6983 263148 305998 -77122 235840 16300 -262954 -38036 -206380 -96921 229636 -42833 -70714
6972 -70714 -277608 212538 -157063 143538 -34640 -252406 -60055 87278 -104738 -9732 -114448
6961 -114448 20190 -47988 -120264 -186803 -78997 -258435 -74747 -139227 -334299 397 21090 26104
6949 26104 227959 16013 -360982 293752 30217 99747 157651 -119773 128311 -115504 217476
6937 88441 196804 159977 20842 -190333 -172369 -57165 -92066 -63085 -7721 301425 70656
6925 -56244 15033 -402371 -76955 -195484 280977 -254702 -116835 -23120 -23229 -223351 -179173
6914 -179173 122778 29609 -86187 248831 -148011 110149 -2305 413347 187514 -10520 56510
6902 -59019 -32740 141077 48991 236871 -236350 -40746 -296 -20504 59026 -460086 73738
6890 108489 -166547 -53711 -38667 -195249 -215222 104158 80783 199354 132955 -190836 173649
6878 -97940 -840 -263779 94021 -112612 -80328 19998 -234157 -242893 30621 94841 -312963 103434
6865 164572 283165 -506821 -229760 220141 351832 -402421 -19733 104717 269851 -87426
6854 -401467 -20987 191983 -26496 -258637 -56687 233561 295552 -269719 -10792 116519 -84615
6842 36504 81615 -259810 -13909 -198113 343693 -162876 -412260 -41320 72551 -335645 -163926
6830 -48219 195677 213813 -48342 -202705 40092 -90210 239377 7829 188003 -270540 -237110
6819 -237110 -33212 93224 190300 -14897 62635 84103 352116 81851 -179586 379789 -303582
6807 -27671 370 -31928 -18010 63303 -102160 -104133 -25810 -996 -158948 445299 -35428 -394018
6795 -394018 -34159 -190992 154571 -22925 11880 159262 -105906 208018 -55288 137976
6784 9020 -245059 -248907 25089 -22052 -33633 -147658 20343 -83741 -404855 -206397 -59992
6772 -91749 -243707 -71322 -6490 -249948 169213 154126 -194377 -139693 20361 43006 206493
6761 206493 109411 45187 145092 -71539 86155 29502 316108 -34373 -19804 -227738 113426
6749 35447 -31365 191416 -148041 89994 -85465 171584 -199098 386864 295796 38341 77113
6738 77113 182291 -355183 251598 -284746 -432747 304621 -370000 201966 9163 151372
6728 151372 -187294 -21142 265802 -254604 350255 111753 -59616 -29647 -110441 -243337
6718 -243337 -106748 -129299 59492 21584 -400851 38648 14174 -36151 -201605 -76213 -224360
6707 -224360 -36100 23780 74328 -76450 -115058 -61683 -249935 -9293 210233 -146598 -13838
6695 145083 -268120 148165 68829 -180207 -36906 357874 -107911 77522 389420 -92816
6684 -120284 -88289 149110 -131771 -68214 38849 87524 -255714 -51460 2220 -12761 -119849
6673 -119849 105013 123652 -9287 -86369 -114698 54 -189806 -154901 -19667 46749 -122395 -25839
6660 288278 -188366 131366 -163972 -335445 138689 -64118 270135 -236624 266255 52074
6649 -272913 191111 -354676 -44973 -138819 -316956 -199661 -439326 71321 195265 -63949
6638 512036 -173432 -125846 -60839 -97916 -323124 94035 39484 -2599 47724 303359 -290343
6626 139038 153592 -62395 131538 -30462 -31917 97032 217220 -95280 62828 32053 -199888
6614 -51926 -167787 116953 -501583 -198154 -61440 -14709 135185 -11849 -190177 -47210 -175331
6603 -175331 -155811 -101923 -58165 27915 75412 -152451 66778 32930 44715 115247 -40031
6591 81090 36054 -73432 -18992 17129 97110 182907 36860 -14469 309816 -59689 24580 -84864
6578 271809 -474 146384 -145066 60210 336307 -181335 12962 99131 226740 -20220 -292561
6567 -292561 119590 77044 148216 128113 -67639 -327549 143615 -190401 30183 211023 -252308
6555 -178609 61584 -104221 -285191 250541 -5417 147901 87303 61568 81353 39783 -214446
6543 -213182 -8625 32217 -106144 -30176 414661 124758 24314 -116974 4806 -152030 234721
6531 27593 34181 101270 -78683 -28910 -169484 -256081 -216293 -208960 49074 39929 -63118 103601
6518 25311 179619 -31348 -184538 -158207 -275025 -18429 30666 161852 -41069 307751 114272
6506 -21277 127711 -295783 54970 33078 102070 -96495 -272537 -282912 94638 409412 43729
6494 -44413 -509528 -246160 41188 74237 43352 -84290 -335707 -92647 24897 -150802 94381
6482 -44922 93483 -453597 41985 86326 -13312 107951 -136446 299926 34752 -215378 240076
6470 345347 141549 -279844 16304 -333173 174000 -305841 -339 -147090 -246290 69137 280351
6459 280351 -249197 -42141 -344963 51051 -77007 -273968 246312 -210789 76462 446 90421
6448 90421 57796 41636 341661 -131664 58164 -16790 113740 64019 -124373 -484219 -120244
6436 -299309 51989 -318670 -167790 210777 -168851 -263857 -64140 166969 168552 17658 -138537
6424 9679 -211075 -75074 42266 -315516 -142376 295870 -267971 114616 65829 -62887 269303
6412 269936 111416 133284 78012 36132 166350 -48554 164909 189451 -30338 187943 77708
6400 113081 -18838 310430 -210691 -249274 150221 75628 -186616 31108 314483 -71769 -89293
6389 -89293 60474 -138802 -112197 -138306 -69011 113838 -61245 14316 -106928 -231858 -151094
6378 -151094 -118777 -55537 -99387 47100 -416870 186621 -134393 115355 -67201 -325631 -104361
6366 -59488 -276187 -100617 -147174 36819 -363429 -30666 -262538 17358 122780 -232943 237407
6354 -230986 238907 218315 -59410 156388 77065 185166 -18731 153025 23803 -108223 -231719
6343 -231719 -160741 -105646 -162796 358906 67203 -303591 237726 -115120 -77097 -7794 -10030
6332 -10030 467795 56254 -198142 -32207 -165015 -308480 -63045 -40737 -194213 -321461 23675
6320 -148885 41327 111501 -404989 286657 -29010 -40888 -20975 -138774 -111600 48 72300 -32455
6307 10885 196106 22722 -119181 -311227 -78705 -181289 -17006 6722 68664 -43331 -190478
6296 -190478 35026 25300 -379824 -4709 143391 -244967 157750 -52039 51845 88795 -43538
6284 233873 89699 -45647 -159469 195839 42082 175257 -227293 -288411 3504 124586 48793
6272 166760 -171478 5759 16239 31778 92052 39954 296365 -252896 -213459 -57904 -131066
6261 -131066 13860 143209 185483 -22412 -117380 183660 192011 23447 111490 -62690 18245
6249 -91631 -6771 -172463 -169633 188501 136234 76035 31645 -153561 -223248 130714 -337308
6237 -96011 -45153 61407 -40416 133622 66407 -205097 114201 -300392 352875 -225713 -35053
6225 -190895 -168193 -79255 109283 307216 -15967 88674 -63137 -61070 61900 -92151 183343
6213 26199 -331852 -131039 -36605 -152318 332766 -337407 -54075 -181124 5356 271400 29314
6201 -74929 -32879 226731 -189354 125641 -217693 289318 6309 -53110 -250376 -232346 184807
6189 255766 187251 -165007 66401 -204385 229148 -221390 104835 -132617 -30481 9099 64133
6178 64133 -191983 -132736 -263889 -309493 348949 289604 134355 -1540 -128270 -189736 160491
6166 -94450 -122374 -130970 -13896 -223122 -23201 116559 102137 162049 16685 72065 178932
6155 178932 -143512 36340 275743 149221 80327 89925 100232 64140 -68927 168185 -321418
6143 -125192 122153 -159909 24272 -143443 -202508 -28333 -106806 27930 330971 -320902 -218965
6132 -218965 -41060 -51005 -29599 -63882 443616 -124905 -3839 263639 -52931 191828 10975
6120 -5581 197937 -308965 140283 115417 -184123 145876 226047 -101952 -201577 116136 34837
6108 -286045 -309877 46612 -45457 -58044 -100152 -317510 92765 252609 -14452 93223 109622
6097 109622 421284 92708 -140863 -354458 -103409 282786 -14907 133075 93367 -128167
6086 299905 84383 -114226 46157 317869 -240056 -48745 -141582 -87153 -125308 69840 -89431
6074 30907 -40794 208016 46817 -160 -207360 35518 118982 -354130 -156306 29730 45116
6063 45116 39679 -96786 -214869 524963 147285 -36364 252513 98000 238760 38806 -187282
6051 -52291 11261 -121260 273682 -178481 -32256 -149553 -115409 -255372 -125498 -21008 4362
6039 -12474 20085 125071 -73879 369706 -65436 24269 -248461 119300 83397 -57393 -132531
6028 -132531 -88198 -63329 -165278 42954 -101947 38254 -129769 -30943 143112 67520 45668
6017 45668 87875 59342 -167737 -33446 179793 9486 -9116 66409 79022 82328 -86148 -3549
6004 218414 26549 228611 -110786 -248729 157075 -46389 -40754 -183210 -226283 -65026 -336830
5993 -336830 258413 -45204 -145291 74390 233335 183472 -93598 -24330 234170 266598 -137960
5981 239618 -217062 -54728 322122 11483 -131836 92437 133834 -207287 392792 354792 207566
5970 207566 -70953 -316169 166562 275182 197118 267744 -123794 43840 76645 219249 252807
5959 252807 -114393 -13851 -25188 204117 -46960 -41657 -219652 169720 -10438 -427343 45611
5947 53393 20631 -273444 168315 -73210 -16922 -238951 72923 90050 260535 24650 122734
5936 122734 -20641 191428 199199 90190 74503 122414 -139398 -61406 175716 38188 -160049
5924 213344 301 46000 242098 20244 211784 -53743 57519 -251824 15500 -211615 -160203
5913 -160203 -206570 123741 -250363 174724 67505 -162853 -100819 84902 10098 363932 65592
5901 -141659 350803 -2760 -308416 64386 -148708 -326669 -140753 -128008 41091 212739 155464
5890 155464 204230 -49325 -162299 -328337 111135 -9315 -255292 -67909 -37579 82081 -284002
5878 -123519 -356598 50003 73287 -235610 -362666 -27322 17812 -144542 -90868 154161 -5302
5866 124570 -88822 154448 244136 -76468 -17975 118592 271224 -155027 -117371 -226785 116736
5854 -88798 134012 -38305 -295344 233918 99727 179377 78802 -287981 25126 236191 29793
5842 -293593 405002 61969 -306959 190641 -144193 192662 35729 5083 187182 -65997 -91593
5831 -91593 -339883 84419 -107838 -30219 -78713 -22496 -57907 147446 -309467 -126910 -59758
5819 179704 -62293 -276129 80201 -106605 -134623 206917 -228004 -277055 237967 105481
5808 -18404 -25868 -175798 175804 164954 -102225 -74472 -285551 -33920 214378 257102 -360891
5796 50202 -10320 -10864 -276190 -317877 -67648 -288765 -45732 -156167 302966 -103073 236137
5784 -216234 -123439 -46086 83851 77526 -194530 -36395 22539 85344 171600 49297 2114 -262560
5771 -157676 -155421 120288 -299219 98087 -145429 334808 -217260 -112367 -113952 30176 -71717
5759 90686 209360 76268 -359138 197605 -775 218328 -5184 272429 -240800 95766 208936
5748 208936 -47736 308713 -36352 116159 -162252 96824 -263744 -117359 -211458 -206247 -30349
5736 77813 153087 123765 -141643 109604 217610 -112326 -34228 105331 -201525 212360
5725 -13458 -48534 79406 362226 -233021 155127 201912 -126292 -76994 -82344 -66269 -16192
5713 -18754 143342 561478 -259861 -36996 64046 -50113 -101627 -130026 163698 -243807 -106638
5701 -224558 16900 -110606 68220 -162353 117607 -370844 44624 22312 137061 185843 39636
5689 -187183 -94764 -14273 135324 -240253 241294 151844 4449 83408 -174577 -1618 158125
5677 -24815 78084 -199199 -133244 -193369 51515 88861 104307 17219 -202506 289674 -227887
5665 61071 84380 -160936 -35065 182981 -69496 -32128 -72891 -73240 58743 -84813 -113844 -98581
5653 -98581 -26283 39620 13394 -91951 -18645 -94041 124087 235631 9269 -135437 238811
5641 -2961 -48878 10142 33951 -42610 134225 140445 149109 184102 -245394 116070 254991 112690
5628 152144 27786 -199452 -8704 75649 3545 37696 -132184 -336371 -160929 -24940 -90754
5617 -90754 251261 -58078 212710 161244 132553 -131366 -115502 230112 -123783 -120259 -140671
5606 -140671 -132865 -96062 158637 159665 -35587 244183 -333125 -15770 -165743 -43549 157250
5594 -28083 289203 8748 85177 -149569 -312908 -39051 -55091 -189834 -230925 -70768 -15902
5582 293010 270956 -235663 99064 9687 69115 133002 133098 -150307 34903 195791 80178 10793
5569 186762 53066 85489 192689 15130 -256901 75185 163757 27004 140049 -115 -216089
5558 -216089 -67649 -139389 223255 -19090 89354 176701 141904 -125790 -78772 -335042 107712
5546 83466 140077 -59776 1913 -30156 12631 225761 -94720 -104520 -34767 51826 44167 349440
5534 349440 -43088 163816 122562 -127420 -8208 -383558 -38081 -24804 -127635 175292 137494
5523 137494 -47938 -193458 401309 -61028 -12653 96807 192777 -104136 -184064 -469432 -256280
5512 -256280 -183730 -227134 -87340 253305 155103 78601 212725 -213348 -122069 -188093 -135607
5501 -135607 142868 93573 -5900 -125998 18612 -9091 -208723 218005 -59724 -14182 24895
5489 744 -151559 -140907 -147356 -30810 60455 -98540 -307753 -181295 141093 -76017 -150737 -262344
5477 -262344 345058 122106 330424 101216 395567 523830 -10085 102177 70963 -180137
5466 56421 228286 -123879 -231689 -159246 333577 126322 -155700 -227428 -58565 -61957 36447
5454 -190370 45207 -64835 109069 122506 4908 -179660 147824 -275945 105110 155904 -132349
5442 255192 -118404 -13705 -53376 -275734 233794 26389 208678 123561 70899 -73798 -254600
5431 -254600 131029 -21106 -142113 6043 102848 -106294 -23433 -140335 1012 -70245 -12104
5419 376037 251974 -288420 258550 -28463 187597 427917 -80436 64499 162077 21561 146334
5408 146334 72386 -20565 75148 -301318 -47877 64076 282213 142291 53915 42420 -281
5396 -342883 121655 -194961 -242591 52482 -93402 -223278 -184875 -67862 -43605 -39729 11914
5384 103930 -261046 -106662 -171425 59703 251403 -348778 -102985 -58840 -326701 28545
5373 138481 -98894 69399 -62259 69882 51626 37201 89230 286970 -162558 -109307 153804
5361 -266394 260344 341254 17067 261803 -402566 172845 -111234 -104644 310496 25650 -169767
5349 78705 54675 -192594 78685 -112503 -343314 -67363 137677 269689 82384 -212120 140634
5337 -52094 69927 279314 310267 192007 -56950 61357 -40790 326256 191771 121437 52685
5325 -109133 55473 210705 -116914 127556 43366 -116188 -70377 -40539 125263 -108333
5314 -135710 92128 -129037 180975 90011 -189098 -63064 -35879 91568 293361 -241538 70146
5302 41370 286213 -151501 39646 -181958 -162726 -104427 25660 -277723 231735 25883 -151419
5290 -193582 120080 18576 -200022 -130241 14971 -74542 -231414 -218504 -69366 309962 186184
5279 186184 1065 23973 -65956 -113927 -76912 214248 234020 59885 -180627 -98343 16831
5267 -111492 -341246 -216896 -183412 -63999 209288 249152 -234160 94145 89925 -269081 106938
5255 -296865 -1325 -59023 -166461 -35250 301676 -172994 -58142 206703 253862 106418 -253207
5243 -105927 21065 83727 31371 243866 91521 -37621 32127 50161 184762 69851 257619
5232 257619 -53409 -170335 60612 -154519 -428964 140074 -17726 77586 -74853 80927 10408
5220 12907 -95427 -65781 26874 -64999 52388 559459 -122834 18834 357728 112624 141074
5209 141074 -285413 -124204 144080 -105380 175477 -8214 -176395 198162 68205 243076
5199 243076 23207 316793 200445 -115760 -204867 205608 36810 117382 -62153 182138 -38262
5187 136624 165438 -123100 44498 165657 -136024 266988 -265678 -242997 415389 73708
5176 -156331 99833 31354 439019 -297562 -40044 -113935 132591 155539 -258586 79628 -152983
5164 -203230 63578 -62600 76005 -27598 46233 -246351 -472602 62488 5024 107765 404011
5153 404011 -68785 12647 -152413 -276685 2353 -168213 -261967 58937 436141 -100570 116498
5141 8351 24839 -215247 46374 143319 299461 -134675 -96174 -139667 167271 -179233 -19497
5129 51381 121444 -235460 129749 178416 -285568 -104850 197946 -12720 352925 -48554 138828
5117 -48383 218997 -117319 116700 -49258 111889 -318441 83449 -171814 -191361 126086
5106 41427 83628 -329447 55549 178334 73706 -77421 100386 324574 -35310 42092 103272
5095 103272 -47990 -179196 -118353 -127489 -196396 -3283 190558 -265861 -81547 115847 -307931
5083 8164 -161023 -332923 78919 -120518 -303537 -190004 -31850 28991 71662 190532 -44768
5071 135291 51469 -32540 -52067 247275 -165941 21906 -392006 -219105 -83041 -79731 166574
5059 -197748 136078 100499 78242 198899 -293758 32187 -190611 -259158 195796 102270 183851
5048 183851 53050 -338610 140275 223457 68180 125060 -29623 168794 12382 -93684 -187712
5037 -187712 -178053 -93682 -48666 141767 -73362 109835 -82070 -3492 -25389 -53561 -165025
5026 -165025 95244 -214073 2245 -126202 86376 -244785 32737 -13704 -286161 124117 169376
5015 169376 41687 -14782 266331 -148977 1541 35964 21656 370074 -189976 3139 39302
5004 39302 84705 210053 -251167 -143179 -272296 -290743 -57828 94663 -266626 264936 2281
4992 135058 -76808 -84799 117119 -305835 -221449 -114747 45758 -124935 61800 261174 -71366
4980 118764 259633 89033 14614 -168663 -22163 278031 -8949 -22099 138843 119264 201261
4969 201261 60497 93789 47036 -71503 138495 33856 94891 -145395 -220125 10839 -93054
4957 -128382 -140924 115586 3263 -334507 -134796 -132981 150566 -10515 164814 304053 -75825
4945 106798 32073 -27106 113394 183551 -10250 8519 -81933 -130477 -307868 110984 64002
4934 64002 -16352 -68995 182898 91654 -4683 130217 83759 -218843 158058 -134361 -13477
4922 191741 -69597 -55581 -23133 185658 205218 249878 -14005 -53191 -139345 86368 29700
4910 -31334 -20434 -136485 215835 -77120 95828 -9039 205329 20995 199267 259046 -68701
4898 -108150 -75228 17372 262941 102782 118565 53570 -162016 -2960 344406 118151 150879
4887 150879 213877 67309 123445 -16058 -324367 -12396 295862 136342 -125183 -190643 267441
4875 -394999 51461 444890 28860 258371 -122799 -4062 -32676 -168549 28957 271171 27177
4863 -4157 122135 -140165 187081 16751 -65460 145352 154656 -97804 171686 123536 -193244
4851 25100 52889 179660 138882 100623 73941 77756 -194256 -155683 246893 68620 7150 12548
4839 12548 -317160 301859 128621 -130783 3317 44862 42118 77340 -263686 -177964 -240085
4828 -240085 -17074 -203502 48943 169952 -149578 148603 10085 -24594 296022 131415
4817 242439 399283 -77722 -177037 200173 -127872 263990 178695 45916 -101500 118812
4806 -71407 116338 256104 -73652 -166109 381210 18156 -238396 -151869 -34016 -266197 -64421
4794 66965 -1992 8424 -18906 160547 163558 9613 81870 133580 171682 -443669 -57582 56442
4781 -59794 120029 384764 192102 -30784 -165551 -75131 -175391 23165 -65918 198336 -272212
4769 154678 -270180 94782 292855 -193491 -99724 75725 -47629 105584 -151130 89775 42307
4757 -11210 188537 -298739 -165368 124793 -161814 105525 226196 924 140143 311353
4747 311353 264479 -75633 -182096 -80294 -40837 32445 -226086 222831 34495 192212 86462
4735 141599 -16886 -101364 23802 175177 282957 -14660 109927 -136520 -127075 -59806 133846
4723 -52970 -176909 97410 200897 66318 -17725 118264 -371387 -412612 140468 -287190 15488
4711 -248955 83881 -56911 -35807 73043 -118495 -221944 391876 -229736 49465 138991 -206483
4699 145848 -284208 -158582 64854 163275 118897 43781 -375325 -53018 -83750 254250 395127
4688 395127 -191119 -361795 105532 -203524 -213300 149391 -35012 294850 17805 62047 2612
4676 291698 74003 -127850 -361071 22635 190753 24458 161535 263636 99262 94548 -204251
4664 -306165 -6775 300592 22186 -192405 -295344 -267640 293968 238475 132338 76103 -74995
4652 186113 14872 198953 127667 68311 210063 453740 191748 -71707 -90122 -160558 -109587
4641 -109587 168050 -52982 -94458 91701 20860 91064 19068 -105223 -79639 82982 74353
4630 74353 146786 353881 11391 68322 -314677 81811 -202447 -91316 -47550 107397 -44485
4618 86503 61050 37395 46712 90303 -284452 -35361 189046 12584 -92948 -172617 -108873 11602
4605 153531 -47322 -100750 -53126 69235 -36570 -64596 241136 94076 291044 -8214 -171403
4594 -171403 90693 -127382 46780 -200664 -286417 -1298 50603 112199 -178980 68613 41766
4583 41766 254421 167553 -124102 -61916 -209334 -152203 -308558 118605 -20483 -131294 -29922
4571 63634 48993 -168454 -51737 419193 74230 76119 163089 199652 -33854 206361 92507
4559 -85620 -105529 155178 -321162 399203 201692 -20906 193443 -346397 -120815 -125054 30747
4547 99665 102986 -214712 345057 227136 -75222 -137605 -87123 30170 -197149 226182 -266016
4535 -180010 -163820 63759 238996 -116015 -199156 244394 389954 -34031 64819 177890 -64643
4523 66509 -17342 -75571 -43275 -251172 -81016 -9006 31639 188983 79681 103753 144239 9592
4510 -215606 -86751 133990 104370 -139599 136720 206018 -139773 -267173 17957 290706
4500 290706 -150862 210421 -53068 715 -41267 -133379 -71305 -50916 422530 -306090 -118051
4488 98192 277117 -287539 -99720 -56015 13261 452574 320022 -363313 192497 79903 33205
$$ [...]
##END NTUPLES=NMR SPECTRUM
##END=
