##TITLE=AC1664_GALAH14355_8570617_Uh1Ts7uQdr
##JCAMPDX= 6.0         $$ Bruker NMR JCAMP-DX V2.0
##DATA TYPE= NMR SPECTRUM
##DATA CLASS= NTUPLES
##ORIGIN= BRUKER
##OWNER= Administrator
$$ 1.72 TOPSPIN		Version 2.1
$$ 2014-04-11 19:42:43.958 -0700  Administrator@X
$$ Compression mode = diff/dup
##.OBSERVE FREQUENCY= 400.02188249412
##.OBSERVE NUCLEUS= ^1H
##.ACQUISITION MODE= SIMULTANEOUS (DQD)
##.ACQUISITION SCHEME= undefined
##.AVERAGES= 64
##.DIGITISER RES= 22
##SPECTROMETER/DATA SYSTEM= spect
##.PULSE SEQUENCE= noesygpps1d.comp
##.SOLVENT NAME= COFFEE_meoh
##.SHIFT REFERENCE= INTERNAL, COFFEE_meoh, 1, 14.96108
##AUDIT TRAIL= $$ (NUMBER, WHEN, WHO, WHERE, PROCESS, VERSION, WHAT)
$$ ##TITLE= Audit trail, TOPSPIN		Version 2.1
$$ ##JCAMPDX= 5.01
$$ ##ORIGIN= Bruker BioSpin GmbH
$$ ##OWNER= Administrator
$$ $$ E:\/data/COFFEE/nmr/AC1664_GALAH14355_8570617_Uh1Ts7uQdr/12/pdata/1/auditp.txt
$$ ##AUDIT TRAIL=  $$ (NUMBER, WHEN, WHO, WHERE, PROCESS, VERSION, WHAT)
(   1,<2014-04-11 19:42:38.615 -0700>,<Administrator>,<X>,<go>,<TOPSPIN 2.1>,
      <created by zg
	started at 2014-04-11 19:31:09.130 -0700,
	POWCHK enabled, PULCHK disabled,
       configuration hash MD5:
       C8 4E 4E 5D D3 5C D8 9E 9F 52 82 E0 59 8A DE 15
       data hash MD5: 64K
       1A 91 87 19 13 85 54 BA B1 F8 90 14 85 9C 33 5C>)
(   2,<2014-04-11 19:42:41.771 -0700>,<Administrator>,<X>,<proc1d>,<TOPSPIN 2.1>,
      <Start of raw data processing
       efp LB = 0.3 FT_mod = 6 PKNL = 1 PHC0 = 0 PHC1 = 0 SI = 128K 
       data hash MD5: 128K
       B9 B3 D4 1B 65 B1 BD AD 9C F2 49 30 A1 89 CB 28>)
(   3,<2014-04-11 19:42:42.833 -0700>,<Administrator>,<X>,<proc1d>,<TOPSPIN 2.1>,
      <pk PHC0 = -81.58447 PHC1 = 0 
       data hash MD5: 128K
       11 C7 03 7C 52 37 06 38 DA 75 34 7E 8B 05 BE 18>)
(   4,<2014-04-11 19:42:43.302 -0700>,<Administrator>,<X>,<proc1d>,<TOPSPIN 2.1>,
      <abs ABSG = 1 
       data hash MD5: 128K
       59 BC 9E 13 C0 8A 9B 1E AB BD 81 51 DC 2C 3F 7E>)
(   5,<2014-04-11 19:42:43.427 -0700>,<Administrator>,<X>,<proc1d>,<TOPSPIN 2.1>,
      <abs ABSG = 2 
       data hash MD5: 128K
       50 8C D0 27 D2 BB 68 75 28 64 30 92 ED D2 16 0A>)
(   6,<2014-04-11 19:42:43.552 -0700>,<Administrator>,<X>,<proc1d>,<TOPSPIN 2.1>,
      <abs ABSG = 3 
       data hash MD5: 128K
       0B 80 B8 61 52 17 CE AA B2 27 5E 45 D3 CD C1 B5>)
(   7,<2014-04-11 19:42:43.662 -0700>,<Administrator>,<X>,<proc1d>,<TOPSPIN 2.1>,
      <abs ABSG = 4 
       data hash MD5: 128K
       85 4E D3 D1 40 6B 48 03 93 CD 41 F6 CC CC AC 76>)
(   8,<2014-04-11 19:42:43.755 -0700>,<Administrator>,<X>,<proc1d>,<TOPSPIN 2.1>,
      <abs ABSG = 5 
       data hash MD5: 128K
       00 DC BF 90 28 56 41 50 9D 3F E4 B6 4B 81 4D 70>)
$$ ##END=
$$ 
$$ $$ hash MD5
$$ $$ 18 AA A5 F4 D5 9D BC F0 98 E9 BA 2E 55 E3 4C C1
##$RELAX= 
##$RELAX= 
##$RELAX= 
##$RELAX= 
##$RELAX= 
##$RELAX= 
##$RELAX= 
##$RELAX= 
$$ Bruker specific parameters
$$ --------------------------
##$DU= <E:\>
##$EXPNO= 12
$$ [...]
##$TP07= 0
##$TPNAME0= <>
##$TPNAME1= <>
##$TPNAME2= <>
##$TPNAME3= <>
##$TPNAME4= <>
##$TPNAME5= <>
##$TPNAME6= <>
##$TPNAME7= <>
##$TPOAL= (0..7)
0.5 0.5 0.5 0.5 0.5 0.5 0.5 0.5
##$TPOFFS= (0..7)
0 0 0 0 0 0 0 0
##$TUNHIN= 0
##$TUNHOUT= 0
##$TUNXOUT= 0
##$USERA1= <user>
##$USERA2= <user>
##$USERA3= <user>
##$USERA4= <user>
##$USERA5= <user>
##$V9= 5
##$VALIST= <valist>
##$VCLIST= <CCCCCCCCCCCCCCC>
##$VD= 0
##$VDLIST= <DDDDDDDDDDDDDDD>
##$VPLIST= <PPPPPPPPPPPPPPP>
##$VTLIST= <TTTTTTTTTTTTTTT>
##$WBST= 1024
##$WBSW= 4
##$XGAIN= (0..3)
0 0 0 0
##$XL= 0
##$YL= 0
##$YMAX_a= 6509427
##$YMIN_a= -13331524
##$ZGOPTNS= <>
##$ZL1= 120
##$ZL2= 120
##$ZL3= 120
##$ZL4= 120
##$ABSF1= 14.96108
##$ABSF2= -5.597102
##$ABSG= 5
##$ABSL= 3
##$ALPHA= 0
##$AQORDER= 0
##$ASSFAC= 0
##$ASSFACI= 0
##$ASSFACX= 0
##$ASSWID= 0
##$AUNMP= <proc_prof1d_extract.lims>
##$AXLEFT= 0
##$AXNAME= <>
##$AXNUC= <1H>
##$AXRIGHT= 0
##$AXTYPE= 0
##$AXUNIT= <>
##$AZFE= 0.1
##$AZFW= 0.1
##$BCFW= 0
##$BC_mod= 0
##$BYTORDP= 0
##$COROFFS= 0
##$CY= 15
##$DATMOD= 1
##$DC= 0
##$DFILT= <>
##$DTYPP= 0
##$F1P= 0
##$F2P= 0
##$FCOR= 0.5
##$FTSIZE= 131072
##$FT_mod= 6
##$GAMMA= 0
##$GB= 0
##$INTBC= 1
##$INTSCL= 1
##$ISEN= 128
##$LB= 0.3
##$LEV0= 0
##$LPBIN= 0
##$MAXI= 10000
##$MC2= 0
##$MEAN= 0
##$ME_mod= 0
##$MI= 0
##$NCOEF= 0
##$NC_proc= -2
##$NLEV= 6
##$NOISF1= 0
##$NOISF2= 0
##$NSP= 0
##$NTH_PI= 0
##$NZP= 0
##$OFFSET= 14.96108
##$PC= 1
##$PHC0= -81.58447
##$PHC1= 0
##$PH_mod= 1
##$PKNL= yes
##$PPARMOD= 0
##$PPDIAG= 0
##$PPIPTYP= 0
##$PPMPNUM= 2147483647
##$PPRESOL= 1
##$PSCAL= 4
##$PSIGN= 0
##$PYNMP= <proc.py>
##$REVERSE= no
##$SF= 400.020009605853
##$SI= 131072
##$SIGF1= 0
##$SIGF2= 0
##$SINO= 400
##$SIOLD= 131072
##$SPECTYP= <>
##$SREGLST= <1H.CDCl3>
##$SSB= 0
##$STSI= 131072
##$STSR= 0
##$SW_p= 8223.68421052631
##$SYMM= 0
##$S_DEV= 0
##$TDeff= 65536
##$TDoff= 0
##$TI= <>
##$TILT= no
##$TM1= 0
##$TM2= 0
##$TOPLEV= 0
##$USERP1= <user>
##$USERP2= <user>
##$USERP3= <user>
##$USERP4= <user>
##$USERP5= <user>
##$WDW= 1
##$XDIM= 131072
##$YMAX_p= 337252925
##$YMIN_p= -11486
##$CURPLOT= <Network HP LaserJet P1505>
##$CURPRIN= <$Network HP LaserJet P1505>
##$DFORMAT= <normdp>
##$LAYOUT= <+/1D_H.xwp>
##$LFORMAT= <normlp>
##$PFORMAT= <normpl>
##$SURQMSG= 1
$$ End of Bruker specific parameters
$$ ---------------------------------
##NTUPLES= NMR SPECTRUM
##VAR_NAME=  FREQUENCY,     SPECTRUM/REAL,   SPECTRUM/IMAG
##SYMBOL=    X,             R,               I
##VAR_TYPE=  INDEPENDENT,   DEPENDENT,       DEPENDENT
##VAR_FORM=  AFFN,          ASDF,            ASDF
##VAR_DIM=   131072,        131072,          131072
##UNITS=     HZ,            ARBITRARY UNITS, ARBITRARY UNITS
##FACTOR=    0.0627417313425164, 1,          1
##FIRST=     8223.62146879497, -946,         -65552
##LAST=      0,             1367,            -65703
##MIN=       0,             -11486,          0
##MAX=       8223.62146879497, 337252925,    0
$$ Real data points
##PAGE= N=1
##DATA TABLE= (X++(R..R)), XYDATA
$$ [...]
63887G83687j1019r646q809q367p942p548p268o690n325l311j184Q66L039N383
63873G15866P762J0192J2711J4920J6252J6747J7119J7949J9108K0077K0508K0308
63861I09519J9499J8162J6382J4208J1787R500P674O107M137J339k042n466q681
63848A002125j1759j4686j7233j9278k1044k2864k4805k6601k7950k8750k9084
63837G58071k9126k9075k9036k8873k8293k7248k6076k5058k3971k2357k0187
63826D68771j7996j6260j4965j3916j3139j2750j2505j1821j0314q253o383n301
63814C25168n018n084n105m966m614l901k915k172k148k647l009k872k422j966
63800B76329j644j635k111k805l006k308j181n11p34j544k293k529k252j902j906
$$ plain form
63887 783687 772668 763022 754213 745846 737904 730356 723088 716398 711073 707762 706578 707444 710483 715866
63873 715866 723628 733820 746531 761451 777703 794450 811569 829518 848626 868703 889211 909519
63861 909519 929018 947180 963562 977770 989557 999057 1006731 1012838 1016975 1018314 1016272 1010806 1002125
63848 1002125 990366 975680 958447 939169 918125 895261 870456 843855 815905 787155 758071
63837 758071 728945 699870 670834 641961 613668 586420 560344 535286 511315 488958 468771
63826 468771 450775 434515 419550 405634 392495 379745 367240 355419 345105 336852 330469 325168
63814 325168 320150 315066 309961 304995 300381 296480 293565 291393 289245 286598 283589 280717 278295 276329
63800 276329 274685 273050 270939 268134 265128 262820 261639 261128 260394 258850 256557 254028 251776 249874 247968
63785B47968k188k275j953j537j399j508j668j872k161k293j987j324o28j5O80
63770B25840J495K162K325J868J005J66l28n57r35j582j969j474k49Q11J040O38
63754B30256J75k01o80j116r73j16Q53J357J602K072K553K378J599J126J425J854
63738B44164J778J637K138K985L312L064K944L170L275L181L367L738L460K339
63724B84552J431J645K543L177L462L877M374M424L869L009K020R52O8m22p75
63709C18206j292j728j714j483j490j517r72l8L81n9o71p44l13L55J263K252K697
63692C13133K230J392J036J344J859K283K633K800K490J730R54M46N1l34l81J71
63676C33837P64M16r91k246k052n40Q98J196N46k64q18j119j170j005q92j028
$$ plain form
63785 247968 245780 243505 241552 240015 238616 237108 235440 233568 231407 229114 227127 225803 225175 225160 225840
63770 225840 227335 229497 231822 233690 234695 234861 234533 233976 233041 231459 229490 228016 227767 228578 229618 230256
63754 230256 230431 230230 229550 228434 227461 227345 228198 229555 231157 233229 235782 238160 239759 240885 242310 244164
63738 244164 245942 247579 249717 252702 256014 259078 262022 265192 268467 271648 275015 278753 282213 284552
63724 284552 285983 287628 290171 293348 296810 300687 305061 309485 313354 316363 318383 319335 319403 318981 318206
63709 318206 316914 315186 313472 311989 310499 308982 308010 307972 308353 308294 307623 306879 306566 306921 308184 310436 313133
63692 313133 315363 316755 317791 319135 320994 323277 325910 328710 331200 332930 333884 334330 334381 334047 333666 333837
63676 333837 334601 335017 334026 331780 329728 329188 330086 331282 331828 331564 330746 329627 328457 327452 326560 325532
63660C25532j167r65n78m76p60j103j309j495j647j522j147r38j123j384j349
63645C08569j076p85m17J55O86P99O07P18J486K606L495L910M093M481N368O642
63629C41337P784Q328Q461Q927J0090J1308J1651J1158J0914J1739J3245J4465
63617D69407J5051J5405J5831J6179J6369J6769J7689J8842J9623J9860J9995
63606F61020K0472K1261K1960K2210K1713J9977J6517J1562O245J711j891n083
63594H17674p858r533r922r868j0134j0399j0155j0012j1144j3578j6110j7924
63582F81037j9292k0398k0563j9301j7390j5997j5186j3984j1855r342p260n764
63570E04705m409k785q37J287L512N709P485Q393Q618R044J0229J1582J2228J2395
$$ plain form
63660 325532 324365 323400 322822 322346 321586 320483 319174 317679 316032 314510 313363 312425 311302 309918 308569
63645 308569 307493 306708 306291 306446 307132 307931 308538 309256 310742 313348 316843 320753 324846 329327 334695 341337
63629 341337 349121 357449 365910 374837 384927 396235 407886 419044 429958 441697 454942 469407
63617 469407 484458 499863 515694 531873 548242 565011 582700 601542 621165 641025 661020
63606 661020 681492 702753 724713 746923 768636 788613 805130 816692 822937 824648 822757 817674
63594 817674 809816 800283 790361 780493 770359 759960 749805 739793 728649 715071 698961 681037
63582 681037 661745 641347 620784 601483 584093 568096 552910 538926 527071 517729 510469 504705
63570 504705 500296 497511 496674 497961 501473 507182 514667 523060 531678 540722 550951 562533 574761 587156
63556E87156J3157J4722J6010J6195J5793J5743J6195J6847J7832J9414K1274
63545G70338K2917K4461K6271K7863K7893K5267J9905J2624M730k429q022j1949
63533I39869j4362j5255j4816j3770j2826j2120j1612j1701j2849j4862j7258
63522G88438k0038k3382k6734k8991k9696k9344k8441k6971k4959k2888k1163
63511E05831j9561j7592j5193j2839j1085j0088r477q678p469o160n186m637m306
63498C73560l903l129j928p88l75o23p10k50J59L5j18K13M52j62j053j016j03
63481C60261M90L62M06J076J583J283P69R11J607K193K373K081J127l57j558j865
63465C72742j698j862k346k436j872j274j307j812j948j099M85J966K863L475
$$ plain form
63556 587156 600313 615035 631045 647240 663033 678776 694971 711818 729650 749064 770338
63545 770338 793255 817716 843987 871850 899743 925010 944915 957539 962269 959840 951818 939869
63533 939869 925507 910252 895436 881666 868840 856720 845108 833407 820558 805696 788438
63522 788438 768400 745018 718284 689293 659597 630253 601812 574841 549882 526994 505831
63511 505831 486270 468678 453485 440646 429561 419473 409996 401318 393849 387689 382503 377866 373560
63498 373560 369657 366528 364600 363812 363437 362814 362104 361854 362013 362048 361930 362143 362595 362433 361380 360364 360261
63481 360261 360751 361113 361519 362595 364178 365461 366230 367141 368748 370941 373314 375395 376522 376165 374607 372742
63465 372742 371044 369182 366836 364400 362528 361254 359947 358135 356187 355088 355573 357539 360402 363877
63451C63877M206M904N244N493O183P235Q141Q906R935J1024J1486J1471J2066
63438D70171J3619J5023J5323J5205J6098J8470K1719K5073K7796K9027K8324
63427F95848K6091K2934J9019J4692J1078R141Q601Q686R495J1586J4595J7423
63415H69189J9666K1679K3366K4054K3680K2761K0941J6905J0392L137l015p885
63403A044870j2042j5025j5892j4995j3894j3590j3920j4664j6152j8443k0883
63392H75370k2995k5091k7485k9603l0436k9581k7427k4647k1903j9712j8017
63381E98473j6065j3213r787o741m534k832j187N56K489M758P226R493J1384J3039
63367E93059J4470J5464J6117J6904J8026J9078J9697J9972K0051J9847J9605
$$ plain form
63451 363877 368083 372987 378231 383724 389907 397142 405283 414189 424124 435148 446634 458105 470171
63438 470171 483790 498813 514136 529341 545439 563909 585628 610701 638497 667524 695848
63427 695848 721939 744873 763892 778584 789662 798803 807404 816090 825585 837171 851766 869189
63415 869189 888855 910534 933900 957954 981634 1004395 1025336 1042241 1052633 1055770 1052755 1044870
63403 1044870 1032828 1017803 1001911 986916 973022 959432 945512 930848 914696 896253 875370
63392 875370 852375 827284 799799 770196 739760 710179 682752 658105 636202 616490 598473
63381 598473 582408 569195 559408 552667 548133 545301 544114 544670 547159 551917 559143 568636 580020 593059
63367 593059 607529 622993 639110 656014 674040 693118 712815 732787 752838 772685 792290
63356G92290K0125K1808K3905K5375K6092K6451K6088K3937J9637J4065Q382L053
63344A031208j957o594j0557j3450j5017j5473j5489j5528j5426j5098j5328j7104
63332H74187k0197k3221k5220k6449k7440k8074k7881k6648k4422k1501j8627
63321F04507j6541j4975j2693r081n196k786k750m864q386j2246j5108j6158j5822
63308D67901j5172j4636j3707j1911r568p517o349n954n678m957l866l023k860
63295C62703l144l249k771j798q09l47n73j052j236j150j295j872k456k552k077
63280C36322j268m39M5n0n17q91j007r39n10M79J530J727J054O48J303K363K655
63263C42505K061J502J700K538L377L648L271K834L093M111N264O172P020P788
$$ plain form
63356 792290 812415 834223 858128 883503 909595 936046 962134 986071 1005708 1019773 1028155 1031208
63344 1031208 1029251 1022657 1012100 998650 983633 968160 952671 937143 921717 906619 891291 874187
63332 874187 853990 830769 805549 779100 751660 723586 695705 669057 644635 623134 604507
63321 604507 587966 572991 560298 551217 546021 543235 540485 535621 527235 514989 499881 483723 467901
63308 467901 452729 438093 424386 412475 402907 395390 389041 383087 377409 372452 368586 365563 362703
63295 362703 359559 356310 353539 351741 350932 350585 350012 348960 347724 346574 345279 343407 340951 338399 336322
63280 336322 335054 334615 334660 334610 334093 333202 332195 331256 330746 331225 332755 334482 335536 336184 337487 339850 342505
63263 342505 344566 346068 347768 350306 353683 357331 360602 363436 366529 370640 375904 382076 389096 396884
63249C96884P984P582P464Q221R257R824J0241J1214J2465J3204J3548J4294J5458
63236E37640J6193J6301J6719J8167K0186K1875K2912K3461K3685K3751K3961
63225G64851K4383K4632K4259K3201K1736K0235J9017J8241J7796J7446J7053
63214I92850J6539J5725J4444J2734J0673Q158N094J618k167o418j1161j5823
63202A042266j9616k2280k4080k5208k5618k5297k4252k2335j9520j6284j3204
63191H04572j0338p382m332j454J278M126P022R614J1820J3826J5486J6510J7174
63178H77922J8187J9611K0540K0215J8931J7547J6496J5636J4719J3706J2685
63167A066195J1667J0351Q238N249K098n52l221p207j2795j8555k2861k5584k7815
$$ plain form
63249 396884 404868 412450 419914 428135 437392 447216 457457 468671 481136 494340 507888 522182 537640
63236 537640 553833 570134 586853 605020 625206 647081 669993 693454 717139 740890 764851
63225 764851 789234 813866 838125 861326 883062 903297 922314 940555 958351 975797 992850
63214 992850 1009389 1025114 1039558 1052292 1062965 1071123 1076217 1077835 1075668 1069250 1058089 1042266
63202 1042266 1022650 1000370 976290 951082 925464 900167 875915 853580 834060 817776 804572
63191 804572 794234 786852 782520 781066 782344 786470 793492 803106 814926 828752 844238 860748 877922
63178 877922 896109 915720 936260 956475 975406 992953 1009449 1025085 1039804 1053510 1066195
63167 1066195 1077862 1088213 1096451 1101700 1103798 1103246 1100025 1092818 1080023 1061468 1038607 1013023 985208
63154I85208l0277l2612l4094l4421l3733l2254l0217k7965k5868k3990k1931
63143F57846j9242j6130j3461j1841j0881r726q147o693n790n205m463l417k236
63130E40614j174m61j38M0L27O17P59J070K040L437M352M325L880L645L516L077
63114E69926K421K012K016K270K630K924K773K037J291J280J921K382K141J472
63100E99496P95J47m10m89%M10J37m34m57N5K93R8L45J497K674K876K553K885
63082F12471L932M603M390M037M256M839N421O210P362Q354Q700Q796R437J0851
63068G03659J2722J4687J6396J7512J8274J9511K1582K3749K5219K6282K7716
63057I27309K9671L1974L4919L8685M2346M4702M5997M7644N0216N2838N4769
$$ plain form
63154 985208 954931 922319 888225 853804 820071 787817 757600 729635 703767 679777 657846
63143 657846 638604 622474 609013 597172 586291 576565 568418 561725 555935 550730 546267 542850 540614
63130 540614 539440 538979 538841 538881 539208 539825 540584 541654 543694 547131 551483 555808 559688 563333 566849 569926
63114 569926 572347 574359 576375 578645 581275 584199 586972 589009 590300 591580 593501 595883 598024 599496
63100 599496 600291 600438 600028 599539 599539 599949 600086 599652 599195 599250 599543 599641 599986 601483 604157 607033 609586 612471
63082 612471 616403 621006 625396 629433 633689 638528 643949 650159 657521 665875 674575 683371 692808 703659
63068 703659 716381 731068 747464 764976 783250 802761 824343 848092 873311 899593 927309
63057 927309 956980 988954 1023873 1062558 1104904 1149606 1195603 1243247 1293463 1346301 1401070
63046A401070N6329N7896N8944N8774N7494N5793N4201N2902N1797N0415M8293
63035B003908M5615M3032M0744L8389L5891L3583L1138K7316K1371J4040O492
63024B341519j198r813j9581k9653l8907m6729n3089n8119o1700o3369o2831o0531
63012A835999n7321n3490m8541m2174l4950k7689k0600j3407o077R62P237J2636
63000A552585J7442K2027K6297K9589L1454L2416L3393L4386L4463L3153L1180
62989A878385K9446K7967K6224K4053K1683J9236J6612J3565R607M256k396r699
62977B058939j7269k5250l3537m1379m8163n4065n9368o3715o6570o7991o8212
62966A513420o6914o3745n9372n5254n2260n0029m7646m4542m0759l6790l3236
$$ plain form
63046 1401070 1457399 1515295 1574239 1633013 1690507 1746300 1800501 1853403 1905200 1955615 2003908
63035 2003908 2049523 2092555 2133299 2171688 2207579 2241162 2272300 2299616 2320987 2335027 2341519
63024 2341519 2340321 2330508 2310927 2281274 2242367 2195638 2142549 2084430 2022730 1959361 1896530 1835999
63012 1835999 1778678 1725188 1676647 1634473 1599523 1571834 1551234 1537827 1531750 1532712 1539949 1552585
63000 1552585 1570027 1592054 1618351 1647940 1679394 1711810 1745203 1779589 1814052 1847205 1878385
62989 1878385 1907831 1935798 1962022 1986075 2007758 2026994 2043606 2057171 2066778 2071034 2068638 2058939
62977 2058939 2041670 2016420 1982883 1941504 1893341 1839276 1779908 1716193 1649623 1581632 1513420
62966 1513420 1446506 1382761 1323389 1268135 1215875 1165846 1118200 1073658 1032899 996109 962873
62955I62873l0331k7850k5638k4012k3268k3003k2323k0759j8661j6743j5446
62944G14839j4715j4139j3397j2563j1885j1235j0237q970q089p903p833p139
62932E86734n842m458l229k152j457j448j944k387k496k417k304k115j810j463
62918E51212j230j324j856k515k729k457k405l078l964m138l442k496j783j345
62904E16450j248j694k540l229l358k980k345j644j054o97m74k55j97n81j315
62889D92839j881j840j174j74P45J162Q69J30m52m54MM53N41L62L17N50O99L87
62871D93083q5m5N28P93J58q92j462j386j198j267j445j435j106n09J03L76K42
62854D84453N7J27L59N64Q12J155J348J212R59Q00N34J4l67k01J95J84k02l33
$$ plain form
62955 962873 932542 904692 879054 855042 831774 808771 786448 765689 747028 730285 714839
62944 714839 700124 685985 672588 660025 648140 636905 626668 617698 609609 601706 593873 586734
62932 586734 580892 576434 573205 571053 569596 568148 566204 563817 561321 558904 556600 554485 552675 551212
62918 551212 549982 548658 546802 544287 541558 539101 536696 533618 529654 525516 522074 519578 517795 516450
62904 516450 515202 513508 510968 507739 504381 501401 499056 497412 496358 495661 495187 494932 494735 494154 492839
62889 492839 490958 489118 487944 487770 488515 489677 490546 490676 490224 489770 489774 490227 490768 491130 491447 491997 492696 493083
62871 493083 492998 492953 493481 494274 494432 493540 492078 490692 489494 488227 486782 485347 484241 483732 483835 484211 484453
62854 484453 484510 484637 484996 485560 486372 487527 488875 490087 491046 491846 492380 492394 492027 491826 492021 492205 492003 491670
62836D91670K7M33M17m7p62j401j449n25J004K141K198J413O53P32J858L421M360
62819E06143M132L284K887L429M497N336N452M875M222M324N386O666P318P318
62805E75269P286P672Q538R781J1054J1840J2193J3055J5123J7698J9475K0264
62793G29248K1077K2665K4908K7588L0740L4023L6781L8981M1348M4155M6815
62782A098329M8995N1349N4536N8145O1237O3451O5053O6323O7378O8238O8571
62771A771605O7672O5110O1098N5876M9172M0724L0887K0219Q758l671j6733k9657
62759B121060m1855n2938o2305o9430p4535p8370q1198q2465q1697p9315p6290
62748A340662p3221p0027o6363o2025n6992n1387m5605m0283l5868l2235k8949
$$ plain form
62836 491670 491697 492130 492547 492500 491738 490337 488888 488363 489367 491508 493706 495119 495772 496504 498362 501783 506143
62819 506143 510275 513559 516446 519875 524372 529708 535160 540035 544257 548581 553967 560633 567951 575269
62805 575269 582555 590227 598765 608546 619600 631440 643633 656688 671811 689509 708984 729248
62793 729248 750325 772990 797898 825486 856226 890249 927030 966011 1007359 1051514 1098329
62782 1098329 1147324 1198673 1253209 1311354 1372591 1436042 1501095 1567418 1634796 1703034 1771605
62771 1771605 1839277 1904387 1965485 2021361 2070533 2111257 2142144 2162363 2171121 2167450 2150717 2121060
62759 2121060 2079205 2026267 1963962 1894532 1819997 1741627 1660429 1577964 1496267 1416952 1340662
62748 1340662 1267441 1197414 1131051 1069026 1012034 960647 915042 874759 838891 806656 777707
62737G77707k5918k3449k1546j9513j6792j3819j1543j0107q676o642m414k714
62725F12574j577m69R44K558M157N586O787P885R204J0944J2984J5099J7223J9316
62711G23215K1260K3109K5255K7942L0916L3825L6787M0075M3384M6012M7843
62700A099623M9581N1769N4087N5909N7172N8200N9017N9386N9364N9220N8761
62689A722089N7275N4262M9674M3393L5026K4656J3226J656j0041k2227l4547
62678A934442m5997n5856o3927p0054p4150p6632p8057p8247p6510p2814o8109
62667A174089o3366n8993n5236n2183m9156m5145m0313l6075l3129l0457k7048
62656F82988k3594k1345k0089j8541j6290j4049j2261j0735r502q872q573p950
$$ plain form
62737 777707 751789 728340 706794 687281 670489 656670 645127 635020 626344 619702 615288 612574
62725 612574 610997 610528 611472 614030 618187 623773 630560 638445 647649 658593 671577 686676 703899 723215
62711 723215 744475 767584 792839 820781 851697 885522 922309 962384 1005768 1051780 1099623
62700 1099623 1149204 1200973 1255060 1310969 1368141 1426341 1485358 1544744 1604108 1663328 1722089
62689 1722089 1779364 1833626 1883300 1926693 1961719 1986375 1999601 2001257 1991216 1968989 1934442
62678 1934442 1888445 1832589 1768662 1698608 1624458 1547826 1469769 1391522 1315012 1242198 1174089
62667 1174089 1110723 1051730 996494 944311 895155 850010 809697 773622 740493 710036 682988
62656 682988 659394 638049 617960 599419 583129 569080 556819 546084 536582 527710 519137 511187
62644E11187p088o687o690o111m557k935k233k383k701k719k177r32O04J422R14
62629D66914l79j302j160j73Q50J120N35j84k68K74J008J872L089M417N356O003
62613D87972O852P726P937P647P983R389J0859J1433J1625J2579J4475J6555J8323
62600F31355J9880K1298K2376K3048K3637K4656K6394K8570L0396L1278L1506
62589I14394L1792L2151L1856L0547K8651K6449K3487J9284J4010Q022J344n878
62577A156109j2979j9325k4837k9540l3156l5606l7334l8582l8854l7773l5987
62566H12136l4516l3451l1964k9472k6196k2789j9892j7883j6519j4979j2711
62555E51764j0155q230p272o877o517n975n202m263l354k633k060j520r30j51
$$ plain form
62644 511187 504099 497412 490722 484611 480054 477119 474886 472503 469802 467083 464906 463974 464578 466000 466914
62629 466914 466535 465233 464073 463900 464750 465870 466405 466221 465953 466227 467235 469107 472196 476613 481969 487972
62613 487972 494824 502550 510487 518134 526117 535506 546365 557798 569423 582002 596477 613032 631355
62600 631355 651235 672533 694909 717957 741594 766250 792644 821214 851610 882888 914394
62589 914394 946186 978337 1010193 1040740 1069391 1095840 1119327 1138611 1152621 1160643 1161987 1156109
62577 1156109 1143130 1123805 1098968 1069428 1036272 1000666 963332 924750 885896 848123 812136
62566 812136 777620 744169 712205 682733 656537 633748 613856 595973 579454 564475 551764
62555 551764 541609 533379 526107 519230 512713 506738 501536 497273 493919 491286 489226 487706 486776 486625
62541D86625Q87J835K158J871J636J845K184K382K796L746M821N500O028P028
62527E31342Q583J0357J2358J4799J7309J9078J9897K0517K1757K3662K5607K7087
62515G52353K8210K9545L1436L3539L5149L6039L6583L7065L7284L6960L6109
62504A130272L4764L2769L0030K6580K2271J6944J1118N776J178l443q521j3199
62492A286539j6287j7539j7448j6340j4320j1641q524n087j885J83J144K426N206
62479A186427Q825J1639J2803J2358J0196O202J136l741p916j1813j6006k0904
62467A189206k6743l2947l7939m0588m1532m2159m2776m2835m2330m1576l9982
62456G57799l6668l2179k8087k4786k1252j7124j3433j0863q803o737n147m340
$$ plain form
62541 486625 487512 489347 491505 493376 495012 496857 499041 501423 504219 507965 512786 518286 524314 531342
62527 531342 539925 550282 562640 577439 594748 613826 633723 654240 675997 699659 725266 752353
62515 752353 780563 810108 841544 875083 910232 946271 982854 1019919 1057203 1094163 1130272
62504 1130272 1165036 1197805 1227835 1254415 1276686 1293630 1304748 1310524 1311702 1308259 1299738 1286539
62492 1286539 1270252 1252713 1235265 1218925 1204605 1192964 1184440 1179353 1177468 1177651 1178795 1181221 1186427
62479 1186427 1195252 1206891 1219694 1232052 1242248 1248450 1249586 1245845 1237929 1226116 1210110 1189206
62467 1189206 1162463 1129516 1091577 1050989 1009457 967298 924522 881687 839357 797781 757799
62456 757799 721131 688952 660865 636079 614827 597703 584270 573407 564604 557867 552720 548380
62444E48380l629k529j616j393j248m45P40J711K516L270L414K543J341P11N17
62429E54283%j014k210l609n375p105q132q390q239p751o914o254o387o974o969
62414D68960n959m650l900l831l982l917l494k822k132j580j158q13n31k25J71
62399D30137M78M84M65J005K098K965L090K934L144L630L920M008M155M248M038
62384D70799L822M193N167O162O769P023P044O979P224Q141R496J0767J1946J3457
62370E78989J5248J6573J6988J7015J7559J8959K0852K2684K4101K5079K5915
62359G99962K7042K8720L0877L3197L5271L6845L8060L9294M0484M0804L9393
62348A189949L6194L1735K6272J9866J3104O944J582l762r535j5073j9568k3244
$$ plain form
62444 548380 544751 542222 540606 539213 537965 537520 538260 539971 542487 545757 549171 551714 553055 553766 554283
62429 554283 554283 553269 551059 547450 542075 534970 526838 518448 510209 502458 495544 489290 482903 475929 468960
62414 468960 463001 458351 454451 450620 446638 442721 439227 436405 434273 432693 431535 430722 430191 429966 430137
62399 430137 430615 431099 431564 432569 434667 437632 440722 443656 446800 450430 454350 458358 462513 466761 470799
62384 470799 474621 478814 483981 490143 496912 503935 510979 517958 525182 533323 542819 553586 565532 578989
62370 578989 594237 610810 627798 644813 662372 681331 702183 724867 748968 774047 799962
62359 799962 827004 855724 886601 919798 955069 991914 1029974 1069268 1109752 1150556 1189949
62348 1189949 1226143 1257878 1284150 1304016 1317120 1324064 1325646 1321884 1312349 1297276 1277708 1254464
62336A254464k6798l0151l2624l4079l5004l5517l5186l3993l2566l1128k9112
62325H98306k6321k3655k1976k0867j9492j8144j7817j8452j8835j8350j7692
62314F76705j7455j7130j6185j5144j4686j4344j3148j1166r370q137o881n234
62302E27825l711k920k732k575k100j316m06L84R23J295J560J551J261J191J867
62287E22097L054M035M604N087N473N259M390L636L630M131M649N287O434P982
62273E89748R326J0091J0426J0766J1443J2493J3713J4960J6389J8183K0152K1947
62261G59637K3614K5379K7041K8217K9168L0693L2945L5130L6725L8217M0084
62250A106850M1721M2035M0598L7541L2773K6175J8310J0235K600m519j1049j6823
$$ plain form
62336 1254464 1227666 1197515 1164891 1130812 1095808 1060291 1025105 991112 958546 927418 898306
62325 898306 871985 848330 826354 805487 785995 767851 750034 731582 712747 694397 676705
62314 676705 659250 642120 625935 610791 596105 581761 568613 557447 548077 539940 533059 527825
62302 527825 524114 521194 518462 515887 513787 512471 512065 512449 513372 514667 516227 517778 519039 520230 522097
62287 522097 525151 529186 533790 538877 544350 549609 553999 557635 561265 565396 570045 575332 581766 589748
62273 589748 599074 609165 619591 630357 641800 654293 668006 682966 699355 717538 737690 759637
62261 759637 783251 808630 835671 863888 893056 923749 956694 991824 1028549 1066766 1106850
62250 1106850 1148571 1190606 1231204 1268745 1301518 1327693 1346003 1356238 1358838 1354319 1343270 1326447
62238A326447k2008k7071l2179l7051m1287m4519m6421m6969m6649m5898m4471
62227H91924m1877l8284l4456l0776k6943k2786j8743j5348j2646j0405q501o829
62215F24330n190l567k279j546j039j86J137K498L439L878L964L807L561L613
62201F36420M314N406O006N540M497L919M160M553M393L730L067K683K576K713
62187F93977L012L328L753M568N602O104N804N689O923R212J0987J1277J0589
62174G80825R840R259Q736Q577R242J0667J2400J4253J6328J8574K0776K2949
62162I42426K5232K7391K8822K9205K8768K7719K5724K2320J7587J2068O237L98
62150A193897m885q940j1745j4186j7130k0507k3640k6201k8328k9934l0457k9516
$$ plain form
62238 1326447 1304439 1277368 1245189 1208138 1166851 1122332 1075911 1028942 982293 936395 891924
62227 891924 850047 811763 777307 746531 719588 696802 678059 662711 650065 639660 631159 624330
62215 624330 619140 615573 613294 611748 610709 610523 611660 614158 617597 621475 625439 629246 632807 636420
62201 636420 640734 646140 652146 657686 662183 666102 670262 674815 679208 682938 686005 688688 691264 693977
62187 693977 696989 700317 704070 708638 714240 720344 726148 731837 738760 747972 758959 770236 780825
62174 780825 790665 799924 808660 817237 826479 837146 849546 863799 880127 898701 919477 942426
62162 942426 967658 995049 1023871 1053076 1081844 1109563 1135287 1157607 1175194 1187262 1193499 1193897
62150 1193897 1189012 1180072 1168327 1154141 1137011 1116504 1092864 1066663 1038335 1008401 977944 948428
62138I48428k7427k4870k2266j9630j6815j3783j0759q119n993m123k342j026
62126G91275o18q28q45l67K22P49J562K703L561L810M063M963O135O753O640O037
62110H35815M711K235r03l380m329m019l160k302j902k269l066l441l019k385
62096H08586k254k445k080o37J464L273M251M857O010P859R359R554R017R256
62082H66070J0688J2044J2160J1581J1725J3029J4673J5928J6969J8294J9924
62071A023085K1401K2217K2037K0864J9238J8031J7768J8161J8493J8357J7927
62060A237579J7624J7700J8030J7999J6642J3240Q095K459k558o847j0856j4538
62048A314569j7348j9297k1319k4236k7774l1115l3996l6718l9188m0697m0753
$$ plain form
62138 948428 921001 896131 873865 854235 837420 823637 812878 804759 798766 794643 792301 791275
62126 791275 790657 789829 788984 788617 788839 789588 791150 793853 797414 801224 805287 810250 816385 823138 829778 835815
62110 835815 840526 842761 841858 838478 834149 830130 826970 824668 822766 820497 817431 813990 810971 808586
62096 808586 806332 803887 801807 801170 802634 805907 810158 815015 821025 828884 838243 847797 856814 866070
62082 866070 876758 888802 900962 912543 924268 937297 951970 967898 984867 1003161 1023085
62071 1023085 1044486 1066703 1088740 1109604 1128842 1146873 1164641 1182802 1201295 1219652 1237579
62060 1237579 1255203 1272903 1290933 1308932 1325574 1338814 1346909 1349368 1346810 1339963 1329107 1314569
62048 1314569 1297221 1277924 1256605 1232369 1204595 1173480 1139484 1102766 1063578 1022881 982128
62037I82128l9594l7719l5394l2879l0691k9193k8075k6665k4686k2418k0166
62026F54648j7951j5788j3892j2391j1042r582q279p724p940q042p152n509m312
62013E25044m429n542o608o843o135m830l445k346j477n32M98J119R69M70M46
61998D86359J185K198K899L156L078K630J754P12k9l40o34j404k637l855m704
61983D90368n297n861o370o700o888o920o454n265l787k742k153j363q5J134J755
61968D33372J868J684J071R6n20j99O60J285J614K106K770L192L372L703M165
61953D60239M290M068M107M669N222N268N089N313O117P194Q248R238J0259J1316
61939E50637J2156J2413J2128J1910J2251J2862J3111J2911J2589J2132J1267
$$ plain form
62037 982128 942534 904815 869421 836542 805851 776658 748583 721918 697232 674814 654648
62026 654648 636697 620909 607017 594626 583584 574002 565723 557999 550059 542017 534865 529356 525044
62013 525044 520615 515073 508465 501622 495487 490657 487212 484866 483389 482857 483355 484474 485443 485913 486359
61998 486359 487544 489742 492641 495797 498875 501505 503259 503971 503942 503602 502968 501564 498927 495072 490368
61983 490368 485071 479210 472840 466140 459252 452332 445878 440613 436826 434084 431931 430568 430483 431617 433372
61968 433372 435240 436924 437995 438091 437571 437372 438032 439317 440931 443037 445807 448999 452371 456074 460239
61953 460239 464529 468597 472704 477373 482595 487863 492952 498265 504382 511576 519824 529062 539321 550637
61939 550637 562793 575206 587334 599244 611495 624357 637468 650379 662968 675100 686367
61928F86367J0225R553R092Q067O350M752L776K961J922J007L77o70k514m203
61914G37062m585l903l189k577j412K60J601K362L192M412N543O346P179P925
61900G60216P552N506K674K22j895m420p310r714j1219j2178j2847j3044j2756
61887F90787j2416j2297j2133j1606j0755r741q642p687p276p451p688p551p205
61874E68339o945o543n602m368l520l185k692j447L23J981L289M527O032P831
61860E58020R559J0689J1035J1126J1841J3432J5234J6529J7384J8305J9395K0312
61848G32861K0930K1474K2040K2408K2372K1851K0690J8879J6993J5791J5117
61837I51406J3715J0629O390K361p71l316n595p356q172p919o718m842k809j196
$$ plain form
61928 686367 696592 706145 715237 723304 729654 734406 738182 741143 743065 744072 744449 743779 741265 737062
61914 737062 732477 728574 725385 722808 721396 721656 723257 725619 728811 733223 738766 745112 752291 760216
61900 760216 767768 773274 775948 776170 774275 769855 762545 752831 741612 729434 716587 703543 690787
61887 690787 678371 666074 653941 642335 631580 621839 613197 605510 598234 590783 583095 575544 568339
61874 568339 561394 554851 549249 544881 541361 538176 535484 534037 534360 536341 539630 544157 550189 558020
61860 558020 567579 578268 589303 600429 612270 625702 640936 657465 674849 693154 712549 732861
61848 732861 753791 775265 797305 819713 842085 863936 884626 903505 920498 936289 951406
61837 951406 965121 975750 982140 984501 983730 980414 974819 967463 959291 951372 944654 939812 937003 935807
61823I35807j40P08J579K272K527K269J229j110m750q731j2043j4740j7495k0298
61809H67084k2325k3208k3566k3989k4143k3371k1732j9896j8339j7018j5694
61798F33803j4237j2768j1683j1255j0987r977q179o684o185n882m807l522l321
61785E24316m051m190l135j984j610j414o96o2l99j269j562j124o90n36l20n5
61769E01219j44m28j73P42J482J399Q94P44J061J308J122P74Q98J770K851L140
61753E18659K237R28L12N38P60K96n76j147j169j050j268j770k038j783j443j619
61737E09867k144k232j662j122j043q34J09J269J748J610J585J794J762J542J729
61722E13978K329K586K161J602J405J429J442J524J631J521J279J221J069J34
$$ plain form
61823 935807 935667 936375 937954 940226 942753 945022 946251 945141 940391 931660 919617 904877 887382 867084
61809 867084 844759 821551 797985 773996 749853 726482 704750 684854 666515 649497 633803
61798 633803 619566 606798 595115 583860 572873 562896 554717 548033 541848 535966 531159 527637 524316
61785 524316 520265 516075 512940 510956 509346 507932 507236 507174 506775 505506 503944 502820 502130 501594 501274 501219
61769 501219 501075 500647 500474 501216 502698 504097 504991 505735 506796 508104 509226 510000 510898 512668 515519 518659
61753 518659 520896 521824 522136 522674 523434 523730 523154 522007 520838 519788 518520 516750 514712 512929 511486 509867
61737 509867 507723 505491 503829 502707 501664 500830 500939 502208 503956 505566 507151 508945 510707 512249 513978
61722 513978 516307 518893 521054 522656 524061 525490 526932 528456 530087 531608 532887 534108 535177 535311
61708E35311j399k339k088j538j687k259k462k450l043m311n315n198l956k304
61694D94962j203j260k167k900k857k479k413k593k592k413k250j947j413j227
61680D65248j892k785k777j900j373j853k568k540j852j189q19o54q48j597k457
61665D38144k579j757q26p44j486k057j554r2J351J909J552Q66L73J65J07J62
61649D33534M26R01J335J374R80O64J065K240L474L951L432K271R42j93q48j002
61633D54546j045j412j930j855q64K72L62q23k301l098l382l946m879n298m492
61618D19855k816j232l87l46q40j411j668j727k132l024l740l652l109k945l405
61603C87421m091m742n325n494m846l689k892k788k921k942l004l149l073k782
$$ plain form
61708 535311 533912 531573 529485 527947 526260 524001 521539 519089 516046 511735 506420 501222 497266 494962
61694 494962 493759 492499 490332 487432 484575 482096 479683 477090 474498 472085 469835 467888 466475 465248
61680 465248 463356 460571 457794 455894 454521 452668 450100 447560 445708 444519 443700 443046 442198 440601 438144
61665 438144 435565 433808 432982 432238 430752 428695 427141 427049 428400 430309 431861 432727 433100 433265 433372 433534
61649 433534 433960 434861 436196 437570 438550 439214 440279 442519 445993 449944 453376 455647 456589 456396 455548 454546
61633 454546 453501 452089 450159 448304 447440 447712 448074 447251 444950 441852 438470 434524 429645 424347 419855
61618 419855 417039 415807 415420 415074 414234 412823 411155 409428 407296 404272 400532 396880 393771 390826 387421
61603 387421 383330 378588 373263 367769 362923 359234 356342 353554 350633 347691 344687 341538 338465 335683
61589C35683k731k947k741j755o85m00q32j355j736k104k257j759p40o1m92j827
61573C11261k915k677j258M3K95J04N80J492J506L15p10n25J18K3n44m34M83J153
61555C08310Q96K61K18J115K397L074K623J646J229J493J462P27K24P21J408J109
61539C28913J36k98RK86M11J060K183K755K352J787J710J596P01p01j688j773
61523C39439j258p99q77j395j709j434j063j268j791j759j045m40l82m15j53J11
61507C23762P8l9n2k06n74p24m07m0q2m10o60p02m28L26J278J693J397J177J672
61488C27059K348K255J298J67o02q19k89R13K008K133J404P65P03Q05O73N91R75
61471C42387J603J823J308L10p04j379j522j085k73N46J046J122P93J30o11r14
$$ plain form
61589 335683 332952 330005 327264 325509 324824 324424 323592 322237 320501 318397 316140 314381 313641 313580 313088 311261
61573 311261 308346 305669 304411 304454 304749 304853 305433 306925 308431 308746 308036 307511 307629 307652 307108 306674 307157 308310
61555 308310 309206 309467 309685 310800 313197 316271 318894 320540 321769 323262 324724 325451 325675 326396 327804 328913
61539 328913 329049 328751 328760 329046 329457 330517 332700 335455 337807 339594 341304 342900 343601 342900 341212 339439
61523 339439 338181 337382 336505 335110 333401 331967 330904 329636 327845 326086 325041 324601 324219 323804 323651 323762
61507 323762 323840 323801 323749 323543 322969 322245 321838 321798 321716 321306 320646 319944 319516 319842 321120 322813 324210 325387 327059
61488 327059 329407 331662 332960 333127 332525 331706 331417 332330 334338 336471 337875 338640 339343 340148 340821 341412 342387
61471 342387 343990 345813 347121 347431 346727 345348 343826 342741 342468 343014 344060 345182 345975 346105 345494 344580
61455C44580m43M04P54L36o8L63J342J888J714J461J563J626J271R28J216J926
61439C60861K226J803J291J450K257K921K743J803Q56N33P28Q84P71P09J022J498
61423C84356J590J071L78L01J155K275K549J676N70K44N70O47J55l51m21k70k22
61406C96273j93n8J9j03k87l94m85n55m89m34o87j010o72M67J467J415O00pn1
61387C94816L2j25m12o01n63j47O64J451J690J394J046R35R16Q79R94J388J912
61370D06269K395K830L146L048K348J395Q45J043J705K302K612K839L228L722
61356D39727M047M057L893L831M066M633N425O330P309Q267Q846Q590P452N912
61342E22385M443L099J882J142J138J460J453J019N64K68M7J17P26J358J051k31
$$ plain form
61455 344580 344137 344541 345295 345631 345563 345926 347268 349156 350870 352331 353894 355520 356791 357719 358935 360861
61439 360861 363087 364890 366181 367631 369888 372809 375552 377355 378211 378744 379472 380356 381127 381836 382858 384356
61423 384356 385946 387017 387395 387696 388851 391126 393675 395351 395921 396165 396735 397382 397537 397186 396765 396495 396273
61406 396273 396080 396022 396041 395938 395651 395257 394772 394217 393728 393294 392607 391597 390925 391392 392859 394274 394874 394867 394816
61387 394816 394848 394723 394311 393710 393147 393000 393664 395115 396805 398199 399245 400180 401096 401975 402969 404357 406269
61370 406269 408664 411494 414640 417688 420036 421431 422276 423319 425024 427326 429938 432777 436005 439727
61356 439727 443774 447831 451724 455555 459621 464254 469679 476009 483318 491585 500431 509021 516473 522385
61342 522385 526828 529927 531809 532951 534089 535549 537002 538021 538585 538853 538900 539017 539743 541101 542152 541921
61326E41921j322j349p86n52p36p36j63R86K611M391N733O317O423O360O035N507
61310E80640N415O171P168P572P541P921Q956J0080J0838J1180J0933R786P797
61297F91998N346K608k46k521l548l800m468n828o918p176p326q074q911q979
61283F32157q446q013p597o568n063l968l564l145k211j130k07J014K808M312
61269E90379M481L696L402M088M634M014K832K407L003L806M385N150O305P291
61255F49873P565P223O429M893K574L82n61k83J03k03q92j201r43o04o81j116
61239F72558j414j222o91n9Q38K217L480L470J994M60L38J468K590L220L930M970
61223F98147N650N475M993M979N399N727N846O044O386O622O662O656O654O457
$$ plain form
61326 541921 540599 539250 538464 537912 537176 536440 536277 537263 539874 544265 549998 556315 562738 569098 575133 580640
61310 580640 586055 592226 599394 606966 614507 622428 631384 641464 652302 663482 674415 684201 691998
61297 691998 697344 699952 699706 697185 693637 689837 685369 679541 672623 665447 658121 650047 641136 632157
61283 632157 623711 615698 608101 601533 596470 592502 588938 585793 583582 582452 582245 583259 586067 590379
61269 590379 594860 598556 601958 606046 610680 614694 617526 619933 622936 626742 631127 636277 642582 649873
61255 649873 657438 664661 671090 675983 678557 678939 678378 678095 678198 677995 677103 675902 674959 674355 673674 672558
61239 672558 671144 669922 669231 669172 670010 672227 675707 679177 681171 681631 681969 683437 686027 689247 693177 698147
61223 698147 703797 709272 714265 719244 724643 730370 736216 742260 748646 755268 761930 768586 775240 781697
61209G81697N885M979L986L241L004L276L806M342M792N159N437N720O275P331
61195H48930Q782J0205J1185J1678J2046J2574J2920J2247J0155P212M303J722
61183I63959o84k663l613l585l544m362n994p890r675j1048j1563j1139j0465
61170H77734j0382j0940j1548j1852j1974j1974j1681j1132j0723j0747j1099
61159G53682j1520j1850j1926j1554j0657r320p650n806m164l068k345j337L03
61146F62788K055K946K457R39p47j938k572l053l631m009l703k739j652p95N3
61131F46399J250K783M471O354Q536J0760J2521J3668J4546J5539J6655J7670
61119G71152J8464J9072J9596K0174K0929K1822K2562K2876K2763K2378K1686
$$ plain form
61209 781697 787582 792561 796547 799788 802792 806068 809874 814216 819008 824167 829604 835324 841599 848930
61195 848930 857712 867917 879102 890780 902826 915400 928320 940567 950722 957934 962237 963959
61183 963959 963275 960612 956999 953414 949870 945508 939514 931624 921949 910901 899338 888199 877734
61170 877734 867352 856412 844864 833012 821038 809064 797383 786251 775528 764781 753682
61159 753682 742162 730312 718386 706832 696175 686855 679205 673399 669235 666167 663822 662485 662788
61146 662788 664843 667789 670246 671185 670438 668500 665928 662875 659244 655235 651532 648793 647141 646346 646399
61131 646399 647649 650432 654903 661257 669793 680553 693074 706742 721288 736827 753482 771152
61119 771152 789616 808688 828284 848458 869387 891209 913771 936647 959410 981788 1003474
61108A003474K0447J8604J6511J4549J2677J0599Q383O488M937K869n89n104r285
61095A104560j2186j4197j6271j8651k0751k2095k2813k3287k3638k3752k3558
61084H83361k3100k2372k1215j9504j7476j5753j4757j4161j3186j1575r952q972
61072F91338q416p423n514l076r61K06N05P34J715L389M845N505N846O549P412
61057G02654P765P706Q076R307J1048J2902J4802J6558J7812J8643J9572K0769
61045H67614K1915K3002K4515K6520K8341K9533L0524L1866L3458L4952L6319
61034A188559L7538L8404L9101M0421M2751M5447M7840N0378N4044N9110O5009
61023A708602P1232P7698Q4703R3001J03779J18086J36620J59971J88262K20202
$$ plain form
61108 1003474 1023921 1042525 1059036 1073585 1086262 1096861 1105244 1111732 1116669 1119538 1118949 1113845 1104560
61095 1104560 1092374 1078177 1061906 1043255 1022504 1000409 977596 954309 930671 906919 883361
61084 883361 860261 837889 816674 797170 779694 763941 749184 735023 721837 710262 700310 691338
61072 691338 682922 675499 669985 666909 665948 666154 666659 667393 669108 672497 677342 682847 688693 695242 702654
61057 702654 710419 718125 726201 735508 746556 759458 774260 790818 808630 827273 846845 867614
61045 867614 889529 912531 937046 963566 991907 1021440 1051964 1083830 1117288 1152240 1188559
61034 1188559 1226097 1264501 1303602 1344023 1386774 1432221 1480061 1530439 1584483 1643593 1708602
61023 1708602 1779834 1857532 1942235 2035236 2139015 2257101 2393721 2553692 2741954 2962156
61013B962156K53497K86692L19722L52447L84304M15979M49260M83715N15548
61004F423320N41912N64716N88198O15275O49668O98939P70602Q67892R95966
60995A2716488J166712J377206J570802J634294J464296J054731N16591O008l65333
60986B1141795n55788n62128m02330j42438Q5936J35390o5396m63637r23604j313568
60976A6934232j563318j664843j644459j539755j387813j217967j048578q89821
60968E977678p47925o25753n22064m33811l59370k98490k50072k11858j81824
60959B346511j58341j39412j23228j09286r7764q7939p8389o8579n9262n1266
60949A373045m4759l9600l5586l2465l0182k8935k8447k7735k6248k4659k3712
$$ plain form
61013 2962156 3215653 3502345 3822067 4174514 4558818 4974797 5424057 5907772 6423320
61004 6423320 6965232 7529948 8118146 8733421 9383089 10082028 10852630 11720522 12716488
60995 12716488 13883200 15260406 16831208 18465502 19929798 20984529 21501120 21507128 21141795
60986 21141795 20586007 20023879 19621549 19479111 19565047 19700437 19635041 19171404 18247800 16934232
60976 16934232 15370914 13706071 12061612 10521857 9134044 7916077 6867499 5977678
60968 5977678 5229753 4604000 4081936 3648125 3288755 2990265 2740193 2528335 2346511
60959 2346511 2188170 2048758 1925530 1816244 1718480 1630541 1552152 1483573 1424311 1373045
60949 1373045 1328286 1288686 1253100 1220635 1190453 1161518 1133071 1105336 1079088 1054429 1030717
60938A030717k2851k1032j8425j6248j5138j4684j4369j3992j3311j2183j0977
60927H57507j0076r218q003o699n669m466k553m98O97J206K047L374M378M881
60913H26908N655P040Q477R663J0992J2530J3736J4560J5686J7197J8122J7875
60901I78441J7265J7343J8067J8680J8795J8450J7649J6438J5071J3727J2338
60890A162264J0863R315P507N296L078J284o37l848q421j2846j5664j6937j7748
60877A123506j8891k0407k1806k2413k2010k1356k1442k2107k2182k1228k0126
60866H89538j9623j9307j8573j7660j7014j6383j5349j4112j3063j2087j0921
60855G15446r732q776q038p749q488j0137j1431j1366j0453r724r151q108o813
$$ plain form
60938 1030717 1007866 986834 968409 952161 937023 922339 907970 893978 880667 868484 857507
60927 857507 847431 838213 830210 823511 817842 813376 810823 810325 811022 812228 814275 817649 822027 826908
60913 826908 832563 839603 848080 857743 868735 881265 895001 909561 925247 942444 960566 978441
60901 978441 995706 1013049 1031116 1049796 1068591 1087041 1104690 1121128 1136199 1149926 1162264
60890 1162264 1173127 1182442 1189949 1195245 1198323 1199607 1198970 1195122 1186701 1173855 1158191 1141254 1123506
60877 1123506 1104615 1084208 1062402 1039989 1017979 996623 975181 953074 930892 909664 889538
60866 889538 869915 850608 832035 814375 797361 780978 765629 751517 738454 726367 715446
60855 715446 705714 696938 688900 681151 672663 662526 651095 639729 629276 619552 610401 602293 595480
60842E95480o186o415o808p029p436q176q757q766q265p361o083m805m168m292
60828E00933m553m327l634k872k273j750j057p9R07J398J286J095J218J302Q54
60813D88448J29k12j29j11j83J78J005J494J050M4q15j305j499j260n12K36K81
60796D86839m62j344j750j661j470j552j999k540k669k110j299j146k095l517
60782D61225m286l972l251l026l431l870l869l559l335l340l328k932k049j041
60768D15936n61r56j808k250j761n44P75J605J636J016L85M70J360K337K629K222
60752D22491J813K009K635K926K461J738J626K264K859K768K272J938J647Q94
60738D52341k72j259j885k586l613m634n227n268m744l792l001l072l904m580
$$ plain form
60842 595480 589294 582879 576071 569042 561606 553430 544673 535907 527642 520281 514198 509393 505225 500933
60828 500933 496380 492053 488419 485547 483274 481524 480467 480388 481295 482693 483979 485074 486292 487594 488448
60813 488448 488577 488365 488236 488125 487942 488120 489125 490619 491669 491713 490898 489593 488094 486834 486322 486558 486839
60796 486839 486377 485033 483283 481622 480152 478600 476601 474061 471392 469282 467983 466837 464742 461225
60782 461225 456939 452967 449716 446690 443259 439389 435520 431961 428626 425286 421958 419026 416977 415936
60768 415936 415375 414419 412611 410361 408600 408056 408831 410436 412072 413088 413473 413943 415303 417640 420269 422491
60752 422491 424304 426313 428948 431874 434335 436073 437699 439963 442822 445590 447862 449800 451447 452341
60738 452341 452069 450810 448925 446339 442726 438092 432865 427597 422853 419061 416060 412988 409084 404504
60724D04504m521m081l795l611l270k921k790k655k151j388r16j134j965k851
60710C66455l015k081o04L81M71J87R1J58K27M58Q93J129R19O25O73Q95R21P98
60692C69581Q43J193J912L084M330M730L813K347J568J828K567L282L923M489
60678D09490M832M899M724M269L592L080L162L840M719N328N290M503L385K521
60664D67634J823O59r17j796j326m79n98j549k180k132k058k135j771r37n96j277
60648D50365k208k417j965j445j016o09n99j385k594l387l533l509l622l624l354
60633D15098l128l166l101k467j451o78l83l12l32n66p46j96J110K076J772P27
60617D04257J89L79M39k6m21l30j54k11j18M09R60J205J496J986J980R56l34p43
$$ plain form
60724 404504 399983 395902 392107 388496 385226 382305 379515 376860 374709 373321 372405 371271 369306 366455
60710 366455 363440 361359 360755 361136 361607 361794 361885 362043 362270 362728 363621 364750 365669 366294 366967 367862 368783 369581
60692 369581 370424 371617 373529 376613 380943 385673 389486 391833 393401 395229 397796 401078 405001 409490
60678 409490 414322 419221 423945 428214 431806 434886 438048 441888 446607 451935 457225 461728 465113 467634
60664 467634 469457 470116 469199 467403 466077 465598 465000 463451 461271 459139 457081 454946 453175 452238 451642 450365
60648 450365 448157 445740 443775 442330 441314 440705 440106 438721 436127 432740 429207 425698 422076 418452 415098
60633 415098 411970 408804 405703 403236 401785 401107 400724 400412 400080 399514 398768 398572 399682 401758 403530 404257
60617 404257 404446 404825 405264 405238 404817 404487 404333 404122 404004 404413 405373 406578 408074 410060 412040 412996 412662 411919
60599D11919k44K59L32K54J77jk0N76J577K211K173J912J834J855J866J929J899
60582D30508J457P45M66J044K107L000L475L672L733L654L452L304L570M459N650
60567D74296O433O510O388O732P581Q523R333R947J0063R256P477N050K388o2
60553E69915j828k802l332l600l211j910k45J033K003L280M962O474P337P528
60539E85604P213O769O821P714R083J0418J1660J2684J2734J1293R093P184N314
60526G03584K468j131l931n168n727o487o986o432n086l833l056k494j785o21
60512F53315J113K998M436N597P309R608J1266J1403J0912J1422J3309J5556J7301
60499G75545J8699K0301K2269K4356K6184K7468K8264K8993K9960L0801L0654
$$ plain form
60599 411919 411675 411934 412266 412520 412697 412696 412676 413252 414829 417040 419213 421125 422959 424814 426680 428609 430508
60582 430508 431965 432710 433176 434220 436327 439327 442802 446474 450207 453861 457313 460617 464187 468646 474296
60567 474296 480729 487239 493627 500359 507940 516463 525796 535743 545806 555062 562539 567589 569977 569915
60553 569915 568087 565285 561953 558353 555142 553232 552987 554020 556023 559303 564265 570739 578076 585604
60539 585604 592817 599586 606407 614121 623204 633622 645282 657966 670700 681993 691086 698270 703584
60526 703584 706052 704921 700990 695822 690095 683608 676622 670190 665104 661271 658215 655721 653936 653315
60512 653315 654428 657426 661862 667459 674768 684376 695642 707045 717957 729379 742688 758244 775545
60499 775545 794244 814545 836814 861170 887354 914822 943086 972079 1002039 1032840 1063494
60488A063494K8943K5897K2325J8810J5028R896K657o071j4650k1956k8271l4457
60476A081645m0541m5418m7903m7783m5807m2920l9705l6411l3160k9839k6150
60465F46008k2207j8893j7018j6079j4648j2218r797q343p503o668o237o767p483
60452D92147p021n361l817l185l064k953k855k700k304j977k195k540k100r96
60438D49079l35m28l73K22N01o6o19k72N07P38L29k04o41q89o81k08k99j177j790
60419D43394j197R5J072J702K474L118K972K212J572J183O80J90J74M68N64O22
60403D61295J222K118K361J675P95L10J20J62O93J529J903J559J265J725K553
60388D81285K872K538K171K255K649K975L021K773K307J759J348J271J514J778
$$ plain form
60488 1063494 1092437 1118334 1140659 1159469 1174497 1184393 1187050 1180979 1166329 1144373 1116102 1081645
60476 1081645 1041104 995686 947783 900000 854193 811273 771568 735157 701997 672158 646008
60465 646008 623801 604908 587890 571811 557163 544945 535148 526805 519302 512634 506397 499630 492147
60452 492147 485126 479765 475948 472763 469699 466746 463891 461191 458887 456910 454715 452175 450075 449079
60438 449079 448744 448316 447943 448165 448666 448600 447981 447709 448216 448954 449283 449079 448438 447549 446868 446660 446361 445184 443394
60419 443394 442197 442292 443364 445066 447540 450658 453630 455842 457414 458597 459277 459467 459641 460109 460673 461295
60403 461295 462517 464635 466996 468671 469466 469776 469896 470058 470751 472280 474183 475742 477007 478732 481285
60388 481285 484157 486695 488866 491121 493770 496745 499766 502539 504846 506605 507953 509224 510738 512516
60374E12516J731J417J278J703K618L555L960L485K232Q61J00M8K17L40O75J275
60358E38011J519Q94l5j22R44K234K638K040J284J235J939K708L011L111L615
60343E65026M451M798M183L106K278J594L68j637l785n128n219m508m016m364
60329E57147n050n035m058k888k131j485n30M39Q25N76R7k23j9J049K723M052
60313E45489M463M478M861N520N954O284O957P793Q233Q330Q689R553J0790J2580
60299F49974J5100J7468J8016J5991J2259Q047L625j441p268j3188j8056k0787
60287F79740k1071j9613j7460j5072j2425r826p901o778n956n172m686m550m291
60274E44939l751l560m253n303n648m945l800k927k493k256j980j590j179q94
$$ plain form
60374 512516 514247 515664 516942 518645 521263 524818 528778 532263 534495 535356 535456 535504 535721 536061 536736 538011
60358 538011 539530 540424 540389 540267 541211 543445 546083 548123 549407 550642 552581 555289 558300 561411 565026
60343 565026 569477 574275 578458 581564 583842 585436 585804 584167 580382 575254 570035 565527 561511 557147
60329 557147 552097 547062 543004 540116 537985 536500 535970 536409 537234 537810 537907 537684 537665 538714 541437 545489
60313 545489 549952 554430 559291 564811 570765 577049 584006 591799 600032 608362 617051 626604 637394 649974
60299 649974 665074 682542 700558 716549 728808 736855 740480 739039 731771 718583 700527 679740
60287 679740 658669 639056 621596 606524 594099 584273 576372 569594 563638 558466 553780 549230 544939
60274 544939 541188 537628 533375 528072 522424 517479 513679 510752 508259 506003 504023 502433 501254 500360
60260E00360q00q67j081j377j553j408j010n75j12N06J074J117N85J17K49O81
60244D95906P74N51O63J317J837J595R59Q17J327J731J528J257J722K748L315
60229E18047K876K106K136L302M812N483M801L497K941L701M768M693L458K538
60215E69159K990M177M859M877N077N842O624O863O720O643O694O629O383O134
60201F49671N939N589N007M585M750N155M811L386J900J444J553Q15j003k538
60187F91064k844k694l245m363n109n245n201n036m477l746l435l523l342k598
60173F36206j786j417j445j510j402j127r03j029j450j588r95pO22O24L34P9n0
60156F23156L1L90Q93J446K240L348M297M532M215L990M175M729N808P564R368
$$ plain form
60260 500360 499560 498693 497612 496235 494682 493274 492264 491689 491577 492083 493157 494274 494859 494976 495225 495906
60244 495906 496680 497231 497894 499211 501048 502643 503602 504419 505746 507477 509005 510262 511984 514732 518047
60229 518047 520923 523029 525165 528467 533279 538762 543563 547060 550001 553702 558470 563163 566621 569159
60215 569159 572149 576326 581185 586062 591139 596981 603605 610468 617188 623831 630525 637154 643537 649671
60201 649671 655610 661199 666206 670791 675541 680696 685507 688893 690793 692237 693790 694605 693602 691064
60187 691064 688220 685526 682281 677918 672809 667564 662363 657327 652850 649104 645669 642146 638804 636206
60173 636206 634420 633003 631558 630048 628646 627519 626616 625587 624137 622549 621554 621547 622169 622793 623127 623206 623156
60156 623156 623187 623577 624470 625916 628156 631504 635801 640333 644548 648538 652713 657442 663250 670814 680182
60141F80182J0061R277P924P093O924O846O618O725P791R685J1334J1663J0798
60128G92921R916R626R012O800L091p93l893o200p774q290p730o846o361o172
60114G77307n699m816m062l995m489m837m518l764l116k609j896j221j418k594
60100G28273l644l650l111k953k976k311r70K03Q82J514K263K775L052L541M231
60085G27119M583M515M535M794M840M572M569N131N796N992N547M317K183m24
60071G88069k747m841p547j1019j4010j5308j5123j4593j4389j4375j4157j3433
60059F46527j2055j0187q234o480n076m299m231m238l460k041j076j091j309p73
60045E81977N18J948L086L664L498K914K708L172L653L513K901K187J294J73p53
$$ plain form
60141 680182 690243 699520 707444 714537 721461 728307 734925 741650 749441 759126 770460 782123 792921
60128 792921 802837 812463 821475 828275 831366 830573 826680 820480 812706 804416 796686 789840 783479 777307
60114 777307 771608 766792 762730 758735 754246 749409 744891 741127 738011 735402 733506 732285 730867 728273
60100 728273 724629 720979 717868 714915 711939 709628 708658 708861 709743 711257 713520 716295 719347 722888 727119
60085 727119 731702 736217 740752 745546 750386 754958 759527 764658 770454 776446 781993 786310 788493 788069
60071 788069 785322 780481 772934 761915 747905 732597 717474 702881 688492 674117 659960 646527
60059 646527 634472 624285 616051 609571 604495 600196 595965 591727 588267 586226 585150 584059 582750 581977
60045 581977 582495 584443 587529 591193 594691 597605 600313 603485 607138 610651 613552 615739 617033 617206 616453
60030F16453j225j678k523l372l759m078m992o270p040p041o824o762o592n983
60016E48314n078m258l771l574l340k657j504l58L01M13J10n87j527k208k261
60001E18015j895j470q23M68K260L743M248L895L382L285L504L422K703J874J806
59986E48417K625L546L951M091M461M917M845M012K851J976J657J605J260M65
59972E90679j66J80J516L088M365N423O290O606O322O049O259O689P054P807R451
59957F67612J1428J2393J1569R314O463L570P97j825m193o106p421q243q731q792
59943F77835q220p183o189n504n019m691m623m617m211l413k777k509k044r11
59929F15924N05J417J487J013P02J383L296N501O631O516O261O562O905O895P141
$$ plain form
60030 616453 615228 613550 611027 607655 603896 599818 594826 588556 581516 574475 567651 560889 554297 548314
60016 548314 543236 538978 535207 531633 528293 525636 524132 523774 524075 524488 524598 524011 522484 520276 518015
60001 518015 516120 514650 513827 514295 516555 520298 524546 528441 531823 535108 538612 542034 544737 546611 548417
59986 548417 551042 554588 558539 562630 567091 572008 576853 580865 583716 585692 587349 588954 590214 590679
59972 590679 590513 590693 592209 595297 599662 605085 611375 617981 624303 630352 636611 643300 650354 658161 667612
59957 667612 679040 691433 703002 712316 718779 722349 723146 721321 717128 711022 703601 695358 686627 677835
59943 677835 669615 662432 656243 650739 645720 641029 636406 631789 627578 624165 621388 618879 616835 615924
59929 615924 616429 617846 619333 620346 621048 622431 625727 631228 637859 644375 650636 657198 664103 670998 678139
59914F78139Q051Q837Q843Q961J0406J2644J3902J3476J2283J1253J0362R326
59902H06483Q146O758M920K746O56j221l063m756n962o706p189p107n950m012
59888G83743k341j480r56j63Q80J868K687L352L904M462N049N340N036M397L899
59873H19677L479K768J960J667J855J776J101M43L82O54O29P2q95k050l037l558
59857H26923l886m686o011p027p117o733o708p151p476p213o286m751k742o07
59843G48529J268K616L111K351L61k082m083n325n852n486m109k431j708k498
59829G24662m125n617o663p363p540o989o135n783o135o577o625o518o563o408
59815F35621n513m049k759k041j701j553j676j959j988j635j301j319j452j324
$$ plain form
59914 678139 686190 695027 703870 712831 723237 735881 749783 763259 775542 786795 797157 806483
59902 806483 814629 821387 826307 829053 829709 828488 825425 820669 814707 808001 800812 793705 787755 783743
59888 783743 781402 779922 778966 778803 779683 781551 784238 787590 791494 795956 801005 806345 811381 815778 819677
59873 819677 823156 825924 827884 829551 831406 833182 834283 834726 835108 835762 836391 836463 835568 833518 830481 826923
59857 826923 823037 818351 812340 805313 798196 791463 784755 777604 770128 762915 756629 751878 749136 748529
59843 748529 749797 752413 755524 757875 758236 756154 752071 746746 740894 735408 731299 728868 727160 724662
59829 724662 720537 714920 708257 700894 693354 686365 680230 674447 668312 661735 655110 648592 642029 635621
59815 635621 630108 626059 623300 621259 619558 618005 616329 614370 612382 610747 609446 608127 606675 605351
59801F05351j004q90j138j541j735j463p93k12k43q42j477j760j708j285l33Q32
59785E89759J404J130Q70J473K478K618J473%o19j59P12J259J319J319J714K418
59769F09168K911L029L280M177N522O688P350P624P749Q000Q771J0173J1634J2337
59755G08413J2134J1768J2026J2928J3819J4246J4535J5366J6692J7436J6685
59744H66048J4948J3614J3191J2830J1763J0285Q828O937L974M11k577m570o245
59731I49437q234j0279j1597j1707j0845r816r404r679j0024r954r658r502r456
59718H19282r345r333r650j0036r939r098p724o269n241m881m788m254l264k676
59704G22784k948l332k867j705p56m35m52n18n29k49M63J180J340J017P21N29
$$ plain form
59801 605351 604347 603457 602319 600778 599043 597580 596787 596575 596332 595490 594013 592253 590545 589260 588927 589759
59785 589759 591163 592293 593163 594636 597114 599732 601205 601205 600586 600427 601139 602398 603717 605036 606750 609168
59769 609168 612079 615108 618388 622565 628087 634775 642125 649749 657498 665498 674269 684442 696076 708413
59755 708413 720547 732315 744341 757269 771088 785334 799869 815235 831927 849363 866048
59744 866048 880996 894610 907801 920631 932394 942679 951507 958444 962418 962829 960252 955682 949437
59731 949437 941203 930924 919327 907620 896775 886959 877555 867876 857852 847898 838240 828738 819282
59718 819282 809937 800604 790954 780918 770979 761881 754157 747888 742647 737766 732978 728724 725460 722784
59704 722784 719836 716504 713637 711932 711176 710741 710289 709771 709242 708993 709456 710636 711976 712993 713714 714243
59688G14243K5j031k420l785m711m719l769k625k203k570l063l241l297l583m223
59673F69028n106n891o192o010n758n577n086m099l096k469j915j203q46j225
59659F14555j592j005J38N77N7l84K6Q65J342J242Q89P62J159J805J867Q58o43
59642F22518j719k250k732l337l954m781n976o863o480m941l413k670k438k178
59628E68786j820j587j692k223k922l265l115k966l068k900k156j601j892k335
59614E35244j883r47q05j635k421k566k206j242M67K053K393J882J932K657K723
59599E35646J667O02K64K7n03o21n5J71n97j401j174l55K6q1j04j6j28l37m28
59580E32603n90j005j407j581j754k041k182k167k358k630k344j486r21r93r39
$$ plain form
59688 714243 714268 713237 710817 707032 702321 697602 693833 691208 689005 686435 683372 680131 676834 673251 669028
59673 669028 663922 658031 651839 645829 640071 634494 629408 625309 622213 619744 617829 616626 615780 614555
59659 614555 612963 611958 612096 612673 612730 612346 612372 613237 614579 615821 616710 617472 618631 620436 622303 623161 622518
59642 622518 620799 618549 615817 612480 608526 603745 597769 590906 584426 579485 576072 573402 570964 568786
59628 568786 566966 565379 563687 561464 558542 555277 552162 549196 546128 543228 541072 539471 537579 535244
59614 535244 533361 532414 531609 529974 527553 524987 522781 521539 522006 524059 526452 528334 530266 532923 535646
59599 535646 537313 537915 538179 538206 537703 537082 537027 537198 536601 535200 534026 533671 533697 533616 533512 533496 533368 533031 532603
59580 532603 532013 531008 529601 528020 526266 524225 522043 519876 517518 514888 512544 511058 510137 509144 508205
59565E08205k72L57L90L43P18R35L58m27l89M83J424K040K429K667K934L596M538
59548E30329M997M675M332M640N164N201M916M843M927M918N111N985P625J0094
59534F07757J3429J6486J6824J3034O624N42l602n932o771o229m986m031l471
59521F39674k562j009N85J463J283O5j687l085l695m103n055o426p618q474q993
59506E90363q707p361n856n350n598n182l472j377j09K5n09j075j157o65r9j7
59490E43854l46n34k73L65J230K122K637K557K200K074K285K662L129L644M050
59475E71656M387M934N638N955N628N126M924M900M806M697M400L378J726N68
59461F32723O62J407J952K503L583M789N393N615O097O642O639O300O287O450
$$ plain form
59565 508205 507933 508290 508680 509023 509741 510676 511034 510607 510218 510701 512125 514165 516594 519261 522195 525791 530329
59548 530329 535326 540001 544333 548973 554137 559338 564254 569097 574024 578942 584053 590038 597663 607757
59534 607757 621186 637672 654496 667530 674154 674696 671094 665162 658391 652162 647176 643145 639674
59521 639674 637112 636103 636688 638151 639434 639499 637812 634727 631032 626929 621874 615448 607830 599356 590363
59506 590363 581656 574295 568439 563089 557491 552309 548837 547460 547351 547376 546867 545792 544635 543970 543871 543854
59490 543854 543508 542974 542701 543066 544296 546418 549055 551612 553812 555886 558171 560833 563962 567606 571656
59475 571656 576043 580977 586615 592570 598198 603324 608248 613148 617954 622651 627051 630429 632155 632723
59461 632723 633385 634792 636744 639247 642830 647619 653012 658627 664724 671366 678005 684305 690592 697042
59447F97042O157N548N251N039M040K151J01j817l903n975p340p890q057p673
59433F82674o023l296q69K71M91O17Q80J162J561K364L737N592P504Q942R944
59418G15551J1130J2573J3421J3306J3352J4597J6367J7675J9323K2433K5156
59407H94884K3396J5469M227o078j3280j7089j7560j5316j1828p903k831L556
59395H49647Q878R797N336k417j0471j6666j9911k0246j8881j7213j5626j3749
59383G38478j1663j0043r085q120o544m494k502q95K61J017J563K156K913L771
59369F96813M576N158N348N201N099N494O486P753Q820R398R585R829J0487J1395
59355H01442J2034J2206J2305J2729J3238J3236J2615J2026J2128J2760J3090
$$ plain form
59447 697042 703199 708747 713998 719037 723077 725228 725329 723512 719609 713634 706294 698404 690347 682674
59433 682674 676651 673355 672486 672757 673248 673865 674745 675907 677468 679832 683569 689161 696665 705607 715551
59418 715551 726681 739254 752675 765981 779333 793930 810297 827972 847295 869728 894884
59407 894884 918280 933749 937976 931898 918618 901529 883969 868653 856825 848922 846091 849647
59395 849647 858525 868322 873658 871241 860770 844104 824193 803947 785066 767853 752227 738478
59383 738478 726815 716772 707687 699567 693023 688529 686027 685132 685393 686410 687973 690129 693042 696813
59369 696813 701389 706547 711895 717096 722195 727689 734175 741928 750748 760146 769731 779560 790047 801442
59355 801442 813476 825682 837987 850716 863954 877190 889805 901831 913959 926719 939809
59344I39809J2570J1489J0493R800R105Q060O464M169J341j317l190m649o687
59331I97457r405j1700j2768j3185j3892j4761j4941j4102j2612j0781q740o860
59319H53710n547m684l826k841j893j096n69n12o54j64J259K659K986K543K378
59304H43749K728L007L082L379L881M155M307M888N760O095N515M212J914j983
59290H94689o994j1389j3955j4982j5096j4210j2250r948q079o502m673k585o13
59277G73413J145K749M047M984N937P234Q576R416R737R960J0246J0242R569Q276
59263H75531O800N544M469L182J457m54k235l959n799p508q591q933q741q029
59249H42734o625m685k801j525j051j208j505j473j192j162j416j334q31q78k053
$$ plain form
59344 939809 952379 963868 974361 984161 993266 1001326 1007790 1011959 1013300 1011983 1008793 1004144 997457
59331 997457 988052 976352 963584 950399 936507 921746 906805 892703 880091 869310 860570 853710
59319 853710 848163 843479 839653 836812 834919 833823 833254 832742 832088 831924 833183 835842 838828 841371 843749
59304 843749 846477 849484 852566 855945 859826 863981 868288 873176 878936 885031 890546 894758 896672 894689
59290 894689 887695 876306 862351 847369 832273 818063 805813 795865 787786 781284 776611 774026 773413
59277 773413 774558 777307 781354 786338 792275 799509 808085 817501 827238 837198 847444 857686 867255 875531
59263 875531 882331 887875 892344 895526 896983 896529 894294 890335 884536 877028 868437 859504 850763 842734
59249 842734 836109 831424 828623 827098 826047 824839 823334 821861 820669 819507 818091 816757 815926 815048 812995
59234H12995l285l246k384k218k970l406l008k716l202l873m075m104m405m810
59220G65293n112n540n956n615m322l105k950l486l607k868j675n01M03P78M25
59205G22162m77j310j365m28Q01J140K69p23p34j34mk98oR97J703J611J348J317
59187G25869J133Q44J350K841M087M081L467L439M125M954N830O912P805P896
59173G84633P214O252N275M307L494K944K614K643L317M402N102N000M449L791
59159H45437K860J641N71k04j145k471l762m860o188p732q646q540q232q420q546
59144G81763p836o728o245o556p022p153o804n903m776m143m109l775k526r66
59130G07221J86J241K635L694L619L087L480M879O074O414O325O113N491M568
$$ plain form
59234 812995 809710 806464 804080 801862 798892 795486 792478 789762 786560 782687 778612 774508 770103 765293
59220 765293 760181 754641 748685 743070 738748 735643 732693 729207 725600 722732 721057 720556 720959 721737 722162
59205 722162 721685 720375 719010 718582 719383 720523 720792 720069 719335 719201 719197 718899 718893 719890 721593 723204 724552 725869
59187 725869 727002 727846 729196 732037 736124 740205 743672 747111 751236 756190 762020 768932 776737 784633
59173 784633 791847 798099 803374 807681 811175 814119 816733 819376 822693 827095 832197 837197 841646 845437
59159 845437 848297 849938 850509 850305 849160 846689 842927 838067 831879 824147 815501 806961 798729 790309 781763
59144 781763 773927 767199 760954 754398 747376 740223 733419 727516 722740 718597 714488 710713 708187 707221
59130 707221 707407 708648 711283 714977 718596 721683 725163 730042 736116 742530 748855 754968 760459 765027
59116G65027M155M678N594O191O334O159N679M954M219L605L071K655K470K344
59102H27135J887J002M3o24j045j602k555l689m466m710m923n539o062n649m461
59087G84742l582l429l258k636k372l266m786n841o232o475o705o731o687o789
59073G15953o722o162n529n405n430m758l460k569k689l312l651l477l018k532
59059F57239k175j937j656j301j104j255j588j842j883j506m64R31J729J410O85
59044F45283O74J574K697L529M135M705N245N776O376P044P738Q410Q953R276
59030G21415R602J0244J1063J1582J1817J2351J3406J4509J5389J6476J8079J9637
59018H85570K0324J9745J7685J3918Q849L642r08n074r199j2741j5057j6352j7016
$$ plain form
59116 765027 769182 773860 779454 785645 791979 798138 803817 808771 812990 816595 819666 822321 824791 827135
59102 827135 829022 830024 830067 829443 828398 826796 824241 820552 816086 811376 806453 800914 794852 789203 784742
59087 784742 781160 777731 774473 771837 769465 766199 761413 755572 749340 742865 736160 729429 722742 715953
59073 715953 709231 703069 697540 692135 686705 681947 678487 675918 673229 669917 666266 662789 659771 657239
59059 657239 655064 653127 651471 650170 649066 647811 646223 644381 642498 640992 640528 641459 643188 644598 645283
59044 645283 645957 647531 650228 653757 657892 662597 667842 673618 679994 687038 694776 703186 712139 721415
59030 721415 731017 741261 752324 763906 775723 788074 801480 815989 831378 847854 865933 885570
59018 885570 905894 925639 943324 957242 966091 969733 968825 963751 954552 941811 926754 910402 893386
59005H93386j6722j5085j2745j0762r321p861o142m355k571r03P8l8o67q57n36
58990H04899m42r45j642j929j515n63K00m0j121j800j248o6Q30J595K854M356
58974H03423N331N803O443P329P885P974Q085Q455Q795Q973R242R684R920R443
58960I16785P972N674L332J848J223M54j206l454n715p980j0238j1931j2696j3042
58946H71026j3482j3609j2805j1257r544p816o154n005m419l594k020m18M39R82
58932G82324J925K928L369L603M184M601M183L546L591L655K387K1j911k901l850
58917H11655n207o300o593o241n364m037k933k660k573j552K30J696K813M560
58903G77494O988Q927R827J0369J1081J1820J2716J4119J5295J4887J3078J1728
$$ plain form
59005 893386 876664 861579 848834 838072 828751 820890 814748 810393 807822 806919 806997 806959 806292 805435 804899
58990 804899 804457 803512 801870 799941 798426 797863 798063 798023 796902 795102 793854 793788 794618 796213 799067 803423
58974 803423 808754 814557 821000 828329 836214 844188 852273 860728 869523 878496 887738 897422 907342 916785
58960 916785 924757 930431 933763 935611 936834 937288 936082 932628 926913 918933 908695 896764 884068 871026
58946 871026 857544 843935 831130 819873 810329 802513 796359 791354 786935 783341 781321 780903 781342 782324
58932 782324 784249 787177 790546 794149 798333 802934 807117 810663 814254 817909 820296 820317 818406 815505 811655
58917 811655 806448 800148 793555 787314 781950 777913 774980 772320 769747 768195 768425 770121 772934 777494
58903 777494 784482 793409 803236 813605 824686 836506 849222 863341 878636 893523 906601 918329
58891I18329J1802J2124J1418J0162R559R817J0412J1088J1692J1694J0643Q696
58879A047436O299L809J633N2j366l406o093q587j0286j1337j1964j2154j2041
58866I81995j1782j1006r298p205n778n122m488l761l634m122m220l441k604k572
58852I02962l178l795m081l743k509p07P75J357R65n63l306o506r086j1057j3318
58837H44210j5941j7808j8195j7541j6409j4813j2886j1057r251p059m948m083
58825F94219m465m571l399j736p97o44o02k71N08J808L113L457K649J641J255
58810F92165J324J404J474J456J001J76m72r00j765l255m562m957m595l969l374
58795F71151l198l769m603m708l920l108k783k521k003j529j167m67O03J457K013
$$ plain form
58891 918329 930131 942255 953673 963835 973394 983211 993623 1004711 1016403 1028097 1038740 1047436
58879 1047436 1053735 1057544 1059177 1059229 1057863 1054457 1048364 1039777 1029491 1018154 1006190 994036 981995
58866 981995 970213 959207 949909 942704 936926 931804 927316 923555 919921 915799 911579 908138 905534 902962
58852 902962 899784 895989 891908 888165 885656 884949 885724 887081 888046 887483 884177 877671 868585 857528 844210
58837 844210 828269 810461 792266 774725 758316 743503 730617 719560 710309 703250 698302 694219
58825 694219 689754 685183 681784 680048 679251 678607 678005 677734 678242 680050 683163 686620 689269 690910 692165
58810 692165 693489 694893 696367 697823 698824 699000 698528 697628 695863 692608 688046 683089 678494 674525 671151
58795 671151 667953 664184 659581 654873 650953 647845 645062 642541 640538 639009 637842 637375 637978 639435 641448
58780F41448K890M147M891M655M087L823L645L228K682J977Q25n26j346j599j945
58765F72882k366k114j266r36j415j523m72J020K139L193M605N898O581O923P078
58750G00227O486M931L138J629M1j764l022l248l011k789k196j021J24Q84J773
58735G02182K942L541L132K568K626K935L059L409M145M409L713K946K920L028
58721G47555K345J165L60R8J72N98J043P17k50n09M65J240M64j147k064k179k414
58704G47659l062l882n072o868q793j0324j1701j3117j3977j3891j3484j3265
58692F30223j2631j1132r647r120r014q281o997n842m834l800l246l437l463k482
58678E36297j177o60o34l7J172K178K721L079L150K746K302K237K192J884K083
$$ plain form
58780 641448 644338 648485 653376 658031 662118 665941 669586 672814 675496 677473 678298 677772 676426 674827 672882
58765 672882 670516 668402 667136 666200 664785 663262 662790 663810 665949 669142 673747 679645 686226 693149 700227
58750 700227 706713 711644 714782 716411 716452 714688 711666 708418 705407 702618 700422 699401 699525 700409 702182
58735 702182 705124 708665 711797 714365 716991 719926 722985 726394 730539 734948 738661 741607 744527 747555
58721 747555 749900 751065 751425 751523 751695 752293 753336 754053 753803 753294 753759 754999 755463 754316 752252 750073 747659
58704 747659 744597 740715 735643 728775 719982 709658 697957 684840 670863 656972 643488 630223
58692 630223 617592 606460 596813 587693 578679 570398 563401 557559 552725 548925 545679 542242 538779 536297
58678 536297 535120 534460 533826 533789 534961 537139 539860 542939 546089 548835 551137 553374 555566 557450 559533
58663E59533L542N644P157P712P506O314L976J227j043k800m193m730m254l829
58649E81762m452n537n891n431m811m146l343k875k971k775j586j35O03R89J776
58634E41177K517K447K092K379K821K262R75K68M24N71L55L40P81J307J675J873
58618E64264J759J489J686K449K917K808L304N152O966O983N535M232L479K609
58604F15632J735J537J688J219K33l18k57j17J82R99J731J421M52J73J049K436
58588F29795L866N277O298O619O807P612Q875J0049J1184J2291J2650J1968J1313
58575G44604J1535J1711J0715R302Q950R558J0111J0704J1972J3344J3891J4265
58563H80662J5671J7634J8785J9280K0217K1202K0814J9134J7449J5666J2373
$$ plain form
58663 559533 563075 568719 575876 583588 591094 597408 601384 602611 601568 598768 594575 589845 585591 581762
58649 581762 577310 571773 565882 560451 555640 551494 548151 545276 542305 539530 537944 537809 538412 539401 541177
58634 541177 543694 546141 548233 550612 553433 555695 556670 556938 557362 557933 558288 558628 559409 560716 562391 564264
58618 564264 566023 567512 569198 571647 574564 577372 580676 585828 592794 599777 605312 609544 613023 615632
58604 615632 617367 618904 620592 621811 622044 621726 621469 621352 621534 622533 624264 625685 626137 626310 627359 629795
58588 629795 633661 638938 645236 651855 658662 666274 675149 685198 696382 708673 721323 733291 744604
58575 744604 756139 767850 778565 787867 796817 806375 816486 827190 839162 852506 866397 880662
58563 880662 896333 913967 932752 952032 972249 993451 1014265 1033399 1050848 1066514 1078887
58552A078887P502K673j229m731p908r883j0424j0278r760q741p995q682j0498
58539I98933j2104j3416j5528j8371k0415k0924k0707k0323j9327j7608j5810
58528H04400j4163j2237j0078q255o775n241l865l047k352j290n36p70j057k10
58514G34524R12N88q56j591j294j220j654j743j678k488l642l397j714m40l29
58499G13978k54M02R22J122J735K589K608K059K479M016N147N365N880P099P782
58484G62929P357O932P297P913Q451R402J0620J1280J1655J2913J4703J5031J3042
58471H99525R862O419K621r63k996l634m564o174o884n989m831m325l600k026
58457H72441m48O10J962M017N841O827P609Q561R030Q623P545N371J385l428o834
$$ plain form
58552 1078887 1086389 1089062 1087833 1083102 1075194 1065311 1054887 1044609 1034849 1026108 1018113 1009431 998933
58539 998933 986829 973413 957885 939514 919099 898175 877468 857145 837818 820210 804400
58528 804400 790237 778000 767922 759667 752892 747651 743786 740739 738387 737097 736561 735791 734734 734524
58514 734524 735436 736024 735168 733577 732283 731063 729409 727666 725988 723500 719858 716461 714747 714307 713978
58499 713978 713724 714126 715048 716170 717905 720494 723102 725161 727640 731656 736803 742168 748048 755147 762929
58484 762929 770286 777218 784515 792428 800879 810281 820901 832181 843836 856749 871452 886483 899525
58471 899525 909387 915806 918427 917464 914468 910834 906270 900096 893212 887223 882392 878067 874467 872441
58457 872441 871993 872603 874565 878582 884423 891250 898859 907420 916450 925073 932618 937989 939374 935946 929112
58442I29112q218q982r755r465p702n701m305k980j526o44k52O90K230L368M154
58427H80024N580P128P093N744N404O816Q035P730O813O028M609K310J78j605
58413I51887m082o905q034p036n994o155o345n689n098m951m078k336j480k148
58399H81556k555j481j9Q87K049L907N323N765O220O856O348M569L322L376L484
58384I29607L195L689M844M773L361L004M516N695N407N556P294Q741Q473P956
58370A006111Q572R338R517J0296J1935J2482J1291J0582J1548J2316J1772J1800
58358A137560J3437J4427J3215J1835J2118J2400J0889Q961Q247P595N930M981
58346A261595O126P489P248O872Q059R451R455R431J0903J2507J2804J3249J5143
$$ plain form
58442 929112 920894 911912 902157 892692 884990 879289 874984 872004 870478 869834 869582 870272 872502 875870 880024
58427 880024 885604 892732 899825 905569 910973 917789 925824 933554 940367 946395 951004 953314 953492 951887
58413 951887 947805 940900 932866 925830 919836 913681 907336 901647 896549 891598 887520 885184 883704 881556
58399 881556 879001 877520 877501 878388 880437 884344 889667 895432 901652 908508 914856 919425 922747 926123 929607
58384 929607 932802 936491 941335 946108 949469 952473 956989 962684 968091 973647 980941 989682 998155 1006111
58370 1006111 1014683 1024021 1033538 1043834 1055769 1068251 1079542 1090124 1101672 1113988 1125760 1137560
58358 1137560 1150997 1165424 1178639 1190474 1202592 1214992 1225881 1234842 1243089 1250684 1256614 1261595
58346 1261595 1267721 1275210 1282458 1289330 1297389 1306840 1316295 1325726 1336629 1349136 1361940 1375189 1390332
58333A390332J6613J5979J5257J6775J8988J9149J7693J6558J5556J3762J2157
58322A568819J1638J0765Q514O810P318Q369Q111P922R503J1499J2214J2954J5247
58309A699683J7601J8246J8410J9646K0825K0886K1527K3881K5739K5423K5064
58298A936931K6618K8161K7690K6940K7671K7951K6187K5036K7040L0061L1304
58287B241590L2178L4732L7173L7529L7992M0802M3628M3967M4142M6841M9627
58276B690201M9326M8167M9900N3417N5739N7733O1322O4545O4983O4619O5985
58265C325937O7363O7160O8668P4649Q1616Q5506Q8443R3668R8677J00224J01219
58254D253130J05450J10224J11723J12780J17692J24152J28227J32343J40143
$$ plain form
58333 1390332 1406945 1422924 1438181 1454956 1473944 1493093 1510786 1527344 1542900 1556662 1568819
58322 1568819 1580457 1591222 1599736 1606546 1613864 1622233 1630344 1638266 1647769 1659268 1671482 1684436 1699683
58309 1699683 1717284 1735530 1753940 1773586 1794411 1815297 1836824 1860705 1886444 1911867 1936931
58298 1936931 1963549 1991710 2019400 2046340 2074011 2101962 2128149 2153185 2180225 2210286 2241590
58287 2241590 2273768 2308500 2345673 2383202 2421194 2461996 2505624 2549591 2593733 2640574 2690201
58276 2690201 2739527 2787694 2837594 2891011 2946750 3004483 3065805 3130350 3195333 3259952 3325937
58265 3325937 3393300 3460460 3529128 3603777 3685393 3770899 3859342 3953010 4051687 4151911 4253130
58254 4253130 4358580 4468804 4580527 4693307 4810999 4935151 5063378 5195721 5335864
58245E335864J48560J53642J58962J69296J81317J89912J98261K11643K26967
58236F974424K38886K50770K68550K89234L07004L25135L49869L78120M03823
58227I785815M30799M66201N06985N46665N89579O44089P07635P73839Q48286
58218A5299893R41305J051604J174213J318067J497616J714007J963963K259937
58210B7220605K620227L046065L529745M075241M684182N329809N974197O605096
58202F3085167P227252P826284Q372116Q843886R211533R411329R401066R244125
58194A32622758R089946R075143R297858R869935J0904738J2457319J4580272
58187B07897969J7395107K0816216K3972703K5069279K2267795J5047423M786433
$$ plain form
58245 5335864 5484424 5638066 5797028 5966324 6147641 6337553 6535814 6747457 6974424
58236 6974424 7213310 7464080 7732630 8021864 8328868 8654003 9003872 9381992 9785815
58227 9785815 10216614 10682815 11189800 11736465 12326044 12970133 13677768 14451607 15299893
58218 15299893 16241198 17292802 18467015 19785082 21282698 22996705 24960668 27220605
58210 27220605 29840832 32886897 36416642 40491883 45176065 50505874 56480071 63085167
58202 63085167 70312419 78138703 86510819 95354705 104566238 113977567 123378633 132622758
58194 132622758 141712704 150787847 160085705 169955640 180860378 193317697 207897969
58187 207897969 225293076 246109292 270081995 295151274 317419069 332466492 337252925
58180C37252925o002885j5070595k1335137k4871119k6346294k6454084k5636528
58173A91536283k4115789k2067847j9720784j7304006j4968801j2795945j0845109
58166F9718002r155907p723114o513476n502749m673329l991216l416365k929488
58158B5812358k525528k189167j899666j651904j449798j284481j139402j011475
58150A2660937r07322q23110p46774o76297o17823n68799n19860m70903m29419
58141F900630l95008l60355l25445k96585k73246k49509k26809k11996k03972
58132D357705j94882j83277j74185j67394j57589j45299j36227j30300j22169
58123B946383j11994j05131j01508r5722q7410q1654p9169p5527p0138o6796o5333
$$ plain form
58180 337252925 331250040 316179445 294844308 269973189 243626895 217172811 191536283
58173 191536283 167420494 145352647 125631863 108327857 93359056 80563111 69718002
58166 69718002 60562095 52838981 46325505 40822756 36149427 32158211 28741846 25812358
58158 25812358 23286830 21097663 19197997 17546093 16096295 14811814 13672412 12660937
58150 12660937 11753615 10930505 10183731 9507434 8889611 8320812 7800952 7330049 6900630
58141 6900630 6505622 6145267 5819822 5523237 5249991 5000482 4773673 4561677 4357705
58132 4357705 4162823 3979546 3805361 3637967 3480378 3335079 3198852 3068552 2946383
58123 2946383 2834389 2729258 2627750 2532028 2444618 2362964 2283795 2208268 2138130 2071334 2006001
58112B006001o1676n6247n3561n3441n1155m6422m3794m3883m2495l8992l7395
58101A476940l8454l8364l6122l4752l4518l2250k8221k6530k7659k7532k4942
58090A127596k3182k3303k2392j9656j7943j7950j6989j4650j3803j4917j5046
58079I27765j3554j3278j4958j5997j5694j6300j7926j7796j5610j4382j4918
58068G57352j4657j2996j2533j3793j3864j1677r777r535r227q102p812q566q341
58055F16472p037p018q446q608o984o408p920q901p808o485o277n904m752m380
58041E19544n247n570m725m378n103n388m928n306o638p090o508o761p885p789
58027D36228o448o264p461p426n616m710n654n995m637l881m936n592m362k999
$$ plain form
58112 2006001 1944325 1888078 1834517 1781076 1729921 1683499 1639705 1595822 1553327 1514335 1476940
58101 1476940 1438486 1400122 1364000 1329248 1294730 1262480 1234259 1207729 1180070 1152538 1127596
58090 1127596 1104414 1081111 1058719 1039063 1021120 1003170 986181 971531 957728 942811 927765
58079 927765 914211 900933 885975 869978 854284 837984 820058 802262 786652 772270 757352
58068 757352 742695 729699 717166 703373 689509 677832 668055 658520 649293 641191 633379 624813 616472
58055 616472 609435 602417 593971 585363 578379 571971 564051 555150 547342 540857 534580 528676 523924 519544
58041 519544 514297 508727 504002 499624 494521 489133 484205 478899 472261 465171 458663 451902 444017 436228
58027 436228 429780 423516 416055 408629 403013 398303 392649 386654 382017 378136 373200 367608 363246 360247
58013C60247k828k430j022n12j844k813j741j93J06j0M27M10n86j035j95L71j13
57996C46239J3J469K085M95j308j308o16q34j112l21L47m77j697j807j513j989
57980C37666k441j798j060j598k701k938k540k455k370j569n40r6p2j59o91j429
57964C13209j143L86J588J419P59N26K89q4M06J741K140R01r3O33J748J592J021
57947C27038J686L161L920L924M132M538M534M429N011O191P242P789P805P475
57933C98875P487Q351R168Q629P228O578O394M697J498o35p46j233l918p165q820
57918D36388r416j0305j0892j0136q921q547q495p760o856o470n734l919k243
57905C36694j925k022j352r12k024l531l448k221j820k406k457j549o17J55J477
$$ plain form
58013 360247 357419 354989 353967 353455 351611 348798 347057 346864 346970 346960 347387 347797 347211 346176 345981 346352 346239
57996 346239 346252 347721 349806 350301 348993 347685 347069 346235 345123 344802 345149 344672 342975 341168 339655 337666
57980 337666 335225 333427 332367 330769 328068 325130 322590 320135 317765 316196 315656 315560 315488 315329 314638 313209
57964 313209 312066 312452 314040 315459 316218 316744 317033 316949 317355 319096 321236 322137 322044 322677 324425 326017 327038
57947 327038 328724 331885 335805 339729 343861 348399 352933 357362 362373 368564 375806 383595 391400 398875
57933 398875 406362 414713 423881 432510 439738 446316 452710 457407 458905 458270 457524 456291 452373 445208 436388
57918 436388 426972 416667 405775 395639 386718 378171 369676 361916 355060 348590 342856 338937 336694
57905 336694 334769 332747 331395 330483 328459 324928 321480 319259 317439 315033 312576 311027 310410 310565 312042
57890C12042L169M137M075L640L163K595K320K673L033K617J750J176P82J15m82
57875C46805n26m85j023j763j937j654j456j319j093j124j491j477p29k9M5J27
57859C30871P73J328J213J084J595K109J912J513J521J438Q38N06J021J421P00
57844C49843n68j446k280l621m741m761m146l637k945j891j490k216k659j608
57830C11834j77R3j77M30J457J614J308J771K606K577K030K101K237J094o24r07
57814C29267K38Q20J75l06K0M3q27j600j665j897l017m317m817m471l682k686
57798C01278j747j083m30N05J294J375J071J020R88N20J97Q76J994K268J824K022
57782C13972L243M324M334L527K454J488J208J998L136L457K944K506K317J649
$$ plain form
57890 312042 315211 319348 323423 327063 330226 332821 335141 337814 340847 343464 345214 346390 347172 347287 346805
57875 346805 346279 345794 344771 343008 341071 339417 337961 336642 335549 334425 332934 331457 330728 330699 330744 330871
57859 330871 331644 332972 334185 335269 336864 338973 340885 342398 343919 345357 346195 346701 347722 349143 349843
57844 349843 349275 347829 345549 341928 337187 332426 328280 324643 321698 319807 318317 316101 313442 311834
57830 311834 311657 311750 311573 312003 313460 315074 316382 318153 320759 323336 325366 327467 329704 330798 330174 329267
57814 329267 329505 330325 330500 330194 330214 330257 329430 327830 326165 324268 321251 316934 312117 307646 303964 301278
57798 301278 299531 298448 298018 298523 299817 301192 302263 303283 304271 304791 304988 305864 307858 310126 311950 313972
57782 313972 317215 321539 325873 329400 331854 333342 334550 336548 339684 343141 346085 348591 350908 352557
57768C52557L15r97j866k524l039l253l456m083m755m615l596k400j496r77j060
57753C14755j672j943j248k89l3o2P03K140L167L408L225K515J019n02r87p03
57737C23493o78q44l70M10K06j125k347k702k537k073j197m43o04j273j298p29
57721C05889o69j228j311o09m7m0L7L10jj021j800j903j910j998j534n92l08j096
57703B90169j895j825j309r45n49O4N10O99J204K133K642K186J369J085J535K448
57687B99521L509M305M656N040O007P303Q420R706J1695J3695J4557J4613J5207
57674D18234J6348J6650J5831J5449J6597J8730K1384K5490L1836L9374M5592
57663F81515M7593M2631K9397R823j1329k9444m2155m8911n0232m7834m3851l9117
$$ plain form
57768 352557 352872 351875 350009 347485 344446 341193 337737 333654 328899 324284 320688 318288 316792 315815 314755
57753 314755 313083 311140 309892 309603 309570 309508 310211 312351 315518 318926 322151 324666 325685 325183 324196 323493
57737 323493 322815 321971 321601 322011 322217 321092 318745 316043 313506 311433 310236 309793 309189 307916 306618 305889
57721 305889 305220 303992 302681 302072 302025 301985 302022 302332 302331 301310 299510 297607 295697 293699 292165 291573 291265 290169
57703 290169 288274 286449 285140 284195 283646 283710 284220 284919 286123 288256 290898 293084 294453 295538 297073 299521
57687 299521 303030 307335 311991 317031 323038 330341 338761 348467 360162 373857 388414 403027 418234
57674 418234 434582 451232 467063 482512 499109 517839 539223 564713 596549 635923 681515
57663 681515 729108 771739 801136 810959 799630 770186 728031 679120 628888 581054 537203 498086
57651D98086l3313k7020k1986j8851j6248j2998r675p204n394l877l030k975k814
57638C32701j916q86m31l05j52j57k17K90J158J153k6r45o09O2m8m84m16k35n39
57619C27998p25j42M02j60j255j465o28K62O88Q91J009J082J426J989J923Q12
57603C34107l65n60j89k13m49j31M16K13o40r96l98M69R59J056P67o3j208k055
57585C30720k239j795q34L74J210J163L72n55j063q06J75J203J490J182J216J806
57569C33619K078J577J072J197J352Q43J37O0N05R06J312K014K736L084L191L197
57553C58880K818K186K205L175M039L934L612M055M737M591L847L442L283K686
57539D07490J996K137K856L041K595K510L104L622L618L409L065K243J166O25
$$ plain form
57651 498086 464773 437753 415767 396916 380668 367670 357995 350791 345397 341520 338490 335515 332701
57638 332701 330785 329899 329468 329163 329011 328854 328637 328927 330085 331238 331212 330267 329658 329720 329672 329188 328772 328537 327998
57619 327998 327273 327131 327533 327373 326118 324653 324025 324287 324975 325866 326875 327957 329383 331372 333295 334107
57603 334107 333742 333182 332993 332780 332331 332200 332616 332829 332189 331193 330795 331264 332223 333279 334046 333983 332775 330720
57585 330720 328481 326686 325852 326226 327436 328599 328971 328416 327353 326547 326722 327925 329415 330597 331813 333619
57569 333619 335697 337274 338346 339543 340895 341738 341875 341935 342440 343346 344658 346672 349408 352492 355683 358880
57553 358880 361698 363884 366089 369264 373303 377237 380849 384904 389641 394232 398079 401521 404804 407490
57539 407490 409486 411623 414479 417520 420115 422625 425729 429351 432969 436378 439443 441686 442852 443477
57525D43477Q11J178J523K217L224L957M280M688N301N588N261M712M333M165
57511D94715M219M482M573M151L617L611L916L707K938K469K734L200L367L462
57497E45161L757L917L492K591J733J348J535K046K434K519K633L088L647L908
57483E83809L998M280M629M554M062L739M014M733N483N881N655M852L975L632
57469F47296M061N000N823N816M927M195M742O056O419N298M252M624N613N755
57455G19877N262N453O478P221P139O814O749O867P180P818Q397Q309P639O988
57441H18191O514O069N960O613P669Q456R094J0056J0901J0713R728R162R393
57428I28519R551R100Q610Q666R090R583J0212J0851J1008J0570J0051R867R953
$$ plain form
57525 443477 444288 445466 446989 449206 452430 456387 460667 465355 470656 476244 481505 486217 490550 494715
57511 494715 498934 503416 507989 512140 515757 519368 523284 526991 529929 532398 535132 538332 541699 545161
57497 545161 548918 552835 556327 558918 560651 561999 563534 565580 568014 570533 573166 576254 579901 583809
57483 583809 587807 592087 596716 601270 605332 609071 613085 617818 623301 629182 634837 639689 643664 647296
57469 647296 651357 656357 662180 667996 672923 677118 681860 687916 694335 699633 703885 708509 714122 719877
57455 719877 725139 730592 737070 744291 751430 758244 764993 771860 779040 786858 795255 803564 811203 818191
57441 818191 824705 830774 836734 843347 851016 859472 868566 878622 889523 900236 909964 919126 928519
57428 928519 938070 947170 955780 964446 973536 983119 993331 1004182 1015190 1025760 1035811 1045678 1055631
57415A055631J0183J0494J0615J0348J0150J0634J1600J2299J2567J2877J3336
57404A180734J3535J3385J3168J2843J2181J1587J1781J2665J3394J3591J3587
57393A322451J3497J3164J2978J3644J4967J5916J6035J5836J5732J5633J5706
57382A485559J6444J7706J8671J8962J8925J8742J8310J8024J8527J9479J9686
57371A689035J8706J7316J6275J5706J5789J6760J8022J8567J8572J9246K0801
57360A884795K1964K1921K1355K1013K0685K0200K0118K0654K1157K1343K1828
57349B117033K2759K3250K3020K3179K4361K5431K5206K4300K3975K4202K4227
57338B380943K4167K4695K5736K6733K7627K8485K8780K8195K7612K8091K9308
$$ plain form
57415 1055631 1065814 1076308 1086923 1097271 1107421 1118055 1129655 1141954 1154521 1167398 1180734
57404 1180734 1194269 1207654 1220822 1233665 1245846 1257433 1269214 1281879 1295273 1308864 1322451
57393 1322451 1335948 1349112 1362090 1375734 1390701 1406617 1422652 1438488 1454220 1469853 1485559
57382 1485559 1502003 1519709 1538380 1557342 1576267 1595009 1613319 1631343 1649870 1669349 1689035
57371 1689035 1707741 1725057 1741332 1757038 1772827 1789587 1807609 1826176 1844748 1863994 1884795
57360 1884795 1906759 1928680 1950035 1971048 1991733 2011933 2032051 2052705 2073862 2095205 2117033
57349 2117033 2139792 2163042 2186062 2209241 2233602 2259033 2284239 2308539 2332514 2356716 2380943
57338 2380943 2405110 2429805 2455541 2482274 2509901 2538386 2567166 2595361 2622973 2651064 2680372
57327B680372L0114L0165K9923K9506K8769K8180K8445K9376L0220L0914L1984
57316C007968L3330L4201L4301L4117L4042L4032L4110L4398L4659L4491L4082
57305C383731L4064L4643L5465L6365L7562L9034M0283M0894M0991M0967M1132
57294C805131M1577M2181M2716M3097M3449M3820M4124M4424M4942M5568M5785
57283D286814M5395M4909M4948M5550M6291M6746M6660M6110M5643M5755M6125
57272D790946M5987M5370M5118M5478M5656M5253M5048M5649M6274M5892M4840
57261E291511M4334M4786M5622M6329M6862M7263M7690M8600N0154N1744N2647
57250E817542N2868N2778N2359N1471N0459M9725M9062M8049M6809M5664M4446
$$ plain form
57327 2680372 2710486 2740651 2770574 2800080 2828849 2857029 2885474 2914850 2945070 2975984 3007968
57316 3007968 3041298 3075499 3109800 3143917 3177959 3211991 3246101 3280499 3315158 3349649 3383731
57305 3383731 3417795 3452438 3487903 3524268 3561830 3600864 3641147 3682041 3723032 3763999 3805131
57294 3805131 3846708 3888889 3931605 3974702 4018151 4061971 4106095 4150519 4195461 4241029 4286814
57283 4286814 4332209 4377118 4422066 4467616 4513907 4560653 4607313 4653423 4699066 4744821 4790946
57272 4790946 4836933 4882303 4927421 4972899 5018555 5063808 5108856 5154505 5200779 5246671 5291511
57261 5291511 5335845 5380631 5426253 5472582 5519444 5566707 5614397 5662997 5713151 5764895 5817542
57250 5817542 5870410 5923188 5975547 6027018 6077477 6127202 6176264 6224313 6271122 6316786 6361232
57239F361232M2840M1128L9826L8887L7968L7218L7155L7925L9276M0968M2723
57228F797146M4135M5184M6451M8252N0061N1374N2494N3740N4525N4176N3135
57217G350673N2373N1971N1282N0123M8793M7247M5324M3513M2459M1843M0789
57206G866390L9247L7899L6831L5499L4029L3360L3787L4437L4560L4521L5078
57195H255638L6363L8022L9890M2149M5069M8568N1875N3826N3939N2954N1812
57184H770105N0451M8213M4995M1108L6354L0284K3354J6847J1510P075L112n28
57172I082880m252q778j4348k0449k6458l2027l6894m1032m5100n0015n5747o1112
57160H686668o4894o6788o7194o6585o5243o3188o0266n6460n2019m7037m1361
$$ plain form
57239 6361232 6404072 6445200 6485026 6523913 6561881 6599099 6636254 6674179 6713455 6754423 6797146
57228 6797146 6841281 6886465 6932916 6981168 7031229 7082603 7135097 7188837 7243362 7297538 7350673
57217 7350673 7403046 7455017 7506299 7556422 7605215 7652462 7697786 7741299 7783758 7825601 7866390
57206 7866390 7905637 7943536 7980367 8015866 8049895 8083255 8117042 8151479 8186039 8220560 8255638
57195 8255638 8292001 8330023 8369913 8412062 8457131 8505699 8557574 8611400 8665339 8718293 8770105
57184 8770105 8820556 8868769 8913764 8954872 8991226 9021510 9044864 9061711 9073221 9080296 9083408 9082880
57172 9082880 9078628 9069850 9055502 9035053 9008595 8976568 8939674 8898642 8853542 8803527 8747780 8686668
57160 8686668 8621774 8554986 8487792 8421207 8355964 8292776 8232510 8176050 8124031 8076994 8035633
57149H035633l5200k9374k4434k0190j6779j5452j7360k1981k7879l4455m1778
57138G750751m9139n5131n9116o1240o1120n8016n2396m6006m0037l4526k9833
57127G204191k7319k7851l0681l4356l7771l9868l9369l5605k9001k0257r747
57116F872366J898J3554K4620L5831M8575O3925Q2492J04551J29867J57975J88976
57105G724630K23722K63153L08002L59140M17553M83884N58373O40776P29457
57096A1708690Q21113R12759J004037J096681J192058J290344J390984J491657
57088B0908323J587199J672597J748305J821564J903248K005527K138910K300789
57080C6086462K458678K547649K494032K250357J814806J226454N47711j54876
$$ plain form
57149 8035633 8000433 7971059 7946625 7926435 7909656 7894204 7876844 7854863 7826984 7792529 7750751
57138 7750751 7701612 7646481 7587365 7526125 7465005 7406989 7354593 7308587 7268550 7234024 7204191
57127 7204191 7176872 7149021 7118340 7083984 7046213 7006345 6966976 6931371 6902370 6882113 6872366
57116 6872366 6874264 6887818 6912438 6948269 6996844 7060769 7143261 7247812 7377679 7535654 7724630
57105 7724630 7948352 8211505 8519507 8878647 9296200 9780084 10338457 10979233 11708690
57096 11708690 12529803 13442562 14446599 15543280 16735338 18025682 19416666 20908323
57088 20908323 22495522 24168119 25916424 27737988 29641236 31646763 33785673 36086462
57080 36086462 38545140 41092789 43586821 45837178 47651984 48878438 49426149 49271273
57072D9271273q28248j443274j989680k459322k835321l097568l235459l253226
57064C0129175l166305k996632k769894k511802k243447j979774j731417j505793
57056A1224111j306104j131368r78887q46385p31795o32587n46535m72513m09772
57047D168165l56758l11398k72200k38434k09420j84205j61975j42303j24970
57038B166502j09813r6681q5239p4981o5617n7374n0505m4734l9465l4319k9107
57027A478667k3500j7141r606K37J3854L0134M2822M3006K5970m549l9252o9568
57015A471074r0892j01812j02994r7035q7615p7626o8205n9521n1684m4800l8840
57004F50050l3735k9238k4865k0462j6668j4149j2530j0781q601o652n489m972
$$ plain form
57072 49271273 48443025 46999751 45010071 42550749 39715428 36617860 33382401 30129175
57064 30129175 26962870 23966238 21196344 18684542 16441095 14461321 12729904 11224111
57056 11224111 9918007 8786639 7807752 6961367 6229572 5596985 5050450 4577937 4168165
57047 4168165 3811407 3500009 3227809 2989375 2779955 2595750 2433775 2291472 2166502
57038 2166502 2056689 1960008 1874769 1799788 1734171 1676797 1626292 1581558 1542093 1507774 1478667
57027 1478667 1455167 1438026 1428420 1428657 1442511 1472645 1515467 1558473 1584443 1579894 1540642 1471074
57015 1471074 1380182 1278370 1175376 1078341 990726 913100 844895 785374 733690 688890 650050
57004 650050 616315 587077 562212 541750 525082 510933 498403 487622 479021 472369 466880 461908
56992D61908m724m467l877k802j570n18O54K369M352O184Q241J0804J2473J0982
56978E00009N947n07o115j0158j2514j2659j0695q151o550n816m922l499j903
56965D22467m00Q95J682J920K274L470N484P900J0586J3360J5377J5473J3015
56952E13503Q116J474n635j1606j5344j6726j6223j4434j2155j0134q417o419
56940D06000l955j592J50J336K164K801L876O173R540J2994J6177J9325K1329
56927D96318J9471J2335J977q106j6150k2128k5741k6370k4655k2367k0508j8745
56915C45331j6730j4745j2943j1108r332q016p035n767m128k755j980j349m28
56902B49015O44J617K590L665M593N027M907M456M061M072M524N082N540O247
$$ plain form
56992 461908 457184 452717 448840 446038 444468 443950 444604 446973 451325 457509 465750 476554 489027 500009
56978 500009 505956 505449 499334 489176 476662 464003 453308 445157 438607 432791 427869 424370 422467
56965 422467 422067 422962 424644 426564 428838 432308 437792 445692 456278 469638 485015 500488 513503
56952 513503 521619 523093 517458 505852 490508 473782 457559 443125 430970 420836 412419 406000
56940 406000 402045 400453 400603 401939 404103 406904 410780 416953 426493 439487 455664 474989 496318
56927 496318 515789 528124 530101 521995 505845 483717 457976 431606 406951 384584 364076 345331
56915 345331 328601 313856 300913 289805 280473 272457 265422 259655 255527 252772 250792 249443 249015
56902 249015 249659 251276 253866 257531 262124 267151 272058 276514 280575 284647 289171 294253 299793 306040
56888C06040P728J0067J2862J5534J7381J7679J6132J3090R070M423j71l497m794
56875D21544m615m019l113j113K205N762Q124Q827Q691Q985J0301J2152J3761
56862D87492J5256J7813K2529K9359L6810M2089M1898L4465K1491P269m584j3004
56850G38883j8220k0109j8758j5379j1432p354l116P95L885O500R110J1448J3515
56837F89768J6685K2336K9826L7386M4572N1973N8184N8922N0241L2134Q625j4905
56825A085747l4271m7458n4305n5519n2098m5566l7994l1015k4864j8980j3308
56814F70369q376m353p92K858P087J2521J9480K7379L4856M0231M1380L5983K3199
56801I01822N113j4164l0846m2686m8822m9755m7314m3391l8531l2481k5862k0207
$$ plain form
56888 306040 313768 323835 336697 352231 369612 387291 403423 416513 425583 430006 429835 426338 421544
56875 421544 416929 412910 409797 408684 410889 416651 424775 433602 442293 451278 461579 473731 487492
56862 487492 502748 520561 543090 572449 609259 651348 693246 727711 749202 756471 751887 738883
56850 738883 720663 700554 681796 666417 654985 647631 644515 645310 649195 655695 664805 676253 689768
56837 689768 706453 728789 758615 796001 840573 892546 950730 1009652 1059893 1092027 1100652 1085747
56825 1085747 1051476 1004018 949713 894194 842096 796530 758536 727521 702657 683677 670369
56814 670369 661993 657640 656848 659706 666793 679314 698794 726173 761029 801260 842640 878623 901822
56801 901822 906935 892771 861925 819239 770417 720662 673348 629957 591426 558945 533083 512876
56789E12876j6308j3572j1085q448n520k195J367N025R174J4149J8966K1389J9512
56776E45330J2934K696r117j9881k7552l1682l3022l2338l0177k7343k4612k2066
56764C03170j9455j7059j5298j3775j1708r215p194n949m977m091l725l973m250
56751A82501m094l539k669j526n27j92m47q47j296j819j942j310o05p28j280j083
56735A58597j07M25j06r98j527j712j566q22L13J155J535J849K046J701J134J245
56719A63162J987K301J851J468J560J421P44M36J119J916J720Q43M43Q66J382
56704A83219J279P10M86J155K113K015M93j006j027r9K84R1M88J384J275j70j280
56687A91410q31L40Q85O30j36j462k892l143j792j69L86J85J98M90O41P34Q69
$$ plain form
56789 512876 496568 482996 471911 463463 457943 455748 457115 462140 471314 485463 504429 525818 545330
56776 545330 558264 560960 551843 531962 504410 472728 439706 407368 377191 349848 325236 303170
56764 303170 283715 266656 251358 237583 225875 216660 209466 203517 198540 194449 190724 186751 182501
56751 182501 178407 174868 172199 170673 170146 169954 169507 168660 167364 165545 163603 162293 161688 160960 159680 158597
56735 158597 158490 158915 158809 157811 156284 154572 153006 152184 152497 153652 155187 157036 159082 160783 161917 163162
56719 163162 165149 167450 169301 170769 172329 173750 174494 174930 176049 177965 179685 180528 180971 181837 183219
56704 183219 184498 185208 185694 186849 188962 190977 191470 190464 189437 189338 189622 189713 190201 191585 192860 192690 191410
56687 191410 190579 190919 191804 192434 192298 190836 187944 184801 183009 182840 183226 183411 183609 184099 184740 185474 186343
56670A86343N35m92j383j264m01M43J071J513J419O71r8l62l27j55O01J976K956
56653A93046K812K212K089K204J840J202R73J093J006P15N48L06l81j160j281
56638B07224o98l5L15M51N15N49N78N22K34j55l86o22j250k012k160j728j650
56621A99692k256k683k330j774j612j403o51J13J48l72q27j137j457j538j166
56606A80747o97n17m94m56n15n56k11K76J80l05q3Q98J154l6j257j067j49P8k18
56587A76772N5Q10J040P29Q20J550K140K124J841J667J647J786J966J845J392
56572A98184J161J491J991K394L081M126M722M392L921M129M603M651M650N288
56558B48784O266O891P276P662P281N220K100l94j397j341r84q47j164j557j296
$$ plain form
56670 186343 186878 186386 185003 183739 183338 183781 184852 186365 187784 188455 188357 187995 187668 187513 188114 190090 193046
56653 193046 195858 198070 200159 202363 204203 205405 206378 207471 208477 209192 209740 210046 209665 208505 207224
56638 207224 206526 206491 206806 207257 207772 208321 208899 209421 209655 209500 209114 208492 207242 205230 203070 201342 199692
56621 199692 197436 194753 192423 190649 189037 187634 186983 187096 187244 186872 186045 184908 183451 181913 180747
56606 180747 180050 179533 179039 178583 178068 177512 177301 177577 177757 177452 177369 178267 179421 179385 178128 177061 176912 176990 176772
56587 176772 176827 177637 178677 179406 180226 181776 183916 186040 187881 189548 191195 192981 194947 196792 198184
56572 198184 199345 200836 202827 205221 208302 212428 217150 221542 225463 229592 234195 238846 243496 248784
56558 248784 255050 261941 269217 276879 284160 289380 291480 291086 289689 288348 287364 286517 285353 283796 282500
56543B82500n77p01k205l793m147l763l713l715k945j905j710k152k125j575j410
56528B46064j745j803j424j218j347j431j522j937k337k089j344p83n73n40q38
56513B25133j436j596r75n52j122j742j094K74Q16M33K24L18q9p82o58K03M75
56496B17830j68n63j24K34k67j166j684j615r89J2O55K81n49n86L52J265J492
56479B14410J268Q02Q5l94k3P63R15L43r2j22k74n22j31R18J652J526J055Q00
56461B22979P73R60J411J731J426P78M77M40P1m98n33l8K43Q9k0Q7J37K05O22
56442B31340J138J210R18O53K59m12o54L8P30K87o07m25N84P42k19p30k8P24M42
56423B35990m00r53j221j440j379q24L8J052K073K556K054J064M75L47K39K67
$$ plain form
56543 282500 281923 281222 279017 275224 271077 267314 263601 259886 256941 255036 253326 251174 249049 247474 246064
56528 246064 244319 242516 241092 239874 238527 237096 235574 233637 231300 229211 227867 227084 226511 225971 225133
56513 225133 223697 222101 221126 220574 219452 217710 216616 216890 217706 218139 218363 218681 218592 217810 217152 217355 217830
56496 217830 217662 217099 216975 217209 216942 215776 214092 212477 211488 211500 212155 212436 211887 211301 211653 212918 214410
56479 214410 215678 216480 216565 216171 216148 216911 217826 218169 218077 217955 217681 217159 217028 217946 219598 221124 222179 222979
56461 222979 223752 224712 226123 227854 229280 230058 230535 230975 231046 230548 230015 229977 230220 230309 230289 230376 230513 230718 231340
56442 231340 232478 233688 234606 235259 235518 235106 234452 234490 235220 235507 234900 234475 235059 235801 235582 234852 234824 235548 235990
56423 235990 235590 234637 233416 231976 230597 229773 229811 230863 232936 235492 237546 238610 239085 239432 239671 239938
56407B39938P11J013O05J85O93J528J424O45M53Q24O64Q4L41J484K163J922J654
56390B56331J560P44q23j798j450m45O68J984L031K793J403K40rJ69N14J209J673
56373B67794J096J63L11J265J394N39J58N22L00o25o08Q16J919J615R88R87Q51
56356B79485qo66l19N04J329K425L331K779R37j97L56J362J803K259K937K703
56340C01020J318M50J045J825J719J648K488L290L162K883L126K981J916J288
56326C30159K076L027K816K322K796L503L210K520K535K612J590J79l7Q48J491
56311C61647J536J620J765J500J164J635K964M430N417N515M504L123K915M388
56297D04123O132O618N964N156M626M418M707N288N466N195N265N954O657P224
$$ plain form
56407 239938 240649 241662 242267 242452 243145 244673 246097 246742 247195 248019 248683 248767 249108 250592 252755 254677 256331
56390 256331 257891 258635 257812 256014 254564 254119 254787 256771 259802 262595 263998 264238 264229 264398 264912 266121 267794
56373 267794 268890 269053 269364 270629 272023 272562 272720 273242 273542 272917 272309 273125 275044 276659 277647 278634 279485
56356 279485 279477 278811 278492 278996 280325 282750 286081 288860 289797 289600 289956 291318 293121 295380 298317 301020
56340 301020 302338 302788 303833 305658 307377 309025 311513 314803 317965 320848 323974 326955 328871 330159
56326 330159 332235 335262 338078 340400 343196 346699 349909 352429 354964 357576 359166 359345 359308 360156 361647
56311 361647 363183 364803 366568 368068 369232 370867 373831 378261 383678 389193 393697 396820 399735 404123
56297 404123 410255 416873 422837 427993 432619 437037 441744 447032 452498 457693 462958 468912 475569 482793
56283D82793Q171R270R630R570J0483J2266J3117J2599J2583J4098J5657J6081
56271F26318J6580J8451K0805K2426K3904K6164K8690L0948L3834L7940M2055
56260I28115M5169M8306N2669N7571O1934O6187P0955P5531P9390Q3619Q9044
56249A658490R4522R8725J02104J05369J07875J09141J10217J11602J11520J08257
56239B717822J02505R5515Q6616P4635O0092M3951K5925O046j3793l2020m9449
56228C117845o6930q2710r4569j03060j10128j15858j19049j19744j18880j16459
56218B070458j12314j07534j03095r8152r1624q4280p7475p1213o5230o0341n6760
56207A142440n2862m7647m2612l9136l6030l1933k8084k6042k4723k2407j9792
$$ plain form
56283 482793 490964 500234 509864 519434 529917 542183 555300 567899 580482 594580 610237 626318
56271 626318 642898 661349 682154 704580 728484 754648 783338 814286 848120 886060 928115
56260 928115 973284 1021590 1074259 1131830 1193764 1259951 1330906 1406437 1485827 1569446 1658490
56249 1658490 1753012 1851737 1953841 2059210 2167085 2276226 2386443 2498045 2609565 2717822
56239 2717822 2820327 2915842 3002458 3077093 3137185 3181136 3207061 3213107 3199314 3167294 3117845
56228 3117845 3050915 2968205 2873636 2770576 2660448 2544590 2425541 2305797 2186917 2070458
56218 2070458 1958144 1850610 1747515 1649363 1557739 1473459 1395984 1324771 1259541 1199200 1142440
56207 1142440 1089578 1041931 999319 960183 924153 892220 864136 838094 813371 790964 771172
56196G71172j8218j6716j3846j0813r545r281q166o678o275o121m512k320j598
56183F57083j904j320r2P0n38k04R38J350J167J786L027L638L925N014O267O271
56167F86478N675O249P876R168J0211J1990J4004J5147J5997J7661J9526K0768
56155H40750K2635K6396L0528L3010L4853L8172M2314M5409M8079N2036N6397
56144A270579N9280O1695O5983P1665P6778Q2119Q9885R9069J06325J10536J12348
56133B206262J10155J01273Q6787P1079N6825M4282L4651K9417K6491K1405J2561
56122B801188J785r774k2020l2867l9344m2038m4464m8234n2762n9162o9668q3036
56110B299604r4889j02939j07875j09282j05254r6493q6486p6964o6914n6261
$$ plain form
56196 771172 752954 736238 722392 711579 702034 692753 684587 677909 671634 665513 661001 658681 657083
56183 657083 655179 653859 653767 653837 653299 653095 654033 655383 656550 658336 661363 665001 668926 673940 680207 686478
56167 686478 692153 698402 706278 715446 725657 737647 751651 766798 782795 800456 819982 840750
56155 840750 863385 889781 920309 953319 988172 1026344 1068658 1114067 1162146 1214182 1270579
56144 1270579 1329859 1391554 1457537 1529202 1605980 1688099 1777984 1877053 1983378 2093914 2206262
56133 2206262 2316417 2417690 2504477 2575556 2632381 2676663 2711314 2740731 2767222 2788627 2801188
56122 2801188 2802973 2793199 2771179 2738312 2698968 2656930 2612466 2564232 2511470 2452308 2382640 2299604
56110 2299604 2204715 2101776 1993901 1884619 1779365 1682872 1596386 1519422 1452508 1396247
56100A396247m6697l8636l1076k4509k0222j6988j2361o977l588k250o30J418
56088A193731K009J613K703N234O879P492Q840J0403J0106Q865R524J1639J2248
56075A291286J1490J2316J4825J6123J5754J6069J7370J7801J7845J9613K2020
56064A472512K2104K0760K1461K3803K4301K3149K3765K5881K5790K3533K3015
56053A730074K4644K4777K2974K2825K4922K5907K5364K6626K9885L1528L1243
56042B020769L2650L5981L7454L6937L8619M2863M5046M4007M3979M6572M8560
56031B473437M9268N2178N7383O0318O0033O0874O4113O5970O5865O8242P4044
56020C151725P8616Q0353Q3138Q8087R1393R2531R5933J02321J07149J09621J14228
$$ plain form
56100 1396247 1349550 1310914 1279838 1255329 1235107 1218119 1205758 1198781 1195193 1192943 1192313 1193731
56088 1193731 1195740 1197353 1200056 1205290 1212169 1219661 1228501 1238904 1249010 1257875 1267399 1279038 1291286
56075 1291286 1302776 1315092 1329917 1346040 1361794 1377863 1395233 1413034 1430879 1450492 1472512
56064 1472512 1494616 1515376 1536837 1560640 1584941 1608090 1631855 1657736 1683526 1707059 1730074
56053 1730074 1754718 1779495 1802469 1825294 1850216 1876123 1901487 1928113 1957998 1989526 2020769
56042 2020769 2053419 2089400 2126854 2163791 2202410 2245273 2290319 2334326 2378305 2424877 2473437
56031 2473437 2522705 2574883 2632266 2692584 2752617 2813491 2877604 2943574 3009439 3077681 3151725
56020 3151725 3230341 3310694 3393832 3481919 3573312 3665843 3761776 3864097 3971246 4080867 4195095
56009D195095J21492J26697J29640J35575J44649J51033J54507J61639J73261
56000E493588J82592J88463J98047K13325K27566K38704K53155K72577K90335
55991G558352L05222L24896L51365L77344M01461M32114M71496N11521N50691
55982A1284462N98599O58297P21680P88346Q70787R74406J091810J224065J387216
55973A9599668J590022J826822K100914K431843K829849L286398L797746M369334
55965D1832596M985527N605603O204372O787275P352591P872381Q321675Q683164
55957I7645184Q909350Q939607Q792501Q596731Q502370Q617345R056694R966922
55949A69026704J1446979J3537926J6326533J9810128K3339932K5255468K3527642
$$ plain form
56009 4195095 4316587 4443284 4572924 4708499 4853148 5004181 5158688 5320327 5493588
56000 5493588 5676180 5864643 6062690 6276015 6503581 6742285 6995440 7268017 7558352
55991 7558352 7863574 8188470 8539835 8917179 9318640 9750754 10222250 10733771 11284462
55982 11284462 11883061 12541358 13263038 14051384 14922171 15896577 16988387 18212452 19599668
55973 19599668 21189690 23016512 25117426 27549269 30379118 33665516 37463262 41832596
55965 41832596 46818123 52423726 58628098 65415373 72767964 80640345 88962020 97645184
55957 97645184 106554534 115494141 124286642 132883373 141385743 150003088 159059782 169026704
55949 169026704 180473683 194011609 210338142 230148270 253488202 278743670 302271312
55942C02271312J7177129P160601m156659j4368193k2005130k6637711k8523446
55935B30917903k8274176k6606819k4138866k1308396j8426400j5721273j3314158
55928H3127815j1221037r423923p916812o679308n658742m807104m105099l533725
55920B9782065l055256k640824k288569j997694j749780j530315j344018j193538
55912A3982071j064511r45493q42368p59950o88177o18982n58953n13199m73122
55903G517316m31552l94359l66291l40206l10761k84491k66178k48881k27246
55894D647351k07596j95115j83634j67764j53177j45304j39031j29001j19480
55885C207249j14891j10533j01618r2196q6623q1228p2652o5737o5111o6953o6640
$$ plain form
55942 302271312 319448441 326609042 322452383 308084190 286079060 259441349 230917903
55935 230917903 202643727 176036908 151898042 130589646 112163246 96441973 83127815
55928 83127815 71906778 62482855 54566043 47886735 42227993 37420889 33315790 29782065
55920 29782065 26726809 24085985 21797416 19799722 18049942 16519627 15175609 13982071
55912 13982071 12917560 11972067 11129699 10369749 9681572 9062590 8503637 7990438 7517316
55903 7517316 7085764 6691405 6325114 5984908 5674147 5389656 5123478 4874597 4647351
55894 4647351 4439755 4244640 4061006 3893242 3740065 3594761 3455730 3326729 3207249
55885 3207249 3092358 2981825 2880207 2788011 2701388 2620160 2547508 2481771 2416660 2349707 2283067
55874B283067o6509o8883o9496o5271o0983o0961o1420n7961n3429n1512m9641
55863A617001m5166m1716m2462m3534m0810l7075l5920l4812l0794k7051k7125
55852A210536k8194k6522k4268k4553k5079k2942k0786k1871k3647k2362j9683
55841I50629j8977j9142j7768j6320j6828j7345j5751j4182j4886j5805j4767
55830G68858j3819j4745j4781j1659q430q308r066p587n711o342p812p455o949
55817F46194q804j1090j0789r088q455p776n249k781k659l095j763l65j051j725
55803E71504J27K321J788L20J359L845M522L685L511L150N87k731m085m391o255
55788E79257q995j0111r841r920r581p110l752k086k141k738m582q241j1194j0894
$$ plain form
55874 2283067 2216558 2147675 2078179 2012908 1951925 1890964 1829544 1771583 1718154 1666642 1617001
55863 1617001 1571835 1530119 1487657 1444123 1403313 1366238 1330318 1295506 1264712 1237661 1210536
55852 1210536 1182342 1155820 1131552 1106999 1081920 1058978 1038192 1016321 992674 970312 950629
55841 950629 931652 912510 894742 878422 861594 844249 828498 814316 799430 783625 768858
55830 768858 755039 740294 725513 713854 705424 697116 688050 680463 674752 668410 660598 653143 646194
55817 646194 637390 626300 615511 606423 597968 590192 584943 582162 579503 576408 574645 574280 573229 571504
55803 571504 571631 573952 575740 576060 577419 581264 585786 589471 592982 596132 596719 593988 589903 585512 579257
55788 579257 570262 560151 550310 540390 530809 523699 519947 517861 515720 512982 508400 500159 488965 478071
55774D78071q745p380o228l618p85L74J241L803O217N369J944j302m269q126j1227
55759D45339j1174r372q984r734r183p710p617q393p585n464m572n158n328n075
55745C39990o032p750q070o902n993n462m053k231j631j948j722j423k400l641
55731B80732l087j433j118k167k504j809j584j962j789j430k191l416l308k183
55717B50751j775j973j380m13n55j176m47J156J642J177J596K649K306N83l84
55702B53757r7k26j395k467l117m081m908m336k950k607l304l321k305j394n65
55687B16684J184L134L376K034J139J291J267R13J483K962L874L898M095M416
55673B51750L732K349J764J837R28r33j852j265o68p68o43q3k35j233j645q86
$$ plain form
55774 478071 469326 461946 455718 452100 451315 451689 452930 456733 462950 468319 470263 468961 464692 456566 445339
55759 445339 434165 424793 415809 406075 396892 389182 381565 373172 365587 360123 355551 350393 345065 339990
55745 339990 333958 326208 318138 311236 305243 299781 295728 293497 291866 289918 288196 286773 284373 280732
55731 280732 277645 276212 275094 272927 270423 268614 267030 265068 263279 261849 259658 256242 252934 250751
55717 250751 248976 247003 245623 245210 244655 243479 243032 244188 245830 247007 248603 251252 253558 254141 253757
55702 253757 253660 253434 252039 249572 246455 242374 237466 233130 230180 227573 224269 220948 218643 217249 216684
55687 216684 217868 221002 224378 226412 227551 228842 230109 231022 232505 235467 239341 243239 247334 251750
55673 251750 255482 257831 259595 261432 262360 261427 259575 258310 257642 256874 256231 256148 255913 254680 253035 252149
55657B52149r3l7j54n5p8j10L28O51j48j566k143j963k459l846m830m840m561
55640B26245m237l529k940l356m295m562m421n005n949n819m626l664l093k075
55626A68674r74j058k087k594k346k195j883n22R93Q47n46j050l64j97q95r33
55610A52870j12j53j518k497k239j982k487k743k190j788k009j934j202p37q14
55595A28465m56N33J027O84N61J048J204P01M37O62N56J24M49J515J934J330R82
55578A41756J485J923J827J875K173J959J464J894L088L419K548J979K348K530
55564A72268K014J760J933J285m16j705j978k337l080k917j722j430k859m108
55550A56708l575k315j849j695q56J66M81L69L62J80j71J52J198J698J189Q84
$$ plain form
55657 252149 252056 252019 251865 251810 251732 251622 251950 252601 252453 250887 248744 246781 244322 240476 235646 230806 226245
55640 226245 222008 218479 215539 212183 207888 203326 198905 193900 187951 182132 177506 173842 170749 168674
55626 168674 167700 166642 164555 161961 159615 157420 155537 155015 156008 156855 156309 155259 154895 154698 153803 152870
55610 152870 152758 152605 151087 148590 146351 144369 141882 139139 136949 135161 133152 131218 130016 129279 128465
55595 128465 128009 128542 129569 130253 130814 131862 133066 133767 134204 134866 135422 135546 135995 137510 139444 140774 141756
55578 141756 143241 145164 146991 148866 151039 152998 154462 156356 159444 162863 165411 167390 169738 172268
55564 172268 174282 176042 177975 179260 178844 177139 175161 172824 169744 166827 165105 163675 160816 156708
55550 156708 153133 150818 148969 147274 146418 146584 147065 147434 147796 147976 147805 147957 149155 150853 152042 152926
55534A52926J365J413L90k41O23J657J152m59j746k506l161l326k664k029k269
55519A41125k846k938k850l076l142k605k178k606l375l624l331k729j639l10
55505A03876K86j08m57j65Ll94m58L09P99R1q95q83j22M99R69J509J561P53j58
55486A07015n04p98j474j765j042j56r3l44K1O49O59K27J16K87K23l8k31n25r19
55467A01308p78J06Q23O20K1j71j13k67m02j93J6j25l15l26m39o16k74N10Q06
55448A00191M53N09J317J677Q87N2J83M33l55j669k244j930j266l29P62J188O00
55431A00459n9jJ84j45l67J17N90L89L38J262K240J984R49L34o0j105k203j844
55413A03062L8J897K616K345J590O99L6l72j033k014k408j668p08o20j054j007
$$ plain form
55534 152926 154291 155704 156094 155853 156476 158133 159285 158826 157080 154574 151413 148087 145423 143394 141125
55519 141125 138279 135341 132491 129415 126273 123668 121490 118884 115509 111885 108554 105825 104186 103876
55505 103876 104162 104054 103597 103432 103435 103041 102583 102892 103691 103782 102887 102004 101882 102381 103350 104859 106420 107173 107015
55486 107015 106511 105713 104239 102474 101432 101276 101183 100839 100860 101509 102168 102395 102511 102798 103021 102983 102752 102227 101308
55467 101308 100530 100636 101459 102079 102100 101929 101816 101549 101147 100954 100970 100845 100530 100204 99765 99149 98875 99385 100191
55448 100191 100644 101153 102470 104147 105034 105086 105269 105702 105347 103678 101434 99504 98238 97909 98671 99859 100459
55431 100459 100400 100399 100583 100438 100071 100188 100778 101167 101505 102767 105007 106991 107940 108274 108214 107109 104906 103062
55413 103062 103100 104997 107613 109958 111548 112247 112283 111911 110878 108864 106456 104788 104080 103460 102406 101399
55397A01399m21J16M98P94N98j87p38o48q38j888k571j605Q9O50J0m15j18K70
55379I4995O20J325J885J340M4o43m21l02o87p99k04M34N00K85L45P32J107J022
55361A01578K13r17j422r79l42j47L2N88Q27M5j060j387j117j101j215p22J59
55344I3033N40L92M37P71R04Q31Q34N09o11j773j726o17J86Q7k16j62N4L08P27
55325I4508R52L76p21j316j011l42K81R41J475J402O98j02o62r46p66n9N24J97
55307I5429q59j730j883j361j94J354K325J882N18m85o55m84k90O3M18L82J25
55290I4555J60M33M18J28P0L24N05N20O11P06N52L44M55O96O07L37L98P44Q74
55271A03437O57L29r5o25q01k65M90O65L27J56L75N97N29Q0q39j934k337j571
$$ plain form
55397 101399 100978 101094 101592 102386 102984 102797 102059 101411 100573 98685 96114 94509 94598 95248 95258 94843 94725 94995
55379 94995 95615 96940 98825 100165 100209 99566 99145 98843 98156 97357 97153 97587 98087 98372 98717 99449 100556 101578
55361 101578 101791 100874 99452 98473 98131 97984 98016 98604 99431 99476 98416 97029 95912 94811 93596 92874 93033
55344 93033 93573 93965 94402 95173 96077 96908 97742 98251 97640 95867 94141 93524 93710 93797 93581 93419 93473 93781 94508
55325 94508 95460 95836 95115 93799 92788 92446 92727 93668 95143 96545 97243 97141 96479 95533 94767 94708 95232 95429
55307 95429 94570 92840 90957 89596 89402 90756 93081 94963 95481 94996 94341 93857 93567 93630 94048 94430 94555
55290 94555 94715 95148 95566 95694 95764 96088 96593 97113 97724 98430 98982 99326 99781 100477 101084 101421 101819 102563 103437
55271 103437 104094 104423 104328 103703 102902 102637 103127 103792 104119 104275 104650 105247 105776 105856 105017 103083 100746 99175
55253I9175k94N93J021J240R51m2j029j215q48n26r5O77J125O73Q1K43M99l37
55235A01892j770k178j268k60J46L76N39J73m74m08N25J338J424J209J077P70
55219A03111J21n95j132j321p90M11J259Q86j24o31o56q55q93k3J112J102O2n35
55201A00509l11l18q00o91K12N89j09n63K41J317J269L40l00l32k93m63o91q24
55183I8782o91o6Q86J577J616J134M62o6j40J24Q3m12m11P08J826J390k07j160
55165A05435q40k41O0N16J098R61J10l70j87l39j121j376m46O42Q70O50O52M79
55147A06553m34j597k113j759p90N63J813K301K028J597J092Q6j037j135j49N24
55131A07543J01n34m82j37r2o4J98J77l19n41j72j2m58n96J02N91oo98j90R59
$$ plain form
55253 99175 98881 99474 100495 101735 102686 102644 101615 100400 99552 99026 98931 99608 100733 101406 101487 101730 102229 101892
55235 101892 100122 97944 96676 96416 96562 96938 97477 97650 97176 96768 97293 98631 100055 101264 102341 103111
55219 103111 103232 102637 101505 100184 99394 99805 101064 101950 101826 101195 100539 99684 98791 98768 99880 100982 101044 100509
55201 100509 100198 99880 99080 98389 98601 99190 99081 98518 98759 100076 101345 101685 101385 101053 100760 100297 99606 98782
55183 98782 98091 98025 98911 100488 102104 103238 103700 103634 103494 103618 103701 103289 102878 103586 105412 106802 106595 105435
55165 105435 104595 104354 104414 104930 106028 106989 107099 106729 106542 106203 105082 103706 103260 103902 104772 105422 106074 106553
55147 106553 106119 104522 102409 100650 99860 100423 102236 104537 106565 108162 109254 109340 108303 107168 107019 107543
55131 107543 107644 107110 106628 106491 106399 106335 106533 106710 106391 105850 105678 105666 105208 104612 104714 105305 105299 104601 104411 105370
55111A05370J309Q72P38R76O51l62j095j050p68o70m82J7N26P37O91N00J63k46
55093A07877m88l07M43J528K215J866P84q9l87n70q75r51q12j036j583j475l56
55076A05784O92P20L36N70J208J326Q79N59M98K11l37n75k27L34O37N35J93j7
55058A13326K13O87Q14L79k45p36j137j324r37j62K51J40K36Q31J059K42q89j156
55040A11592m63L97Q34O65j52j149j310k46J050J332N70m05j129j609j723j375
55024A06879r29o98l19N70J422J335L65m77m80P3M47K51k47m03O6O53P07M18N19
55005A10152R83J011M51J88O31R59N18o8L8N68Q21P93P31L77l54o47J31J193J328
54986A19804O08R1K06N11P61J057J138N63l89q48m32M22J139J421J132L96k78
$$ plain form
55111 105370 106679 107551 108289 109265 109916 109554 108459 107409 106641 105971 105489 105506 106032 106769 107460 107960 108123 107877
55093 107877 107389 107082 107525 109053 111268 113134 113918 113829 113442 112872 111997 111046 110234 109198 107615 106140 105784
55076 105784 106476 107196 107532 108102 109310 110636 111515 112074 112572 112783 112446 111871 111644 111978 112615 113150 113343 113326
55058 113326 113539 114226 115040 115419 115174 114438 113301 111977 111040 110878 111129 111269 111505 112336 113395 113637 112748 111592
55040 111592 111129 111526 112360 113025 112873 111724 110414 110168 111218 112550 113120 112715 111586 109977 108254 106879
55024 106879 105950 105252 104933 105503 106925 108260 108625 108148 107668 107741 108188 108439 108192 107789 107855 108508 109215 109633 110152
55005 110152 111135 112146 112597 112785 113416 114375 114893 114825 114863 115431 116252 117045 117776 118153 117799 117152 117283 118476 119804
54986 119804 120412 120503 120709 121220 121981 123038 124176 124739 124350 123502 123070 123492 124631 126052 127184 127580 127302
54969A27302m65k98j77j82j53rK97P17Q23J60q21j023k20M98L48n1Q0L78J83k17
54949A27170k26j05l44n45j24M52L23k45k57L90Q38O82L89M33Q59J604K451K909
54931A36654K771K513K473K218J496J112J771K672K542J635J357K170L231L972
54917A68587M684N426N594M835L462J788j00j886l159m050m963n740n882n450
54903A63146m917m316l393k436j977j851j473q71m92k17L43P95M78j36J38J349
54887A44170K295K358K145K069J691R32O52J370K404K942L087L320L682M029M402
54872A81548M628M242L154J842N81p67k068k872l381m452o145p207o690n275m192
54857A52946l620k952k120j650j645j647j475j487j928k506k793k683k373k077
$$ plain form
54969 127302 126837 126539 126362 126180 126027 126018 126315 127032 127855 128015 127194 126171 125951 126449 126797 126746 126826 127204 127387 127170
54949 127170 126944 126839 126495 125950 125826 126278 126601 126356 126099 126489 127327 128009 128398 128831 129690 131294 133745 136654
54931 136654 139425 141938 144411 146629 148125 149237 151008 153680 156222 157857 159214 161384 164615 168587
54917 168587 173271 178697 184291 189126 192588 194376 194276 192390 189231 185181 180218 174478 168596 163146
54903 163146 158229 153913 150520 148084 146107 144256 142783 141912 141420 141203 141546 142341 142819 142683 142821 144170
54887 144170 146465 148823 150968 153037 154728 155660 156312 157682 160086 163028 166115 169435 173117 177146 181548
54872 181548 186176 190418 193572 195414 195995 195228 193160 190288 186907 182455 176310 169103 162413 157138 152946
54857 152946 149326 146374 144254 142604 140959 139312 137837 136350 134422 131916 129123 126440 124067 121990
54843A21990j862j628j251p62l56k06l12n26o12l69J60O71Q67P16L47o0k49jN22
54824A17079Q40P44N11L63J78l7J12O76R54M09m25n98k3O15R30J074J143J017
54806A25562P52N14K00l09o88n71j80l8j53j11J73L60K71K1k50l56kP58J354J459
54786A28766J492J818K013J655J248J470K004K049J637J458J688J999K351K783
54772A54431K806K149J669K295L424L733L259L148L573L623L280L627M716N079
54758B00812L987K558J776R40q68l088m615n422o045o307n769m847m377m338m029
54743A60368l234k383j723j059k99L07N15L70J65K26O38J101J278J197J091J030
54727A59588J104J640K621L172K548J403J143K034L088L715M266M669L964J847
$$ plain form
54843 121990 120128 118500 117249 116487 116131 115925 115613 115087 114475 114106 114266 114937 115804 116520 116867 116807 116558 116557 117079
54824 117079 117919 118663 119174 119537 119715 119678 119790 120466 121420 121829 121404 120806 120783 121398 122328 123402 124545 125562
54806 125562 126314 126828 127028 126719 126031 125460 125280 125242 125089 124978 125151 125511 125782 125803 125553 125197 125195 125953 127307 128766
54786 128766 130258 132076 134089 135744 136992 138462 140466 142515 144152 145610 147298 149297 151648 154431
54772 154431 157237 159386 161055 163350 166774 170507 173766 176914 180487 184110 187390 191017 195733 200812
54758 200812 204799 207357 209133 210073 209205 206117 201502 196080 190035 183728 177959 173112 168735 164397 160368
54743 160368 157134 154751 153028 151969 151670 151977 152492 152862 153027 153253 153891 154992 156270 157467 158558 159588
54727 159588 160692 162332 164953 168125 170673 172076 173219 175253 178341 182056 186322 190991 194955 196802
54713A96802n37k049k925l937n054n734n803n321m235k830j913j815j795j140
54699A51714l04k11r14j664j951j818j417q86m82l23k22r2j98o68j146j339j429
54682A36650j647j815j704j392r69k70O17J106P61p8p37r52q93p53n79l07K04
54665A27242Q49J100O25K3J58Q10Q48m3q54q40n63p74j132q75m6P61J293J576
54647A30158J371M90n68j008o41j9K25l3l19rQ61J375Q93J32K16Q35O03o61j471
54628A32430r69j98k64o19l19J94k8o03l66P18J526J447R54O03M41L45J67l08
54610A35151q92p89L60J623J737O59n97j402j903k153j865j070k59J98L57M09
54594A29564N16P52R05N65k14p20m74J27N21P96J212J485J228O16l1q20j685j849
$$ plain form
54713 196802 196265 194216 191291 187354 182300 176566 170763 165442 161207 158377 156464 154649 152854 151714
54699 151714 151410 151199 150285 148621 146670 144852 143435 142549 142067 141744 141522 141430 141232 140564 139418 138079 136650
54682 136650 135003 133188 131484 130092 129123 128853 129470 130576 131337 131259 130522 129570 128677 127924 127345 127038 127242
54665 127242 128091 129191 129816 129839 129997 130807 131655 131612 130758 129918 129355 128581 127449 126574 126528 127289 128582 130158
54647 130158 131529 132019 131451 130443 129802 129783 130008 129975 129656 129647 130508 131883 132776 132908 133124 133959 134562 133901 132430
54628 132430 131461 131263 130999 130380 130061 130255 130227 129624 129258 129976 131502 132949 133903 134506 134947 135292 135459 135151
54610 135151 134259 133470 133830 135453 137190 137849 137252 135850 133947 131794 129929 128859 128600 128798 129155 129564
54594 129564 130080 130832 131737 132302 132088 131368 130894 131021 131542 132338 133550 135035 136263 136879 136848 136028 134343 132494
54576A32494q27N13R04L70o1N9L17N19Q37R85L89o98j331j255j154j306j053k8
54558A29674J008J163O17K59M55P60O57J80j50R8P95J394J520J253Q12L03k3K32
54540A41007J014J602J451Q71M30Q4m96j109j158m60N62J320J292K89j072j574
54524A44053p37M36O66j04j020j580j743j325k81O15M73m68j151j109p68m88k28
54507A35241m8o6J6M72Q60O52L35P46J512J440M56k08mJ94k25n43r5M82K89l45
54487A41161m16L05J206J769J797J158K9q26p26R5P85Q31L92j26m31l97j06K55
54469A46755O58J168J537J274L57n05o35j70J98jo63j308j404p70J60P03O70M50
54451A48474K74n9n90q44n18m3Q2Q4M17P61L11q57j539r07L44Q57L33k76j81L27
$$ plain form
54576 132494 131667 132180 133084 133454 133393 133452 133769 134288 135125 136110 136499 135801 134470 133215 132061 130755 129702 129674
54558 129674 130682 131845 132462 132721 133176 133936 134593 134773 134623 134721 135516 136910 138430 139683 140495 140798 140775 141007
54540 141007 142021 143623 145074 145945 146375 146459 145963 144854 143696 143236 143798 145118 146410 146699 145627 144053
54524 144053 143316 143752 144418 144314 143294 141714 139971 138646 138365 138980 139453 138985 137834 136725 135957 135469 135241
54507 135241 135193 135127 135143 135615 136475 137127 137462 138208 139720 141160 141616 141408 141404 141598 141373 140830 140735 141217 141506 141161
54487 141161 140745 141050 142256 144025 145822 146980 147009 146183 145457 145552 146337 147168 147560 147434 147003 146606 146500 146755
54469 146755 147413 148581 150118 151392 151749 151244 150609 150439 150637 150636 149973 148665 147261 146491 146651 147354 148024 148474
54451 148474 148748 148689 148099 147255 146737 146694 146776 146860 147277 148038 148349 147492 145953 145046 145390 146247 146580 146304 146123 146450
54431A46450O11O76Q65J026O62j39o40m80r0M0K9J70L98N28N87N07K3p62j141
54412A49320o95K6K70J73L82R25J202R90O94O05N92O08Q89J529K225K558K290
54395A64583J461N03K7J58L01j4l65j34L56K20o51j438j633j613j743j671q65
54378A57482N83J984K599K076P16n94j018m90M25J200J583J369N82j98k39M45
54362A68505J116J229R93R72J477K331K890K464J137j7L3J084K053K248J745P74
54346A91034m07j138p78L06R82P70L35K89J94p47k469l944m198l183j818j212
54330A74016j605k207k194j629j093p92n59m17m19k12N40J385J503Q37P0m05p63
54313A66056j073j143j035r78q29l61M9j40o07n70j34j03m85l79L85Q41M54n4
$$ plain form
54431 146450 147061 147737 148602 149628 150290 150151 149511 149031 148941 148981 149010 149180 149578 150106 150693 151200 151223 150461 149320
54412 149320 148625 148651 148921 149094 149476 150401 151603 152593 153287 153892 154484 155092 155981 157510 159735 162293 164583
54395 164583 166044 166547 166574 166732 167033 167019 166654 166520 166876 167096 166445 165007 163374 161761 160018 158347 157482
54378 157482 158065 160049 162648 164724 165440 164846 163828 163338 163763 164963 166546 167915 168497 168299 168060 168505
54362 168505 169621 170850 171843 172815 174292 176623 179513 181977 183114 183097 183130 184214 186267 188515 190260 191034
54346 191034 190627 189489 188711 189017 189999 190769 191104 191393 191587 190840 188371 184427 180229 177046 175228 174016
54330 174016 172411 170204 168010 166381 165288 164496 163937 163520 163101 162889 163429 164814 166317 167154 167224 166819 166056
54313 166056 164983 163840 162805 161827 160998 160637 160686 160546 159939 159369 159235 159132 158647 158268 158653 159494 159948 159894
54295A59894L9M19N67N76O00L66j09k81m7l0l73l34L11N83q5p35l62M86Q06Q45
54275A63136J363J939J580N50K3J71L5o56j050p52n18q75j154n62O31J569J905
54258A67335J876J716J471J105N46j78o59l97M26Q58K72p88j258r11n33p54j238
54241A68889j283q85o46o99m16M99J197P02n66j122l79N31L22p17j166l48Q86
54224A64799J299P13O1J28O20O49M8l64j9N06L61l04o89o87q42j119p85K72J115
54205A65762J063N04j2n74j276j563j041k88j14m06m32Q6P92J251J191M86n31
54188A64898j120r07l60q9j11j68k95n12n00j15J67l1k90m5N37R22J032R58M30
54169A64401o15j351r27J71O51K19k16o7K02J63J94O47J029O68k62r73j068q22
$$ plain form
54295 159894 159933 160352 160919 161495 162095 162461 162352 162071 162024 161994 161621 161287 161598 162181 162096 161361 160999 161485 162291 163136
54275 163136 164499 166438 168018 168568 168591 168762 168797 168141 167091 166339 165821 164946 163792 163230 163861 165430 167335
54258 167335 169211 170927 172398 173503 174049 173871 173212 172815 173241 174099 174371 173583 172325 171414 170881 170127 168889
54241 168889 167606 166721 166075 165376 164960 165459 166656 167358 166792 165670 165291 165822 166144 165427 164261 163913 164799
54224 164799 166098 166811 166872 167000 167620 168269 168317 167953 167934 168440 168801 168497 167808 167121 166279 165160 164375 164647 165762
54205 165762 166825 167329 167317 166743 165467 163904 162863 162575 162461 162055 161623 161709 162501 163752 164943 165429 164898
54188 164898 163778 162871 162511 162422 162311 162143 161848 161336 160836 160721 160888 160857 160567 160522 161059 161981 163013 163971 164401
54169 164401 163786 162435 161508 161679 162330 162549 162333 162266 162468 162631 162825 163472 164501 165169 164907 163934 162866 162044
54151A62044n71k94Q7L68K82l3j28J73M61L70J76L60P14N70o9l30K88J061R51
54132A66480j19j225j433m71J120K215J937O05n45p80n12k56K05J065J748J684
54116A71718J254J121J117P22J57M0K48J17l78n91l07O6L20O65J032J030O68L77
54098A79376K16j51o89q95o83n80q47j034o88N3Q00J356J663J740J787J962K066
54081A85452J904J835K337L010K870J773P78Q12J599K293K505K376K132K063K458
54066B16197L116L347K818K092J894K223K648L101L760M259L771K081J11r80j085
54051B49353j176k006l146l530k764j521n86k1N84J361K097K627K939L054L083
54036B50348L323L933M661N111N120M737M057L336K943K858K619K088J811K140
$$ plain form
54151 162044 161473 161179 161266 161634 161916 161883 161755 161928 162389 162759 162935 163295 164009 164579 164510 164180 164468 165529 166480
54132 166480 166361 165136 163703 163232 164352 166567 168504 169109 168564 167784 167272 167016 167221 168286 170034 171718
54116 171718 172972 174093 175210 175932 176089 176129 176377 176494 176116 175525 175218 175284 175604 176269 177301 178331 178999 179376
54098 179376 179592 179441 178752 177857 177174 176594 175747 174713 174025 174078 174878 176234 177897 179637 181424 183386 185452
54081 185452 187356 189191 191528 194538 197408 199181 199959 200771 202370 204663 207168 209544 211676 213739 216197
54066 216197 219313 222660 225478 227570 229464 231687 234335 237436 241196 245455 249226 251307 251418 250438 249353
54051 249353 248177 246171 243025 239495 236731 235210 234624 234603 235187 236548 238645 241272 244211 247265 250348
54036 250348 253671 257604 262265 267376 272496 277233 281290 284626 287569 290427 293046 295134 296945 299085
54022B99085K506K263J796J872K249J923P24l68o44n13o66j225k016k987l998
54007C00001m799n450o201o746o352n039l856l501l410k833k129k123k612k554
53993B42396j664q69r19j266q22M12J156L39j515k745k328q93K18N38P19J344
53977B34101K069K177J522O56J83K73P46J386K065K582K520J528r8j412j662j072
53961B47564m68k80k73j69l7j3l8l5m6K6M66J409K579L558M157M431M504M470
53943B71805M425M484M757N298O016O712P285P719P921P739P327P178P490P721
53929C63877P132N697M184L364L366L794M210M492M779N131N353N399N713O698
53915D33189P845Q105P394P077Q428J1113J3619J4609J3409R888M703o98n110
$$ plain form
54022 299085 301591 303854 305650 307522 309771 311694 312418 312050 311406 310893 310227 309002 306986 303999 300001
54007 300001 295202 289752 283551 276805 270453 265414 261558 258057 254647 251814 249685 247562 244950 242396
53993 242396 240732 239863 238944 237678 236856 237268 238424 238763 237248 234503 232175 231282 231500 232038 232757 234101
53977 234101 236170 238347 239869 240525 240708 240981 241727 243113 245178 247760 250280 251808 251710 250298 248636 247564
53961 247564 247096 246816 246543 246374 246337 246324 246286 246251 246205 246231 246697 248106 250685 254243 258400 262831 267335 271805
53943 271805 276230 280714 285471 290769 296785 303497 310782 318501 326422 334161 341488 348666 356156 363877
53929 363877 371009 376706 380890 384254 387620 391414 395624 400116 404895 410026 415379 420778 426491 433189
53915 433189 441034 449139 456533 463610 472038 483151 496770 511379 524788 534676 539379 538681 533571
53902E33571q435j0999j2585j2936j2645j2499j2186j0797q472o509n792o070
53890D13646o817p858q909r457r392r114q810q342p842p641p503o798n610m808
53876C04745m762m806m323l601l201l150l196l290l461l616l739l939m119m025
53862B51517l638l071k259j313r72j783k995l243k336j349r48p73o07q09j192
53847B24229q54K10O38l56j610j611n36L08L69J49J19L20O88R99Q33J72l27k26
53829B23514N9K0j33pJ96J32k4RJ00J99P24J713K292J857J122J113J697K074K212
53810B38869K662L343L684L743M094M682M845M435M059M140M560N120N607N508
53796B99351M540L389L032L377L410K696J789J134N87K21N67J559K102J266n73
$$ plain form
53902 533571 525136 514137 501552 488616 475971 463472 451286 440489 432017 425508 419716 413646
53890 413646 406829 398971 390062 380605 371213 362099 353289 344947 337105 329464 321961 315163 309553 304745
53876 304745 299983 295177 290854 287253 284052 280902 277706 274416 270955 267339 263600 259661 255542 251517
53862 251517 247879 244808 242549 241236 240264 238481 235486 232243 229907 228558 227610 226837 226230 225421 224229
53847 224229 223375 223585 224223 223867 222257 220646 220110 220418 220787 220936 221055 221375 222063 223062 223895 224067 223740 223514
53829 223514 223573 223593 223460 223453 223649 223781 223757 223766 223866 224065 224789 226502 228794 230651 231773 232886 234583 236657 238869
53810 238869 241531 244874 248558 252301 256395 261077 265922 270357 274416 278556 283116 288236 293843 299351
53796 299351 303891 307280 310312 313689 317099 319795 321584 322718 323305 323526 324093 325652 327754 329020 328447
53781C28447k306l323l754l906l938l962m060m295m692n114n184m673l966l711
53767B71563l951m031l516k813k561k754k792k358j826j741k054k157j688j051
53753B36270r04j285j651j707j735j975k218k178j854j279l95N61J053R48P76
53738B22427R57J254J329J270J098M59o22j242o10Q89K244K978L109K581J564
53723B39685Q79J120J756J934J791J952K188J770R34O72J059J093L85j77K28J329
53707B58598K439L166L169K258J117R75K023L001K939K425K555L392M189M502
53693B96748M324L614K455J382Q59O49K04m82q99p07q0N09N85K2p23r65o20l07
53675C06568n02r64j220j172r66p15o39j016j653j838j223l33J55K55L53M71L50
$$ plain form
53781 328447 326141 322818 319064 315158 311220 307258 303198 298903 294211 289097 283913 279240 275274 271563
53767 271563 267612 263581 260065 257252 254691 251937 249145 246787 244961 243220 241166 239009 237321 236270
53753 236270 235366 234081 232430 230723 228988 227013 224795 222617 220763 219484 219089 219650 220703 221651 222427
53738 222427 223384 224638 225967 227237 228335 228794 228172 226930 226320 227209 229453 232431 235540 238121 239685
53723 239685 240564 241684 243440 245374 247165 249117 251305 253075 254009 254681 255740 256833 257218 257041 257269 258598
53707 258598 261037 264203 267372 269630 270747 271722 273745 276746 279685 282110 284665 288057 292246 296748
53693 296748 301072 304686 307141 308523 309382 310031 310235 309753 308854 308147 308067 308576 309161 309183 308460 307495 306875 306568
53675 306568 306066 305102 303882 302710 301744 301029 300390 299374 297721 295883 294660 294327 294482 294737 295090 295561 295911
53658B95911J7k26k34p9J22J92mk79k66p5k45p62p64K24J378J639J168R08J091
53639B99716J199J148J451K121K502K367K241K330K040J139N04R68K009K474K191
53624C26400K011K384K854K959K902K957K944K655K400K627L305M077M802N553
53610C70830O164O282N827N084M260L346K467K003K109K412K485K395K515K891
53596D21070L141K971K538K257K327K538K466J858Q67r5p71j254j810k616l609
53581D31878m427m488l540k166j425j738k420k546k036j541j496j710j832j752
53567C98761j471r17p9P71J177Q43j7p00n44M20J482J975J843J485J339J679K486
53550D10533L268L417K945K545K660K957L020L095L597M282M566M361M032L776
$$ plain form
53658 295911 295928 295702 295468 295389 295511 295703 295699 295420 295154 295079 294834 294072 293308 293532 294910 296549 297717 298625 299716
53639 299716 300915 302063 303514 305635 308137 310504 312745 315075 317115 318254 318758 319726 321735 324209 326400
53624 326400 328411 330795 333649 336608 339510 342467 345411 348066 350466 353093 356398 360475 365277 370830
53610 370830 376994 383276 389103 394187 398447 401793 404260 406263 408372 410784 413269 415664 418179 421070
53596 421070 424211 427182 429720 431977 434304 436842 439308 441166 442033 441938 441167 439913 438103 435487 431878
53581 431878 427451 422963 419423 417257 415832 414094 411674 409128 407092 405551 404055 402345 400513 398761
53567 398761 397290 396373 396294 397065 398242 399085 399068 398368 397824 398244 399726 401701 403544 405029 406368 408047 410533
53550 410533 413801 417218 420163 422708 425368 428325 431345 434440 438037 442319 446885 451246 455278 459054
53536D59054L689M178N538P217Q268Q499Q523Q706Q907R225J0146J1631J2869
53523E66450J3309J3373J3755J4544J5394J6038J6342J6295J6220J6644J7639
53512G36003J8734J9661K0634K1721K2533K2897K3227K3747K3968K3484K2774
53501I79383K2494K2422K1831K0745K0037K0256K0944K1216K0619J9328J7896
53490A207171J6847J6314J6020J5717J5536J5635J5722J5343J4569J4043J4220
53479A377137J4798J4986J4251J2732J1071R724Q437O551L894J143r03k179l234
53466A468408m498o017p772r787j1861j3563j4696j5546j6477j7381j7724j7207
53454A315879j6272j5811j6332j7491j8497j8884j8740j8312j7714j7022j6350
$$ plain form
53536 459054 462743 466921 472459 479676 487944 496443 504966 513672 522579 531804 541950 553581 566450
53523 566450 579759 593132 606887 621431 636825 652863 669205 685500 701720 718364 736003
53512 736003 754737 774398 795032 816753 839286 862183 885410 909157 933125 956609 979383
53501 979383 1001877 1024299 1046130 1066875 1086912 1107168 1128112 1149328 1169947 1189275 1207171
53490 1207171 1224018 1240332 1256352 1272069 1287605 1303240 1318962 1334305 1348874 1362917 1377137
53479 1377137 1391935 1406921 1421172 1433904 1444975 1454699 1463136 1469687 1473581 1474724 1473821 1471642 1468408
53466 1468408 1463910 1457893 1450121 1440334 1428473 1414910 1400214 1384668 1368191 1350810 1333086 1315879
53454 1315879 1299607 1283796 1267464 1249973 1231476 1212592 1193852 1175540 1157826 1140804 1124454
53443A124454j5688j4839j3669j2303j0937r599q157o475m521k455o44N96J341
53430A027104K001K889M033N365O881Q483R915J0948J1476J1555J1543J2133J3828
53417A138154J6276J8564K0331K2162K4615K7206K8909K9424K9518L0071L1244
53406A416474L2734L4447L6473L8526L9923M0456M0979M2598M5261M7687M8895
53395A864453M9235M9513M9722M9374M8693M8573M9286N0059N0008M8867M6708
53384B404491M3743M0624L8184L6517L4828L2499K9703K6710K3264J9179J4881
53373B744623J0777O612K101k299n908q854j1907j5552j9816k4712l0156l5510
53361B609399l9972m3413m6222m8361m9298m9065m8684m9112n0128n0671n0034
$$ plain form
53443 1124454 1108766 1093927 1080258 1067955 1057018 1047419 1039262 1032787 1028266 1025811 1025167 1025763 1027104
53430 1027104 1029105 1031994 1036027 1041392 1048273 1056756 1066671 1077619 1089095 1100650 1112193 1124326 1138154
53417 1138154 1154430 1172994 1193325 1215487 1240102 1267308 1296217 1325641 1355159 1385230 1416474
53406 1416474 1449208 1483655 1520128 1558654 1598577 1639033 1680012 1722610 1767871 1815558 1864453
53395 1864453 1913688 1963201 2012923 2062297 2110990 2159563 2208849 2258908 2308916 2357783 2404491
53384 2404491 2448234 2488858 2527042 2563559 2598387 2630886 2660589 2687299 2710563 2729742 2744623
53373 2744623 2755400 2762012 2764113 2761814 2755906 2747052 2735145 2719593 2699777 2675065 2644909 2609399
53361 2609399 2569427 2526014 2479792 2431431 2382133 2333068 2284384 2235272 2185144 2134473 2084439
53350B084439m8342m6077m3559m1052l9001l7812l7366l7058l6447l5640l4866
53339A647219l4019l2950l1887l1026k9912k7939k5446k3438k2137k0637j8393
53328A349435j6124j4643j3611j2263j0781r982r964j0032r778r420r092q599
53316A215146p889p141o330n283m175l307k379p27J622L744M959N583O292P232
53302A207347Q127Q910R839J1165J2835J4474J5680J6566J7838J9915K2012K2806
53290A387514K2093K1148K1120K1668K1724K1060K0368J9928J9045J6998J4058
53279A606724J1172Q947P180N277K849j10l329o432r143j1494j3686j5710j7228
53266A565017j8096j8824k0135k2057k3876k5134k6157k7268k7982k7599k6436
$$ plain form
53350 2084439 2036097 1990020 1946461 1905409 1866408 1828596 1791230 1754172 1717725 1682085 1647219
53339 1647219 1613200 1580250 1548363 1517337 1487425 1459486 1434040 1410602 1388465 1367828 1349435
53328 1349435 1333311 1318668 1305057 1292794 1282013 1272031 1262067 1252035 1242257 1232837 1223745 1215146
53316 1215146 1207257 1200116 1193786 1188503 1184328 1181021 1178642 1177915 1179537 1183281 1188240 1193823 1200115 1207347
53302 1207347 1215474 1224384 1234223 1245388 1258223 1272697 1288377 1304943 1322781 1342696 1364708 1387514
53290 1387514 1409607 1430755 1451875 1473543 1495267 1516327 1536695 1556623 1575668 1592666 1606724
53279 1606724 1617896 1626843 1634023 1639300 1642149 1642039 1638710 1632278 1623135 1611641 1597955 1582245 1565017
53266 1565017 1546921 1528097 1507962 1485905 1462029 1436895 1410738 1383470 1355488 1327889 1301453
53255A301453k5735k6193k7173k7597k7287k6859k6558k5858k4380k2767k2045
53244A019001k2317k2633k2317k1772k1583k1433k0681j9611j9178j9497j9567
53233G88412j8678j7238j5806j4295j2648j1488j1240j1285j0874j0317j0303
53222F44240j0473r850q591q107r225j1127j2450j2748j2482j2198j2079j1991
53210E12919j1666j1093j0745j0972j1240j0533q651o566n307n033n375o033o652
53197D03053o676n906m952m616n022n676o157o379o278n743m879m091l656l425
53183C29597l030k453k175k604l368l520k623j347o85q70j409j974k572l030k941
53168B94996k343j858j900k137k010j407o61j56j52o58j252j389j102j065j647
$$ plain form
53255 1301453 1275718 1249525 1222352 1194755 1167468 1140609 1114051 1088193 1063813 1041046 1019001
53244 1019001 996684 974051 951734 929962 908379 886946 866265 846654 827476 807979 788412
53233 788412 769734 752496 736690 722395 709747 698259 687019 675734 664860 654543 644240
53222 644240 633767 623917 615326 607219 597994 586867 574417 561669 549187 536989 524910 512919
53210 512919 501253 490160 479415 468443 457203 446670 438019 431453 426146 421113 415738 409705 403053
53197 403053 396377 390471 385519 380903 375881 370205 364048 357669 351391 345648 340769 336678 333022 329597
53183 329597 326567 324114 321939 319335 315967 312447 309824 308477 307792 306922 305513 303539 300967 297937 294996
53168 294996 292653 290795 288895 286758 284748 283341 282680 282524 282372 281714 280462 279073 277971 276906 275259
53153B75259k243j974q46K19M73P3l20l91l85n88p88m79L86J137J066L38j85J4
53135B70766N48P17L35k32n98p07o76m92J2R21J909K440K276J695J071M78l8j51
53117B80274L87J200J607J379Q23K30k70m24m7M47L35n07j457k030k289k316j875
53100B75467j005k92j42l02m46p68j494k293k661k569k198j456l20O46Q15L22
53084B61304k11n70r01r64l45N57O83j95q81k62J173J932J430N24K66O96J158
53067B65394J245J059P58K79m34j150j489j284q16n89q13j087p83J39Q70O12l97
53050B61514j076p30K31R29R78O30K42NoJ85M10N39N87N19J79l80p24n43j23L0
53030B63396j41l48n08p25q32m99J82P20Q44P24N38K60m1j22O0K59L17L63N25
$$ plain form
53153 275259 273016 271042 270196 270415 270888 270961 270641 270250 269865 269277 268489 268010 268396 269533 270599 270937 270752 270766
53135 270766 271314 272031 272366 272134 271536 270829 270153 269661 269673 270594 272503 274943 277219 278914 279985 280463 280425 280274
53117 280274 280661 281861 283468 284847 285670 285900 285630 285206 285159 285606 285941 285434 283977 281947 279658 277342 275467
53100 275467 274462 274170 274028 273726 273280 272512 271018 268725 266064 263495 261297 259841 259521 260167 260982 261304
53084 261304 261093 260523 259622 258658 258313 258870 259553 259358 258477 258215 259388 261320 262750 263274 263540 264236 265394
53067 265394 266639 267698 268456 268735 268301 267151 265662 264378 263562 262973 262160 261073 260290 260429 261299 261911 261514
53050 261514 260438 259708 259939 260868 261846 262476 262718 262723 262717 262902 263312 263851 264438 264957 265136 264756 264032 263489 263366 263396
53030 263396 263255 262907 262399 261674 260842 260343 260525 261245 262089 262813 263351 263611 263570 263448 263508 263767 264084 264447 264972
53011B64972P92J120J411J374Q61K72J84N27O77L57n6k21k16j70l8Rl54r13r08
52992B69680r5Q10J128J135J402J792J772J352J050J049J038Q52P43Q89J089J024
52976B86710P13N38Q52J545K081K067J727J528J473J201P02L90L49J12n38j155
52960C00295j276j032p88o60o85r49j273j222q33p02j023j178p62l47n80j149
52944B85836j390j330j346j233o31K5o0p75j195r49n56m64n28n80p27r13q38m66
52926B71880j00J19K52K02j01k57J46O40L18p78j545j328o70k73p6J77K32k24
52908B68614r13j382j576j596j322p61l07k07j49J17K54m3l20PP07J096J114J253
52890B64586J493J234M35l3M15J217J431R17K50k03m81m90oP50J056N52k48o26
$$ plain form
53011 264972 265764 266884 268295 269669 270530 270802 270986 271513 272190 272547 272491 272270 272054 271884 271846 271855 271501 270588 269680
52992 269680 269585 270395 271523 272658 274060 275852 277624 278976 280026 281075 282113 282965 283708 284597 285686 286710
52976 286710 287423 287961 288813 290358 292439 294506 296233 297761 299234 300435 301137 301527 301876 301988 301450 300295
52960 300295 299019 297987 297199 296539 295854 294905 293632 292410 291577 290875 289852 288674 287912 287565 286985 285836
52944 285836 284446 283116 281770 280537 279906 279931 279871 279096 277901 276952 276396 275932 275404 274824 274097 273184 272346 271880
52926 271880 271780 271899 272151 272353 272252 271995 272141 272781 273099 272321 270776 269448 268778 268505 268429 268606 268838 268614
52908 268614 267701 266319 264743 263147 261825 261064 260757 260550 260401 260518 260772 260729 260409 260416 261123 262219 263333 264586
52890 264586 266079 267313 267748 267715 268130 269347 270778 271695 271945 271742 271261 270771 270765 271515 272571 273123 272875 272249
52872B72249n51n32p79r68p39o9Q81J873K483K325J550Q12N14M26J61l14q38j318
52854B77166j549j208m43m9o03j712k548k877l015l068k907k601k268j623m62
52839B50233N70N33m51j292j493j667k185k328j480l08N8l97o85k52M78R09R44
52822B41187P72N16K48R6J45M29R08J344J364R18M43L71N66O34N36N58P65R55
52804B52755J042J090R82N03k14p52j028j444k148k613k243j202k74l3m54j140
52788B42827j574j266p2J398K062J391K7q43o49J74Q98J241J310J169P11q9r56
52771B47759j428j140j57R50J517J368Q83M47M4m73r93j266j223r50m35K68Q10
52754B45981Q48N17K54J97J15p8k35l05l22K3J151K714L554L026J843J185J261
$$ plain form
52872 272249 271698 271166 270387 269419 268680 268611 269492 271365 273848 276173 277723 278535 279049 279475 279636 279322 278484 277166
52854 277166 275617 274409 273966 273917 273314 271602 269054 266177 263162 260094 257187 254586 252318 250695 250233
52839 250233 250803 251336 250885 249593 248100 246433 244248 241920 240440 240132 240190 239793 239108 238856 239334 240243 241187
52822 241187 241959 242475 242723 242819 242964 243393 244301 245645 247009 247927 248370 248741 249307 249941 250477 251035 251800 252755
52804 252755 253797 254887 255869 256372 256158 255406 254378 252934 250786 248173 245930 244728 244454 244421 243967 242827
52788 242827 241253 239987 239915 241313 243375 244766 244793 243950 243301 243475 244373 245614 246924 248093 248804 248715 247759
52771 247759 246331 245191 245034 245984 247501 248869 249752 250199 250243 249770 248777 247511 246288 245338 244903 245171 245981
52754 245981 246829 247346 247600 247797 247912 247834 247599 247294 246972 246995 248146 250860 254414 257440 259283 260468 261729
52737B61729J416J303J268J579J925J950J762J643J586J450J309J357J491J348
52723B83116P41r5p91j188j390j484j440j254j104j173j339j226o83m6J91r2n94
52706B70149r91j190j169q37k00M80R06J077J240J459J494J187Q00P08Q67Q25
52690B76805L27l58p65p72n91m13k76j99k36l24k84l9K57L22L4m30p42p95q30
52671B70691j088j355j176n14P2J33q7q3J68L01K40L00N70O55K57l04l81L10J437
52652B70146K433K988L178L167K826J850L21j062j573j188m68J09M05L12k29q82
52636B82333j021m51L04O10M16J50J96O37J324K031K582K980L232L014J806l91
52620B99752k706m052m099l461k938k760k556j962j135n62l77j41N12J255J404
$$ plain form
52737 261729 263145 264448 265716 267295 269220 271170 272932 274575 276161 277611 278920 280277 281768 283116
52723 283116 283857 283762 282971 281783 280393 278909 277469 276215 275111 273938 272599 271373 270690 270644 270835 270743 270149
52706 270149 269158 267968 266799 265962 265762 266242 267148 268225 269465 270924 272418 273605 274405 275113 275980 276805
52690 276805 277132 276774 276009 275237 274646 274233 273957 273758 273522 273198 272914 272875 273132 273454 273488 273058 272316 271521 270691
52671 270691 269603 268248 267072 266558 266630 266763 266676 266593 266761 267062 267302 267602 268172 268827 269084 268780 268399 268709 270146
52652 270146 272579 275567 278745 281912 284738 286588 286909 285847 284274 283086 282618 282727 283132 283444 283215 282333
52636 282333 281312 280861 281165 281775 282191 282341 282537 283174 284498 286529 289111 292091 295323 298337 300143 299752
52620 299752 297046 292994 288895 285434 282496 279736 277180 275218 274083 273521 273144 273003 273515 274770 276174
52605B76174P99m2n75o88m53P5O83J057J161J293J550J617J294Q51N96M05Q7r7
52587B85787L14J243J954J757O91m25o39K87J556K008J238p5r53r93m50J90M86
52570B93976K72k48p16j032j269j322j027o98q76j426j504q10j49k55p33q01n60
52553B80822o06q37n98L1J75n37j349j379n90M32J180J452J284Q80M01j53o24
52536B79984m83N06J545J487L38o24m20N66J344J493J174O43J71R6M38P87Q79
52519B89924R76J348J759J830J560J145O25J27Q2O95J538K098K469K910L112K517
52503C14715J286J93m08q83j521k030k090j893j857k081k335k396k263k154k295
52488B91988k497k134q72O61J385J022L30K3O1J35L22P79J226J282J063J048J433
$$ plain form
52605 276174 276973 276931 276356 275668 275215 275290 275973 277030 278191 279484 281034 282651 283945 284796 285392 285797 285884 285787
52587 285787 286101 287344 289298 291055 291746 291321 290682 290969 292525 294533 295771 295696 294743 293750 293300 293490 293976
52570 293976 294248 294000 293284 292252 290983 289661 288634 287936 287060 285634 284130 283320 283171 282916 282183 281382 280822
52553 280822 280216 279379 278781 278812 278987 278450 277101 275722 275132 275564 276744 278196 279480 280360 280761 280608 279984
52536 279984 279501 280007 281552 283039 283377 282753 282333 282899 284243 285736 286910 287553 287724 287820 288258 289045 289924
52519 289924 290900 292248 294007 295837 297397 298542 299167 299294 299376 300071 301609 303707 306176 309086 312198 314715
52503 314715 316001 316194 315786 314903 313382 311352 309262 307369 305512 303431 301096 298700 296437 294283 291988
52488 291988 289491 287357 286485 287146 288531 289553 289883 289906 289967 290102 290424 291203 292429 293711 294774 295822 297255
52471B97255J998K479K686K415J628P14K84O06J346J927K012J711J442J428J327
52456C21258O00o56j658j917j830j981k278k377k473k946l436l220k421k018k411
52441B90236k848k590j828j056l29L09M01j65n32J13J231J560Q36J7j41J71N55
52424B85940J049J619J859J655J601K198L026L231K671K036J866J969J920J775
52410C14415J954K553L121L270L265L662M493N208N515N702N858N327L555J133
52396C69031q20k062l267m601n302m920m206m057m210l715k384j087n87o52m34
52381C26727N38J865K693K607K090J940K347K824L029L149L343L376L148L082
52367C62758L542M143M238L740L026K261J438Q34P46Q11L25o57j218q26p1K35
$$ plain form
52471 297255 299253 301732 304418 306833 308461 309175 309459 310065 311411 313338 315350 317061 318503 319931 321258
52456 321258 321858 321202 319544 317627 315797 313816 311538 309161 306688 303742 300306 297086 294665 292647 290236
52441 290236 287388 284798 282970 281914 281585 281894 282295 282130 281598 281711 282942 284502 285338 285355 285214 285385 285940
52424 285940 286989 288608 290467 292122 293723 295921 298947 302178 304849 306885 308751 310720 312640 314415
52410 314415 316369 318922 322043 325313 328578 332240 336733 341941 347456 353158 359016 364343 367898 369031
52396 369031 368211 366149 362882 358281 352979 348059 343853 339796 335586 331871 329487 328400 327813 327161 326727
52381 326727 327265 329130 331823 334430 336520 338460 340807 343631 346660 349809 353152 356528 359676 362758
52367 362758 366300 370443 374681 378421 381447 383708 385146 385980 386726 387537 387862 387205 385987 385161 385090 385325
52351C85325K33O96J812K867L195K942K721K888L369M067M950N774O178O253O600
52336D39870P486Q250Q163P680Q026R466J0856J1250J1168J1656J2782J3870J4729
52323E75252J5710J6787J7570J8217J9319K0738K1479K0996J9849J8788J7939
52312G82644J7349J7500J8555J9657J9798J9046J8252J7762J7213J6358J5357
52301I79491J4274J3047J2014J1691J1802J1274R596P616O347N460L718P35k421
52288A084644m488n309n585n849o097o229o283o206n724m611l055j581o00L1R27
52273A023985K529M487N901O322O369P134R024J1396J3244J3965J3565J2498J1474
52260A141893J1104J1474J2139J2595J2683J2525J2257J1937J1544J0966J0121
$$ plain form
52351 385325 385558 386254 388066 390933 394128 397070 399791 402679 406048 410115 415065 420839 427017 433270 439870
52336 439870 447356 455606 463769 471449 479475 488941 499797 511047 522215 533871 546653 560523 575252
52323 575252 590962 607749 625319 643536 662855 683593 705072 726068 745917 764705 782644
52312 782644 799993 817493 836048 855705 875503 894549 912801 930563 947776 964134 979491
52301 979491 993765 1006812 1018826 1030517 1042319 1053593 1063189 1070805 1077152 1082612 1086330 1087065 1084644
52288 1084644 1080156 1074847 1069262 1063413 1057316 1051087 1044804 1038598 1032874 1028263 1025208 1023627 1023027 1023058 1023985
52273 1023985 1026514 1031001 1036902 1043224 1049593 1056727 1065751 1077147 1090391 1104356 1117921 1130419 1141893
52260 1141893 1152997 1164471 1176610 1189205 1201888 1214413 1226670 1238607 1250151 1261117 1271238
52249A271238R104Q045O841N279L436J582k66k289m277n639o278o924q178r641
52235A262033j0526j0799j1036j1357j1216j0289r004q020p585p525p518p259
52223A149899o653n881n128m254l035j628m89J63M86O71Q60J262J951K638L051
52208A133913L506M497N793O627O795O909P250P206O248M922M224M371M714M618
52194A211593M043L397L236L805M582M573L399J828Q37N10L26M0l61j243k940
52179A237625m898o073o337o630p500q312q368q006p904p802o844n008l286k382
52165A148275j902j148j22O56R99J236J679K280K751K810K283J262K10l43k72
52150A160654R7M13N62N46M35N17J174K358L430L821L623L319L130L005L034L417
$$ plain form
52249 1271238 1280342 1288387 1295228 1300507 1303943 1305525 1305259 1302970 1298693 1293054 1286776 1279852 1271674 1262033
52235 1262033 1251507 1240708 1229672 1218315 1207099 1196810 1187806 1179786 1172201 1164676 1157158 1149899
52223 1149899 1143246 1137365 1132237 1127983 1124948 1123320 1122831 1122994 1123480 1124151 1125011 1126273 1128224 1130862 1133913
52208 1133913 1137419 1141916 1147709 1154336 1161131 1168040 1175290 1182496 1188744 1193666 1197890 1202261 1206975 1211593
52194 1211593 1215636 1219033 1222269 1226074 1230656 1235229 1238628 1240456 1241293 1241803 1242129 1242169 1241808 1240565 1237625
52179 1237625 1232727 1226654 1220317 1213687 1206187 1197875 1189507 1181501 1173597 1165795 1158951 1153943 1150657 1148275
52165 1148275 1146373 1145225 1145103 1145759 1146758 1147994 1149673 1151953 1154704 1157514 1159797 1161059 1161269 1160926 1160654
52150 1160654 1160751 1161164 1161726 1162272 1162707 1163224 1164398 1166756 1170186 1174007 1177630 1180949 1184079 1187084 1190118 1193535
52134A193535M049M625N248O390Q174J0073J1548J2644J3661J4686J5813J7387
52122A317833J9555K1761K3233K3942K4610K5668K6703K7029K6425K5147K3568
$$ plain form
52134 1193535 1197584 1202209 1207457 1213847 1222021 1232094 1243642 1256286 1269947 1284633 1300446 1317833
52122 1317833 1337388 1359149 1382382 1406324 1430934 1456602 1483305 1510334 1536759 1561906 1585474
$$ [...]
##END NTUPLES=NMR SPECTRUM
##END=
