##TITLE=AC1670_HONAH14361_8570817_kuR3e2hGd2
##JCAMPDX= 6.0         $$ Bruker NMR JCAMP-DX V2.0
##DATA TYPE= NMR SPECTRUM
##DATA CLASS= NTUPLES
##ORIGIN= BRUKER
##OWNER= Administrator
$$ 1.72 TOPSPIN		Version 2.1
$$ 2014-04-11 20:35:02.516 -0700  Administrator@X
$$ Compression mode = diff/dup
##.OBSERVE FREQUENCY= 400.02188249412
##.OBSERVE NUCLEUS= ^1H
##.ACQUISITION MODE= SIMULTANEOUS (DQD)
##.ACQUISITION SCHEME= undefined
##.AVERAGES= 8
##.DIGITISER RES= 22
##SPECTROMETER/DATA SYSTEM= spect
##.PULSE SEQUENCE= zg30
##.SOLVENT NAME= COFFEE_meoh
##.SHIFT REFERENCE= INTERNAL, COFFEE_meoh, 1, 14.98509
##AUDIT TRAIL= $$ (NUMBER, WHEN, WHO, WHERE, PROCESS, VERSION, WHAT)
$$ ##TITLE= Audit trail, TOPSPIN		Version 2.1
$$ ##JCAMPDX= 5.01
$$ ##ORIGIN= Bruker BioSpin GmbH
$$ ##OWNER= Administrator
$$ $$ E:\/data/COFFEE/nmr/AC1670_HONAH14361_8570817_kuR3e2hGd2/10/pdata/1/auditp.txt
$$ ##AUDIT TRAIL=  $$ (NUMBER, WHEN, WHO, WHERE, PROCESS, VERSION, WHAT)
(   1,<2014-04-11 20:34:55.313 -0700>,<Administrator>,<X>,<go>,<TOPSPIN 2.1>,
      <created by zg
	started at 2014-04-11 20:33:48.813 -0700,
	POWCHK enabled, PULCHK disabled,
       configuration hash MD5:
       C8 4E 4E 5D D3 5C D8 9E 9F 52 82 E0 59 8A DE 15
       data hash MD5: 64K
       D5 D1 B4 E4 BF 0A E9 3F 10 9D 46 41 48 37 7B 1D>)
(   2,<2014-04-11 20:34:58.359 -0700>,<Administrator>,<X>,<proc1d>,<TOPSPIN 2.1>,
      <Start of raw data processing
       efp LB = 0 FT_mod = 6 PKNL = 1 PHC0 = 0 PHC1 = 0 SI = 32K 
       data hash MD5: 32K
       CF 01 9D 92 30 6C C0 DB 59 86 A1 61 8F 13 05 E9>)
(   3,<2014-04-11 20:34:58.688 -0700>,<Administrator>,<X>,<proc1d>,<TOPSPIN 2.1>,
      <pk PHC0 = 93.12561 PHC1 = 0 
       data hash MD5: 32K
       AD 92 6C 9C E9 B9 78 BC 2B CF 64 7D 78 D8 C1 0A>)
(   4,<2014-04-11 20:34:58.781 -0700>,<Administrator>,<X>,<proc1d>,<TOPSPIN 2.1>,
      <abs ABSG = 1 
       data hash MD5: 32K
       46 F4 ED 81 17 2F 4A F6 0F 6F BB 18 1F 81 F5 9B>)
(   5,<2014-04-11 20:34:58.844 -0700>,<Administrator>,<X>,<proc1d>,<TOPSPIN 2.1>,
      <abs ABSG = 2 
       data hash MD5: 32K
       F0 60 62 23 40 35 0A 74 22 39 54 CF 89 03 D1 9E>)
(   6,<2014-04-11 20:34:58.891 -0700>,<Administrator>,<X>,<proc1d>,<TOPSPIN 2.1>,
      <abs ABSG = 3 
       data hash MD5: 32K
       4F 4D 17 41 2B 7B AC ED 04 50 52 45 81 FE 8F 5A>)
(   7,<2014-04-11 20:34:59.000 -0700>,<Administrator>,<X>,<proc1d>,<TOPSPIN 2.1>,
      <abs ABSG = 4 
       data hash MD5: 32K
       AA E9 A5 50 B4 94 AD 84 54 83 3F F7 33 9D 34 94>)
(   8,<2014-04-11 20:34:59.063 -0700>,<Administrator>,<X>,<proc1d>,<TOPSPIN 2.1>,
      <abs ABSG = 5 
       data hash MD5: 32K
       82 89 AC DE 62 D9 6D 99 12 3D 4F CE FB 42 26 35>)
$$ ##END=
$$ 
$$ $$ hash MD5
$$ $$ 4E B0 FC B0 0E 53 83 47 ED D2 EB 96 E7 6D FF 3D
##$RELAX= 
##$RELAX= 
##$RELAX= 
##$RELAX= 
##$RELAX= 
##$RELAX= 
##$RELAX= 
$$ Bruker specific parameters
$$ --------------------------
##$DU= <E:\>
##$EXPNO= 10
##$NAME= <AC1670_HONAH14361_8570817_kuR3e2hGd2>
$$ [...]
##$TP= (0..7)
150 150 150 150 150 150 150 150
##$TP07= 0
##$TPNAME0= <>
##$TPNAME1= <>
##$TPNAME2= <>
##$TPNAME3= <>
##$TPNAME4= <>
##$TPNAME5= <>
##$TPNAME6= <>
##$TPNAME7= <>
##$TPOAL= (0..7)
0.5 0.5 0.5 0.5 0.5 0.5 0.5 0.5
##$TPOFFS= (0..7)
0 0 0 0 0 0 0 0
##$TUNHIN= 0
##$TUNHOUT= 0
##$TUNXOUT= 0
##$USERA1= <user>
##$USERA2= <user>
##$USERA3= <user>
##$USERA4= <user>
##$USERA5= <user>
##$V9= 5
##$VALIST= <valist>
##$VCLIST= <CCCCCCCCCCCCCCC>
##$VD= 0
##$VDLIST= <DDDDDDDDDDDDDDD>
##$VPLIST= <PPPPPPPPPPPPPPP>
##$VTLIST= <TTTTTTTTTTTTTTT>
##$WBST= 1024
##$WBSW= 4
##$XGAIN= (0..3)
0 0 0 0
##$XL= 0
##$YL= 0
##$YMAX_a= 631329
##$YMIN_a= -534696
##$ZGOPTNS= <>
##$ZL1= 120
##$ZL2= 120
##$ZL3= 120
##$ZL4= 120
##$ABSF1= 14.98509
##$ABSF2= -5.573092
##$ABSG= 5
##$ABSL= 3
##$ALPHA= 0
##$AQORDER= 0
##$ASSFAC= 0
##$ASSFACI= 0
##$ASSFACX= 0
##$ASSWID= 0
##$AUNMP= <proc_prof1d_extract_pilot.lims>
##$AXLEFT= 0
##$AXNAME= <>
##$AXNUC= <1H>
##$AXRIGHT= 0
##$AXTYPE= 0
##$AXUNIT= <>
##$AZFE= 0.1
##$AZFW= 0.1
##$BCFW= 0
##$BC_mod= 0
##$BYTORDP= 0
##$COROFFS= 0
##$CY= 15
##$DATMOD= 1
##$DC= 0
##$DFILT= <>
##$DTYPP= 0
##$F1P= 0
##$F2P= 0
##$FCOR= 0.5
##$FTSIZE= 32768
##$FT_mod= 6
##$GAMMA= 0
##$GB= 0
##$INTBC= 1
##$INTSCL= 1
##$ISEN= 128
##$LB= 0
##$LEV0= 0
##$LPBIN= 0
##$MAXI= 10000
##$MC2= 0
##$MEAN= 0
##$ME_mod= 0
##$MI= 0
##$NCOEF= 0
##$NC_proc= -8
##$NLEV= 6
##$NOISF1= 0
##$NOISF2= 0
##$NSP= 0
##$NTH_PI= 0
##$NZP= 0
##$OFFSET= 14.98509
##$PC= 1
##$PHC0= 93.12561
##$PHC1= 0
##$PH_mod= 1
##$PKNL= yes
##$PPARMOD= 0
##$PPDIAG= 0
##$PPIPTYP= 0
##$PPMPNUM= 2147483647
##$PPRESOL= 1
##$PSCAL= 4
##$PSIGN= 0
##$PYNMP= <proc.py>
##$REVERSE= no
##$SF= 400.02
##$SI= 32768
##$SIGF1= 0
##$SIGF2= 0
##$SINO= 400
##$SIOLD= 32768
##$SPECTYP= <>
##$SREGLST= <1H.CDCl3>
##$SSB= 0
##$STSI= 32768
##$STSR= 0
##$SW_p= 8223.68421052631
##$SYMM= 0
##$S_DEV= 0
##$TDeff= 65536
##$TDoff= 0
##$TI= <>
##$TILT= no
##$TM1= 0
##$TM2= 0
##$TOPLEV= 0
##$USERP1= <user>
##$USERP2= <user>
##$USERP3= <user>
##$USERP4= <user>
##$USERP5= <user>
##$WDW= 1
##$XDIM= 32768
##$YMAX_p= 461672121
##$YMIN_p= -712437
##$CURPLOT= <Network HP LaserJet P1505>
##$CURPRIN= <$Network HP LaserJet P1505>
##$DFORMAT= <normdp>
##$LAYOUT= <+/1D_H.xwp>
##$LFORMAT= <normlp>
##$PFORMAT= <normpl>
##$SURQMSG= 1
$$ End of Bruker specific parameters
$$ ---------------------------------
##NTUPLES= NMR SPECTRUM
##VAR_NAME=  FREQUENCY,     SPECTRUM/REAL,   SPECTRUM/IMAG
##SYMBOL=    X,             R,               I
##VAR_TYPE=  INDEPENDENT,   DEPENDENT,       DEPENDENT
##VAR_FORM=  AFFN,          ASDF,            ASDF
##VAR_DIM=   32768,         32768,           32768
##UNITS=     HZ,            ARBITRARY UNITS, ARBITRARY UNITS
##FACTOR=    0.250966925370066, 1,           1
##FIRST=     8223.43324360094, -119286,      102162
##LAST=      0,             -44411,          9361
##MIN=       0,             -712437,         0
##MAX=       8223.43324360094, 461672121,    0
$$ Real data points
##PAGE= N=1
##DATA TABLE= (X++(R..R)), XYDATA
$$ [...]
19544a13428A85310q4254d2921K525J5955m74781A03861c32644M2875R5878A4239
19532F6811a20930a7560j67669E0144a3839A14803a8169j41534B2452a82335k16257
19521c98592A2926a89331e2643A57575a45390N5031D15974e4145B02953a38890
19510b65023j01740a48599J8889C5174h2829J9490k9955j64653a08334D08527
19499h8418A84399c39917A02054b42363b3513j8743J7323B59779a74554A17773
19488A33724f6591j1372L2191r1866C09420c31246Q5670j4005a6150E7540a57019
19476a21953j65282G895K4709e1268q1648k18405J47657r6380f4083C21633b71843
19464c23615N8954q3240b221E2618K6154k5726P8891c37793g8405C1755a59420
$$ plain form
19544 -113428 185310 101056 -42921 -40396 -24441 -499222 103861 -332644 -289769 -193891 14239
19532 66811 -120930 -17560 -185229 50144 -13839 114803 -18169 -159703 22452 -182335 -398592
19521 -398592 12926 -189331 -52643 157575 -145390 -90359 415974 -54145 202953 -138890
19510 -265023 -366763 -148599 -129710 35174 -82829 -63339 -93294 -257947 -108334 408527
19499 -88418 184399 -339917 102054 -242363 -23513 -42256 -24933 259779 -174554 117773
19488 133724 -66591 -77963 -45772 -137638 309420 -331246 -245576 -259581 -16150 57540 -157019
19476 -121953 -287235 7895 32604 -51268 -132916 -351321 -203664 -300044 -64083 321633 -271843
19464 -323615 -264661 -347901 -2221 52618 78772 53046 131937 -337793 -78405 31755 -159420
19452a72789l4155A76212H184J95842m3671b52317B8325a18411j28690B2977c3931
19440a24982k7656M1405A37594b32667f2948j70597o4260O676J9907A09012J3190
19429A22202l1369a42998c0892j28437A17362r40g0822j40745D22434c13849a08708
19417B02b47342B27587d0657K672r8849j6875k30643A39129a91519C867L1638
19406C5505L7546k4920g4898k4559q2711j63404H287J15738a84786C3667d86348
19394I7934M0505a25781C55092g6239A89133e358q0112d0785m5394m3454q2251
19383b11884I281K42372j9695d02023a44678H255h7380B69812a70043N802A66843
19371a22411H262h9114p9427p715c5750r1783j45727c0323k13538E219a08367
$$ plain form
19452 -172789 -206944 176212 8184 204026 160355 -252317 28325 -118411 -247101 22977 -33931
19440 -124982 -152638 -111233 137594 -232667 -62948 -233545 -297805 -291129 -271222 109012 122202
19429 122202 90833 -142998 -30892 -159329 117362 116422 -70822 -211567 422434 -313849 -108708
19417 202 -247342 227587 -40657 -37985 -136834 -153709 -384352 139129 -191519 3867 35505
19406 35505 73051 48131 -74898 -99457 -182168 -345572 8287 124025 -184786 33667 -486348
19394 97934 138439 -125781 355092 -76239 189133 -5358 -85470 -40785 -86179 -129633 -211884
19383 -211884 9281 251653 231958 -402023 -144678 8255 -87380 269812 -170043 -164241 166843
19371 -122411 8262 -89114 -168541 -176256 -35750 -127533 -273260 -30323 -243861 5219 -108367
19359b56164d4576j08919A59731G8186a33957l85114H9682L479m4510K08932d8495
19347c0805o2065C1877c58418J47658C8360a57304C28431H5375h8781n912m56831
19336e51524a80341K0494J1076k41863h9588q0902p6218A95279a1983B76948C9993
19324C2717j2773h9238C2560K32093E695f23k68000Q9462e7265B19758n3786e19823
19311A42216n3908h7196l3128i626B13560o2233Q6843a8761D3936J65542C5545
19299c49406j51738f2100j4661j45829A54294a78233k31k2083G3442j948B162
19287h0934C02042c09733A5154K67916e1550G3588J16046J7421i2648M3016g407
19275A31407a41753g0227b3663D7166b8742p1627H1368J55378O048I513b428l10716
$$ plain form
19359 -256164 -44576 -153495 159731 78186 -133957 -519071 89682 93161 48651 257583 -48495
19347 -30805 -92870 31877 -358418 -210760 38360 -157304 328431 85375 -88781 -94693 -551524
19336 -551524 -180341 -159847 -148771 -390634 -89588 -170490 -246708 195279 -11983 276948 39993
19324 32717 19944 -89238 32560 264653 5695 -623 -268623 -179161 -57265 219758 165972 -519823
19311 142216 88308 -87196 -120324 -9626 213560 151327 238170 -18761 43936 209478 35545
19299 -349406 -501144 -62100 -76761 -222590 154294 -178233 -178464 -200547 73442 71494 2162
19287 -80934 302042 -309733 15154 283070 -51550 73588 189634 207055 -92648 -49632 -7407
19275 131407 -141753 -70227 -23663 47166 -28742 -100369 81368 236746 242794 9513 -2428 -313144
19263c13144A00061g2877j14728I4859e1197j43420R5931H2086O265a07412n5072
19252a62484F9677j6848d10366A14847a69254A77856B6044c56992Q8635M5629
19242b22728a0351B19370f7702b5264D6045A1830J5494h8472A28453b553l34986
19231c37539h2546j27830A76540N3810a09664j0180k1682k98876J23168b936n1911
19220e4847k07196c3859o4872A38786a20730q3431A1763c33558O4501j8574k3046
19209c10677m5666E078L073J61968a57543A07713d1102j66460L9709L0576C6210
19197C5896h7884I6019a0043k02120j81427k8305a07720j06819A63379g3731H9159
19185b01802p6294d4633f639A2417b32418A2877J63471D9384a68606j34066A50774
$$ plain form
19263 -313144 100061 -72877 -187605 94859 -51197 -194617 -98686 82086 88351 -107412 -162484
19252 -162484 69677 52829 -410366 114847 -169254 177856 26044 -356992 -268357 -222728
19242 -222728 -10351 219370 -67702 -25264 46045 11830 27324 -88472 128453 -2553 -337539
19231 -337539 -82546 -210376 176540 230350 -109664 -119844 -141526 -440402 -317234 -2936 -54847
19220 -54847 -262043 -33859 -98731 138786 -120730 -204161 11763 -333558 -269057 -287631 -310677
19209 -310677 -356343 5078 8151 170119 -157543 107713 -41102 -207562 -167853 -137277 36210
19197 35896 -87884 96019 -10043 -212163 -393590 -421895 -107720 -214539 163379 -73731 89159
19185 -201802 -278096 -44633 -6639 12417 -232418 12877 176348 49384 -168606 -302672 150774
19173A17313h883j36567f5756j55951i266A62667b14801A37036o8228a94391A88694
19161b36961g3081J4354l6572J6577B68060C072a03372j50827F9184c46283F7953
19149B55892G892c25145G6885J04993B5174e4088B18004a53873K9030H0336a33255
19137a80754n4329A9847J33460a267j01766k50231B97601g1087r3612j3593c0462
19125a05639L1129C6139P0287e3964j00312k2161B84639b80309L7966g140I6805
19113c69402A56935b24749F5871h876j41534D9568a60203j20404g9438A2548e9567
19101C0554J41619b67084J13642m5565d5369k102i853B13835j01802J49271M327
19090B65631l9766b32942k4944i4476L0175k36335J12020g5067B2410K57162b64928
$$ plain form
19173 117313 -8883 -145450 -65756 -221707 -9266 162667 -214801 137036 68808 -194391 188694
19161 -236961 -73081 -58727 -95299 -78722 268060 3072 -103372 -254199 69184 -346283 67953
19149 255892 7892 -325145 76885 181878 25174 -54088 218004 -153873 -124843 80336 -133255
19137 -180754 -235083 19847 153307 -1267 -103033 -353264 297601 -71087 -164699 -178292 -30462
19125 -105639 -74510 36139 106426 -53964 -154276 -176437 284639 -280309 -242343 -7140 96805
19113 -369402 156935 -224749 65871 -8876 -150410 49568 -160203 -280607 -79438 12548 -59567
19101 30554 172173 -267084 -153442 -199007 -45369 -47471 -9853 213835 112033 261304 265631
19090 265631 225865 -232942 -257886 -94476 -64301 -300636 -188616 -75067 22410 279572 -264928
19078A65559e0255C29312A21215b68221a0462j32329a7182k6087B38545p596d1784
19066b22211K7013O815k11018d3303j17168k0353Q8416A80342e5219A385a45333
19054H2221L0965m4034b41501F1266Q54a56663A8893a31702M0881A11695a6411
19042G3064L00151a05711C95022a60700B0096a5531j54462m628d5747E9953M46488
19031E06441a00207A03339J19890A5059J73061l6972a18726k542a3867D33900
19020a31085n6407A55584h2457k16177G4813K68264f6842k99116J48327Q2819
19010a34812A3798a78469n5813f0297E6563a42042L3566n5454h1018B03784h365
18998A18991M2305B0727N7783h813k55628A1591d36031A0771c80294H5684b22607
$$ plain form
19078 165559 -50255 329312 121215 -268221 -10462 -142791 -17182 -43269 238545 230949 -41784
19066 -222211 -195198 -188383 -399401 -43303 -160471 -180824 -92408 180342 -55219 1385 -145333
19054 82221 113186 69152 -241501 61266 62120 -156663 18893 -131702 -90821 111695 -16411
19042 73064 373215 -105711 395022 -160700 20096 -15531 -169993 -174621 -45747 59953 506441
19031 506441 -100207 103339 223229 15059 188120 151148 -118726 -121268 -13867 433900
19020 -131085 -187492 155584 -82457 -298634 74813 343077 -66842 -365958 -217631 -134812
19010 -134812 13798 -178469 -234282 -60297 56563 -142042 -108476 -163930 -81018 203784 -8365
18998 118991 161296 20727 78510 -8813 -264441 11591 -436031 10771 -380294 85684 -222607
18986B0223g8828l00309O2257f020k65806j71168D0371c0623j26348j49625B27723
18974a4716B7005m181g3663j10081M8379A28166b29172K715C10034c69593C39944
18962a31148l2396j88112D016P3985d1126k37768P6102A80636E2246J30470a51386
18950b26127J4501A40413l818H091d95916I5717q713g3303H352b48520G5806a75368
18937C42006j60815b61013F3818a55687A97727C8608e6224C7201O2861Q8479a42733
18925a3534k53558j30605i2226l3592j68111c7120I8434a33770M4924I5448a25176
18913A97537c1295B78339a54095l47725J93847C41888b08276l8766E4970f4450
18902C0919f2428K2904A91748a22077A59878E9032K24762B5434e1020j64658e6036
$$ plain form
18986 20223 -78828 -379137 -316880 -6020 -271826 -442994 40371 -30623 -156971 -306596 227723
18974 -14716 27005 22824 -73663 -183744 -135365 128166 -229172 -226457 310034 -369593 339944
18962 -131148 -163544 -351656 4016 78001 -41126 -278894 -202792 180636 52246 182716 -151386
18950 -226127 -211626 140413 136595 8091 -495916 95717 87004 -73303 8352 -248520 75806 -175368
18937 342006 181191 -261013 63818 -155687 197727 38608 -56224 37201 100062 188541 -142733
18925 -13534 -267092 -397697 -92226 -125818 -293929 -37120 98434 -133770 -88846 95448 -125176
18913 197537 -31295 278339 -154095 -501820 -307973 341888 -208276 -247042 54970 -64450
18902 30919 -62428 -39524 191748 -122077 159878 59032 283794 25434 -51020 -215678 -56036
18890d8487C9427b65108M8005G2510p632e5109B14166a96829Q7863j51263n4266
18879c14495I0509b4777k33236j7897i901B33232f3356j30253L0266A55584l8291
18868A17293e6223j05073M6996j10546B0106c64663N7367A93825a83920k3900
18858b07820A29370a39573a060A66454j6494e8133j71125C2977J06902a61268
18847b17669j9016B10527g2104H5200b41474k9060a3000j85460A88028G4265l4060
18836D0205i2418m0791M1273n8569a8592j2792A40358g1360k26526e5693q1069
18825a36762b5220I8058a66681A74427N8499F5295a33904j39428H5369G595N8067
18814F5662L2578a55191M9682H7573L25030c5197D3779M7326J06472L6668o2364
$$ plain form
18890 -48487 39427 -265108 -217103 72510 64878 -55109 214166 -196829 -108966 -260229 -314495
18879 -314495 90509 -24777 -258013 -275910 -9901 233232 -63356 -193609 -163343 155584 117293
18868 117293 -56223 -161296 -114300 -224846 20106 -364663 -307296 193825 -183920 -207820
18858 -207820 129370 -139573 -1060 166454 149960 -58133 -229258 32977 139879 -161268
18847 -217669 -236685 210527 -72104 85200 -241474 -270534 -13000 -198460 188028 74265 40205
18836 40205 -92418 -133209 -91936 -150505 -18592 -31384 140358 -71360 -297886 -55693 -136762
18825 -136762 -25220 98058 -166681 174427 232926 65295 -133904 -273332 85369 7595 65662
18814 65662 98240 -155191 -105509 87573 412603 -35197 43779 91105 197577 234245 171881
18803A71881a95004A1891a34132K7401A14037a96962A77726a39728A52073J83415
18793C35488b59050D3543b7811j63843o1462F8253J2577J47286b28672L2134d4763
18781f8078A51576b13522E493J4147R8602b47979N2233B0492i0034A00548d42166
18769A09979b01257d8693F8004B172g9111H9783C8205a29615L0046c6523k604
18758c9127j82943Q6112j51951M6460D4536c79002i804j67996a1512D01116a07929
18746B4920h6885l26642f1010c638j7236j22050k54559C69140H987a18797M8094
18735g0703B8086J58252i3561A47359N0676n8300f68l00259i4576b5996a019n2874
18723e3893D3556G251h7522A69747e2392j91284B08663R1084A7160c65219D13310
$$ plain form
18803 171881 -195004 11891 -134132 -106731 114037 -196962 177726 -139728 152073 335488
18793 335488 -259050 43543 -27811 -191654 -253116 68253 80830 228116 -228672 -196538 -44763
18781 -68078 151576 -213522 5493 19640 118242 -247979 -195746 20492 -90034 100548 -442166
18769 109979 -201257 -48693 68004 2172 -79111 89783 38205 -129615 -99569 -36523 -39127
18758 -39127 -222070 -135958 -287909 -241449 44536 -379002 -9804 -177800 -11512 401116 -107929
18746 24920 -86885 -413527 -61010 -3638 -20874 -142924 -397483 369140 8987 -118797 -70703
18735 -70703 28086 186338 -93561 147359 198035 139735 -668 -300927 -94576 -25996 -1019 -53893
18723 -53893 43556 7251 -87522 169747 -52392 -243676 208663 299747 17160 -365219 413310
18711e9652k2943I6534m4019c24487a37022j67752J51479a630k41451d1654D5279
18699b10116A65734e4905m0978l3097B3371K35455c1506l08393c8712k05189j6950
18688b60851g1871B4947M1954K7523J380a73973d691E3469b08709r2369d0899
18676g5015K5193j70162g7635K0745r5397O1852j8505k5748M5796r3899e5536
18664B2067a81022l8194F1083k7795J00303c25988A27177b61837a12429A2998
18653b0479C55717a75915g0725A18377J78156a29753F461e4312C72029a21201
18642d2949D69096d0327k67100b3665j81862n1429A16992D5214c63676a00569
18631b91417N7337O1539A16741a25799C48672j37931b3514j57899Q8665K1024
$$ plain form
18711 -59652 -82595 96534 52515 -324487 -137022 -304774 -153295 -1630 -243081 -41654 45279
18699 -210116 165734 -54905 -95883 -128980 23371 258826 -31506 -339899 -38712 -243901 -260851
18688 -260851 -71871 24947 66901 94424 95804 -173973 -4691 53469 -208709 -301078 -40899
18676 -75015 -49822 -219984 -77635 -56890 -152287 -90435 -108940 -134688 -88892 -182791 -55536
18664 22067 -181022 -219216 61083 33288 133591 -325988 127177 -261837 -112429 12998
18653 -20479 355717 -175915 -70725 118377 296533 -129753 6461 -54312 372029 -121201
18642 -42949 469096 -40327 -307427 -23665 -205527 -256956 116992 45214 -363676 -100569
18631 -291417 -234080 -172541 116741 -125799 348672 210741 -23514 -181413 -92748 -71724
18621g1724K0011A04884c39728a00604n9781b1808l29908K9642A48262O8584a02418
18609E8325J7246a9297A73594a54327j13113A62052a05080M8234j20496F424L7100
18598D3524e432k04205R5995c6929l08724o1249a7339l77028A62907a87880e2441
18586f7317B81927g7123B56684j05231N0947a12448p1786j05932a26562q4715
18576b11277E0839d12123C02468b61386g6093j03798C9285N5911M9186i5663j5261
18565a10924j92101F373K74277a85085f5593l49497h2347j22142j06863F1159
18554a34398n0160e8953m0272A01630c4149I6838j2906b7302F0879b72301r837
18543b82138m2242B04771E4240O8378a46679H2409c78842A6026K28418b14578
$$ plain form
18621 -71724 -51713 104884 -339728 -100604 -160385 -21808 -351716 -322074 148262 216846 -102418
18609 58325 75571 -19297 173594 -154327 -267440 162052 -105080 -56846 -177342 6424 43524
18598 43524 -5432 -209637 -113642 -36929 -345653 -406902 -17339 -394367 162907 -187880 -52441
18586 -67317 281927 -77123 256684 151453 202400 -112448 -184234 -290166 -126562 -211277
18576 -211277 50839 -412123 302468 -261386 -76093 -179891 39285 95196 144382 -95663 -110924
18565 -110924 -303025 6373 280650 -185085 -65593 -415090 -82347 -204489 -311352 61159
18554 -134398 -184558 -58953 -99225 101630 -34149 96838 83932 -27302 60879 -272301 -282138
18543 -282138 -324380 204771 54240 122618 -146679 82409 -378842 16026 244444 -214578
18532d11042B00492i8023a0275l56532H120L5247J07298g9579C27598a03562K8539
18521g5023k32867J24459A04151J7651a44183H5581a4671q2720l68164d691C70730
18509a00804A21984j5860B9362A344J68440q0558d4402j11488d7804B7835c33089
18497a13351c9366n9318j33104F083J9521c70570h9780k68453J68721G1365J30390
18486B01755c23646J07396J0638b4155C5926f6538r4485K7900O6542m6007e5387
18474A7638L06500b07973A07241e7570k4964p083o6777B91479c16229g4046A47169
18462A47829R4807G6617J00047c9981k41972G3900L5911c90752c5055B31797A03239
18450a05411a8784j89316D936a81822j6140D28892A593e0040j77767K4417J6942
$$ plain form
18532 -411042 200492 -98023 -10275 -366807 8120 43367 150665 -79579 327598 -103562 -75023
18521 -75023 -307890 -183431 104151 121802 -144183 85581 -14671 -97391 -465555 -4691 370730
18509 -100804 121984 106124 29362 1344 169784 89226 -44402 -155890 -47804 27835 -333089
18497 -113351 -39366 -98684 -231788 6083 25604 -370570 -89780 -358233 -189512 71365 201755
18486 201755 -323646 -216250 -205612 -24155 35926 -66538 -161023 -133123 -66581 -112588 -55387
18474 17638 324138 -207973 107241 -57570 -82534 -89617 -156394 291479 -316229 -74046 147169
18462 147829 242636 76617 176664 -39981 -281953 73900 109811 -390752 -35055 231797 103239
18450 -105411 -18784 -208100 4936 -181822 -197962 428892 1593 -50040 -227807 -203390 -186448
18439a86448j4265l146a5807j77969k9173B30071D9916f3170K8857l10178g4772
18427a68719c094G3740D895Q95f1304l49740a68231k7157R4235B21713M0419g3885
18414d5491j31198j03198f546j82425A37708c18583D3759a51047q9240a166I3053
18402A58723b82415B91998A4814J36487c5801B56143d32886d6168j15167K8823
18392a32512M4206K3520F0017a00083G2700b27221A81326b0275M655j20902j47863
18381b84385g7802j4042k2586B68784b12407h831j71177c5625E9762A9261N717
18370B4978J39739c6827D93081b41698J8672G6435b54385K9733F9647A5345h1943
18358c1887A04696J32652e5379A94b59453d3223j12606K1773a5060k86112B67713
$$ plain form
18439 -186448 -200713 -203859 -15807 -193776 -222949 230071 49916 -63170 -34313 -344491 -74772
18427 -168719 -3094 73740 4895 5790 -61304 -411044 -168231 -195388 -101153 221713 262132 -73885
18414 -45491 -176689 -279887 -6546 -188971 137708 -318583 43759 -151047 -240287 -1166 93053
18402 158723 -282415 291998 14814 151301 -35801 256143 -432886 -46168 -161335 -132512
18392 -132512 -88306 -64786 60017 -100083 72700 -227221 181326 -20275 -15620 -136522 -284385
18381 -284385 -77802 -91844 -114430 268784 -212407 -8831 -180008 -35625 59762 19261 24978
18370 24978 164717 -36827 493081 -241698 -223026 76435 -254385 -224652 69647 15345 -81943
18358 -31887 104696 237348 -55379 194 -259453 -43223 -155829 -134056 -15060 -301172 267713
18346B54307A711a11697j8748E3312a62377C25a59671o129B28926a44902m0344
18335a85246M3638D1210L4103J0912e5853q5578q8139p1496R8540B5369a34746
18323a45342A42801e0543E8086a54396O6900j5983o29k28742A09884b55905l4633
18312b90538a32913A6768b54250A10989g7616b5824o8219H6911h6574a8992B26095
18300b03207B17688B4731b36670A1344a04457j18296A30059P4399B9765g3429
18289A52464B2079a81714B00593a60847j41458A07010m5920e9167j14689j51347
18279c25203i2664j36777A60515c8158a6602I0481R814a90659M5343r4055E9830
18267b96576a8890l71699B9926c11212B34481o1125a79726D2555c89783J43439
$$ plain form
18346 254307 1711 -111697 -130445 53312 -162377 325 -159671 -165800 228926 -144902 -185246
18335 -185246 -141608 41210 75313 86225 -55853 -141431 -229570 -301066 -202526 25369 -134746
18323 -145342 142801 -50543 58086 -154396 -87496 -103479 -104108 -332850 109884 -255905 -290538
18312 -290538 -132913 16768 -254250 110989 -77616 -25824 -94043 86911 -86574 -18992 226095
18300 -203207 217688 24731 -236670 11344 -104457 -222753 130059 204458 29765 -73429
18289 152464 22079 -181714 200593 -160847 -302305 107010 61090 -59167 -173856 -325203
18279 -325203 -92664 -229441 160515 -38158 -16602 90481 100295 -190659 -145316 -239371 59830
18267 -296576 -18890 -390589 29926 -311212 234481 173356 -179726 42555 -389783 -246344
18257b46344A48984b25657j5005A38266J53339A32933O721J60279I1783a22862
18246a43022k3101P1108c7964a3896A0760J21174a49005F3066j9314i584D1333
18234b05363F8750b75472a15740A75040b49964c4122F5310f4510a1765F9593a57345
18222D11147A02797m9082A5342b54132j99594a61922A87028c0774N435j0522J6548
18211a9313r4422m513c5406E7079a33820O6276K5762g180a297j46792A29889c8591
18198a74351B3130b27020F5758a6060B15725F8165b61269J28065E0907b18858
18187a29498D6920i9649m49999b50062j24614E374b34989C5546b28241B24347
18176h4547a1590D0642N4112a18023m5052D8481c76319c4642l032B22826f0943
$$ plain form
18257 -246344 148984 -225657 -240662 138266 291605 132933 139654 299933 91783 -122862
18246 -143022 -166123 -95015 -37964 -13896 10760 131934 -149005 63066 43752 -9584 41333
18234 -205363 68750 -275472 -115740 175040 -249964 -34122 65310 -64510 -11765 69593 -157345
18222 411147 102797 53715 15342 -254132 -453726 -161922 187028 -30774 -25339 -35861 -19313
18211 -19313 -113735 -118248 -35406 57079 -133820 -67544 -41782 -7180 -1297 -148089 129889 -38591
18198 -174351 23130 -227020 65758 -16060 215725 68165 -261269 -133204 50907 -218858
18187 -129498 46920 -99649 -549648 -250062 -374676 5374 -234989 35546 -228241 224347
18176 -84547 -11590 40642 94754 -118023 -163075 48481 -376319 -34642 -37674 222826 -60943
18164a22414B4700a09407j39697K7232J3691a01760B31779d96056a4250G3334
18153a40922f3865j75316I1712b23509H3851a58331r2612k3257B650c9328C54760
18141c25963a51201o774G5450M0036A8957G068a4515k9538I4924R7353b10735
18129a22294l8223k50847a28880j6601j83319a9343n7136J627K7857G1071a04397
18117e6468n9205B11002a91336Q6603G045c0843j23909O7474a0744l51544G8807
18105b26935a12783b0489D4354c64024B35038B0251b69260f7903o3585f1485p8878
18094a40363N1595A91614b71744I8747K39150A43083b50859B3291M4451J17999
18084A85741a25925A88407P516J07622H3862e6537j9122j7772B13000b59977n3071
$$ plain form
18164 -122414 24700 -109407 -249104 -221872 -208181 -101760 231779 -496056 -14250 73334
18153 -140922 -63865 -239181 91712 -223509 83851 -158331 -250943 -274200 2650 -39328 354760
18141 -325963 -151201 -157975 75450 115486 18957 7068 -14515 -44053 94924 192277 -210735
18129 -122294 -160517 -411364 -128880 -145481 -328800 -19343 -76479 -74852 -46995 71071 -104397
18117 -56468 -115673 211002 -191336 -104733 7045 -30843 -154752 -87278 -10744 -362288 78807
18105 -226935 -112783 -20489 44354 -364024 235038 20251 -269260 -67903 -131488 -61485 -140363
18094 -140363 -88768 191614 -271744 98747 337897 143083 -250859 23291 67742 185741
18084 185741 -125925 188407 195923 303545 83862 -56537 -75659 -93431 213000 -259977 -313048
18073c13048e7838K2356j1659p5997m1800f6418j64845J6974J9920B2096a66009
18061B94215b07031k18820C6261b3611A93359E638c88656J15920a01769B13968
18050e3621A64771b77457C22061p289F2137L0766N0473b0725A2108m515L03144
18039C10737A08593k0633M5333a02811j06597F2728a20164A66514r11c02951I2489
18027a47829B89788A36680c05526j57268A19455a13183B2559h8940A0986c687
18016B6480b11557A03509a42824j20460Q0212F1802b76099l3642C0133a0935f25
18004A48233E059L4668h7822j70079P9382A03705a06939b7663D11561o896a92034
17992i1884k68868a32473m1471m7918a01074c6252q0369K1131B3315G450a89271
$$ plain form
18073 -313048 -57838 -35482 -47141 -123138 -164938 -66418 -231263 -214289 -194369 22096 -166009
18061 294215 -207031 -425851 36261 -23611 193359 5638 -388656 -272736 -101769 213968
18050 -53621 164771 -277457 322061 314772 62137 92903 143376 -20725 12108 7593 310737
18039 310737 108593 87960 133293 -102811 -209408 62728 -120164 166514 165603 -302951 92489
18027 -147829 289788 136680 -305526 -462794 119455 -113183 22559 -88940 10986 -3687
18016 26480 -211557 103509 -142824 -263284 -183072 61802 -276099 -309741 30133 -10935 -625
18004 148233 5059 39727 -87822 -257901 -178519 103705 -106939 -27663 411561 404665 -192034
17992 -91884 -360752 -132473 -173944 -221862 -101074 -36252 -116621 -95490 23315 7450 -189271
17980C58165a34527a3136j61872A76456N0378c696B48788q9015N0146d589j85410
17969a89999A91337i3505J1015j0283k01036A47100a51513A37277a24896m1405
17959a66301A35445e3234p1232A28181J82690a7513H7751b3876A03277c27612
17948a71358A04024i3340i542H2692a9550j24475e4887j05783e7841a7963j043
17937a9006E8903B4715a00229j18701m1189J08002A54344L997m8231d8515A76640
17925b11793G4529a23182a1448A18490m7131J29048d5132k92341a45598D8804
17914c9868J4640j20483d0820m5186j9292k93316a29373B97050a9697A42023a8826
17902B27828G114b60642C56700A30368a12867A04983k4474a70649O2980j2665
$$ plain form
17980 358165 -134527 -13136 -175008 176456 226834 -3696 248788 159773 209919 -4589 -189999
17969 -189999 191337 -93505 -82490 -92773 -293809 147100 -151513 137277 -124896 -166301
17959 -166301 135445 -53234 -124466 128181 310871 -17513 87751 -23876 103277 -327612
17948 -171358 104024 -93340 -9542 82692 -19550 -144025 -54887 -160670 -57841 -17963 -19006
17937 -19006 58903 24715 -100229 -218930 -260119 -152117 154344 158341 110110 -48515 176640
17925 -211793 74529 -123182 -11448 118490 71359 200407 -45132 -337473 -145598 48804
17914 -39868 -25228 -145711 -40820 -86006 -105298 -398614 -129373 297050 -19697 142023 -18826
17902 227828 7114 -260642 356700 130368 -112867 104983 80509 -170649 -107669 -120334
17892a20334o3450A52351f148j48139M8987A21963c5562C40460b28462j25370
17882c53832I5257Q0557b7168k20767m3877A55907A5429c59049a23753B73542
17871a47788A10353l3525b09548a03195k67834C35871F8351O755Q4355H145b63474
17859C55994a37778E3664A5162a61823D6236c09200a01036i877B01577c0162H3117
17847A06701d7824C9906J30407i3975o9152C9426j7144c4645a0415A48506a2425
17835A25350L66035a11747c3896k16331O7584a7587A86007c63170J47106a02215
17824a12479A53070a97841N9272A62223p9412K22280H6178k8245c5830C29935
17813A72420b44742Q4809B44107c571j2759r2771B70180d77034e4779A81827c19814
$$ plain form
17892 -120334 -183784 152351 -6148 -154287 -105300 121963 -35562 340460 -228462 -353832
17882 -353832 95257 175814 -27168 -247935 -291812 155907 15429 -359049 -123753 273542
17871 -147788 110353 76828 -209548 -103195 -371029 335871 68351 75106 159461 8145 -263474
17859 355994 -137778 53664 15162 -161823 46236 -309200 -101036 -9877 201577 -30162 83117
17847 106701 -47824 39906 170313 -93975 -163127 39426 22282 -34645 -10415 148506 -12425
17835 125350 491385 -111747 -33896 -250227 -182643 -17587 186007 -363170 -216064 -102215
17824 -112479 153070 -197841 -138569 162223 82811 305091 86178 57933 -35830 329935
17813 172420 -244742 -159933 244107 -3571 -16330 -109101 270180 -477034 -54779 181827 -319814
17801F9389k1107h143o6686j56489L0828h5048b9554j93313O2559M7412l53083
17790d65979J89022a10075B7012h3262j80246K2962B4997b28401A90026g7843
17779c28256J4831a6908j21756I5299g6731B10261b35537K3181i3199q6086A80816
17767B70961i1838A47913d7192k4798A19083I234O7338a56055d3554e69k23926
17756b24495a876A22322a92807b7036A73071b584n9264l5553J2932A14498O7904
17745A82402a01560c0590D5694a5295C15547n9373k5502F7765b8850E0095a27012
17733I5266a74933e2652F5743a46992e1125B83687b40024a00948J2650j26507
17723b14805a06712j28549G0153d2263j48788f1832l19701J60631A30490p848
$$ plain form
17801 69389 48282 -8143 -74829 -231318 -200490 -85048 -29554 -222867 -160308 -112896 -465979
17790 -465979 -276957 -110075 27012 -83262 -263508 -240546 24997 -228401 190026 -77843
17779 -328256 -313425 -16908 -138664 95299 -76731 210261 -235537 -212356 -93199 -179285 180816
17767 270961 -91838 147913 -47192 -71990 119083 9234 76572 -156055 -43554 -569 -224495
17756 -224495 -1876 122322 -192807 -27036 173071 -2584 -61848 -97401 -84469 114498 182402
17745 182402 -101560 -30590 45694 -15295 315547 256174 230672 67765 -28850 50095 -127012
17733 95266 -174933 -52652 65743 -146992 -51125 283687 -240024 -100948 -88298 -214805
17723 -214805 -106712 -235261 70153 -42263 -191051 -61832 -381533 -220902 130490 122642
17713A22642i1764l0409d1419F512J8939a50647A8010L47918d23270A90830b06530
17701A22550i96A85363H73L7048d038E4489M881K8993R4382N8096b61562L0953
17689b30609L7845j12895F1149a84212E6242a16100o5616M4467b5623l38587B3932
17677B13330A8356J35089j3303b8326H7586a96115o2777B2481K58467p3838l5111
17666A71999g7722B13064b59086N57A04023G952h2344A10430a38970o466C5767
17654f6580A15594a04591c3101B90912a60764B02114p0893l0936d0343j04545
17644a44888f4952A42896b46608c5381l59423a9903k50044P1575A17377E6313
17633a71603A2258b69294B66446c57823a39032A42908p388f8623A59538a12892
$$ plain form
17713 122642 -91764 -122173 -41419 6512 25451 -150647 18010 365928 -423270 190830 -206530
17701 122550 -996 185363 873 37921 -4038 54489 59370 88363 182745 240841 -261562 -230609
17689 -230609 -192764 -305659 61149 -184212 56242 -116100 -181716 -137249 -25623 -364210 23932
17677 213330 18356 153445 140142 -28326 87586 -196115 -258892 22481 280948 207110 171999
17666 171999 -77722 213064 -259086 -258529 104023 7952 -82344 110430 -138970 -145436 35767
17654 -66580 115594 -104591 -33101 290912 -160764 202114 131221 100285 -40343 -144888
17644 -144888 -64952 142896 -246608 -35381 -394804 -19903 -269947 -198372 117377 56313
17633 -171603 12258 -269294 266446 -357823 -139032 142908 135520 -68623 159538 -112892
17622b06322A28041d3520p2577E9907a16808J3923A50158o5179a98199L3519O8346
17611i6334A49959c34314G7309i6620B8722i2096a4741k18899B01696a39271A02385
17599C9994J22623a27144F4374M41334j87619A53803f9152k77291a326D627a43041
17587A10129M6759e7598A0340b60210B27933K1040a40631n7512g4893C77878q0387
17576B97491i2041C42844j55576b60388G8283b08269J2322a8313C7394K50300
17566B87694d8756A36470O3689g2786A60926K4781d2877j101l0039j7423B89595
17554A33527a83619A12100M539b2649r509r6664N9744b6864o0209E5323K9976
17543H5299G023c76693C6696c78724C94048A75871P2778P2539E3437J43591k0988
$$ plain form
17622 -206322 128041 -43520 -116097 59907 -116808 -102885 150158 84979 -198199 -164680 -96334
17611 -96334 149959 -334314 77309 -96620 28722 -92096 -14741 -233640 201696 -139271 102385
17599 39994 162617 -127144 64374 505708 318089 153803 -69152 -346443 -1326 4627 -143041
17587 110129 156888 -57598 10340 -260210 227933 248973 -140631 -198143 -74893 377878 297491
17576 297491 -92041 342844 187268 -260388 78283 -208269 -195947 -18313 37394 287694
17566 287694 -48756 136470 200159 -72786 160926 185707 -42877 -43978 -74017 -91440 289595
17554 133527 -183619 112100 116639 -22649 -32158 -128822 -69078 -26864 -87073 55323 85299
17543 85299 7023 -376693 36696 -378724 394048 175871 248649 321188 53437 197028 176040
17532A76040n0755P8661q1741a40047j32431A8168J05320a8107A41864a99591
17521a15240B85886a17385E69038a5888G934L08027A20710a24413m03359E3073
17510B56638b3380I8132P0656K72390C7514K879a68901B07175J27825A60809c86070
17498a43087D32990B07513L8786m8182e8325j74917D8222M3773b94947B22899
17487C15651F2279L4202K57664b21516d4227A95478P7908E8699J17874G9760O5118
17476A44878b71054A45124g9182A93429L7046d6406j4981k5829B27190J8731l2038
17465B13883A01312L85252j43558k6718I0283O4163Q4755r1576a59969A15515
17454C9027L014J07218a06878j41899A24599L94657B27883J35338p6820R9437
$$ plain form
17532 176040 125285 203946 122205 -140047 -272478 18168 123488 -18107 141864 -199591
17521 -115240 285886 -117385 569038 -15888 7934 315961 120710 -124413 -527772 53073
17510 256638 -23380 98132 168788 441178 37514 40393 -168901 207175 335000 160809 -386070
17498 -143087 432990 207513 246299 198117 -58325 -233242 48222 91995 -294947 222899
17487 315651 62279 96481 354145 -221516 -44227 195478 273386 58699 176573 79760 144878
17476 144878 -271054 145124 -79182 193429 230475 -46406 -61387 -87216 227190 245921 213883
17465 213883 101312 486564 343006 316288 90283 154446 239201 147625 -159969 115515
17454 39027 42041 149259 -106878 -248777 124599 519256 227883 363221 286401 385838
17444C85838H6063K10442j20696l7852a04228B64631N4867A725a78252A95134
17433a15838B86838C0885J4450J2576K29000A6741L64285n1047j12033G2638P2907
17422A45545J28543O1424e5021o2001E6667c899C28126Q7401n2312H590J71769
17411A80359C8068J68961J21459i5821b6841A86862C0403J21023J96767a84672
17400e045B16636O4573A30364L6327q757K32234c8774l1027A7486R2150J88483
17389B98119d8095B91993A19662D9177K31274D9814K00762q4034G1716J4964C8357
17377a40676A89593a9456B39742a22982C5498J32772n1705c5335A24600h6780
17366c8617m7465D7151a80147Q0434B47919B9027P5415J36230Q3861o8246m3755
$$ plain form
17444 385838 86063 296505 175809 137957 -104228 264631 319498 1725 -178252 195134
17433 -115838 286838 30885 45335 57911 286911 16741 381026 329979 217946 72638 145545
17422 145545 274088 335512 -55021 -117022 56667 -3899 328126 415527 363215 8590 180359
17411 180359 38068 207029 328488 -95821 -26841 186862 30403 151426 348193 -184672
17400 -5045 216636 281209 130364 166691 157934 390168 -38774 -69801 17486 109636 298119
17389 298119 -48095 291993 119662 49177 280451 49814 250576 166542 71716 86680 38357
17377 -140676 189593 -19456 239742 -122982 35498 168270 116565 -35335 124600 -86780
17366 -38617 -86082 47151 -180147 -99713 247919 29027 104442 240672 324533 256287 212532
17355B12532J7136E6882R6484J71450j38625l325J87275A52073B2321J05765J2709
17344A40795Q699P3135K65863A08146k5297l0555K62756H4794l2091J7190K1067
17333I0960Q3612p8896K2971J92761A42587D748K39156a06176e3015G5083a60630
17321H1872J28728g2049A17218J9094L3699L9785h1708A63413h5429A67180K740
17310A69920C654J10995O0881l9671Q3905m4156g6733B97135k6430b11157C13305
17298a74659q1684C14762r6175F2453g7943B75583F0232A0280L05564m0033H9593
17286B23682b22918C06123r9345e0781B42143f0251A73751C2144b29034p6116
17276c05150H4184g2073B53637Q2827R3147j12764F9712J71160O6845A05267d2310
$$ plain form
17355 212532 229668 56882 153366 324816 186191 182866 370141 152073 22321 128086 140795
17344 140795 149494 222629 488492 108146 82849 52294 315050 84794 52703 69893 90960
17333 90960 174572 95676 118647 311408 142587 4748 243904 -106176 -53015 75083 -160630
17321 81872 210600 -72049 117218 136312 170011 209796 -81708 163413 -85429 167180 169920
17310 169920 3654 114649 175530 135859 219764 175608 -76733 297135 270705 -211157 313305
17298 -174659 -256343 314762 218587 62453 -77943 275583 60232 10280 315844 275811 89593
17286 223682 -222918 306123 206778 -50781 242143 -60251 173751 32144 -229034 -305150
17276 -305150 84184 -72073 253637 336464 429611 316847 69712 240872 307717 105267 -42310
17264A34736Q4781M30546A59700O4694K57715B33493a0144r849k94561I6293d537
17252B57252g467A58789i0421J160A40291K92096k12647m271h5371B59951E064
17240c2181C69195a25551A75766J22000j18456N8434H2536P8970L6813n5389j4703
17229A28227O2373H6045J0770M17069a1028A95877r538J3533R7381A05242M8619
17218A53861l7745f8585A54237N4561M7319R5623a03007E65846H9452b73181A13290
17206C96846n6748j10430J30291H7051M73014a2505E15574k41846J53837j94814
17196B32751N0443l6326N180l5832I4508J33075a04204B28440B207J13207P6747
17185A92161J17852D8966K04819o7905M69321D2238J05499E8872J32229M27179
$$ plain form
17264 134736 219517 650063 159700 224394 482109 233493 -10144 -19993 -314554 96293 -4537
17252 257252 -7467 158789 -90421 -89261 140291 432387 219740 215469 -85371 259951 5064
17240 -32181 369195 -125551 175766 297766 179310 237744 82536 161506 198319 142930 128227
17229 128227 190600 86045 96815 513884 -11028 195877 186339 199872 297253 105242 153861
17218 153861 116116 -68585 154237 208798 256117 351740 -103007 565846 89452 -273181 113290
17206 396846 340098 229668 359959 87051 560065 -12505 515574 273728 427565 232751
17196 232751 283194 246868 252048 216216 94508 227583 -104204 228440 2207 115414 192161
17185 192161 310013 48966 253785 185880 655201 42238 147737 58872 191101 618280
17175F18280A32911l4632K73966r8273O1921H3094L60607B05758A5180K26152
17165B41332K31490A52293d7191J1045B90254j9708O6284I5689J30553o4175L5879
17154A97946J60713j55042p9996J62453K1965Q063J93310J12891j75979B04883
17143A96653E5025K40057a25267F83419B93109A42243K47771K87527B30606O9089
17133B99695a4669B25047a3862B83775J22135A89472M12615j94649I9133K65193
17123C64326K27646j34457J447A81605K07305j71175K43677J9729B13554r2772
17113A20782K02904A31634P4914n7325L81191l9642A97749K95436k10305D3747
17102B24644i6832D83817r0865l7317L37227k35142k06440L52385A83866J84074
$$ plain form
17175 618280 132911 98279 372245 273972 335893 83094 443701 205758 15180 241332
17165 241332 472822 152293 -47191 -36146 290254 270546 336830 95689 226242 162067 197946
17154 197946 358659 203617 123621 286074 308039 316102 509412 622303 446324 204883
17143 196653 55025 295082 -125267 683419 293109 142243 390014 677541 230606 299695
17133 299695 -14669 225047 -13862 283775 405910 189472 602087 407438 99133 364326
17123 364326 591972 457515 458962 181605 388910 217735 461412 481141 213554 120782
17113 120782 323686 131634 206548 149223 530414 490772 197749 493185 282880 43747
17102 224644 -96832 483817 392952 355635 692862 457720 251280 603665 183866 367940
17092C67940A22972J70782J45230l0385j30000K98478B78618m3977n7945D457
17081A95647P7772J11499J02252J83618C23010A57841J52040P2903J49571A79493
17070B50540M5867j1003L29661p5882J5435j90536J95167A23868L96564L24724
17060H45156j04424k85066j06094j4012Q9645J8039N2751L54088l66047K1689
17050E05725j41012k4565j15998P4301J08028J83423k63195M07762C13895L97741
17040G11636k02923P1082j52412L66038l03962n9371R6002j36450J39556M2150
17030E71346L6433J54517J16418p9282j06991r5374j11261K64435k93030j4822
17020D42389L98580l66113K68548N4497l06893m3288K44426j0374q953K68259
$$ plain form
17092 367940 122972 293754 438984 408599 278599 577077 278618 234641 176696 4457
17081 195647 273419 384918 487170 670788 323010 157841 309881 382784 532355 179493
17070 250540 296407 285404 615065 539183 554618 364082 559249 123868 520432 845156
17060 845156 740732 455666 349572 335560 425205 443244 495995 850083 484036 505725
17050 505725 364713 340148 224150 298451 406479 589902 326707 734469 313895 711636
17040 711636 508713 579795 427383 793421 489459 430088 526090 389640 529196 571346
17030 571346 607779 762296 878714 799432 692441 597067 485806 750241 457211 442389
17020 442389 840969 474856 743404 797901 491008 447720 692146 681772 672819 941078
17010I41078m03493O9071R9851J36790j58996L07129m11244J41044K14709j39775
17000G96164k9673J15395N586k89847L19330l67128l5595K19455l03969J61224
16990E90942R9303j4332k64995M41878l36955L76927j52930j6850K56727k0023
16980I59692l9159L9453j97037L42727l97265j39284Q227R6142K11922O9201k96493
16969F58126M02821k06279j62332L92516l63476L92437l75115J02905J33557K82230
16959A257390k21018l62229K22689M3455K35487j07600O2255n3644j00857J43430
16949A119358j29322J96220j28246J24630N6547N404n69289M86303r1099J33585
16939A204091k21070Q338o2365K09894J87659Q5970k51065j89603K08871q8925
$$ plain form
17010 941078 537585 606656 706507 843297 684301 991430 580186 721230 935939 796164
17000 796164 766491 881886 887472 597625 916955 549827 514232 733687 429718 590942
16990 590942 690245 675913 410918 852796 515841 892768 739838 722988 979715 959692
16980 959692 920533 959986 762949 1105676 708411 569127 577354 673496 885418 954619 658126
16969 658126 1060947 854668 692336 1084852 721376 1113813 738698 841603 975160 1257390
16959 1257390 1036372 674143 896832 940287 1175774 1068174 1130429 1076785 975928 1119358
16949 1119358 990036 1186256 1058010 1182640 1239187 1244591 675302 1161605 1070506 1204091
16939 1204091 983021 991359 928994 1138888 1326547 1412517 1161452 971849 1180720 1091795
16929A091795O6423L81473L3700k95608Q4247j14767j0730Q6806k68149O03824
16919A659014o55001N51601m2919n2627l60318k7995O22428l70224J46896J65900
16909A636755j02967n6474q7080K0388J5947l5702Q1455K21635j77970L80949
16899A896936l7519j30888M45307m76292j85464K12253K08568l1618j97192L34216
16889B038307o6203k98589M59895k7663m8382j26171L83916k10517j66700M63481
16879B401374o6165J13731Q0303R6983m0235m12539K66339L8939m3606J79012
16869B614136k12401p841L28252j32980j11991L57522l7074M8570m2789K50024
16859C053428m82497O12860l57538J48382K23299J54804j95428J41277j77263
$$ plain form
16929 1091795 1158218 1539691 1573391 1277783 1362030 1247263 1236533 1323339 1055190 1659014
16919 1659014 1004013 1555614 1512695 1460068 1099750 1071755 1694183 1323959 1470855 1636755
16909 1636755 1533788 1477314 1390234 1410622 1426569 1390867 1472322 1693957 1515987 1896936
16899 1896936 1859417 1728529 2173836 1697544 1512080 1724333 1932901 1901283 1704091 2038307
16889 2038307 1972104 1673515 2133410 2105747 2057365 1931194 2315110 2104593 1937893 2401374
16879 2401374 2335209 2448940 2529243 2626226 2585991 2173452 2439791 2478730 2435124 2614136
16869 2614136 2401735 2393894 2722146 2589166 2477175 2834697 2797623 2846193 2803404 3053428
16859 3053428 2570931 3183791 2826253 2974635 3197934 3352738 3157310 3298587 3121324
16850C121324J85653k3335j76764J24525K50158L48957m45594M62237O4451N8805
16840C970417j55088k363J71388J5872L10786r4216L15849k24879K11504J70172
16830D689442m0300k27740J49028M72706k09644K85131R9893k9732K05226J70275
16820E564285n117k03899M96876l0527M14879k21356L92006j0194l1346J86038
16810F551645J77436L84269L3479J54968J2089J77410N01764k21014M31788O1496
16800H265330K40794j90501P85578l2760K16650J18171M07868L58315p8318L68998
16790A0460125N70524L54678J60416J02529O00222L88581J81133M59211M15079
16781A3692498J23742N23920N38160M32467N09744O06586O76327M51849L13462
$$ plain form
16850 3121324 3306977 3283642 3106878 3231403 3481561 3830518 3384924 3847161 3911612 3970417
16840 3970417 3815329 3812966 3984354 4000226 4311012 4216796 4532645 4307766 4519270 4689442
16830 4689442 4649142 4421402 4570430 5043136 4833492 5118623 5218516 5188784 5394010 5564285
16820 5564285 5559168 5355269 5852145 5821618 6236497 6015141 6407147 6396953 6365607 6551645
16810 6551645 6729081 7113350 7146829 7301797 7313886 7491296 7993060 7772046 8203834 8265330
16800 8265330 8506124 8315623 9101201 9068441 9285091 9403262 9811130 10169445 10091127 10460125
16790 10460125 11030649 11385327 11545743 11648272 12248494 12637075 12818208 13277419 13692498
16781 13692498 13816240 14340160 14878320 15310787 15820531 16427117 17103444 17555293 17868755
16772A7868755Q10240O17433R98555M36231Q90720P12874J090280R78785N54788
16763B4958661J179533Q98412J275623J276569J035875J341976J173369J442054
16755C4582072J840996J612721J772912J814601J927255K002491K332106K484560
16747E0369714K183065L125464K493941L401032L318887L352653L836317L878656
16739G5959729L837069M803837M652620M784706N072484N730230N507825N382680
16731A15731180O426958O218628O331662O269541O097713O017712N545494N059755
16723A63698643M847054L542919L083119K076105J124606l3893r00850k243406
16715A75194297k882026m477094m644092n127735n518767o215474o355106o809490
$$ plain form
16772 17868755 18678995 19296428 20294983 20731214 21621934 22334808 23425088 24403873 24958661
16763 24958661 26138194 27036606 28312229 29588798 30624673 31966649 33140018 34582072
16755 34582072 36423068 38035789 39808701 41623302 43550557 45553048 47885154 50369714
16747 50369714 52552779 55678243 58172184 61573216 64892103 68244756 72081073 75959729
16739 75959729 79796798 84600635 89253255 94037961 99110445 104840675 110348500 115731180
16731 115731180 122158138 128376766 134708428 140977969 147075682 153093394 158638888 163698643
16723 163698643 168545697 172088616 175171735 177247840 178372446 178338553 177437703 175194297
16715 175194297 172312271 167835177 163191085 158063350 152544583 146329109 139974003 133164513
16707A33164513o410704o177029o261393o141779n675159n783243n112752m970254
16699H6632200m850088m534363m079902l809168m124527k949292l650675k800083
16691E5834102k718243k684395k628865k414600j811201k358853j689024j829388
16683C7699533j784903j293185j667549j543322j279119j176661j081612j183333
16675B6689849q81857r73794r90590q21357q04235j074546o68215n97219r85258
16666A8892778k82575j011452n39980l50474o81302j64427r66312j55804n61411
16657A4179041j13113q93128m46512q9535l45135l35172q3186p42039j05069l7715
16647A0988437j77988r13342J52990k81849l20613m62056k80275j39945J05608
$$ plain form
16707 133164513 126753809 120576780 114315387 108173608 102498449 96715206 91602454 86632200
16699 86632200 81782112 77247749 73167847 69358679 65234152 62284860 58634185 55834102
16691 55834102 53115859 50431464 47802599 45387999 43576798 41217945 39528921 37699533
16683 37699533 35914630 34621445 32953896 31410574 30131455 28954794 27873182 26689849
16675 26689849 25807992 24834198 23843608 23022251 22218016 21143470 20475255 19878036 18892778
16666 18892778 18610203 17598751 17058771 16708297 16026995 15862568 14896256 14740452 14179041
16657 14179041 14065928 13172800 12726288 12636753 12291618 11956446 11873260 11131221 11026152 10988437
16647 10988437 10810449 9897107 10050097 9768248 9447635 8985579 8705304 8565359 8670967
16638H670967l58151l43810J1433m48315p6547j90694k82848J98865p2092m41366
16628F667442n0536l12641o8450k08823l07115o2493J99998k88731l14757J67428
16618E421322m7294m690l63642J36056l2709k52311J85589j03090m30261k87061
16608D221909Q1687O9465j05439j00253k5974J31715O872l79506K14873l38947
16598C776402p0187m75438M44745j53324N5336o4800o1930j82023M7479q5643
16588C230617J53786M976n52571K18100k27853o2771j89469K89568L5097k40069
16578B659411J64559N2458n5685j26180N393k72738j42829L92064k83643j88807
16568B204003L97564l06429k15182K31351j30768L26658j50628P8190j18363k13017
$$ plain form
16638 8670967 8312816 7969006 7980439 7532124 7455577 7264883 6982035 7180900 7108808 6667442
16628 6667442 6616906 6304265 6235815 6026992 5719877 5657384 5857382 5568651 5253894 5421322
16618 5421322 5374028 5369338 5005696 5141752 5109043 4856732 5042321 4939231 4508970 4221909
16608 4221909 4303596 4373061 4267622 4167369 4141395 4273110 4279982 3900476 4115349 3776402
16598 3776402 3706215 3230777 3675522 3522198 3577534 3512734 3450804 3268781 3316260 3230617
16588 3230617 3384403 3389379 2836808 3054908 2827055 2764284 2574815 2864383 2899480 2659411
16578 2659411 2823970 2876428 2820743 2694563 2699956 2427218 2284389 2676453 2392810 2204003
16568 2204003 2601567 2295138 2079956 2311307 2180539 2507197 2356569 2434759 2316396 2103379
16558B103379l3190J06016j36716j3950j34392R2316J13242k11168M8749m5329
16548A888957J73780l47983O8344R2100j16067k05041R1078J6258J15073j34110
16538A642389p678j64914K0076k20m7449p0849J29461L4295k61854N02311k97364
16527A478204j44727k33998L32621L8806J40149m1920K869l06294M19153n45538
16517A139325L15007l00258j9507R3672m9281l5531L23988l79873K12217j07408
16507A192351p2817J89575j06172q3618J34101l74035L03128P076P3222k34112
16497A028699L26762O2927k00553m18826N8554K90327k79999P0059R6185K30457
16487A264592l70213j78787N82454m74123K90812l01281Q6679P8160k59335L32715
$$ plain form
16558 2103379 2070189 2176205 2039489 2025539 1891147 1983463 2096705 1885537 1934286 1888957
16548 1888957 2062737 1714754 1783098 1875198 1759131 1554090 1645168 1661426 1776499 1642389
16538 1642389 1634711 1469797 1489873 1489653 1442204 1371355 1500816 1535111 1273257 1775568 1478204
16527 1478204 1333477 1099479 1432100 1470906 1611055 1569135 1572004 1265710 1684863 1139325
16517 1139325 1454332 1154074 1134567 1228239 1178958 1143427 1467415 1087542 1299759 1192351
16507 1192351 1119534 1309109 1202937 1119319 1253420 879385 1182513 1189589 1262811 1028699
16497 1028699 1355461 1418388 1217835 799009 857563 1147890 867891 937950 1034135 1264592
16487 1264592 894379 715592 1298046 823923 1114735 813454 900133 978293 718958 1051673
16477A051673k19208K15264j5336n8670k75988L2411K36728l8421k73434J65412
16467H20431k79903r1192K58447K37681m10827O5509K0571O2002J2976M2320J4712
16456G52727Q1843J36732l00233L44067l3001C36731L99560R578j89795K06732
16446G62806J95345l68956K55509p2558m6076C42646K44826P8650J24066j30354
16436F59834J09820j61581j09431M9715J36544l13353L00248p4228B86560M59169
16426G45729k11059j56319K86922C28060M43990j39522B86705J38833K73613P415
16416G06566j61672P3111J61690k17554J42644P912J89303I8415M02922k09403
16406B91934k7321N8693P9601n0885J8267l1602K19231n9355o7910J75588j39504
$$ plain form
16477 1051673 832465 1047729 1032393 973723 697735 730146 966874 928453 655019 820431
16467 820431 540528 449336 707783 945464 534637 600146 620717 682719 695695 738015 752727
16456 752727 834570 971302 671069 1015136 982135 336731 736291 745869 556074 762806
16446 762806 958151 589195 844704 772146 726070 342646 587472 666122 790188 659834
16436 659834 769654 608073 498642 548357 684901 371548 671796 597568 286560 745729
16426 745729 534670 378351 665273 328060 772050 632528 286705 425538 699151 706566
16416 706566 544894 618005 779695 562141 704785 712697 902000 98415 501337 291934
16406 291934 264613 323306 402907 352022 370289 338687 557918 498563 430653 606241 466737
16395D66737L5680k51118K11265F8826N22044B67843k1762R8155K09744k6333
16385E27647N1394A75812E0274L52033n6128M69630k34211k36915K46259p1137
16375E19805n09A23461J86172A12525J69132n5395L76483q8843k22522P8044P7947
16364D47371O4006A88056J5104K51167R1479k13700j1342j00913L26795k04275
16354C42371P5814j59215M40575H9779R3181Q0692M30091k81581J32668k14714
16344C30116J62560A67469L24832M4346B60628o0075L3770J9489A26814P2189
16334A99003L93979A37013J53010k0390J3245J08690E356L95554j05198K05135
16324E00847B15215K60909A88798R6953n2465J59168N5940B12660L07598L8898
$$ plain form
16395 466737 502417 251299 462564 68826 590870 267843 246081 344236 553980 527647
16385 527647 579041 175812 50274 402307 346179 815809 581598 344683 590942 519805
16375 519805 519296 123461 309633 112525 281657 226262 602745 513902 291380 369424 447371
16364 447371 511377 188056 203160 454327 545806 332106 320764 219851 546646 342371
16354 342371 418185 258970 699545 89779 182960 263652 693743 412162 544830 330116
16344 330116 492676 167469 492301 536647 260628 200553 234323 253812 126814 199003
16334 199003 592982 137013 290023 269633 282878 391568 5356 400910 295712 500847
16324 500847 215215 476124 188798 285751 233286 392454 448394 212660 520258 559156
16314E59156H732J31177L07362j4271b20284A84774O7828j05622p2177M86262
16304E61065k25224o683J71763B26478H7932N15004A45899O9860J05059g5938
16293e3491c421D53757F5856J30918J54314c6223H6253O9227o313o0863J0167
16282I8471K8398N59680B53958C2331M0623K89336b2378B98063O8060j02300k2973
16271B40850q9878L49806b4241A18889n1084J53181E7829j1841j3030J16098K06580
16260C55636I4431J57709K00993A59893L22320O0398e825B29509h3269d1112D69082
16248A46862D6288J49016H5654j3346J61015L280N8308f5049A16071K92813o6364
16237C42520j14049g1786B68251K35164b3246F80656c0974C62708L4859a32208
$$ plain form
16314 559156 8732 139909 447271 433000 -220284 184774 252602 146980 74803 561065
16304 561065 335841 329158 500921 226478 87932 602936 145899 215759 320818 -75938
16293 -53491 -3421 453757 65856 196774 351088 -36223 86253 155480 149167 88304 98471
16282 98471 126869 686549 253958 32331 72954 362290 -22378 298063 366123 263823 240850
16271 240850 150972 500778 -24241 118889 67805 220986 57829 45988 32958 149056 355636
16260 355636 94431 252140 453133 159893 482213 542611 -5825 229509 -83269 -41112 469082
16248 146862 46288 195304 85654 72308 233323 236603 294911 -65049 116071 408884 342520
16237 342520 228471 -71786 268251 503415 -23246 680656 -30974 362708 397567 -132208
16226C7419L08337l2940C9296K52979q2251k5083n7472l8243J74687k6777q5054
16215A52082J19486P9461A65741J56667M7317Q6312k11238a25404A38912a49636
16204A90552Q463c9801A06057L55771a13269m6485A20280L8968o4770L0247g2740
16192A04161k2035L4757b28396Q5460A2913a71188D58043C4783b12519B51493
16181c6422B98932d3783B48116i3856B25487b9170D5311R3796a36329A35969L1593
16170A67562c1228C33321q3135b11525A81035J4224c55167f9078C14018O9140
16160C83158A27637A0802b95642P0528B01018b7124q7797j3234D26283b11018
16149b65809A31359a88228N5703k0834C9711J93037a98982B94376q5791f9728
$$ plain form
16226 37419 345756 312816 39296 292275 210024 184941 127469 89226 263913 237136 152082
16215 152082 271568 351029 165741 322408 369725 456037 244799 -125404 138912 -149636
16204 190552 199015 -39801 106057 461828 -113269 -159754 120280 159248 94478 124725 -72740
16192 104161 82126 116883 -228396 -142936 12913 -171188 458043 34783 -212519 251493
16181 -36422 298932 -43783 248116 -93856 225487 -29170 45311 139107 -136329 135969 167562
16170 167562 -31228 333321 250186 -211525 181035 195259 -355167 -69078 314018 383158
16160 383158 127637 10802 -295642 -225114 201018 -27124 -114921 -128155 426283 -211018
16149 -265809 131359 -188228 -132525 -153359 39711 232748 -198982 294376 208585 -69728
16138d0002k42378J30870B61485b07238B28604P4966F9233a15033d7176B49120
16127a36579J9098A56117f2113A54183k4446J02654A12900a01682r2595c6222
16116c06641a01411R006D7830a60051B26402l3471n5943b9382J0115A46403a00478
16104B84906j23823M7520L60254B09472H2845A1187a24490n1198A35484b15289
16093a9588A70793l737j3795A4798O9596p712N2572a01359J9809F7538J42493
16082B10031i174A68378e6561D35903A4158M6014a79229E93302H6293Q4516o6349
16071A04460L4403m1987B3335c6832B07361a34108C0537J19481a54005C09873
16060c67338a38895d5351o2128j825B56199B4225L2825k2831b46797Q932A09793
$$ plain form
16138 -40002 -282380 -151510 261485 -207238 228604 303570 69233 -115033 -47176 249120
16127 -136579 -117481 156117 -62113 154183 129737 232391 112900 -101682 -194277 -36222
16116 -306641 -101411 -92405 47830 -160051 226402 192931 136988 -29382 -19267 146403 -100478
16104 284906 161083 208603 568857 209472 82845 11187 -124490 -175688 135484 -215289
16093 -19588 170793 167056 153261 14798 84394 76682 129254 -101359 -81550 67538 210031
16082 210031 -9174 168378 -56561 435903 14158 60172 -179229 593302 86293 170809 104460
16071 104460 138863 96876 23335 -36832 207361 -134108 30537 150018 -154005 309873
16060 -367338 -138895 -45351 -107479 -109304 256199 24225 57050 34219 -246797 -237865 109793
16048B1297h2310k26350b2818j82292e4059G1649a75557f8381q0277C9898b3789
16036a12014e3464j82811B91684o8627B334f4603r1107E6342a1427B0832d33258
16024B24a55923H0309C2612J4073d3959h677r1321K6509C0841J78832f3777A80914
16011A12336Q738e9035J574b1238p2016l786q1008A92732m6999a26609j43733
16000b70342A48779a03853p7743Q5926H6561d8188A60898a42112G5041g6005A75709
15988E1076a27346B420J36937K42671a48631A11315k9868K3399J40574L5303A7219
15976a38526n1686K3338H3916B6262a40214f4678D9870J18736b28914A0968a83218
15964A4147J10846C3816a58315A03356c1871m408B6409b9932A85676i7211P455
$$ plain form
16048 21297 -82310 -308660 -22818 -205110 -54059 71649 -175557 -68381 -148658 39898 -23789
16036 -112014 -53464 -236275 291684 223057 2334 -64603 -155710 56342 -11427 20832 -433258
16024 224 -155923 80309 32612 46685 -43959 -8677 -99998 -73489 30841 209673 -63777 180914
16011 112336 121074 -59035 -57461 -21238 -93254 -97040 -178048 192732 145733 -126609 -270342
16000 -270342 148779 -103853 -181596 -95670 86561 -48188 160898 -142112 75041 -76005 175709
15988 51076 -127346 2420 139357 382028 -148631 111315 81447 104846 245420 280723 17219
15976 -138526 -190212 -166874 83916 26262 -140214 -64678 49870 168606 -228914 10968 -183218
15964 14147 124993 33816 -158315 103356 -31871 -36279 26409 -29932 185676 -97211 -89756
15953h9756q1710E61616A58905a76063A4678a84356A25848P4171g6512L0885A74579
15941E8394L45093f4792I6052a56239r8301O7865b217j55939A88818G6056N9369
15930A35425D3507N7283C8037a5147r6140J9591B03493n0295K4463r638a54467
15918a49142A10628c89204I7242e5338A14791E4022f6892C5813j1518a18361C83635
15906A00643d34857c2093j83510I6571G062K3009a55201c772A83049q7690a38152
15894C81812g4451b2568j03842m5961C4723a43147A94249J89525A60944a49049
15883c0845j33730L0483D9660H086L04657A33820b13661H0937L9224e5179F0679
15871B05835g6786j20519f9516B12802a60823A7763J24844a75656A1198M0359
$$ plain form
15953 -89756 -171466 561616 158905 -176063 14678 -184356 125848 200019 -76512 -45627 174579
15941 58394 403487 -64792 96052 -156239 -254540 -186675 -2217 -158156 188818 76056 135425
15930 135425 43507 100790 38037 -15147 -111287 -91696 203493 153198 177661 168023 -154467
15918 -149142 110628 -389204 97242 -55338 114791 54022 -66892 35813 24295 -118361 383635
15906 100643 -434857 -32093 -215603 96571 7062 30071 -155201 -3772 183049 95359 -138152
15894 381812 -74451 -22568 -126410 -172371 34723 -143147 194249 383774 160944 -149049
15883 -30845 -164575 -134092 49660 8086 312743 133820 -213661 80937 120161 -55179 60679
15871 205835 -76786 -197305 -69516 212802 -160823 17763 142607 -175656 11198 51557
15861E1557b0803A62560p7147j2464a21639A8141h7663A0621c40192a00012J3133
15850h6879H1693e28j22174j32039N4305E5244M6302b04222K1391C46110h6558
15838A14965c2648j25113B03420c6280l0670l5357b4535m0135o1330M3625A23456
15826a75680d9387E8831c48784E3829A6807P4064h4190o534A19905f6177q1674
15815a47851l25073E4030G52g6751b9276j77480i2653l66029A19570J57987a92759
15803e6792B22879k5859b15960B35899G7934A0595b36706M7610A00567M8910c324
15791A0013L92777A81325K57528h4805A8867c37125g8961b1721A60494H211b00701
15779G3799a13049C956g5949E2639g9870B83213C1761P6763b08122D9896b02123
$$ plain form
15861 51557 -20803 162560 85413 72949 -121639 18141 -87663 10621 -340192 -100012 -86879
15850 -86879 81693 -528 -122702 -254741 -200436 55244 101546 -204222 -182831 346110 -86558
15838 114965 -32648 -157761 203420 -36280 -66950 -102307 -24535 -64670 -126000 -82375 123456
15826 -175680 -49387 58831 -348784 53829 16807 90871 -84190 -90724 119905 -66177 -147851
15815 -147851 -472924 54030 752 -76751 -29276 -206756 -92653 -458682 119570 277557 -192759
15803 -56792 222879 197020 -215960 235899 77934 10595 -236706 -189096 100567 149477 -3324
15791 10013 402790 181325 438853 -84805 18867 -337125 -78961 -21721 160494 8211 -200701
15779 73799 -113049 3956 -75949 52639 -79870 283213 31761 108524 -208122 49896 -202123
15767C1694N7393N1185b76203a18275p4944D22024h3634G6401g3324B56474N5925
15756C12399C5132R0815b42816J14191g696A06660C1118J33050a51717N5438k0472
15745a16751A2507J5860a32834A78392D1957L3778L6595e1796k57000E5325A4244
15733e4474j98503g0586A21907f0617j79460i0934j60539E3833j8475K49195b66578
15721a07467l42862I0855c21549b5418d624A34190J19162p9401E0929c05300A12096
15709a83414A81808a32083L2714I9536h5759b7196k2060A0087c88261B8659K66198
15698B94857E1209J76363A13351a96257G2225J57164c064B8042J24454K67270
15688D19766D8793h8066m5296B23796e2716B9701f6968j79898A0298J23599K0272
$$ plain form
15767 31694 89087 140272 -276203 -118275 -193219 422024 -83634 76401 -73324 256474 312399
15756 312399 35132 125947 -242816 -128625 -7696 106660 31118 164168 -151717 -96279 -116751
15745 -116751 12507 28367 -132834 178392 41957 75735 112330 -51796 -308796 55325 14244
15733 -54474 -252977 -70586 121907 -60617 -240077 -90934 -251473 53833 35358 284553 -266578
15721 -107467 -450329 90855 -321549 -25418 -4624 134190 253352 173951 50929 -305300 112096
15709 -183414 181808 -132083 -99369 99536 -85759 -27196 -49256 10087 -388261 28659 294857
15698 294857 51209 227572 113351 -196257 72225 229389 -3064 28042 152496 419766
15688 419766 48793 -88066 -133362 223796 -52716 29701 -66968 -246866 10298 133897 154169
15677A54169I477b19407e7339j52505k14157a44652B3566b53657A74053c27532
15666b15745d9882p2166C20287j47952J50123c50295f0077N097a3084k28886B22990
15654d8294j98188C396L2885D577J36911o7815a26906n2617g2309k7600o2622
15643a62531M4451a3640l73632A13231a7796I0624e4939j0363F5455a55822p7849
15632b33671g8974G3136b85712p5881a57605A02540N8955b56224j45553J34400
15622b67377J25279p4135H970a92220A3340L2915R911c12668A93458D4710O858
15611E1568a02453D3204R3899a18108l19966g4234j57529A01924i123A98441J73942
15600C72383c354k77834e1329j32988H8660g1241C7390b03504N5149e5690k12587
$$ plain form
15677 154169 9477 -219407 -57339 -209844 -424001 -144652 23566 -253657 174053 -327532
15666 -215745 -49882 -122048 320287 172335 322458 -350295 -60077 -54980 -13084 -241970 222990
15654 -48294 -246482 3396 36281 4577 141488 73673 -126906 -179523 -72309 -99909 -162531
15643 -162531 -118080 -13640 -387272 113231 -17796 90624 -54939 -65302 65455 -155822 -233671
15632 -233671 -78974 73136 -285712 -361593 -157605 102540 161495 -256224 -401777 -267377
15622 -267377 -142098 -216233 8970 -192220 13340 46255 56166 -312668 193458 44710 51568
15611 51568 -102453 43204 137103 -118108 -438074 -74234 -231763 101924 -9123 198441 372383
15600 372383 -3354 -281188 -51329 -184317 88660 -71241 37390 -203504 -148355 -55690 -268277
15589b68277A2795L2776h7226b2223j97026g6770C7627A1004c56481g8088k8032
15578a06120c0037j37387r9146A08339c5843j06263g731A95843A1251O0921K00667
15567B72839f5796D9190a40341A471P7479J88284c1595r3244k9888B83558g6697
15555A0875K22963e6122h086l60838A88849o8959c07671a14178A98498e2823A47975
15543a2998l22213a44068o0663J9856A55085p4855a002C72786A52980b02983K7842
15532a75141Q2871G8879B7092J68501a14226j34095A64829C4907b63483B24860
15521B03832q9647b11560A1790b18920f5905j40087A98346Q3121a19380A14846
15510G5800J5491P525c4332B29099q525g5131j04221A39554a61517K0026A09154
$$ plain form
15589 -268277 12795 45571 -87226 -22223 -219249 -76770 37627 11004 -356481 -78088 -106120
15578 -106120 -30037 -167424 -266570 108339 -35843 -142106 -7731 195843 11251 72172 272839
15567 272839 -65796 49190 -140341 1471 78950 267234 -31595 -124839 -154727 283558 -76697
15555 10875 233838 -56122 -8086 -368924 188849 119890 -307671 -114178 198498 -52823 147975
15543 -12998 -335211 -144068 -204731 -184875 155085 80230 -1002 372786 152980 -202983 -175141
15532 -175141 -92270 78879 27092 195593 -114226 -248321 164829 34907 -263483 224860
15521 203832 114185 -211560 11790 -218920 -65905 -205992 198346 281467 -119380 114846
15510 75800 91291 98816 -34332 229099 220574 -75131 -179352 139554 -161517 -141491 109154
15498A83596i7802m3413r891q234d1233A86268a19099B49258a51718j3476f4438
15486g8569c4609m5146j33033A4912b05703Q6282A09313a10441A81661b57166
15475G736M3830c00493A74472J19920b00250I4900a03894A41308a22091B2044
15464c8096j1661p4646p8503E74715h0946r9097p2092B74163i874G4066a10142
15452e4397A11528a34508k97j67218B17666a5801l62948I7349m7339e4566F6342
15440a23473k0770A52049D4391d7946o1513B14964b05563J0545q927A6141f3428
15428g4321A42396b15822B23866a70159B26790d17429a21466A7976i0832n1320
15418a42152b8420j09715F0000c1289F4772a0312j91835a7369r4718k6323p143
$$ plain form
15498 183596 -97802 -141215 -151106 -159340 -41233 186268 -119099 249258 -151718 -165194 -64438
15486 -78569 -34609 -79755 -212788 14912 -205703 -119421 109313 -110441 181661 -257166
15475 7736 51566 -300493 174472 294392 -200250 94900 -103894 141308 -122091 22044
15464 -38096 -49757 -124403 -202906 574715 -80946 -180043 -252135 274163 -9874 74066 -110142
15452 -54397 111528 -134508 -134805 -302023 217666 -15801 -378749 97349 50010 -54566 66342
15440 -123473 -144243 152049 44391 -47946 -109459 214964 -205563 -195018 -203945 16141 -63428
15428 -74321 142396 -215822 223866 -170159 226790 -417429 -121466 17976 -90832 -142152
15418 -142152 -28420 -138135 60000 -31289 64772 -10312 -202147 -17369 -112087 -138410 -145553
15407a45553m0143f3377K5231C2071N9450J57744D9966a58354a7316l44824a45014
15395C29799F661R8503m5252b68054F0878L01899A07157A448c8542m5710J7956
15384f6296r774j32961E820b28602O9669j88876R0805A42114c60697Q8203G4805
15372b51627B67987a60545c2213B41336c9744B12415a47462H1398Q1448c2600
15361a53134a6840k63253E1807J68846o2192K2959C6649J95986G9400L4190C0538
15349a62583B58228b26534A2293J65804a67725g6392k5455L9193B83232A4285
15338h4868B02829q8193K8709J925a3606j90652c9034r245j80128a11835j14882
15327b26717e1771D3967P5911k1484B3182K46419o9651d2160B38357J47098C0520
$$ plain form
15407 -145553 -185696 -63377 -38146 32071 91521 249265 49966 -158354 -17316 -362140 -145014
15395 329799 6661 105164 59912 -268054 60878 362777 107157 1448 -38542 -84252 -66296
15384 -66296 -76070 -209031 5820 -228602 -158933 -347809 -257004 142114 -360697 -272494 74805
15372 -251627 267987 -160545 -32213 241336 -39744 212415 -147462 81398 162846 -32600
15361 -153134 -16840 -280093 51807 220653 158461 181420 36649 232635 79400 113590 30538
15349 -162583 258228 -226534 12293 178097 -167725 -76392 -101847 -62654 283232 14285
15338 -84868 202829 114636 143345 145270 -13606 -204258 -39034 -48279 -228407 -111835 -226717
15327 -226717 -51771 43967 119878 98394 23182 269601 199950 -42160 238357 385455 30520
15315b03831B68040a44392C33849F9011a35849q7763K9246A72645a50549B02202
15304A70238f8247J0356C97252a93332Q2649a3932A71668j9099J02987f8654b8968
15292D9914L4444a9249k36175H6993d6079D916J72925B117K78839A20444b08308
15280A19584R3170a41490n9860Q5509I8791j4928J0368A4353i5482B84234a12298
15268E2112M326K79679j61024e573D08005a78162h7718B61352C0346A3846b97254
15256B50264i4836L4505B80141a92388k41819a61447A00137J68299M00303P10986
15246A379725J60390m26409R80568G80825B87884M7040A38543a96170C30457A58515
15235a58971A80388B3357J09344k7297h6134L2793I4420g3517L4589A88342K092
$$ plain form
15315 -203831 268040 -144392 333849 69011 -135849 -223612 -194366 172645 -150549 202202
15304 170238 -68247 -57891 397252 -193332 -110683 -13932 171668 152569 255556 -68654 -28968
15292 49914 84358 -19249 -255424 86993 -46079 4916 177841 2117 280956 120444 -208308
15280 119584 212754 -141490 -201350 -115841 98791 83863 94231 14353 -95482 284234 -112298
15268 52112 56438 336117 175093 -5573 408005 -178162 -87718 261352 30346 13846 -297254
15256 250264 -94836 -60331 280141 -192388 -434207 -161447 100137 268436 668739 1379725
15246 1379725 1540115 1113706 2094274 780825 287884 334924 138543 -196170 330457 158515
15235 -158971 180388 23357 132701 105404 -86134 -53341 94420 -73517 -38928 188342 190434
15224A90434F2019A8063J22784o3276C322a0035j20321m7224m6417k3401C33846
15212A36588N2367F4393P312j166L30378a50248k3629Q0995e449A27981a54757
15200b73315A24866j1964f3292K5241A0977K13852A8427b4983B9201R3738K58574
15189C81513D1091i5236L6813a4589j08036n3977B67608b37943B13743A1718a79716
15177B36145a69254B01272r1450K3745R56D5689k305a34863E4261a7642k2238
15166c9880o4391H5535J53410J05681A08184B0493c93192I348a37298b6187A48340
15154c41304F7602J86596b5171N060C6990J94857Q2638r2643b90111j89228A40214
15142C81362d5222A26407L5614H0430k3958j4374e5580B13330d2503a5848K442
$$ plain form
15224 190434 62019 18063 140847 77571 3322 -10035 -130356 -177580 -223997 -247398 333846
15212 136588 188955 64393 71705 70539 400917 -150248 -173877 -92882 -5449 127981 -154757
15200 -273315 124866 112902 -63292 -38051 10977 224829 18427 -24983 29201 122939 381513
15189 381513 41091 -95236 -58423 -14589 -122625 -176602 267608 -237943 213743 11718 -179716
15177 236145 -169254 201272 109822 133567 134523 45689 43384 -134863 54261 -17642 -39880
15166 -39880 -104271 85535 238945 344626 108184 20493 -393192 9348 -137298 -26187 148340
15154 -341304 67602 254198 -25171 -20111 36990 231847 314485 221842 -290111 -479339 140214
15142 381362 -45222 126407 162021 80430 56472 42098 -55580 213330 -42503 -15848 -13406
15131a3406I1354g0333j22183B0107K43712o7268H5936P4334l7903a31022A6858
15119A24472J22122a02997B27942a21299A90716F024b56676C4516L63838j49151
15109B49203m6276o4245O8007F6582a40570A54338B1419K5122P1462K66664j76590
15098B08077N6903i9186C232g216G0438R480O9208R8839J86663A74238J4277C8516
15085D2843M07180I2367n254j8633p007L1989f7866C49540a10465A37522c8151
15073A43117K26040F3356c8250D13806j75238l9555c1249A81924o1781K0800k3836
15062A17107J63275a21520C8087a81422A8412g1255B64634j0663A23969A1982
15051A79855a28155a8573B43257Q0063a5878l4559B95954k7491N4956n2320f4668
$$ plain form
15131 -13406 91354 -70333 -192516 20107 263819 196551 85936 160270 122367 -131022 16858
15119 124472 246594 -102997 227942 -121299 190716 6024 -256676 34516 398354 249203
15109 249203 202927 138682 206689 66582 -140570 154338 21419 46541 118003 384667 208077
15098 208077 264980 -99186 3232 -7216 70438 79918 149126 247965 434628 174238 188515 38516
15085 42843 450023 92367 87113 68480 61473 93462 -67866 349540 -110465 137522 -38151
15073 143117 369157 63356 -38250 413806 238568 199013 -31249 181924 120143 140943 117107
15062 117107 280382 -121520 38087 -181422 18412 -71255 264634 253971 123969 11982
15051 179855 -128155 -18573 243257 323320 -15878 -50437 295954 268463 323419 271099 -64668
15039B75312D1007L7237J64515a0877B65019a01021A63294N6133D73K67758q5599
15028A82632B8671N7482o853M30468k48688N5352B5059L01593k3686J66645o9708
15017C99903A25278j3895P5044P4469j21784O7957m7063R4820a3895G5841R6453
15006A72294J69217j051K1135A32362c07956A37126c6491A32333g3831D89144
14995a6033B63205I3356D2767M5866R6182n2588J47953o5369J28535C7820K03579
14984B41399a4038I9839P4808g1566D14361c4893D15665j61240J14298i3633D35826
14972D98148c6410B62617M20177C9893K91475q3508E2973J01314E6973J61364
14962B18337i0709E22485B18561J17852a10848C39193G0190K41352E6587L63278
$$ plain form
15039 275312 41007 78244 242759 -10877 265019 -101021 163294 219427 473 268231 182632
15028 182632 28671 86153 79300 509768 261080 316432 25059 326652 302966 469611 399903
15017 399903 125278 111383 186427 260896 139112 207069 160006 254826 -13895 75841 172294
15006 172294 341511 340460 361595 132362 -307956 137126 -36491 132333 -73831 489144
14995 -16033 263205 93356 42767 88633 184815 132227 280180 214811 343346 37820 241399
14984 241399 -14038 99839 174647 -71566 414361 -34893 415665 254425 368723 -93633 435826
14972 498148 -36410 262617 682794 39893 331368 247860 52973 154287 56973 218337
14962 218337 -90709 522485 218561 336413 -110848 339193 70190 311542 56587 419865
14952D19865j08683N199m0724J39414A09584M29743D5385j4871N16628j35984
14942D11158l5211j80383R1616J83901b6453B25525e0720C55474C6692K18924
14932B55616A09295K19487A23132J87639K7693A64742k1790J21034L16897A76320
14921A28631R952b7686A47042P5072L39695k12745J6124o4946d4285B31787J98217
14910D30004A34759Q5109M06009B27017J78313A83575K00910A46324K2782K31749
14900D00855l6720l4276A63989r361J82942Q1530j19546Q1319A89175E6679B0778
14888A43097J99771o4558D7006K67188M9027M26458D0657K17284A4885K46615
14878B61500M46743C46077A60261k9372J48025J4023J8555O2168H7216K52878
$$ plain form
14952 419865 311182 316381 275657 415071 109584 539327 45385 30514 547142 411158
14942 411158 375947 195564 287180 471081 -26453 225525 -50720 355474 36692 255616
14932 255616 109295 328782 123132 310771 338464 164742 142952 263986 580883 176320
14921 128631 138583 -27686 147042 222114 561809 349064 365188 300242 -44285 231787 430004
14910 430004 134759 219868 625877 227017 405330 183575 384485 146324 169106 400855
14900 400855 364135 329859 163989 154628 337570 419100 299554 380873 189175 56679 20778
14888 143097 342868 278310 47006 314194 363221 789679 40657 257941 14885 261500
14878 261500 708243 346077 160261 130889 278914 292937 311492 373660 87216 340094
14868C40094m6107j18571L7184m2717K93621J46785B05198K82426k13624K11502
14858D85502B40317j11410k5014J28053K00289J83420h5448I48307C75951C9150
14847C49169A43615J25108J09778j3417j57692J82729A94936M5360L59287A09227
14836C33406l8313l3816F3933K06084r4343J81483M27720k61880k51804n1707
14826B19486J51346A26589n689M23516k35044L0066J37502P2254k6360J66896
14816F89730j69845A26048k361M71083j78033p4926k0557J51052j56846K24039
14806E39499P2340k29821P6343j55731J10831j29983K08890N3093A57897N06066
14796F63963k01749J20728j28611J42372j98119o0430r7671M56153A56661L41791
$$ plain form
14868 340094 293987 175416 212600 169883 463504 610289 205198 487624 274000 485502
14858 485502 240317 128907 103893 231946 432235 615655 -85448 948307 375951 39150
14847 349169 143615 268723 378501 365084 207392 390121 194936 240296 599583 109227
14836 333406 295093 261277 63933 270017 175674 357157 784877 522997 271193 219486
14826 219486 370832 126589 120900 544416 309372 339438 476940 549194 522834 689730
14816 689730 519885 126048 123687 594770 416737 341811 321254 472306 315460 539499
14806 539499 611839 382018 458361 302630 413461 283478 492368 545461 157897 663963
14796 663963 462214 582942 454331 596703 398584 338154 240483 696636 156661 498452
14786D98452J10825j81150K04465j82689j22604J65372k42126M18494j25097m3414
14776E00528I8026K26628j20643J53597J10845J70178B60285K05910J66727L02384
14766I35306l58453B06837J46311L84791j86396K32531l32367J91222j57823M4608
14756E29714j04817O2057L62835j45073j03689r3732R362J23543P8183P0274P8427
14745H67084p3690l70024L66386B41387L94199J42552O6030C58574N9076p3261
14735C44389N25210o5010k16575J81056o0861l28159O88460B49066K52429r2189
14725D09306O35099m84165m8572L36981k8290J26k17342M81851k86218O1579j13525
14714G46830m0398M266M4256J77431q7828k20407R6566N3101L8208l25725L00564
$$ plain form
14786 498452 609277 428127 632592 449903 327299 492671 250545 669039 543942 500528
14776 500528 98026 324654 204011 357608 468453 638631 260285 466195 632922 935306
14766 935306 576853 206837 353148 737939 551543 784074 451707 642929 485106 529714
14756 529714 424897 486954 849789 704716 601027 507295 516657 640200 718383 788657 867084
14745 867084 793394 423370 789756 241387 635586 778138 844168 358574 417650 344389
14735 344389 869599 804589 588014 769070 708209 380050 1068510 249066 501495 409306
14725 409306 1044405 560240 511668 848649 820359 820485 603143 1084994 798776 860355 746830
14714 746830 706432 710698 754954 932385 844557 624150 720716 773817 812025 486300 786864
14703G86864J06585j8752J07450k32854K67799m94027N40479j57564k17385j88222
14693E00373K25383J21422l49099N39690j55739p6828K83082j71013l0018N9883
14683I47136L7481D19103M89018n1388n1180J92238k55663K3223q5025J92118
14673H72444k00880M28671o5431L0588P059m25885L42708l86213K82556k19401
14663F66216M05870K07163k57123k2942O4765j21495K95416j01780j9669o1268
14653A055153J5612L33261m62640o6407k66467P59592j44240o4550n2711q7534
14643A019069k64992M23524j78394M8204L11977R7944m11059J75982J91444m80514
14633I33185K36704K37619j05946K9447j41276k85128M34405J0409j84275j06979
$$ plain form
14703 786864 893449 874697 982147 749293 1017092 523065 1063544 905980 688595 500373
14693 500373 725756 847178 498079 1037769 882030 805202 1088284 917271 887253 947136
14683 947136 984617 419103 908121 856733 805553 997791 742128 765351 680326 872444
14673 872444 671564 1100235 1034804 1065392 1072451 646566 989274 603061 885617 666216
14663 666216 1072086 1279249 1022126 999184 1063949 942454 1237870 1136090 1116421 1055153
14653 1055153 1070765 1404026 941386 874979 608512 1368104 1223864 1159314 1106603 1019069
14643 1019069 754077 1177601 999207 1047411 1359388 1457332 1046273 1222255 1413699 933185
14633 933185 1169889 1407508 1301562 1331009 1189733 904605 1339010 1349419 1165144 1058165
14623A058165M67178k29895n7777j17255q5688K86740J4571L9336J95091k48739
14613A321727J30968q4881j12305J75238J25611k10766k13401L9607K39855K08245
14603A619898j22267Q4271q5395j06397J46294J4138J47369k39577L6796J75078
14593A670208q6196j03294L05397m93184L63642n3511m240P5834k99043M53718
14583A829331J9851K04544n60427M64439j93189m2446M74130m10798J15245Q6160
14573A986840k25236K60996J66293O1436o4995k51865M7238J99078K82511J30736
14563B593032r772l1495Q1091k5935L13683N6839k30552J89586M3756P07696J22329
14552C810258L50345N05713J388839K656785L968958P582551K0039813K231354
$$ plain form
14623 1058165 1525343 1295448 1237671 1120416 1034728 1321468 1336039 1375375 1570466 1321727
14613 1321727 1452695 1367814 1255509 1430747 1556358 1345592 1132191 1171798 1411653 1619898
14603 1619898 1497631 1581902 1496507 1390110 1536404 1550542 1697911 1458334 1495130 1670208
14593 1670208 1584012 1480718 1786115 1292931 1656573 1603062 1598822 1674656 1375613 1829331
14583 1829331 1849182 2053726 1493299 1957738 1764549 1722103 2196233 1785435 1900680 1986840
14573 1986840 1761604 2022600 2188893 2250329 2185334 1933469 1980707 2179785 2462296 2593032
14563 2593032 2583260 2551765 2632856 2606921 2920604 2977443 2746891 2936477 2980233 3687929 3810258
14552 3810258 4160603 4666316 6055155 8711940 12680898 20263449 40303262 42534616
14544D2534616A8267792p512695D980209j867537p83991m81568j67759L57438
14536B036792j67668k52530R0433L29298j81054R9080L50810k34025J11813J78368
14526B361317k75697J14359J1540L5525j88195p519K62351j16902O8480J32219
14516B397478n5060K2746K02600j27792K70680j34245l71817L29498j16453K03387
14506B621022j48924L11525j08652K8123L14370J84k48738M0414L36500k50167
14496B895657L56059l3899j07014J95000k56927J12920q6257M20569j79278j03710
14486C213120K92787p7043m0387R4142N0640p6840M29167K72266l92135j23432
14476C642285k8885K69643j97512J22003J02128k5744j10514K57573k4427j5679
$$ plain form
14544 42534616 18267792 10755097 4980209 3112672 2328681 1847113 1679354 2036792
14536 2036792 1869124 1616594 1707027 2036325 1855271 1954351 2305161 2071136 2182949 2361317
14526 2361317 2085620 2199979 2211519 2247044 2058849 2051330 2313681 2196779 2265259 2397478
14516 2397478 2342418 2365164 2567764 2439972 2710652 2576407 2204590 2534088 2417635 2621022
14506 2621022 2472098 2783623 2674971 2703094 3017464 3017648 2768910 2809324 3145824 2895657
14496 2895657 3251716 3217817 3110803 3305803 3048876 3161796 3075539 3496108 3316830 3213120
14486 3213120 3505907 3428864 3388477 3482619 3533259 3456419 3885586 4157852 3765717 3642285
14476 3642285 3613400 3883043 3685531 3807534 3909662 3883918 3773404 4030977 4006550 3990871
14466C990871K78488j10600Q6024O7351K9036J71570j34206Q7374r3893L37008
14456D709023J26239k36056L94417o0351J46680R1441k75880J46194K916K80647
14446E325270o7742K28766J31713k47393K02604K28365K11946k8523r9842L8024
14436E923188K44008K46635j40844Q6448K93065J16477k93239L80580n751J41364
14426F991931L4246q7719L20705K71956P067q5843Q7492J87287k01578m1697J055672
14415H539519n24687K37765j50190k30215Q16615K6675K4692L27863J29845k88511
14405H909371M78210J81072J79386m0779L40095R5152L55741K01529j1979J76616
14395A0864414j17344L16318L63544K20582N51853j10656l4877J50176K18557
$$ plain form
14466 3990871 4269359 4158759 4244783 4312134 4341170 4512740 4378534 4465908 4372015 4709023
14456 4709023 4835262 4599206 4993623 4933272 5079952 5171393 4895513 5041707 5044623 5325270
14446 5325270 5257528 5486294 5618007 5370614 5573218 5801583 6013529 5985006 5885164 5923188
14436 5923188 6167196 6413831 6272987 6359435 6652500 6768977 6475738 6856318 6850567 6991931
14426 6991931 7026177 6938458 7259163 7531119 7538186 7452343 7539835 7727122 7525544 7483847 8539519
14415 8539519 8014832 8252597 8102407 7872192 8688807 8715482 8740174 9068037 9197882 8909371
14405 8909371 9387581 9568653 9748039 9707260 10047355 10142507 10498248 10699777 10687798 10864414
14395 10864414 10747070 11063388 11426932 11647514 12199367 12088711 12053834 12204010 12422567
14386A2422567P22176j72766M05582J35365K54559P8101M88387K25092J14512
14377A4673575M92378K24701K47110J03301M47082K79063M95820L34114N99049
14368A7896193M31398K61397N02307K06799L81224J07241L74854P70092N82303
14359B1513808N15957L03849L78501N53199O84761L98944R06835M28921O37692
14350B6322467L66013Q38493O93341R84206M98844O08420R11438O93466J223876
14341C3140564M86573J014429J077127J284666J220305R60451J126482J129595
14333D1440192J333917J125303J502815J207979J496081J929514J520571J720945
14325E3277317J609053J908076K098055K162929K346898K061455K583010K382775
$$ plain form
14386 12422567 13144743 12971977 13377559 13512924 13767483 13845584 14333971 14559063 14673575
14377 14673575 15165953 15390654 15637764 15741065 16188147 16467210 16963030 17297144 17896193
14368 17896193 18327591 18588988 19091295 19298094 19679318 19786559 20161413 20931505 21513808
14359 21513808 22029765 22333614 22712115 23265314 23950075 24349019 25255854 25684775 26322467
14350 26322467 26688480 27526973 28220314 29204520 29703364 30311784 31223222 31916688 33140564
14341 33140564 33627137 34641566 35718693 37003359 38223664 39184115 40310597 41440192
14333 41440192 42774109 43899412 45402227 46610206 48106287 50035801 51556372 53277317
14325 53277317 54886370 56794446 58892501 61055430 63402328 65463783 68046793 70429568
14317G0429568K421371K977520L129083L428286L190841L108843L835348M026905
14309I6547765M317841M108238M775889M741245N299910N530446N699034O279538
14301A37299906O526115O543489P652176P443255P747535Q518910Q635593R930489
14293B00297468R686767J0459514J1047836J1726020J2139629J2576927J3218538
14286B81152699J3438977J4276106J4228337J4537338J4829277J4889395J4693656
14279C82045785J4056497J4071664J3025944J2302696J0988385P937270K282198
14272D56710439O22394K255230K084058j379476l990932l528848n783419j0448781
14264D36540665j2789913j4040089j5451801j5698853j6212679j6115321j6063209
$$ plain form
14317 70429568 72850939 75828459 78957542 82385828 85576669 88685512 92520860 96547765
14309 96547765 100865606 104973844 109749733 114490978 119790888 125321334 131020368 137299906
14301 137299906 143826021 150369510 158021686 165464941 173212476 181731386 190366979 200297468
14293 200297468 209984235 220443749 231491585 243217605 255357234 267934161 281152699
14286 281152699 294591676 308867782 323096119 337633457 352462734 367352129 382045785
14279 382045785 396102282 410173946 423199890 435502586 446490971 454428241 456710439
14272 456710439 457332833 459588063 461672121 460292645 456301713 452772865 446989446 436540665
14264 436540665 423750752 409710663 394258862 378560009 362347330 346232009 330168800
14257C30168800j5790984j5343556j5252194j3635434j2821722j3305021j2197629
14250B31822260j1657818j1261574j0529032r980980r123081q812151p768139
14243A62689485p637938p510642o811536o476727n956781n644297n211381n273636
14235A12166547m750753m639222m277964l773580l080267l763798l631808l465435
14227H0783720k943449k995490k340668k822375k793646k088118k000520k095088
14219F0704366j981034k023473j971254j782464j584891j395364j567675j747072
14211D6651139j092105j549404j295363j336589j757j429945j116744j267283
14203C7561949j336127q02905j098830l42762r98448j251560r15104m81509n64880
$$ plain form
14257 330168800 314377816 299034260 283782066 270146632 257324910 244019889 231822260
14250 231822260 220164442 208902868 198373836 188392856 179269775 170457624 162689485
14243 162689485 155051547 147540905 140729369 134252642 128295861 122651564 117440183 112166547
14235 112166547 107415794 102776572 98498608 94725028 91644761 87880963 84249155 80783720
14227 80783720 77840271 74844781 72504113 69681738 66888092 64799974 62799454 60704366
14219 60704366 58723332 56699859 54728605 52946141 51361250 49965886 48398211 46651139
14211 46651139 45559034 44009630 42714267 41377678 41375921 39945976 38829232 37561949
14203 37561949 36225822 35422917 34324087 33981325 32982877 31731317 30816213 30334704 29769824
14194B9769824p07918p25585j055902o87755o67886l13419p53008n08516n96443
14185B3753392k92205o92485o13414n37945k21919l00239q74201l38632l54428
14176A9527924j44356m91132o11036k17695k11647n01160j26404q76731l29647
14167A6018116k0704n23900K76560p05856k20368l30533n2030m00847m30210p8914
14157A3531314m16938J52090k64476k35467k9967k34750l14553k14575m71080
14148A1501598N9301l27874L3309l32201L48570m58756L9364m16256J393l37132
14138A0111316j49848l02392L50961n85427l81294J51797J61544k10844m17830
14129H727983k0500k66491J02728k72863p8527j0149K18004l24612k54974k25508
$$ plain form
14194 29769824 29061906 28336321 27280419 26592664 25924778 25611359 24858351 24349835 23753392
14185 23753392 23461187 22768702 22155288 21617343 21395424 21095185 20220984 19882352 19527924
14176 19527924 19383568 18892436 18281400 18063705 17852058 17350898 17224494 16347763 16018116
14167 16018116 15997412 15473512 15750072 15044216 14823848 14493315 14441285 14040438 13610228 13531314
14157 13531314 13114376 13266466 13001990 12766523 12736556 12501806 12187253 11972678 11501598
14148 11501598 11560899 11233025 11266334 10934133 11282703 10823947 10863311 10447055 10448448 10111316
14138 10111316 9961468 9659076 10010037 9424610 9043316 9195113 9356657 9145813 8727983
14129 8727983 8707483 8440992 8543720 8270857 8192330 8182181 8400185 8075573 7820599 7595091
14119G595091L2532o6770n9228l15523Q2227J20127k23400l46561L7136j40342
14109F715289k00364J95943j94979m05939N50726j8563o33086K12359l5229j79451
14099F006706j84050J03945k18164l63272M72346j89238n0841l62556N22786m62873
14089E274789P9223J18816k99581P2372K97284o70946J09587J59581r0813k69395
14079D780917l0181p2351p0308Q0009M1225o4238k92508l7237O1596j14792K65743
14068D547875l79549K04371k78243K88325k06615J58413k27023p4988J9328j74175
14058C877719J38028n3113j03613J26901j83414j07723J65157n24126J30333m43562
14048C022587O67912l36659J42572n9705k35518K42682j13848k49601J19940r6340
$$ plain form
14119 7595091 7627623 7560853 7501625 7186102 7268329 7388456 7165056 6818495 6855631 6715289
14109 6715289 6514925 6710868 6515889 6109950 6660676 6642113 6009027 6221386 6186157 6006706
14099 6006706 5822656 5926601 5708437 5345165 5817511 5628273 5577432 5214876 5737662 5274789
14089 5274789 5354012 5472828 5173247 5245619 5542903 4871957 4981544 5141125 5050312 4780917
14079 4780917 4750736 4678385 4608077 4688086 4729311 4665073 4372565 4335328 4396924 4282132 4547875
14068 4547875 4168326 4372697 4094454 4382779 4176164 4334577 4107554 4032566 4051894 3877719
14058 3877719 4015747 3962634 3859021 3985922 3802508 3694785 3859942 3335816 3466149 3022587
14048 3022587 3690499 3353840 3496412 3436707 3201189 3443871 3330023 3080422 3200362 3104022
14038C104022l55479L36060k17818M39967k99370J41466j04526J74096k92210
14029B926208K24400K14643m37787K39230j37958k72067q4537K04476j56765l00572
14019B419271J05048Q4285J65924k25120O2623J14442L3582j29180J95032m18917
14009B406990P7824J0209J34150o4838m18100O449N36j8802J45966O5138j25951
13998B219571l8593J1388m9908J22043J36660q3846M07162n36188L65841K373390
13988D927520L036750O357510J8205397J3340863k1914275j1761973n217407j539965
13980E434420j338466p2081p65321K03030n88370J09396N0830k84026k61967k080
13970B485365J92570l58848r1511N0472j59394L2283M45292l56533j51219R5917
$$ plain form
14038 3104022 2748543 3084603 2866785 3306752 3007382 3148848 3044322 3218418 2926208
14029 2926208 3150608 3365251 2927464 3166694 3028736 2756669 2672132 2876608 2719843 2419271
14019 2419271 2524319 2608604 2774528 2549408 2612031 2726473 2760055 2630875 2825907 2406990
14009 2406990 2484814 2495023 2629173 2564335 2146235 2152684 2153220 2134418 2280384 2345522 2219571
13998 2219571 2180978 2192366 2142458 2264501 2401161 2317315 2724477 2188289 2554130 4927520
13988 4927520 7964270 14321780 32527177 45868040 23953765 12191792 6974385 5434420
13980 5434420 4095954 4023873 3258552 3461582 2873212 2982608 3033438 2749412 2487445 2485365
13970 2485365 2677935 2319087 2227576 2278048 2118654 2150937 2596229 2239696 2088477 2184394
13960B184394Q222L6063q868k03174L0765L6641J6656l2027o265M28993n90765
13949A900635p723L7961l2260Q1388N1215J22757l85775l0654J4426r4586O141
13938A663525j4547N08379l00191M7410m6250j16835q2805p7966k00431J84613
13928A564902j42245L46949k08850m5139J66183k89144K41118L03312j92768j07838
13918A636480k87709N50178l75955J62945J87168o19057J81436Q0770J77009l69404
13908A323861K34781l00192M69555M9740l61122N0385l3744k37791R761J80523
13898A385757J7498J3059M70010n00031j26133K77N3845J37751m0200K9205l46044
13887A094994J36003q3534L95519m39078L47614r1936m22184N14449k78265j02971
$$ plain form
13960 2184394 2192616 2228679 2219811 2016637 2047402 2084043 2100699 2068672 2062407 2491400 1900635
13949 1900635 1892912 1930873 1898613 1980001 2031216 2153973 1768198 1737544 1751970 1657384 1663525
13938 1663525 1648978 2157357 1857166 1904576 1858326 1741491 1658686 1580720 1380289 1564902
13928 1564902 1422657 1769606 1560756 1515617 1681800 1392656 1633774 1937086 1744318 1636480
13918 1636480 1348771 1898949 1522994 1685939 1873107 1254050 1435486 1516256 1693265 1323861
13908 1323861 1558642 1258450 1728005 1777745 1416623 1467008 1433264 1195473 1205234 1385757
13898 1385757 1403255 1416314 1886324 1386293 1260160 1260437 1314282 1452033 1411833 1441038 1094994
13887 1094994 1230997 1147463 1542982 1103904 1451518 1359582 937398 1451847 1173582 1070611
13877A070611P02729l54545n8000j43769j87778Q0091P2861K5751j11920j12242
13867I83789K33312K3697J7158m49476N84280l08350J67067l97546L58149k59814
13857I52266J84556l28247M04869j65687R8366M26280o73091J63922j1647K94722
13847A346309n14992M09110p4699k44381J29512j30673K14738N4535k48092r1910
13837H49457P5560J56365J34462j28114j67975J16723n0975j28236J20547O1839
13827A039653j48815J5533K4710p7974R032L0691R3380j13584j37758L12524k92988
13816G54404L9823k7244o9683L87358J27909l86902j31834J71828l7427J18676
13806I46908j60142J7184J33625N633j98286k91954L68063K8630P5016j43539
$$ plain form
13877 1070611 1773340 1418795 1360795 1217026 1029248 1109339 1182200 1207951 1096031 983789
13867 983789 1217101 1240798 1257956 808480 1392760 1084410 1251477 853931 1212080 952266
13857 952266 1136822 808575 1213444 1047757 1146123 1572403 899312 1063234 1051587 1346309
13847 1346309 831317 1240427 1165728 921347 1050859 920186 1134924 1189459 941367 849457
13837 849457 925017 1081382 1215844 1087730 919755 1036478 985503 857267 977814 1039653
13827 1039653 890838 906371 931081 853107 862139 892830 986210 872626 734868 1047392 754404
13816 754404 794227 766983 697300 1084658 1212567 825665 693831 865659 828232 946908
13806 946908 786766 803950 937575 943208 744922 452968 821031 849661 924677 781138
13796G81138L50265l70962K81504m27361N28182k32614l21122j63199P33635j61857
13786I97609k88160Q1878n6209m5227r0782P4409K27126O1917j96083j89800n1447
13775E25231K17663C58753K67481O5190Q2481N4545m0637j88133K84396m14277
13765D69799M68837m7899k19100k8667K24413k01852j72910J78075j33003K51348
13755G89041p3597l0515j02814J47957j25860l3463O6258r7462L47520q9801j16196
13744F81068K71725l30964B02272L83412L25639l44263j17927L4746J13943J48657
13734G46479r2002j70004L94447j53181j72460K27685l01954k1772J07598M7632
13724F12468j89779N796M49758r0654k17222m6616k590K63571k25040J12002J86406
$$ plain form
13796 781138 1131403 760441 1041945 614584 1142766 910152 589030 425831 1159466 997609
13786 997609 709449 791327 735118 689891 599109 673518 900644 962561 766478 576678 525231
13775 525231 742894 358753 626234 691424 773905 828450 787813 599680 884076 469799
13765 469799 938636 890737 671637 642970 867383 665531 492621 670696 537693 789041
13755 789041 715444 684929 582115 730072 604212 570749 637007 539545 887065 797264 681068
13744 681068 952793 621829 202272 585684 911323 567060 449133 483879 597822 746479
13734 746479 654477 484473 878920 725739 553279 780964 479010 457238 564836 612468
13724 612468 422689 428485 878243 787589 570367 523751 521161 784732 559692 671694 858100
13713H58100G8849M48192L1943J44217J67617k76574M17614k98407m2547k17349
13703D53555A90040N1239J25049K29919A91776N11876R4746j64563j47827r9077
13693C86931q730M5075L27415j63677q2628K25636q8298r0443r1922O412K7965
13682D93736j0345j56894m1251m1571L31485R8184l04430K33194k32254L07831
13672F77685q9196m6999p0259J8198e1657F24103j24264p1536j80305L86752n8051
13661E76699Q3965B81423K37936j71565O8123p1012J83554O0008k1545K04497
13651G71419k20745j44677j5725L19720j58796j51473p7802K39506A90938J99535
13641C90473R8661K70884C67581K03049Q4864k43892O5429p8377J46327n6132
$$ plain form
13713 858100 78849 527041 558984 703201 870818 594244 1011858 713451 670904 453555
13703 453555 190040 241279 366328 596247 191776 703652 798398 633835 486008 386931
13693 386931 378201 423276 750691 587014 504386 730022 641724 551281 459359 465771 493736
13682 493736 483391 326497 285246 243675 575160 673344 368914 602108 369854 677685
13672 677685 588489 541490 471231 489429 -51657 624103 499839 428303 247998 634750 576699
13661 576699 660664 281423 519359 347794 415917 344905 528459 588467 566922 771419
13651 771419 550674 405997 390272 709992 551196 399723 321921 561427 190938 390473
13641 390473 489134 760018 367581 570630 655494 411602 477031 398654 544981 488849
13631D88849N556I7390L45220j45509p1297J38220L41032n2528k5775j48693M0086
13620E18146j86773p626J07926j57365K87569A54305B6222K97046J76286B24806
13609A87616L10037n799m7356j25860c5999I1498N70472D3977J66749J55537j6558
13598C49705H4591J65994K32047J29985j68521j39354J34328N8679k12898J09852
13588C94703l4642m6325L34613M1650j87800A85620J29147M21815A82361J51677
13578C34038Q7653J54196j39975q3566N9548m5178l4135j11234q4273K60620J45058
13567E42752B16379A6538L95526A72630J67548j05657O916J92341k08191K78173
13557E03760A31608K65392A34279J43413j23628J38888J42586r5606J14546j43398
$$ plain form
13631 488849 494405 97390 442610 297101 225804 364024 705056 652528 626753 478060 518146
13620 518146 331373 323747 431673 274308 561877 154305 26222 323268 499554 224806
13609 187616 497653 491854 444498 318638 -35999 91498 661970 43977 210726 366263 349705
13598 349705 84591 250585 482632 612617 444096 304742 439070 497749 284851 394703
13588 394703 360061 313736 648349 689999 502199 185620 314767 736582 182361 334038
13578 334038 421691 575887 435912 352346 411894 366716 332581 221347 137074 397694 542752
13567 542752 216379 16538 412064 172630 340178 234521 241437 433778 225587 503760
13557 503760 131608 397000 134279 277692 154064 292952 435538 339932 454478 311080
13547C11080A32971M59945B34295N1003K87275j41659j91342o5110K72281j49380
13537B97363j01981P8068B6218J35629M68884B06346L15212k07022m2144K72404
13527E44796j68180N3225H6389L08989J9805p7389J99417j35215j95614M9211
13517B55593O2191A0692J39614J61578a6941A87465K2965L19610B14681q0589
13507A34092J11441K38991A83405M28103A48041F914M9376M62122A41794L8684
13497A80478a08389D21428I9460K75379j57633J99501L7827G6112L89071p5499
13487C89684A84869l0735Q8574A7524P1866M14444A22298K5007L2932k5066A4090
13475C88798o4300A55935K59714J0368R3765A63741K21893P1332o476J15990B49498
$$ plain form
13547 311080 132971 592916 234295 285298 572573 430914 239572 174462 446743 297363
13537 297363 195382 273450 26218 161847 630731 206346 521558 314536 272392 544796
13527 544796 376616 429841 86389 395378 415183 337794 537211 401996 206382 255593
13517 255593 317784 10692 150306 311884 -16941 187465 210430 530040 214681 134092
13507 134092 245533 484524 183405 611508 148041 6914 56290 518412 141794 180478
13497 180478 -108389 421428 99460 374839 217206 416707 454534 76112 465183 389684
13487 389684 184869 154134 242708 17524 89390 503834 122298 147305 180237 155171 14090
13475 388798 324498 155935 415649 426017 519782 163741 385634 456966 450490 566480 249498
13463D85172j63720F5863N9840K88362H6541L127K04463q411j30996M0601E2127
13451A83775m6639R8842N3571j34394J71989A24861J53308j8776N7421A52060
13440A30345k3383J4830J95734Q569n9036J74872k08703J06965A42450K67809
13430D10259j41404o8991K28746A86998Q6705A22514J26531R8152m4585q7866
13420B14746O8326L29458A70247J33175K53637A70539Q2595j06458M7915a10768
13409A9713p823J79232J38878A07936K51407j14075i948G52110C09045A02528
13398D38831B08554o4897K55455k0859n8658j02036R5407l0182P0830G3720J598
13387G5318M0374L34372H7630J53969q2933R8217R7676A76222j5493J46931B5633
$$ plain form
13463 485172 321452 65863 125703 414065 86541 89668 294131 285720 154724 195325 52127
13451 183775 137136 235978 289549 155155 327144 124861 278169 259393 316814 152060
13440 130345 106962 121792 317526 326095 267059 441931 233228 340193 142450 410259
13430 410259 268855 199864 428610 186998 273703 122514 249045 347197 302612 214746
13420 214746 283072 612530 170247 303422 557059 170539 253134 146676 194591 -110768
13409 19713 11890 191122 330000 107936 359343 245268 -9948 752110 309045 102528
13398 438831 208554 143657 399112 378253 319595 217559 312966 282784 353614 73720 75318
13387 75318 115692 450064 87630 241599 158666 256883 354559 176222 160729 307660 25633
13375A75663G8025L57387G9872K31574L47590B66448j04314K70611B01546m1222
13365A60324O9298j00165J04387I9789L30012H3647j1431J06722K8614E4624J91983
13354B46607J28582A71789a56604A97327O4795J91494A57830K04155k9189H4587
13343A27282J37903j14084M31042A37381A8204Q3412K38588j10414A9462O0597
13333H0059J08778J14000b2953D07799r797H9884C1959K21163i5665D43842j06995
13322C36847Q1349F873L7635b5310A85153e7146D8380K17480p7268K89785a4756
13310H6104K37951J01581j25349J00779o2742K50771B89595B4334K22576j06926
13300A39984J58808r2517l1318R081J83940A35038N0306D7719J48470c00135C3452
$$ plain form
13375 175663 78025 435412 79872 311446 659036 266448 162134 432745 201546 160324
13365 160324 229622 129457 233844 99789 429801 83647 72216 178938 207552 54624 246607
13354 246607 375189 171789 -156604 197327 262122 453616 157830 361985 332796 84587
13343 127282 265185 151101 582143 137381 18204 101616 340204 229790 19462 80059
13333 80059 188837 302837 -22953 407799 398002 89884 31959 253122 -95665 443842 336847
13322 336847 418196 6873 44508 -25310 185153 -57146 48380 265860 188592 478377 -14756
13310 86104 324055 425636 300287 401066 338324 589095 289595 24334 246910 139984
13300 139984 298792 206275 174957 184038 367978 135038 185344 47719 196189 -300135 33452
13288A02267J37632R0171A02067D1439K7589J48034K67363B32188A14346B5530
13277C45745C5936J39554Q0484J09107j4939D5746A8492K7805L21296p7355A8817
13265B73597J31502p3934J1458j57052K13985j74754d2069B50917G2757b869j52975
13254a55844C14846B9271K76214e326F9727a30280E5717J01556Q6600a28799A59806
13242d4243A23308P7343P8019a093A69939a33854D23942a35832a2557B28904D701
13230H1409C4466J53776L1137l0777c5145A15120e502A10055C6317g5570Q229
13219f7341J8555J0869A71896F2103b48195B6766i5906A99692Q9357J9093n7451
13208B50691K3172E8640J36114k3066p2138J90220H910Q5956r617Q2272B4375
$$ plain form
13288 102267 239899 330070 102067 41439 69028 217062 484425 232188 114346 25530
13277 345745 35936 175490 255974 365081 350142 45746 18492 46297 367593 290238 18817
13265 273597 405099 331165 342623 185571 399556 224802 -42069 250917 72757 -2869 -155844
13254 -155844 314846 29271 305485 -5326 69727 -130280 55717 157273 243873 -128799 159806
13242 -44243 123308 200651 278670 -1093 169939 -133854 423942 -135832 -12557 228904 4701
13230 81409 34466 188242 219379 188602 -35145 115120 -5502 110055 36317 -75570 -67341
13219 -67341 -48786 -37917 171896 62103 -248195 26766 -95906 199692 289049 308142 250691
13208 250691 273863 58640 194754 171688 99550 289770 8910 94866 85249 167521 24375
13196E70334B49855r0829l5864k3330c6234C56048A16134K55181A71682J54794
13186C26476A25232a96332A43207F7867J13711K9608D1791h9869C63532A62349
13175a24079c0835B88986a9021C46573e4310B41830b0904A33342a16895B79884
13164B9291K65066J8721a561k455k10348R6946A94391a01967C40955A01558a12411
13152b9440p7199e0650B59296j25452N5477A2421K95196N9681A38345J76893A39861
13140B72035r725j05567K8162J69591A51634N8419I081M52333c7595h337A31787
13128I4391D4487K33286b51310B2257f5825l8307B20079I9044J05901E4860J05792
13117A60652e6528r9434A31968L2238J47227j38971o3639g6032B13099o7117K6937
$$ plain form
13196 570334 249855 159026 123162 99832 -36234 356048 116134 371315 171682 326476
13186 326476 125232 -196332 143207 67867 181578 211186 41791 -89869 363532 162349
13175 -124079 -30835 288986 -19021 346573 -54310 241830 -20904 133342 -116895 279884
13164 29291 294357 313078 -1561 -4016 -214364 -117418 194391 -101967 340955 101558 -112411
13152 -29440 -106639 -50650 259296 133844 189321 12421 307617 367298 138345 315238 139861
13140 272035 262310 156743 184905 354496 151634 210053 9081 461414 -37595 -8337 131787
13128 94391 44487 277773 -251310 22257 -65825 -104132 220079 99044 204945 54860 160652
13117 160652 -56528 -155962 131968 164206 311433 172462 108823 -76032 213099 145982 172919
13106A72919M4338b11712L0173A38976A1970J82983j0731M033n1222O8695G7571
13094A03144a61121A45292m4182c7064D41119b1793A77862b6004C86250I3369
13083A18674R7448E4226N6704J25006f2894B44166r6689J669E1292E649c51739
13071D6203L1364j4107j1437L8554g2056B0356M3558P338a9605C42126a27935
13059D66173H0941M01915B13263k6741K10542b4988H436h7776C91290k6072A72996
13047D50889A84475i8167D42956j8202A25378K2682B5558J0589O1424K7992K7467
13036A53030B9112K93891b64889A27231J23773J00994A19281O4734r1566K06834
13026B99283o4819o8240k7238P8205J04961j47507K3921C102M98276A79372J55158
$$ plain form
13106 172919 217257 -211712 -181539 138976 11970 194953 184222 188255 137033 205728 77571
13094 103144 -161121 145292 101110 -37064 441119 -21793 177862 -26004 386250 93369
13083 118674 216122 54226 110930 235936 -62894 244166 147477 149146 51292 5649 -351739
13071 46203 77567 63460 52023 90577 -72056 20356 63914 71252 -19605 342126 -127935
13059 466173 80941 482856 213263 186522 397064 -24988 8436 -87776 391290 365218 172996
13047 450889 184475 -98167 442956 424754 125378 148060 25558 36147 97571 125563 153030
13036 153030 29112 323003 -264889 127231 251004 351998 119281 184015 92449 299283
13026 299283 234464 166224 138986 217191 322152 174645 198566 3102 501378 179372 334530
13015C34530o8004A21892K51759j11526o2788a57155B96284D4830K76946j16959
13005B04817K1966c6141j45824C7908K22756j19616m990J6545g2834E5055i832
12993e7192B77038R2661A48644J44215a07840A6551b29205F0792J70585A02316
12982I2821J27760P1771a53839J2653G7889J83902R192F3333J24495J8298G4160
12970a40606n2282A67828Q5074a55016l901F0308P9636J03420e7854A58747b7920
12958a86452C78560m2708B8351b26839D12189j34160Q4459a06997H8310P4679
12948A62989a6484A9932a46539B04818b03900I474M0259a45487D49873a5541F4046
12936A52087c82B93781a00345J9966B95252a47334a8061A4948c2759A56687q208
$$ plain form
13015 334530 266526 121892 373651 262125 199337 -157155 296284 44830 321776 204817
13005 204817 226783 -36141 -181965 37908 260664 141048 136058 152603 -72834 55055 -9832
12993 -57192 277038 369699 148644 292859 -107840 16551 -229205 60792 231377 102316
12982 92821 220581 292352 -153839 -141186 77889 261791 270983 63333 187828 206126 74160
12970 -140606 -192888 167828 252902 -155016 -158917 60308 139944 243364 -57854 158747 -27920
12958 -186452 378560 335852 28351 -226839 412189 278029 362488 -106997 88310 162989
12948 162989 -16484 19932 -146539 204818 -203900 9474 49733 -145487 449873 -15541 64046
12936 152087 -382 293781 -100345 -80379 295252 -147334 -18061 14948 -32759 156687 148479
12925A48479D8724O2449e4123B18004g628k81429a29942B87469I0952a60368A18487
12913B93927f2265C27789D6082J65789G709g5162A76278i5694B20290F133J35767
12902A41900D1604i7375C8656J47469o2708A3500f3184m5114F5354J27841k5684
12891A67511a27312n1375E0808e3042j33354G8257a16344B03457E796J30542a77568
12879F2454a41181A20708h238j87403E2264a48442C07686d79091A30013E8056
12868A69668l6369K03391c26479I0713J58447O56C1203J2473R1067b36957I1381
12856A27287E8427f7109B95264a18187C32073a66436B010B89L7869g3859j11398
12845a85257G9008F760a28874A78776a28841B23310a45427E27188h3532b573C20776
$$ plain form
12925 148479 48724 111173 -54123 218004 -7628 -289057 -129942 287469 90952 -160368 118487
12913 293927 -62265 327789 46082 211871 7709 -75162 176278 -95694 220290 6133 141900
12902 141900 41604 -97375 38656 186125 123417 13500 -63184 -108298 65354 193195 167511
12891 167511 -127312 -178687 50808 -53042 -186396 78257 -116344 203457 5796 136338 -177568
12879 62454 -141181 120708 -8238 -195641 52264 -148442 307686 -479091 130013 58056
12868 169668 133299 336690 -326479 90713 249160 249816 31203 43676 134743 -236957 91381
12856 127287 58427 -67109 295264 -118187 332073 -166436 2010 289 38158 -73859 -185257
12845 -185257 79008 6760 -128874 178776 -128841 223310 -145427 527188 -83532 -2573 320776
12833F1866A4877f8954G3938J05406C1655d4742E11415F5226a64473c95o9626
12822g0021A1621a99160B3588K03663o7763b9294q9769M5513j51934F3540N4991
12811A18531n5484a07314M7059J6741B10626j04296P5476n717C3116A3166i4404
12799A31683L12811e3556I2140B3585K00209o2178F3598d4600A4037a78629B05472
12787B1173Q2209a11754C32759b9082j01813B93732a07956C10717f1345A57518
12776f492k67914f8874C5137J64827K05191H8306a00894G5094a14356E4568d596
12764B90916B9674K22071C258K2243N0027J5459K69125f0967A80507K2374b00749
12752g0880A77802i6083A55817N9128N5468r0291a54649B59322a18848j07215
$$ plain form
12833 61866 14877 -68954 73938 179344 31655 -44742 511415 65226 -164473 -395 -70021
12822 -70021 11621 -199160 23588 227251 159488 -29294 -119063 -73550 -225484 63540 118531
12811 118531 63047 -107314 -60255 -43514 210626 106330 181806 176089 33116 13166 -94404
12799 131683 444494 -53556 92140 23585 223794 161616 63598 -44600 14037 -178629 205472
12787 21173 103382 -111754 332759 -29082 -130895 293732 -107956 310717 -61345 157518
12776 -6492 -274406 -68874 35137 199964 405155 88306 -100894 75094 -114356 54568 -4596
12764 290916 29674 251745 3258 25501 75528 90987 360112 -60967 180507 202881 -200749
12752 -70880 177802 -96083 155817 214945 270413 180122 -154649 259322 -118848 -226063
12742b26063A2255a31833a1460B6095c441A76282n3107B0231M04868B10105A668
12730c2218D6141j8015L82824d8699B56245a3034j02922o9396F3596k3261e3621
12718I9523k5441a45273D31698F3279K80850j02849d6599k80214c1506A12065
12707C15930q5748l7285p8019f8666p7647A04725j1926N6996O9164R5308b6530
12695c3257j03521A44387J11811j26068R1577E9530J61246i565A41244a89273
12684A12234P058b2400C76512A06697B7161M40857A88117n4277L08706h3199G7658
12672A06011a44795C6219J65738a06964p278K9450D94413a45614I1359a49072
12661A40070a77276A35274a53808d7054C04645K15429r2900j97478D6717P2134
$$ plain form
12742 -226063 12255 -131833 -11460 26095 -3441 176282 123175 20231 425099 210105 1668
12730 -32218 46141 28126 410950 -48699 256245 -13034 -115956 -185352 63596 40335 -53621
12718 99523 74082 -145273 431698 63279 344129 241280 -46599 -326813 -31506 112065
12707 315930 230182 192897 114878 -68666 -146313 104725 92799 149795 218959 314267 -26530
12695 -33257 -136778 144387 256198 130130 221707 59530 220776 -9565 141244 -189273
12684 112234 119292 -22400 376512 106697 27161 468018 188117 133840 442546 -83199 77658
12672 106011 -144795 36219 201957 -106964 -114242 -84792 494413 -145614 91359 -149072
12661 140070 -177276 135274 -153808 -47054 304645 520074 427174 229696 46717 118851
12651A18851b04439C10535b0841A29680Q9256H9742N8458P2173b90424F5108i8708
12639e3792j35415o6583C41109c4656A96884J17465d2068B64368J9284C6796b65015
12627F9084Q4160b4435C28337A9561a83785C31073f3171B78203d0962B99223a06432
12615a24726E25332A41774P4533l7370I8J45830J25334a60907f2384a1628C7411
12603A25750n1815L8088b34460B20745H6799N1328J85338a39792N8975B55707
12592C4052R3116a12203E017f4434C7424c45052A33385m721N0089J31942a29816
12580A91538d33096B71127c51964d3447H4725L00212f8895j97858B2267b38610
12569B42417D3469K11044A5322d0883j43447C1283a92724B12668A01444A7369
$$ plain form
12651 118851 -204439 310535 -20841 129680 218936 89742 148200 220373 -290424 65108 -98708
12639 -53792 -189207 -255790 341109 -34656 196884 314349 -42068 264368 283652 36796 -265015
12627 69084 153244 -24435 328337 19561 -183785 331073 -63171 278203 -40962 299223 -106432
12615 -124726 525332 141774 216307 178937 98 145928 271262 -160907 -62384 -11628 37411
12603 125750 73935 112023 -234460 220745 86799 138127 323465 -139792 -80817 255707
12592 34052 127168 -112203 5017 -64434 37424 -345052 133385 128664 178753 310695 -129816
12580 191538 -433096 271127 -351964 -43447 84725 384937 -68895 -266753 22267 -238610
12569 242417 43469 254513 15322 -40883 -184330 31283 -192724 212668 101444 17369
12558A69523F8331J27177n7767K26951b5660n4420j50021G1618J22378a20861
12547B81295g9216E5316g0880A60303N376p273m9374N02644A4706L8446H637Q1419
12535I0056R9319d23242a8321A26377a7376F8022N967d2227m1595G6249a52595
12523E3592J7079a73861c7502e565A47655N6921r4703N4411K60902A74973l6688
12512A38285r399d5483A3900b99429I4179J32706g5660o0735H4170K6737a17492
12500F3455a19804C9691b84636J0959R5054j6135i838A02449K20416I3052a1159
12488G9471H854K59659a81773m2506B37516C5142L3041Q4628m7907a0364D7658
12476H715P4158L6962n1469R4717g3558b0378A93120j8536a03830r552r993L3533
$$ plain form
12558 169523 68331 195508 137741 364692 -25660 -80080 -230101 71618 193996 -120861
12547 281295 -79216 55316 -70880 160303 165679 158406 109032 611676 14706 53152 8637 90056
12535 90056 189375 -423242 -18321 126377 -17376 68022 73989 -42227 -83822 76249 -152595
12523 53592 70671 -173861 -37502 -5565 147655 204576 109873 164284 425186 174973 138285
12512 138285 128886 -45483 13900 -299429 94179 226885 -75660 -136395 84170 110907 -117492
12500 63455 -119804 39691 -284636 -273677 -178623 -194758 -9838 102449 322865 93052 -11159
12488 79471 8854 268513 -181773 -224279 237516 35142 68183 152811 104904 -10364 47658
12476 8715 82873 119835 68366 163083 -73558 -20378 193120 174584 -103830 -113382 -123375 -89842
12464h9842k0973I4845m6488A7267a07491A727a44010A5816R6669i029A9555f3576
12451b97454G433b23471E5131c1194M792D0684J25265e703B40057j18203O3080
12440A84934a14856e4540A03611a12588J1C00556f1005n5030A52749i8114B35335
12428E0347A6781b56905C41877A70324g2281A03819f0241I7495B5295J81074H6863
12416A24897a28877M6226F1575P5743b5069k8375o7941G1916c46111c4901j28677
12405a63578N3177c095A06435b87075a4169r4364E3313e6694B7448a79920j37242
12394c17162J01977P3614F0469g3302A51596a49909I7832l8359i0006c9503J3293
12383b6210a1467l5991j56784i8432C23512b83183H2223J1700b5858I5786J08951
$$ plain form
12464 -89842 -110815 94845 48357 17267 -107491 1727 -144010 15816 112485 -9029 19555 -63576
12451 -297454 7433 -223471 55131 -31194 -26402 40684 165949 -5703 240057 121854 184934
12440 184934 -114856 -54540 103611 -112588 -112577 300556 -61005 -116035 152749 -98114 235335
12428 50347 16781 -256905 341877 170324 -72281 103819 -60241 97495 25295 206369 86863
12416 124897 -128877 -82651 61575 137318 -25069 -53444 -121385 71916 -346111 -34901 -163578
12405 -163578 -110401 -3095 106435 -287075 -14169 -108533 53313 -56694 27448 -179920 -317162
12394 -317162 -215185 -141571 60469 -73302 151596 -149909 97832 59473 -90006 -39503 -26210
12383 -26210 -11467 -47458 -204242 -98432 323512 -283183 82223 93923 -25858 95786 204737
12372B04737p5621E1444A2641f4417D3085O7781C412K22296R6768A18089E4707
12360F8094c42051a14369k96885A67802a24126l0482E3531a58812d6811l4452
12350h1263A36406l5541a08956B22111I3352a07600D7680a26882E6429h5685k35958
12339c21643B96535a33239q874j05639H0587b22736R5421C19609d0950F1168c46236
12327B67132B2373K13838c45270A92811b6480n6172A14705n2520f7689j66805
12317b34494C41274a39251B2254c29732f1384G2216K781a85861f4725J7516k42529
12306b89738d0941A4886e4454B72856a92799D07401B3924J53233p5021i5042B16721
12294A96471b2104C68782E3177J32190b4407A32076Q286a27932f1553H6404q273
$$ plain form
12372 204737 129116 51444 12641 -64417 43085 110866 3412 225708 322476 118089 54707
12360 68094 -342051 -114369 -411254 167802 -124126 -154608 53531 -158812 -46811 -81263
12350 -81263 136406 100865 -108956 222111 93352 -107600 47680 -126882 56429 -85685 -321643
12339 -321643 296535 -133239 -142113 -247752 80587 -222736 -127315 319609 -40950 61168 -346236
12327 267132 22373 236211 -345270 192811 -26480 -82652 114705 62185 -67689 -234494
12317 -234494 341274 -139251 22254 -329732 -61384 72216 74997 -185861 -64725 -47209 -289738
12306 -289738 -40941 14886 -54454 272856 -192799 407401 23924 177157 102136 -95042 216721
12294 196471 -22104 368782 53177 185367 -24407 132076 140362 -127932 -61553 86404 78131
12283G8131e3016A37696J1155e91l0755A51528a09788K9029D86433A32561l3061
12272I9500L39082B435J33438J94241o4558i7025B07985j1178I2514P4346J49717
12261C16577r644j03491r9456L9830d8670B42103H9963l674a86378B50302D7616
12249a1694F5158b10032A67755j5808J47622J8698f7408B12409C6349R7756E9873
12237B47619h6234A37318o3749a14728A85843a82296k892A38468F6470J70735
12227B37205j18027E0280M0084J3413J34737N6164K24981a6193A72353J08689
12217B81042P4659G0680l3079N74060a36857H0909h7802A00989J81126D2465J36449
12206A78914l5192b4114F3102J09471J28574K7805J03015B3538L90557a15403
$$ plain form
12283 78131 -53016 137696 148851 -591 -31346 151528 -109788 -80759 486433 132561 99500
12272 99500 438582 2435 135873 330114 265556 -97025 207985 196807 92514 166860 316577
12261 316577 306933 203442 103986 143816 -48670 242103 89963 86289 -186378 250302 47616
12249 -11694 65158 -210032 167755 151947 299569 318267 -67408 212409 36349 134105 59873
12237 247619 -86234 137318 73569 -114728 185843 -182296 -185188 138468 66470 237205
12227 237205 119178 50280 90364 103777 238514 294678 519659 -16193 172353 281042
12217 281042 355701 70680 37601 611661 -136857 80909 -87802 100989 282115 42465 178914
12206 178914 143722 -24114 63102 172573 301147 328952 431967 23538 414095 -115403
12195H8506J05683r0635J03677I7947K26718A12324J25761b44856D63396j82906
12185B80490H2272Q5608h186j36474a2375D2899f674B40851j0560A10226J99721
12174C09947b6707C9252O7975l688J82441m6687Q1783a47925B77446C3330J83288
12163B16618I3747L08295b2337H7185K4000a95640F9485a76783C27939A20296
12152f4638C13542A4797b7370B33955B1895e333j09188m4680C3659o168N0150
12141G7641n941p930J12264a20438D1831a5228d709j89171A94489J53322A45777
12129a0057k26059F9116c5840A56507N8618a81172B0364L9469K22759c9732F3554
12117a00029C04420e1559A71781l4020a94681G5491a19793k28519A48799L7310
$$ plain form
12195 88506 194189 103554 207231 97947 324665 112324 238085 -244856 463396 280490
12185 280490 82272 167880 -8186 -144660 -12375 42899 -6674 240851 230291 110226 309947
12174 309947 -26707 39252 107227 103539 285980 239293 321076 -147925 277446 33330 216618
12163 216618 93747 402042 -22337 87185 111185 -195640 69485 -176783 327939 120296
12152 -64638 313542 14797 -27370 233955 21895 -5333 -114521 -159201 33659 27491 77641
12141 77641 71700 63770 176034 -120438 41831 -15228 -4709 -193880 194489 347811 145777
12129 -10057 -236116 69116 -35840 156507 215125 -181172 20364 59833 282592 -39732 63554
12117 -100029 304420 -51559 171781 137761 -194681 75491 -119793 -348312 148799 186109
12107A86109J42688c0781D3165a84918B11862d4634B25160p9479A9592M1573P8847
12096A40012J49688a7760A22944a58019c7079A61733E4387e3334j33211C70344
12085a56777c0472k84433B35807a00688b7979D7852c44024c9162j48314B442M4962
12074D7404b05063a02531J468C59398f0284k77456G8678d1397B13257c13905F6654
12062d7753C42337R8469K13256J363941H05982C10769o7486J07937b95583A05108
12051b32025E4697a88730B83075a71936Q2388b648F7432A3103k826a11790j7482
12040a29272G5561b18979c0114q4809A71497K23765h3159E3372b31112B52370
12029C2790a01135k13469A89348B6098a56879j38010B20605l0393g362G1231k0653
$$ plain form
12107 186109 328797 -30781 43165 -184918 211862 -44634 225160 145681 19592 61165 140012
12096 140012 289700 -17760 122944 -158019 -37079 161733 54387 -53334 -186545 370344
12085 -156777 -30472 -314905 235807 -100688 -27979 47852 -344024 -39162 -187476 2442 47404
12074 47404 -205063 -102531 -101063 359398 -60284 -337740 78678 -41397 213257 -313905 66654
12062 -47753 342337 440806 654062 2018003 805982 310769 243283 351220 -295583 105108
12051 -232025 54697 -188730 283075 -171936 -89548 -2648 67432 13103 10277 -111790 -129272
12040 -129272 75561 -218979 -30114 -114923 171497 395262 -83159 53372 -231112 252370
12029 32790 -101135 -314604 189348 26098 -156879 -294889 220605 190212 -7362 71231 50578
12018E0578K781g4467p4392A30119R4784c28802D27018A17490M8940b37650e5632
12006B80855j16822g7309J5161k9175M2396G105N767J88188c0723B57151b6878
11994C10551b91850B26888r2349A5860J30988c01990i4512B34283I0637e1087
11983a61806B20082H6319a8650D9879K95044e6949A39936J79395d7367E3218h7780
11971A96196E3027b36201C36417f3923k62939A43002b9626A69889q4081b97258
11960c13604f3332q141j863j63747J0982A68898J35135f390C08344A49388a44075
11948A48741a98251F0725b54486P7687A1798a78600I7131a45598M6149A94438
11937d1732I0598f7450D0643h2205m8658A52272A2660K11708H494N5863B5798
$$ plain form
12018 50578 53359 -74467 -148859 130119 224903 -328802 427018 117490 166430 -237650 -55632
12006 280855 164033 -77309 -62148 -91323 -48927 7105 12872 201060 -30723 257151 -26878
11994 310551 -291850 226888 134539 15860 146848 -301990 -94512 234283 90637 -51087
11983 -161806 220082 86319 -18650 49879 344923 -56949 139936 319331 -47367 53218 -87780
11971 196196 53027 -236201 336417 -63923 -326862 143002 -29626 169889 85808 -297258
11960 -313604 -63332 -71473 -73336 -237083 -226101 168898 304033 -6390 308344 149388 -144075
11948 148741 -198251 60725 -254486 -176799 11798 -178600 97131 -145598 -99449 194438
11937 -41732 90598 -67450 40643 -82205 -130863 152272 12660 224368 8494 64357 25798
11925A11183a10118A34119c47564a27401A32966a29502N0412c4379j6863j83593
11915b34835B90799C7509N3411J58623a25954I2794J79327E5273A2989c87149
11904I1769C9059c3861C37712F1220b16995h9240j32996E9458i8110j51918o5389
11893c15417a08090k98864a04131H2538N696b08116j9575Q4084H0647L3941b64285
11881d031o45909A99507e089k69836c8186A12828a32912L7970n5081b7234j22578
11870a49812g3230K5004B0882p168J59818b0980o4859j49779D8740b22137A41052
11858d1283j13691A24213J77609b83987A4421J04144m8371K46924C0057a29559
11847H5398f3514b5364F1234a14623C8906b52040A32420A0437f7542b0384q515
$$ plain form
11925 111183 -110118 134119 -347564 -127401 132966 -129502 -79090 -34379 -51242 -234835
11915 -234835 290799 37509 90920 249543 -125954 92794 272121 55273 12989 -387149
11904 91769 39059 -33861 337712 61220 -216995 -89240 -222236 59458 -98110 -250028 -315417
11893 -315417 -108090 -406954 -104131 82538 88234 -208116 -227691 -143607 80647 114588 -264285
11881 -4031 -649940 199507 -5089 -274925 -38186 112828 -132912 -94942 -150023 -27234 -149812
11870 -149812 -73230 -48226 20882 13714 173532 -20980 -85839 -235618 48740 -222137 141052
11858 -41283 -154974 124213 301822 -283987 14421 118565 70194 317118 30057 -129559
11847 85398 -63514 -25364 61234 -114623 38906 -252040 132420 10437 -67542 -20384 -28899
11836b8899A29907a29191A33989d19317a39529n374k2350A26232M333J31680A4799
11824A39456D8993O0224c33566B36641c46147A44499a25739F1860K03816d547
11813b06286c7430A52887p5894N4678L6179f0185G7826C4290i0870p8536E8325
11801h8127K3580A4761N7019e8959j97397F507a45922N6025D7700a98492j10271
11790c08763A48410b72619I2131b62341q6791H297a76881k02192e8574B34116
11779h9746q2042A49048b49840b2167B35000a32813A37195a12209e3363a0292
11768B43806f4694A55612E7316J07855k6405n4506a56225C6841n879a51991j31286
11757b83277g491E228f0833l15438a4404j43810A11648b67476A18001Q4680K9154
$$ plain form
11836 -28899 129907 -129191 133989 -419317 -139529 -144903 -167253 126232 130565 262245 14799
11824 139456 48993 109217 -333566 236641 -346147 144499 -125739 61860 265676 -4547
11813 -206286 -37430 152887 76993 131671 167850 -60185 77826 34290 -90870 -169406 58325
11801 -88127 -64547 14761 71780 -58959 -256356 6507 -145922 -89897 47700 -198492 -308763
11790 -308763 148410 -272619 92131 -262341 -349132 8297 -176881 -379073 -58574 234116
11779 -89746 -171788 149048 -249840 -22167 235000 -132813 137195 -112209 -53363 -10292
11768 243806 -64694 155612 57316 165171 138766 84260 -156225 36841 30962 -151991 -283277
11757 -283277 -7491 5228 -60833 -376271 -14404 -158214 111648 -267476 118001 202681 231835
11746B31835c04765K9721g7264A62967g7490I3070a66131j45536H005k028c94427
11734C00140a82754B85884A38383D321d8005r706J0965A88146m6670r303B3730
11722d11753B89492A07067j4971a45317j28535g0926n0207J6548M3664A7208L13628
11711C30836j60569N6164j00736E4882J15837l3608C090M5906a75953B12205J1168
11700B23373n3744h1336Q056a4567A01030N8064G6679J3866M07246d4151C50794
11688a21637B67995A15137h2290j92392B85336r3974L4483d07536B46851K63124
11678E09975a5218B39018A14991P0411g9205k1335b7739C1256K42524d3747p776
11667e1523A61739J33077a35937H0488J66796c50314A82751G5627A5078L3522
$$ plain form
11746 231835 -304765 -275044 -77264 162967 -77490 93070 -166131 -311667 8005 5977 -394427
11734 300140 -182754 285884 138383 4321 -48005 -57711 -46746 188146 141476 132173 23730
11722 -411753 289492 107067 92096 -145317 -273852 -70926 -121133 -104585 -60921 17208 330836
11711 330836 170267 226431 125695 54882 170719 137111 3090 48996 -175953 212205 223373
11700 223373 169629 -81336 -73280 -14567 101030 159094 76679 90545 497791 -44151 350794
11688 -121637 267995 115137 -82290 -274682 285336 191362 225845 -407536 246851 509975
11678 509975 -15218 239018 114991 185402 -79205 -100540 -27739 31256 273780 -43747 -51523
11667 -51523 161739 294816 -135937 80488 247284 -350314 182751 75627 15078 48600
11657D8600a26801H5283K6796a38223A98872i7533C8970h0699A4848b2619j70265
11646a92884A67286Q1817F5546a60378A0833J04673a298D5253a68426K0877C35588
11634B86679a7646j4988B68926q2718k3242O2158a03755k6226K8520j07842b961
11622A79895c9081B18650q0642b16060R6542B78750n0240i4127B11883o0547K1180
11611A72516n8880E4540a85550D54934h7522D9978K1671a80494O8470B33089F108
11599A33484d1921B51198A21205D6051K2613i6172B4812a5385E7423P1535J85253
11588C14211j32929a38602L2952B36723j10255J25319h8861B41721b2929A87772
11577H0314P2867b08494l7058A35807i7339F63890A25071L2676a30046B85808
$$ plain form
11657 48600 -126801 85283 112079 -138223 198872 -97533 38970 -80699 14848 -22619 -192884
11646 -192884 167286 249103 65546 -160378 10833 115506 -1298 45253 -168426 -147549 335588
11634 286679 -17646 -32634 268926 186208 162966 225124 -103755 -129981 -101461 -209303 -2961
11622 179895 -39081 218650 138008 -216060 -119518 278750 228510 -94127 211883 151336 172516
11611 172516 113636 54540 -185550 454934 -87522 49978 71649 -180494 -112024 233089 6108
11599 133484 -41921 251198 121205 46051 68664 -96172 24812 -15385 57423 128958 314211
11588 314211 181282 -138602 -105650 236723 126468 251787 -88861 241721 -22929 187772
11577 80314 153181 -208494 -245552 135807 -97339 663890 125071 157747 -130046 285808
11566B50220f0891A49190k4767a56886A78921a74405P5364A99873a48067q2112
11556b30179P8021p6614I5909J10994d7315B24329k0800E9401K20721E8225q305
11545D9920a06813A69851b16529D7943J00358d3561C35173j64481p0971J26378
11535B26099b62857A8493M46032k30569o143r3149J69189j47170a32344G4342
11524A06025J69613d7526b0337B11776o4099a78514A89224H5515A2257L18120
11514C30377j51383A3878o886K16624a04589E6310N8627M4905E267a50404d4710
11502B85231D4452a75799B77904c81536B82188E6658a06866A07213J33749l7954
11492B03008a03425D8421J76023J69564D6488J38536K54503C4735a6605D75165
$$ plain form
11566 250220 -60891 149190 124423 -156886 178921 -174405 -99041 199873 -148067 -230179
11556 -230179 -152158 -228772 95909 206903 -47315 224329 203529 59401 280122 58225 49920
11545 49920 -106813 169851 -216529 47943 148301 -43561 335173 170692 99721 226099
11535 226099 -262857 18493 464525 233956 227813 134664 303853 156683 -132344 74342
11524 106025 275638 -47526 -20337 211776 147677 -178514 189224 85515 12257 330377
11514 330377 178994 13878 6992 223616 -104589 56310 114937 159842 5267 -150404 -44710
11502 285231 44452 -175799 277904 -381536 282188 56658 -106866 107213 240962 203008
11492 203008 -103425 48421 224444 394008 46488 185024 439527 34735 -16605 475165
11481A60014J31027R8397e2280A94425Q5701k5350r4903j2466Q9538N211k5544
11470B16612n0867Q412a6252A65969p7316J90997m3100l3522F9529C4266O1406
11459I5672Q1927Q7727i534A24339K6716f9234o1842F141i3063A35698a76082
11447A74842J90132j04169a54278J3918B38415l2512r6502K5213K33396I6081
11436e5335j32485g9307A48886a91261i4592A52513d50753I1197c01886a05218
11425B06190h3036m2350B20206A1067C196Q3602a14532F1903a44474B12478j01178
11414A11300a14906a884l64215C1507Q4684I888J23282K53087B6349J4557h9905
11402G9790g9607K5305M798r6353J6877H4504Q4307i2809A2194O0186b43020H1792
$$ plain form
11481 160014 291041 389438 -52280 194425 280126 254776 159873 147407 236945 242156 216612
11470 216612 165745 174157 -16252 165969 88653 279650 236550 203028 69529 34266 95672
11459 95672 177599 265326 -9534 124339 151055 -69234 -131076 6141 -93063 135698 -176082
11447 174842 364974 260805 -154278 -140360 238415 205903 109401 134614 368010 96081
11436 -55335 -187820 -79307 148886 -191261 -94592 152513 -450753 91197 -301886 -105218
11425 206190 -83036 -125386 220206 11067 3196 86798 -114532 61903 -144474 212478 111300
11414 111300 -114906 -1884 -366099 31507 116191 9888 133170 386257 26349 40906 -89905
11402 79790 -79607 -54302 -49504 -145857 -128980 84504 168811 -92809 12194 72380 -243020 81792
11389a10334J0881j3472B47857k2057j07560J96298A00426c73384f4994B22686
11378B00189b15860A37280K05822j21549k9607n1193d0195j67684A4640J37144
11368A51784J29109I3122j7652C1616d0511o2620A66735c09971d6689k01338P3737
11357a74290B10101E82J98443b33284E2534R5901c5594A34892a14152C06427B2409
11345E3836K80282g7717l8924A56700c8040A78714n4643b42177G2659C2600g9263
11333A82856q7688b36950d0507E2500J23334a52774K108L472o5070B55159n7859
11322A97300F7631O9863H603h6466B95618G1499K82835C4959a2611j07240A12616
11310A61a16362p9435h3853C35693A53742B2704J94369b475A3744o815J37232
$$ plain form
11389 -110334 -99453 -112925 247857 225800 118240 314538 100426 -373384 -64994 222686
11378 200189 -215860 137280 343102 221553 191946 140753 -40195 -207879 14640 151784
11368 151784 280893 93122 75470 31616 -40511 -103131 166735 -309971 -46689 -248027 -174290
11357 -174290 210101 582 199025 -233284 52534 148435 -35594 134892 -114152 306427 22409
11345 53836 334118 -77717 -116641 156700 -38040 178714 124071 -242177 72659 32600 -79263
11333 182856 95168 -236950 -40507 52500 175834 -152774 -150666 -147194 -212264 255159 197300
11322 197300 67631 137494 8603 -86466 295618 71499 354334 34959 -12611 -119851 112616
11310 161 -116362 -195797 -83853 335693 153742 22704 217073 -2475 13744 6929 144161
11299A44161a19511A82287o999b9420j18037d9539l18275a975C349a76463E4145
11287g3795C25889C7743d5837D8308a58823F0008n062M5868a01085G3610q747
11276F4863R5331a85229o5346f1455r974r1231N4622C09470B3047c33423a3409
11264a34940d751j71250A32251L9979d7889K1727A61180a54176a5357o5509p8117
11253a58983G1661d7516l6577K5823H1179K81569g7920k08422E5519A4285a11212
11241c51898J66274A79377a1493A13169K08758b5781A37660r227f2729k74007
11231c36736J63042g0560C45695c1504B34224D7956f1090A98698a50782b9704
11220I8860J21171d986n0645B19386C5951e0877o3272A25305B4655b39292J04988
$$ plain form
11299 144161 -119511 182287 175288 -29420 -147457 -49539 -367814 -1975 3349 -176463 54145
11287 -73795 325889 37743 -45837 48308 -158823 60008 54946 100814 -101085 73610 64863
11276 64863 160194 -185229 -250575 -61455 -71429 -162660 -108038 309470 23047 -333423 -13409
11264 -134940 -4751 -176001 132251 172230 -47889 -26162 161180 -154176 -15357 -80866 -158983
11253 -158983 71661 -47516 -84093 -58270 81179 362748 -77920 -286342 55519 14285 -111212
11241 -351898 -185624 179377 -11493 113169 321927 -25781 137660 128433 -62729 -336736
11231 -336736 -173694 -70560 345695 -31504 234224 47956 -61090 198698 -150782 -29704
11220 98860 220031 -4986 -55631 219386 35951 -50877 -114149 125305 24655 -239292 -134304
11209a34304M3973Q014E000d2941p0261N0028E9043c0266D4916Q6221a4187A4709
11196d5968k8953B16821m8094d64896e9272j73309c1614l53545L0158D6272R8536
11185A44808c32781J36831E6681a69179A12337Q2630g8560A70701A9087a78770
11174c0435n2274j776F9586J93679a11115A14212b60149P5393N3882L6352C29413
11162D0698H607a28347B1929a40470N2958C4765b5355j98696K6544A26678B8006
11150A57091J48803a74893A82793D0089M2096a07375b9844j40075F9024K49688
11140C18712C2358a11252A6467K27303r5826a19024J4291b9005A99420a02111
11129A11780b4005q1246G4730P4436B6612H475a36537B2870J07633a26226A01054
$$ plain form
11209 -134304 -90331 -82317 5000 -42941 -113202 -63174 59043 -30266 44916 131137 -14187 14709
11196 -45968 -74921 216821 168727 -464896 -59272 -232581 -31614 -385159 -355001 46272 144808
11185 144808 -332781 -195950 56681 -169179 112337 194967 -78560 170701 19087 -178770
11174 -30435 -82709 -84485 69586 263265 -111115 114212 -260149 -184756 -130874 -94522 329413
11162 40698 8607 -128347 21929 -140470 -87512 34765 -25355 -224051 -197507 126678 28006
11150 157091 305894 -174893 182793 40089 82185 -107375 -29844 -169919 69024 318712
11140 318712 32358 -111252 16467 243770 147944 -119024 -104733 -29005 199420 -102111
11129 111780 -24005 -105251 74730 149166 26612 8475 -136537 22870 130503 -126226 101054
11117A40905l084c88776A00515J24408h7879n1744B09102h1252A83161o8625i320
11105A39763m0449C3651J30159Q8933J35270q0125A33461k841j9617K5060d7805
11093A74902J33401e4422A37796K49376j24311q7199n4312K08345O7485H9256
11082B67956A5831K82631N5100j31090N9334J80084f1332C42598B3077K82485
11072C05562F4700L25517A48510K79356C7970K11957K58333o7502G8659J87620
11062B66279J54382j83336J94053H1230L67384o7210J31325L15463j73979n5304
11052E98909j73530k5987Q3861L29566l26892K43148K7016L5759p2052j82820
11042E36978K97613j91228j86496K89284j00554n7361L00480k60157L4695j30818
$$ plain form
11117 140905 137821 -388776 100515 224923 -87879 -139623 209102 -81252 183161 114536 -9320
11105 139763 99314 33651 163810 252743 388013 307888 133461 130620 111003 136063 -47805
11093 174902 308303 -54422 137796 387172 262861 175662 121350 329695 397180 89256
11082 267956 15831 298462 353562 222472 281806 461890 -61332 342598 23077 305562
11072 305562 64700 390217 148510 427866 37970 249927 508260 440758 78659 266279
11062 266279 420661 237325 431378 81230 448614 381404 512729 828192 654213 598909
11052 598909 425379 399392 483253 812819 485927 729075 756091 791850 719798 536978
11042 536978 834591 643363 456867 746151 645597 588236 888716 628559 663254 532436
11032E32436r44K48754j76875J24939J23028Q3554p8576p6642k03464J18144l5127
11021F59227L784l19761J63916L14441o9163l29422j49017L76172Q0470m0905
11011F89742J3736k81724J89570k42442L37421m0145q4483J13429l0718j62027
11001E02359L55267j89651P6956j130K804l1909J58510J05990k06405J47660j14112
10990H06339K1592m5533J53718j24109L67962k74136J04478j67813J40850N20032
10980A503380k24847R4767K3486K32794m6418J65094L33886O15493J74530J72458
10970C044623m28125K08536l01822J71506r4695l86433k84770J7008k40672M04087
10960B109243q4664l6697j31989K18048j87184K06223m48729q2546k18095j19009
$$ plain form
11032 532436 531492 780246 603371 728310 851338 934892 856316 779674 576210 694354 659227
11021 659227 663011 343250 507166 821607 752444 423022 274005 650177 730647 689742
11011 689742 703478 421754 611324 368882 706303 666158 581675 695104 664386 502359
11001 502359 857626 667975 744931 743801 746605 714696 873206 979196 772791 920451 806339
10990 806339 827931 782398 936116 812007 1179969 905833 1010311 842498 983348 1503380
10980 1503380 1278533 1373300 1396786 1629580 1583162 1748256 2082142 2697635 2872165 3044623
10970 3044623 2616498 2825034 2523212 2694718 2600023 2213590 1928820 1945828 1705156 2109243
10960 2109243 2024579 1987882 1855893 2073941 1886757 2092980 1644251 1561705 1343610 1224601
10950A224601m86197J70994j1198j28712A11390M46877l939K2216k69097M4665
10940C52112J19922m4677j37317E6774O1330l6677N8054C0281K02241I2556K56524
10929C49080f1570B78173a73974I8486e8175A37089m7290b2766G0a72594C20519
10917b33211c3409J4893k231l9320C5536J60312A4805e37534B25034p1796n125
10906A48113D4135Q088b6286B00877g6638p2170b5881C03563l4844b59668L5649
10895b24019Q2536D9912K9862a62456B20358B646d77490B33516e7620A55822F1977
10883b89873B20592g3156j91867d1843l24619D0378d9662J5622B91103j09328
10873A81775j883o7361L1236j9010F2271K9842P8221p4453B1647a78865E6338
$$ plain form
10950 1224601 738404 909398 898200 769488 111390 558267 554328 576544 307447 352112
10940 352112 472034 427357 290040 56774 118104 81427 139481 30281 232522 92556 349080
10929 349080 -61570 278173 -173974 98486 -58175 137089 89799 -22766 70 -172594 320519
10917 -233211 -33409 -18516 -20747 -60067 35536 195848 14805 -537534 225034 153238 148113
10906 148113 44135 52223 -26286 200877 -76638 -148808 -25881 303563 268719 -259668 -224019
10895 -224019 -141483 49912 79774 -162456 220358 2646 -477490 233516 -57620 155822 61977
10883 -289873 220592 -73156 -265023 -41843 -366462 40378 -49662 -34040 291103 181775
10873 181775 179892 112531 143767 124757 62271 92113 170334 95881 21647 -178865 56338
10861a95822B84123C6901K81280a93961A07042k7293a42427e6732m72905A36403
10850A18716J39396h7730A08566b22481C7234a6627p3639d2593p6040A89555H1515
10838E6192J21563o7546c35785a57871N9006r1653A04479A0943J79756f8149r9970
10827a68119A18080a4831m2492I0263K79136d09626D4119h7797B63835a20179
10816A23059a583l9966I2079b05392Q8908I7305a98027j47809A17644i8977m2475
10805a41452D4558a6594n7352A06929h3891j3096B78580j23279a42756A01854
10794a349F1323a12819I8264L4437J91199a87687l1512Q7326A06527E239P9187
10783H4426C572a74045J007L2736H3695g8202J2895j12716F0754F990a36458j06244
$$ plain form
10861 -195822 284123 36901 318181 -193961 107042 79749 -142427 -56732 -529637 136403
10850 118716 258112 -87730 108566 -222481 37234 -16627 -90266 -42593 -118633 189555 81515
10838 56192 177755 110209 -335785 -157871 -98865 -190518 104479 10943 190699 -68149 -168119
10827 -168119 118080 -14831 -57323 90263 369399 -409626 44119 -87797 263835 -120179
10816 123059 -1583 -41549 92079 -205392 -116484 97305 -198027 -345836 117644 -98977 -141452
10805 -141452 44558 -16594 -73946 106929 -83891 -96987 278580 155301 -142756 101854
10794 -1349 61323 -112819 98264 132701 323900 -187687 -219199 -131873 106527 5239 84426
10783 84426 3572 -174045 -173038 -140302 83695 -78202 -65307 -178023 60754 6990 -136458 -242702
10771b42702D5797d13112d5870A08350e82A53021d3703A22667E7215J36742i7818
10759h0176I645L85351e1811A0941b4032C2237d29529a37409d5475A90892a64520
10747B14650b4753j87404A87361l1937b0627A07365r056o505h2272j37310A42810
10735A5113J83123a3558p186B02554a95494G1152b8639H3293a62463H2287k6239
10724E6048A1073N9978i0873A03546a57688g5166o0610k3632M6826A9428b64998
10712c6926o1859A63911D5040b1147l8576K9323k10164g8178a7391l31226a71642
10700C38849a71128G7369a0291j28048B2003a3996j9756r1226j80403F7472d23501
10688a0810l21047d4420m49303C72489d223B20189i202B03714F6828c55174a07162
$$ plain form
10771 -242702 45797 -413112 -45870 108350 -582 153021 -43703 122667 57215 193957 -97818
10759 -80176 9645 394996 -51811 10941 -24032 32237 -429529 -137409 -45475 190892 -164520
10747 214650 -24753 -212157 187361 155424 -20627 107365 98309 91804 -82272 -219582 142810
10735 15113 198236 -13558 -20744 202554 -195494 71152 -28639 83293 -162463 82287 56048
10724 56048 11073 71051 -90873 103546 -157688 -75166 -135776 -159408 -112582 19428 -264998
10712 -36926 -98785 163911 45040 -21147 -59723 -30400 -240564 -78178 -17391 -348617 -171642
10700 338849 -171128 77369 -10291 -138339 22003 -13996 -33752 -124978 -305381 67472 -423501
10688 -10810 -331857 -44420 -493723 372489 -4223 220189 -9202 203714 66828 -355174 -107162
10676a44458H1894c19485i9511L3630G1153d0809m5098I610a22248e5574j71908
10665b27482g9893b4009l03263a1021J275n75198f6608E3311E527d55476a37782
10653b2046j3197k0909A26319l0695e2380i87r9224j3575d4392j37429f3486K6503
10641c6983j80398D8895d2168R917J142k27089N9972D3850c4849G617a46905L5102
10629a11803k27800b5768R229j35444E0373L9620c4327D3161a02363n0327j9535
10618a72225o0378Q0386C6811O6559b00582j52505B12389i8710j6590k56670i9145
10606g6194a5196B13504B5401L74737a69035L9966k9160j07337g4370B10067K21302
10595D31369i6797J3346G8211a71983N3642i020j3298j47066j22955f9062k9292
$$ plain form
10676 -144458 81894 -319485 -99511 -65881 71153 -40809 -85907 9610 -122248 -55574 -227482
10665 -227482 -79893 -24009 -327272 -11021 -9746 -584944 -66608 53311 5527 -455476 -137782
10653 -22046 -35243 -56152 126319 95624 -52380 -987 -100211 -113786 -44392 -181821 -63486 -36983
10641 -36983 -217381 48895 -42168 -32251 -31109 -258198 -198226 43850 -34849 7617 -146905 -111803
10629 -111803 -339603 -25768 -16539 -151983 50373 89993 -34327 43161 -102363 -152690 -172225
10618 -172225 -232603 -152217 36811 103370 -200582 -353087 212389 -98710 -115300 -371970 -99145
10606 -76194 -15196 213504 25401 400138 -169035 -129069 -158229 -265566 -74370 210067 431369
10595 431369 -96797 -83451 78211 -171983 -118341 -9020 -22318 -169384 -292339 -69062 -98354
10584i8354B39740a14926N1529B1650P5999J5840a03707E8359a33290A47729K5098
10573A72827b5721j40510B38084a48523A7353b38114A38639a9048k63957A82146
10562H7905a46013B09779K371b68924l7276C8920J16675M300d4082H5288b85258
10550B04456c15582I1639g7826a5443k2853l52227A13980e3955p0825F9945c81020
10538C05519a85924F6309f6711A79810F5506O0894D2147L66861A83597f0938j92936
10527b53874A39576o020b01299A2668g3120K5692G5062d55897A36566a19867n2208
10516a72075g9028j13567B58993H3824a28975B2424i2392K1544A53464c0253J3843
10505a6410K213A29554b47638E9753d21301B44648G303c8150j6353K1714C54131
$$ plain form
10584 -98354 239740 -114926 -63397 21650 97649 113489 -103707 58359 -133290 147729 172827
10573 172827 -25721 -166231 238084 -148523 17353 -238114 138639 -19048 -283005 182146
10562 87905 -146013 209779 212150 -268924 -306200 38920 155595 159895 -44082 85288 -285258
10550 204456 -315582 91639 -77826 -15443 -38296 -390523 113980 -53955 -124780 69945 -381020
10538 305519 -185924 66309 -66711 179810 65506 126400 42147 409008 183597 -60938 -253874
10527 -253874 139576 133556 -201299 12668 -73120 -47428 75062 -455897 136566 -119867 -172075
10516 -172075 -79028 -192595 258993 83824 -128975 22424 -92392 -70848 153464 -30253 -16410
10505 -16410 -14197 129554 -247638 59753 -421301 244648 7303 -38150 -54503 -32789 354131
10493b07535g6862A6071a3306j96283j40413A91281r3905J52153c0561C82381
10482A97875h4761B64048K4783L39112C07216A41215J40216A15540J59977b5329
10471b84707a29135a8404A35299o0276f3922L950l8259C5564K9993a49625G2635
10459B569a11848k51496A98411b4581o7676N762A32265e2396A37912I059M4481
10448E3540M7464k2769d9391l6825A28576e269A48623p326R0748l4625b63997
10436A58904n1805L0156J30070j26043O9012A9601N8221i944o2931I3825B981
10424a46390m2454j08802j41184K11237N5211l0530E1638M7773b71335G9963p338
10413G2625b57818h6608e59A20037m7066a06020B32526a77673A98689a69137l75928
$$ plain form
10493 -207535 -76862 16071 -13306 -209589 -350002 191281 97376 249529 -30561 382381
10482 197875 -84761 264048 288831 627943 307216 141215 281431 115540 275517 -25329
10471 -284707 -129135 -18404 135299 75023 -63922 -59972 -98231 35564 65557 -149625 72635
10459 2569 -111848 -363344 198411 -24581 -92257 -86495 132265 -52396 137912 9059 53540
10448 53540 101004 78235 -49391 -86216 128576 -5269 148623 141297 232045 197420 -263997
10436 158904 107099 137255 267325 141282 210294 19601 77822 -9944 -72875 93825 2981
10424 -146390 -188844 -297646 -438830 -227593 -172382 -202912 51638 99411 -271335 79963 72625
10413 72625 -257818 -86608 -559 120037 72971 -106020 232526 -177673 198689 -169137 -545065
10402e45065E9432a980j32490p7933O9588D4070a32243A47832a1208C04586d18815
10390A32324E1607a2166B00252a09909I6423b67263D94981A02559C4689O5577
10380A00266N3590M9064J08142q3791j09878C4238K9858M05632B13041p4612K15951
10369C54380j4839l798R4902L5361I6315N17682j04746m8307A78897a07593B28713
10357E01697g0641B5787J19186E6193K01418K45414K05761j33206k43439J64000
10347D96141G4398L75537k9170K20254j17767j3962j26507j564A53701P4267f9922
10335A98275r7793J60265b76825B64909p4393l919J50188f7094A95571b69478
10324d275m53406B22823L7742E1721K51319G5245J80829I4913a57816K0506B20903
$$ plain form
10402 -545065 59432 -1980 -134470 -212403 -142815 44070 -132243 147832 -11208 304586 -418815
10390 132324 51607 -12166 200252 -109909 96423 -267263 494981 102559 34689 100266
10380 100266 153856 202920 311062 227271 117393 34238 64096 469728 213041 138429 354380
10369 354380 339541 335743 430645 466006 96315 613997 509251 460944 178897 -107593 228713
10357 501697 -70641 25787 144973 56193 257611 503025 708786 575580 332141 496141
10347 496141 74398 449935 420765 641019 523252 509290 382783 381219 153701 227968 -69922
10335 198275 100482 260747 -276825 264909 190516 186597 336785 -67094 195571 -269478
10324 -4275 -457681 222823 260565 51721 303040 75245 256074 94913 -157816 -137310 220903
10312D00795n9553A27147f3491A62617a35036F3971Q4739n9795g4020B14872b45597
10300b52673F7676D22Q0479c7239f343E3664i8966j91034A37323F1249f9847j47435
10288b17282Q5817K1899L7860m6618m9662o5840n0069D2114L11300f13658P1127
10277e42531A17681c4581l46183H7603K8640R7181J50393g4820A62690k4291d2454
10265f0133q5518A45502a1746A29574J30485j7761l4716J16618P0514J89994k76721
10254C07987A48342L8778J46289c6980F5987d19724D9312c3448B85018d6344j59987
10243b06331b2459l83875A6494P2464H374J16829a14858B36431C2724J21111f5207
10231b38214I417a21099l46029a51241l4278D08533H9764B7419b5553l19876i678
$$ plain form
10312 400795 341242 127147 -63491 162617 -135036 63971 148710 88915 -74020 214872 -245597
10300 -252673 67676 422 80901 -37239 -6343 53664 -98966 -290000 137323 61249 -69847 -217282
10288 -217282 -131465 -109566 -71706 -118324 -167986 -233826 -283895 42114 353414 -613658 -542531
10277 -542531 117681 -34581 -380764 87603 116243 213424 363817 -74820 162690 138399 -42454
10265 -60133 -145651 145502 -11746 129574 260059 242298 207582 324200 394714 584708 307987
10254 307987 148342 187120 333409 -36980 65987 -419724 49312 -33448 285018 -46344 -206331
10243 -206331 -22459 -406334 16494 88958 8374 125203 -114858 236431 32724 153835 -65207
10231 -238214 9417 -121099 -467128 -151241 -185519 408533 89764 27419 -25553 -345429 -9678
10219B359a75466F5034M4510b01410I8366b9503D3638Q2146J96931j54848c66531
10207H4061d1364n3837A34554E8082e6109J3439a1023A69239e9323k56931d9671
10195E0860A6290a24649B02519P0362p0940c7910I1829n257e1490a7403A97138
10183a90347B5734P6497a92914c9519B4293K03851I1364N8006a96351j58410b5784
10171h5951D0921a45051d3196A53614f8828p2290j48481C990K5131R4961d27622
10159a97949Q9198A01828b37160b2557q9659F4741a02573r8786j85874a22396
10148A78716R465b77327M8007A20144b9527k03433A25754D3158f0369B06411c14978
10136a16490A22210b97496M1434B0983c74780A22810b53240e7969A12881a062
$$ plain form
10219 2359 -175466 65034 109544 -201410 98366 -29503 43638 125784 322715 167867 -366531
10207 84061 -41364 -95201 134554 58082 -56109 -42670 -11023 169239 -59323 -316254 -49671
10195 50860 16290 -124649 202519 272881 201941 -37910 91829 86572 -51490 -17403 197138
10183 -190347 25734 102231 -192914 -39519 24293 228144 91364 149370 -196351 -354761 -25784
10171 -85951 40921 -145051 -43196 153614 -68828 -141118 -289599 3990 29121 124082 -427622
10159 -197949 -108751 101828 -237160 -22557 -112216 64741 -102573 -201359 -387233 -122396
10148 178716 188181 -277327 -229320 120144 -29527 -232960 125754 43158 -60369 206411 -314978
10136 -116490 122210 -297496 -256062 20983 -374780 122810 -253240 -57969 112881 -1062
10125a06985j30379p0628g8309G4822e3831B2091b19574D3839h9593A3142O695
10114A9837J46655b29526A86675m8466b49554N0727O5605J4510H5170P629h699
10102a67324e1354r7403N8738c5872B25121a17875j49889o9149C592K17480B9033
10090f1582o50855A9532e76143b2314B50833b47710E95925a72620E2328a18308
10079b68626c9712p2544j95617Q2770R9345I9948b7210A81517c52362H456d7870
10067f3254K2927j2886k86998B54964a33844f4821k05082E111g4556j50665A69343
10055A10811J7760K3209i3940k41912a34667r9670F3810J77641C8146d3141i007
10043d20611G3657a47998C35596a07101B99429j23982B9428b57134a26937e7198
$$ plain form
10125 -106985 -237364 -307992 -78309 74822 -53831 22091 -219574 43839 -89593 13142 19837
10114 19837 166492 -229526 186675 138209 -249554 -198827 -133222 -118712 85170 92799 -8699
10102 -167324 -51354 -148757 -90019 -35872 225121 -117875 -267764 -336913 3592 221072 29033
10090 -61582 -712437 19532 -576143 -22314 250833 -247710 595925 -172620 52328 -118308
10079 -268626 -39712 -112256 -307873 -225103 -125758 99948 -27210 181517 -352362 8456 -47870
10067 -63254 -40327 -53213 -340211 254964 -133844 -64821 -269903 5111 -74556 -225221 169343
10055 110811 128571 151780 -93940 -335852 -134667 -234337 63810 241451 38146 -43141 -9007
10043 -420611 73657 -147998 335596 -107101 299429 175447 29428 -257134 -126937 -57198
10032b22253Q3214f8510q6726b56l43893J39009P8821l9418j23409M2585f661
10020a20682m1791j97169a48989n3204H3351o984j1048a12451I0749b90365J07100
10009a83265f5865j6136B5905q837g8418a5142I6688d3234l6184n2832q0592G3538
9996c46850Q976A21327N934a75403A2409a21097d9542F0124d740E2556b40259
9984d39398O9371a51285j6408a6828l32286a56049K3074j18818l30686a44151
9973G8110A497a88248j1558C04151b16878b2181k09542K1367c9914l5758O653
9962f9019K6616o8185C5481b08440A55101D819J39124a81420B15995a36390B07853
9950g8458k4201P494r4734a8737j68808k00879k3167c1132j77666A09454d04007
$$ plain form
10032 -222253 -139039 -68510 -155236 -256 -344149 -205140 -126319 -165737 -289146 -246561 -6661
10020 -120682 -162473 -359642 -148989 -202193 83351 76367 65319 -112451 90749 -290365 -183265
10009 -183265 -65865 -82001 25905 17068 -78418 -15142 96688 -43234 -79418 -132250 -212842 73538
9996 -346850 -337874 121327 127261 -175403 12409 -121097 -49542 60124 -4740 52556 -240259
9984 -439398 -370027 -151285 -167693 -16828 -349114 -156049 -132975 -251793 -582479 -144151
9973 78110 1497 -188248 -199806 304151 -216878 -22181 -231723 -210356 -39914 -75672 -69019
9962 -69019 -42403 -110588 35481 -208440 155101 4819 143943 -181420 215995 -136390 207853
9950 -78458 -102659 -95165 -189899 -18737 -187545 -388424 -411591 -31132 -208798 109454 -404007
9938B965a05905p2945c6479o9514j09358O799h9156o2921A49971g5141R275j98487
9926b64353a27114o0786j31775e7912j06669D26709D4328K75445b0681r7036B12719
9914a74866E9668a13484k22643R3498b9319k84805a55267a9013A164R1694e3777
9902c84140i29p9975J5254A49667F6817b22926P998H1481a67390I405c633k5862
9890b9495k03502O2387j4233c1233A26743a11943d8921k2721g290b138j61883
9879a64021e1359D2874J62761i0438l514A20464B3677L37895g864A7499O8944
9868H6443K23585d1206k32349J0908J23063e9472F9030J58397H9733c7654A9153
9856b41545j95481a92434k33583b2782l11524b1536I9224e4435j26929A38852
$$ plain form
9938 2965 -105905 -178850 -36479 -105993 -215351 -208552 -89156 -152077 149971 -75141 -65866 -264353
9926 -264353 -127114 -187900 -319675 -57912 -164581 426709 44328 319773 -20681 -117717 212719
9914 -174866 59668 -113484 -336127 -242629 -29319 -314124 -155267 -19013 1164 92858 -53777
9902 -384140 -929 -80904 -65650 149667 66817 -222926 -214928 81481 -167390 9405 -3633 -29495
9890 -29495 -232997 -170610 -184843 -31233 126743 -111943 -48921 -71642 -7290 -2138 -164021
9879 -164021 -51359 42874 205635 -90438 -93952 120464 23677 361572 -7864 17499 86443
9868 86443 310028 -41206 -273555 -262647 -139584 -59472 69030 227427 89733 -37654 19153
9856 -241545 -437026 -192434 -426017 -22782 -334306 -21536 99224 -54435 -181364 138852
9845a37504K5596H1262j4867e5622C11519a37603D1377a77724h2457A37828O9999
9834B07827c79096a80531e6271p9724A06361i0849j40880a04764G0543J0211d986
9822b70641A36209a70070B85757R2151D4498c08017j0400b0204k00207h1406c0119
9810C39319c4329B4617E526J70058h3130A86787N4528i30j05542a7377j27533
9799a44910r1924a08560j67821A17285a3888j74087A54874k6948I570e46325a10552
9787a9401l25844k3404F0191b06773g2471J2980m6998c3008q481o3814k16516
9776c21819J52035O8314J8805b2330E319c19680a11427d7105o8718I0290r45a04780
9763b05125Q1988m3532j15234d7192H3613K4737m0397b08893a2665p4681J0789
$$ plain form
9845 -137504 -111908 81262 66395 -55622 311519 -137603 41377 -177724 -82457 137828 207827
9834 207827 -379096 -180531 -56271 -135995 106361 -90849 -231729 -104764 70543 80754 -4986
9822 -270641 136209 -170070 285757 377908 44498 -308017 -318417 -20204 -220411 -81406 -30119
9810 339319 -34329 24617 5526 175584 -83130 186787 241315 -930 -106472 -17377 -144910
9799 -144910 -236834 -108560 -276381 117285 -13888 -187975 154874 127926 9570 -546325 -110552
9787 -19401 -345245 -368649 60191 -206773 -72471 -59491 -106489 -33008 -41489 -105303 -321819
9776 -321819 -169784 -101470 -82665 -22330 5319 -319680 -111427 -47105 -115823 90290 89345 -104780
9763 -205125 -123137 -166669 -281903 -47192 83613 108350 67953 -208893 -12665 -87346 -76557
9752g6557A22297c51867L9876J36920B01808D5522d36570J30839A07310f369C762
9740A98424g6132b1279o0119D11c61934A41890a23508F8806a700m9515A51218
9728a24861Q904J5395c6710m1020o1263B69783C3321i1309n3098n1502f9176K4308
9716d4868j34874M989A19182a17233E7151q522c60257H3567f7063k98872J61402
9705b04533G3085b38281b7363C31713A52913E2189h3832A0828J81363c70508O4957
9694c05551R2589q6854A03802b09229j63623n65a30548p6957q5883J40531q1568
9683b34425b7201m28203g4647A80773N0642b19818B03636b44700a9835D508a63684
9671a84949h4012q0337B16307f0291A70695c31833A95443H5974J1061b43908R0662
$$ plain form
9752 -76557 122297 -351867 -311991 -175071 201808 45522 -436570 -305731 107310 -6369 3762
9740 198424 -76132 -21279 -81398 411 -361934 141890 -123508 68806 -1700 -51215 151218
9728 -124861 -115957 -100562 -36710 -77730 -138993 269783 33321 -91309 -144407 -195909 -69176 -44868
9716 -44868 -179742 -174753 119182 -117233 57151 48629 -360257 83567 -67063 -365935 -204533
9705 -204533 73085 -238281 -27363 331713 152913 52189 -83832 10828 192191 -370508 -305551
9694 -305551 -212962 -299816 103802 -209229 -372852 -373417 -130548 -207505 -293388 -152857 -234425
9683 -234425 -27201 -455404 -74647 180773 231415 -219818 203636 -244700 -19835 4508 -163684
9671 -184949 -84012 -164349 216307 -60291 170695 -331833 195443 85974 97035 -243908 -153246
9660a53246N3987k12952O8078I7499b40623J04254K8743f515I779R3686J72582
9649B76047f4940H9243C5451L20296j60497b660j15185B07752e114j14965c1554
9637e05884a01475B29446b53761B20807I3433a63750m0798a01003k21447f6679
9626d0570k94072a66442h3207j77006G9561a10389G1000d8591D3144k772c30157
9614a30419n822A7965O770c8898h54j21675j5409L1226b0967k55845J33169m4789
9602a88432f3558B1968b75180j78345g9510k98028J0462c143j12333A5943a63512
9590d0663r935N728o7169e1917j52540A71966H3568K9573d01149f4113A92086
9578B21974a39731a435A2177O0381J4694f5779B23636a44730j44182A06014h8567
$$ plain form
9660 -153246 -99259 -312211 -244133 97499 -240623 -136369 -107626 -6515 9779 103465 276047
9649 276047 -64940 89243 35451 355747 195250 -2660 -117845 207752 -5114 -120079 -31554
9637 -505884 -101475 229446 -253761 220807 93433 -163750 -204548 -101003 -322450 -66679
9626 -40570 -334642 -166442 -83207 -260213 79561 -110389 71000 -48591 43144 40372 -330157
9614 -130419 -136241 17965 24735 -38898 -854 -122529 -137938 -106712 -20967 -276812 -143643 -188432
9602 -188432 -63558 21968 -275180 -453525 -79510 -377538 -367076 -3143 -115476 15943 -163512
9590 -40663 -50598 -44870 -112039 -51917 -204457 171966 83568 113141 -401149 -64113 192086
9578 221974 -139731 -1435 12177 72558 87252 -65779 223636 -144730 -288912 106014 -88567
9566A88102e1659o0792J8516a6462j56624C02505j03741d52465A09384E1510J83815
9555B35325b1383n8455j82250A20190J31610D988a68295j7285N0182m9190P0802
9544a13786A0774f7425j34951b0943A66173b18486A33064D1873a58829k43655
9534d02484g2107L4222H5234a01244p4200j94575I3569b05085A22471J65756D7338
9522a78274A21103f1162B53774b723F1929c6125l4942C3637d16841E4171a53577
9510A18257b23313j57293A87186b8856l57431J5708c2572H4668J62107a67936
9499b00658a7169j73614A7686d4576j22964E0557P1216a79916B9333h4859R677
9488g5182R418l34945d1894k84851e8812b6783C17243b31880A29756c41419a03387
$$ plain form
9566 188102 -51659 -112451 -93935 -16462 -173086 302505 198764 -452465 109384 51510 235325
9555 235325 -21383 -79838 -262088 120190 251800 4988 -168295 -185580 -135398 -184588 -113786
9544 -113786 10774 -67425 -202376 -20943 166173 -218486 133064 41873 -158829 -402484
9534 -402484 -72107 -37885 85234 -101244 -175444 -370019 93569 -205085 122471 288227 47338
9522 -178274 121103 -61162 253774 -2723 61929 -36125 -71067 33637 -416841 54171 -153577
9510 118257 -223313 -380606 187186 -28856 -386287 -370579 -32572 84668 246775 -167936
9499 -200658 -17169 -190783 17686 -44576 -167540 50557 121773 -179916 29333 -84859 -75182
9488 -75182 -65764 -400709 -41894 -326745 -58812 -26783 317243 -231880 129756 -341419 -103387
9476b57728M2222C68947d52395A70042C5629b08325A96008a09952K6174B88334
9465i6407j40902c4027I8447a44232K1527I7453c70417a02112K7657J2318l4611
9454i6748o5566j26590B52304F9532f1096r3747P3850a9352A24434f5987A60816
9442i9615j29923N2931o634Q1875r6812C1572J8667J17760p0710l7077L4805h0970
9429c37773B42529g3096n0586B31706E5002a20427Q379p572o1131d660E1275b74480
9416h5209k15139D12946A86934a27335k33240i6909K1223i053j07650j7340N9465
9405g4578b0744j78396c1803A25605d43970b1192p7302M0293b5366n25791g3490
9393A95253o1221J21592b38946J02889j91140g0073j05802A40917b13892e0080
$$ plain form
9476 -257728 -215506 368947 -452395 170042 35629 -208325 196008 -109952 -83778 288334
9465 -96407 -237309 -34027 98447 -144232 -122705 97453 -370417 -102112 -74455 -62137 -96748
9454 -96748 -162314 -288904 252304 69532 -61096 -154843 -80993 -19352 124434 -65987 160816
9442 -99615 -229538 -176607 -183241 -101366 -198178 31572 50239 167999 97289 60212 95017 -80970
9429 -337773 242529 -73096 -123682 231706 55002 -120427 -112048 -119620 -180751 -4660 51275 -274480
9416 -85209 -300348 412946 186934 -127335 -360575 -96909 -75686 -9053 -116703 -134043 -74578
9405 -74578 -20744 -199140 -31803 125605 -443970 -21192 -98494 -58201 -25366 -551157 -73490
9393 195253 134032 255624 -238946 -136057 -327197 -70073 -175875 140917 -213892 -50080
9382B93318g7846l90587B03683r9976a34999k67719D0043b86208h439H6632g1549
9370d4188A05598M1241c74628I1958M7361a4620j29350j76911q4315g1091n9024
9359a30115j07899q5851c2679A333J19724b78916D479i719A49256e278m09148
9348d14426P8503c8036I0877L0202a10882J5334k42804F5873l1170b8737l94931
9337d23668J21425j57749I666a36846M8411l31515C05503o9296g7929B16914i7103
9325a22064C71585E7813c58240g6148j02518j51654A65762a94647h9315B40281
9314C1562f8448b46l57952D4599d52797M8918e3891j97165i5123j8G9540a56462
9301a93637B75640D0954L3727k3028e591A29353J1409a33802j50815a05043B29488
$$ plain form
9382 293318 -77846 -468433 203683 103707 -134999 -402718 40043 -286208 -8439 86632 -71549
9370 -44188 105598 146839 -374628 91958 139319 -14620 -143970 -320881 -405196 -71091 -130115
9359 -130115 -238014 -323865 -32679 1333 121057 -278916 4479 -9719 149256 -5278 -414426
9348 -414426 -335923 -38036 90877 121079 -110882 -95548 -338352 65873 34703 -28737 -423668
9337 -423668 -302243 -459992 9666 -136846 -88435 -419950 305503 236207 -77929 216914 -97103
9325 -122064 371585 57813 -358240 -76148 -178666 -330320 165762 -194647 -89315 240281
9314 31562 -68448 -246 -358198 44599 -452797 -403879 -53891 -251056 -95123 -95141 79540 -156462
9301 -193637 275640 40954 74681 51653 -5591 129353 140762 -133802 -284617 -105043 229488
9289f0943k0119q1694A60447a65900N6178q2627h0871L3315m2915G4609L1134
9278A05743i6653A15907d03900A49634J24768a22497A44352B0042J30158B5653
9267f5509j50410h6135j75995i4030r2036Q9000H0559A4346a38591o7544r0128
9256b96263E979J64120a12011B28553J26506a51441N8165h430l90647a33851C46105
9244E2524b00933a0081j2623k24256B81813A32022K0218b9697j83232Q2538j54421
9233b84812n2505A659c35208i8342E1947J07988b64206I1040A8725b12061L6944
9222a75117P8890o0075M028F8125J16203a68392R604I9367b03873j26880J64930
9211a65823C82394a00797C94170c6260j78002A53241i7363k00791H0028K6173
$$ plain form
9289 -60943 -81062 -162756 160447 -165900 -109722 -192349 -80871 -47556 -90471 74609 105743
9278 105743 -96653 115907 -403900 149634 274402 -122497 144352 20042 150200 25653
9267 -65509 -215919 -86135 -262130 -94030 -186066 -97066 80559 14346 -138591 -206135 -296263
9256 -296263 5979 170099 -112011 228553 355059 -151441 -93276 -8430 -399077 -133851 346105
9244 52524 -200933 -10081 -22704 -246960 281813 132022 152240 -29697 -212929 -130391 -284812
9233 -284812 -337317 1659 -335208 -98342 51947 159935 -264206 91040 18725 -212061 -175117
9222 -175117 -96227 -156302 -152274 68125 184328 -168392 -158788 99367 -203873 -330753 -165823
9211 -165823 382394 -100797 394170 -36260 -214262 153241 -97363 -298154 80028 106201
9201A06201l9674b63987O1108B3676J38099b91097A03775a79185E9520P9072Q8385
9190B26977e8607B6768f648A44435L8059a41323M2131r5012A13618b56100P5966
9179a80134k03347a07552d8260A83828C6213a09758j20639g3782o2788O0826M691
9168g1053A68123F2761J17717c8164a3822k86348h1920A52450a344A33311J24163
9157B57474l204g6509j11912A5283a75543B98434A47670A6321a78684B3820j1293
9146A2527f8525l83443d2590k91716a59844b9314n2432B90583H3652K04820a03195
9134a64933f5334b2097g293k34843Q0361A15506a52373A46210a59100J8308k304
9123a43096r621b7977j46116e5336B6214a54418B32044r0257B0312J43601k5857
$$ plain form
9201 106201 66527 -263987 -202879 23676 161775 -291097 103775 -179185 59520 138592 226977
9190 226977 -58607 26768 -6648 144435 182494 -141323 -99192 -194204 113618 -256100 -180134
9179 -180134 -383481 -107552 -48260 183828 36213 -109758 -230397 -73782 -136570 -75744 -71053
9168 -71053 168123 62761 180478 -38164 -13822 -300170 -81920 152450 -1344 133311 257474
9157 257474 254270 -76509 -188421 15283 -175543 298434 147670 16321 -178684 23820 12527
9146 12527 -68525 -451968 -42590 -334306 -159844 -29314 -81746 290583 83652 288472 -103195
9134 -164933 -65334 -22097 -7293 -242136 -161775 115506 -152373 146210 -159100 -140792 -143096
9123 -143096 -152717 -27977 -174093 -55336 26214 -154418 232044 141787 20312 163913 138056
9112A38056o4601a54544j17309Q6872C80599a54970I4653J8699K4570a63765r0459
9101b54224D621J08788n1932f4172B9347a36944A37167M6627F88N70390F9324
9089c5931I7586a14436p427j18164J16771D5139O1969a41609B1007a72728O9795
9078a02933C1100a69708A09582B0847b12113A44833J7314f7607j14330F9601i164
9066f5535k09545J5922l6740Q6132r1812G2504g0821L0039a9305l20340J52959
9055a86686i811k26911H98d00459J9434J10822B05625I9456e889k9167l4500A82191
9042c35348B29293b6928r4446j03660j55676D8239A0144a10855E8063b60171j77643
9031d37814a70663k3974A25042E8157C576h2160o0315j48180a02459K5857j30167
$$ plain form
9112 138056 73455 -154544 -271853 -184981 380599 -154970 94653 113352 137922 -163765 -254224
9101 -254224 4621 113409 61477 -64172 29347 -136944 137167 183794 688 571078 69324
9089 -35931 97586 -114436 -121863 -240027 -123256 45139 107108 -141609 21007 -172728 -102933
9078 -102933 31100 -169708 109582 20847 -212113 144833 162147 -67607 -181937 69601 -9164
9066 -65535 -275080 -259158 -295898 -209766 -301578 72504 -70821 -40782 -19305 -339645 -186686
9055 -186686 -9811 -236722 898 -400459 -381025 -270203 205625 99456 -5889 -35056 -69556 182191
9042 -335348 229293 -26928 -121374 -225034 -380710 48239 10144 -110855 58063 -260171 -437814
9031 -437814 -170663 -194637 125042 58157 3576 -82160 -142475 -290655 -102459 -76602 -206769
9020b06769L3059j88452C6062Q3663a15959C7282d03187f0982j46376J2152E5432
9008d37250e5417F5368a78020p1128f7372j46403a05983H9853J59007a15327E7829
8996b35168A38581E7779J58531c00791d4404J1182B6990i1098l85676c7426H9662
8984B6823L21429b0049C6663a66959l56609J80275A24837K06820a70352N4781
8974a15571c9408o6222c1075o212C1b40580F1642L7884e3537k09907C9960d69313
8961a96923Q0324j70425J32727o1610d6022a0742k95695d3002A57310e30A18373
8949a42707J5735k93495C19719a05167M4996j65935p2131J48448a9965I4263b54569
8937a8181r4950j80014h3254F4016J93806b0391j98255j46253C9193b40152B0753
$$ plain form
9020 -206769 -173710 -362162 36062 119725 -115959 37282 -403187 -60982 -207358 -195206 55432
9008 -437250 -55417 65368 -178020 -249148 -67372 -213775 -105983 89853 248860 -115327 57829
8996 -235168 138581 57779 216310 -300791 -44404 -33222 26990 -91098 -476774 -37426 89662
8984 26823 348252 -20049 36663 -166959 -523568 -343293 124837 331657 -170352 -115571
8974 -115571 -39408 -105630 -31075 -37287 31 -240580 61642 99526 -53537 -263444 39960 -469313
8961 -196923 -116599 -287024 -154297 -215907 -46022 -10742 -306437 -43002 157310 -530 118373
8949 -142707 -126972 -420467 319719 -105167 -60171 -226106 -298237 -149789 -19965 94263 -254569
8937 -18181 -113131 -293145 -83254 64016 257822 -20391 -218646 -364899 39193 -240152 20753
8925A57912a02967F40826K74550K343256J118618I14303C1711L23220j52687A1365
8914a18719D8774J04417B4481h2906H6135A5454L17449a02808A69882g436C41117
8902C47472D6028c609j452H7555M229a00250b0293D02272c0022j97403A35848
8890b31338F1099b16457g7349o3963F5614J31195p8321K07849c8523j55582B18509
8878a4017A28190c71760J16357d2240q7103A93760a57990i071F051a9742j15175
$$ plain form
8925 157912 -102967 640826 915376 3258632 4377250 914303 31711 354931 202244 11365
8914 -118719 48774 153191 24481 -82906 86135 15454 332903 -102808 169882 -7436 341117
8902 347472 46028 -3609 -5061 87555 91784 -100250 -20293 402272 -30022 -227425 135848
8890 -231338 61099 -216457 -77349 -141312 65614 196809 118488 326337 -38523 -194105 218509
8878 -14017 128190 -371760 -255403 -42240 -129343 193760 -157990 -9071 6051 -19742 -134917
$$ [...]
##END NTUPLES=NMR SPECTRUM
##END=
