##TITLE=AC1671_VIERN14362_8570997_khaJmL0gFv
##JCAMPDX= 6.0         $$ Bruker NMR JCAMP-DX V2.0
##DATA TYPE= NMR SPECTRUM
##DATA CLASS= NTUPLES
##ORIGIN= BRUKER
##OWNER= Administrator
$$ 1.72 TOPSPIN		Version 2.1
$$ 2014-04-11 17:52:24.511 -0700  Administrator@X
$$ Compression mode = diff/dup
##.OBSERVE FREQUENCY= 400.02188249412
##.OBSERVE NUCLEUS= ^1H
##.ACQUISITION MODE= SIMULTANEOUS (DQD)
##.ACQUISITION SCHEME= undefined
##.AVERAGES= 8
##.DIGITISER RES= 22
##SPECTROMETER/DATA SYSTEM= spect
##.PULSE SEQUENCE= zg30
##.SOLVENT NAME= COFFEE_meoh
##.SHIFT REFERENCE= INTERNAL, COFFEE_meoh, 1, 14.98509
##AUDIT TRAIL= $$ (NUMBER, WHEN, WHO, WHERE, PROCESS, VERSION, WHAT)
$$ ##TITLE= Audit trail, TOPSPIN		Version 2.1
$$ ##JCAMPDX= 5.01
$$ ##ORIGIN= Bruker BioSpin GmbH
$$ ##OWNER= Administrator
$$ $$ E:\/data/COFFEE/nmr/AC1671_VIERN14362_8570997_khaJmL0gFv/10/pdata/1/auditp.txt
$$ ##AUDIT TRAIL=  $$ (NUMBER, WHEN, WHO, WHERE, PROCESS, VERSION, WHAT)
(   1,<2014-04-11 17:52:17.168 -0700>,<Administrator>,<X>,<go>,<TOPSPIN 2.1>,
      <created by zg
	started at 2014-04-11 17:51:16.434 -0700,
	POWCHK enabled, PULCHK disabled,
       configuration hash MD5:
       C8 4E 4E 5D D3 5C D8 9E 9F 52 82 E0 59 8A DE 15
       data hash MD5: 64K
       11 C7 00 9D 00 95 A3 9A 33 8A 11 08 18 2F 41 AC>)
(   2,<2014-04-11 17:52:20.204 -0700>,<Administrator>,<X>,<proc1d>,<TOPSPIN 2.1>,
      <Start of raw data processing
       efp LB = 0 FT_mod = 6 PKNL = 1 PHC0 = 0 PHC1 = 0 SI = 32K 
       data hash MD5: 32K
       92 9C 8A 42 E0 61 8D 84 72 41 A3 83 70 9A 28 0B>)
(   3,<2014-04-11 17:52:20.577 -0700>,<Administrator>,<X>,<proc1d>,<TOPSPIN 2.1>,
      <pk PHC0 = 92.51587 PHC1 = 0 
       data hash MD5: 32K
       C5 53 62 D7 B8 AF 70 2D 68 99 F8 CF EE 46 09 6C>)
(   4,<2014-04-11 17:52:20.720 -0700>,<Administrator>,<X>,<proc1d>,<TOPSPIN 2.1>,
      <abs ABSG = 1 
       data hash MD5: 32K
       E4 25 0F 7B 3C 07 6F 23 34 85 25 C8 3F D5 44 76>)
(   5,<2014-04-11 17:52:20.773 -0700>,<Administrator>,<X>,<proc1d>,<TOPSPIN 2.1>,
      <abs ABSG = 2 
       data hash MD5: 32K
       31 E7 CA 51 58 B1 4B 47 69 14 6F 44 7F B7 E4 AF>)
(   6,<2014-04-11 17:52:20.827 -0700>,<Administrator>,<X>,<proc1d>,<TOPSPIN 2.1>,
      <abs ABSG = 3 
       data hash MD5: 32K
       93 DE 04 37 00 AC 60 45 18 72 90 D2 76 AB 9C 1A>)
(   7,<2014-04-11 17:52:20.933 -0700>,<Administrator>,<X>,<proc1d>,<TOPSPIN 2.1>,
      <abs ABSG = 4 
       data hash MD5: 32K
       6A 14 8E 76 5F BB 20 AA 1D EA D7 79 4C 97 6A 28>)
(   8,<2014-04-11 17:52:21.040 -0700>,<Administrator>,<X>,<proc1d>,<TOPSPIN 2.1>,
      <abs ABSG = 5 
       data hash MD5: 32K
       EE D8 8C 85 8A 32 75 E6 C9 E8 83 D3 80 C2 B3 DB>)
$$ ##END=
$$ 
$$ $$ hash MD5
$$ $$ CC 35 E0 BC 3E B5 16 64 3C F4 B9 07 FA E8 68 F1
##$RELAX= 
##$RELAX= 
##$RELAX= 
##$RELAX= 
##$RELAX= 
##$RELAX= 
##$RELAX= 
$$ Bruker specific parameters
$$ --------------------------
##$DU= <E:\>
##$EXPNO= 10
##$NAME= <AC1671_VIERN14362_8570997_khaJmL0gFv>
$$ [...]
150 150 150 150 150 150 150 150
##$TP07= 0
##$TPNAME0= <>
##$TPNAME1= <>
##$TPNAME2= <>
##$TPNAME3= <>
##$TPNAME4= <>
##$TPNAME5= <>
##$TPNAME6= <>
##$TPNAME7= <>
##$TPOAL= (0..7)
0.5 0.5 0.5 0.5 0.5 0.5 0.5 0.5
##$TPOFFS= (0..7)
0 0 0 0 0 0 0 0
##$TUNHIN= 0
##$TUNHOUT= 0
##$TUNXOUT= 0
##$USERA1= <user>
##$USERA2= <user>
##$USERA3= <user>
##$USERA4= <user>
##$USERA5= <user>
##$V9= 5
##$VALIST= <valist>
##$VCLIST= <CCCCCCCCCCCCCCC>
##$VD= 0
##$VDLIST= <DDDDDDDDDDDDDDD>
##$VPLIST= <PPPPPPPPPPPPPPP>
##$VTLIST= <TTTTTTTTTTTTTTT>
##$WBST= 1024
##$WBSW= 4
##$XGAIN= (0..3)
0 0 0 0
##$XL= 0
##$YL= 0
##$YMAX_a= 635078
##$YMIN_a= -538663
##$ZGOPTNS= <>
##$ZL1= 120
##$ZL2= 120
##$ZL3= 120
##$ZL4= 120
##$ABSF1= 14.98509
##$ABSF2= -5.573092
##$ABSG= 5
##$ABSL= 3
##$ALPHA= 0
##$AQORDER= 0
##$ASSFAC= 0
##$ASSFACI= 0
##$ASSFACX= 0
##$ASSWID= 0
##$AUNMP= <proc_prof1d_extract_pilot.lims>
##$AXLEFT= 0
##$AXNAME= <>
##$AXNUC= <1H>
##$AXRIGHT= 0
##$AXTYPE= 0
##$AXUNIT= <>
##$AZFE= 0.1
##$AZFW= 0.1
##$BCFW= 0
##$BC_mod= 0
##$BYTORDP= 0
##$COROFFS= 0
##$CY= 15
##$DATMOD= 1
##$DC= 0
##$DFILT= <>
##$DTYPP= 0
##$F1P= 0
##$F2P= 0
##$FCOR= 0.5
##$FTSIZE= 32768
##$FT_mod= 6
##$GAMMA= 0
##$GB= 0
##$INTBC= 1
##$INTSCL= 1
##$ISEN= 128
##$LB= 0
##$LEV0= 0
##$LPBIN= 0
##$MAXI= 10000
##$MC2= 0
##$MEAN= 0
##$ME_mod= 0
##$MI= 0
##$NCOEF= 0
##$NC_proc= -8
##$NLEV= 6
##$NOISF1= 0
##$NOISF2= 0
##$NSP= 0
##$NTH_PI= 0
##$NZP= 0
##$OFFSET= 14.98509
##$PC= 1
##$PHC0= 92.51587
##$PHC1= 0
##$PH_mod= 1
##$PKNL= yes
##$PPARMOD= 0
##$PPDIAG= 0
##$PPIPTYP= 0
##$PPMPNUM= 2147483647
##$PPRESOL= 1
##$PSCAL= 4
##$PSIGN= 0
##$PYNMP= <proc.py>
##$REVERSE= no
##$SF= 400.02
##$SI= 32768
##$SIGF1= 0
##$SIGF2= 0
##$SINO= 400
##$SIOLD= 32768
##$SPECTYP= <>
##$SREGLST= <1H.CDCl3>
##$SSB= 0
##$STSI= 32768
##$STSR= 0
##$SW_p= 8223.68421052631
##$SYMM= 0
##$S_DEV= 0
##$TDeff= 65536
##$TDoff= 0
##$TI= <>
##$TILT= no
##$TM1= 0
##$TM2= 0
##$TOPLEV= 0
##$USERP1= <user>
##$USERP2= <user>
##$USERP3= <user>
##$USERP4= <user>
##$USERP5= <user>
##$WDW= 1
##$XDIM= 32768
##$YMAX_p= 462905680
##$YMIN_p= -731976
##$CURPLOT= <Network HP LaserJet P1505>
##$CURPRIN= <$Network HP LaserJet P1505>
##$DFORMAT= <normdp>
##$LAYOUT= <+/1D_H.xwp>
##$LFORMAT= <normlp>
##$PFORMAT= <normpl>
##$SURQMSG= 1
$$ End of Bruker specific parameters
$$ ---------------------------------
##NTUPLES= NMR SPECTRUM
##VAR_NAME=  FREQUENCY,     SPECTRUM/REAL,   SPECTRUM/IMAG
##SYMBOL=    X,             R,               I
##VAR_TYPE=  INDEPENDENT,   DEPENDENT,       DEPENDENT
##VAR_FORM=  AFFN,          ASDF,            ASDF
##VAR_DIM=   32768,         32768,           32768
##UNITS=     HZ,            ARBITRARY UNITS, ARBITRARY UNITS
##FACTOR=    0.250966925370066, 1,           1
##FIRST=     8223.43324360094, 40316,        -153081
##LAST=      0,             113967,          -30230
##MIN=       0,             -731976,         0
##MAX=       8223.43324360094, 462905680,    0
$$ Real data points
##PAGE= N=1
##DATA TABLE= (X++(R..R)), XYDATA
$$ [...]
19532A49087j0973a08190j60884G3670A4509f1197H7653f723j5419A8179K49525
19521B67704j22310J3368J0697N9657a37738l2359n2842b9958r5790G9482A7729
19509A86934h225j76847R2477C05211a23614B17342c19886A16651b57635e9177
19498H5293l3909b58795b3489j46380O3317j56024F7284J96028e6281B02905c45273
19486e8486a5356j20084e2010j02744l2598C08714c4646j02108f7081A24889e96303
19474b38550e8789j09325j81769c6678C8783f9714A3561J6245f2743n4372m7810
19463a64925B06559b4530H4474J25872c15678a29496j39821A49244B4773K1815
19453D6588a90455J8452A514K34284b59842A68943j4599e30562h3014F9858h0435
$$ y = [149087, 138114, -108190, -269074, 73670, 14509, -61197, 87653, -6723, -22142, 18179, 267704, 145394, 158762, 169459, 229116, -137738, -170097, -222939, -29958, -125748, 79482, 17729, 186934, -8225, -185072, -92595, 305211, -123614, 217342, -319886, 116651, -257635, -59177, 85293, 51384, -258795, -23489, -169869, -106552, -262576, 67284, 263312, -56281, 202905, -345273, -58486, -15356, -135440, -52010, -154754, -187352, 308714, -34646, -136754, -67081, 124889, -596303, -238550, -58789, -168114, -349883, -36678, 38783, -69714, 13561, 29806, -62743, -117115, -164925, 206559, -24530, 84474, 210346, -315678, -129496, -269317, 149244, 24773, 46588, -190455, -172003, 1514, 235798, -259842, 168943, 154344, -530562, -83014, 69858, -80435]
19441d28075a27045b1537o6449j0125l07365E9642b8693C9176K48236j25132d36741
19429B2341c35140J59029k60069M9691a25771j2111L2217l8972j14727A07013
19418a21291p1899N4765c4702j46396Q9430F0093a95925B7165J58548a411j75367
19407a76778n45N2042B92697A25684a35082n3834B1326b30982D9099b55491D1292
19395A26359j3900g2992j20298A6511c19470a1306D5353d16720a66901d9169k21083
19384b70252H7193J71085H017Q1626g463k56354J03478j17556J2193A186b0054
19372A18623J06600k3818a87014e1901H8652c01719J46188n722A73840J23706
19362B97546c02319g1714b8430C24976R2222A59107A046R6461b63040i1147H5313
$$ y = [-428075, -127045, -21537, -87986, -98111, -405476, 59642, -28693, 39176, 287412, 162280, -436741, 22341, -335140, -176111, -436180, -386489, -125771, -137882, -105665, -144637, -259364, 107013, -121291, -193190, -138425, -34702, -181098, -91668, 60093, -195925, 27165, 185713, -1411, -176778, -177323, -125281, 292697, 125684, -135082, -188916, 21326, -230982, 49099, -255491, 41292, 126359, 112459, -72992, -193290, 16511, -319470, -11306, 45353, -416720, -166901, -49169, -270252, 87193, 258278, 8017, 89643, -7463, -263817, -160339, -277895, -265702, 1186, -20054, 118623, 225223, 201405, -187014, -51901, 88652, -301719, -155531, -161253, 173840, 297546, -302319, -71714, -28430, 324976, 417198, 159107, 1046, 97507, -263040, -91147, 85313]
19350h0848M372k06968M0476e3586l43357a12935j45498J24216E1384a80801e2678
19338E3505g9898p3143D6213J20042a23257a6387m0186j43038D6193b21297m982
19327b26279C8232c1795D50138b42774B2402a13698k32817h2133A32832a88189
19316A31080e4992j17726E1333J95015D8586J57138a71011q6475A78104l664c43631
19304g9746a0840k89854p2469I955e5387l3132m11796A12000D7833K1058i3482
19292D3338b91254f4067A87970L2053c18446g5724j66772K9473p8223e062j74178
19281a79240c1697j01197B44948q2928C7033a99245P3095l1300C07731c5288j07679
19270a42967M5605K2587A81753d317k05035A0697b81076F3461c24844O6277M4030
$$ y = [-80848, -76476, -283444, -242968, -53586, -396943, -112935, -258433, -134217, 51384, -180801, -52678, 53505, -79898, -153041, 46213, 166255, -123257, -16387, -56573, -199611, 46193, -221297, -226279, 38232, -31795, 450138, -242774, 22402, -113698, -346515, -82133, 132832, -188189, 131080, -54992, -172718, 51333, 246348, 48586, 205724, -171011, -257486, 178104, 174440, -343631, -79746, -10840, -300694, -373163, 9955, -55387, -88519, -500315, 112000, 47833, 68891, -93482, 43338, -291254, -64067, 187970, 220023, -318446, -75724, -242496, -213023, -291246, -5062, -179240, -31697, -132894, 244948, 162020, 37033, -199245, -126150, -157450, 307731, -35288, -142967, -97362, -74775, 181753, -4317, -209352, 10697, -281076, 63461, -324844, -258567, -214537]
19259b14537p2566M7818a19532k28529q6141C6992g0288j38919A64536a50824
19248C6849a55970k1412b2848A04183j9364c45839b9358j02440M7698C49081b70536
19236b97197e3186E1600N6637a08253J2444A23907p150a0880q6208k8614o7297
19225a92999o184I8706b67149M1732F195J9106b18151K6023G1836e21920a36847
19213H4651b7309C84657A19074D2487a23264l10874a52721d0259o4174B3539b8678
19201c30098C9025J54935c8628j339j06558A30916a85434A02106P0565J25031
19191B97702c8894k54356B18850j01994a56752j18802A33024a7391l3961l9085
19181i0437D1845e2148J2184k14801J05486e1716A59666D3304i1685f652m551
$$ y = [-214537, -287103, -239285, -119532, -348061, -434202, 36992, -70288, -209207, 164536, -150824, 36849, -155970, -177382, -22848, 104183, 84819, -345839, -29358, -131798, -84100, 349081, -270536, -297197, -53186, 51600, 108237, -108253, -95809, 123907, 116757, -10880, -97088, -125702, -192999, -199183, 98706, -267149, -225417, 6195, 25301, -218151, -192128, 71836, -521920, -136847, 84651, -27309, 384657, 119074, 42487, -123264, -434138, -152721, -40259, -104433, 23539, -28678, -330098, 39025, 193960, -38628, -39967, -146525, 130916, -185434, 102106, 172671, 297702, -38894, -293250, 218850, 116856, -156752, -275554, 133024, -17391, -51352, -90437, 41845, -52148, -39964, -254765, -149279, -51716, 159666, 43304, -91685, -6652, -11203]
19170a1203m00789J06674J38869H9806e0286k31040J24838A47851L674P965c06850
19158a12282k8843m0472j28709a49805F4980A7084b66070A76663D2330a4969C1779
19146d2975F3133b85309b2486D64886H2615b00972j52033J29674B62603b73286
19135c52744c8819B7945c08317A39918b2547o3785J8395o5818N9791I1699a96505
19123a22610F636i1758j88947d8262b0070p8177g307F7547k6764d8243o9380k92271
19111d09894a81725A02819b64939D5819a69774P2385A40771a75351Q2815k25419
19101c17955M3297C28490f9408k04414D8223J06827f1533D882d2637E6081a00684
19089a2884K112B4117J51719F4622c17065K4198B7391g8038i227d153B33366a8012
$$ y = [-11203, -411992, -305318, -166449, 89806, -50286, -281326, -156488, 147851, 151525, 159490, -306850, -112282, -141125, -181597, -310306, -149805, 64980, 17084, -266070, 176663, 42330, -14969, 31779, -42975, 63133, -285309, -22486, 464886, 82615, -200972, -353005, -223331, 262603, -273286, -352744, -38819, 27945, -308317, 139918, -22547, -86332, -67937, -133755, -73964, 91699, -196505, -122610, 6636, -91758, -280705, -48262, -20070, -98247, -7307, 67547, 40783, -48243, -117623, -409894, -181725, 102819, -264939, 45819, -169774, -97389, 140771, -175351, -92536, -317955, -274658, 328490, -69408, -273822, 48223, 155050, -61533, 4882, -42637, 56081, -100684, -12884, -10772, 24117, 175836, 64622, -317065, -292867, 27391, -78038, -9227, -4153, 233366, -18012]
19076H7764L1509b90095G4175a84549d8923H6454a71535A45591c9654A69271h8268
19064f1716j18965j45747J9803M1870f3275k5323j07904J2423k5385G7319a42286
19052c14125J05872e1299A40778Q329m9172b78424C0180E225a05065A50856b86944
19040a68926e3191k2814k9063a0706k2534C09065a29625A08681O7710b69772A49449
19028C35928a8390j07869F4852j8673e3523B8044a38399A18978i0591p8910F2993
19016I3115b31904A37522b9290A2767c07689i5801p8457p7873A46865p127a77240
19004a29621G3486b02747I9845d9715J4483Q721C0683b68668J14218P3867B24353
18992a72997f367j1342j87181D6181e8163B4087d0988A58399a52595k53622f0604
$$ y = [87764, 119273, -290095, 74175, -184549, -48923, 86454, -171535, 145591, -39654, 169271, -88268, -61716, -180681, -326428, -306625, -264755, -63275, -88598, -196502, -184079, -209464, 77319, -142286, -314125, -208253, -51299, 140778, 149107, 99935, -278424, 30180, 5225, -105065, 150856, -286944, -168926, -53191, -76005, -105068, -10706, -33240, 309065, -129625, 108681, 176391, -269772, 149449, 335928, -18390, -126259, 64852, 46179, -53523, 28044, -138399, 118978, -90591, -169501, 62993, 93115, -231904, 137522, -29290, 12767, -307689, -95801, -174258, -252131, 146865, 139738, -177240, -129621, 73486, -202747, 99845, -49715, -35232, -26511, 30683, -268668, -154450, -80583, 224353, -172997, -6367, -17709, -204890, 46181, -58163, 24087, -40988, 158399, -152595, -406217, -60604]
18980b87934J07674b1203m8845n4544j15471J07517l2616J2599k00454h9720j28399
18969b18119q510f8695C856a30160G5687e2872B13333a87024l4246d1443B21999
18957C2667e36851c6738k27955j91364D3628M6380a77963B04724f0523G7778b41366
18945A36538a05699n8217j50296J44121g9996L2701k0430l434k49172a10953k62689
18934c73642J06472f1829p3144K2004C29599b86125A10727g5421k23492f0916
18923a01777E0496J27884a44355i52j05976A2593a26209B75535B0235e8195F1683
18911e5845l7568G9260a6299j05523A25334C6202K66152h2132j30587g8443D521
18899B74345a79995M701q823D1173R4220i9141k56903l6129e3379A14652e0987
$$ y = [-287934, -180260, -21203, -70048, -124592, -240063, -132546, -165162, -152563, -353017, -89720, -218119, -226629, -68695, 3856, -130160, 75687, -52872, 213333, -187024, -221270, -41443, 221999, 32667, -536851, -36738, -264693, -456057, 43628, 90008, -177963, 204724, -60523, 77778, -241366, 136538, -105699, -163916, -314212, -170091, -79996, -47295, -67725, -71159, -320331, -110953, -373642, -267170, -61829, -134973, -112969, 329599, -286125, 110727, -75421, -298913, -60916, -101777, 50496, 178380, -144355, -952, -106928, 12593, -126209, 275535, 20235, -58195, 61683, -55845, -93413, 79260, -16299, -121822, 125334, 36202, 302354, -82132, -212719, -78443, 4521, 274345, -179995, -175294, -184117, 41173, 135393, -99141, -356044, -392173, -53379, 114652, -50987]
18887A87328b52871D8524b63776O4357F5026d45555c5958n6228j4499k05037D0274
18875F3467c0211j35227F0770J49672f4997A7708a93083E1569R7509D0755J14590
18864A55345A9500L03104I9496J6456a0209j50127j15299a14588n2688f1039b8496
18852A86015a03927C23715a31876l9214F3066a89268A59158K640a02911A5655
18841A50900M6978a08401F0829a95910L3693B56750B5322L5809K09448A00501
18830a41353c8839B43173l1792f1998A66631b32550B8607a83049A2633K7917M11426
18819D51976E3792L70102d7175k04759Q7592l34706d1488o7691B79432j14366
18809A65066f6041a5516m2428A7351L380d7931l8815H0026i2206q0505A08455
$$ y = [187328, -252871, 48524, -263776, -199419, 65026, -445555, -35958, -92186, -106685, -311722, 40274, 63467, -30211, -165438, 60770, 210442, -64997, 17708, -193083, 51569, 149078, 40755, 155345, 19500, 322604, 99496, 115952, -10209, -160336, -275635, -114588, -167276, -61039, -28496, 186015, -103927, 323715, -131876, -171090, 63066, -189268, 159158, 161798, -102911, 15655, 150900, 197878, -108401, 60829, -195910, -162217, 256750, 25322, 61131, 270579, 100501, -141353, -38839, 243173, 211381, -61998, 166631, -232550, 28607, -183049, 12633, 40550, 451976, 53792, 423894, -47175, -251934, -164342, -499048, -41488, -109179, 279432, 165066, -66041, -15516, -57944, 17351, 20731, -47931, -86746, 80026, -92206, -172711, 108455]
18797a07919j50625A09197R2801i8502l0843N5081a3629A14884f4947K2734d539
18785A45331D5199h5399c785j86796f4325j11193B17820n1573b00106C1792a7636
18773b31479D06784a18142m6699M2594j8713j45733A59653C6915K892a62192E39047
18761I7590D593b6874C23649a81379I9763g6849k55989A33770b24333A8591L03594
18750C22185b16026J8981e522j60592n2724A3148a80892B0156a1818j29553N6403
18739h4968G8540f9666k11279B4178J50265c19395b7452A25454E0829K5554a71765
18727a72290a9401j03690d9755q182A67925a43685B31842c04886D2081b11673
18716C4080L8261L0927B8228O5980i1982j60434e9527c330j36058j88762B38571
$$ y = [-107919, -258544, 109197, 201998, -98502, -129345, -74264, -13629, 114884, -64947, -42213, -4539, 145331, 45199, -85399, -3785, -190581, -64325, -175518, 217820, 166247, -200106, 31792, -17636, -231479, 406784, -118142, -164841, -122247, -140960, -286693, 159653, 36915, 39807, -162192, 539047, 97590, 4593, -26874, 323649, -181379, 99763, -76849, -332838, 133770, -224333, 18591, 322185, -216026, -197045, -5522, -166114, -218838, 13148, -180892, 20156, -11818, -141371, -84968, 78540, -69666, -280945, 24178, 174443, -319395, -27452, 125454, 50829, 76383, -171765, -172290, -19401, -123091, -49755, -57937, 167925, -143685, 231842, -304886, 42081, -211673, 34080, 72341, 103268, 28228, 94208, -91982, -252416, -59527, -3330, -139388, -328150, 238571]
18704c5613j95487C66672i1279l25521E8229c42027C2333b76657A41434b30499
18693A27763b77818A23611C2823b26393m2394D509L0033a14870j25862L2054B61730
18681c09775a39299A65860J81609b85105j17245A15427J13790g1165r7242K8008
18671a40399r4726a4368n34438B25043L5667B1560a26694j9573I0436B3743a429
18659H1128J00949o1707A7613a27477G4904J86156C230a55605F1631c2729k17844
18648b50573A47065g2162F103P5464e7811j1935j76204e0143c903k45538R5771
18637a53670j02923P8462A01594e3180P968m9744k64177F6551K3696a68411J2260
18626a56151P3555M0168L061A43363b59204j75964a98893i0917j34452B40610
$$ y = [-35613, -231100, 366672, -91279, -416800, 58229, -342027, 32333, -276657, 141434, -230499, 127763, -277818, 123611, 32823, -226393, -268787, 4509, 34542, -114870, -240732, -208678, 261730, -309775, -139299, 165860, 347469, -285105, -402350, 115427, 229217, -71165, -168407, -140399, -235125, -14368, -548806, 225043, 260710, 21560, -126694, -146267, 90436, 23743, -1429, 81128, 182077, 120370, 17613, -127477, 74904, 261060, 3230, -155605, 61631, -32729, -250573, 147065, -72162, 6103, 81567, -57811, -69746, -245950, -50143, -3903, -249441, -153670, -256593, -178131, 101594, -53180, -45212, -94956, -359133, 66551, 90247, -168411, -156151, -82596, -42428, -39367, 143363, -259204, -435168, -198893, -90917, -225369, 240610]
18615c64626a20692j8356L2563l26608a79950c3053A69864c2246A20895l2865
18605H8030b81287i7806j26493p0997I5398b79614a35426n2310D0692l122a55026
18593a89905F3267e4076A72797a84762g2629A12483D7038K56394a06144C04028
18582i128L551m05990h2999j64804A98568a761m36667A38717a19649j1059K1975
18571a08733a4116l02059a10169L125r782O810A94838J32121E3166a29079M4416
18560h4663I771K04949H3854i9927C117a83961J8389g7785n3153j5385b7356k8678
18548e6034n0577G1631b05953K8108J1859c9489C188f8880K0796Q196A40287i3356
18535I2145k3828c5073B8221M613e5720A69932a8186A48338b24533A709g5472
$$ y = [-364626, -120692, -139048, -106485, -433093, -179950, -33053, 169864, -32246, 120895, 88030, -281287, -97806, -224299, -295296, 95398, -279614, -135426, -187736, 40692, 37570, -155026, -189905, 63267, -54076, 172797, -184762, -72629, 112483, 47038, 303432, -106144, 304028, -9128, -5577, -411567, -82999, -247803, 198568, -1761, -438428, 138717, -119649, -130708, -108733, -14116, -316175, -110169, -107044, -116826, -110016, 194838, 326959, 53166, -129079, -84663, 9771, 214720, 83854, -99927, 3117, -183961, -165572, -77785, -130938, -146323, -27356, -56034, -106611, 71631, -205953, -177845, -165986, -39489, 3188, -68880, -48084, -39888, 140287, -93356, 92145, 68317, -35073, 28221, 32834, -55720, 169932, -18186, 148338, -224533, 1709, -75472]
18523a02929B78461E3608a55867A99704c12854J42205j11807n9376A89651g1935
18512a24558M1761A16462d5236E0968J8503I593a22516o024A95900a20949a2035
18500a58147r7231B54343j21428g7121q8891j11753a3721k8335J9299m86369J01343
18489d07783a19881q8992L7048c1323A60949h6775n4200f6049C58176a69685A61231
18477i2141j97677a16693m0721d4485k19332Q7917g4584A46057a21147H9779K27261
18466C17040c35190J50620A3686a22350j02877D7001b55076j50498A26085F339
18455D33063c53850B23458G2630e5949B511i497k7558H9260c48011e3746G9328
18443b26770e9719A60936D7893h0205J6989A16056J43878b20210n7671J35503
$$ y = [-102929, 278461, 53608, -155867, 199704, -312854, -170649, -282456, -341832, 189651, -71935, -124558, -82797, 116462, -45236, 50968, 69471, 9593, -122516, -128540, 195900, -120949, -12035, -158147, -255378, 254343, 132915, -77121, -166012, -277765, -13721, -42056, -22757, -509126, -407783, -119881, -208873, -171825, -31323, 160949, -86775, -140975, -66049, 358176, -169685, 161231, -92141, -289818, -116693, -157414, -44485, -263817, -175900, -74584, 146057, -121147, 89779, 317040, -335190, -184570, 13686, -122350, -225227, 47001, -255076, -405574, 126085, 6339, 433063, -353850, 223458, 72630, -55949, 2511, -9497, -37055, 89260, -348011, -53746, 79328, -226770, -59719, 160936, 47893, -80205, -63216, 116056, 259934, -220210, -277881, -142378]
18433a42378A79157a77403P1039A52433K07188a86880C56709a90811e1615j23733
18423a75348h2120m261B8733J57965q4068h3301j18862N1650A41416b45208c4743
18411i9869B38333h287q4889a6733E6405a06259o4473B9424b69261l7622G4455
18399A96442B057e6085o0831M6903p2461b7485D0622f3719A86150j6003m3410
18388A26737L6907b97014j77517a32993l9631H4983b89069B5440K02063a13452
18377a73789C35868D504b53834N1938p1984c8785p4132A43621m6898a00206E2249
18365B21045A1718J55229g9776k00066f7054D3293K25843p8491c13692a39136
18354A2610b94225k3558g1783K1478A6615a44491N8596M36H3912e7866j14987
$$ y = [-142378, 179157, -177403, -106364, 152433, 359621, -186880, 356709, -190811, -51615, -175348, -82120, -86381, 28733, 186698, 102630, -83301, -202163, -150513, 141416, -245208, -34743, -99869, 238333, -8287, -93176, -16733, 56405, -106259, -170732, 29424, -269261, -306883, 74455, 196442, 2057, -56085, -116916, -70013, -142474, -27485, 40622, -63719, 186150, 170147, 126737, 163644, -297014, -474531, -132993, -172624, 84983, -289069, 25440, 227503, -113452, -173789, 335868, 4504, -253834, -201896, -273880, -38785, -112917, 143621, 96723, -100206, 52249, 221045, 11718, 166947, -79776, -279842, -67054, 43293, 269136, 190645, -313692, -139136, 12610, -294225, -317783, -71783, -50305, 16615, -144491, -85895, -85459, 83912, -57866, -172853]
18343a72853l88987a10922d9045C63853a16331A00001g6385K2265m2103k7192
18333a23415A13629b64465j3098B06356m4888h46o2185f01D38389b27207O7536
18322a59671g3307n5371B1539a68581j23398J09931A53960n9066a37795j00528
18312b38323b9881A09129b30736J12570j94373A68698h495k0080j53913g2990
18301I2520P3412q1892m0463N4295J19411a13854j1022j1478B41622C2193J48206
18290A80399a06135L3131L0846A03564a29546p9588E4056a39353N3444D5855K6572
18279G2427J53621a0945A27253J19380j07044c80139Q6181B72488A02350J5007
18269A17357h000q5524c4036j28996B2827M8464h8367k6924B4605i3732C18331
$$ y = [-172853, -561840, -110922, -49045, 363853, -116331, 100001, -76385, -54120, -96223, -123415, 113629, -264465, -277563, 206356, 161468, -846, -63031, -601, 438389, -227207, -159671, -73307, -128678, 21539, -168581, -291979, -182048, 153960, 94894, -137795, -238323, -29881, 109129, -230736, -118166, -312539, 168698, -8495, -28575, -182488, -72990, 92520, 165932, 84040, 43577, 97872, 217283, -113854, -124876, -136354, 241622, 32193, 180399, -106135, -73004, -42158, 103564, -129546, -209134, 54056, -139353, -85909, 45855, 72427, 226048, -10945, 127253, 246633, 139589, -380139, -293958, 272488, 102350, 117357, -8000, -93524, -34036, -163032, 22827, 71291, -88367, -115291, 24605, -93732, 318331]
18257e3460j00554B37532A17033j3940a93307D6740e11649I4277J26962a89207
18246c00324E5401J4806k7883N5263e41221D7213d6393A76882b60902j2225N1471
18235b21656Q0721K1169J7046L2108k25000A57041A3065h8908A82262b17957k60612
18224d78569J38703J66158a7735m8851C14051a2019r4489E0443J62160H2305c94969
18212b4879j07396f0657B0186J03961O431a64037r441L548q6772J9610A32953
18200A29258b23757A84376A8110K3104c42045i6511k67314J00025d6387A43033
18189A6185K27986n0778b3843j46986c3874D682a54998A70918a49989I5083c4353
18177A73502b00255B4034b62130D6635P395h8484j95853A68515b70714g9000K4626
$$ y = [-53460, -154014, 237532, 117033, 103093, -193307, 46740, -511649, 94277, 221239, -189207, -300324, 55401, 70207, 42324, 97587, -541221, 47213, -46393, 176882, -260902, -273127, -221656, -140935, -119766, -102720, -70612, -295612, 157041, 13065, -88908, 182262, -217957, -478569, -339866, -173708, -17735, -66586, 314051, -12019, -106508, 50443, 212603, 82305, -394969, -24879, -132275, -60657, 20186, 124147, 130578, -164037, -173478, -169930, -256702, -237092, 132953, 129258, -223757, 184376, 18110, 41214, -342045, -96511, -363825, -263800, -46387, 143033, 16185, 244171, 193393, -23843, -170829, -33874, 4682, -154998, 170918, -149989, 95083, -34353, 173502, -200255, 24034, -262130, 46635, 54030, -88484, -284337, 168515, -270714, -79000, -54374]
18166e4374E1045d4470F2925b4507J0795j68337M3433c2095l08984B8442b2723
18154D13995H6679f5429E0622J30451b09364B16246n5349b71582a05319j67326
18144b72645l4525a6193F2507a44445B11863c20056B1362J15293J2722k2133a99491
18132a48155H6331k1898c931A3103a85664D61879A45523d4381j8703A63055d0666
18120C6539f1325a9807j36762A47033F0658a24233d2759j74753F9733H986Q862
18109A7848R8774d4846k4608G7927a58590F3745J2946b98293l6798I4342C7002
18097a31674m2069I2775A4238a54255f2797j85268J13316A87499b4782A04651
18086A50421c49572a09109E0825K86095b19421G8808a60062J8298a2631H1713
$$ y = [-54374, 51045, -44470, 62925, -24507, -13712, -182049, -138616, -32095, -341079, 28442, -22723, 413995, 86679, -65429, 50622, 181073, -209364, 216246, 160897, -271582, -105319, -272645, -307170, -16193, 62507, -144445, 211863, -320056, 21362, 136655, 149377, 127244, -199491, -148155, 86331, 64433, -3931, 13103, -185664, 461879, 145523, -44381, -63084, 163055, -40666, 36539, -61325, -19807, -156569, 147033, 60658, -124233, -42759, -217512, 69733, 8986, 17848, 116622, -44846, -69454, 77927, -158590, 63745, 76691, -298293, -335091, 94342, 37002, -131674, -173743, 92775, 14238, -154255, -62797, -248065, -134749, 187499, -24782, 104651, 150421, -349572, -109109, 50825, 336920, -219421, 78808, -160062, -141764, -12631, 81713]
18075a90253K1567A63387i7657k15469A35150d1498m0022k27263B39955J01351
18065C41306a8546D1276L37962L2097a21562A04143c8121B20037Q1529f2894A22368
18053i6A6582h5349k7501J2605J1084B07673a84214B0401a7073k48126b9152j91580
18041b20732k05145J52933Q4207g4359B0934h8719G4753a07483A02617g5209E907
18029a36863L9731n0692H8585c4521j57676b7741A95673A3025J06986B8921L63507
18018C92428F763a11726A15323k1432M1827p333a74682F598J03398a55001r4682
18007b49683G9258e0660j35723A48227p420d5533j06196A63221a11979A9872b59414
17995b02134A20088C3811a52716l938C7185N1223i9448I7952l4911j6946a03701
$$ y = [-190253, -168686, 163387, -97657, -313126, 135150, -41498, -81520, -308783, 239955, 341306, -18546, 41276, 379238, 411335, -121562, 104143, -38121, 220037, 301566, -62894, 122368, -96, 16582, -85349, -112850, -100245, -89161, 207673, -184214, 20401, -17073, -265199, -29152, -220732, -425877, -272944, -188737, -74359, 20934, -88719, 74753, -107483, 102617, -75209, 5907, -136863, -97132, -147824, 88585, -34521, -192197, -27741, 195673, 13025, 120011, 28921, 392428, 6763, -111726, 115323, 93891, 135718, 128385, -174682, 6598, 109996, -155001, -249683, 79258, -50660, -186383, 148227, 140807, -45533, -151729, 163221, -111979, 19872, -259414, -202134, 120088, 33811, -152716, -156654, 37185, 88408, -99448, 97952, 63041, 46095, -103701]
17983d0149l80131c4008M289j70659n0574B19749d478A55293o8943L3202B2138
17971D2690J01206a13352K9847j018J5067B8470m958f0598A53130D0242L454a03697
17958A98978K14559e4832A24136a98842C878K01771J4015C9593J44736c777A78982
17946a44383M4164G6315P4857b85232g277r0069A55981k2657N7371M1468i5454
17934e8003E6905h8183j19565A06878B6406f2881k75164p03B30687o8167K5190
17923A87710e5220D78124c46056A51032a01110d8887I9971a77151F4420L8069
17913A02489e3821I496b37121p2409C30563B0230c02480C7767a02048m340b8365
17901b6972A74631c2974k10950E7643a15568f134F3785j1904M0343J2492b62956
$$ y = [-40149, -420280, -34008, -29719, -200378, -250952, 219749, -4478, 155293, 86350, 119552, 22138, 42690, 143896, -113352, -83505, -84523, -69456, 28470, 23512, -60598, 153130, 40242, 43696, -103697, 198978, 413537, -54832, 124136, -198842, 3878, 205649, 219664, 39593, 184329, -3777, 178982, -144383, -100219, 76315, 151172, -285232, -7277, -97346, 155981, 133324, 190695, 232163, -95454, -58003, 56905, -88183, -207748, 106878, 26406, -62881, -338045, -338748, 230687, 162520, 187710, -55220, 478124, -346056, 151032, -101110, -48887, 99971, -177151, 64420, 102489, -53821, 9496, -237121, -309530, 330563, 20230, -302480, 37767, -102048, -106388, -28365, -26972, 174631, -32974, -243924, 57643, -115568, -6134, 63785, 51881, 92224, 104716, -262956]
17889B27020a57415k1205L9430c4380H2983a348n1290k1303A87179B8093P3966
17878A02059a18407K4145p9072A97074f5392A1594d31738B73059a38035d314C99377
17866c0095A62377A4274L7302a24919G4303k5380a10807B43858c986j25950a892
17854C5113a47774C6237i7349j19708K8051G119Q3227J68959K846a36125B903
17842C090b06812H431b282j06422A12554c26741D1633a60755O8970l8453l0275
17831a60513k5165C7282J89765k168J01584b44905A68245J16102a2537A92407
17820b00076i7011L5293B88391j15109D4493a0216A90712b78720r5133A0814D189
17808b9220C21947j34053a97236h1120r6837m46319a65755A54864o4349P4215
$$ y = [227020, -157415, -178620, -139190, -34380, 82983, -1348, -52638, -73941, 187179, 28093, 102059, -118407, -94262, -173334, 197074, -65392, 11594, -431738, 273059, -138035, -4314, 399377, -30095, 162377, 14274, 51576, -124919, 74303, 48923, -110807, 243858, -3986, -129936, -1892, 35113, -147774, 36237, -97349, -217057, -189006, 7119, 90346, 259305, 262151, -136125, 2903, 3090, -206812, 8431, -2282, -108704, 112554, -326741, 41633, -160755, -91785, -130238, -160513, -185678, 37282, 227047, 224879, 326463, -244905, 168245, 284347, -12537, 192407, -200076, -97011, -61718, 288391, 173282, 44493, -10216, 190712, -278720, -373853, 10814, 4189, -29220, 321947, 187894, -197236, -81120, -177957, -624276, -165755, 154864, 90515, 164730]
17798A64730F847d30684B5664J87559F9762b10301E2678f1909B49225d45372E5241
17786a6558j12452A83012A6034J26656e345A68838a95907h8700A89892L6192G5827
17774c6867A7188a4992N535l3440G5886a33532A16033P3388r4215P7064i4388
17762f5463j17640B32746aA50728L99981A40922h902A86662d89510C13239A596
17750b6732A00345M4995N7480B3299a46336N7063n2080o0171N6770A17423m3331
17739G4092a16585j39217C8142b1631A43713c7487k55061E6737e8984A09613K2788
17728A32401J51267g0958j03486E1381A4311f9070B41243a12476A24353d7582
17717C60719C0680d27773a12775n8163b1311A29411a10770j09620A61352J22348
$$ y = [164730, 6847, -430684, 25664, 213223, 69762, -210301, 52678, -61909, 249225, -445372, 55241, -16558, -129010, 183012, 16034, 142690, -5345, 168838, -195907, -88700, 189892, 226084, 75827, -36867, 17188, -14992, -9457, -42897, 75886, -133532, 116033, 189421, 95206, 172270, -94388, -65463, -183103, 232746, -1, 150728, 550709, 140922, -8902, 186662, -489510, 313239, 1596, -26732, 100345, 145340, 202820, 23299, -146336, -89273, -141353, -201524, -144754, 117423, 74092, -116585, -255802, 38142, -21631, 143713, -37487, -292548, 56737, -58984, 109613, 132401, 283668, -70958, -174444, 51381, 14311, -69070, 241243, -112476, 124353, -47582, 360719, 30680, -427773, -112775, -170938, -21311, 129411, -110770, -220390, 161352, 283700]
17707B83700a74565B98655I7645J14246h8666B0847J1093a60612C0265a09735
17696A1581d2273B88317f3498k37422J17502C6584J00891c70976B649K37547D7282
17684A83051A6759c8384A38598k3691a99096A15934a2204o6751k57618e2745R326
17673d3419j43493C4552J7275b71902A19614i0023k2772C19789c6805g821j1777
17662a9598p3060B29208c165A95561b85441G3291h3762A39782J84772n8814a33257
17650E1121f995k39913B99175J811f9074l8599D00581c5650A09289d6910j45006
17639a91916C14403a2076D06116c7080o357A05524g340B2631j0665P3071a11010
17627a74120a4188j80132A26447c01948i0690a2331A45258b94389D74152b2762
$$ y = [283700, -174565, 298655, 97645, 211891, -88666, 20847, 31940, -160612, 30265, -109735, 11581, -42273, 288317, -63498, -300920, -183418, 36584, 137475, -370976, 2649, 240196, 47282, 183051, 16759, -38384, 138598, 114907, -199096, 115934, -12204, -78955, -336573, -52745, -43419, -186912, 34552, 51827, -271902, 119614, -90023, -112795, 319789, -36805, -7821, -19598, -92658, 229208, -3165, 195561, -285441, 73291, -83762, 139782, 324554, 265740, -133257, 51121, -6995, -246908, 299175, 300986, -69074, -107673, 400581, -35650, 109289, -46910, -191916, 314403, -12076, 406116, -37080, -43437, 105524, -7340, 22631, 11966, 85037, -111010, -174120, -14188, -194320, 126447, -301948, -90690, -12331, 145258, -294389, 474152, -22762]
17616b01786C47157p2496K0669M6192g3873j05093c7936Q915A69482e5313A07564
17604a6312l402A35417d62094D3111c55391J44335n8294J12062N1440L9991D89225
17592I6437a15607B15606B061J42323f6960E2047j337J6769c0547m1539A41196
17580a2560C02614i9645d8502B44951l809G9896J46682l4310a77016p5005C46147
17568F1711d0020l00609D72481p4107D0007F064J95488h7020C44747g1065A19911
17556c9276J4597j36726L4270e6847H7239J79916b9886k15231d5840I6270C8409
17544B16401I124a70925L4840A12461J62524g145A94272J36505b19669B8288a244
17532b84372a30876A42035D7009J76320q4155J94157h891H1380e7981B27075D41
$$ y = [-201786, 347157, 274661, 295330, 341522, -73873, -178966, -37936, -29021, 169482, -55313, 107564, -16312, -19714, 135417, -462094, 43111, -355391, -211056, -269350, -157288, -105848, -65857, 489225, 96437, -115607, 215606, 2061, 144384, -66960, 52047, 50710, 67479, -30547, -72086, 141196, -12560, 302614, -99645, -48502, 244951, 241142, 79896, 226578, 192268, -177016, -252021, 346147, 61711, -40020, -340629, 472481, 398374, 40007, 6064, 201552, -87020, 344747, -71065, 119911, -39276, -24679, -161405, -127135, -56847, 87239, 267155, -29886, -245117, -45840, 96270, 38409, 216401, 9124, -170925, -136085, 112461, 274985, -7145, 194272, 330777, -219669, 28288, -1244, -284372, -130876, 142035, 47009, 223329, 139174, 333331, -8891, 81380, -57981, 227075, 441]
17520A92160a79409A95560q0723f8661B20630n3881N0419a33054D5296M9103k0457
17509G3942K71219E7567J287H693P5972A5726K09582F0065l512Q6547L8697j5786
17497A66011D3743G562J82969a50765B06160b38133f3276A51706B9843J89167
17487B19010H8634D2293P9496b65486A44501K13349A05987K04443J23484a46345
17476A69929o8995O2830M7983e6392m2396p81A59225j3725b554A10343b7519A37126
17463h2697k7310j47646g5614C08625F5643O6786C918c0794q4756B43267J21457
17452C64724j5756c077D4536P6372m1135L22753A43893M16464j59444G8538R4051
17441A72589L56663o7895K27008C5991L06819h7852A87140o7583E1064d8043A34596
$$ y = [192160, -179409, 195560, 114837, -68661, 220630, 166749, 217168, -133054, 45296, 94399, 73942, 345161, 57567, 58854, 8693, 84665, 15726, 225308, 60065, 56553, 143100, 181797, 166011, 43743, 7562, 190531, -150765, 206160, -238133, -63276, 151706, 29843, 219010, 88634, 42293, 121789, -265486, 144501, 357850, 105987, 310430, 433914, -146345, 169929, 100934, 163764, 211747, -56392, -98788, -99569, 159225, 145500, -2554, 110343, -27519, 137126, -82697, -110007, -257653, -75614, 308625, 65643, 132429, 3918, -30794, -115550, 243267, 364724, 348968, -3077, 44536, 120908, 79773, 402526, 143893, 560357, 400913, 78538, 172589, 529252, 461357, 688365, 35991, 342810, -87852, 187140, 119557, 51064, -48043, 134596]
17429B34871r9793B469M3469M21007l6787K3358n3182j79122K32806j46040l3216
17418B74762A5421N5671l2650L45229a35060F2944K79689o1976c5905B38949b068
17406A1646L14933k493B3865J59395g0721r3945B38557n3385N6936d0711A50112
17394e4539C05144A2318b7195j01743B15935N281a43685B52405q5953K37060j46869
17383B56643E1938K67826j04159b19551a4149A11156B3886L66032p2626p4784
17373B42508P950a8942B1012e8682C10401K236G2140O2485b6473d297k61552A40051
17360A2537K55938a78781f1923B45673F1217h4686A04495J22420H9534J8931L52889
17349D61354b51599B51169a75495B49945h6572C07256i0374A25562d4449A89736
$$ y = [234871, 135078, 2469, 45938, 466945, 430158, 453516, 400334, 221212, 454018, 307978, 274762, 15421, 71092, 38442, 383671, -135060, 62944, 342633, 280657, -35905, 238949, -2068, 11646, 326579, 324086, 23865, 183260, -70721, -164666, 238557, 185172, 242108, -40711, 150112, -54539, 305144, 12318, -27195, -128938, 215935, 221216, -143685, 252405, 166452, 403512, 256643, 51938, 319764, 215605, -219551, -14149, 111156, 23886, 389918, 317292, 242508, 250458, -18942, 21012, -58682, 310401, 312637, 72140, 134625, -26473, -4297, -265849, 140051, 12537, 268475, -178781, -61923, 245673, 61217, -84686, 104495, 226915, 89534, 108465, 461354, -251599, 251169, -175495, 249945, -86572, 307256, -90374, 125562, -44449, 189736]
17338A82824n563l5034O3897b61510Q4448A29721O408o7986K30147f273A71463
17326C24330F2559R8668K67926i363C13543b4752A53591G5308K24298m4206H0861
17314B95102l9358J10814j34839r9056a99534h2221C08132p8818r2686K9948a009
17302g1972D67842j74580I7722J74085j12077C9909M54910j93778a21455B11207
17291A76468p203B4380J83375p7422f6179A7701R8121a68614e6249H1286a00361
17279C7407L0603O0593j2257J24827I6255a00189A90456H7368J719K88076A32348
17267A1379J22716J31443j2576j06684L1214J7811K52329q1633j76879N667J59550
17256C54337P7742j76313q50F1027J79660o9985J46787A3501M0243J57247q381
$$ y = [182824, 177261, 142227, 206124, -261510, -177062, 129721, 136129, 68143, 298290, -6273, 171463, 324330, 62559, 161227, 429153, -9363, 313543, -24752, 153591, 75308, 299606, 255400, 80861, 295102, 255744, 366558, 231719, 132663, -199534, -82221, 308132, 229314, 136628, 166576, -1009, -71972, 467842, 293262, 97722, 271807, 159730, 39909, 494819, 301041, -121455, 211207, 176468, 169265, 24380, 207755, 130333, -66179, 17701, 115822, -168614, -56249, 81286, -100361, 37407, 68010, 128603, 116346, 241173, 96255, -100189, 190456, 87368, 89087, 377163, 132348, 11379, 134095, 265538, 252962, 146278, 177492, 195303, 447632, 365999, 189120, 194787, 354337, 432079, 255766, 254916, 61027, 240687, 170702, 317489, 13501, 53744, 210991, 202610]
17245B02610N4308Q6073l5263D7654K54663A34541Q2035p6366F5315J96532P4677
17234C36524g9553j21978A48111K96603A94548p0736Q5252B4498J45353J71796
17224C41647I2330J39145n2196K09976j53102K05015A81234o0321L41934J6310
17214D79157j74249Q1271l2101k1036B2004J19176L39223o1940j52229J9124K15414
17203E00772n6592A68401j9093N157P5491J61155F7922R9741K47305A02460K84466
17192C86926j46757A16637K96087B04872J01365B4269K43041m1842J31555A9500
17181A14772Q9605J37787I4756L62287j40355j46379E9591K4604L2415C361L22035
17170C25396A51830M27990j77510H8318K38748k0073D2589K41824P42D4728L28853
$$ y = [202610, 256918, 342991, 307728, 47654, 302317, 134541, 216576, 140210, 65315, 261847, 336524, -79553, -201531, 148111, 444714, 194548, 123812, 209064, 24498, 169851, 341647, 92330, 231475, 179279, 389255, 236153, 441168, 181234, 120913, 462847, 479157, 304908, 386179, 354078, 333042, 22004, 141180, 480403, 418463, 266234, 285358, 500772, 444180, 168401, 149308, 154465, 229956, 391111, 67922, 167663, 414968, 102460, 386926, 240169, 116637, 412724, 204872, 306237, 24269, 267310, 225468, 357023, 19500, 114772, 204377, 342164, 94756, 457043, 316688, 170309, 59591, 84195, 116610, 3361, 325396, 151830, 579820, 402310, 88318, 327066, 306993, 42589, 284413, 285155, 44728, 373581]
17159C73581H9294B0475L06144l8238N2657K4903E5974K57335k1433D2429J56599
17148A99028g194D53231P3540B59794H7886M55122O1135A56715L36064k04715
17138B88064A20274L85311j90352Q4927G2451L55120n786B0230M79466j61427
17128C38269J63058j56119I6841L82653j52537M45494C42840j11614H3959K97785
17118C81744A11960J58398J77918p2881A30264K29592J02655l3738G4981K93578
17108C68559L37773l15322r941K27632B49478J12782K5055j36101J398M97253
17098G49865j25605k87856o7797K17737J63488B41507N0375O5699A46420J4751
17088A61171J22418R4484J56276l8960j08331l0142J83535k01726K05939k1468
$$ y = [373581, 89294, 20475, 326619, 288381, 341038, 365941, 55974, 313309, 291876, 42429, 199028, -7194, 453231, 526771, 259794, 87886, 543008, 604143, 156715, 492779, 288064, 120274, 505585, 315233, 400160, 72451, 427571, 421785, 20230, 499696, 338269, 501327, 345208, 96841, 479494, 326957, 772451, 342840, 231226, 83959, 381744, 111960, 270358, 448276, 375395, 130264, 359856, 462511, 428773, 74981, 368559, 706332, 391010, 381069, 608701, 249478, 362260, 387315, 251214, 252612, 749865, 624260, 336404, 268607, 486344, 649832, 241507, 291882, 357581, 146420, 161171, 283589, 378073, 534349, 495389, 387058, 356916, 540451, 338725, 544664, 523196]
17078E23196r9379o6269A28211M3711N8283K10763k11376k2850L41889D5323O05062
17067F50385j68361q8795K50409B78039J24356k0145l166P1239J82330P2933l49007
17056C56579L18131j87258K34927j51602n1903j22994J65113P7676K42722j10341
17046G71050k49808j11706J47021K14005j39243j71386J78902L3720K20385m06480
17036D86460J56577J69592l8307l63047K01279j24875J17916o0082N7267K5110
17026F27890j8890j79811L9307r34K80578o9523Q3018J88016k49335n1017J33058
17015G82357l07465J78056J98523k63983j63452K18538J67545j23537k60375m7647
17005C78560L38942K24037j46160M0336j09749J13892J24639k8552j64712j7873
$$ y = [523196, 423817, 357548, 128211, 171922, 230205, 440968, 229592, 206742, 548631, 45323, 650385, 482024, 393229, 643638, 278039, 402395, 382250, 379084, 450323, 632653, 705586, 356579, 674710, 487452, 722379, 570777, 518874, 395880, 560993, 638669, 881391, 771050, 521242, 409536, 556557, 770562, 631319, 459933, 638835, 672555, 892940, 486460, 643037, 812629, 774322, 411275, 612554, 487679, 605595, 545513, 602780, 627890, 609000, 429189, 468496, 467562, 748140, 678617, 761635, 949651, 700316, 649299, 782357, 474892, 652948, 851471, 587488, 424036, 642574, 810119, 686582, 426207, 378560, 717502, 941539, 795379, 835715, 725966, 839858, 964497, 935945, 771233, 753360]
16995G53360o1215J17695J19613l06377K1884P2793J24353j56589L97008k33378
16985H49147K3638N9910k23018L0229K10511o8926P7808l85068K58637P5860j09907
16974G98821J23491j38551J1294J63849o1404j69098k19075J03071K97499P0707
16964I80604k48151L90919o7101q7920k9838o1280J12222k76960M03448j51239
16954I64704O4519J40682N7154m78740M11318j37040L16850l20871J31391q4964
16944A065003Q4661P0940J02110j19380J3500J96993J76617m62745J33697K33383
16934A494779m54193J39756J10657J2286M6372j21677N305L60197L4394m2485
16924A585391l00618K00030m22186J89851j09559M10547r9534M2256j29257L53998
$$ y = [753360, 692145, 809840, 929453, 623076, 644960, 717753, 842106, 685517, 1082525, 849147, 872785, 932695, 709677, 739906, 950417, 881491, 959299, 574231, 832868, 908728, 798821, 922312, 783761, 795055, 958904, 897500, 728402, 509327, 612398, 909897, 980604, 732453, 1123372, 1056271, 968351, 938513, 877233, 989455, 712495, 1115943, 964704, 1029223, 1169905, 1227059, 748319, 1159637, 1022597, 1339447, 1018576, 1149967, 1065003, 1149664, 1220604, 1322714, 1203334, 1216834, 1413827, 1590444, 1127699, 1261396, 1494779, 1040586, 1180342, 1290999, 1303285, 1349657, 1227980, 1233285, 1593482, 1627876, 1585391, 1284773, 1484803, 1062617, 1252468, 1142909, 1553456, 1453922, 1496178, 1366921, 1720919]
16914A720919l25221K32998l99272L13875J93819J00353q0985M1753o9746J93533
16904A922026k95910L4795J06797k40663j39452J87700L85544k12950K05753k20378
16894A733262J66565K4504k9680o4333m4382K19284K26842j22789J38755q8381
16884B159647J86900j1790l6106J89764m18393K77972J63798j68361J23578L35217
16874B802226m63260J68847j69562q6255M90468k18761K95485J7425J18208j94429
16864B760392J08723k5378K06248j54330O1719n5074R9101N0646j43135M11259
16854C320171J0187j43489K86183n4834n0899p3425j34342L53007J694j07614
16844C406639N52891m39220J66598N27171l20401J17909O7186q7189L29456p39
$$ y = [1720919, 1395698, 1628696, 1229424, 1543299, 1737118, 1837471, 1756486, 1798239, 1728493, 1922026, 1626116, 1660911, 1767708, 1527045, 1387593, 1575293, 1960837, 1747887, 1953640, 1733262, 1899827, 1924331, 1894651, 1830318, 1785936, 2005220, 2232062, 2109273, 2248028, 2159647, 2346547, 2334757, 2298651, 2488415, 2070022, 2347994, 2511792, 2343431, 2467009, 2802226, 2338966, 2507813, 2338251, 2251996, 2742464, 2523703, 2819188, 2836613, 2954821, 2760392, 2869115, 2843737, 3049985, 2895655, 2957374, 2902300, 3001401, 3052047, 2908912, 3320171, 3330358, 3186869, 3473052, 3418218, 3367319, 3293894, 3159552, 3512559, 3514253, 3406639, 3959530, 3520310, 3686908, 4214079, 3893678, 4011587, 4078773, 3991584, 4321040, 4320301]
16834D320301J6879K84086O4181j7937O1816J7276j40184M58292P2543J23016
16824E260269k2965L03788J38253l32266M84062m232J91379L48486k17638L96088
16814F545224l4042K23914N5751j34427N4892J39443K84823N69784k94687K93924
16804G704599L28623K16199J44476J02777P7545K62299M20765k15452K67416K38874
16794I548121M32188L94363L25150M9591M35885K52147p5151M73576K53079M19470
16784A2508419L33388M16616L04186M69001L89884L69434O90574M83587L66220
16775A6331309O63964M49966Q64801J94238Q49846L50993P61091P73236J045279
16766B2284723N76241O17863R36556R30151J108203J185651P91861J387977J041530
$$ y = [4320301, 4337180, 4621266, 4685447, 4667510, 4729326, 4746602, 4606418, 5064710, 5137253, 5260269, 5237304, 5541092, 5679345, 5347079, 5831141, 5826909, 6018288, 6366774, 6149136, 6545224, 6511182, 6735096, 6790847, 6656420, 6711312, 6850755, 7135578, 7705362, 7410675, 7704599, 8033222, 8249421, 8393897, 8496674, 8574219, 8836518, 9257283, 9041831, 9309247, 9548121, 9980309, 10374672, 10699822, 10749413, 11185298, 11437445, 11362294, 11835870, 12088949, 12508419, 12841807, 13258423, 13562609, 14031610, 14421494, 14790928, 15481502, 15965089, 16331309, 16995273, 17445239, 18310040, 18504278, 19354124, 19705117, 20466208, 21239444, 22284723, 22860964, 23478827, 24415383, 25345534, 26453737, 27639388, 28431249, 29819226, 30860756]
16757C0860756J587653R96209J415808J895475J457096J917617J614008K311282
16749D4055904J561155K521414K355576K509811K434708K761113L206236L078588
16741F4484505L423131L400963M009454L769684M415056M422460M542443N450509
16733I7918205M925511N054782N815721O046035N842128N979589N738778N669850
16725A42990599N979863M995787M574825M655144L893695K911469K212867J028718
16717A73242967O03456n72056j723920k122780l521826l999299m567499n397392
16709A51941651m903159o016999o095695o118991o160805o063023n605800n789754
16701A05187425n398790n492046n159719m763670m471660l879177m175898l918474
$$ y = [30860756, 32448409, 33444618, 34860426, 36755901, 38212997, 40130614, 41744622, 44055904, 45617059, 48138473, 50494049, 53003860, 55438568, 58199681, 61405917, 64484505, 67907636, 71308599, 75318053, 79087737, 83502793, 87925253, 92467696, 97918205, 102843716, 107898498, 113714219, 119760254, 125602382, 131581971, 137320749, 142990599, 148970462, 153966249, 158541074, 163196218, 167089913, 170001382, 172214249, 173242967, 173846423, 173274367, 171550447, 169427667, 165905841, 161906542, 157339043, 151941651, 147038492, 141021493, 134925798, 128806807, 122646002, 116582979, 110977179, 105187425, 99788635, 94296589, 89136870, 84373200, 79901540, 76022363, 71846465, 67927991]
16693F7927991l277962l496701k916046l120046k568933k664638k160378k621495
16685D5101792k029401j800695k087880j394270j941578j370975j508644j203232
16677C1765117j384129q95511j410494j027683j269517j082775p75978j383928
16669B2535102l09146o52320p59243r77073n10709q98517o20040l74248n95543
16660A6838263o30617n09606m02168m08410m57797m58258n03409l22928m85693
16651A2659377o70210K28641n58573j65450m68878p24579K52784n24614N0720
16642A0079218L1388m80300n65624K4941k74366p2786k40735l09856p9088M5052
16632H157844k09542n59137k73662K07815k05838k76302l04935n4200m186j28294
$$ y = [67927991, 64650029, 61153328, 58237282, 55117236, 52548303, 49883665, 47723287, 45101792, 43072391, 41271696, 39183816, 37789546, 35847968, 34476993, 32968349, 31765117, 30380988, 29485477, 28074983, 27047300, 25777783, 24695008, 23919030, 22535102, 22225956, 21573636, 20814393, 19837320, 19326611, 18428094, 17808054, 17433806, 16838263, 16207646, 15698040, 15295872, 14887462, 14429665, 13971407, 13467998, 13145070, 12659377, 11989167, 12217808, 11659235, 11493785, 11024907, 10300328, 10553112, 10028498, 10079218, 10110606, 9630306, 9064682, 9089623, 8815257, 8742471, 8501736, 8191880, 8112792, 8157844, 7948302, 7389165, 7115503, 7323318, 7117480, 6841178, 6536243, 6482043, 6477857, 6349563]
16622F349563j69731k24644j74074N9308k74119j60728j53275n7219J74887n5621
16612E314347n56573J32866l41831N32900o83056M62025m87292j73232J34374
16603D334528J89224l87799Q4153l06287j15936j01929M9930l031M60469n42083
16593C661239J91535k94611J41323j07008j3998j46699j50521J3891k39357N6884
16583C112678q1052J64405l18819K42880l35608O4059j33118L0027k5804P734
16573B727382K99059k02438m60486M24822j7346k23212q9462J64506l2076j78425
16563B412324m46120k7786K64712p3943K20623j16575M6712j5213k05644R1073
16553B150163R794j85791O3356j10589J10622k74557L36376k54607J41714k27043
$$ y = [6349563, 6179832, 5955188, 5781114, 5840422, 5566303, 5405575, 5252300, 5195081, 5369968, 5314347, 4757774, 4890640, 4548809, 5081709, 4398653, 4860678, 4373386, 4200154, 4334528, 4523752, 4135953, 4220106, 3913819, 3797883, 3695954, 3745884, 3742853, 4203322, 3661239, 3852774, 3558163, 3699486, 3592478, 3578480, 3431781, 3281260, 3295151, 3055794, 3112678, 3031626, 3196031, 2877212, 3120092, 2784484, 2848543, 2715425, 2745452, 2719648, 2727382, 3026441, 2824003, 2363517, 2788339, 2770993, 2547781, 2458319, 2622825, 2590749, 2412324, 1966204, 1938418, 2203130, 2129187, 2349810, 2233235, 2279947, 2264734, 2059090, 2150163, 2159957, 1974166, 2037522, 1926933, 2037555, 1762998, 2099374, 1844767, 1986481, 1759438]
16543A759438j75581K25390j53518J52419r0155n7063J77235J32340k57515M5754
16533A758744k446j64093o2385j4054J30830j9845J69830k54516L62945m70455
16523A434555J28006j87931k5442L16408j55420o562n3306l03873n7665R9079
16513A187849K80044m15644L39629n877J03J84439l89612q3332M61399k80757
16503A278241j89478J43452N0633p7897n7762n9411J30449J25182j38946j27837
16493A076626p5920J0098K87715k57691j2233P256o2950K62570k29133l3663j30983
16482H41692J97441j3707j34691j1125o5605M04680k10532j43835K29604K72433
16472A366355n89074Q8536J58179L28169n36367L96683l24477l4593K16326k97997
$$ y = [1759438, 1583857, 1809247, 1655729, 1808148, 1717993, 1660930, 1838165, 1970505, 1712990, 1758744, 1756298, 1592205, 1529820, 1515766, 1646596, 1626751, 1796581, 1542065, 1905010, 1434555, 1562561, 1374630, 1349188, 1665596, 1510176, 1503614, 1450308, 1146435, 1088770, 1187849, 1467893, 1052249, 1391878, 1386001, 1386104, 1570543, 1180931, 1097599, 1558998, 1278241, 1088763, 1232215, 1282848, 1204951, 1147189, 1087778, 1218227, 1343409, 1204463, 1076626, 1000706, 1010804, 1298519, 1040828, 1028595, 1035851, 972901, 1235471, 1006338, 972675, 841692, 1039133, 1025426, 890735, 879610, 814005, 1218685, 1008153, 864318, 1093922, 1366355, 777281, 865817, 1023996, 1352165, 815798, 1212481, 888004, 853411, 1069737, 771740]
16462G71740l0228j4914L78246k30730Q5276J7967l37151N30571n48946M28781
16452A050612j64884k04423J54735n8811J18240k95112J29565L18560m5822q2984
16442I19676k28785L20610k30310k35928J65359j86307J52040K18034j41382k1969
16432G31038L60950D40836L14166M1940q9814n0401J19796j1984C76805K95193
16422F71998j68078L1043j2263J76892k74703L83330M6104j57553k53205K66911
16412G10476B32075M05584m2968J22811j73705j58921J90861I2088K08894K19828
16402E20810M9665j92143O0876k04288J13099O4010J32914M30763j09801k24032
16392F41873l06900L90768C53836J12487K46774o8657L6209N9360j63912J24957
$$ y = [771740, 741512, 726598, 1104844, 874114, 959390, 977357, 640206, 1170777, 621831, 1050612, 885728, 681305, 836040, 777229, 895469, 600357, 729922, 1048482, 1002660, 919676, 690891, 1011501, 781191, 545263, 710622, 524315, 676355, 894389, 753007, 731038, 1091988, 440836, 755002, 796942, 707128, 656727, 776523, 764539, 376805, 671998, 503920, 534963, 522700, 699592, 424889, 808219, 854323, 696770, 443565, 710476, 232075, 637659, 594691, 717502, 543797, 384876, 575737, 92088, 300982, 520810, 570475, 378332, 439208, 234920, 348019, 412029, 544943, 975706, 865905, 641873, 334973, 725741, 353836, 466323, 713097, 644440, 680649, 740009, 576097, 701054]
16382G01054k95192R998K79418l30706J36015j23137K63115O2047J79157k61629
16372F20140j60411A92161J17959J91955J53744k06468Q9766B50136I9837L29060
16362D28897J46395m6913F2440N58187k72262A25166M89625k84482K6767K68474
16352F25550B79207J85539I9816K43443K66010O821j18892B39045K47511p9681
16342D06875j292L1343M572k5821A31523M65095J0034B79076A9200M16117A38093
16330D12139B03541K76455n4178j49222p9326L64513B25133J30522A60632A0626
16319C61504j09770J66260j62770k3225J18411L78066B23611J02367k1021J81577
16309D86534j43188J62069P1340B40401c9317A62041J46581j41881L69011k02402
$$ y = [701054, 405862, 415860, 695278, 364572, 500587, 377450, 640565, 702612, 881769, 620140, 459729, 192161, 310120, 502075, 655819, 449351, 539117, 250136, 99837, 428897, 575292, 528379, 62440, 620627, 348365, 125166, 614791, 330309, 357076, 625550, 279207, 464746, 99816, 343259, 609269, 616090, 497198, 239045, 486556, 406875, 405583, 436926, 441498, 415677, 131523, 596618, 606652, 279076, 19200, 435317, 138093, 412139, 203541, 479996, 425818, 276596, 197270, 561783, 225133, 355655, 160632, 10626, 361504, 251734, 417994, 255224, 231999, 350410, 728476, 223611, 325978, 304957, 486534, 343346, 505415, 576755, 240401, -39317, 162041, 308622, 166741, 535752, 333350]
16299C33350L6932Q1860A39274c6693l5232A90767k0422K95971j42616r9969J66651
16288C90382A45544A9049J61790L08880B15261L3471J85884A33366M38788A83939
16277A22134M27987a8370K581D03637d2194B77650n0329j06313M93912k60311
16267C54609J61649A27900L00854j28235H4452C1936J93622a904j0959A37788
16256F46227A82852M5860M9791A24248J22422e8539A38217M0222L17784k41723
16246B54500A01787Q2179K08885F4539N62917B62960K60955n7811A33893J81531
16236C15424j22848m8832J68863A52208k9837a52299A78468n0415F344M70333
16226D76677q5269j43163a04780F5253J89869j05217E9537a05950F9758J41946
$$ y = [333350, 370282, 452142, 139274, -36693, -71925, 190767, 170345, 466316, 323700, 223731, 390382, 145544, 19049, 180839, 489719, 215261, 248732, 434616, 133366, 572154, 183939, 122134, 550121, -18370, -15789, 403637, -42194, 277650, 227321, 121008, 614920, 354609, 516258, 127900, 428754, 300519, 84452, 31936, 225558, -1904, -12863, 137788, 646227, 182852, 228712, 278503, 124248, 246670, -58539, 138217, 178439, 496223, 254500, 101787, 183966, 392851, 64539, 627456, 262960, 523915, 466104, 133893, 315424, 192576, 143744, 312607, 152208, 122371, -152299, 178468, 128053, 6344, 476677, 391408, 248245, -104780, 65253, 255122, 149905, 59537, -105950, 69758, 211704]
16216B11704K21066j36597C7592F824J83646K46218F1640g6337j18422b0239H0231
16204A84782m4593J29601b3354C91078r9178n5300I4613J18364L81862l2035e7589
16192D81652j97025K64341A46844O980n3409k391J44168B0947c7697D29644Q751
16181D38395q6349j3722j44274J17414E0404J99124n1466o6566A5385K27344R1894
16170C34623A65895b63844a15233B48741r5392m4009J67043a08734K9233d469
16159d6822B78367F823J08829C802K18514a5684A24400R0353C1066L63783b0906
16147H3056i1443D3246d2743C82082j50278d14899A68629B5819O9729L2762g0681
16135A76114p5592c0129C8203D684h9877A80129M09303k53772a79699B59077E7184
$$ y = [211704, 432770, 296173, 37592, 6824, 190470, 436688, 61640, -76337, -194759, -20239, 80231, 184782, 140189, 269790, -23354, 391078, 291900, 236600, 94613, 212977, 594839, 562804, -57589, 481652, 284627, 548968, 146844, 153824, 100415, 98024, 242192, 20947, -37697, 429644, 438395, 352046, 338324, 194050, 311464, 50404, 249528, 198062, 131496, 15385, 242729, 334623, 165895, -263844, -115233, 248741, 153349, 109340, 276383, -108734, -79501, -4469, -46822, 278367, 6823, 115652, 3802, 222316, -15684, 124400, 214753, 31066, 394849, -20906, 83056, -91443, 43246, -42743, 382082, 231804, -414899, 168629, 25819, 95548, 128310, -70681, 176114, 100522, -30129, 38203, 4684, -89877, 180129, 589432, 335660, -179699, 259077, 57184]
16123A32848k3446E2326k2734a30018a2360C16751j50934J28440k6884D3565J49290
16112A92855J36913N590a34395j3027E9268J28676G9332J02162B870Q7569A8336
16100A09288m3494c3710D9116J43778J08l2836G1726a38614A28882J10975I898
16088f8252l88447C02746A4509J49017B4148b50389A07696d3727j8808j01471
16078a64006h265A60688b49272A25372k9448i7018k91768i7620E0122J90242J3361
16067B53725g1646R533A25627n9203a20036J2249r7639I5239Q9007H5828J90572
16056B76400D1689J20039a66649B47393j02347D5389L11461c5657a103B22309
16045F6985h2741B04849F0012b961l78306Q2074c6398k04141E45c05475J09503
$$ y = [132848, 109402, 52326, 29592, -130018, -12360, 316751, 165817, 294257, 267373, 43565, 192855, 329768, 335358, -134395, -147422, 59268, 187944, 79332, 181494, 2870, 90439, 18336, 109288, 65794, -33710, 49116, 192894, 193002, 160166, 71726, -138614, 128882, 239857, 9898, -68252, -456699, 302746, 14509, 163526, 24148, -250389, 107696, -43727, -62535, -164006, -8265, 160688, -249272, 125372, 95924, -97018, -388786, -97620, 50122, 240364, 253725, -71646, -62113, 125627, 66424, -120036, -107787, -205426, 95239, 184246, 85828, 276400, 41689, 161728, -166649, 247393, 145046, 45389, 356850, -35657, -1103, 222309, 66985, -82741, 204849, 60012, -2961, -381267, -299193, -36398, -240539, 545, -305475, -195972]
16034a95972M8412f6784j15471A21636a38413O1881B30672p8403G3177J01569
16024A74746a23517A61804f949l7809j01429j89811A38557b4547k23316B83733
16013e8139a6103j47542A63739N9170g8846H2877l8593K29293g1472A55981c03705
16001C0869D512J00199j5427i0128E7720f6165j27897E1121K6473a48292B07728
15989B028a13943j36313B4702a69535B01349J3126G9495J79041o7532C7244L30450
15978C67694F5027d8608A48297O3582L7584G80J29243h1906H6434j8766J58445
15967B26113g0163m4749L4016A15084L8175b37700A1832i5497r7028B20391Q6631
15956C07022J13533A91551C5730P5559J51518a97851A15913a92656B0670J21673
$$ y = [-195972, -147560, -66784, -182255, 121636, -138413, -76532, 230672, 152269, 73177, 174746, -123517, 161804, -6949, -44758, -146187, -335998, 138557, -24547, -247863, 283733, -58139, -16103, -163645, 163739, 222909, -78846, 82877, 44284, 273577, -71472, 155981, -303705, 30869, 4512, 104711, 89284, -90128, 57720, -66165, -194062, 51121, 77594, -148292, 207728, 2028, -113943, -250256, 24702, -169535, 201349, 214475, 79495, 258536, 191004, 37244, 367694, 65027, -48608, 148297, 211879, 249463, 780, 130023, -81906, 86434, 67668, 226113, -70163, -114912, -80896, 115084, 153259, -237700, 11832, -95497, -192525, 220391, 307022, 420555, 191551, 35730, 111289, 262807, -197851, 115913, -192656, 20670, 142343]
15946A42343J8005h1181k74241A00629K4764B7928J07162C7074a42232f2445c1079
15934b58711G7826O573M5990a8047C11327e5446A6634e7597A05829a0523j99737
15923b10260G4127b11036A66760D0901c38685a45975E5802c70079B70363A8625
15912a59794K3351A85170c31331h8458J6723D7716K37716a26612f2890G6979h4042
15900A46382a31009G7140L2067J54395k8368G6216B8635j0595b44564A36864a87852
15888A40771J27584K9712f1074A6636a22653j6400b482j63605A63221f7194l23036
15877c90230a39118e6845A48329B0824d1833r9174j18744G4698b9544A35792b32863
15865A55945b18132r1270Q8580M9413g849I3331d4520j53882P3314I3274m6001
$$ y = [142343, 160348, -81181, -355422, 100629, 125393, 27928, 135090, 37074, -142232, -62445, -31079, -258711, 77826, 84399, 130389, -18047, 311327, -55446, 16634, -57597, 105829, -10523, -210260, 74127, -211036, 166760, 40901, -338685, -145975, 55802, -370079, 270363, 18625, -159794, -136443, 185170, -331331, -88458, -71735, 47716, 285432, -126612, -62890, 76979, -84042, 146382, -131009, 77140, 109207, 263602, 235234, 76216, 28635, 18040, -244564, 136864, -187852, 140771, 268355, 298067, -61074, 16636, -122653, -139053, -2482, -166087, 163221, -67194, -390230, -139118, -56845, 148329, 20824, -41833, -141007, -259751, 74698, -29544, 135792, -232863, 155945, -218132, -309402, -220822, -171409, -7849, 93331, -44520, -198402, -125088, 93274, 47273]
15854D7273e2882A0358i2798E6990a46779A79814F1375g4986B19010a19025m8428
15843a67453M031j56932k12411B80055o9476C6260b04795J01074m5887A07273
15832d49041O5079f3454j69431A80430c17217A5011c94764e5565F7534K25601
15822B93135F39L1712M4561b15068C21436G3739c12237e0101C9004L25650i3157
15810a82880c9276j05354A5799N0395C1985b20883B98669G4497f4682a9096k54599
15799b73695D2032a31382B0626J49363a42091c8805l18187a67098a33A46159m3857
15788A02302a78846Q6608k0821J990A83419i8534A24347A5392a86796d628o4733
15777f9361q59j60147A78263l9842a4343M184l9340o6688G4258M5304a13100A5567
$$ y = [47273, -52882, 10358, -92798, 56990, -146779, 179814, 61375, -74986, 219010, -119025, -167453, -163422, -320354, -532765, 280055, 210579, 36260, -204795, -103721, -149608, 107273, -449041, -383962, -63454, -232885, 180430, -317217, 15011, -394764, -55565, 67534, 293135, 639, 32351, 76912, -215068, 321436, 73739, -312237, -50101, 39004, 364654, -93157, -182880, -39276, -144630, 15799, 66194, 31985, -220883, 298669, 74497, -64682, -19096, -273695, 42032, -131382, 20626, 169989, -142091, -38805, -356992, -167098, -133, 146159, 102302, -178846, -92238, -113059, -111069, 183419, -98534, 124347, 15392, -186796, -4628, -69361, -70220, -230367, 178263, 138421, -14343, -10159, -49499, -116187, 74258, 119562, -113100, 15567]
15764A37617K2796a61271d2244l17285G3771l1679N8559A2510P8837e3419B0048
15752A31315d8866q7876E86286c17796A52109B8980J0682J07201J4558A6872a2613
15740C55410e7615l644H4309b32060A33665b20838D0651K89892c94734C35757
15729c4709n8944m347G68h2779j3406j6052D9164a42582B27154o6031i3169C89500
15716h7432A2564J3331m88c28131a10668B65690f0035I8103J13309a97228j51506
15705c48734E29K87729o1009e9191o5697D5532J26289N3178b111l22704a03076
15693E0558e76488a26455A64300c94511G4344M5702c43505b7056j14606B333L4938
15682C7271d2969r1644A13894g6452j31091N7861r7621A74027b39650d3799j4029
$$ y = [137617, 160413, -161271, -42244, -359529, 73771, 42092, 100651, 12510, 91347, -53419, 20048, 131315, -48866, -136742, 586286, -317796, 152109, 28980, 39662, 146863, 161421, 16872, -12613, 355410, -57615, -61259, 84309, -232060, 133665, -220838, 40651, 330543, -394734, 335757, -34709, -93653, -98000, 768, -82779, -96185, -112237, 49164, -142582, 227154, 161123, -93169, 389500, -87432, 12564, 25895, 25407, -328131, -110668, 265690, -60035, 98103, 211412, -197228, -348734, 529, 288258, 227249, -59191, -124888, 45532, 171821, 224999, -2111, -324815, -103076, 50558, -576488, -126455, 164300, -394511, 74344, 120046, -343505, -27056, -141662, 2333, 37271, -42969, -134613, 113894, -76452, -207543, -149682, -247303, 174027, -239650, -43799, -57828]
15671e7828q4851B57203b66077J9368A97241n7528f6779A5120J17296b20359E2394
15659a173B67616C9670a1754D6692o44a65817l6436g8560B21066a08203A47592
15647A63834b39944D0228c4777B2828J30570Q0541a01149c2895j54587k5457n3901
15636b66840I7947K20717H0932a93746A85174q5249a59464K1445B2583a66342
15625B4826O9940d6405l5669C07598b84034j18403f2580j76503e3103A21776J623
15614A23399B1526d1147j00884k56541B3698A94c26790a23181B9286a06721r1578
15603a98299A87307A5298P9959d3055A34594K57876j23590c34992A12752c89077
15592c44040g6256k79509c9780A15241J81871A47998n3713C6621A6846E614g4505
$$ y = [-57828, -142679, 257203, -266077, -246709, 197241, 139713, -66779, 15120, 132416, -220359, 52394, -1173, 267616, 39670, -11754, 46692, 46048, -165817, -202253, -78560, 221066, -108203, 147592, 163834, -239944, 40228, -34777, 22828, 153398, 233939, -101149, -32895, -187482, -212939, -266840, 97947, 318664, 80932, -193746, 185174, 99925, -159464, -138019, 22583, -166342, 24826, 94766, -46405, -82074, 307598, -284034, -402437, -62580, -239083, -53103, 121776, 123399, 21526, -41147, -142031, -398572, 23698, 194, -326790, -123181, 29286, -106721, -198299, 187307, 15298, 95257, -43055, 134594, 392470, 268880, -334992, 112752, -389077, -344040, -76256, -355765, -39780, 115241, 297112, 147998, 94285, 36621, 16846, 5614, -74505]
15580A48114D3112k0603b5074A20135d9391m6011o8388A21426e3239r173H8962
15568A1296K49943a64165p8638R0012j20304B2651J61922B1506Q0846D2336M4717
15557H7053a040r65C64238c6849m9713k9026C22579b46930B92488C7715M94O0856
15545I9065J4070K07224g8640c3241m6412B31917J23258A50021c0950k75543a2425
15533A29970n7327J53035a80137d7307G559b18356E7952a32082a5220A89521o9107
15522A20414a407j91577m4586D5421a0237j59411e678A37632A4758P7399D2759
15510h0590C5026b21545A08394L9187N8867F7426d7367q2938e5958A31368D9432
15498A93166a47157k3280p5329o0563A12375a91674q1876e5877j18503Q1151a9709
$$ y = [148114, 43112, 22509, -25074, 120135, -49391, -95402, -163790, 121426, -53239, -62412, 88962, 11296, 261239, -164165, -242803, -152791, -273095, 22651, 184573, 21506, 102352, 42336, 87053, -1040, -2005, 364238, -36849, -86562, -115588, 322579, -246930, 292488, 37715, 38209, 99065, 113135, 320359, -78640, -33241, -79653, 231917, 355175, 150021, -30950, -306493, -12425, 129970, 72643, 225678, -180137, -47307, 7559, -218356, 57952, -132082, -15220, 189521, 120414, -1407, -192984, -237570, 45421, -10237, -169648, -5678, 137632, 14758, 92157, 42759, -80590, 35026, -221545, 108394, 147581, 206448, 67426, -47367, -130305, -55958, 131368, 49432, 193166, -147157, -170437, -245766, -306329, 112375, -191674, -273550, -55877, -174380, -93229, -19709]
15486c23730B21425D1L20943O7499b7072A06172C2250J13452F9887B5512b930
15474b45901R6200d7335n8095A47580c61946A35175i643j32282D12543I2887j8680
15463G4207b86997h9403J776B20458E648Q9055M60879b0795D7963a31793E8640
15451i632n4380A90552g5871k24927c2181k32220A20346b42536D04047A65371
15440B40446b19059A51295c04092c3893A76914p0881c12296B72836R4262r1619
15430B75479b25468H0125a50567l40646c3873D9074L93433c7742A84979K5597
15420B10576D4986A220J39742c0689j9861b4808C6224b91974B17993a21852B14534
15408F8699d45j95086b1271m6876N901B2772a68847g036o0417C8351n330M8367
$$ y = [-323730, 221425, 41, 320984, 388483, -27072, 106172, 32250, 145702, 69887, 25512, -2930, -245901, -149701, -47335, -105430, 147580, -361946, 135175, -9643, -141925, 412543, 92887, 74207, -286997, -89403, -87627, 220458, 5648, 94703, 555582, -20795, 47963, -131793, 58640, -9632, -64012, 190552, -75871, -300798, -32181, -264401, 120346, -242536, 404047, 165371, 240446, -219059, 151295, -304092, -33893, 176914, 106033, -312296, 272836, 367098, 275479, -225468, 80125, -150567, -491213, -33873, 49074, 442507, -37742, 184979, 210576, 44986, 1220, 140962, -30689, -50550, -24808, 36224, -291974, 217993, -121852, 214534, 68699, -445, -195531, -21271, -68147, -62246, 22772, -168847, -7036, -67453, 38351, 33021, 81388]
15396H1388b47539a19666c9879k09405G9966c72814i5715L7081B80840k4744E2323
15384f2242A75837a51798E0064l37j548f5253k14909A81213b98865J43820P6166
15373g8879H4598a5781m5752j56520F9194K53140i1056G9354C3517N7034rd28776
15360B9813h0554A43312b85098F9100c8481C03265o4098j00665c6836k95855I3565
15348A97695G8268f8530o300C01131A17236f633B73263m5395D9557f0880j80912
15337b41792g2501B18450a00241B28877e7389B57544g2917A46056j0841a05342
15326A54981n6616M5943O914R6241c5657m8205A20169h399l0443r3394j84201
15315c16437g1208c236A6288J82633b14276A53790o1500a27777A14032K0397K10437
$$ y = [81388, -247539, -119666, -39879, -249284, 79966, -372814, -95715, -58634, 280840, 256096, 52323, -62242, 175837, -151798, 50064, 49727, 48179, -65253, -280162, 181213, -298865, -155045, -78879, 84598, -15781, -61533, -218053, 69194, 322334, -91056, 79354, 33517, 90551, 90542, -428776, 29813, -80554, 143312, -285098, 69100, -38481, 303265, 239167, 138502, -36836, -332691, 93565, 197695, 78268, -68530, -74830, 301131, 117236, -6633, 273263, 227868, 49557, -60880, -241792, -72501, 218450, -100241, 228877, -57389, 257544, -72917, 146056, 135215, -105342, 154981, 98365, 144308, 151222, 247463, -35657, -83862, 120169, -8399, -38842, -132236, -316437, -71208, -3236, 16288, 198921, -214276, 153790, 92290, -127777, 114032, 134429, 344866]
15304C44866A41848h4620K8639B10948C0645J63991N9891d9319A34813a682C552
15292E5092b54781E6674i8455G2039K75700r5136p8705C5591J03715P2588p9173
15281A32721N2381k8074g3717q7680a703A69717b7291A17158b29748A80051q5769
15270I4282Q3414K3796B3190J61724J1251F3935H071K92642A27370K05192c81211
15258A12152a33737B8630K8065g4797D2825b15330D7930J48905r2619R6833P0067
15247B71116N79572O92323O60608J59831K3520l82410o91611E19098A49843J53966
15237C03809p436a57836E4218b9705k43719J01849g8920C20992O3739h6089B4960
15225a03232B36596a55091A90386g4700A25819l5761a62726e0777j44924A52066
$$ y = [344866, 141848, -84620, -55981, 210948, 30645, 194636, 254527, -49319, 134813, -1682, 3552, 55092, -254781, 56674, -98455, 72039, 347739, 252603, 173898, 35591, 139306, 211894, 132721, 185102, 157028, -73717, -161397, -1703, 169717, -27291, 117158, -229748, 180051, 94282, 177696, 201492, 23190, 184914, 196165, 63935, 8071, 300713, 127370, 332562, -381211, 112152, -133737, 28630, 56695, -74797, 42825, -215330, 47930, 196835, 104216, 201049, 271116, 850688, 1543011, 2203619, 2363450, 2386970, 2004560, 1312949, 519098, 149843, 303809, 296373, -157836, 54218, -29705, -273424, -171575, -78920, 320992, 384731, -86089, 24960, -103232, 236596, -155091, 190386, -74700, 125819, 90058, -162726, -50777, -195701, 152066]
15214F2726b18034A30513r28J18703a99620A35638a83295A35970a15180L6460
15204g8720C02751I0249J45884G9889C0833b3631A1020b36434g7789C2964M36921
15193D69885I1763h6749p1546m2692A6256B529J99277a1511o1648B02714a6309
15181A99298a30627C8733K26243d0909n2021A92857F1655L3238a67372G5001e6939
15169B30697j10306d34369A78002b25617A70154a4525B98155j37634a70241j51335
15159c21576A4232M27392B2243J66006J02033a85292A77610J67721a37924B03026
15148g1168B55988G0535L96347A36551l840B6054i089I3679R4955P0660a09551
15136a1215j05109C04383g8060D83185j83208h2246p2361p4706D6153J52116h2640
$$ y = [62726, -218034, 130513, 129585, 248288, -199620, 135638, -183295, 135970, -115180, -78720, 302751, 90249, 236133, 79889, 30833, -23631, 11020, -236434, -77789, 32964, 469885, 91763, -86749, -158295, -200987, 16256, 2529, 201806, -11511, -73159, 202714, -16309, 199298, -130627, 38733, 264976, -40909, -92930, 192857, 61655, 94893, -167372, 75001, -56939, 230697, 120391, -434369, 178002, -225617, 170154, -14525, 298155, 160521, -170241, -321576, 14232, 441624, 22243, 188249, 290282, -185292, 177610, 345331, -137924, 203026, -71168, 255988, 70535, 466882, 136551, 132711, 26054, -9089, 93679, 188634, 259294, -109551, -11215, -116324, 304383, -78060, 483185, 299977, -82246, -154607, -229313, 46153, 198269, -82640]
15124B22486K12260j44679F7111O3023E4647L10892A79705r660e7508B95797F2493
15112B15082l1707E9635J78894o6178a06579C6429K37200L45815a84103A77628
15101a22072n9223D95733a34339d9680N126C36166b27642A57433a31663B92374
15090b02006E83679d8755D9209M2783a53307b3109B51379L0576j15410J20098
15080B86643b5984B53847C1567K35992n7879m4544a14095C20595k794A1683D833
15068G2355c36343A53893J42576G8943K14630j16030c457j58446F73590a1342
15057A22226J26318i9534K1127j75654A98141L38645B3149L25586A1680g6766
15046A56630K37033A04609J24450m5160L11153G7644J02419L85429B2914L26793
$$ y = [222486, 434746, 290067, 67111, 130134, 54647, 365539, 179705, 170045, -57508, 295797, 62493, 215082, 183375, 59635, 238529, 172351, -106579, 36429, 273629, 619444, -184103, 177628, -122072, -181295, 495733, -134339, -49680, -44554, 336166, -227642, 157433, -131663, 292374, -202006, 583679, -48755, 49209, 91992, -153307, -23109, 251379, 281955, 166545, 286643, -25984, 253847, 31567, 267559, 209680, 165136, -114095, 320595, 317801, 11683, 4833, 72355, -336343, 153893, 296469, 78943, 293573, 177543, -3457, -161903, 673590, -11342, 122226, 248544, -99534, -78407, -254061, 198141, 536786, 23149, 348735, 11680, -76766, 156630, 393663, 104609, 229059, 183899, 495052, 77644, 180063, 565492, 22914, 349707]
15036C49707A29917f0260C4620J64673J2556q635G2137B8800J32459J52988j7730
15025B96517N0798I6669C173L58064A3202f3193H126O4768a14278G6321A3523
15013I4962N06407k88695O4097b2614A95617m8159P2699K15590h2061C97708D8215
15001A97651K15129A69694R1701D2201L13745A14731K57433G0698K67642A36994
14990I7948J94022f190D03263B9722M50741F3656J36018L46708B8149O0106K13201
14979C01456D0986K71311I6512h2845A53624R8275B1741J73541a78497E14402
14968A80505K20737A64834R0102j25417R3762M3694J99017A75958m8935N36664
14958F63687B27488p2570R2996K63296A48741K416J81199p0924o8365a42664A34744
$$ y = [349707, 129917, -60260, 34620, 199293, 211849, 203214, 72137, 28800, 161259, 314247, 296517, 347315, 96669, 3173, 361237, 13202, -63193, 8126, 72894, -114278, 76321, 13523, 94962, 601369, 312674, 376771, -22614, 195617, 147458, 220157, 435747, -82061, 397708, 48215, 197651, 412780, 169694, 261395, 42201, 355946, 114731, 372164, 70698, 338340, 136994, 97948, 291970, -6190, 403263, 29722, 480463, 63656, 199674, 546382, 28149, 88255, 301456, 40986, 312297, 96512, -82845, 153624, 251899, 21741, 195282, -178497, 514402, 180505, 401242, 164834, 254936, 129519, 223281, 266975, 465992, 175958, 127023, 663687, 227488, 154918, 247914, 511210, 148741, 151157, 332356, 261432, 193067, -142664, 134744]
14946b1121A00231K91717k9641J3152j04529K29335a4846l8315D90151O232j47373
14935C49010j16853K48276e5579B32223J35298p6686J20029F3222b27755i961
14924C20718p4298O6564L55369B34990L20894B50209k4970J11288A36789O27043
14914G63832A95947L13107A52522J63635J49651k12333D2860J63701c1124C68219
14903B16451N8465J8612J12577J63578o5580Q9010G0673K46112J3812j5136j8462
14892B96999j35630M59873k59806O810K35362D4565K71133J8342K74572k28145
14882C80467p8398n1020l2564K22077M3605J7061B2638L57012n0488F7490K10133
14871B77623K41768j83544j30678K94264j30986J81073k50541J01023j16224K1040
$$ y = [-21121, 100231, 391948, 362307, 375459, 270930, 500265, -14846, -53161, 490151, 496383, 349010, 232157, 480433, -55579, 232223, 367521, 290835, 410864, 63222, -227755, -9961, 320718, 246420, 312984, 668353, 234990, 555884, 250209, 225239, 336527, 136789, 763832, 195947, 509054, 152522, 316157, 465808, 253475, 42860, 206561, -31124, 368219, 216451, 274916, 293528, 406105, 569683, 504103, 593113, 70673, 316785, 330597, 315461, 296999, 161369, 621242, 361436, 368246, 603608, 44565, 315698, 334040, 608612, 380467, 302069, 251049, 218485, 440562, 484167, 501228, 22638, 379650, 329162, 67490, 277623, 519391, 335847, 205169, 499433, 368447, 549520, 298979, 400002, 283778, 304818]
14861C04818O4630K20864K80630D09127j86445d1998C31840n415J73947j54971
14851C45401O0993K30254k19908O0312J02952j24558r3970A57564P4062j8092
14841B13534o3273J88423A30025L37014j47310R3415L87153A66551J78236L88125
14831G32912C49288K37295K41313D00334N9041K75341l01019n0042p6862J29612
14821D36405K39521j77564n4335M32652D15685J79026A02448O00530r8371j69547
14811D35060M1279j01653J40568A22711K00007L8004A32804M08824M7771K04730
14801G94129C69373K45369j25962o6357p9621L0990M743J96105j7803j02018j6809
14790D38010J50839k4686J60635j00795q5939o1937J52778j65618K42973M6581
$$ y = [304818, 369448, 590312, 870942, 409127, 222682, -41998, 331840, 326425, 500372, 345401, 406394, 636648, 416740, 477052, 580004, 455446, 361476, 157564, 231626, 213534, 150261, 338684, 130025, 467039, 319729, 413144, 800297, 166551, 344787, 732912, 349288, 586583, 827896, 400334, 459375, 734716, 433697, 383655, 306793, 436405, 675926, 498362, 444027, 876679, 415685, 594711, 102448, 702978, 604607, 435060, 476339, 374686, 515254, 122711, 322718, 360722, 132804, 541628, 589399, 794129, 369373, 614742, 488780, 422423, 342802, 373792, 378535, 574640, 556837, 454819, 438010, 588849, 564163, 724798, 624003, 538064, 476127, 628905, 463287, 706260, 752841]
14780G52841k06978J7606K02239k68064J57131j11212P0562O9374J06853P7382
14770H67734l76563Q587J04729N2283K8110O3335N4261k89076J77836J2080k17820
14759D85496K13102j30152m3753J53634K98647p8690k60727l13523M19809K52224
14749I96067l16339k9857J20519M2067l15807r1596M20571r9870k8733j7445O947
14738F86524J92295q423J07343k32888l26256J7829M51699j13123N2420N2529
14728H79949j51534j18464j01780K31322L9790k97472J92396J61383m5090P4656
14718H65156j14001j57199J24551j67001J4765K83855N7672L3458k46415K16851
14708I11692j86880K3540l0081n735R3331m1448L08656l84089J23315J20254A17495
$$ y = [752841, 545863, 563469, 765708, 497644, 654775, 543563, 614125, 683499, 790352, 867734, 491171, 499758, 604487, 656770, 684880, 748215, 802476, 513400, 691236, 703316, 485496, 698598, 568446, 524693, 678327, 976974, 898284, 637557, 324034, 743843, 996067, 679728, 649871, 770390, 812457, 496650, 405054, 825625, 725755, 697022, 679577, 686524, 878819, 870396, 977739, 744851, 418595, 436424, 888123, 775000, 827420, 879949, 728415, 609951, 508171, 739493, 779283, 481811, 674207, 835590, 790500, 865156, 751155, 593956, 718507, 551506, 566271, 850126, 907798, 941256, 694841, 911692, 724812, 748352, 718271, 712536, 805867, 764419, 1073075, 688986, 812301, 932555, 117495]
14696G07973r5168j8007M24095j24982j22141M39474E79635M5570j3982R5637
14686G06860K40727k15725K3957J34872j27929L8455N7989J23956J43224k91965
14676H34421j84280O05559k64376J7573j53865N03116l51587k16997J61611j60981
14666G90194K43528j01714K28511L45999n94296K29901L5635j47551J61189J05283
14656A296679j72824j55338O5846K51916j95274K73476l37717L15661n03515L51372
14646A190282l22043K63047j66869L16631j35033J19764j6203n5567M76183o09190
14636A061002K61802K99875k96078M17296o82340N74977l46791j17085J60972
14627A333630n2395K14191k16760J07951l0917n8736Q0445l8343R5993O153l38985
$$ y = [707973, 612805, 594798, 1018893, 893911, 771770, 1211244, 579635, 625205, 611223, 706860, 947587, 731862, 755819, 890691, 762762, 801217, 859206, 983162, 1126386, 834421, 650141, 1255700, 991324, 1008897, 855032, 1358148, 1006561, 789564, 951175, 790194, 1033722, 932008, 1160519, 1506518, 912222, 1142123, 1177758, 1030207, 1191396, 1296679, 1123855, 968517, 1034363, 1286279, 1091005, 1364481, 1026764, 1342425, 838910, 1190282, 868239, 1131286, 964417, 1281048, 1146015, 1265779, 1249576, 1194009, 1670192, 1061002, 1322804, 1622679, 1326601, 1743897, 1061557, 1636534, 1289743, 1172658, 1333630, 1281235, 1495426, 1278666, 1386617, 1355700, 1296964, 1377409, 1339066, 1435059, 1441212, 1102227]
14616A102227L83493l93951M52067P2847J53684j53108J13977k74061K69019J16168
14606A842362l55869J15431M2610l96273N52457m20546N6978J13721N1663Q6145
14596A688679j65216J53925L2474m5526P9907L14491k10234J34177j71729j11211
14586A699737K62498k72212j9271N1274L09717k72462J77584o288r1523r651j94934
14575A634469M29216Q1867j22317q6996K08197L2413J82219M94821k29688p6101
14565B548100j30257J38569K36803Q4330p8254l20643L24076J15641p4046L39641
14555C183960p5334N11747P7456N61555M23691J328650J494274M036881J0340549
14546B1883429J6235894k153387j4204621j0186771m810092M36293j168229k342429
$$ y = [1102227, 1485720, 1091769, 1543836, 1616683, 1770367, 1617259, 1731236, 1457175, 1726194, 1842362, 1486493, 1601924, 1644534, 1248261, 1800718, 1380172, 1437150, 1550871, 1602534, 1688679, 1523463, 1677388, 1709862, 1664336, 1744243, 2058734, 1848500, 1982677, 1810948, 1699737, 1962235, 1690023, 1670752, 1722026, 2031743, 1759281, 1936865, 1930577, 1839054, 1829403, 1634469, 2063685, 2145552, 2023235, 1936239, 2144436, 2176849, 2359068, 2853889, 2624201, 2548100, 2417843, 2556412, 2793215, 2877545, 2799291, 2478648, 2802724, 2918365, 2844319, 3183960, 3108626, 3620373, 3697829, 4259384, 4683075, 6011725, 7505999, 11542880, 21883429, 38119323, 35965936, 21761315, 11574544, 6764452, 7200745, 6032516, 3690087]
14538C690087q77020o07789o46444L01900j5073L36766k46485K57554L18427m65515
14528B046408K64449l86842L44680l21723K61281L61384n14848L83948J77740
14519B616477l8023k41906r356J52269M556j09470L0304N81321k23712J68464
14509B930924k94541J09572L21298k48424m1763K23829J5305j04912K47947j91329
14499B967906J65773P9799p2955J97564Q9994j40088o0483K0596j84716m9044
14489C014346O54861p686J71392k91690K37993J07674k63614J17325j99743L84003
14479C924861j96321K13899J7763j49629K71438k37559L46440k57719L15744K39755
14469D488672p3705J27553k5416k32977K70431R9038j13608p4678K8735K59893
$$ y = [3690087, 2813067, 2205278, 1558834, 1860734, 1845661, 2182427, 1935942, 2193496, 2511923, 2046408, 2310857, 1924015, 2268695, 1946972, 2208253, 2569637, 2054789, 2438737, 2616477, 2578454, 2336548, 2327192, 2479461, 2484017, 2374547, 2404851, 2986172, 2762460, 2930924, 2636383, 2745955, 3067253, 2818829, 2777066, 3000895, 3016200, 2911288, 3159235, 2967906, 3133679, 3213478, 3140523, 3338087, 3428081, 3287993, 3227510, 3248106, 3063390, 3014346, 3669207, 3661521, 3832913, 3541223, 3779216, 3886890, 3623276, 3740601, 3540858, 3924861, 3728540, 3942439, 3960202, 3810573, 4082011, 3844452, 4190892, 3933173, 4248917, 4488672, 4414967, 4542520, 4517104, 4284127, 4554558, 4653596, 4539988, 4465310, 4494045, 4753938]
14459D753938J40826J61301r7604J24042K53003l27414M6523M52864m46765M48419
14449E509133j90695K95733j67661M40991k07966q8145K27264K03773j19508P8003
14439E980922J32369N5379L52186m70043K37261J36939L23057J32858o8070j06638
14429F706220M72001j5334J13024k00220M99827k80541K15254M82907j86293l23465
14419G483380O23474P1563j05894M40393J44533J48145L8170q6855J47180L85588
14409I289677J86330k14440L14345K44478k95873M51386K02010o041M21580L53303
14399A0946755j17556J46117J4501M34669k01625M76696K33222L31816m42182
14390A1822413N97064K4749M37530J51053M6238O64491J82458K02262L62371l1171
$$ y = [4753938, 4894764, 5056065, 4958461, 5082503, 5335506, 5008092, 5054615, 5507479, 5060714, 5509133, 5318438, 5614171, 5446510, 5887501, 5679535, 5591390, 5818654, 6022427, 5902919, 5980922, 6113291, 6168670, 6520856, 6050813, 6288074, 6425013, 6748070, 6880928, 6812858, 6706220, 7178221, 7162887, 7275911, 7075691, 7575518, 7294977, 7510231, 7993138, 7806845, 7483380, 8106854, 8178417, 8072523, 8512916, 8657449, 8805594, 8843764, 8756909, 8904089, 9289677, 9476007, 9261567, 9575912, 9820390, 9524517, 9975903, 10177913, 10171872, 10593452, 10946755, 10829199, 10975316, 10989817, 11424486, 11222861, 11699557, 11932779, 12264595, 11822413, 12419477, 12444226, 12881756, 13032809, 13079047, 13743538, 13925996, 14128258, 14490629, 14459458]
14380A4459458N07313N05L13772L26016M14389M14314K05663Q03968j81477M91873
14370A7755794L65767L53537J70013M01658N52756L62159M23397L57260M08135
14361B1150476P45689j2368R83543M10809O30679N39702O51777L64324M53523
14352B5918154R05384N90592L87460Q64489N81483R53933P10981P07285Q99061
14343C2518822P46137P68025J113797P56173P43870J187739J305195J042147J233596
14334D1415501J306436J475342P00948J588981J262457K051845J269940J760408
14326E2831858J546950J990372J871407K051427J828753K394564K266347K458637
14318F9240315K588513K564575K965853K773627L579210L344657L577427L529673
$$ y = [14459458, 14966771, 14967276, 15281048, 15607064, 16021453, 16435767, 16641430, 17445398, 17263921, 17755794, 18121561, 18475098, 18645111, 19046769, 19599525, 19961684, 20385081, 20742341, 21150476, 21896165, 21883797, 22867340, 23278149, 23908828, 24448530, 25100307, 25464631, 25918154, 26823538, 27414130, 27801590, 28666079, 29247562, 30201495, 30912476, 31619761, 32518822, 33264959, 34032984, 35146781, 35902954, 36646824, 37834563, 39139758, 40181905, 41415501, 42721937, 44197279, 44898227, 46487208, 47749665, 49801510, 51071450, 52831858, 54378808, 56369180, 58240587, 60292014, 62120767, 64515331, 66781678, 69240315, 71828828, 74393403, 77359256, 80132883, 83712093, 87056750, 90634177, 94163850]
14310I4163850L879060M061548M800381M242425M833472N084149N357775N574913
14302A31997573O095288O431831O309092P395386P577342Q181983Q311596Q808936
14294A91109027R809403R710018J0545124J0854173J1451350J1872629J2903108
14287B68254832J2910905J3456566J3906482J4038180J4630630J4612130J4529942
14280C66339667J4475851J4443114J3390628J3048561J1606995J0410796R077618
14273D52793230O581866L530584j123617n311108l812099l689804j047150m291681
14265D43630221q439801j1187146j3241807j4094232j4922583j5906543j5787834
14258C50050275j5787397j5680427j5109871j5182364j4507803j4135064j2479876
$$ y = [94163850, 98042910, 102104458, 106904839, 111147264, 115980736, 121064885, 126422660, 131997573, 138092861, 144524692, 150833784, 158229170, 165806512, 173988495, 182300091, 191109027, 200918430, 210628448, 221173572, 232027745, 243479095, 255351724, 268254832, 281165737, 294622303, 308528785, 322566965, 337197595, 351809725, 366339667, 380815518, 395258632, 408649260, 421697821, 433304816, 443715612, 452793230, 459375096, 462905680, 461782063, 456470955, 452658856, 448969052, 447921902, 443630221, 435190420, 424003274, 410761467, 396667235, 381744652, 365838109, 350050275, 334262878, 318582451, 303472580, 288290216, 273782413, 259647349, 247167473]
14251B47167473j1221986j1572081j1289803j0609797j0387179r499134q992476
14244A73595017p898253p915027p608472p203730o286555o052887n289212n715385
14236A19625496n153217n146013m625459m393407l918842l264768m050224l346802
14228H5726764l364972l048038l042322k983026k586558k557110k498427k271742
14220F3374569j972543j967123k144141j731233j638126k232776r44888j401913
14212D9341826j771066j676257j504993j171354r45117r90014r25398j638609
14204C8719018j089392j034728j011273r53463o36226r58955j000576p56984j071332
14195C0206089p69883p74974l33089q47623l90101r27627m95133o65753m56456
$$ y = [247167473, 235945487, 224373406, 213083603, 202473806, 192086627, 182587493, 173595017, 165696764, 157781737, 150173265, 142969535, 136682980, 130630093, 125340881, 119625496, 114472279, 109326266, 104700807, 100307400, 96388558, 93123790, 89073566, 85726764, 82361792, 79313754, 76271432, 73288406, 70701848, 68144738, 65646311, 63374569, 61402026, 59434903, 57290762, 55559529, 53921403, 51688627, 50743739, 49341826, 47570760, 45894503, 44389510, 43218156, 42273039, 41283025, 40357627, 38719018, 37629626, 36594898, 35583625, 34630162, 33993936, 33034981, 32034405, 31277421, 30206089, 29436206, 28661232, 28328143, 27480520, 27090419, 26162792, 25667659, 25001906, 24545450]
14186B4545450o83575m76188n61312l69265l76137p72658n11534m11898n87950
14177A9794933p507m52065m36697k66646p28645k84106l04293l68585k79994k31489
14167A6434906m02261J7245q28118L91139k77091n95423n59884j3152j26426j78497
14157A3862438j77982m58810q9005k67768j73377n31278K21177m37815j8712k66031
14147A1662837L7359o44126K10255m13099k41586P3745R923k92452j30659r1678
14137A0180519n39742R3961l08464J89148m54056j90750K81525m16245q9708k01084
14127H545104j24114J3522k99974Q1160l58809K14784l5484l83144J22577j75457
14117G600165m6543l37053Q494j7670o4768l18814J35256j97814J0676j77165
$$ y = [24545450, 23861875, 23385687, 22824375, 22455110, 22078973, 21306315, 20794781, 20382883, 19794933, 19787426, 19335361, 18898664, 18632018, 17903373, 17619267, 17314974, 16946389, 16666395, 16434906, 16032645, 16049890, 15221772, 15612911, 15335820, 14740397, 14180513, 14167361, 14040935, 13862438, 13684456, 13225646, 13136641, 12868873, 12695496, 12164218, 12385395, 11947580, 11928868, 11662837, 11700196, 11056070, 11266325, 10853226, 10611640, 10685385, 10695308, 10402856, 10272197, 10180519, 9640777, 9734738, 9426274, 9615422, 9161366, 8970616, 9252141, 8835896, 8746188, 8545104, 8420990, 8434512, 8134538, 8215698, 7856889, 8071673, 8036189, 7653045, 7775622, 7600165, 7553622, 7216569, 7225063, 7207393, 7142625, 6823811, 6959067, 6761253, 6771929, 6594764]
14107F594764J15493R572j86554j34066J78618j17675j67981j60080j02918j52318
14097E876855k41441K24886k8388j94645l84977K72028r9630K15542m53201J22234
14087E309263j77803J05715j09833m1550j27801j95790P5920J33701O8818m08252
14077D632388J30217k43419K18358j21620n2384j54903R0660j84089Q5675Q0401
14067D481284j83287k20816Q4583r8744j05174j11689l6544M68711l65398K54190
14057D167116m27074K04977j58811J65087k25335k92052R3446L93220l51704M1462
14047C610332o6803J02699n28885J65190K46206p3137m905n00551l7620J29036
14037C041562Q7265k41487K55113k94470Q3390J12317k04435P9356N5998N5176
$$ y = [6594764, 6710257, 6719829, 6533275, 6399209, 6577827, 6460152, 6292171, 6132091, 6029173, 5876855, 5635414, 5860300, 5831912, 5637267, 5252290, 5524318, 5424688, 5640230, 5187029, 5309263, 5131460, 5237175, 5127342, 5085792, 4957991, 4762201, 4838121, 4971822, 5040640, 4632388, 4762605, 4519186, 4737544, 4615924, 4563540, 4408637, 4499297, 4315208, 4400883, 4481284, 4297997, 4077181, 4161764, 4063020, 3957846, 3846157, 3809613, 4278324, 3912926, 4167116, 3740042, 3945019, 3786208, 3951295, 3725960, 3433908, 3527354, 3920574, 3568870, 3610332, 3543529, 3646228, 3117343, 3282533, 3528739, 3455602, 3450697, 2950146, 2912526, 3041562, 3128827, 2887340, 3142453, 2847983, 2931373, 3043690, 2839255, 2918611, 2974609, 3029785]
14027C029785j19924J40623J67870n93922L13033k23162K59641m31214R6705L9189
14017B678624l04743K21855j04662M5783r852n959j24443k78873M92727l70124
14007B240333K63681j16659k71380L20967m32311K91548j11374J26620k87014
13998B024411J17980J78566j34794J42782m279r1845l7578K23998M93108Q37872
13988C750221K237705R004918J8379831M436358j1624087j0367493o357538l341515
13980F118400j277548o10407k68956o61055l5548j37211k50534J7908n73260L87609
13970B709398j03972j49764n4350J29567K8472P3403l19624o198k15655j34551
13960A956726J94783K3272k18615J22091j62836p9737K257J52668j47114L9341
$$ y = [3029785, 2909861, 3050484, 3218354, 2624432, 2937465, 2714303, 2973944, 2542730, 2639435, 2678624, 2373881, 2595736, 2491074, 2536857, 2527005, 2521046, 2396603, 2117730, 2610457, 2240333, 2504014, 2387355, 2115975, 2436942, 2004631, 2296179, 2184805, 2311425, 2024411, 2142391, 2320957, 2186163, 2328945, 2324666, 2232821, 2195243, 2419241, 2912349, 3750221, 5987926, 14992844, 33372675, 37809033, 26184946, 15817453, 9459915, 6118400, 4840852, 4230445, 3961489, 3300434, 3264886, 3127675, 2877141, 2895049, 2321789, 2709398, 2605426, 2455662, 2401312, 2530879, 2559351, 2632754, 2313130, 2306932, 2091277, 1956726, 2151509, 2174781, 1956166, 2078257, 1915421, 1835684, 1837941, 1990609, 1843495, 1882836]
13950A882836J3195k9221Q3386k24519K48021j40421O1097R1584r5478J0221l61453
13939A539248M43821l84292K38842n0345q2565J18367j27646J08799m18193M87874
13929A873910l06825j88067L50437j6807k67798P9175l7357r9542K35030q9236
13919A532920j82442r841J70995k55039J12389J5663k5985K77832k46699M5370
13909A435163K58899m01275M53923m64731J47931k76259L68627R296k76644k19343
13899A035587K21697Q332N28574k28190o3018k07125L99305k44943k61417P5172
13889A263974M1409K17088n07376J35642O5004J89756k81545M31094n78848K83952
13879A260150N931r0222M3510j5949k51489L42562k56601L43046M8749j93297
$$ y = [1882836, 1896031, 1866810, 1950196, 1725677, 1973698, 1833277, 1894374, 1985958, 1890480, 1900701, 1539248, 1983069, 1598777, 1837619, 1787274, 1704709, 1823076, 1695430, 1804229, 1386036, 1873910, 1567085, 1379018, 1729455, 1712648, 1444850, 1524025, 1486668, 1387126, 1622156, 1532920, 1350478, 1340637, 1511632, 1256593, 1368982, 1384645, 1358660, 1636492, 1389793, 1435163, 1694062, 1292787, 1746710, 1281979, 1429910, 1153651, 1522278, 1531574, 1254930, 1035587, 1257284, 1265616, 1794190, 1566000, 1502982, 1295857, 1695162, 1450219, 1188802, 1263974, 1305383, 1522471, 1015095, 1150737, 1215741, 1405497, 1123952, 1555046, 976198, 1260150, 1266081, 1175859, 1219369, 1203420, 951931, 1294493, 1037892, 1380938, 1429687, 1236390]
13869A236390j64642j16054O2473R2250r1996l6274M1520L61184l27506J3614
13859A070959J31759J34231n00481K45590J18559j16355K62150l35624J40147
13850A150935k28297K04910j84570L36736k44374K33311j25588n7890j70129J25511
13840A040555P9017k6128E03525P43117k60526j55091J89650R1660j35035Q4375
13830A061675O8148N661m67087K10682m3946R49K65089n03369M68391j00947j23929
13819H41317J8127j22561k49581K91378k1939M1892k2089Q01m7744J56808J94991
13808A081400l11457M43199n23089L21798n05037K24523K66411j40357r8829q1563
13798F76999L216q4192K52384n6257J49898k03075l91J06861j39247K2624Q5093
$$ y = [1236390, 1071748, 955694, 1018167, 1110417, 1018421, 982147, 1023667, 1384851, 1057345, 1070959, 1202718, 1336949, 836468, 1082058, 1200617, 1084262, 1346412, 1010788, 1150935, 922638, 1127548, 942978, 1279714, 1035340, 1268651, 1143063, 1085173, 915044, 1040555, 1119572, 1093444, 503525, 1246642, 986116, 831025, 1020675, 1112335, 977300, 1061675, 1129823, 1135484, 668397, 879079, 835133, 836082, 1101171, 597802, 1066193, 965246, 841317, 859444, 736883, 487302, 778680, 756741, 798633, 776544, 777345, 729601, 886409, 1081400, 769943, 1213142, 690053, 1011851, 506814, 731337, 997748, 857391, 758562, 676999, 680215, 596023, 848407, 792150, 942048, 738973, 738582, 845443, 706196, 728820, 813913]
13787H13913j85659K20290m10094N02815l69124K78855k22647K70682k59502K81889
13777I21418D53394M73293K1159K59598l01744D51141K08832j2665J52025j04405
13767F94928j29980p9103K11151P8444j18070L9189Q4694r3561K2954j73356J86216
13756G23506j98519j24201L77216k9942j1814P5861O7804l00774J74647l64634
13746C89150M3166K13101j11348J58558B97743K63176M5041P9529l34716j8161
13736C32612K63629j58807Q399j96312O35598j14091j58195j23636K17563j22169
13726E84591I3173L14015K16118k0153J7053k30882L32227N6317k32444j44349
13716D01075K619L29642l58379J38882j17956J54911l9642B7957N92499B11292
$$ y = [813913, 628254, 848544, 438450, 941265, 572141, 850996, 628349, 899031, 639529, 921418, 453394, 926687, 947846, 1207444, 905700, 451141, 659973, 647308, 799333, 694928, 564948, 485845, 696996, 775440, 657370, 696559, 781253, 687692, 710646, 537290, 723506, 524987, 400786, 778002, 748060, 736246, 812107, 879911, 579137, 753784, 389150, 432316, 645417, 534069, 692627, 297743, 560919, 605960, 685489, 350773, 332612, 596241, 437434, 445833, 249521, 885119, 771028, 612833, 489197, 706760, 584591, 93173, 407188, 623306, 603153, 620206, 389324, 721551, 777868, 545424, 401075, 403694, 733336, 374957, 513839, 395883, 550794, 511152, 27957, 620456, 211292]
13705G16069j22994B63587K25721Q8844j21721B10099K52467l1669j2430K57492
13695F75959j16612j59491O0290l4765J95181K31412r8614j10856o1346O047j3151
13684E74054K8243P9352k03639P1993o4910N7677J42444k49049N1739j377J25212
13673F11739A43533L35161j52679J46832m7605K27196R2976C14443K10399K04591
13663G29433o7595j46596J21189j35569R9499k33997m8211K01374R3319k04860
13653D07986J41408j83249n7081K57451j88753A43482K63779r3886J61628j47774
13643C27229K64816k29580K63803o7908A50181J41314J22407J39517k25640j07621
13633B20158K69325J10757j46657m6729A84663K75709Q0094D0015M40819j56623
$$ y = [716069, 593075, 263587, 489308, 578152, 456431, 210099, 462566, 430897, 418467, 675959, 559347, 399856, 460146, 425381, 620562, 851974, 753360, 642504, 581158, 587205, 574054, 602297, 681649, 478010, 550003, 485093, 542770, 685214, 436165, 487904, 486527, 611739, 143533, 478694, 326015, 472847, 425242, 652438, 745414, 314443, 524842, 729433, 661838, 515242, 636431, 500862, 600361, 366364, 318153, 519527, 612846, 407986, 549394, 366145, 309064, 566515, 377762, 143482, 407261, 313375, 475003, 327229, 592045, 362465, 626268, 558360, 150181, 291495, 413902, 553419, 327779, 220158, 489483, 600240, 453583, 406854, 184663, 460372, 540466, 40015, 480834, 324211]
13623C24211r8406M42783l30963J51607P6780k02041A15794K11971J58351j77790
13613C08326R3826K07640A88780K34400n9790J37839k46509J7355m9081M11866
13603F34860j96916N6712k5020P7623k48757K21567j6365M0808p4840p1344N6495
13592D54823j5896K27632k70271p1408J32886o3848J00671K5972l20j70623l9069
13581C10549J10334j59595K56047j86314H7338M01773B11723N3867n0663K96473
13571E11400k36144M5665K63265r7467k08612J61982r790g1840B67430P6253j20922
13560B22761I1950K14750A37989b6489A16828J41154J1199p4717K17086A14351
13549E85956k56699J71890A42966J86709A14602L48942j08458A7286L2765J69134
$$ y = [324211, 225805, 668588, 337625, 489232, 566012, 363971, 115794, 327765, 486116, 308326, 402152, 609792, 188780, 423180, 363390, 501229, 254720, 272075, 222994, 634860, 437944, 494656, 469636, 547259, 298502, 520069, 503704, 544512, 469672, 398328, 454823, 438927, 666559, 396288, 324880, 457766, 393918, 494589, 520561, 520241, 349618, 310549, 420883, 261288, 517335, 331021, 87338, 489111, 211723, 265590, 214927, 511400, 275256, 320921, 584186, 486719, 278107, 440089, 430299, -71840, 267430, 343683, 222761, 91950, 306700, 137989, -26489, 116828, 257982, 269181, 194464, 411550, 114351, 585956, 329257, 501147, 142966, 329675, 114602, 463544, 355086, 17286, 50051, 219185]
13539B19185J76531O0738L47464l05603k7377n5720n7537K93237A09244J45002
13529B54246M6809A43831K25955A27655l6978o96J28967J45289C2040g062A36100
13517D27805j81092n3012J27833n1586j8456q1632C7101M30301A68814J06649
13507B75463L7208j27107J73665A29033L60124D7640J52855L55661O666C3348
13496c0672E96280B25055J08938A14080N0875A792c8660m52D44450n8698j66835
13485B18917K70471J9796A1167e6353N390j01918A34456K93863n9291o7404r1920
13474B09704n6586A1481M6843K21072L5983j14635f8355C12499J66615A52134
13463D9029E166J69996m9863N50358B04623e2855r905C81542j03976E9469O6930
$$ y = [219185, 395716, 456454, 803918, 498315, 470938, 415218, 357681, 650918, 109244, 254246, 301055, 143831, 369786, 127655, 90677, 89981, 218948, 364237, 32040, -7062, 136100, 427805, 246713, 193701, 321534, 269948, 251492, 169860, 37101, 467402, 168814, 275463, 312671, 185564, 359229, 129033, 489157, 47640, 200495, 556156, 562822, 33348, -30672, 596280, 225055, 333993, 114080, 164955, 1792, -38660, -39112, 444450, 385752, 218917, 489388, 509184, 11167, -56353, -50963, -152881, 134456, 428319, 369028, 301624, 209704, 153118, 11481, 58324, 279396, 315379, 200744, -68355, 312499, 479114, 152134, 49029, 5166, 175162, 125299, 675657, 204623, -52855, -62760, 381542, 277566, 59469, 126399]
13452A26399J4652o3672J400K00444k572N879h940B70608K85906G0709b57766
13440C63601J29399k24643A4306d4300A33493K78552e3575C32955j53399L69544
13430E49100a07589E08123B28221M1320O7426K61093o8010k47748K70034c0264
13419C68749j0098F3311K01119J37216j70091K6005J61528p085E5688e7417C90534
13407D75377j58212K91771q2526A28867J34438o8991J09822j19496J74273E3961
13396A68638Q0345k9433k650D110b7715C06670J45860B25082A7176M04585A57821
13384A61799A0622K67488l5791E6857F26J79308c2611D28522B00048J59405l8969
13373C20484r2226J84126e0794a9060A01074P6488J33668p8750J28759J14669
$$ y = [126399, 141051, 77379, 78779, 279223, 276651, 282530, -8940, 270608, 556514, 70709, -257766, 363601, 493000, 268357, 14306, -44300, 133493, 412045, -53575, 332955, 179556, 549100, -107589, 508123, 228221, 269541, 336967, 598060, 530050, 282302, 552336, -30264, 368749, 358651, 63311, 264430, 401646, 231555, 257560, 419088, 412003, 55688, -57417, 390534, 475377, 317165, 608936, 526410, 128867, 263305, 194314, 304136, 184640, 358913, 53961, 168638, 248983, 219550, 216900, 4110, -27715, 306670, 452530, 225082, 17176, 421761, 157821, 161799, 10622, 278110, 242319, 56857, 626, 179934, -32611, 428522, 200048, 359453, 320484, 228258, 412384, -50794, -19060, 101074, 177562, 311230, 232480, 361239, 475908]
13363D75908o6789a12830D2557N23742k57575N8740o5713A22806L32493k11638
13353B43661c2389D02837j3383A92873J53997I2388L12550j91507L29210B53011
13342a64396C16325A16326K81492A45175N4596E0177L02448k9705A9544J75508
13332A95052a63968B51701O7360k9974I0022K03887J90396k24261b9847B54302
13321D52792C6411Q2543L04488A26383j5566Q7139K66209a0711A34651R9636F3130
13309B65509f2690D2999h208D150J06009m2936a28344C84283C1277K39895j18574
13298A52598k4606P1511F0840j8193g9718B3983K24274r7695p2031a3285B11300
13286D11553G2638J6368O6576N8755K8194A20125R5598q2097a36106C92020h986
$$ y = [475908, 409119, -112830, 42557, 566299, 308724, 367464, 301751, 122806, 455299, 243661, -32389, 402837, 389454, 192873, 346870, 92388, 404938, 213431, 542641, 253011, -164396, 316325, 116326, 397818, 145175, 199771, 50177, 352625, 322920, 19544, 195052, -163968, 251701, 319061, 289087, 90022, 293909, 484305, 260044, -29847, 254302, 452792, 36411, 118954, 423442, 126383, 110817, 197956, 464165, -10711, 134651, 234287, 63130, 265509, -62690, 42999, -8208, 4150, 110159, 67223, -128344, 384283, 31277, 271172, 152598, 127992, 199503, 60840, 42647, -79718, 23983, 248257, 150562, 78531, -13285, 211300, 411553, 72638, 89006, 155582, 214337, 242531, 120125, 215723, 133626, -136106, 392020, -8986]
13274G9742j8608J52381J22357j50014J96450j03921p9975O0795l9187N4328j15990
13263A58358O8494c2257j83208F2654J08636i8250B19168R3536j05525J41560
13253C48739G3558J10426N4674b07976H8335O8471E1286K95244b4800A92858a44525
13241B43188C6308K04494n1489J65963a13154B21855r673P4005c8413J7348n319
13230b6384j39151B44987n90b88320L7491B59089q6296L91252b30346D74161h281
13218a43285A59817a60727C8538L27277E9846K40848I7024J66363M6413O031A32369
13206a93335D2806J796L1212d4205E9196a2592j35490C9222O2220b35739L4349
13195b01390L3419B83307a39051H7804R5264o8613C9906J66666J3491j3836c2671
$$ y = [79742, 61134, 213515, 335872, 185858, 382308, 278387, 198412, 259207, 220020, 274348, 158358, 226852, -32257, -215465, 62654, 171290, -98250, 219168, 312704, 207179, 348739, 73558, 183984, 238658, -207976, 88335, 156806, 51286, 346530, -24800, 192858, -144525, 243188, 36308, 240802, 189313, 355276, -113154, 221855, 212182, 286187, -38413, -21065, -26384, -165535, 244987, 244397, -288320, -250829, 259089, 172793, 564045, -230346, 474161, -8281, -143285, 159817, -160727, 38538, 365815, 59846, 300694, 97024, 263387, 309800, 315831, 132369, -193335, 42806, 44602, 75814, -44205, 59196, -12592, -148082, 39222, 101442, -235739, -201390, -167971, 283307, -139051, 87804, 183068, 114455, 39906, 206572, 220063, 206227, -32671]
13183C76987A30829j9423N06294B67172n9091b00945P5510A48067o8443a21320
13172A20779a94723A17531E3544b33053I0876A074b35487B27868p2946e1304A19867
13160G3812l1968F9L1859d1799k77553b2411A48927b03857B60288K4095d0797
13148a31039D53072A13732k4330K14907I6905J54143b9269A73386n8117K7830
13138A43099l0373R7286K00509h1035e254A01388R122J50166G8077O103j3752
13127G0428i6500C06990I9756a28323N8179D42584g8926B47464b560G8236f7402
13115B12479a11455j48005A9100a00770C9756Q4869J55724g4700B32788n4040
13105A78748J88683A22782a81449A47642F8849L39904a5631j01840E3931l496
$$ y = [376987, 130829, 111406, 617700, 267172, 208081, -200945, -125435, 148067, 79624, -121320, 120779, -194723, 117531, 53544, -233053, 90876, 1074, -235487, 227868, 154922, -51304, 119867, 73812, 41844, 69, 31928, -41799, -319352, -22411, 148927, -203857, 260288, 284383, -40797, -131039, 453072, 113732, 89402, 304309, 96905, 251048, -29269, 173386, 115269, 143099, 112726, 210012, 410521, -81035, -5254, 101388, 110510, 260676, 78077, 84180, 70428, -96500, 306990, 99756, -128323, -70144, 442584, -78926, 247464, -2560, 78236, -67402, 212479, -111455, -259460, 19100, -100770, 39756, 124625, 280349, -74700, 232788, 178748, 367431, 122782, -181449, 147642, 68849, 408753, -15631, -117471, 53931, 50435]
13095E0435K76904j51726a18476m2346A25885b59970I6521N7066R3759q8626m9416
13084A09304k2873j421J74377b3418A36616K2861M8050D4656K03096B4611h6318
13072c8705A25958b6339n6933A17945a3754j4703A2412a01181A75762Q9428J1882
13061B77072C9402j4855K29499b21557c6695j40406A03455a41216B22171A9869
13050A56972D7278P4514c10246H8546F231J55648a19267g158k78359A15236D7577
13038B73919a75194A38453J2228O0922a24771A88366J73842A76243Q2970a73925
13027H1863a04448L3920B87230d9008B29064e1765j62736C35562E7681K65186
13017C22867g6625A49521M9724a54960G9420g0890n7972F4008a12593B96939b90152
$$ y = [50435, 327339, 175613, -118476, -160822, 125885, -259970, 96521, 153587, 247346, 158720, 109304, 86431, 85010, 259387, -23418, 136616, 159477, 207527, 44656, 247752, 24611, -86318, -38705, 125958, -26339, -83272, 117945, -13754, -28457, 12412, -101181, 175762, 265190, 277072, 39402, 24547, 254046, -221557, -36695, -177101, 103455, -141216, 222171, 19869, 156972, 47278, 121792, -310246, 88546, 6231, 161879, -119267, -7158, -285517, 115236, 47577, 273919, -175194, 138453, 150681, 211603, -124771, 188366, 362208, 176243, 259213, -173925, 81863, -104448, -70528, 287230, -49008, 229064, -51765, -214501, 335562, 57681, 322867, -76625, 149521, 199245, -154960, 79420, -70890, -128862, 64008, -112593, 296939, -290152]
13005h283D7534J11651K4540M8054H3027O8855i7114D9115L00275a81468D0513
12993B25955F2496P5554b24179a07709A55387C516L2635f7892B40452H7324J89499
12982B76823r8133D5917c26240J27205o904A8805f1805A58370k1384f4861D2525
12970E0271R2667M0632H2718O6861D7772J97789G4915h9970C29204p3719J3272
12959B68757A05967Q5670e1542j6974I7755a26978A30204J35961b4729q7030I7592
12947C72756j42846r8472a36412A73653c7782B5479J61029L9720L5414r0583N7057
12936B28116o7494J15339K08598h7793I5309N9991M5425a22298G7754j0757J91485
12925B58482C8006J88483a14967I7981k4945b74153B54897a89830a1425A70531
$$ y = [-8283, 47534, 159185, 183725, 231779, 83027, 151882, -97114, 49115, 349390, -181468, 40513, 225955, 62496, 138050, -224179, -107709, 155387, 3516, 36151, -67892, 240452, 87324, 276823, 178690, 45917, -326240, -199035, -205939, 18805, -61805, 158370, 136986, -64861, 42525, 50271, 142938, 183570, 82718, 149579, 47772, 245561, 74915, -89970, 329204, 255485, 268757, 105967, 191637, -51542, -68516, 97755, -126978, 130204, 266165, -24729, -111759, 97592, 372756, 229910, 131438, -136412, 173653, -37782, 25479, 186508, 226228, 261642, 171059, 228116, 160622, 275961, 484559, -87793, 95309, 155300, 200725, -122298, 77754, 66997, 258482, 38006, 226489, -114967, 97981, 73036, -274153, 254897, -189830, -11425, 170531]
12914F9381R5241b69062g4390E8411N4588g6178O877A13565d7392E1854e2076
12902A42364J28238A7674K95216G0744L29518A46900a58522M4137C3746b85375
12891F8731J67160j4784d6616F058K81785A13234Q7100K8979a34845B63642a09864
12879a40774H8226c6789A5452c16635A52790J09185a26100G1336d6137j6302C8099
12867c748m2850m9385C1233Q5624J60322o5772g6196A44431L7493A5763a58067
12855c2120A81398K17294i259B20912M8417p7624a27099k09541a17514o9272h8146
12843A75063a47704f6639C41249b01544H9422a67753B57428E4713g5501D9868
12832a5816K845j75067l9515F9182C4524b06841C4227J80649a10669b6167G4652
$$ y = [69381, 164622, -269062, -74390, 58411, 112999, -76178, -69301, 113565, -47392, 51854, -52076, 142364, 270602, 17674, 312890, 70744, 400262, 146900, -158522, -114385, 33746, -285375, 68731, 235891, 221107, -46616, 6058, 287843, 113234, 200334, 229313, -134845, 263642, -109864, -140774, 88226, -36789, 15452, -316635, 152790, 261975, -126100, 71336, -46137, -62439, 38099, -3748, -46598, -95983, 31233, 116857, 277179, 211407, -76196, 144431, 181924, 15763, -158067, -32120, 181398, 398692, -9259, 220912, 269329, 191705, -127099, -336640, -117514, -186786, -88146, 175063, -147704, -66639, 341249, -201544, 89422, -167753, 257428, 54713, -75501, 49868, -15816, -12971, -188038, -227553, 69182, 34524, -206841, 34227, 214876, -110669, -26167, 74652]
12820a6389I7080K69849r6147O5018C6926i345j23581b0303D39503A60502p7749
12809H2753p982i6931J9845A02404C4088b07826Q2818C22481g7844B48939D9191
12797e2893A02433m339J38076g2823B16271K722k0659b83701j6678O2168A09028
12785B93189c46302A28016l2836a67969n9948B54298g4715l8308L950A9227J30411
12774A49638b56757e5270J8023j4286A43237N0294b32200B8195a18286k9072L1035
12763a16323J0866b8224j06333A4233g6630C71223F2954B7516M4549a93720B0849
12751b9233A27134i4025G772J3997M27360B05047N13D9562b15467A41437J8076
12740A59513K03661D9221a97909A45626a48690C78471j60253m4703J25598a59773
$$ y = [-16389, 97080, 366929, 270782, 335800, 36926, -9345, -132926, -20303, 439503, 160502, 82753, 74771, -96931, -77086, 102404, 34088, -207826, -125008, 322481, -77844, 248939, 49191, -52893, 102433, 98094, 236170, -72823, 216271, 218993, 198334, -283701, -300379, -238211, 109028, 293189, -346302, 128016, 95180, -167969, -227917, 254298, -74715, -113023, -109073, 19227, 149638, -256757, -55270, -37247, -51533, 143237, 193531, -232200, 28195, -118286, -147358, -116323, -105457, -28224, -134557, 14233, -76630, 371223, 62954, 27516, 72065, -193720, 20849, -29233, 127134, -94025, 7772, 21769, 449129, 205047, 205560, 49562, -215467, 141437, 159513, 363174, 49221, -197909, 145626, -148690, 378471, 218218, 173515, 299113, -159773]
12729B40235j05572d2865A41847B7778a36462C62774F969K52427m9628a06305
12718B7896J6780L68553A18228g287H6639a90829A23016R5899J77318c2064A12110
12706c0976J5285q3012D4012P3507m0070c6245H7738A7215J83938M3022F2275
12694G2022K63094a14613L0121n3845F139j260a59587A18667b5949k63523i0984
12682B35287j04312b61458A48939j2682d3576J8507n6539A65405E1435a21685
12671D5973a39532a7950k4442C45694F9744h6941A56319p263a75855A24770J10538
12660B35308H6893Q076N1519P6285c00636A5246Q9593k3501K46190a66225A92158
12648H3306c4806E938a32851q4188A82452a24109j2890f2989C05153c24093J6019
$$ y = [240235, 134663, -42865, 141847, 27778, -136462, 362774, 6969, 259396, 209768, -106305, 27896, 44676, 413229, 118228, -7287, 86639, -190829, 123016, 218915, 396233, -32064, 112110, -30976, -15691, -98703, 44012, 117519, 77449, -36245, 87738, 17215, 201153, 244175, 62275, 72022, 335116, -114613, -84492, -138337, 6139, 4879, -159587, 118667, -25949, -289472, -90984, 235287, 130975, -261458, 148939, 136257, -43576, -25069, -81608, 165405, 51435, -121685, 45973, -139532, -17950, -42392, 345694, 69744, -86941, 156319, 149056, -175855, 124770, 235308, 86893, 94969, 146488, 222773, -300636, 15246, 104839, 81338, 327528, -166225, 192158, 83306, -34806, 5938, -132851, -217039, 182452, -124109, -136999, -62989, 305153, -324093, -308074]
12637c08074b4702A4163L03591E4914b27267D26362j20738A5553K88187J8582
12627C22322L42530e1266m5615B48623c3731A55912J60047p8665a03429A38997
12616a01468C05517b8035A46268a49088B72672j31307m2042N3298K33729A24149
12605B61459p1997d4401C11103j54872c3137j91450D9672a21032C15827C4498
12594a69445A75676b43191C49365r7325f8973k24645D8407h873L364j89826B0818
12582D67133h0975P205B8569K02718F2654J37487d5577k131B89155e8418a559
12570f9552B01681b65599A4185h7338P887C0171f5493D44044A83076R6251G3380
12558f4484j16566f9001B25056g7512b1297l9936E5369a31747c2880m2950A19573
$$ y = [-308074, -24702, 14163, 317754, 54914, -227267, 426362, 305624, 15553, 303740, 322322, 664852, -51266, -96881, 248623, -33731, 155912, 315959, 237294, -103429, 138997, -101468, 305517, -28035, 146268, -149088, 272672, 141365, 99323, 152621, 386350, 124149, 261459, 189462, -44401, 311103, 156231, -33137, -224587, 49672, -121032, 315827, 34498, -169445, 175676, -243191, 349365, 252040, -68973, -293618, 48407, -8873, -5509, -195335, 20818, 467133, -80975, -73770, 28569, 231287, 62654, 200141, -45577, -47708, 289155, -58418, -1559, -69552, 201681, -265599, 14185, -87338, -79451, 30171, -65493, 444044, 183076, 279327, 73380, -64484, -181050, -69001, 225056, -77512, -21297, -61233, 55369, -131747, -32880, -75830, 119573]
12546a14134A29965b09769h6368j58500C38241f8113C4897b64512a31747A91172
12535h9816c1035Q273B03105r7009c9605D15457F7335R842C3627a13866B5419
12523A8824K18324L8521A35560k6059b17473g5913m6086N3254n9627o052j9457
12512a53881a5639m1906k2420D9590P8747k2470n1536r215c7280B05513n7351
12501A48162b06200D44390d1477B71664b44501b159j07317A61506b04191C09790
12490b49338N9460C28220g248C7063B006J02258C1122J26535P7123b33577d2457
12478B9672e8155A09631a16666A45945J36774a90899H828D230e4187G1000N2132
12467A23132D9900a76275j60207I0740L025K42896I4368K59199g5673L4322F1152
$$ y = [-114134, 129965, -209769, -86368, -244868, 338241, -68113, 34897, -264512, -131747, 191172, -89816, -31035, -22762, 203105, 106096, -39605, 415457, 67335, 77177, 33627, -113866, 25419, 18824, 237148, 275669, 135560, 109501, -217473, -75913, -121999, -68745, -128372, -134424, -153881, -15639, -57545, -79965, 49590, 128337, 105867, 54331, 45116, -37280, 205513, 148162, -206200, 444390, -41477, 271664, -244501, -2159, -109476, 161506, -204191, 309790, -249338, -189878, 328220, -7248, 37063, 2006, 104264, 31122, 157657, 234780, -233577, -42457, 29672, -58155, 109631, -116666, 145945, 282719, -190899, 8828, 4230, -54187, 71000, 123132, 49900, -176275, -336482, 90740, 93765, 336661, 94368, 353567, -75673, -41351, 61152]
12455I1705J1065m0107r467J7499d6847B28145q4458A6208a27133B6982R2869
12444A19851C4174f0265k0685F28J19335a05385K7021p2878A41671b86441J09612
12433a76829c7604j0622j86169J7265j43539A99490j7604a8431m2665A84302H0005
12421C70288g2040r8210k28421K2112a04522j7909D3174O9203c53886i1478j71060
12410b62538E0451J06025c8204j85404A28845Q0202b3450D35855A04896a13732
12399a3071j40431f4612J9687A68163F3944k459K5346J3116J7252g9017R898j29071
12387a98190E4539J30898b53112C07721a75518D4826d4167j5032j41368Q3282
12377a17285A4950h4388a1070B48229q3389f3838B74781c4647D3720N8661P2224
$$ y = [91705, 102770, 62663, 53196, 70695, -46847, 228145, 143687, 16208, -127133, 26982, 119851, 34174, -60265, -80950, 628, 119963, -105385, -78364, -151242, 141671, -286441, -176829, -37604, -48226, -234395, -217130, -360669, 199490, 181886, -18431, -61096, 184302, 80005, 370288, -72040, -170250, -398671, -376559, -104522, -122431, 43174, 112377, -353886, -91478, -262538, 50451, 156476, -38204, -223608, 128845, 209047, -23450, 435855, 104896, -113732, -13071, -153502, -64612, -44925, 168163, 63944, 61485, 86831, 99947, 117199, -79017, -69119, -198190, 54539, 185437, -253112, 307721, -175518, 44826, -44167, -59199, -200567, -117285, 14950, -84388, -11070, 248229, 164840, -63838, 274781, -34647, 43720, 102381, 174605]
12366A74605b2442B30443H2086m0112J59978q3340B6666K2279b20479e5074l40552
12355c95626a8169q0656d2149F757K32950h5591D69851c6088m6060A40577j4202
12344A26375a41426j65144A63610p5773C376Q9669d8273B40238C9110L843c9283
12332A762g0909J5461H6699h9164B48283A4598e0385j4436j5174F7016J74956
12321B41972c47315A73580a34271C37437a6662j24917j58341a09805j05044B73437
12310A93820e03842g517B24337d4261j49535C33126j43914E8368a50886d3186
12299H4715a47992B42939q2342D7829a72672b9754B58562C7286h3300j13525H9613
12287i3645B15360b61891B09525a53466F5190j4516P3181R9311D4605L35681A01807
$$ y = [174605, -22442, 230443, 82086, 41974, 201952, 118612, 26666, 48945, -220479, -55074, -395626, -18169, -98825, -42149, 6757, 239707, -85591, 469851, -36088, -82148, 140577, 126375, -141426, -306570, 163610, 87837, 3376, 93045, -48273, 240238, 39110, 42953, -39283, 1762, -70909, -55448, 86699, -89164, 248283, 14598, -50385, -64821, -79995, 67016, 241972, -347315, 173580, -134271, 337437, -16662, -141579, -299920, -109805, -214849, 273437, 193820, -503842, -7517, 224337, -44261, -193796, 333126, 189212, 58368, -150886, -43186, 84715, -147992, 242939, 160597, 47829, -172672, -29754, 258562, 37286, -83300, -196825, 89613, -93645, 215360, -261891, 209525, -153466, 65190, 50674, 123855, 223166, 44605, 380286, 101807]
12275B87261j22278G0001f814j64896B5489g6394Q885c235C87487G1334i3567
12263E94800c50417H068d0979B54721A02553J6481N7317J94274c22709B05501
12252h1453l06651A27964a42823r6545H6844e370I3779L7460A789N1578f3861
12240A54009j7983b67838C55641k8004a72024A93366h5569k7574A89479a27713
12229H4148r601b59057I9843L6854O0971H0610K40597D5558R5414n7447L0546
12218A14071M1035J23822A31105D4078a8149j44060B86266J8728e6947E7748L56135
12207D13883I6311K4714k5114K52613B77K79845a45963j4511B91651M7503A34884
12195A10847L40794a05029D2340L18936A50364J15963H4787O7084C6051F838K77249
$$ y = [287261, 164983, 70001, -6814, -171710, 25489, -76394, -67509, -3235, 387487, 71334, -93567, 594800, -350417, 8068, -40979, 254721, 102553, 119034, 176351, 370625, -322709, 205501, -81453, -388104, 127964, -142823, -239368, 86844, -5370, 93779, 131239, 1789, 53367, -63861, 154009, 136026, -267838, 355641, 327637, -172024, 193366, -85569, -113143, 189479, -127713, 84148, 74547, -259057, 99843, 136697, 197668, 80610, 321207, 45558, 140972, 83525, 114071, 155106, 278928, 131105, 44078, -18149, -162209, 286266, 304994, -56947, 57748, 413883, 96311, 121025, 95911, 348524, 277, 280122, -145963, -160474, 291651, 339154, 134884, 110847, 451641, -105029, 42340, 361276, 150364, 266327, 84787, 151871, 36051, 6838, 284087]
12184B84087a68207B22776B955L87704A31043l9475d1951d023A64788K75681A90053
12172B08689A7108K76783E5478K21429L098j17489N30707A95079k4548J27149
12162B97680A09877j2948M8010b17982F54270I6922b12213A30404C7118b5351
12151g5453B42787n2482J64199D584J8369J36564J40102l9575a17199B01096B6556
12139f4032k6853B10358k0817g6873A9776L14192p1175c69138a39295B9929a31879
12127B7853c14122B42583a52950A72569D903K35528h140j57227D20334F9162K12137
12116B81299p397c1380n9669B23006f8305o8961a8545j49549G778i6159a0341
12104b9300r7718o4288c9193j6183A94977r4929R1523L88895k73274b08333H327
$$ y = [284087, -168207, 222776, 2955, 390659, 131043, 91568, -41951, -4023, 164788, 440469, 190053, 208689, 17108, 293891, 55478, 276907, 280005, 162516, 693223, 195079, 170531, 297680, 109877, 96929, 144939, -217982, 654270, 96922, -212213, 130404, 37118, -25351, -75453, 242787, 190305, 354504, 4584, 22953, 159517, 299619, 260044, -117199, 201096, 26556, -64032, -90885, 210358, 189541, -76873, 19776, 333968, 262793, -369138, -139295, 29929, -131879, 27853, -314122, 242583, -152950, 172569, 4903, 240431, -8140, -165367, 420334, 69162, 281299, 273902, -31380, -91049, 223006, -68305, -137266, -18545, -168094, 7778, -96159, -10341, -29300, -127018, -191306, -39193, -55376, 194977, 100048, 191571, 580466, 307192, -208333, 8327]
12092B29851a7346F6409a26927j38456J9090L6274B84130B7843b2156l14973K6824
12081c10305a38539D03232b6209j99250D8474J0492M5145J75134a57587A94265
12070d72514M0396d6116C19503A44013a17741c8477n4850B1118K97132A5967K9494
12059D5461c8899J518k7716b6905I7188a67659B63761A8262a33442C33718Q96076
12048A229794l38247k14298k22825A6145J08921C6121d6030B30534i3155M2135
12038e1020a204k7916j82515J3820i7409F9469J86030i0194A94546D5420a2671
12026c84305B1648K28552a7248m28927B10755f2484A84215a8255G2326i4790I2793
12014a29852A04107b23206B03686f4212j82207F5413a97377m2906B07645m0590
$$ y = [229851, -17346, 66409, -126927, -265383, -246293, -210019, 284130, 27843, -22156, -337129, -310305, -138539, 403232, -26209, -225459, 48474, 58966, 104111, 279245, -157587, 194265, -472514, -432118, -46116, 319503, 144013, -117741, -38477, -93327, 21118, 318250, 15967, 45461, -38899, -37381, -65097, -26905, 97188, -167659, 263761, 18262, -133442, 333718, 1229794, 891547, 677249, 454424, 16145, 125066, 36121, -46030, 230534, -93155, -51020, -1204, -29120, -211635, -197815, -97409, 69469, 255499, -90194, 194546, 45420, -12671, -384305, 21648, 250200, -17248, -446175, 210755, -62484, 184215, -18255, 72326, -94790, 92793, -129852, 104107, -223206, 203686, -64212, -246419, 65413, -197377, -240283, 207645, 167055]
12004A67055c1006m6130K9141A01906j4771k9587a69679m3879P5791I7743b20343
11992A08291a21382E3128k0453f5486l49353a01848n760n3870c587k28546g0966
11980h5695l03226h7242D0381a47056e4163F3793K37853b7142p6964k13510B2734
11968I9506a51921L4439q4887A18710b63087A28940Q7390I7827a1I5564l8296
11957E7268e4092A82528a8973m2834B23818f8941k9913k54731B19003M2490g0699
11945a69422A78093b64014e2457E3414J53138i5155j68292C27502a26836J4231
11935a12605A54829b53249k2446J17337E0497a59778B32004o8932e3438k37487
11925b90925D669i9955A55111g3205K3759k5994C8481J40545m3464M0687a13089
$$ y = [167055, -31006, -77136, -47995, 101906, 87135, 57548, -169679, -213558, -137767, 97743, -220343, 108291, -121382, 53128, 32675, -65486, -414839, -101848, -107608, -161478, -3587, -232133, -70966, -85695, -388921, -87242, 40381, -147056, -54163, 63793, 301646, -27142, -104106, -317616, 22734, 99506, -151921, -117482, -202369, 118710, -263087, 128940, 216330, 97827, -11, 95564, 57268, -54092, 182528, -18973, -61807, 223818, -68941, -98854, -353585, 219003, 261493, -70699, -169422, 178093, -264014, -52457, 53414, 206552, -95155, -263447, 327502, -126836, -112605, 154829, -253249, -275695, -158358, 50497, -159778, 232004, 163072, -53438, -290925, 4669, -99955, 155111, -73205, -49446, -75440, 38481, 179026, 135562, 176249, -113089]
11913a36884D7352R0052b73918a15073A17909P171a17860r2614C94706H6385O8622
11902A55007J12144A1952c6619A33234a20325j11841P4402f0012a9979C1235M4860
11891G6095J73009g1136j8853j91010l0685a5138m0390E0180K07353q0242d8685
11879D6352K22117o8640e82768E2451b5118C7650a63991B32610e4772j73725h1189
11867e13524K06689d3613K1372A26718J67563A04587O6672j8182G6072a29149
11856a68504N00O6164a4857j82757C73060a68327K9768k77968a93322g2879J6221
11845e6658B606K85561c0166j99432a0982G8219J892a13211F1205d67743h4223
11833a61852j65356E7191k0664j3939a54150F8772a10511c2302q6782B13505L9544
$$ y = [-136884, 47352, 137404, -273918, -115073, 117909, 125080, -117860, -210474, 394706, 86385, 155007, 267151, 11952, -36619, 133234, -120325, -232166, -157764, -60012, -19979, 31235, 76095, 249104, -71136, -89989, -280999, -311684, -15138, -55528, 50180, 257533, 177291, -48685, 46352, 268469, 199829, -582768, 52451, -25118, 37650, -163991, 232610, -54772, -228497, -81189, -513524, -306835, -43613, -22241, 126718, 294281, 104587, 171259, 153077, 76072, -129149, -168504, -168004, -101840, -14857, -197614, 373060, -168327, -138559, -416527, -193322, -72879, -56658, 2606, 288167, -30166, -229598, -10982, 78219, 80111, -113211, 61205, -467743, -84223, -161852, -327208, 57191, 36527, 22588, -154150, 68772, -110511, -32302, -119084, 213505, 253049]
11822B53049q1482G9375d384m2357o8973e1372A9031J87022a60411j90436a1343
11810A80562c65096a09078I0051c9156a6271A21552e10450b5338E04710a82358
11799a60455r9545P6928D1415J01092a13325c8152j3776B39852A8447c2628C8560
11787B367b06866F1984J21792j1284C599R3778K05348a06457a3955C32053A02869
11775G0936P327a48092k7187L0502B08815a62675g2073q6763K7153n7525C02264
11763a91814f6900g882j80706k7227e9169j36234d8642J1942A5862b02829q4736
11752b87565h6502K2260A61272G9115B3646b44696C9039g2013H9495e0619B7212
11740F6187g7978l29762f5353A82789L2882a1866l281B7855J96616f2568A29061
$$ y = [253049, 171567, 79375, -4384, -46741, -115714, -51372, 19031, 206053, -160411, -350847, -11343, 180562, -365096, -109078, 90051, -39156, -16271, 121552, -510450, -25338, 504710, -182358, -160455, -260000, -183072, 41415, 142507, -113325, -38152, -51928, 239852, 18447, -32628, 38560, 2367, -206866, 61984, 183776, 172492, 3599, 97377, 302725, -106457, -13955, 332053, 102869, 70936, 78263, -148092, -175279, -144777, 208815, -162675, -72073, -158836, -131683, -189208, 302264, -191814, -66900, -7882, -188588, -215815, -59169, -195403, -48642, -36700, 15862, -202829, -287565, -86502, -64242, 161272, 79115, 23646, -244696, 39039, -72013, 89495, -50619, 27212, 66187, -77978, -407740, -65353, 182789, 215671, -11866, -15147, 27855, 224471, -62568, 129061]
11728G5876b95452A48080b71544A4653d19904A15774b36136A93544A2209c6264
11717a9484G9584d842j08539j12385G2044B6435J63378a80309B15772G1158l4852
11706C6306J72292a27419N5648A65373a25407k39231A2112J28829b64171a8461
11695E4121l408b92890A760R0977K15480A44060b03508h4187j2404D200a3255
11683A16306c31604B54041m4527k9069n5970l8301c5068m1920B70918e3405A6765
11671A12910c4007A2256d4791k01824C20672B0512J60795b10569j1094P8650C1153
11659b7579A02573g4887A60453K8722e6827E7322j3811c4481j6222H2825b59128
11647a24617J949L4745I1852b62947o022h9614A85873G4975K22007c5346I736
$$ y = [75876, -295452, 148080, -271544, 14653, -419904, 115774, -236136, 193544, 12209, -36264, -19484, 79584, -4842, -113381, -225766, 72044, 26435, 189813, -180309, 215772, 71158, 36306, 208598, -127419, -71771, 165373, -125407, -364638, 12112, 140941, -264171, -18461, 54121, 50713, -292890, 1760, 92737, 308217, 144060, -203508, -84187, -96591, 4200, -13255, 116306, -331604, 254041, 209514, 180445, 124475, 86174, -35068, -76988, 270918, -53405, 16765, 112910, -34007, 12256, -44791, -246615, 320672, 20512, 181307, -210569, -221663, -143013, 31153, -27579, 102573, -74887, 160453, 189175, -56827, 57322, 43511, -34481, -50703, 82825, -259128, -124617, -122668, -87923, 91852, -262947, -268969, -89614, 185873, 74975, 296982, -35346, 9736]
11635b31381D0446c44138a12588J6239B39935M1465b14565l6804f0842o2239Q516
11624a14565I7393b63557R5701K0605H893i7556B6252a63081A87419h6151C39347
11612h2240p4161H5376b7364p0895B91094A40785C4059a02269D4530h1339n9838
11601a41177A03612A6d3836B00677j7670n9833C7841J17824b62245c9038A40363
11589b62048C2398J56224b63870i0684M0163B12268h8571n5388K1264A09J69543
11578A69652a56277D4432a12933D4908a25180I8514f2379B56031h3752A42824
11567a08508B96178F2434a56529m123f591A70156B8629a5382A52247m5917J46208
11556B52538A00774J9871b39511j01263C53491h03H283b2716j04062c018G3217
$$ y = [-231381, 40446, -344138, -112588, -96349, 239935, 281400, -214565, -251369, -60842, -123081, -114565, 97393, -263557, -167856, -147251, 8893, -97556, 26252, -163081, 187419, -86151, 339347, -82240, -156401, 85376, -27364, -98259, 291094, 140785, 34059, -102269, 44530, -81339, -141177, 103612, 16, -43836, 200677, 183007, 123174, 37841, 155665, -262245, -39038, 140363, -262048, 32398, 188622, -263870, -90684, -50521, 212268, -88571, -143959, -122695, 109, 169652, -156277, 44432, -112933, 44908, -125180, 98514, -62379, 256031, -83752, 142824, -108508, 296178, 62434, -156529, -160652, -6591, 170156, 28629, -15382, 152247, 106330, 252538, 100774, 120645, -239511, -340774, 353491, -803, 8283, -22716, -126778, -3018, 73217]
11544A03197j0418J23846c87333I0806K3816O775n4824j6969a96999N3767D8923
11532a37472a82A47355A2524N19449j62571g9698c8528j79087B21584l0002a6066
11520A63747a1835E8673J40944J73342a38756B44011M249e0713B60310j15768
11510A44542F8985F571L0297c09145i2954k19167I6533O9721a07470E8329a60281
11498A4240J15680F401R9558R4191l9844J58673d01669F4136K08108r2327a49369
11486f6301B70906C7996a43706C12428A19104K57888A04421M0560E9622E11e0323
11474A61053J20501J7138M1269C6703j4024L7308J15940G6448L76769a38378K8403
11463a09975B6968J85814L9489F2938J77790a66113A06954L3114a69443b5863
$$ y = [103197, 92779, 216625, -387333, 90806, 114622, 121397, 66573, 49604, -196999, -143232, 48923, -137472, -182, 147355, 12524, 531973, 369402, -79698, -38528, -217615, 221584, 191582, -16066, 163747, -11835, 58673, 199617, 372959, -138756, 244011, 248260, -50713, 260310, 144542, 68985, 6571, 36868, -309145, -92954, -312121, 96533, 166254, -107470, 58329, -160281, 14240, 129920, 6401, 105959, 200150, 160306, 318979, -401669, 64136, 272244, 179917, -149369, -66301, 270906, 37996, -143706, 312428, 119104, 376992, 104421, 144981, 59622, 511, -50323, 161053, 281554, 298692, 339961, 36703, 22679, 59987, 175927, 76448, 453217, -138378, -109975, 26968, 212782, 252271, 62938, 240728, -166113, 106954, 140068, -169443, -25863]
11452B05603f4217A16796d5294A70026n4650h1854a9045I3203c1303m1000A27093
11440a56059f8308A26989e3045A0711b12775G7809k6766a13440b1576r109o0886
11429i1571A99484L9386J38295C4419J84061a0657A71501H0397k240a55355G7819
11417a92113A20977a97328r455E32L46337a89312B09106G1889a00129l17582a5573
11405f160k47797d026q4064a3676A56713m6174j1965h6481B55987a95450D8335
11393f0641F2552c8593l6976A85079A3136a42231p8325p0095a14543A38279J8214
11382A56493D3500K843J89044r5356K2579O5283b25108b0836C9904A9462K75264
11371B94726G3878a0876C1830J85513a27332k8284K8601e9981C16747A17671B0325
$$ y = [205603, -64217, 116796, -45294, 170026, 115376, -81854, -19045, 93203, -31303, -72303, 127093, -156059, -68308, 126989, -53045, 10711, -212775, 77809, 51043, -113440, -21576, -30685, -91571, 199484, 238870, 377165, 34419, 218480, -10657, 171501, 80397, 78157, -155355, 77819, -192113, 120977, -197328, -206783, 532, 346869, -189312, 209106, 71889, -100129, -417711, -15573, -6160, -253957, -4026, -88090, -13676, 156713, 110539, 98574, -86481, 255987, -195450, 48335, -60641, 62552, -38593, -75569, 185079, 13136, -142231, -220556, -290651, -114543, 138279, 156493, 43500, 46343, 235387, 140031, 162610, 227893, -225108, -20836, 39904, 19462, 294726, 73878, -10876, 31830, 217343, -127332, -155616, -127015, -59981, 316747, 117671, 20325]
11359a42094c332A89080a52679c3640k61578F4006g7833j16030h5271C2185a095
11347a21862A01276a09360g0A64089n1772a11817m55714C9389J71768C4404b2799
11335a23021G1181a05796l7665B7051a0530k62551m6642b5895j43327H950Q4146
11324I3096L5865D5348i4562m3864I3972H819c20911F3361Q0774d8021B19735
11312h4952C7958N3535J3121m6835a19910M7264E8636b33533B18704i1798j34521
11301b26319R711E1069a31398p3154o5928D0432a73324A32971i6160A27273E495
11289I3213J1185i7265a0859p4425j73186B53545a26080j5092B8975a60270b5238
11277B8225A0132M4281b32330A1650O2174A6712R0056Q3913j0905B7938r960a89861
$$ y = [-142094, -3332, 189080, -152679, -33640, -295218, 64006, -77833, -193863, -85271, 32185, -1095, -121862, 101276, -109360, -70, 164089, 112317, -111817, -567531, 39389, 211157, 34404, -22799, -123021, 71181, -105796, -143461, 27051, -10530, -273081, -319723, -25895, -169222, 8950, 93096, 128961, 45348, -94562, -138426, 93972, 8819, -320911, 63361, 144135, -48021, 219735, -84952, 37958, 91493, 104614, 57779, -119910, -72646, 58636, -233533, 218704, -91798, -226319, -216608, 51069, -131398, -204552, -270480, 40432, -173324, 132971, -96160, 127273, 5495, 93213, 104398, -97265, -10859, -85284, -258470, 253545, -126080, -141172, 28975, -160270, -25238, 28225, 10132, 54413, -232330, 11650, 73824, 16712, 106768, 190681, 179776, 27938, 17978, -189861]
11264d1008l3688B9783P3760K9438a45241o8937b870D2797d92877i5341b2919
11252g0602j22170f9077H2325a35220q5028N6201B33162a74640k7208B6785J85808
11241B12593b81732I0135E084h6475k30984g3450A07846m3491a96820R4430A06924
11229e1110B86204c39729e3729r6838G3540a28601a2666k32522K6940f4217I1891
11217a16963b2664f464n1284q5930j87867j496h4865n4603q8236B63140a17193
11205B61649H1554M8655a8679P78G2275Q4722a50648o0064A553K44229b80921
11193a75095B12553a25294k85001h2608C115e014k92997h7373f435j9527A07607
11181c26339R0948f4241C0704i0257n8707j29840G9730l4891K71243F023i5421
$$ y = [-41008, -74696, 29783, 103543, 132981, -145241, -214178, -2870, 42797, -492877, -95341, -22919, -70602, -192772, -69077, 82325, -135220, -220248, -164047, 233162, -174640, -201848, 26785, 212593, -281732, 90135, 5084, -86475, -317459, -73450, 107846, 64355, -196820, -102390, 106924, -51110, 286204, -339729, -53729, -150567, 73540, -128601, -12666, -245188, -218248, -64217, 91891, -116963, -22664, -6464, -57748, -143678, -331545, -333041, -84865, -139468, -227704, 263140, -117193, 261649, 81554, 130209, -18679, -17901, 72275, 156997, -150648, -210712, 1553, 245782, -280921, -175095, 212553, -125294, -410295, -82608, 3115, -5014, -298011, -87373, -6435, -25962, 107607, -326339, -235391, -64241, 30704, -90257, -148964, -278804, 79730, 44839, 316082, 6023, -95421]
11169A06548J50069m6143p8103b73060J18473D4041J57952g8381B1023B145P447
11158I592a36921C837M17049A7335K4417H788J37783a26870d8726D6964h9758
11146a37241B03863b13544A47223O0743N1381a2835B62856E0439N8498m8112A8070
11134A06351m8165a91304A08575g6843C35526H5232l5628a53521B73305J30801
11124D04106K5947A02870k4747K6735J10551O8123h4704r177E2092f936A84523
11112A07750J56859p3936a03742d1845j13358A24996E1909e7064D6109J6326L12914
11101C75349h3864J2508I7549a32088A50259A889a01954E1234J66331R1348H5583
11089H4007K09605g8047E5416b27903A47970K7925m1835h5526C83505A75927O1855
$$ y = [106548, 256617, 210474, 132371, -273060, -154587, 44041, 201993, -78381, 21023, 2145, 9592, -136921, 3837, 420886, 17335, 41752, 8788, 146571, -126870, -48726, 46964, -89758, -137241, 203863, -213544, 147223, 207966, 259347, -12835, 262856, 50439, 108937, 60825, 18070, 106351, 58186, -191304, 108575, -76843, 335526, 85232, 49604, -153521, 273305, 404106, 430053, 102870, 78123, 104858, 215409, 283532, -84704, -93881, 52092, -6936, 184523, 107750, 264609, 190673, -103742, -41845, -155203, 124996, 51909, -57064, 46109, 62435, 375349, -83864, -71356, 97549, -132088, 150259, 1889, -101954, 51234, 217565, 308913, 85583, 84007, 293612, -78047, 55416, -227903, 147970, 175895, 134060, -85526, 383505, 175927, 237782]
11078B37782j07666I369a61794F0125N2230d2126A91499K96411k10214G8072K31214
11067C09286i2794K3252A28741m8390N37441r2540j22918Q2616j442d938E06687
11055E18746R5091k05746P6156j76226J68703o2726J29642B70946K05945l8084
11045D38807k1382K98305C24131L50307L6667k85536K77953q6648J06079R4832
11035H17785m06327Q8951P4221l7636k57829L06018j21976r6311J46851B41252
11024G01210j79341L0571j26726j87361K12568q9249J1619N8769L40267C58428
11013C56191J93607j69101K3540L05937N8034l09600J56325k95791M7188M82910
11003H49240E9306M80343J72789n2895r7845J10818l3734Q97B93088K59162j89577
$$ y = [237782, 130116, 9369, -161794, 60125, 112355, -42126, 191499, 487910, 277696, 78072, 309286, -92794, -69542, 128741, 80351, 617792, 525252, 402334, 484950, 483508, -4938, 506687, 518746, 613837, 408091, 484247, 308021, 476724, 413998, 543640, 270946, 476891, 438807, 417425, 715730, 324131, 674438, 711105, 425569, 703522, 616874, 722953, 817785, 411458, 500409, 574630, 536994, 279165, 585183, 463207, 366896, 513747, 241252, 701210, 521869, 552440, 425714, 238353, 450921, 361672, 373291, 432060, 772327, 358428, 356191, 549798, 380697, 404237, 710174, 768208, 458608, 614933, 319142, 366330, 849240, 59306, 539649, 712438, 659543, 561698, 672516, 638782, 639679, 293088, 552250, 362673]
10992C62673A28619M33887k62284P63301l43021M9177C39760K67434K26202Q4397
10982I17793L61604n84919K95593J18587J11606L17655m48062L76458L31244R974
10972A807533L85518J5142K18259l52058K42198O9813n66502l20053j59997N7842
10962A397695k71604R4630j64446J0837n1517r7069J58796J44864l58665J43263
10952A006784D54700N24865D72011G6143L4451K05206m676J29127A90585J00783
10942B91368O9707A05996a08899A51604b8689B08145a60703g5978C035K09657
10932B12692D7299J28936D1202J77684K060i4969L1676B24140J61618J60713E8591
10920a4987D5980J7795b19924B39508d0260q0863D18840a14299A20011C6344a83548
$$ y = [362673, 128619, 562506, 300222, 1063523, 720502, 769679, 339760, 607194, 833396, 917793, 1279397, 694478, 990071, 1108658, 1220264, 1537919, 1089857, 1466315, 1797559, 1807533, 2193051, 2208193, 2426452, 2074394, 2316592, 2386405, 1819903, 1499850, 1339853, 1397695, 1126091, 1220721, 1056275, 1067112, 1015595, 918526, 1077322, 1222186, 863521, 1006784, 454700, 979565, 472011, 76143, 110594, 315800, 311124, 440251, 190585, 291368, 361075, 105996, -108899, 151604, -28689, 208145, -160703, -75978, 3035, 212692, 47299, 176235, 41202, 218886, 220946, -94969, -63293, 224140, 385758, 546471, 58591, -14987, 45980, 63775, -219924, 239508, -40260, -121123, 418840, -114299, 120011, 36344, -183548]
10908d4866I558a8502l9950B31410J36718A27795a09063k4340j01926J1581A62627
10896I6229K1023J4046a1756j99372A62464e0392C26691c24267b7138j29258J0170
10885a46226J2048n570l5160d5062p1497D5504b30237B0796a24688A61308K97560
10874D58868F7270a3796k40661M8166L1534j61095H7379a7934l541j59025G3640
10862H9281L001c73901B79295a31299C8923H304O758C377R6309Q0140d37626A79429
10849A51302e3173C780b65916O4486c4063A72792c59132a33903j658A51604m4628
10838A06976b7554A5594e4985j59313f0567B23043G4495Q6269a51309A90195b93742
10826B4496J5664M6043b58773a07803j89611f3724E5446a46206a0964A74316c95912
$$ y = [-44866, 9558, -18502, -58452, 231410, 368128, 127795, -109063, -133403, -235329, -223748, 162627, 96229, 117252, 131298, -11756, -211128, 162464, -50392, 326691, -324267, -27138, -156396, -146226, -134178, -139748, -174908, -45062, -116559, 45504, -230237, 20796, -124688, 161308, 458868, 67270, -13796, -254457, -206291, -174757, -335852, 87379, -17934, -21475, -180500, 73640, 89281, 92282, -373901, 279295, -131299, 38923, 8304, 15062, 3377, 99686, 179826, -437626, 179429, 151302, -53173, 3780, -265916, -201430, -34063, 172792, -359132, -133903, -135561, 151604, 106976, -27554, 15594, -54985, -214298, -60567, 223043, 74495, 160764, -151309, 190195, -293742, 24496, 40160, 86203, -258773, -107803, -297414, -63724, 55446, -146206, -10964, 174316, -395912]
10814b64505A20783a02430A7294K34337b3391A79520J10954a60451o4258r669
10804b34378H0815c31924J54238k04097G9837i5106k80970E1955a09497G6659
10793e62649b8672j40884j81185J47548P3298A56674a38127L4582n8238K8261
10783a33522b6235L622B20924A06029a94294A2210a36107N5746J2164I5518m2453
10772E3065a09763H1350g5429E4789d6104q5703E5289O7695O5404h7244D1451
10760a03059j19584R9962C0515e7031A05439b19657B81402k6870E2999i6125A26984
10748c34310O2674K6198b9466H9959A0394a51676B7063K13819J29778F4805a66442
10736a27397D7589b12327O2572N7326b1384k27419O9299a9294A88212a44118j7806
$$ y = [-264505, 120783, -102430, 17294, 251631, -23391, 179520, 290474, -160451, -224709, -234378, 80815, -331924, -177686, -381783, 79837, -95106, -376076, 51955, -109497, 76659, -562649, -28672, -169556, -350741, -203193, -129895, 156674, -138127, -103545, -161783, -133522, -26235, -22613, 220924, 106029, -194294, 12210, -136107, -80361, -68197, 95518, 53065, -109763, 81350, -75429, 54789, -46104, -131807, 55289, 122984, 188388, -87244, 41451, -103059, -222643, -122681, 30515, -57031, 105439, -219657, 281402, 254532, 52999, -96125, 126984, -334310, -271636, -245438, -29466, 89959, 10394, -151676, 27063, 240882, 370660, 64805, -166442, -127397, 47589, -212327, -149755, -92429, -21384, -248803, -179504, -19294, 188212, -144118, -161924]
10725a61924K9937C0560J5450a28747j38357i0705C4853b43661B62146a85106
10714a32726G5708J09389c8451o8118o7116B46483b55098A72426p0969m3095i121
10702b5906E0194d998j53031j6162e9223D9270J88719b38371P246h6246j52906
10691b39152A18013R5298D0710R3131a37163A29023i0083B04211a39890D9745
10680A00683a82674D3473a56644e1765K4257m4684G1129K04418g5325j07843B3860
10668a79337C5943O5431c99795e1089k9166A20279h1784F9699c33218B5035a18699
10656a39357n8749j85316G227R0609a47887E6753b55341J2836I8841b82751h9051
10644e0896B49140j08394B7834b68374a9691j27422B31017A76a18112p1822A83181
$$ y = [-161924, -131987, 30560, 46010, -128747, -267104, -90705, 34853, -243661, 262146, -185106, -132726, 75708, 185097, -38451, -106569, -173685, 246483, -255098, 172426, 101457, 58362, -9121, -25906, 50194, -4998, -158029, -174191, -59223, 49270, 237989, -238371, -231125, -86246, -239152, 118013, 213311, 40710, 133841, -137163, 129023, -90083, 204211, -139890, 49745, 100683, -182674, 43473, -156644, -51765, -27508, -72192, 71129, 275547, -75325, -183168, 23860, -179337, 35943, 101374, -399795, -51089, -80255, 120279, -81784, 69699, -333218, 25035, -118699, -139357, -198106, -383422, 7227, 97836, -147887, 56753, -255341, -242505, 98841, -282751, -89051, -50896, 249140, 140746, 27834, -268374, -19691, -147113, 231017, 176, -118112, -189934, 183181]
10632b47167D8555a75878A53882J3602a19915F7858a56977K7410H3586b68720
10621B6716b21244b6550E3477a49510B68342I846J47885m445d6236l8324A65612
10609I9019K2743P1572B3120b71052A29474c12409a24711f2073A26397b20711
10598a07405k62021R9604b110E4575J2864a17336k43127a61373C22120e988k07979
10587b13967j03883d7702A14091P0154b29541a11864H6912b50258L056A53108
10576A5251f2920A14276D8015e541l50084R3987d8581l2031o4269J4526j36568
10565b66923B2209a67280B18234d6359D70644E1387J3838b2533j44705A04886
10554c2555C30978c92589F9862f5191C59346A3913D939M0453f3225l94784G2154
$$ y = [-247167, 48555, -175878, 153882, 167484, -119915, 67858, -156977, -129567, 83586, -268720, 26716, -221244, -26550, 53477, -149510, 268342, 9846, 157731, 153286, -46236, -84560, 165612, 99019, 121762, 193334, 23120, -271052, 129474, -312409, -124711, -62073, 126397, -220711, -107405, -369426, -269822, -2110, 54575, 67439, -117336, -360463, -161373, 322120, -5988, -213967, -317850, -47702, 114091, 184245, -229541, -111864, 86912, -250258, -247202, 153108, 15251, -62920, 114276, 48015, -5541, -355625, -261638, -48581, -80612, -144881, -130355, -266923, 22209, -167280, 218234, -46359, 470644, 51387, 65225, -22533, -167238, 104886, -32555, 330978, -392589, 69862, -65191, 359346, 13913, 4939, 45392, -63225, -458009, 72154]
10542C28897a41475D2580b5090j24228d3682j44973O3786N5867j02171E6906h9228
10530D6383e2739G2176c704m36096n7294a60741j39356J42166A32809a0802k59251
10519b70053c8905A7559b55521A2216b6667I3935b34935o7072B00960c95664h9272
10507c50618b8330A08166A9738O7535c38667b7920q0879R13A19194a1878l11814
10496c23692i0699R574K1267j85806g4219H9799j8312a84031A59891c04585Q1382
10485b23203F5642J2971R0897c3315m0499l3470B14624C0781b7955A21087c0362
10473e3923A38178c80783A51947a18916c5523B4344J7708a55977C69060A53817
10462A84359E8339a07760B34763B8658J58060D4156Q5610i9159A11627Q1047G1425
$$ y = [328897, -141475, 42580, -25090, -149318, -43682, -188655, -124869, -69002, -171173, 56906, -89228, 46383, -52739, 72176, -3704, -439800, -497094, -160741, -300097, -157931, 132809, -10802, -270053, -38905, 17559, -255521, 12216, -26667, 93935, -234935, -302007, 200960, -395664, -89272, -350618, -28330, 108166, 19738, 87273, -338667, -27920, -108799, -107886, 119194, -11878, -323692, -90699, -81125, -59858, -245664, -74219, 89799, 71487, -184031, 159891, -304585, -223203, 65642, 78613, 169510, -33315, -73814, -107284, 214624, 30781, -27955, 121087, -30362, -53923, 138178, -380783, 151947, -118916, -35523, 24344, 42052, -155977, 369060, 153817, 184359, 58339, -107760, 234763, 28658, 186718, 44156, 129766, -99159, 111627, 192674, 71425]
10450A96360E5993g2025j46409j6554A59778a71296A10298B4725K655J8499R183
10439E5062c0829n1432B05818c65906a51217f2020A51254A150J69171a14008k2226
10428a36234L2762D03368e3731k82441f7492n0662m5057B21579b3514p0103A03924
10416E2742K01255C8661K83188c7194m6491B85242A10160C8899a41164K7271C24119
10404a07833l5704B14863a91257B8923a73682A5488K02193G8250K71250F7748
10393C9349f969G8937h4014A30682n7592m102K46873j30271c3912p5924B20673
10381E63034C0264K72211F0757J50357i0358G6310M07493A08355J60391j26021
10371A42725M740o3774J64235q9388Q9375I2221J33121J6715P1851Q2135j92616
$$ y = [196360, 55993, -72025, -218434, -234988, 159778, -171296, 110298, 24725, 27380, 45879, 55062, -30829, -82261, 205818, -365906, -151217, -62020, 151254, 1150, 170321, -114008, -136234, -103472, 403368, -53731, -336172, -67492, -118154, -163211, 221579, -23514, -93617, 103924, 52742, 253997, 38661, 321849, -37194, -83685, 285242, 110160, 38899, -141164, -113893, 324119, -107833, -143537, 214863, -191257, 28923, -173682, 15488, 217681, 78250, 349500, 67748, 39349, -6969, 78937, -84014, 130682, 73090, 68988, 315861, 185590, -33912, -109836, 220673, 563034, 30264, 302475, 60757, 211114, -90358, 76310, 483803, 108355, 268746, 142725, 147465, 83691, 247926, 158538, 247913, 92221, 225342, 242057, 313908, 396043, 203427]
10360B03427K9733R8294j25269J9400J06667Q4858L7566A9911L53180A80865O7494
10349B48359K7429J61091J8825k4605A50843g6872g437B91703J77408b43734I0191
10337d3846C34235j2479H0902L6561a33550C10604n5979h0662A53236A248J89470
10326A90718q7848d6382B0410c1137C74604i2579l5531A86844a38696A54820b88781
10314B31744F3037j8992J97628D510d5615k13942m2594B23450d8939A25179a60099
10302e0648B19622I9045P4704m4613d5882p1229d5462C7923B596a93344B43677
10290A18272h3053I7030c84332J91125A60243c78431a02099A88435a76282I5539
10279e4456j16016q9509d3825I6071b95742h3336c5087A56147B8706A200J07682
$$ y = [203427, 233160, 331454, 206185, 225585, 332252, 417110, 454676, 19911, 373091, 180865, 248359, 275788, 436879, 455704, 431099, 150843, -76872, -7437, 291703, 469111, -243734, 90191, -43846, 334235, 321756, 80902, 117463, -133550, 310604, 254625, -80662, 153236, 1248, 190718, 102870, -46382, 20410, -31137, 374604, -92579, -128110, 186844, -138696, 154820, -288781, 231744, 63037, 44045, 241673, 4510, -45615, -259557, -302151, 223450, -48939, 125179, -160099, -50648, 219622, 99045, 173749, 129136, -45882, -117111, -45462, 37923, 2596, -193344, 243677, 118272, -83053, 97030, -384332, -193207, 160243, -378431, -102099, 188435, -176282, 95539, -54456, -170472, -259981, -43825, 96071, -295742, -83336, -35087, 156147, 28706, 1200, 108882]
10268A08882M7193a3056j5932A4556K79732E9274b27934L3339a1863l5902e156
10256B24140J38607c8321B16819o3655A9478R6255J174F247K50578c14709d1089
10244I6990a15493e969j02874A90569a65398C66300c05156E6362c42668C6753
10233B28242b92378H4402N282Q9590a4596A45553B7801a06555c5447j15934C44407
10221A13491R7186m3584K4461a40713e0817k86080a17280E4700a07472M9398E3327
10209B36850L8699D8167J2997A4209a35447B3174b24438k14304A13716K5728b12376
10197F7158f5788B95842I1474m980a2783m7358k53760J56548B0972f767A24096
10185e5319k55377L1214f8439n2567B99907b17846a04929E2102b53951A18301
$$ y = [108882, 156075, -13056, -28988, 14556, 294288, 59274, -227934, -194595, -11863, -47765, -5156, 224140, 362747, -38321, 216819, 153164, 19478, 115733, 116907, 6247, 256825, -314709, -41089, 96990, -115493, -5969, -108843, 190569, -165398, 366300, -305156, 56362, -342668, 36753, 228242, -292378, 84402, 89684, 179274, -14596, 145553, 27801, -106555, -35447, -151381, 344407, 113491, 210677, 167093, 191554, -140713, -50817, -336897, -117280, 54700, -107472, -58074, 53327, 236850, 275549, 48167, 61164, 14209, -135447, 23174, -224438, -438742, 113716, 139444, -212376, 67158, -65788, 295842, 91474, 86494, -12783, -60141, -313901, -157353, 20972, -6767, 124096, -55319, -310696, -279482, -68439, -121006, 299907, -217846, -104929, 52102, -253951, 118301]
10174a4169A82732g6562m6292d9683j61566B16662a94484M8544M6044H9535b51677
10162f6816B34477A05963m5933R6957l4093a09921l1823B80267f5485A46892a50839
10150A17967b00001B57467A8017a15249A86868g8324j18397N5984K7853q5868
10140a98752G7507C6045h4915L5870g906j89470E8286a32261n6591A19098a12087
10128A85041B7974K66647f0121K585o1153j67242A94715b34310m735B58068b2686
10116E3408f6730A10928g6060K2507j85562h3688L2890r5410q998p6772A6685
10104B76087b19400R0912e4338A46987h2539l27948A8211a61190B22459B0045
10093B15447C0463j0600i0522D6736B1904F307f5273j01684B18555l9360b69947
$$ y = [-14169, 182732, -76562, -122854, -49683, -211249, 216662, -194484, -145940, -99896, 89535, -251677, -66816, 234477, 105963, 60030, 156987, 122894, -109921, -141744, 280267, -65485, 146892, -150839, 117967, -200001, 257467, 18017, -115249, 186868, -78324, -196721, -140737, -112884, -198752, 77507, 36045, -84915, -49045, -7906, -197376, 58286, -132261, -188852, 119098, -112087, 185041, 27974, 294621, -60121, -57536, -118689, -285931, 194715, -234310, -239045, 258068, -22686, 53408, -66730, 110928, -76060, -53553, -239115, -83688, -50798, -146208, -155206, -231978, 16685, 276087, -219400, -128488, -54338, 146987, -82539, -410487, 18211, -161190, 222459, 20045, 215447, 30463, 19863, -90522, 46736, 21904, 6307, -65273, -166957, 218555, 179195, -269947]
10081b74143P4897D6538p566P3086a10094B03713e1400j03146A21201c14674C50408
10069g2259E6519a9817o7922j17867e9715a0352j3695P465m0065D8321a71963
10057a45921e3912A62131a16068j29227d2970j64189d0815k82360p2818A11876
10046A74315b02809M7610A2641b41187B03138i1395A99253q8636g9696A82861
10035A40304c4890j36277P4006k20086A08058P1052p9535a99171J7318A66305
10024g8284B66964b78840A27074a25628A16497c8006j04977c598B42403a68606
10013b30817K4270N7033I5776b55603r823B03039d0492A25838b94618j49929a49451
10001a60935d0860k13152m2209j15414a5704j97489M233D4048a39663q2291H7224
$$ y = [-274143, -199246, 46538, 38972, 112058, -110094, 203713, -51400, -154546, 121201, -314674, 350408, -72259, 56519, -19817, -87739, -205606, -59715, -10352, -24047, -16582, -56647, 48321, -171963, -145921, -53912, 162131, -116068, -245295, -42970, -207159, -40815, -323175, -395993, 111876, 174315, -202809, -155199, 12641, -241187, 203138, -91395, 199253, 110617, -79696, 182861, 140304, -34890, -171167, -97161, -317247, 108058, 179110, 99575, -199171, -181853, 166305, -78284, 266964, -278840, 127074, -125628, 116497, -38006, -142983, -3598, 242403, -168606, -230817, -206547, -149514, 95776, -255603, -265426, 203039, -40492, 125838, -294618, -444547, -149451, -160935, -40860, -254012, -296221, -411635, -15704, -213193, -208960, 44048, -139663, -221954, 87224]
9989c28974J48872J2442p6485a12713o3934J5811p0756k0714b2864j9010q9783
9978a31657b0891m6599H552b80749J03372A4317D662b8486k14607A85398d1499
9966c7884A34392d5634F4842K63678a76171j32140a41570j24029O8808a0675l09009
9955c19684J52544k9552k448j46168i8878H586d7200l29185a20724m04504c9092
9943e19602h5673A68511i4191b30A46032I601K990M623a15810A70322c7393p0368
9931a07761j52311d3439B13574b19066B09549e3448G3189L3244c7272k88281C5835
9919C42676G9060J51762A09683J20541q8423b4321j59726G6204a19589A58454
9908A6473N5798O6462c46406d132q4596o43248e7592k74737R8553C1135h2535
$$ y = [-328974, -180102, -167660, -244145, -112713, -176647, -160836, -231592, -252306, -22864, -41874, -131657, -20891, -67490, 8552, -280749, -177377, 14317, 4662, -28486, -243093, 185398, -41499, -37884, 134392, -45634, 64842, 328520, -176171, -308311, -141570, -265599, -196791, -10675, -319684, -167140, -196692, -199140, -345308, -98878, 8586, -47200, -376385, -120724, -525228, -39092, -519602, -85673, 168511, -94191, -230, 146032, 9601, 12591, 17214, -115810, 170322, -37393, -107761, -260072, -43439, 213574, -219066, 209549, -53448, 73189, 106433, -37272, -325553, 35835, 342676, 79060, 230822, 109683, 230224, 141801, -24321, -184047, 76204, -119589, 158454, 16473, 72271, 138733, -346406, -4132, -88728, -731976, -57592, -332329, -233776, 31135, -82535]
9896D3009L11932a12310B52724d3182l5655a9472o4131j60680J2831l363d8895
9884a01129p1558O3668C41016b44935a4452B988a0989A15579a96238f91o9097
9873f9788q7917B35911d2479j69979g4402A46586n9516b30419f9210A43929b73486
9861d2793B46425b97963B37791A08640i3472A18989K5599e388r7076B68884a88779
9849a11186A0998a13563n9408E4559h8939A62796J2941B9434c91890Q9201e4306
9837a63955M8981A2379K11415C2037a7534B37238d2154j8449k3278c038a088j50826
9825a51914b6522k88936m4972h3711C6488d68487f7461A9827g4417A47066a53052
9813c81360B13591b8638j10090K8441o7359n2993G3540d0872B9573b51034H302
$$ y = [43009, 354941, -112310, 252724, -43182, -78837, -19472, -83603, -244283, -231452, -234815, -48895, -101129, -172687, -109019, 341016, -244935, -14452, 2988, -10989, 115579, -196238, -691, -69788, -157705, 235911, -42479, -212458, -74402, 146586, 87070, -230419, -69210, 143929, -273486, -42793, 246425, -297963, 237791, 108640, -93472, 118989, 144588, -5388, -102464, 268884, -188779, -111186, 10998, -113563, -172971, 54559, -88939, 162796, 175737, 29434, -391890, -302689, -54306, -163955, -114974, 12379, 223794, 32037, -17534, 237238, -42154, -60603, -83881, -3038, -1088, -151914, -26522, -315458, -360430, -83711, 36488, -468487, -67461, 19827, -74417, 147066, -153052, -381360, 213591, -28638, -138728, -110287, -177646, -230639, 73540, -40872, 29573, -251034, 8302]
9801b83947A48603J4284e4727J5603o8378j12510L8484j74438A61085b1234A58087
9789a59322l15315A64847a63491j28540J18682A57975a33827H0167e8659j38303
9779a96962g490j11617k9288k00463I3180f9954l107D6412E608a92610m6129I533
9766b99587C15591b87990G8005a57624l6428K493B5332J31489a6408N752j8620
9755b9276j16530A68854m7312a50366E5284b61249A16743d43457A88552a98888
9744a67539c4367j31917M2849f1378m8077b0362F994b58418R3083E9608b25839
9732c53410H5196b24673g6727D11034a06687q5030q1471j30205J61758g9598J8413
9721f1185E4632k2965f6036C2655J98049I0309J9665J23341c75075A17894D484
$$ y = [-283947, 148603, 162887, -54727, -39124, -107502, -220012, -181528, -355966, 161085, -21234, 158087, -159322, -474637, 164847, -163491, -292031, -173349, 157975, -133827, 80167, -58659, -196962, -7490, -119107, -148395, -348858, 93180, -69954, -73061, 46412, 5608, -192610, -238739, 9533, -299587, 315591, -287990, 78005, -157624, -194052, -191559, 25332, 156821, -16408, -10656, -29276, -145806, 168854, 121542, -150366, 55284, -261249, 116743, -443457, 188552, -198888, -167539, -34367, -166284, -123435, -61378, -109455, -20362, 6994, -258418, -165335, 59608, -225839, -353410, 85196, -224673, -76727, 411034, -106687, -191717, -273188, -403393, -241635, -79598, -61185, 54632, 31667, -66036, 32655, 230704, 90309, 109974, 233315, -375075, 117894, 4484]
9709a42593a1738l746r1365H8972L7213a23565k2983o0861g0152J5388k47958
9698c02722n230C13318b53027Q3194E5004L25788c29610a26832O2065j4696B4106
9686a89832a8458l62360a35228J6766j922B40634a50886B18255b18044f6652B95529
9674i1177j30061g5866A23176b76960p3513H0596g6539B56178C4660c7167m4157
9663h1324F2064K75651j08697a44306o3520m7497e6824j38656f7964k39568d1680
9651c77371I1994C3249a93248j98615a50659A61234O0723J4926E4011h2159k4562
9640a06721j6180N9412r7274m4422d3378A8050b2382A3686g5101o1660A56175
9628a19135k15324A90149o8038P7421a32281j55227C01386b49004g6237k29083
$$ y = [-142593, -11738, -15484, -106849, 88972, 126185, -123565, -146548, -207409, -70152, -54764, -302722, -307952, 313318, -253027, -169833, 55004, 380792, -329610, -126832, -64767, -79463, 24106, -189832, -18458, -380818, -135228, -118462, -120384, 240634, -150886, 218255, -218044, -66652, 295529, -91177, -221238, -75866, 123176, -276960, -350473, 80596, -76539, 256178, 34660, -37167, -81324, 62064, 337715, 229018, -144306, -207826, -255323, -56824, -195480, -67964, -307532, -41680, -377371, 91994, 33249, -193248, -391863, -150659, 161234, 221957, 236883, 54011, -82159, -106721, -122901, -63489, -160763, -205185, -43378, 18050, -22382, 13686, -75101, -136761, 156175, -119135, -334459, 190149, 122111, 199532, -132281, -287508, 301386, -249004, -76237, -305320]
9618c05320N311J33397C8797g5988r4965k829A55995J0564c8973p5446e2937B5458
9605c57053a58851l2625A39971a16047j33115p9717J00826a05357B01135k132
9595A99003b48894A34445f4779j169A28149l4837a54578H2344R1445c41475a52413
9583D9808M573B1382f502G2460i2627c7245C7177a2229o3234a7830m59343f693
9570h5332a1239j49943P5302K2214r6385r7006d2245n2006F8401b42042K3149
9559b18893F0006Q7694G3577O5964K41109d9923N136p9560D2281L2708c4377k9575
9547f3952a4965B0609a57585C0270d1210M353A85350g8564j60116b1397k2150
9536d3547F7914b16710j18207a05802n8051P4428B9833d8744B61073j25300C4026
$$ y = [-305320, -300009, -166612, 38797, -75988, -170953, -173782, 155995, 166559, -38973, -114419, -52937, 25458, -357053, -158851, -191476, 139971, -116047, -249162, -328879, -228053, -105357, 201135, 199003, -248894, 134445, -64779, -65948, 128149, 93312, -154578, 82344, 173789, -341475, -152413, 49808, 54381, 21382, -6502, 72460, -92627, -37245, 37177, -12229, -75463, -17830, -477173, -6693, -85332, -11239, -161182, -85880, -63666, -160051, -257057, -42245, -94251, 68401, -242042, -218893, 60006, 147700, 73577, 139541, 380650, -49923, -44787, -124347, 42281, 74989, -34377, -63952, -14965, 20609, -157585, 30270, -41210, -36857, 185350, -78564, -238680, -21397, -43547, 67914, -216710, -334917, -105802, -163853, -89425, 29833, -48744, 261073, 135773, 34026]
9524d2648B79028i8585p670p1356Q0634o5328b6426o2251E343e4411j02939N4949
9512a02401M7322q7210f7883n1877A18766c9530A75965c07278a34243f1127m4016
9501a05143H9672b27820m454E75J49846k7765E2339a57568M3604b3074k75421
9490b98495J16736A65527M55J63252A27043i4789F4720d5206j6589A13102k5548
9479H7554b16198q788i6040A21471b22519H106c87096G3599c67190J41796A91675
9467D5548a0322j55367K352n2594R4132J4859b6483G098c35192a33455j17882
9456b51337j13107J35063Q6734A00600e0485r9261H340b6929D3497K15336A19796
9444a42287d5566B03115G0778l0090d9085j64522B13519a01469C59975j50329
$$ y = [-42648, 279028, -98585, -106255, -177611, -96977, -162305, -26426, -88677, 5343, -54411, -157350, -102401, -55079, -142289, -67883, -119760, 118766, -39530, 175965, -307278, -134243, -61127, -105143, 89672, -227820, -232274, 575, 150421, 122656, 52339, -157568, -113964, -23074, -298495, -181759, 165527, 165982, 329234, 127043, -94789, 64720, -45206, -61795, 113102, 87554, -216198, -224986, -96040, 121471, -222519, 8106, -387096, 73599, -367190, -225394, 191675, 45548, -10322, -165689, -163337, -215931, -121799, -106940, -26483, 7098, -335192, -133455, -251337, -364444, -229381, -142647, 100600, -50485, -149746, 8340, -26929, 43497, 258833, 119796, -142287, -45566, 203115, 70778, 40688, -49085, -213607, 213519, -101469, 359975, 209646]
9434B09646b1153j57291c1853E0765B0159a15383l5138b6072B90770r2476d5614
9422A13758d57919a89950A72875a19642E1970e5202j89712a21752B00036f2177
9411g7594l09294C017J09740b67876a08251F6418O0273D5063d03524e5776p5581
9400a31357l61573a83175d0264j96343R5670f2027j08255D2620J63319n0107C9373
9388E4033a96841A3431a3540k5540j85335B31695a08242A40156a52311B8544R2517
9377A21061Q9279R6404b24733K6883J1605a8694A07237a07238r9735f9638l01325
9366c70963B76856a96842A4734J77004b32059O3842e2683m7938j36284C8692a02340
9354b65361g0240k92069B88785D2404J41305e5616H7636h0890B3238b12735o2160
$$ y = [209646, -21153, -178444, -31853, 50765, 20159, -115383, -150521, -26072, 290770, 198294, -45614, 113758, -457919, -189950, 172875, -119642, 51970, -55202, -244914, -121752, 200036, -62177, -77594, -386888, 3017, 112757, -267876, -108251, 66418, 126691, 45063, -403524, -55776, -131357, -492930, -183175, -40264, -236607, -140937, -62027, -170282, 42620, 205939, 155832, 39373, 54033, -196841, 13431, -13540, -39080, -224415, 231695, -108242, 140156, -152311, 28544, 121061, 210340, 306744, -224733, -197850, -186245, -18694, 107237, -107238, -206973, -69638, -370963, 276856, -196842, 14734, 191738, -232059, -168217, -52683, -100621, -236905, 38692, -102340, -265361, -70240, -362309, 288785, 42404, 183709, -55616, 87636, -80890, 23238, -212735, -274895]
9343b74895A95484L2872a20985H6104J20626b10529N4701B79167c5334c229m14851
9332d18080A56953a69415b3162j60525l1442r4542g0494E4259A5901a37666j53666
9321b91332B33453d0526q1986B1135b87584a16868n5707p6257B8925J37742a01355
9309b35133H0806a46630b9539l6775D176d8403l00605j2595h3593j65988F1499
9297a24909j55331a05407m9438G8429M0444c6683A06206c27508F6660K30k6784
9286D0106A1950l458a25748j91254A22919c5032l9317c1946k75230a32122G8277
9274e2973H140J33500g6735F9836b22200l6581i6936k68700A32594E5020A3152
9262h7070j16593h8358k35931K0886b0779A985c9044G8243a73024P7402k63498
$$ y = [-274895, 195484, 228356, -120985, 86104, 206730, -210529, -155828, 279167, -35334, -3229, -418080, 156953, -169415, -23162, -183687, -215129, -309671, -70494, 54259, 15901, -137666, -291332, 233453, -40526, -122512, 21135, -287584, -116868, -172575, -248832, 28925, 166667, -101355, -235133, 80806, -146630, -29539, -66314, 4176, -48403, -349008, -361603, -83593, -249581, 61499, -124909, -280240, -105407, -154845, 78429, 118873, -36683, 106206, -327508, 66660, 66890, 40106, 11950, 8492, -125748, -317002, 122919, -35032, -74349, -31946, -307176, -132122, 78277, -52973, 8140, 141640, -76735, 69836, -222200, -258781, -96936, -365636, 132594, 55020, 13152, -87070, -203663, -88358, -324289, -303403, -20779, 1985, -39044, 78243, -173024, -95622, -359120]
9251c59120j55801K15804b4783j33713q1358Q2643j11372P9125D04624i8423o0726
9240a59149g9367j22334A16111E0453d9106C08307a56974e9017a0076j94869a4603
9228a88932C80409a36352j58881B43284a20057K8809A33780J13999h8869k75816
9218c64685C00349a50285b4455j52951g7475k50996B00073m924d9334A34820e5497
9206b09499f0997h785F0120c2624k117n5519B07188g7688B4498e4105F7590b8138
9193A9781h5629j24269A9726a51556I1660a04119n2096b7706r5317A02672a46465
9181h3691B40068F924a77997h8381q0870P7269C5053L3857A6441J38790b5108
9169A7038f4155K2934l22627A33767M3483j8507c38864J43810B29632b14379C9765
$$ y = [-359120, -514921, -299117, -24783, -158496, -239854, -157211, -268583, -189458, 404624, -98423, -159149, -79367, -201701, 116111, 50453, -49106, 308307, -156974, -59017, -10076, -204945, -14603, -188932, 380409, -136352, -295233, 243284, -120057, -91248, 133780, 247779, -88869, -364685, 300349, -150285, -24455, -177406, -77475, -328471, 200073, 195149, -49334, 134820, -55497, -209499, -60997, -8785, 60120, -32624, -34741, -90260, 207188, -77688, 24498, -54105, 67590, -28138, 19781, -85629, -209898, 19726, -151556, 91660, -104119, -156215, -27706, -123023, 102672, -146465, -83691, 240068, 6924, -177997, -88381, -169251, -91982, 35053, 68910, 16441, 155231, -25108, 17038, -64155, -41221, -363848, 133767, 177250, 158743, -338864, -195054, 229632, -214379, 39765]
9157A90616i8792o0245A1329b94621E6425a65512j32314i5389r4753A36423P8856
9146B15279a00869n2297E6035g7969j60393j45609D74450b85485J24842C1970
9135C1827a62684d4993B87669f2189k9334A8947a24674A60067O9022j9102b05682
9123a36105b8497n592B64380a26988o8600d6185Q252l56862a22849P15B9855j0735
9111A9120L4320J56268a2936B73296a33203j10757H230J79393b67178a294j45018
9100a46312l1165B2221c36709i8821A36948b910j4847l36921B51594a94568e5275
9088A12954b47998B51903m4523E7825a25124D06532b4503j65619L7342e3599D0385
9076A00848L3326R024b178a078n9625m0679L1288m3596j91739K6296C35200A21673
$$ y = [190616, -98792, -159037, 11329, -294621, 56425, -165512, -297826, -95389, -190142, 136423, 215279, -100869, -153166, 56035, -77969, -238362, -383971, 474450, -285485, -160643, 31970, 31827, -162684, -44993, 287669, -62189, -91523, 18947, -124674, 160067, 229089, 209987, -205682, -136105, -28497, -34089, 264380, -126988, -195588, -46185, -37933, -394795, -122849, -122134, 29855, 19120, 53440, 209708, -12936, 273296, -133203, -243960, 8230, 187623, -267178, -1294, -146312, -177477, 22221, -336709, -98821, 136948, -2910, -17757, -354678, 251594, -194568, -55275, 112954, -247998, 251903, 207380, 57825, -125124, 406532, -24503, -190122, -152780, -53599, 40385, 100848, 134174, 143198, -2178, -1078, -60703, -101382, -70094, -113690, -305429, -279133, 335200, 121673]
9063d6696E4517f0019J1965j02986A2014a72859j34374a19004A53814N50j7533
9052A36831l3379a1495k15070c943l6946D4573d38099B91016a26504A90696E481
9040F2452f9660j96128F126Q4997b7270m0333A46341a62714b7863k46911A83880
9028B49891c53346A25979l7007h835q1705B02998D5678a62804A95785c18113e868
9016b95478Q4937e8113k47814g8588B80060a29047N1481A0677K9615b05298F8697
9004A05628H988b26031O7000N9096k5876o9513J3816P2771A00266b38332A72805
8992a39540A87326b3710l62381J35698R9097b2722l28j24246H3007K57899j60114
8981A80792b4733m9744H1289b35820D6916J84792e7769A46467J0445c77137a48353
$$ y = [-46696, 54517, -60019, -48054, -151040, 12014, -172859, -307233, -119004, 153814, 154364, 136831, 103452, -11495, -226565, -3943, -40889, 44573, -438099, 291016, -126504, 190696, 5481, 62452, -69660, -265788, 6126, 91123, -27270, -67603, 146341, -162714, -27863, -274774, 183880, 249891, -353346, 125979, 88972, -8835, -90540, 202998, 45678, -162804, 195785, -318113, -5868, -295478, -210541, -58113, -305927, -78588, 280060, -129047, -77566, 10677, 40292, -205298, 68697, 105628, 8988, -226031, -159031, -99935, -125811, -195324, -181508, -108737, 100266, -238332, 172805, -139540, 187326, -23710, -386091, -250393, -151296, -22722, -23050, -147296, 83007, 340906, 180792, -24733, -74477, 81289, -235820, 46916, 231708, -57769, 146467, 156912, -377137, -148353]
8969a8324j09931j01121D2500a73958k5837A70864a18227j99559M9578j42992
8959d11200A72742b3342m8885A28833j3084a4165k69645H0940D907M883J59051
8948A68841c16953Q2593e6003E157a78294j98147a31294j81189A27370c69821
8937a35084M0087b7560E1942B0503a79771g339k45106E1352b2541j93898A38985
8925G4969i8371B66026L08047K858878K009763k694995A026951C61220R2641F4450
8914g9049A97338E2028b6590B34280f7249k0535D3269N0520O3149a39364A66169
8902C7024a4019B1242b73095A2091a19461r1740A53558m0692E4603L44264F2834
8890e4561l72256b5831B31061b83303O2781A77387a84925j22686J06385h1978
$$ y = [-18324, -128255, -229376, 42500, -173958, -199795, 170864, -118227, -317786, -268208, -411200, 172742, -23342, -72227, 128833, 115749, -14165, -283810, 80940, 4907, 9790, 168841, -316953, -234360, -56003, 5157, -178294, -376441, -131294, -312483, 127370, -369821, -135084, -94997, -27560, 51942, 20503, -179771, -7339, -252445, 51352, -22541, -216439, 138985, 74969, -98371, 266026, 574073, 3432951, 5442714, 2747719, 1026951, 361220, 453861, 64450, -79049, 197338, 52028, -26590, 234280, -67249, -87784, 43269, 93789, 156938, -139364, 166169, 37024, -14019, 21242, -273095, 12091, -119461, -211201, 153558, 112866, 54603, 398867, 62834, -54561, -426817, -25831, 231061, -283303, -220522, 177387, -184925, -307611, -201226, -81978]
8879A95794A3788J46149b22705F3264A5194d2712J2612I6022b97878h4642k22431
8868c07073Q8701A4888b51198a1584p4554k74265f9356L127K8579r7368j49371
8857b84389h4456m1148a9197A11827h3040l4557B2349a31092Q775B08814a18222
8845F5382d43433F3213j3556J12598L4969b23274A5393g3155L2032r560B2696
$$ y = [195794, 13788, 159937, -222705, 63264, 15194, -42712, -30100, 96022, -297878, -84642, -307073, -218372, 14888, -251198, -11584, -86138, -360403, -69356, -66229, -37650, -135018, -284389, -84456, -125604, -19197, 111827, -83040, -117597, 22349, -131092, -122317, 208814, -118222, 65382, -443433, 63213, 49657, 162255, 197224, -223274, 15393, -73155, -41123, -50683, 22696]
$$ [...]
##END NTUPLES=NMR SPECTRUM
##END=
