##TITLE=AC1671_VIERN14362_8570997_khaJmL0gFv
##JCAMPDX= 6.0         $$ Bruker NMR JCAMP-DX V2.0
##DATA TYPE= NMR SPECTRUM
##DATA CLASS= NTUPLES
##ORIGIN= BRUKER
##OWNER= Administrator
$$ 1.72 TOPSPIN		Version 2.1
$$ 2014-04-11 18:05:26.397 -0700  Administrator@X
$$ Compression mode = diff/dup
##.OBSERVE FREQUENCY= 400.02188249412
##.OBSERVE NUCLEUS= ^1H
##.ACQUISITION MODE= SIMULTANEOUS (DQD)
##.ACQUISITION SCHEME= undefined
##.AVERAGES= 64
##.DIGITISER RES= 22
##SPECTROMETER/DATA SYSTEM= spect
##.PULSE SEQUENCE= noesygpps1d.comp
##.SOLVENT NAME= COFFEE_meoh
##.SHIFT REFERENCE= INTERNAL, COFFEE_meoh, 1, 14.96108
##AUDIT TRAIL= $$ (NUMBER, WHEN, WHO, WHERE, PROCESS, VERSION, WHAT)
$$ ##TITLE= Audit trail, TOPSPIN		Version 2.1
$$ ##JCAMPDX= 5.01
$$ ##ORIGIN= Bruker BioSpin GmbH
$$ ##OWNER= Administrator
$$ $$ E:\/data/COFFEE/nmr/AC1671_VIERN14362_8570997_khaJmL0gFv/12/pdata/1/auditp.txt
$$ ##AUDIT TRAIL=  $$ (NUMBER, WHEN, WHO, WHERE, PROCESS, VERSION, WHAT)
(   1,<2014-04-11 18:05:20.876 -0700>,<Administrator>,<X>,<go>,<TOPSPIN 2.1>,
      <created by zg
	started at 2014-04-11 17:53:51.123 -0700,
	POWCHK enabled, PULCHK disabled,
       configuration hash MD5:
       C8 4E 4E 5D D3 5C D8 9E 9F 52 82 E0 59 8A DE 15
       data hash MD5: 64K
       29 B7 C2 6F 14 20 9C 60 2B B1 C0 25 50 DC E3 3D>)
(   2,<2014-04-11 18:05:24.169 -0700>,<Administrator>,<X>,<proc1d>,<TOPSPIN 2.1>,
      <Start of raw data processing
       efp LB = 0.3 FT_mod = 6 PKNL = 1 PHC0 = 0 PHC1 = 0 SI = 128K 
       data hash MD5: 128K
       52 1C 3E 14 E1 AC 9D 69 7E 76 EF 8B A7 6E FE 1C>)
(   3,<2014-04-11 18:05:25.265 -0700>,<Administrator>,<X>,<proc1d>,<TOPSPIN 2.1>,
      <pk PHC0 = -85.45166 PHC1 = 0 
       data hash MD5: 128K
       10 AB 50 FA 2C 40 7C 32 32 07 C2 DF 58 4C EA F7>)
(   4,<2014-04-11 18:05:25.750 -0700>,<Administrator>,<X>,<proc1d>,<TOPSPIN 2.1>,
      <abs ABSG = 1 
       data hash MD5: 128K
       87 05 12 6C 31 C7 18 5D 82 D1 ED D1 22 AD 3A 6E>)
(   5,<2014-04-11 18:05:25.858 -0700>,<Administrator>,<X>,<proc1d>,<TOPSPIN 2.1>,
      <abs ABSG = 2 
       data hash MD5: 128K
       F0 F2 CF B5 64 C8 73 84 AB 4D E8 EA 49 CF 85 4E>)
(   6,<2014-04-11 18:05:25.966 -0700>,<Administrator>,<X>,<proc1d>,<TOPSPIN 2.1>,
      <abs ABSG = 3 
       data hash MD5: 128K
       70 9E 53 06 69 B6 6F F9 63 8C 5F 20 99 E5 80 4E>)
(   7,<2014-04-11 18:05:26.073 -0700>,<Administrator>,<X>,<proc1d>,<TOPSPIN 2.1>,
      <abs ABSG = 4 
       data hash MD5: 128K
       6C 12 1A EA F8 6C 73 66 D3 AF 3C D0 A5 DC 4B C1>)
(   8,<2014-04-11 18:05:26.181 -0700>,<Administrator>,<X>,<proc1d>,<TOPSPIN 2.1>,
      <abs ABSG = 5 
       data hash MD5: 128K
       F3 77 D8 97 F2 B8 0C CD BA AF 3A F5 93 91 86 01>)
$$ ##END=
$$ 
$$ $$ hash MD5
$$ $$ BD 4D 74 A0 DF 14 FA B5 F8 07 97 D5 8D EF 1A 00
##$RELAX= 
##$RELAX= 
##$RELAX= 
##$RELAX= 
##$RELAX= 
##$RELAX= 
##$RELAX= 
##$RELAX= 
$$ Bruker specific parameters
$$ --------------------------
##$DU= <E:\>
##$EXPNO= 12
$$ [...]
##$TP07= 0
##$TPNAME0= <>
##$TPNAME1= <>
##$TPNAME2= <>
##$TPNAME3= <>
##$TPNAME4= <>
##$TPNAME5= <>
##$TPNAME6= <>
##$TPNAME7= <>
##$TPOAL= (0..7)
0.5 0.5 0.5 0.5 0.5 0.5 0.5 0.5
##$TPOFFS= (0..7)
0 0 0 0 0 0 0 0
##$TUNHIN= 0
##$TUNHOUT= 0
##$TUNXOUT= 0
##$USERA1= <user>
##$USERA2= <user>
##$USERA3= <user>
##$USERA4= <user>
##$USERA5= <user>
##$V9= 5
##$VALIST= <valist>
##$VCLIST= <CCCCCCCCCCCCCCC>
##$VD= 0
##$VDLIST= <DDDDDDDDDDDDDDD>
##$VPLIST= <PPPPPPPPPPPPPPP>
##$VTLIST= <TTTTTTTTTTTTTTT>
##$WBST= 1024
##$WBSW= 4
##$XGAIN= (0..3)
0 0 0 0
##$XL= 0
##$YL= 0
##$YMAX_a= 5629867
##$YMIN_a= -11793703
##$ZGOPTNS= <>
##$ZL1= 120
##$ZL2= 120
##$ZL3= 120
##$ZL4= 120
##$ABSF1= 14.96108
##$ABSF2= -5.597102
##$ABSG= 5
##$ABSL= 3
##$ALPHA= 0
##$AQORDER= 0
##$ASSFAC= 0
##$ASSFACI= 0
##$ASSFACX= 0
##$ASSWID= 0
##$AUNMP= <proc_prof1d_extract.lims>
##$AXLEFT= 0
##$AXNAME= <>
##$AXNUC= <1H>
##$AXRIGHT= 0
##$AXTYPE= 0
##$AXUNIT= <>
##$AZFE= 0.1
##$AZFW= 0.1
##$BCFW= 0
##$BC_mod= 0
##$BYTORDP= 0
##$COROFFS= 0
##$CY= 15
##$DATMOD= 1
##$DC= 0
##$DFILT= <>
##$DTYPP= 0
##$F1P= 0
##$F2P= 0
##$FCOR= 0.5
##$FTSIZE= 131072
##$FT_mod= 6
##$GAMMA= 0
##$GB= 0
##$INTBC= 1
##$INTSCL= 1
##$ISEN= 128
##$LB= 0.3
##$LEV0= 0
##$LPBIN= 0
##$MAXI= 10000
##$MC2= 0
##$MEAN= 0
##$ME_mod= 0
##$MI= 0
##$NCOEF= 0
##$NC_proc= -2
##$NLEV= 6
##$NOISF1= 0
##$NOISF2= 0
##$NSP= 0
##$NTH_PI= 0
##$NZP= 0
##$OFFSET= 14.96108
##$PC= 1
##$PHC0= -85.45166
##$PHC1= 0
##$PH_mod= 1
##$PKNL= yes
##$PPARMOD= 0
##$PPDIAG= 0
##$PPIPTYP= 0
##$PPMPNUM= 2147483647
##$PPRESOL= 1
##$PSCAL= 4
##$PSIGN= 0
##$PYNMP= <proc.py>
##$REVERSE= no
##$SF= 400.020009606343
##$SI= 131072
##$SIGF1= 0
##$SIGF2= 0
##$SINO= 400
##$SIOLD= 131072
##$SPECTYP= <>
##$SREGLST= <1H.CDCl3>
##$SSB= 0
##$STSI= 131072
##$STSR= 0
##$SW_p= 8223.68421052631
##$SYMM= 0
##$S_DEV= 0
##$TDeff= 65536
##$TDoff= 0
##$TI= <>
##$TILT= no
##$TM1= 0
##$TM2= 0
##$TOPLEV= 0
##$USERP1= <user>
##$USERP2= <user>
##$USERP3= <user>
##$USERP4= <user>
##$USERP5= <user>
##$WDW= 1
##$XDIM= 131072
##$YMAX_p= 368189936
##$YMIN_p= -12451
##$CURPLOT= <Network HP LaserJet P1505>
##$CURPRIN= <$Network HP LaserJet P1505>
##$DFORMAT= <normdp>
##$LAYOUT= <+/1D_H.xwp>
##$LFORMAT= <normlp>
##$PFORMAT= <normpl>
##$SURQMSG= 1
$$ End of Bruker specific parameters
$$ ---------------------------------
##NTUPLES= NMR SPECTRUM
##VAR_NAME=  FREQUENCY,     SPECTRUM/REAL,   SPECTRUM/IMAG
##SYMBOL=    X,             R,               I
##VAR_TYPE=  INDEPENDENT,   DEPENDENT,       DEPENDENT
##VAR_FORM=  AFFN,          ASDF,            ASDF
##VAR_DIM=   131072,        131072,          131072
##UNITS=     HZ,            ARBITRARY UNITS, ARBITRARY UNITS
##FACTOR=    0.0627417313425164, 1,          1
##FIRST=     8223.62146879497, 2455,         -50272
##LAST=      0,             2787,            -50365
##MIN=       0,             -12451,          0
##MAX=       8223.62146879497, 368189936,    0
$$ Real data points
##PAGE= N=1
##DATA TABLE= (X++(R..R)), XYDATA
$$ [...]
63862E32706J4160J6188J8312K0714K3209K5421K7557L0263L3574L6739L9332
63851H18175M1724M4060M5621M5927M5765M6261M7287M7567M6225M3473L9920
63840A312005L5910L1576K6896K1564J5263Q225J127n654j2221j8584k4364k9372
63828A362371l3987l8522m2594m5510m7180m8135m8731m8805m8206m7203m6019
63817H67479m4343m1756l8607l5869l4022l2425l0136k7072k4021k1651j9927
63806E17650j8462j7006j5403j3449j1092q656o585n081m072l478l233l222l383
63793D04528l896m999o518p817q374q296q157q293q446q082p032n698m699m275
63779C09946m057l449k332j332j231k066l022l351l151k986k944k535j607p76
$$ plain form
63862 532706 546866 563054 581366 602080 625289 650710 678267 708530 742104 778843 818175
63851 818175 859899 903959 949580 995507 1041272 1087533 1134820 1182387 1228612 1272085 1312005
63840 1312005 1347915 1379491 1406387 1427951 1443214 1451439 1452566 1446912 1434691 1416107 1391743 1362371
63828 1362371 1328384 1289862 1247268 1201758 1154578 1106443 1057712 1008907 960701 913498 867479
63817 867479 823136 781380 742773 706904 672882 640457 610321 583249 559228 537577 517650
63806 517650 499188 482182 466779 453330 442238 433582 426997 421916 417844 414366 411133 407911 404528
63793 404528 400632 395633 389115 381298 372924 364628 356471 348178 339732 331650 324618 318920 314221 309946
63779 309946 305889 302440 300108 298776 297545 295479 292457 289106 285955 282969 280025 277490 275883 275107
63765B75107p22j283j722j604j159q10p68j044j540j947j890j326o34j92L8L29
63749B58833P48J096J273J402J496J268O09N5L27J278J879J595J221J708K611
63734B77399K636J672J132J895K974K965K035J529K056L068M086N256O594P567
63720C22864P765P289O346N059L898L519L807L685K381L99j246k235k921l474
63706C57136l728l737l758l744l369k641k015j725j423p21J81P55Q69R47J382
63691C34409J998K246J767O85n63j444j570j010m36n34j084j059O1J481K071J788
63675C38806J553J907K584L296M106M802M817M220M031M921O120O343N408M132
63661C97046K919J332p97k735l706l888m047m503m911m956m822m838n001m993
$$ plain form
63765 275107 274385 273102 271380 269776 268617 267807 267039 265995 264455 262508 260618 259292 258658 258466 258504 258833
63749 258833 259581 260677 261950 263352 264848 266116 266725 266780 267107 268385 270264 271859 273080 274788 277399
63734 277399 280035 281707 282839 284734 287708 290673 292708 294237 296293 299361 303447 308703 315297 322864
63720 322864 330629 337918 344264 349323 353221 356740 360547 364232 366613 367012 365766 363531 360610 357136
63706 357136 353408 349671 345913 342169 338800 336159 334144 332419 330996 330275 330456 331211 332080 333027 334409
63691 334409 336407 338653 340420 341105 340542 339098 337528 336518 336082 335548 334464 333405 333466 334947 337018 338806
63675 338806 340359 342266 344850 348146 352252 357054 361871 366091 370122 375043 381163 387506 392914 397046
63661 397046 399965 401297 400500 397765 394059 390171 386124 381621 376710 371754 366932 362094 357093 352100
63647C52100m589l821k779j532k89O14J100J497K071K581K701K667L064L892M385
63632C63662M039L331L156L763M590M976M826M642N030O077P248Q028Q579R363
63618D41310J0346J1153J2043J3826J6542J9041K0492K1605K3586K6366K8776
63607F45086L0043L0304K9744K8245K5831K2689J8752J3929Q861M571J339j365
63595H58029l702n114n487n713o621q016r347j0757j2765j5329j7779j9479k0100
63582G17820j9613j8463j7419j6784j6028j4605j2712j0767q629o047l507j764
63570E71482p19M38J927L144L737M097M551M797M551M096L787L613L641M343N926
63555F23411P796R309J0741J2905J6057J9776K3810K8338L3322L8107M1764M3388
$$ plain form
63647 352100 347511 343690 340911 339379 339090 339704 340804 342301 344372 346953 349654 352321 355385 359277 363662
63632 363662 367701 371032 374188 377951 382541 387517 392343 396985 402015 408092 415340 423368 431947 441310
63618 441310 451656 462809 474852 488678 505220 524261 544753 566358 589944 616310 645086
63607 645086 675129 705433 735177 763422 789253 811942 830694 844623 853484 858055 859394 858029
63595 858029 854327 849213 843726 838013 831392 823376 814029 803272 790507 775178 757399 737920 717820
63582 717820 698207 679744 662325 645541 629513 614908 602196 591429 582800 576753 573246 571482
63570 571482 570763 571201 573128 576272 580009 584106 588657 593454 598005 602101 605888 609501 613142 617485 623411
63555 623411 631207 640516 651257 664162 680219 699995 723805 752143 785465 823572 865336 908724
63543I08724M2104L7335K9485K0041J0738K682l719q320j1076j2173j2083j1388
63531I92350j0541r756r171r204j0509j3345j7020k0324k2551k3914k5018k6187
63519G94810k7314k7931k7422k5565k2993k0718j9073j7544j5758j4105j3047
63508E63340j2295j1244r817q426p282o342n681n459n523n554n544n653n728n437
63494D63355m855m362l982l428k752k374k269j832q22J91P40J250K346L712M338
63479D49256L884L171L158L859M484M495M159L973L842L166J766K19r27j915l213
63464D83377m549n159m930m542m427m253l688k972k398j840j192p70q04r82q56
63449D40015l06P27K368M213N204M890M342N006P003R311J1374J3626J6522K0021
$$ plain form
63543 908724 950828 988163 1017648 1037689 1048427 1051109 1047390 1039070 1027994 1015821 1003738 992350
63531 992350 981809 972053 962882 953678 943169 929824 912804 892480 869929 846015 820997 794810
63519 794810 767496 739565 712143 686578 663585 642867 623794 606250 590492 576387 563340
63508 563340 551045 539801 529984 521558 514276 507934 502253 496794 491271 485717 480173 474520 468792 463355
63494 463355 458500 454138 450156 446728 443976 441602 439333 437501 436679 436870 437610 438860 441206 444918 449256
63479 449256 453140 456311 459469 463328 467812 472307 476466 480439 484281 487447 489213 489432 488505 486590 483377
63464 483377 478828 473669 468739 464197 459770 455517 451829 448857 446459 444619 443427 442657 441853 440871 440015
63449 440015 439709 440436 442804 447017 452221 457111 461453 466459 473462 482773 494147 507773 524295 544316
63435E44316K4079K8754L3443L6617L6823L3668K7920K1008J4522R535O126L819
63423H20630K452K270L290N215Q018J1922J6650K1303K5099K7658K8451K6798
63411I99756K2846J7800J2718P624K403k184n114o442p159q010r122j0628j2765
63398A001723j5299j7562j9372k1358k4016k6836k8742k9192k8534k7360k5876
63387G37576k4060k2115k0482j9241j7779j5408j2255r284p289o115m981l321
63375E75246j170J047K896M268N441O736Q123R369J0554J1980J3586J4964J6209
63362F79249J8055K0771K3489K5342K6804K8980L1852L4110L4804L4165L2567
63351I90188K9611K4954J9311J3861Q948M180l38l776n790p198q973j1059j2757
$$ plain form
63435 544316 568395 597149 630592 667209 704032 737700 765620 786628 801150 810685 816811 820630
63423 820630 823082 825352 828642 833857 841875 853797 870447 891750 916849 944507 972958 999756
63411 999756 1022602 1040402 1053120 1060744 1063147 1060963 1055849 1049407 1042248 1034238 1025116 1014488 1001723
63398 1001723 986424 968862 949490 928132 904116 877280 848538 819346 790812 763452 737576
63387 737576 713516 691401 670919 651678 633899 618491 606236 596952 589663 583548 578567 575246
63375 575246 574076 575123 578019 582287 587728 594464 602587 611956 622510 634490 648076 663040 679249
63362 679249 697304 718075 741564 766906 793710 822690 854542 888652 923456 957621 990188
63351 990188 1019799 1044753 1064064 1077925 1086873 1091053 1090715 1086939 1081149 1073951 1064978 1053919 1041162
63338A041162j4007j5499j7494j9423k0958k2719k5212k7624k8607k8050k7061
63327G94508k6136k4513k1699j8487j5654j2538q070k768J376K876J695j586o319
63314F62685j1361j5249j7352j8216j8462j8084j7161j6329j5899j5158j3403
63303D86011j1159r608r019q625p871o988o321n802n307m974m877m831m712m645
63289C91272m645m405l708k845k318k270k430k541k588k614k504k154j672j251
63275C53327q76m05J4l5n92r39m31M83O80q4p58m69K52L22l52r14q60m64k7M30
63255C48302O97M19j67k93K42P32P09O77J171J713J474N56j43j39K74P30J064
63238C58018J009L92k33N8J260K184J904R48N57J121J894K116J831J629J956K736
$$ plain form
63338 1041162 1027155 1011656 994162 974739 953781 931062 905850 878226 849619 821569 794508
63327 794508 768372 743859 722160 703673 688019 675481 667411 664643 666019 668895 670590 669004 662685
63314 662685 651324 636075 618723 600507 582045 563961 546800 530471 514572 499414 486011
63303 486011 474852 465244 456225 447600 439729 432741 426420 420618 415311 410337 405460 400629 395917 391272
63289 391272 386627 382222 378514 375669 373351 371081 368651 366110 363522 360908 358404 356250 354578 353327
63275 353327 352451 352046 352060 352025 351433 350494 350063 350546 351226 351142 350384 349915 350167 350489 350137 349223 348363 347899 347872 348302
63255 348302 348999 349418 349251 348958 349200 349932 350641 351318 352489 354202 355676 356232 356089 355950 356224 356954 358018
63238 358018 359027 359419 359186 359244 360504 362688 364592 365540 366097 367218 369112 371228 373059 374688 376644 379380
63222C79380L517L848L610L064K568K401K743L555M364M514L888L136K957L279
63208D26824L458L116K484K029K057K534L002K793J704M29j34N3K19k9j39N16
63192D50916J656K454K637K766L511M995O845Q574R876J0751J1476J2343J3405
63179E42205J4510J5455J6020J5934J5137J4026J3230J3035J3129J3012J2527
63168F98220J1915J1425J1006J0345R136P344N212L066J040j061l584o678j0063
63155G47323j3161j5482j6889j7552j7751j7809j7973j8197j8073j7254j5924
63144E61258j4603j3464j2117j0248q162o443n233m139k802j316r2N31N09J22
63130D83801j74q0L58R25J528K189K839L317L644M056M667N195N198M579L818
$$ plain form
63222 379380 382897 386745 390355 393419 395987 398388 401131 404686 409050 413564 417452 420588 423545 426824
63208 426824 430282 433398 435882 437911 439968 442502 445504 448297 450001 450430 450296 450349 450568 450539 450400 450916
63192 450916 452572 455026 457663 460429 463940 468935 475780 484354 494230 504981 516457 528800 542205
63179 542205 556715 572170 588190 604124 619261 633287 646517 659552 672681 685693 698220
63168 698220 710135 721560 732566 742911 752047 759391 764603 767669 768709 767648 764064 757386 747323
63155 747323 734162 718680 701791 684239 666488 648679 630706 612509 594436 577182 561258
63144 561258 546655 533191 521074 510826 502664 496221 490988 486849 484047 482731 482639 483170 483679 483801
63130 483801 483627 483547 483905 484830 486358 488547 491386 494703 498347 502403 507070 512265 517463 522042 525860
63115E25860L599M143N003N554N563N156M445L521K807K864L640M311M207L562
63101E84235L030K834K814L064L873N159O484P655Q771R726J0156R981R525Q994
63087F76301Q310P468O589N523L926J897m6j726l486n366o793p442p753q193q562
63072F60647q602q700r297j0030j0171r610q716p557o017m477l573l323l160k729
63058E64685j989p32J170L117M247M656N282O508P758Q627R410J0191J0444J0103
63044F43477J0079J0952J1913J1897J1160J0787J1124J1656J2174J2941J3724
63033G71884J3701J2622J1284J0458R874Q702O638M203K119O22o91k382m562o765
63019H37707q545r915j0995j1571j1441j0982j0755j0650r964q412o484m663k759
$$ plain form
63115 525860 529459 533602 538605 544159 549722 554878 559323 562844 565651 568515 572155 576466 580673 584235
63101 584235 587265 590099 592913 595977 599850 605009 611493 619148 627919 637645 647801 657782 667307 676301
63087 676301 684611 692079 698668 704191 708117 710014 709968 708242 704756 699390 692597 685155 677402 669209 660647
63072 660647 652045 643345 634048 624018 613847 604237 595521 587964 581947 577470 573897 570574 567414 564685
63058 564685 562696 561964 563134 566251 570498 575154 580436 586944 594702 603329 612739 622930 633374 643477
63044 643477 653556 664508 676421 688318 699478 710265 721389 733045 745219 758160 771884
63033 771884 785585 798207 809491 819949 829823 838525 845163 849366 851485 852107 851416 849034 844472 837707
63019 837707 829162 819247 808252 796681 785240 774258 763503 752853 742889 734477 727993 723330 720571
63006G20571l13K688N794Q549J0763J2561J4244J5996J7678J9102K0387K1688
62994H69708K2681K2855K2380K2070K2278K2499K2299K2107K2480K3103K3154
62983A117614K2430K1425K0325J8587J5643J1575O925K166k473o990j1531j6218
62971A199478k0855k4958k8179l0530l2172l3137l3380l2974l2115l1009k9800
62960H70369k8499k6980k5135k3175k1624k0867k0705k0551k0017j9126j7976
62949F25714j6498j4753j3235j2477j2352j2165j1464j0445r458q550p721p221
62937D89375p147p121o833o584o642o384m956k759j277j232j711j634j192j151
62923D32752j465j492j215j261j764k101j858j389j160j084p91j94M60Q80Q75
$$ plain form
63006 720571 720258 722946 728740 737289 748052 760613 774857 790853 808531 827633 848020 869708
62994 869708 892389 915244 937624 959694 981972 1004471 1026770 1048877 1071357 1094460 1117614
62983 1117614 1140044 1161469 1181794 1200381 1216024 1227599 1234524 1236690 1234217 1227227 1215696 1199478
62971 1199478 1178623 1153665 1125486 1094956 1062784 1029647 996267 963293 931178 900169 870369
62960 870369 841870 814890 789755 766580 744956 724089 703384 682833 662816 643690 625714
62949 625714 609216 594463 581228 568751 556399 544234 532770 522325 512867 504317 496596 489375
62937 489375 482228 475107 468274 461690 455048 448664 443708 440949 439672 438440 436729 435095 433903 432752
62923 432752 431287 429795 428580 427319 425555 423454 421596 420207 419047 417963 417172 416978 417438 418318 419193
62908D19193M53j01l16J38J192K323K788K260J366J228K202L444M095M352M786
62893D49403N166M943M581N186O724P781P514O719O368O157N378M357L906L776
62879E27959K858Q41j352k832l593l988m168m316m801n766o916p883q463q462
62865D69118p801o934o553o712o707o127n441n167m998m297l107k098j662j600
62851C99914j579j440j110o97o08j123j800j764p39N53J190R36K21m10o56n17
62835C90371k73k57m82n72k02N52J356J931K175K103J884J659J352Q29L54M25
62819D03205J005J309P77j14m84j81K52N51R08J256J101L66l25n04n00p56j048
62802D06818q52k12L84P19R59J088Q55L08j11j37j2k9m6L53J289K374L043L148
$$ plain form
62908 419193 419646 419545 419229 419367 420559 422882 425670 427930 429296 430524 432726 436170 440265 444617 449403
62893 449403 454569 459512 464093 469279 476003 483784 491298 498017 504385 510542 515920 520277 524183 527959
62879 527959 530817 531658 530306 527474 523881 519893 515725 511409 506608 500842 493926 486043 477580 469118
62865 469118 461317 454383 447830 441118 434411 428284 422843 417676 412678 408381 405274 403176 401514 399914
62851 399914 398335 396895 395785 395088 394480 393357 391557 389793 389054 389607 390797 391733 391954 391544 390888 390371
62835 390371 390098 389841 389359 388787 388585 389137 390493 392424 394599 396702 398586 400245 401597 402426 402780 403205
62819 403205 404210 405519 406296 406182 405698 405517 405769 406320 407228 408484 409585 409951 409626 409122 408622 407866 406818
62802 406818 405966 405754 406138 406857 407816 408904 409759 410067 409956 409819 409807 409778 409732 410085 411374 413748 416791 419939
62784D19939L181L808N100O452P397Q163R094R848R725Q733P699P260P261P396
62770E21056P809Q564R042Q507P210O234O147O284N622L970J947M6j780l667n467
62755E81524p035q446r651j0217r929r410r524j0152j0255r433q683r035r963
62742D59791r979q565o687n371m579l816l089k714k557k065j051pM25J47l63o33
62726D08887o81q37j102j020l09O51J327J765K384L235M032M782N727O667P094
62711D42602P171P776R284J1006J2240J3184J4216J5055J5347J5615J6679J8467
62699E98642K0321K2221K4747K7836L0613L2685L4753L7470M0379M2449M3237
62688I55353M3044M2217M0733L8313L4634K9529K3229J6232Q880J230o529j3910
$$ plain form
62784 419939 423120 426928 432028 438480 445877 454040 463134 472982 482707 491440 499139 506399 513660 521056
62770 521056 528865 537429 546471 554978 562188 568422 574569 580853 586475 590445 592392 592438 590658 586991 581524
62755 581524 574489 566043 556392 546175 536246 526836 517312 507160 496905 487472 478789 469754 459791
62742 459791 449812 441247 434560 429189 424610 420794 417705 414991 412434 410369 409318 409311 409736 409883 409520 408887
62726 408887 408206 407369 406267 405247 404938 405589 406916 408681 411065 414300 418332 423114 428841 435508 442602
62711 442602 449773 457549 466833 477839 490079 503263 517479 532534 547881 563496 580175 598642
62699 598642 618963 641184 665931 693767 724380 757065 791818 829288 869667 912116 955353
62688 955353 998397 1040614 1081347 1119660 1154294 1183823 1207052 1223284 1232164 1233394 1226865 1212955
62676A212955k0545k6456l1657l5774l8457m0015m1157m2099m2303m1189l8947
62665H14356l6399l4181l2265l0316k8296k6440k4654k2389j9405j6413j4438
62654E29160j3589j2920j1604r805q305p574p470p502p153o265n312m956n109
62641D21596m871l743k406j723j403m91R85J822J267k3j036j621k134k471k292
62626D01456j801j548j542j294p35m00n50p85p57p14r84j389j569j516j390j113
62610C83369n76kK90K98J74o8l33k90J26L82J07k10L2M14R5o01l49J223K900L652
62590C90633L920M512N190N347N268N573N916N405M100K924K210J402K87n66q57
62575D41264j092j680k264k454k557l078l945m621m727m313l848l976m783n308
$$ plain form
62676 1212955 1192410 1165954 1134297 1098523 1060066 1020051 978894 936795 894492 853303 814356
62665 814356 777957 743776 711511 681195 652899 626459 601805 579416 560011 543598 529160
62654 529160 515571 502651 491047 481242 472937 465363 457893 450391 443238 436973 431661 426705 421596
62641 421596 416725 412982 410576 408853 407450 406959 407944 409766 411033 411010 409974 408353 406219 403748 401456
62626 401456 399655 398107 396565 395271 394536 394136 393586 392801 392044 391330 390346 388957 387388 385872 384482 383369
62610 383369 382793 382791 383081 383379 383553 383485 383152 382862 382988 383370 383477 383267 383299 383713 383808 383207 382858 384081 386981 390633
62590 390633 394553 399065 404255 409602 414870 420443 426359 431764 435864 438788 440998 442400 442687 442121 441264
62575 441264 440172 438492 436228 433774 431217 428139 424194 419573 414846 410533 406685 402709 397926 392618
62561C92618m508k784j671j798k094j578q06p68j232j292r50r22j207j114n90
62546C69304l53n98o50r8P14J519K504L461L608K784K016K147K648K474J610Q81
62530C93971O98Q49J288K207L305L873L748L616M146N290O622P868Q905R738J0721
62515D66845J2366J4567J6497J7626J8516K0088K2304K4210K5238K5863K6743
62504F90863K7689K7924K7113K5642K3846K1447J8037J3932J0104P255N172L233
62492I02257J373K47M23J676L223M514N632O993Q848J0968J2713J3404J2762J1080
62478I96113Q877O461L837Q92k548o751j1859j7508k2868k7183l0231l2257l3657
62465H31318l4745l5569l5877l5420l4271l2619l0276k6895k2877j9444j7350
$$ plain form
62561 392618 388110 385326 383655 381857 379763 378185 377379 376611 375379 374087 373137 372215 371008 369894 369304
62546 369304 368951 368353 367703 367605 368319 369838 372342 375803 379411 382195 384211 386358 389006 391480 393090 393971
62530 393971 394669 395518 396806 399013 402318 406191 409939 413555 417701 422991 429613 437481 446386 456124 466845
62515 466845 479211 493778 510275 527901 546417 566505 588809 613019 638257 664120 690863
62504 690863 718552 746476 773589 799231 823077 844524 862561 876493 886597 893852 899024 902257
62492 902257 903630 903877 904300 905976 909199 913713 919345 926338 935186 946154 958867 972271 985033 996113
62478 996113 1004990 1011451 1015288 1016180 1013632 1006881 995022 977514 954646 927463 897232 864975 831318
62465 831318 796573 761004 725127 689707 655436 622817 592541 565646 542769 523325 505975
62454E05975j5924j4037j1695r870q943q138o762n158m088l693l547l280k712
62441D08128j841r68n41m14J86J507K612K495J446M85j43r51j886k174j698j408
62425D04835j884k374j901o88K10K50l00r91j481j412p01Q5J94m60j292j718j529
62408C88843p95O8L18m09j400j515n43N85J118J346J899K738L239L088K665K635
62392D03880L290M265M831M686M374M679N642O552O937P026P192P466P821Q417
62378D87058R124R353Q796P982P652P895Q362Q983R893J0903J1686J2335J3234
62365F13256J4481J6006J8076K1061K4784K8763L3036L8007M3341M7861N0851
62354I49523N2755N4198N4886N4015N1257M6790M0782L3424K5324J7304R818K933
$$ plain form
62454 505975 490051 476014 464319 454449 445506 437368 430606 425448 421360 417667 414120 410840 408128
62441 408128 406287 405319 404778 404364 404550 406057 408669 411164 412610 413095 412952 412001 410115 407941 406243 404835
62425 404835 402951 400577 398676 397988 398198 398448 398148 397157 395676 394264 393563 393648 393842 393382 392090 390372 388843
62408 388843 388048 388116 388434 388025 386625 385110 384567 385152 386270 387616 389515 392253 395492 398580 401245 403880
62392 403880 407170 411435 416266 420952 425326 430005 435647 442199 449136 456162 463354 470820 478641 487058
62378 487058 496182 505535 514331 522313 529965 537860 546222 555205 565098 576001 587687 600022 613256
62365 613256 627737 643743 661819 682880 707664 736427 769463 807470 850811 898672 949523
62354 949523 1002278 1056476 1111362 1165377 1216634 1263424 1304206 1337630 1362954 1380258 1390076 1393009
62342A393009l321q950j4268j9636k4941k9612l3192l5640l7109l7715l7546l6733
62330A074346l5471l4049l2789l1787l0835k9759k8730k7987k7350k6274k4468
62319G44847k2310k0579j9756j9515j8929j7404j5373j3796j2956j2212j1054
62308E60963r855r100q403o971m841k925j851j348r07m76k50j27K91J215K314
62293E17729K896K630K077K169K923L202K212Q42O56J837L024L205K748K356K004
62278E52510J475J172J518K092K205K023K331L328M410N188O026P387R233J1374
62264F12272J3940J7122K0675K4136K7458L1075L5258L9731M4086M8312N2477
62253I66542N5949N7488N6378N3110M8506M2545L4708K5370J6064Q080J395m818
$$ plain form
62342 1393009 1389688 1380738 1366470 1346834 1321893 1292281 1259089 1223449 1186340 1148625 1111079 1074346
62330 1074346 1038875 1004826 972037 940250 909415 879656 850926 822939 795589 769315 744847
62319 744847 722537 701958 682202 662687 643758 626354 610981 597185 584229 572017 560963
62308 560963 551108 542008 533605 526634 521793 518868 517017 515669 514762 514286 514036 513909 514200 515415 517729
62293 517729 520625 523255 525332 527501 530424 533626 535838 536680 537336 539173 542197 545402 548150 550506 552510
62278 552510 553985 555157 556675 558767 560972 562995 565326 568654 573064 578252 584278 591665 600898 612272
62264 612272 626212 643334 664009 688145 715603 746678 781936 821667 865753 914065 966542
62253 966542 1022491 1079979 1136357 1189467 1237973 1280518 1315226 1340596 1356660 1364740 1366135 1361317
62241A361317j1182j7929k5103l2346l8807m3786m7257m9401n0019m8935m6642
62230I49910m3889m0801l7119l3171k9825k7387k5262k2936k0657j8796j7125
62219F32942j5222j3156j1344r960q949q351q153p937p182n904m654l844l405
62206E24881l132k939k676k042r51K19J033J543K185L125M000M368M312M449N346
62191E43721O926Q471R294R429R603J0366J1438J2096J2125J1996J2081J2054
62179F69600J1387J0061Q509P079N952N383N592O389P382Q648J0814J4339J9014
62166G90149K4230K9384L3850L7017L8691L9209L8796L7011L3218K7520K0910
62155A149985J4490Q822L890n83m960r572j4551j9753k4765k9023l2090l3936
$$ plain form
62241 1361317 1350135 1332206 1307103 1274757 1235950 1192164 1144907 1095506 1045487 996552 949910
62230 949910 906021 865220 828101 794930 765105 737718 712456 689520 668863 650067 632942
62219 632942 617720 604564 593220 583260 574311 565960 557807 549870 542688 536784 532130 528286 524881
62206 524881 521749 518810 516134 514092 513141 513360 514393 515936 518121 521246 525246 529614 533926 538375 543721
62191 543721 550647 559118 568412 577841 587444 597810 609248 621344 633469 645465 657546 669600
62179 669600 680987 691048 699557 706636 712588 717971 723563 729952 737334 745982 756796 771135 790149
62166 790149 814379 843763 877613 914630 953321 992530 1031326 1068337 1101555 1129075 1149985
62155 1149985 1164475 1173297 1177187 1176604 1171644 1162072 1147521 1127768 1103003 1073980 1041890 1007954
62143A007954l4876l5153l4663l3228l0978k8316k5583k2928k0411j8107j6114
62132G07597j4522j3216j1783r860p683n957m991m273l216k043j413j364j144
62119F26132j78J278K612L655M717O072P722R574J1636J3952J6467J9048K1555
62106G44242K3732K5039K4798K2774J9572J6248J3607J2060J2017J3718J6471
62095I44278J8578J8576J6344J2782Q688M427M32k630m348m890m707m104l057
62082A000369j336J090L671N645O983Q636J1356J4633J7333J9155K0764K2561
62070A130860K4063K4667K4430K3952K3925K4854K6666K8373K8694K7240K4705
62059A412429K1748J8253J3962R218M623L29l851p877j1481j4562j7299k0013
$$ plain form
62143 1007954 973078 937925 903262 870034 839056 810740 785157 762229 741818 723711 707597
62132 707597 693075 679859 668076 658216 650533 644576 639585 635312 632096 630053 628640 627276 626132
62119 626132 625954 627232 629844 633499 638216 644288 652010 661584 673220 687172 703639 722687 744242
62106 744242 767974 793013 817811 840585 860157 876405 890012 902072 914089 927807 944278
62095 944278 962856 981432 997776 1010558 1019246 1023673 1024105 1021475 1017127 1012237 1007530 1003426 1000369
62082 1000369 999033 1000123 1003794 1009439 1016422 1025058 1036414 1051047 1068380 1087535 1108299 1130860
62070 1130860 1154923 1179590 1204020 1227972 1251897 1276751 1303417 1331790 1360484 1387724 1412429
62059 1412429 1434177 1452430 1466392 1475610 1480233 1480562 1476711 1468834 1457353 1442791 1425492 1405479
62047A405479k3006k6317k9442l1674l2935l3907l5038l5835l5592l4447l3202
62036A054084l2344l1671l0778k9467k7781k6010k4507k3195k1427j8813j5896
62025G72195j3604j2157j1099j0253r991j0447j1099j1339j1031j0299r216p984
62013F43676p062o745o733o400n420m003k606j525o48M34J942L540M591M904M974
61998F22919N395O133O520N937M424K661J325M32n84k145m054n833p287q399r017
61983F18427r043q821q845r113r217r027q694q034o616m780l732m144n170n455
61969E17736m746l846l332l049k792k675k677k440j762q91j30M82R72J266J397
61954D93513J569J879K228K691L541M747N779O306O728P769R608J1844J4069J6165
$$ plain form
62047 1405479 1382473 1356156 1326714 1295040 1262105 1228198 1193160 1157325 1121733 1087286 1054084
62036 1054084 1021740 990069 959291 929824 902043 876033 851526 828331 806904 788091 772195
62025 772195 758591 746434 735335 725082 715091 704644 693545 682206 671175 660876 651660 643676
62013 643676 636614 629869 623136 616736 611316 607313 604707 603182 602534 602968 604910 608450 613041 617945 622919
61998 622919 628314 634447 640967 646904 651328 653989 655314 655746 655162 653017 648963 643130 635843 627444 618427
61983 618427 609384 600563 591718 582605 573388 564361 555667 547633 541017 536237 532505 528361 523191 517736
61969 517736 512990 509144 505812 502763 499971 497296 494619 492179 490417 489526 489396 489878 490850 492116 493513
61954 493513 495082 496961 499189 501880 505421 510168 515947 522253 528981 536750 546358 558202 572271 588436
61940E88436J8122J9938K1693K3373K4614K4972K4507K3818K3369K3054K2561
61929H38457K1850K0977J9705J7664J4858J1687Q372M692N19l608o799q680r627
61916I30067j0077r984r105p497n319k365J656O364J0756J4191J6920J9333K1114
61903I76054K1542K0425J8175J5080J0983N880M14m490q362j1461j4334j7184
61891A012722j9631k1089k1422k1141k0870k0733k0391j9611j8606j7845j7623
61880G93760j7797j7859j7401j6530j5708j5115j4435j3340j1859j0101q085o100
61868F29430m783m318l934k779r75P78K298L920N646P242R083J1857J5358J8582
61854F87405K1168K3836K7020L0155L2782L5365L8303M0972M2559M3114M2957
$$ plain form
61940 588436 606558 626496 648189 671562 696176 721148 745655 769473 792842 815896 838457
61929 838457 860307 881284 900989 918653 933511 945198 953570 958262 958781 955173 948374 939694 930067
61916 930067 919990 910006 900901 893404 888085 885720 887376 893740 904496 918687 935607 954940 976054
61903 976054 997596 1018021 1036196 1051276 1062259 1068139 1068553 1064063 1055701 1044240 1029906 1012722
61891 1012722 993091 972002 950580 929439 908569 887836 867445 847834 829228 811383 793760
61880 793760 775963 758104 740703 724173 708465 693350 678915 665575 653716 643615 635530 629430
61868 629430 624647 620329 616395 613616 612641 613419 615717 619637 625283 632525 641608 653465 668823 687405
61854 687405 708573 732409 759429 789584 822366 857731 896034 937006 979565 1022679 1065636
61843A065636M1682L8677L4121K8616K2299J5251Q280K303k776p519j1561j3885
61831A221124j4359j3779j2373r342m342J594P011J1250J4342J6356J7255J6966
61819A251703J5222J1745O695O17o063j2976j9418k4655k8715l2114l4783l6093
61807A091165l6041l5529l5120l4364l2759l0572k8180k5402k2193j9320j7563
61796G74122j6662j5767j4579j3461j2644j1978j1324j0652r863q873p811o828
61784F33680n870m913m141l690l444l332l503l920m117l655k573j204J33J073
61770E90524J352J263J505K264L006L382L699M105M121L592L326M015N054N427
61756F36635N181N078N140M639L405K091J151M63o0k75l75p89j436j845k053k542
$$ plain form
61843 1065636 1107318 1145995 1180116 1208732 1231031 1246282 1254562 1256865 1254089 1246570 1235009 1221124
61831 1221124 1206765 1192986 1180613 1171271 1166929 1168523 1175534 1186784 1201126 1217482 1234737 1251703
61819 1251703 1266925 1278670 1285365 1285982 1279919 1266943 1247525 1222870 1194155 1162041 1127258 1091165
61807 1091165 1055124 1019595 984475 950111 917352 886780 858600 833198 811005 791685 774122
61796 774122 757460 741693 727114 713653 701009 689031 677707 667055 657192 648319 640508 633680
61784 633680 627810 622897 618756 615066 611622 608290 604787 600867 596750 593095 590522 589318 589451 590524
61770 590524 591876 593139 594644 596908 599914 603296 606995 611100 615221 618813 622139 626154 631208 636635
61756 636635 641816 646894 652034 656673 660078 662169 663320 663783 663723 663448 663073 662284 660848 659003 656950 654408
61740F54408l230l431k989k574k545k391j779j243j217j168m30O10J038Q33Q60
61725F34752J531K200K121J463J013J159J522J656J707K133K864L251K967K503
61711F62842K233J508m89l164m695m144k600j788k114k700k863k786k863k985
61697F33392k743k040j249q27q52j007j021r48r11p85m76k97n41q40m85M89J179
61680F20038J042O30P67J447K088K476K883L414L776L759L519L288L034K540J804
61665F56505J245J436K391L245K975J611L21J47R03J567J511R82O02O86R77J016
61649F78120P19O02J106J826J940J427J227J864K572K320J151j07j057j937k926
61634F88847l956n090o334p243p385p134p229p582p375o428n604n482n485m769
$$ plain form
61740 654408 651178 647747 644758 642184 639639 637248 635469 634226 633009 631841 631411 632021 633059 633892 634752
61725 634752 636283 638483 640604 642067 643080 644239 645761 647417 649124 651257 654121 657372 660339 662842
61711 662842 665075 666583 666094 662930 658235 654091 651491 649703 647589 644889 642026 639240 636377 633392
61697 633392 630649 628609 627360 626533 625681 624674 623653 622705 621794 621009 620533 620236 619695 618855 618370 618859 620038
61680 620038 621080 621710 622477 623924 626012 628488 631371 634785 638561 642320 645839 649127 652161 654701 656505
61665 656505 657750 659186 661577 664822 667797 669408 669729 669876 670779 672346 673857 674839 675441 676127 677104 678120
61649 678120 678839 679441 680547 682373 684313 685740 686967 688831 691403 693723 694874 694767 693710 691773 688847
61634 688847 684891 679801 673467 666224 658839 651705 644476 636894 629519 623091 617487 612005 606520 601751
61620F01751l367j944r18l84l98p47p90k25K44l93k201m296n850o593o467n556
61604E61866m454l996m310m646m403l904l776l971l903l337k762k710l124l465
61590E09105l307k715k095j774j801k073k561l233l885m232m170l761l000j917
61576D68581r19o52j265k030k055j296o06p57j603k336k375j914j574j629j700
61561D45870j283m64J45J00m10q70r05m21L71R60R08M59L85R53J394Q54l58j041
61543D46647n47N68J370J549J399J225J081R40Q88J103J555J837J470N51k41n38
61527D60857p81j440k081j896j032o01j249k350k886k604k033j734j819j954j776
61512D34621j438j557k228k473j471l4J75j044k141k134j844k131k268j263J59
$$ plain form
61620 601751 598384 596440 595522 595138 594740 593993 593203 592978 593222 592829 590628 586332 580482 573889 567422 561866
61604 561866 557412 553416 549106 544460 540057 536153 532377 528406 524503 521166 518404 515694 512570 509105
61590 509105 505798 503083 500988 499214 497413 495340 492779 489546 485661 481429 477259 473498 470498 468581
61576 468581 467662 467010 465745 463715 461660 460364 459758 459001 457398 455062 452687 450773 449199 447570 445870
61561 445870 444587 444123 444268 444368 443958 443088 442183 441762 442133 443093 444001 444460 444845 445798 447192 448046 447688 446647
61543 446647 446100 446668 448038 449587 450986 452211 453292 454232 455120 456223 457778 459615 461085 461636 461395 460857
61527 460857 460076 458636 456555 454659 453627 453026 451777 449427 446541 443937 441904 440170 438351 436397 434621
61512 434621 433183 431626 429398 426925 425454 425420 425595 424551 422410 420276 418432 416301 414033 412770 412929
61497D12929L94o82j633j529q12j03N96J235J353Q14J25l03n78p25l91M30J068
61480D12188J012N95M14N02N61O33J012J598J848J433N92j64n80p13o24k58K64
61463D20313M53o9r26j311j034p23o62j99J155K542K637J409J32l12k29k06k51
61446D22719j67lJ81N17R52J143J030J096J784K953M090M745M683M031L428L538
61430D56720M215M490L635K038Q27Q57K001L241L516K729J818J574J722J698J741
61415D92822K398L224L140K049R64L15o24k221l586l890l623l685m016l981l552
61400D75734l250l282l486l737l813l304k304j669j889k177j559m00J05l31q28
61385D43810o91j20M96J109J670J945J905J806J717J476J101Q52Q57J066J556
$$ plain form
61497 412929 413323 412641 411008 409479 408667 408564 409160 410395 411748 412562 412687 412384 411806 411081 410690 411120 412188
61480 412188 413200 413795 414209 414711 415272 415905 416917 418515 420363 421796 422388 422224 421644 420931 420307 420049 420313
61463 420313 420766 420697 419771 418460 417426 416703 416041 415842 416997 419539 422176 423585 423717 423405 423176 422970 422719
61446 422719 422552 422549 422730 423247 424199 425342 426372 427468 429252 432205 436295 441040 445723 449754 453182 456720
61430 456720 460935 465425 469060 471098 471925 472782 474783 478024 481540 484269 486087 487661 489383 491081 492822
61415 492822 495220 498444 501584 503633 504597 504912 504288 502067 498481 494591 490968 487283 483267 479286 475734
61400 475734 472484 469202 465716 461979 458166 454862 452558 450889 449000 446823 445264 444864 444969 444638 443810
61385 443810 443119 442999 443495 444604 446274 448219 450124 451930 453647 455123 456224 457076 457933 458999 460555
61370D60555K329K926K770J971J190P31L43j3J55J091K259K906K861K536K421
61355D87031K816L705M722N447N914O587P663Q770R604J0485J1949J3897J5524
61342E94114J6120J5640J4400J2528R984P058M494K873J965R41p55k947n085o746
61328F64584p724p935p524o925o495o182n688m883l923l050k375j838j298p30
61314E98014l09j90k53l06m11p02q76l76Q98K493M126N952P961R636J0690J1516
61298F47863J2422J2856J1985R823P129M370J414j771m679o657p446p332o962
61285F73015o968p398p625p038n771m527l732l149k252q22Q12K039K606K995L901
61270F36086N275O369O824P187Q036R117R835J0127J0309J0457J0545J0932J2051
$$ plain form
61370 460555 462884 465810 468580 470551 471741 472472 472815 472802 472957 474048 476307 479213 482074 484610 487031
61355 487031 489847 493552 498274 503721 509635 516222 523885 532655 542259 552744 564693 578590 594114
61342 594114 610234 625874 640274 652802 662786 669844 674338 677211 679176 680117 679362 676415 671330 664584
61328 664584 656860 648925 641401 634476 627981 621799 616111 611228 607305 604255 601880 600042 598744 598014
61314 598014 597705 597515 597262 596956 596545 595843 594967 594591 595489 597982 602108 608060 616021 625657 636347 647863
61298 647863 660285 673141 685126 694949 702078 706448 707862 706091 701412 694755 687309 679977 673015
61285 673015 666047 658649 651024 643986 638215 633688 629956 626807 624555 623733 624545 626584 629190 632185 636086
61270 636086 641361 647730 654554 661741 669777 678894 688729 698856 709165 719622 730167 741099 753150
61257G53150J3777J5576J7185J8597J9501J9298J7650J4747J1055P150L471o5
61245I11092l958q197j1813j3861j4548j4813j5021j4756j3694j1984r890p650
61233G70907n687m362l523k707j825j162q62p76o38n3J441L712N733O562O375
61218G73135N959N538M803L804K937K192J316O23P19J391J766J643J811K739L797
61203H14173M162L820L370L299L788M810O225Q028J0427J3375J6253J8536K0467
61190I30733K2488K4331K5530K6394K7448K8170K7445K5270K2705K0213J7266
61179A197993J3777J0529P853N234K592O38n90k195m767p589j0211j3331j7125
61166A182808k0144k1310k1805k3388k5697k6895k6429k5476k4886k4244k3022
$$ plain form
61257 753150 766927 782503 799688 818285 837786 857084 874734 889481 900536 907686 911157 911092
61245 911092 907134 898937 887124 873263 858715 843902 828881 814125 800431 788447 778557 770907
61233 770907 765220 760858 757335 754628 752803 751641 750779 750003 749365 749312 750753 754465 760198 766760 773135
61218 773135 779094 784632 789435 793239 796176 798368 799684 800307 801026 802417 804183 805826 807637 810376 814173
61203 814173 818335 822155 825525 828824 832612 837422 843647 851675 862102 875477 891730 910266 930733
61190 930733 953221 977552 1003082 1029476 1056924 1085094 1112539 1137809 1160514 1180727 1197993
61179 1197993 1211770 1222299 1230152 1235386 1237978 1238616 1238026 1235831 1231064 1223475 1213264 1199933 1182808
61166 1182808 1162664 1141354 1119549 1096161 1070464 1043569 1017140 991664 966778 942534 919512
61155I19512k1256j8989j6192j3407j1363r813p786n143k799j181M57K702M950
61142H19692O298O733O758O447N519M014K273N19j082k123k247j608n98P78K807
61127H54180N420Q088J0510J2983J5791J8554K0669K2274K4189K6782K9346L1005
61115A079791L1784L2362L3015L3432L3380L2892L1816K9853K7247K4810K2923
61104A413305K0998J8280J4781J1110P689M528J488j512m547p787j1572j6185
61092A450576k1321k5984k9391l1850l4130l6140l7058l6714l5952l5238l3940
61081A092858l1502k8597k6361k4975k3663k1711j8973j5719j2550j0177q793
61070H69837p866o864n816m859l675j881L34K368L839M770N411O089O972P896
$$ plain form
61155 919512 898256 879267 863075 849668 838305 828492 820706 815563 812764 811583 812040 814742 819692
61142 819692 825990 832723 839481 845928 851447 855461 857734 858253 857171 855048 852801 851193 850595 851373 854180
61127 854180 859600 867688 878198 891181 906972 925526 946195 968469 992658 1019440 1048786 1079791
61115 1079791 1111575 1143937 1176952 1210384 1243764 1276656 1308472 1338325 1365572 1390382 1413305
61104 1413305 1434303 1452583 1467364 1478474 1486163 1490691 1492179 1490667 1486120 1478333 1466761 1450576
61092 1450576 1429255 1403271 1373880 1342030 1307900 1271760 1234702 1197988 1162036 1126798 1092858
61081 1092858 1061356 1032759 1006398 981423 957760 936049 917076 901357 888807 878630 869837
61070 869837 861971 855107 849291 844432 840757 838876 839210 841578 845417 850187 855598 861687 868659 876555
61056H76555Q732R846J1605J3513J4657J5097J5825J7202J8522J9497K0890K3067
61044A065008K5143K6447K7735K9804L1914L2865L2881L3140L3971L4751L5122
61033A408781L5140L4580L3322L2087L1658L1713L1474L1151L1527L2423L2876
61022A766732L2711L2841L4074L6614M0537M5532N0400N3848N5822N7217N8737
61011B265065O1109O5824P4165Q5679R8959J13635J30048J47341J63722J78869
61001C384416J94613K13449K37966K71481L17086L75948M48708N38792O52358
60992F634817P95677R76703J210527J518669J916447K394800K903803L341872
60984B1693315L564613L435781K913586K111689J266782O19204K97675K91920
$$ plain form
61056 876555 885287 895133 906738 920251 934908 950005 965830 983032 1001554 1021051 1041941 1065008
61044 1065008 1090151 1116598 1144333 1174137 1206051 1238916 1271797 1304937 1338908 1373659 1408781
61033 1408781 1443921 1478501 1511823 1543910 1575568 1607281 1638755 1669906 1701433 1733856 1766732
61022 1766732 1799443 1832284 1866358 1902972 1943509 1989041 2039441 2093289 2149111 2206328 2265065
61011 2265065 2326174 2391998 2466163 2551842 2650801 2764436 2894484 3041825 3205547 3384416
61001 3384416 3579029 3792478 4030444 4301925 4619011 4994959 5443667 5982459 6634817
60992 6634817 7430494 8407197 9617724 11136393 13052840 15447640 18351443 21693315
60984 21693315 25257928 28693709 31607295 33718984 34985766 35604970 35902645 36194565
60976C6194565N02704P92340R97626R47575N31910k16122j112760j923451k491759
60967C4222628k792845k889435k857182k746752k587196k397373k188608j966493
60959A3796744j737030j509880j294917j098576r24584p75364o50929n48333m64038
60950D793093l95870l41811k98480k62374k31796k06279j84770j65596j47953
60941B558164j32308j19342j09186j01600r6294r2814r0465q8410q5822q2132
60931A559791p7329p1920o6455o1183n6113n1195m6350m1611l7293l3779l1058
60920I85505k8674k6234k3710k1238j8865j6688j4921j3685j2726j1564r872p847
60908G79481o166n378n223m821l783k821k861l818m800n361n879o646p327p591
$$ plain form
60976 36194565 36697269 37489609 38487235 39434810 39966720 39750598 38637838 36714387 34222628
60967 34222628 31429783 28540348 25683166 22936414 20349218 17951845 15763237 13796744
60959 13796744 12059714 10549834 9254917 8156341 7231757 6456393 5805464 5257131 4793093
60950 4793093 4397223 4055412 3756932 3494558 3262762 3056483 2871713 2706117 2558164
60941 2558164 2425856 2306514 2197328 2095728 1999434 1906620 1816155 1727745 1641923 1559791
60931 1559791 1482462 1410542 1344087 1282904 1226791 1175596 1129246 1087635 1050342 1016563 985505
60920 985505 956831 930597 906887 885649 866784 850096 835175 821490 808764 797200 787328 779481
60908 779481 773315 767937 762714 757893 754110 751289 748428 744610 739810 734449 728570 721924 714597 707006
60894G07006p717q042q318q061p423p079p260p358o676n324m052l342k943k390
60880F21021j719j332j324j303j043r22j442k511l544m132m349m447m591m886
60866E83476n366n852o034n738n002l927k687j622j033q30n95j00M50Q05J117
60851E47062J754K733L507L458K577J585J289J910K998L873M060L494K599K012
60837E84911J956J863J061k20r90p70j38J78K02L11M30K78M9J71N51P06O08P14
60819E91871J148J443J255P96L42k42j118k049k627k829k995l442m209n095n781
60804E66468o051n996n933o061o280o389o286n988n563n082m537l864l200k954
60790D92284l313l755l522k637j979k124k549k377j574r17r12j273j548j673j720
$$ plain form
60894 707006 699289 691247 682929 674868 667445 660366 653106 645748 639072 633748 629696 626354 623411 621021
60880 621021 619302 617970 616646 615343 614300 613378 611936 609425 605881 601749 597400 592953 588362 583476
60866 583476 578110 572258 566224 560486 555484 551557 548870 547248 546215 545385 544790 544690 545140 545945 547062
60851 547062 548816 551549 555056 558514 561091 562676 563965 565875 568873 572746 576806 580300 582899 584911
60837 584911 586867 588730 589791 589571 588581 587811 587673 587851 588053 588364 588794 589072 589121 589292 589843 590549 591157 591871
60819 591871 593019 594462 595717 596513 596855 596613 595495 593446 590819 587990 584995 581553 577344 572249 566468
60804 566468 560417 554421 548488 542427 536147 529758 523472 517484 511921 506839 502302 498438 495238 492284
60790 492284 488971 485216 481694 479057 477078 474954 472405 470028 468454 467537 466625 465352 463804 462131 460411
60775D60411j474o74M67J385J807J972K197K572L186M230N548O404O282N783O094
60760E06190P482Q911R360Q978Q397P662O496N328N020N591O058N757N093M582
60746F00905L994L001K099K011K415K156P19j205k813m091n286o148o308o083
60732E85366o187o724p124p099p115p639q387q699q383p819p400p224p137o786
60718D81643n701l848k022j295j864k794k983k132p13N82J130O33l97p44L94K401
60702D62290L817L979L663M001N130O281O849O947O945O885O584O025N396M788
60688E39580M140L472K906K331J402M2j233j847j836j747j907k149k183j864j172
60673E37935k68L52K82j99l89j08J58K28O53J718K673K686K088J843K003J726
$$ plain form
60775 460411 458937 458263 458730 460115 461922 463894 466091 468663 471849 476079 481627 488031 494313 500096 506190
60760 506190 513672 522583 531943 540921 549318 556980 563476 568804 573824 579415 585473 591230 596323 600905
60746 600905 604899 607900 609999 612010 614425 616581 617300 616095 613282 609191 603905 597757 591449 585366
60732 585366 579179 572455 565331 558232 551117 543478 535091 526392 518009 510190 502790 495566 488429 481643
60718 481643 475942 472094 470072 468777 466913 464119 461136 459004 458291 458873 460003 460636 460239 459495 459889 462290
60702 462290 466107 470086 473749 477750 482880 489161 496010 502957 509902 516787 523371 529396 534792 539580
60688 539580 543720 547192 550098 552429 553831 553873 552640 550793 548957 547210 545303 543154 540971 539107 537935
60673 537935 537667 538019 538301 538102 537713 537605 537763 537991 538644 540362 543035 545721 547809 549652 551655 553381
60657E53381Q93O90K077M460O438P418P818Q070Q149Q102Q299Q984R976J0970
60643F45725J1785J2190J1956J1361J1247J2128J3497J4483J5024J5859J7418
60632G92673J9323K1092K2679K4042K4791K4716K4279K3964K3499K2304K0455
60621A043817J8457J6265J3311R619N998K900j79l730p311j0145j2209j4083j6033
60608A046677j7795j9179k0318k1315k2053k2373k2203k1512k0405j9203j8229
60597H22092j7532j6985j6541j6143j5589j4696j3550j2384j1220r934q577p382
60585F61559o497n919n632n554n352m589l192j658o50m21o40p74n12J35J049K088
60569F23441K998L636M445O267R365J2919J5962J8518K1176K3833K5733K6633
$$ plain form
60657 553381 554274 554964 557041 561501 567939 575357 583175 591245 599394 607496 615795 624779 634755 645725
60643 645725 657510 669700 681656 693017 704264 716392 729889 744372 759396 775255 792673
60632 792673 811996 833088 855767 879809 904600 929316 953595 977559 1001058 1023362 1043817
60621 1043817 1062274 1078539 1091850 1101469 1107467 1110367 1110188 1106458 1099147 1089002 1076793 1062710 1046677
60608 1046677 1028882 1009703 989385 968070 946017 923644 901441 879929 859524 840321 822092
60597 822092 804560 787575 771034 754891 739302 724606 711056 698672 687452 677518 668941 661559
60585 661559 655062 649143 643511 637957 632605 628016 624824 623166 622516 622095 621455 620681 620169 620304 621353 623441
60569 623441 626439 630075 634520 640787 650152 663071 679033 697551 718727 742560 768293 794926
60557G94926K6881K6164K3303J7919J1332N084o35o210j1055j3987j4793j4356
60545H44573j3378j1864r872p701n247j973K204O693J1106J5703K0687K5585K9638
60532I06154L2383L3591L2957L0117K4888J7578R233J442m581q769j1667j3363
60520A049963j3491j2252j0676r627r015q285p251o157n250m516l683k384m84
60507I56892J697L675N250O444P220P701Q467J0141J2754J6021K0113K5510L2183
60494A114068L9680M8047N7753O8538P9158Q8622R6762J03115J06110J04219R7432
60483B003504Q6823P3050N6059L6087J4189q269l0148n0568o8740q3801r4742
60472A933444j00817j02437j01191r8501r4473q8604q1272p3789o7002o0633n4203
$$ plain form
60557 794926 821807 847971 871274 889193 900525 905609 904974 898764 887709 873722 858929 844573
60545 844573 831195 819331 809459 801758 796511 794538 796742 803435 814541 830244 850931 876516 906154
60532 906154 938537 972128 1005085 1035202 1060090 1077668 1086901 1088343 1083762 1074993 1063326 1049963
60520 1049963 1036472 1024220 1013544 1003917 994902 986617 979366 973209 967959 963443 959760 957376 956892
60507 956892 958589 962264 967514 973958 981178 988879 997346 1007487 1020241 1036262 1056375 1081885 1114068
60494 1114068 1153748 1201795 1259548 1328086 1407244 1495866 1592628 1695743 1801853 1906072 2003504
60483 2003504 2090327 2163377 2219436 2255523 2269712 2261443 2231295 2180727 2111987 2028186 1933444
60472 1933444 1832627 1730190 1628999 1530498 1436025 1347421 1266149 1192360 1125358 1064725 1010522
60461A010522m7941m2428l7809l3812l0276k7213k4477k1807j9273j7289j5956
60450F92241j4623j2501r751p537o702o703o280n053l876l557l858m007l721l217
60436F00855k648k079j751j808j853j329k96N97R43Q48L79o07j885k685k555j986
60420E82140j753j881j834j484j305j565j947k115k211k490k853l039k966k536
60406E52161j457K29J722K144J689J474K149L146L473K811J587L56n00q13p05
60391E69466m97l21l1L55N13L39K53O17J173J447J391J211R09N08M02Q91J507
60374E80133J488Q46L49M28P07P60P22R44J408J682J361M84k81j10J030K096K132
60357E96179J402R21J073J404J541J492J162M56j31P5Q26J155R13J000J800K479
$$ plain form
60461 1010522 962581 920153 882344 848532 818256 791043 766566 744759 725486 708197 692241
60450 692241 677618 665117 655366 647829 641127 634424 628144 623091 619215 615658 611800 607793 604072 600855
60436 600855 598207 596128 594377 592569 590716 589387 589091 589688 590631 591479 591858 591251 589366 586681 584126 582140
60420 582140 580387 578506 576672 575188 573883 572318 570371 568256 566045 563555 560702 557663 554697 552161
60406 552161 550704 550933 552655 554799 556488 557962 560111 563257 566730 569541 571128 571484 570984 570171 569466
60391 569466 568969 568648 568617 568972 569485 569824 570077 570694 571867 573314 574705 575916 576825 577333 577735 578626 580133
60374 580133 581621 582467 582816 583244 583951 584711 585433 586377 587785 589467 590828 591312 591031 590921 591951 594047 596179
60357 596179 597581 598502 599575 600979 602520 604012 605174 605630 605499 605574 606400 607555 608468 609468 611268 613747
60341F13747K478K631L840N447O010N271M310L949L918L542K569J196j75j170
60327F57563j772k370l219m049m460m344l669k336p06K95K53JN53J686K445K736
60311F38607L366M606N782O507P320Q726J0428J1998J3727J6260J9815K4161K8882
60298H00185L3164L5675L5342L2162K6904K0240J2521M207m034j1665j8269k3223
60286I43209k5862k6214k5198k3803k2194j9967j7104j4254j2014j0297q631o906
60274G30765n526m950n232n963o485o282n457m722m682n198n669n784n634n229
60260F53952m495l739l513l781l741k825j480n62l50m68n28l91o0K97L45r2q14
60243F27755j565k284k793k628j602l66J52k39q51r12j74J055K148K552K383K432
$$ plain form
60341 613747 616225 618856 622696 628143 634153 639424 643734 647683 651601 655143 657712 658908 658733 657563
60327 657563 655791 653421 650202 646153 641693 637349 633680 631344 630638 630933 631186 631187 631740 633426 635871 638607
60311 638607 641973 646579 652361 658868 666188 674914 685342 697340 711067 727327 747142 771303 800185
60298 800185 833349 869024 904366 936528 963432 983672 996193 1000400 996366 984701 966432 943209
60286 943209 917347 891133 865935 842132 819938 799971 782867 768613 756599 746302 737671 730765
60274 730765 725239 720289 715057 709094 702609 696327 690870 686148 681466 676268 670599 664815 659181 653952
60260 653952 649457 645718 642205 638424 634683 631858 630378 629816 629466 628998 628470 628079 628019 628316 628661 628569 627755
60243 627755 626190 623906 621113 618485 616883 616517 616669 616430 615579 614667 614493 615548 617696 620248 622631 625063
60227F25063L239M377N086N319N566N850N732N275N118N357N145L911K394J801
60213F89233K345L196L662L728L579L186K617K268K452K937L151K769J984J232
60199G28339Q28P87Q36O14K4o29r58j017j304k179l404m396m784m586m111l835
60183G00225m139m790m901l879k320j384j311j194m01M65M56l74j082j025m01
60168F73945K72O61O91N04M93J033K097L232L978M182M014L746L510L177K600
60153G08135J973J723J892J956J442N44r3q2M86J374K429L535M477M986M948M656
60137G44381M720N476O543P297P708Q257Q952R023P808N527K929O00j117k052
60123H16052k433k843l529m140m375m390m244l530k131q62o83j478k272k382j838
$$ plain form
60227 625063 628302 632679 637765 643084 648650 654500 660232 665507 670625 675982 681127 685038 687432 689233
60213 689233 691578 694774 698436 702164 705743 708929 711546 713814 716266 719203 722354 725123 727107 728339
60199 728339 729167 729954 730790 731404 731428 730799 729841 728824 727520 725341 721937 717541 712757 708171 704060 700225
60183 700225 696086 691296 686395 682516 680196 678812 677501 676307 675906 676371 676827 676453 675371 674346 673945
60168 673945 674217 674878 675569 676073 676566 677599 679696 682928 686906 691088 695102 698848 702358 705535 708135
60153 708135 710108 711831 713723 715679 717121 717665 717572 717490 717976 719350 721779 725314 729791 734777 739725 744381
60137 744381 749101 754577 761120 768417 776125 784382 793334 802357 810165 815692 818621 819221 818104 816052
60123 816052 813619 810776 807247 803107 798732 794342 790098 786568 784437 783575 782892 781414 779142 776760 774922
60108G74922r77k57j95q61j521j335l46P48J567K225K750L012L172L483L670L166
60092G93223K050J178J209J923K618K865K754K682K920L295L428L375L610M098
60078H31228L987K678P00j150k977n266p636r127r608r808j0053r914r208q395
60064G55451p785p153o310n376m382l308k549k588l118l330l053k810k721k365
60050F98603j863j966k720l127k566j570p42J16J184J961K124K223K695L018K657
60035G00027K111K108K379K199J630J233Q73j29j839l543m687n309n611n765o062
60020F79615o602o979o779o300o207o615p061p256p253o964o181n033l942l103
60006E93340k444j983j839j916j991k001j806j029L47J525J758J477J788K909
$$ plain form
60108 774922 773945 773688 773493 772632 771111 769776 769430 770178 771745 773970 776720 779732 782904 786387 790057 793223
60092 793223 795273 796451 797660 799583 802201 805066 807820 810502 813422 816717 820145 823520 827130 831228
60078 831228 835215 837893 838593 837443 834466 829200 821564 812437 802829 793021 782968 773054 763846 755451
60064 755451 747666 740513 734203 728827 724445 721137 718588 716000 712882 709552 706499 703689 700968 698603
60050 698603 696740 694774 692054 688927 686361 684791 684049 684165 685349 687310 689434 691657 694352 697370 700027
60035 700027 702138 704246 706625 708824 710454 711687 712560 712431 710592 707049 702362 697053 691442 685677 679615
60020 679615 673013 666034 659255 652955 646748 640133 633072 625816 618563 611599 605418 600385 596443 593340
60006 593340 590896 588913 587074 585158 583167 581166 579360 578331 578678 580203 581961 583438 585226 588135
59992E88135L908M088L744L383L083K927L297M134M618M161L256K748K655K433
59978F36570K034J886J894J359Q9j110j434j095r18j267j864k407k848l093k953
59963F24843k528k249k293k292j813r35j04L88N28M15K01O3pk64p87j182j064
59946F10920o41m45n61n96l58p9J22M67J002J269Q51m2q04j062q42l52J84N68
59928F09601P12P20P75R72J303J692K085K501K908L033K514J435M50J07K87N62
59912F31657Q03R98Q70L22k3M61J296J343M07m55m29R7M24N53Q05J073J036P91
59894F42029P37J084J727K421K952L407M276N807P364Q041P887P766P977P996
59880G11471P660P562P877Q010P779P818Q070P279M916K418J223N81j147l876
$$ plain form
59992 588135 592043 596131 599875 603258 606341 609268 612565 616699 621317 625478 628734 631482 634137 636570
59978 636570 638604 640490 642384 643743 643832 642722 641288 640193 639275 638008 636144 633737 630889 627796 624843
59963 624843 622315 620066 617773 615481 613668 612733 612629 613017 613545 613960 614161 614224 614217 613953 613166 611984 610920
59946 610920 610279 609834 609273 608677 608319 608240 608362 608829 609831 611100 611951 611909 611105 610043 609201 608849 609033 609601
59928 609601 610313 611033 611808 612780 614083 615775 617860 620361 623269 626302 628816 630251 630701 630808 631095 631657
59912 631657 632460 633458 634328 634650 634627 635088 636384 637727 638134 637679 637250 637347 637771 638324 639129 640202 641238 642029
59894 642029 642766 643850 645577 647998 650950 654357 658633 664440 671804 679845 687732 695498 703475 711471
59880 711471 719131 726693 734570 742580 750359 758177 766247 773526 778442 780860 782083 782664 781517 777641
59866G77641o093p250q112q879q785p727o814o796p169p177o728n980n005m192
59852F80934l985l961l089j216O14J687K392L120L526L475L726M877O419P663
59838G06182Q886J0683J2794J4372J5037J4836J3591J1173Q282O143N394N720
59826H33093O377O594N622L078p79n363j0140j4379j7066j7811j7560j7592j7963
59813G36111j7701j6405j4700j3026j1020q561o515n680n546m934l563k254j705
59800F24501j761j967k184k413k482k289k078k200k721l418m019m310m146l554
59786E84959k782k161j908k072k446k551k062j341j146j522j516l92J243K177
59772E66480K184K093K337K349J677Q62O65R53R80N32J60L53Q92J136P57J51J00
$$ plain form
59866 777641 771548 764298 756186 747307 738522 730795 723981 717185 710016 702839 696111 690131 685126 680934
59852 680934 676949 672988 669899 668683 669297 670984 673376 676496 680022 683497 687223 692100 698519 706182
59838 706182 715068 725751 738545 752917 767954 782790 796381 807554 815836 821979 827373 833093
59826 833093 839470 846064 851686 854764 853985 848622 838482 824103 807037 789226 771666 754074 736111
59813 736111 718410 702005 687305 674279 663259 654698 648183 642503 636957 632023 628460 626206 624501
59800 624501 622740 620773 618589 616176 613694 611405 609327 607127 604406 600988 596969 592659 588513 584959
59786 584959 582177 580016 578108 576036 573590 571039 568977 567636 566490 564968 563452 563060 564303 566480
59772 566480 568664 570757 573094 575443 577120 577982 578647 579600 580580 581112 581272 581625 582517 583653 584410 584561 584661
59755E84661R03J977K598K911L587M551M838M039L057K860L189L157K641K143
59741F27112J752J164N10K66K94q7r64j538j209l16M52Q01P26J46q25j638j714
59724F24932j033j59K01l08j403k296k383j801j136o90l54m2J73M13R25J642K156
59707F18837K295K334K540K806K903K711K188J448J001J407K562L676M160M200
59693F55068M244M346M304L992L296K005K04j421k147k004j628j371r11Q1J143
59678F69201J284J39j362j852j072j93m00j530k499k744k662k759k941k855k395
59663F45360j748j234j179j558j819j473q44n96n18L83K240L710L641K667K265
59648F49297K691K858K029O22p51k003l115l768m015m463n270n533m490k811j795
$$ plain form
59755 584661 585564 587541 590139 593050 596637 601188 606026 610065 613122 615982 619171 622328 624969 627112
59741 627112 628864 630028 630538 630804 631098 631011 630047 628509 627300 626984 627436 628237 628963 629109 628284 626646 624932
59724 624932 623899 623740 623941 623633 622230 619934 617551 615750 614614 613924 613570 613528 613701 614114 615039 616681 618837
59707 618837 621132 623466 626006 628812 631715 634426 636614 638062 639063 640470 643032 646708 650868 655068
59693 655068 659312 663658 667962 671954 675250 677255 677459 676038 673891 671887 670259 668888 667977 668058 669201
59678 669201 670485 670624 669262 667410 666338 666145 665745 664215 661716 658972 656310 653551 650610 647755 645360
59663 645360 643612 642378 641199 639641 637822 636349 635505 634909 634391 634774 637014 640724 644365 647032 649297
59648 649297 651988 654846 656875 657497 656746 654743 651628 647860 643845 639382 634112 628579 624089 621278 619483
59633F19483j581j172k25L73Ko63p88o21p61q67k04R66J676J845K294L120L220
59616F26097J938Q7j254k069k804l213k771j725p84p2Q26J877K534K557K208J693
59600F25125R94K72j44l06o56j430k320k767k317r21P83J705J309K15o35j066
59584F17841j458j822j771j357j121j371k013l004m257n187n136m327l631l327
59570E78059k843j911j142j093j429j419p95K02J155J569J145K98o5M44J196J329
59554E74700P48Q2j6O19J589K233K210J825J582J549J571J917L056M868O748Q542
59538F13823J0749J3652J6783J9239K0001J8060J3267P244K559M85K53P15J752
59525G38582L580N561O710O922O983P455Q102Q167P004M666K049N7j450l274n535
$$ plain form
59633 619483 617902 616730 616505 616878 616880 616217 615429 614808 614047 613180 612976 613942 615618 617463 619757 622877 626097
59616 626097 628035 628122 626868 624799 621995 618782 616011 614286 613502 613430 614256 616133 618667 621224 623432 625125
59600 625125 626119 626391 626247 625941 625285 623855 621535 618768 616451 615530 616313 618018 619327 619542 618907 617841
59584 617841 616383 614561 612790 611433 610312 608941 606928 603924 599667 594480 589344 585017 581386 578059
59570 578059 575216 573305 572163 571070 569641 568222 567427 567629 568784 570353 571498 571796 571731 572175 573371 574700
59554 574700 575448 575530 575514 576133 577722 579955 582165 583990 585572 587121 588692 590609 593665 598533 605281 613823
59538 613823 624572 638224 655007 674246 694247 712307 725574 732818 735377 735862 736115 736830 738582
59525 738582 742162 747723 754433 761355 768338 775793 783895 792062 799066 803732 805781 805838 804388 801114 795579
59510G95579p433q631r733j0966j1459j0661r536r315r695r490q518p687p399
59497F75056p053o255n425m975m675m166l545l116k920k711k153j048L37J351
59483F28702J649J697K198L194M224N165O381Q027R781J1274J2256J2312J0979
59470G17839Q396N437K989J331L71N2L01P90J181J539K256L584N450P753J0503
59455G69772J3481J6086J7898J9360K1308K3675K5298K5348K4309K2913K0682
59444A000130J6467J0147K830m494j1416j7245k0906k2181k2111k1707k1126k0417
59432H67971k0034j9924j9095j6938j4264j2163j0444q159n174k260J85K574N445
59419G47720Q968J3016J7137K0656K3323K5695K8441L1370L3372L2858K8163J8606
$$ plain form
59510 795579 788146 779515 769782 758816 747357 736696 727160 717845 708150 698660 690142 682455 675056
59497 675056 668003 661748 656323 651348 646673 642507 638962 635846 632926 630215 628062 627014 627351 628702
59483 628702 630351 632048 634246 637440 641664 646829 653210 661237 671018 682292 694548 706860 717839
59470 717839 726235 731672 734661 735992 736363 736415 736716 737506 738687 740226 742482 746066 751516 759269 769772
59455 769772 783253 799339 817237 836597 857905 881580 906878 932226 956535 979448 1000130
59444 1000130 1016597 1026744 1029574 1025080 1013664 996419 975513 953332 931221 909514 888388 867971
59432 867971 847937 828013 808918 791980 777716 765553 755109 746950 741776 739516 739701 742275 747720
59419 747720 756688 769704 786841 807497 830820 856515 884956 916326 949698 982556 1010719 1029325
59407A029325N939n960j3920j7768j9239j9288j7500j3616q462l508m49q85n240
59394I09429j1924j8474k3483k6769k8123k7222k4669k1867j9506j7172j4650
59383F75570j2491j1006r682q072o441n091l852k638j886j843k042j901j412q61
59369F06352k85M12J176J905K537K955L088L221L711M464N142N843O934Q267R302
59354F65024J0087J1259J2895J4296J5304J6863J9636K2791K4936K5784K6154
59343H65029K6703K7332K7591K7031K5237K2111J8063J3681R217M687K21m022
59331A062881q082j1951j5273j7619j9027j9901k0437k0454j9822j8753j7588
59320H73974j6420j5059j3370j1515r824q464p421o766o590o563o024m855l899
$$ plain form
59407 1029325 1035264 1029304 1015384 997616 978377 959089 941589 927973 919511 916003 915554 914669 909429
59394 909429 897505 879031 855548 828779 800656 773434 748765 726898 707392 690220 675570
59383 675570 663079 652073 642391 634319 627878 622787 618935 616297 614411 612568 610526 608625 607213 606352
59369 606352 606067 606479 607655 609560 612097 615052 618140 621361 625072 629536 634678 640521 647455 655722 665024
59354 665024 675111 686370 699265 713561 728865 745728 765364 788155 813091 838875 865029
59343 865029 891732 919064 946655 973686 998923 1021034 1039097 1052778 1061995 1066682 1066903 1062881
59331 1062881 1054799 1042848 1027575 1009956 990929 971028 950591 930137 910315 891562 873974
59320 873974 857554 842495 829125 817610 807786 799322 791901 785135 778545 771982 765958 761103 757204
59307G57204l947m595m746m083l335l061k912k319j314l48L52R23J644K720M045
59292G36228N283O393P896J0175J2806J5388J8644K3630K9577L3639L3390K8858
59280I61907K1701J3408N096j791n899p023o036l855j032J905M533O908R258J1304
59266A010384J2356J2155J1073R448P169M035J86l996q078j1654j4440j6500j8111
59253I94027j9348j9992j9891j9255j8424j7514j6391j4970j3331j1554r560p280
59241H06517m911k828j128N18K428M472O268P664Q690R151Q656P155N116L071
59227H60839J154q51l187n864q512j0579j1835j2620j3316j3776j3669j3190j2846
59214G41748j2559j1701j0149q636p750p223o572n845n247m530l463k508k277
$$ plain form
59307 757204 753257 748662 743916 739833 736498 733437 730525 728206 726892 726544 726896 727819 729463 732183 736228
59292 736228 741511 747904 755800 765975 778781 794169 812813 836443 866020 899659 933049 961907
59280 961907 983608 997016 1002112 1000321 994422 987399 981363 977508 976476 978381 982914 989822 999080 1010384
59266 1010384 1022740 1034895 1045968 1055416 1062585 1066620 1066806 1062810 1054732 1043078 1028638 1012138 994027
59253 994027 974679 954687 934796 915541 897117 879603 863212 848242 834911 823357 813797 806517
59241 806517 801606 798778 797650 798168 800596 805068 811336 819000 827690 836841 845497 852652 857768 860839
59227 860839 861993 861142 857955 852091 843579 833000 821165 808545 795229 781453 767784 754594 741748
59214 741748 729189 717488 707339 698703 690953 683730 677158 671313 666066 661536 658073 655565 653288
59201F53288k476k144r74K44P63Q71J439K802M423N482N516M647L477K750K819
59186F82927L411L969M260M448M631M682M674N086O172P347P770P527P615Q545
59172G63064R605R989J0133J1172J3245J5130J5691J5174J4732J4972J5326J4789
59160I23022J3063J0855Q964P268M926J579k068n051p157q858j0603j2468j4170
59147I09302j5076j4635j3227j2154j2166j2470j1808j0119q381p159o232n455
59135G80420m942m444l503k353j686j408n96J043K655L621M476N895P529Q639
59121G95346R317J0322J2022J4035J5793J6990J7652J8074J8548J8954J8906J8335
59109I84294J7626J6979J6157J4880J3058J0649P813N249L644K554O62k480n737
$$ plain form
59201 653288 650812 648668 647694 647938 648701 649572 651011 653813 658236 663718 669234 673881 677358 680108 682927
59186 682927 686338 690307 694567 699015 703646 708328 713002 718088 724260 731607 739377 746904 754519 763064
59172 763064 772669 782658 792791 803963 817208 832338 848029 863203 877935 892907 908233 923022
59160 923022 936085 946940 955904 963172 968098 969677 967609 962558 955401 946543 935940 923472 909302
59147 909302 894226 879591 866364 854210 842044 829574 817766 807647 799266 792107 785875 780420
59135 780420 775478 771034 767531 765178 763492 762084 761488 762531 765186 768807 773283 779178 786707 795346
59121 795346 804663 814985 827007 841042 856835 873825 891477 909551 928099 947053 965959 984294
59109 984294 1001920 1018899 1035056 1049936 1062994 1073643 1081456 1086705 1090349 1092903 1093565 1091085 1085348
59096A085348p813q687r102r348r262q928q610q303p949p745p807p838p743q077
59082I68136r350j1211j2945j4413j5754j6508j5912j4099j2242j1304j1110j0823
59070H12465r960q763p810p370p052o164m487k572j143m55l45o44j236j892k336
59055G50236k438k258k047k143k652l236l580l893m456m752l891k002l71J77K13
59040G12907O03J227J545J696K197K882L068K567J959J895K623L996N558O820
59026G51543P802R029J0741J2517J3995J5314J6399J6461J4937J2440R964P612
59014H98754M953K217J88r50j664k104j940j196l44M86J683L308M834N925O909
58999I21059Q167R433J0008R446Q020O666O262O656O624N198K764L48j802m207
$$ plain form
59096 1085348 1077535 1068848 1059746 1050398 1041136 1032208 1023598 1015295 1007346 999601 991794 983956 976213 968136
59082 968136 958786 947575 934630 920217 904463 887955 872043 857944 845702 834398 823288 812465
59070 812465 802505 793742 785932 778562 771510 765346 760859 758287 757144 756689 756344 755700 754464 752572 750236
59055 750236 747798 745540 743493 741350 738698 735462 731882 727989 723533 718781 714890 712888 712517 712694 712907
59040 712907 713510 714737 716282 717978 720175 723057 726125 728692 730651 732546 735169 739165 744723 751543
59026 751543 759345 768374 779115 791632 805627 820941 837340 853801 868738 881178 891142 898754
59014 898754 903707 905924 906112 905162 903498 901394 899454 898258 897914 898400 900083 903391 908225 914150 921059
58999 921059 929226 938659 948667 958113 966133 972799 979061 985717 992341 997539 1000303 1000651 998849 994642
58985I94642o963r515j1547j3243j4493j4691j3709j2300j1121r920q142n889
58973H63109l711j847r7J696L588N721Q221J0843J3124J4856J6225J7342J7969
58960I67039J7803J6823J5097J2372Q316L317j411m961p707j0685j4127j7183
58948I84693j9095j9904j9892j9092j7668j6156j4761j2993j0500p862n975n052
58936H15743m694m651m843m997m875m757n029n531n770n699n719n981o215o197
58922G40785n921n404m657l799k864j673k48R63J666K247L266M638N756O262O244
58907G47261N966N874O560Q168J0107J1801J3309J4686J5296J4694J3758J3884
58895H81364J5224J6766J8076J9844K2510K5502K8204L0750L3362L5619L6928
$$ plain form
58985 994642 987679 978164 966617 953374 938881 924190 910481 898181 887060 877140 868998 863109
58973 863109 859398 857551 857454 859150 862738 868459 876680 887523 900647 915503 931728 949070 967039
58960 967039 984842 1001665 1016762 1029134 1037450 1040767 1039356 1034395 1026688 1016003 1001876 984693
58948 984693 965598 945694 925802 906710 889042 872886 858125 845132 834632 826770 820795 815743
58936 815743 811049 806398 801555 796558 791683 786926 781897 776366 770596 764897 759178 753197 746982 740785
58922 740785 734864 729460 724803 721004 718140 716467 716219 717182 718848 721095 724361 728999 734755 741017 747261
58907 747261 753227 759101 765661 773829 783936 795737 809046 823732 839028 853722 867480 881364
58895 881364 896588 913354 931430 951274 973784 999286 1027490 1058240 1091602 1127221 1164149
58884A164149L7103L5974L3111K8508K3101J7872J2724O857Q5o790j2942j8301
58872A321451k3115k7128k9622l0309k9793k8921k7864k6248k4124k2254k1209
58861A030864k0682k0044j9249j8757j8777j9003j8950j8311j7168j6049j5463
58850H28411j5111j4083j2125j0168r146q819q427p901p633p527p206o811o735
58837G06719o771o530o361o798p259o571m894l767l874m005k917j142q9n2j36
58822F45553K95R98J557J925K177K312K391K514K519J988P96n06j143r50n33m30
58806F61463l92R1P93Q68K2j048j627j751j671j245m42J41k8n91q25o23l26Q2
58788F52891Q73J970L136M490O145P539P947P455O748O191N782N746O284O853
$$ plain form
58884 1164149 1201252 1237226 1270337 1298845 1321946 1339818 1352542 1359399 1359484 1352694 1339752 1321451
58872 1321451 1298336 1271208 1241586 1211277 1181484 1152563 1124699 1098451 1074327 1052073 1030864
58861 1030864 1010182 990138 970889 952132 933355 914352 895402 877091 859923 843874 828411
58850 828411 813300 799217 787092 776924 767778 758959 750532 742631 734998 727471 720265 713454 706719
58837 706719 699948 693418 687057 680259 673000 666429 661535 657768 653894 649889 646972 645830 645741 645689 645553
58822 645553 645848 646846 648403 650328 652505 654817 657208 659722 662241 664229 665025 664519 663376 662426 661893 661463
58806 661463 661071 661162 661955 662823 662845 661797 660170 658419 656748 655503 655061 655202 655174 654583 653758 653135 652809 652891
58788 652891 653764 655734 658870 663360 669505 677044 684991 692446 699194 705385 711167 716913 723197 730050
58774G30050O605N371L581J412j049l102l975m063m556n710o471o014m764l592
58760G03723k748j947r02M12J648K275K281K463L376M357M419L774L545M147N018
58745G35841N756O431O897O998P355Q671J0235J0567R736R511J0792J2365J2863
58732H54018J2648J2784J3334J3621J3388J2783J1753J0296Q875P995P719P930
58720I87144Q484Q946Q882Q632R012R907J0131R040P329N723L872J265j729m460
58706A072178o959r543j2124j4581j7222k0155k2750k4399k5276k5802k5870k5203
58694H42294k3982k2498k0728j8702j6854j5439j4107j2551j1074j0071r453r071
58682F57764r067r327r187q270p130o412n845m736l066j459k85O85J852L434N402
$$ plain form
58774 730050 736655 742026 745607 747019 745970 742868 738893 734830 730274 724564 718093 712079 707315 703723
58760 703723 700975 699028 698126 698538 700186 702461 704742 707205 710581 714938 719357 723131 726676 730823 735841
58745 735841 741597 748028 754925 761923 769278 777949 788184 798751 808487 817998 828790 841155 854018
58732 854018 866666 879450 892784 906405 919793 932576 944329 954625 963500 971495 979214 987144
58720 987144 995628 1004574 1013456 1022088 1031100 1041007 1051138 1060178 1067507 1073230 1077102 1078367 1076638 1072178
58706 1072178 1065219 1055676 1043552 1028971 1011749 991594 968844 944445 919169 893367 867497 842294
58694 842294 818312 795814 775086 756384 739530 724091 709984 697433 686359 676288 666835 657764
58682 657764 648697 639370 630183 621913 614783 608371 602526 597790 594724 593265 592980 593665 595517 598951 604353
58667F04353P554R745J2040J4331J6002J6461J5829J4461J2087Q400M299J255
58655G36817o31k637n207p147p611p452p721q046p523o281n125m289l514k768
58641F60865k090j248k43M37O16Q21J364J782J702J419R62l00k361l929m031l380
58625F52386l134l195k830k139j554n94J533M450O993Q855J0669J2698J4421J5409
58611G13968J5675J5231J3998J2051R460O186K595l46k029k916l774m682n414
58598G70003o108o892p355p141o498n694m447k597n59J478L956O782Q889R910
58584G53727J1222J3994J7045J8142J6830J4541J2466J0772R472Q534P305N278
58572H99328L302K752L685N076O707R276J2721J5919J8347K0642K3155K5099K5615
$$ plain form
58667 604353 611907 621652 633692 648023 664025 680486 696315 710776 722863 731263 735562 736817
58655 736817 736186 733549 728342 721195 713584 706132 698411 690365 682842 676561 671436 667147 663633 660865
58641 660865 658775 657527 657284 657721 658337 659158 660522 662304 664006 665425 666387 666087 663726 659797 655766 652386
58625 652386 649252 646057 643227 641088 639534 638940 640473 644923 651916 660771 671440 684138 698559 713968
58611 713968 729643 744874 758872 770923 780383 786569 789164 788818 786789 783873 780099 775417 770003
58598 770003 763895 757003 749648 742507 736009 730315 725868 723271 722712 724190 728146 734928 743817 753727
58584 753727 764949 778943 795988 814130 830960 845501 857967 868739 878211 886745 894050 899328
58572 899328 902630 905382 909067 914143 920850 930126 942847 958766 977113 997755 1020910 1046009 1071624
58559A071624K4734K2879K0195J6764J2784Q312L420j265m892p337r221j0951
58547A147046j2451j3770j5085j6043j6024j5374j5511j7287j9742k1056k0450
58536I64253j8819j7590j7268j7125j6221j4450j2442j0618q874p179n792m702
58524H13173l468j907l36J108K695M310N228N122M564M095L514K608J728J175
58510H43609P45L91M96J029J421J705K620L984M385L338K323K506K788J651m17
58495H72574j927k786l889n103n490n032m465l878k930j994j569j047M09K309
58481H35182L742N186P661J0530J2066J1952J1365J0661Q935N947K643m57l751
58468I21662p047r147r504r020q800r026r342r344q543o733m452k299q6K479M754
$$ plain form
58559 1071624 1096358 1119237 1139432 1156196 1168980 1177292 1180712 1179447 1174555 1167218 1157997 1147046
58547 1147046 1134595 1120825 1105740 1089697 1073673 1058299 1042788 1025501 1005759 984703 964253
58536 964253 945434 927844 910576 893451 877230 862780 850338 839720 830846 823667 817875 813173
58524 813173 809705 807798 807462 808570 811265 815575 820803 825925 830489 834584 838098 840706 842434 843609
58510 843609 844354 844745 845241 846270 847691 849396 852016 856000 860385 863723 866046 868552 871340 872991 872574
58495 872574 870647 867861 863972 858869 853379 848347 843882 840004 837074 835080 833511 832464 832873 835182
58481 835182 838924 844110 851771 862301 874367 886319 897684 908345 917280 923227 925870 925413 921662
58468 921662 914615 905468 895964 886944 878144 869118 859776 850432 841889 835156 830704 828405 828319 830798 835552
58453H35552N971O587P448Q021O988M374J594n17k200l476l910l680l462l271
58439H56019k651j853j434r62K85J649J827J193J460L006M430M984N590O939Q360
58424H88842R195R724J0136R926Q979P971P186O100M627L601L535L908M077L935
58410I81742L333J840n74l329n822p583q085p362o484o348o355n398l739k568
58396I23268k043j304j94N31O02M35J05n15r28p01o08j537k760k933k296k020
58380I07102j948j045L10P89O37J384L063M068M004M289N599O910P583Q344R692
58365I60781J1183J2662J4434J6000J6433J6152J6430J7048J6505J4520J2281
58354A124429J0193P640N024L658L451L062K513L143M749N416M662M175N016O469
$$ plain form
58453 835552 841523 848110 855558 863579 870567 874941 876535 876018 873818 870342 866432 862752 859290 856019
58439 856019 853368 851515 850081 849119 849404 851053 852880 854073 855533 858539 862969 867953 873543 880482 888842
58424 888842 898037 907761 917897 927823 936802 944773 951959 958059 962686 966287 969822 973730 977807 981742
58410 981742 985075 986915 986341 983012 977190 969607 961522 954160 947676 941328 934973 929575 925836 923268
58396 923268 921225 919921 919727 920258 920860 921295 921400 920885 919957 919256 918648 917111 914351 911418 909122 907102
58380 907102 905154 904109 904419 905208 905845 907229 910292 914360 918364 922653 928252 935162 942745 951089 960781
58365 960781 971964 984626 999060 1015060 1031493 1047645 1064075 1081123 1097628 1112148 1124429
58354 1124429 1134622 1142262 1147286 1150944 1154395 1157457 1159970 1163113 1167862 1173278 1177940 1182115 1187131 1193600
58340A193600Q100J0348J2637J3577J3511J4287J6055J7082J7037J7446J8367
58329A352047J7844J5472J3299J2213J0696Q225O587O486O110M618L848M877N983
58316A468305N896O069P756R636J0384J0938J2171J2914J2389J2191J3737J5914
58304A598300J7203J8019J9058J9543J8910J8291J8665J9390J9913K0852K2234
58293A810378K2949K3005K3864K5568K6289K5761K6027K7719K8906K8925K9754
58282B099145L1989L3238L2528L2606L5588L9725M2766M5100M7324M8195M7457
58271B535661M7376M9057N0640N1326N3427N7932O1951O3435O4558O7535P0878
58260C173776P2859P4774P7608P9254P8449P7657P8717P9601P8923P9518Q3692
$$ plain form
58340 1193600 1201700 1212048 1224685 1238262 1251773 1266060 1282115 1299197 1316234 1333680 1352047
58329 1352047 1369891 1385363 1398662 1410875 1421571 1429796 1436383 1442869 1448979 1453597 1457445 1462322 1468305
58316 1468305 1474201 1480270 1488026 1497662 1508046 1518984 1531155 1544069 1556458 1568649 1582386 1598300
58304 1598300 1615503 1633522 1652580 1672123 1691033 1709324 1727989 1747379 1767292 1788144 1810378
58293 1810378 1833327 1856332 1880196 1905764 1932053 1957814 1983841 2011560 2040466 2069391 2099145
58282 2099145 2131134 2164372 2196900 2229506 2265094 2304819 2347585 2392685 2440009 2488204 2535661
58271 2535661 2583037 2632094 2682734 2734060 2787487 2845419 2907370 2970805 3035363 3102898 3173776
58260 3173776 3246635 3321409 3399017 3478271 3556720 3634377 3713094 3792695 3871618 3951136 4034828
58249D034828Q8997R2723R6588J02845J09701J14923J20196J27496J34974J40756
58239E164027J46987J55759J65025J72947J82015J94240K06713K16871K27705
58230F832289K42607K59547K75662K92920L13670L35381L55759L78284M06590
58221I692709M38183M69893N04484N45477N90766O38052O91033P53270Q21960
58212A5145827Q95144R78606J077746J189748J312416J453435J621559J816735
58204B5491216K039634K302962K622398L005862L465348M030909M740280N626513
58196E3325122O733510Q134327R918801J2180196J5037445J8639428K3061729
58189A47030558K8106266L3115768L6917948L8006414L5055435K7663578J6854174
$$ plain form
58249 4034828 4123825 4216548 4313136 4415981 4525682 4640605 4760801 4888297 5023271 5164027
58239 5164027 5311014 5466773 5631798 5804745 5986760 6181000 6387713 6604584 6832289
58230 6832289 7074896 7334443 7610105 7903025 8216695 8552076 8907835 9286119 9692709
58221 9692709 10130892 10600785 11105269 11650746 12241512 12879564 13570597 14323867 15145827
58212 15145827 16040971 17019577 18097323 19287071 20599487 22052922 23674481 25491216
58204 25491216 27530850 29833812 32456210 35462072 38927420 42958329 47698609 53325122
58196 53325122 60058632 68192959 78111760 90291956 105329401 123968829 147030558
58189 147030558 175136824 208252592 245170540 283176954 318232389 345895967 362750141
58182C62750141M804163o163468j4600710k0239240k3554786k5164637k5532013
58175B52299450k4969803k3704807k1894172j9638733j7021803j4141716j1125547
58168A19802869q154477n507199l557104k644834k855802l881808n142599o114838
58160H1944208o590720o657151o486172o184694n799399n367963m919446m458231
58152C5480432l983433l512801l070151k663662k292917j964468j684591j446773
58144A4861636j240816j066602r26914q14754p19751o40541n79905n33333m92547
58135G846473m55299m22727l91922l59627l28697l02739k78699k52133k25419
58126D829211k03409j85347j68399j55004j49050j48077j46347j42721j39133
$$ plain form
58182 362750141 367554304 361390836 346790126 326550886 302996100 277831463 252299450
58175 252299450 227329647 203624840 181730668 162091935 145070132 130928416 119802869
58168 119802869 111648392 106141193 102584089 99939255 97083453 93201645 88059046 81944208
58160 81944208 75353488 68696337 62210165 56025471 50226072 44858109 39938663 35480432
58152 35480432 31496999 27984198 24914047 22250385 19957468 17993000 16308409 14861636
58144 14861636 13620820 12554218 11627304 10812550 10092799 9452258 8872353 8339020 7846473
58135 7846473 7391174 6968447 6576525 6216898 5888201 5585462 5306763 5054630 4829211
58126 4829211 4625802 4440455 4272056 4117052 3968002 3819925 3673578 3530857 3391724
58117C391724j34465j26627j17921j11876j07112j00166r2048q6183q2193p7360
58107B355773p2181o8931o6704o3191n9540n8322n8480n7265n5388n5282n5877
58096A684612n4058m9997m6313m3169l8804l3753l0127k7634k4457k1071j9273
58085A295956j8551j7273j6293j7411j9478j9999j9541k0579k2813k3677k2831
58074A077510k2252k2352k1664k0126j9163j8706j7344j5208j3811j3256j2354
58063H81274j1076j0311r781q729q014q924j0604j1210j0849j0833j0980j0219
58051G59744q996q448q094o946n929o496p799p979p423p824q904q988q180q050
58037F49688q692q821q272p855p383o388n974p280q892q629p115o622p223p159
$$ plain form
58117 3391724 3257259 3130632 3012711 2900835 2793723 2693557 2601509 2515326 2433133 2355773
58107 2355773 2283592 2214661 2147957 2084766 2025226 1966904 1908424 1851159 1795771 1740489 1684612
58096 1684612 1630554 1580557 1534244 1491075 1452271 1418518 1388391 1360757 1336300 1315229 1295956
58085 1295956 1277405 1260132 1243839 1226428 1206950 1186951 1167410 1146831 1124018 1100341 1077510
58074 1077510 1055258 1032906 1011242 991116 971953 953247 935903 920695 906884 893628 881274
58063 881274 870198 859887 850106 841377 833363 824439 813835 802625 791776 780943 769963 759744
58051 759744 750748 742300 734206 727260 721331 714835 707036 699057 691634 683810 674906 665918 657738 649688
58037 649688 640996 632175 623903 616048 608665 602277 596303 589023 580131 571502 564387 557765 550542 543383
58023E43383o369o340o820o027m093l050l287l115k082j679k343k617j885j265
58009D92411j282j109o44q35j475j025P70K251K485K415K925L670M311N007N332
57994E15207M535L129K440K510K326K088K974M599N073L960K832K391J400q20
57980E54644l030m120m650n419o185o648p155p741p813p369p124p079o467n431
57966D68413n082n485n334m136l046k831k688j814o58J53P29J070O74k89o72L
57950D39007P33N47k12p50q42m22P90K529L760L809L124K571K637L472M852O003
57934D71608O319O264O694P363P228O156N145M717M316L419K199Q92m83j682k484
57919E27671l294m542n742o220o431p266q439q978r066r695j0687j0808r902r117
$$ plain form
58023 543383 537014 530674 523854 517827 513734 510684 507397 504282 502200 500521 498178 495561 493676 492411
58009 492411 491129 490020 489376 488541 487066 486041 486811 489062 491547 493962 496887 500557 504868 509875 515207
57994 515207 519742 522871 525311 527821 530147 532235 535209 539808 544881 548841 551673 554064 555464 554644
57980 554644 551614 547494 542844 537425 531240 524592 517437 509696 501883 494514 487390 480311 473844 468413
57966 468413 463331 457846 452512 448376 445330 442499 439811 437997 437339 437492 438221 439291 439965 439676 439004 439007
57950 439007 439740 440287 440075 439325 438483 438061 438851 441380 445140 448949 452073 454644 457281 460753 465605 471608
57934 471608 477927 484191 490885 498248 505476 511632 516777 521494 525810 529229 531428 532320 531837 530155 527671
57919 527671 524377 519835 514093 507873 501442 494176 485737 476759 467693 457998 447311 436503 426601 417484
57905D17484q850q297p292o847p345p841p655p248p018o621n921n336m852l938
57891C22423k705j816j152K0J501K338K618L365M551N050M846N229O309O476N074
57876C64127L566L140L047K403J772J749J652R24L24M65N67q9p98q44r45j924
57860C79136l078l276k668j953r86M71J528J223K09M0J110K439L169L358L535
57845C84257M226N471O459O164M782L686L507L309K235Q20r1o24j203j698k133
57830D19167l108m562n225m412l272l049l244k795k072k027k216j443J30J185
57816C83057J382J660K411K867K485J748J306J201J234J292J081K16j285k959
57802C97696m488n896p273q599r746j0436j0449j0040r766r699r420q864q432
$$ plain form
57905 417484 408634 400337 393045 386198 378853 371012 363357 356109 349091 342470 336549 331213 326361 322423
57891 322423 319718 317902 316750 316770 318271 320609 323227 326592 331143 336193 341039 346268 352577 359053 364127
57876 364127 367693 370833 373880 376283 378055 379804 381456 382380 382704 383169 383736 383647 382849 382005 381060 379136
57860 379136 376058 372782 370114 368161 367175 367646 369174 370397 370606 370646 371756 374195 377364 380722 384257
57845 384257 388483 393954 400413 406577 411359 415045 418552 421861 424096 424916 424825 424201 422998 421300 419167
57830 419167 416059 411497 406272 401860 398588 395539 392295 389500 387428 385401 383185 381742 381872 383057
57816 383057 384439 386099 388510 391377 393862 395610 396916 398117 399351 400643 401724 401940 400655 397696
57802 397696 393208 387312 380039 371440 361694 351258 340809 330769 321003 311304 301884 293020 284588
57789B84588p961o645m519l006l052l610l090j619o39o81p73j9J303K395K897
57774B55569L064L485M580O091P164P257O708O193O014O161O480O424N315L337
57760C33842J603P12q9j646l576m977n817o614p216o954n858m808m467m602m524
57745B75009l776k576j673j562j682j166l38n39j991l017k204l48P50N67j82r96
57729B54276j758j930j042K89R69R21R22J171J126P33O10J004J383J294Q61L76
57713B61205M0N9L39K90m60j383j737j643j665j596p09Q82K102K283J848J530
57697B61385J638K152K851L250L017K504K243K047J292P4p40p09l48k04q5N35
57681B80902J797L417M984O221P223Q657J1357J5689K1422K8151L5800M4792N5950
$$ plain form
57789 284588 276627 269982 265463 262457 259405 255795 252705 251086 250447 249766 248993 248974 250277 252672 255569
57774 255569 258633 262118 266698 272789 279953 287210 293918 300111 306125 312286 318766 325190 330505 333842
57760 333842 335445 336157 336068 334422 330846 325869 320052 313438 306222 299268 293410 288602 284135 279533 275009
57745 275009 271233 268657 266984 265422 263740 262574 262236 261697 259706 256689 254485 254137 254887 255454 255272 254276
57729 254276 252518 250588 249546 249835 250804 251725 252647 253818 254944 255677 256287 257291 258674 259968 260829 261205
57713 261205 261245 261304 261643 261933 261473 260090 258353 256710 255045 253449 252740 253622 255724 258007 259855 261385
57697 261385 263023 265175 268026 271276 274293 276797 279040 281087 282379 282453 281713 281004 280656 280452 280367 280902
57681 280902 282699 286116 291100 297321 304544 313201 324558 340247 361669 389820 425620 470412 526362
57668E26362O9626Q4416R6785J02268R7206P9986N2012J8314j3929l9011n5379
57657A018656o4665o8886o9348o7348o4261o0539n5625m9159m1749l4565k8612
57646D13899k4370k1505j9045j6329j3670j1589r854p932n996m622l733k801j911
57633B70542j606j714j360k98P04R77O91K47k71p90j097j243j589k171k553k433
57617B56036j921j180k43O41J033P26p3r76j498j220l47J89k31j010j089l55M20
57600B48902P35O72L17k75p16p97j044j876k551k110j112j029j902k226j407p48
57584B32833j304k153j885p03N0j94q68j393j756k091k349k342j873j034l87l83
57568B12168n62m2J038J508Q30j08l94k73k70p2P51J564J323R3j029j260o84L62
$$ plain form
57668 526362 595988 680404 777189 879457 976663 1056649 1108661 1126975 1113046 1074035 1018656
57657 1018656 953991 885105 815757 748409 684148 623609 567984 518825 477076 442511 413899
57646 413899 389529 368024 348979 332650 318980 307391 297537 289605 283609 278987 275254 272453 270542
57633 270542 268936 267222 265862 265564 266268 267245 267936 268183 267912 267122 266025 264782 263193 261022 258469 256036
57617 256036 254115 252935 252692 253333 254366 255092 255019 254043 252545 251325 250978 251167 250936 249926 248837 248482 248902
57600 248902 249637 250309 250626 250351 249635 248838 247794 245918 243367 241257 240145 239116 237214 234988 233581 232833
57584 232833 231529 229376 227491 226788 226838 226644 225776 224383 222627 220536 218187 215845 213972 212938 212551 212168
57568 212168 211606 211564 212602 214110 214940 214832 214438 214165 213895 213823 214574 216138 217461 217554 216525 215265 214581 214943
57550B14943J561K411K539K288K323K662K639J940J061O37P99J339K047K589K495
57535B44273J611M41l14m01j38J25K82K78%m17m80O1O59N93J12K34J203J982J771
57516B51875J278J657K715L280L022K768K978L073K601K062K111K568K740K240
57502B86968J158j15r60q66J3R74J560J785J617Q83j63q66r30o33j51N75J230
57485B92079J201N74J60K56L06J49M88J495K038J280J09n9P60J472J608J550J409
57468C06875J000P17J217K191K534J913J200J176J673K218K660K818K398J678
57454C32268J590K526L650L998L739L675L872L641K774J999J938K261K329K189
57440C72449K367K906L256L174L080L323L632L694L736L999M060L428K543K311
$$ plain form
57550 214943 216504 218915 221454 223742 226065 228727 231366 233306 234367 235004 235803 237142 239189 241778 244273
57535 244273 245884 246325 246011 245610 245472 245597 245879 246157 246157 245740 245260 245321 245980 246573 246685 246919 248122 250104 251875
57516 251875 253153 254810 257525 260805 263827 266595 269573 272646 275247 277309 279420 281988 284728 286968
57502 286968 288126 288011 287051 286185 286198 287172 288732 290517 292134 293017 292854 291988 291058 290425 290274 290849 292079
57485 292079 293280 293854 294014 294270 294576 294725 295213 296708 298746 300026 300135 300076 300836 302308 303916 305466 306875
57468 306875 307875 308592 309809 312000 314534 316447 317647 318823 320496 322714 325374 328192 330590 332268
57454 332268 333858 336384 340034 344032 347771 351446 355318 358959 361733 363732 365670 367931 370260 372449
57440 372449 374816 377722 380978 384152 387232 390555 394187 397881 401617 405616 409676 413104 415647 417958
57426D17958K807L241L274L363L664L604K984K565K941L562L644L361L276L253
57412D63497K889K574L076M188M863M718M466M670M962M809M367M120M189M373
57398E21761M551M668M614M440M477M964N673O105O045N759N681O003O563P136
57384E98440P651Q079Q173P690O969O810P554Q539Q881Q519Q021P549O654N120
57370G04649L490K528K496L159M184N330O389P131P289O756N904N587O360P744
57356G78996Q652Q672Q501Q912R800J0531J0862J0989J0908J0418R772R641J0166
57343I06820J0601J0337R869J0099J0935J1370J0926J0277J0124J0240J0091R823
57331A031512R950J0465J0952J1325J1734J1976J1749J1477J1986J3258J4286
$$ plain form
57426 417958 420765 424006 427280 430643 434307 437911 440895 443460 446401 449963 453607 456968 460244 463497
57412 463497 466386 468960 472036 476224 481087 485805 490271 494941 499903 504712 509079 513199 517388 521761
57398 521761 526312 530980 535594 540034 544511 549475 555148 561253 567298 573057 578738 584741 591304 598440
57384 598440 606091 614170 622343 630033 637002 643812 651366 659905 668786 677305 685326 692875 699529 704649
57370 704649 708139 710667 713163 716322 720506 725836 732225 739356 746645 753401 759305 764892 771252 778996
57356 778996 787648 796320 804821 813733 823533 834064 844926 855915 866823 877241 887013 896654 906820
57343 906820 917421 927758 937627 947726 958661 970031 980957 991234 1001358 1011598 1021689 1031512
57331 1031512 1041462 1051927 1062879 1074204 1085938 1097914 1109663 1121140 1133126 1146384 1160670
57320A160670J4399J4038J3917J4066J4129J4060J4121J4549J5496J6845J7898
57309A324188J7869J6959J6353J6717J7337J7280J6767J6665J7119J7527J7623
57298A512404J7830J8470J9323J9951K0116J9881J9668J9988K0839K1545K1640
57287A731655K1518K1794K2259K2230K1733K1625K2517K4064K5471K6262K6469
57276A987597K6439K6487K6633K6680K6686K7061K7965K8971K9734L0541L1715
57265B296509L2887L3492L3697L4130L5010L6240L8023M0397M2452M3096M2700
57254B708633M2818M4123M5699M6802M8092N0304N2644N3614N2984N2049N2081
57243C249843N3268N5054N6799N8065N8790N9374O0333O1831O3650O5438O6758
$$ plain form
57320 1160670 1175069 1189107 1203024 1217090 1231219 1245279 1259400 1273949 1289445 1306290 1324188
57309 1324188 1342057 1359016 1375369 1392086 1409423 1426703 1443470 1460135 1477254 1494781 1512404
57298 1512404 1530234 1548704 1568027 1587978 1608094 1627975 1647643 1667631 1688470 1710015 1731655
57287 1731655 1753173 1774967 1797226 1819456 1841189 1862814 1885331 1909395 1934866 1961128 1987597
57276 1987597 2014036 2040523 2067156 2093836 2120522 2147583 2175548 2204519 2234253 2264794 2296509
57265 2296509 2329396 2362888 2396585 2430715 2465725 2501965 2539988 2580385 2622837 2665933 2708633
57254 2708633 2751451 2795574 2841273 2888075 2936167 2986471 3039115 3092729 3145713 3197762 3249843
57243 3249843 3303111 3358165 3414964 3473029 3531819 3591193 3651526 3713357 3777007 3842445 3909203
57232C909203O7231O6954O6677O7033O7704O7762O6830O5527O4650O4316O4021
57221D637908O3328O2254O1177O0558O0582O0936O0926N9966N7953N5127N1730
57210E292445M7939M4034M0404L7317L4829L3012L2067L2056L2701L3715L5222
57199E695741L7564M0659M3935M6986M9879N2649N4817N5864N5957N5799N5749
57188F245599N5482N4610N3314N2116N1206N0270M9047M7947M7692M8260M8433
57177F803976M6896M3807M0723L8830L7734L6287L4118L1712K9316K6506K2902
57166G192807J8825J5030J2074R951Q112N766K420j694n824r202j1356j2258j2466
57153G212185j2903j4059j5482j6376j6680j7180j8657k1233k4521k7958l1064
$$ plain form
57232 3909203 3976434 4043388 4110065 4177098 4244802 4312564 4379394 4444921 4509571 4573887 4637908
57221 4637908 4701236 4763490 4824667 4885225 4945807 5006743 5067669 5127635 5185588 5240715 5292445
57210 5292445 5340384 5384418 5424822 5462139 5496968 5529980 5562047 5594103 5626804 5660519 5695741
57199 5695741 5733305 5773964 5817899 5864885 5914764 5967413 6022230 6078094 6134051 6189850 6245599
57188 6245599 6301081 6355691 6409005 6461121 6512327 6562597 6611644 6659591 6707283 6755543 6803976
57177 6803976 6850872 6894679 6935402 6974232 7011966 7048253 7082371 7114083 7143399 7169905 7192807
57166 7192807 7211632 7226662 7238736 7248687 7256799 7262565 7264985 7263291 7257467 7248265 7236909 7224651 7212185
57153 7212185 7199282 7185223 7169741 7153365 7136685 7119505 7100848 7079615 7055094 7027136 6996072
57142F996072l3653l5870l7765l8936l8935l7928l6570l5288l4057l2773l1392
57131F602905k9777k7963k6564k6333k7260k8630k9979l1289l2149l1712k9928
57120F281321k8080k7268k6893k5367k1988j7288j1706m832L915J4458K6251L8812
57108F201335N2020O6296Q2769J02953J28136J59354J97957K45737L04598L76807
57098G917962M65866N76525P13445Q80525J081697J320995J600194J916252K261346
57089A8734807K623897K987635L330400L625775L843937L945976L878729L588540
57081D6559696L057717K336344J534857P76120J43158l41615p02605r83763j226338
57072E1153571j457233j687485j917843k144613k360307k551844k702726k799295
$$ plain form
57142 6996072 6962419 6926549 6888784 6849848 6810913 6772985 6736415 6701127 6667070 6634297 6602905
57131 6602905 6573128 6545165 6518601 6492268 6465008 6436378 6406399 6375110 6342961 6311249 6281321
57120 6281321 6253241 6225973 6199080 6173713 6151725 6134437 6122731 6117899 6121814 6136272 6162523 6201335
57108 6201335 6253355 6319651 6402420 6505373 6633509 6792863 6990820 7236557 7541155 7917962
57098 7917962 8383828 8960353 9673798 10554323 11636020 12957015 14557209 16473461 18734807
57089 18734807 21358704 24346339 27676739 31302514 35146451 39092427 42971156 46559696
57081 46559696 49617413 51953757 53488614 54264734 54407892 54066277 53363672 52379909 51153571
57072 51153571 49696338 48008853 46091010 43946397 41586090 39034246 36331520 33532225
57064C3532225k834847k809076k726305k594914k426299k232440k024333j812174
57056A4071837j605148j409984j230352j068152r24598p99808o92501o00860n23150
57047E217284m57319m00985l52371l10672k75183k44788k18553j95958j76221
57038B585234j58266j41713j27026j14284j02697r1846q2376p4776o8355o2136
57028A561759n6024n0375m5095l9968l5239l0980k6369k0383j2859m187N677J7379
57016A263336L1820N0276P4223J03698J35410J62654J77123J71622J43096R5081
57006B408339L7297j8616o4312r7040j18252j30903j37385j38806j35662j29021
56996A475639j20567j11200j00531q8302p5726o4491n4983m6437l8416l1135k4554
$$ plain form
57064 33532225 30697378 27888302 25161997 22567083 20140784 17908344 15884011 14071837
57056 14071837 12466689 11056705 9826353 8758201 7833603 7033795 6341294 5740434 5217284
57047 5217284 4759965 4358980 4006609 3695937 3420754 3175966 2957413 2761455 2585234
57038 2585234 2426968 2285255 2158229 2043945 1941248 1849402 1767026 1692250 1623895 1561759
57028 1561759 1505735 1455360 1410265 1370297 1335058 1304078 1277709 1257326 1244467 1240280 1245957 1263336
57016 1263336 1295156 1345432 1419655 1523353 1658763 1821417 1998540 2170162 2313258 2408339
57006 2408339 2445636 2427020 2362708 2265668 2147416 2016513 1879128 1740322 1604660 1475639
56996 1475639 1355072 1243872 1143341 1055039 979313 914822 859839 813402 774986 743851 719297
56985G19297j8357j2895r212p779p980r066j0929j3619j6602j8991k0301k0690
56973E52876k0573k0159j9317j7879j6006j4096j2280j0338q191o006l654n62
56961D03815L469P758J1465J4363J6390J6954J5320J1449N950m34o752j1733j4610
56948D73404j5845j6420j6617j6108j4945j3531j1825r410o413l578j249J083
56936C48546M145Q215J3150J8438K3107K6070K6608K4361J9148J1432K743n130
56924E20833j1400j6282j9890k1959k2561k2315k1642k0494j8906j7217j5563
56913C12604j3786j2027j0743r930q905p250n454m294l921l845l540k792j681
56900B24436m81N08J144J439J559J951L186N329P644R370J0563J1837J3521J5540
$$ plain form
56985 719297 700940 688045 678833 671054 663074 654008 643079 629460 612858 593867 573566 552876
56973 552876 532303 512144 492827 474948 458942 444846 432566 422228 414037 408031 404377 403815
56961 403815 407284 415042 426507 440870 457260 474214 489534 500983 506933 506499 499747 488014 473404
56948 473404 457559 441139 424522 408414 393469 379938 368113 358703 352290 348712 347463 348546
56936 348546 352691 360906 374056 392494 415601 441671 468279 492640 511788 523220 525963 520833
56924 520833 509433 493151 473261 451302 428741 406426 384784 364290 345384 328167 312604
56913 312604 298818 286791 276048 266118 257213 249963 244509 240215 236294 232449 228909 226117 224436
56900 224436 223955 224463 225607 227046 228605 230556 233742 239071 246715 256085 266648 278485 292006 307546
56886C07546J7780J9814K0478J8526J3861P592J012m865r062j0942j0941j0320
56874C60479r791r020p489n239k530N97M057P582J1137J5265K0722K7903L6423
56861D50096M4895N1320N4079N2425M5944L4415J9146L602q846j7649k4311k9246
56849F75870l1214k9930k7098k4045k0091j4444q176k712K522R301J8108K8086
56837E76177L9045N1715O5745P8570Q6599Q6765P7279N8316L2790N718j8096l6079
56825A104544m8081n5254n8921n9981n8792n5554n0751m5060l8904l2174k4466
56814E76606j5535n590M885J5758K7444M0010N2017O0700O3450N8901M6904K8571
56802I54121O829j4051l0546m1570m7981n0968n1421n0125m7677m4206l9769l4817
$$ plain form
56886 307546 325326 345140 365618 384144 398005 405597 406609 401744 392682 381740 370799 360479
56874 360479 350688 341668 334179 328940 326410 327007 331064 338646 349783 365048 385770 413673 450096
56861 450096 494991 546311 600390 652815 698759 733174 752320 755922 747076 729427 705116 675870
56849 675870 644656 614726 587628 563583 543492 529048 520872 518160 520682 529983 548091 576177
56837 576177 615222 666937 732682 811252 897851 984616 1061895 1120211 1153001 1158719 1140623 1104544
56825 1104544 1056463 1001209 942288 882307 823515 767961 717210 672150 633246 601072 576606
56814 576606 561071 555481 560366 576124 603568 643578 695595 756295 819745 878646 925550 954121
56802 954121 960950 946899 916353 874783 826802 775834 724413 674288 626611 582405 542636 507819
56790E07819k9758k4331j8062j1195m551J583P878J5096K2942K9729L3083L1292
56778E61525K4508J4549L444p606j7712k5581l0189l1962l2423l2553l1999l0077
56766C63924k6974k3652k0879j8718j6885j5264j3881j2504j0770q897p778p815
56754A79907p946o720m258k208j621j827j785j462j192p50NL01n71j927k471k104
56738A43371j876k249k525k116j413j089j199j295r43m2J011J502J133M59Q7j90
56722A32626p69j131l88J101J789J003j12k15M45O47M6m52p0Q41J362J136O54
56705A38513M96O22O02L37J41O4l24j167j819j574n84M49J161J519J304M16n01
56688A39655o10j09n2q12j563j536r99n53j78M18R79R77M18j44l58l42k34P8O19
$$ plain form
56790 507819 478061 453730 435668 424473 419922 421505 429383 444479 467421 497150 530233 561525
56778 561525 586033 600582 604026 596420 578708 553127 522938 490976 458553 426000 394001 363924
56766 363924 336950 313298 292419 273701 256816 241552 227671 215167 204397 195500 187722 179907
56754 179907 171961 165241 160983 158775 157154 155327 153542 152080 150888 150138 150143 150444 149873 147946 145475 143371
56738 143371 141495 139246 136721 134605 133192 132103 130904 129609 128666 128624 129635 131137 132270 132729 132816 132626
56722 132626 131857 130726 130338 131439 133228 134231 134119 133904 134349 134996 135042 134590 134520 135361 136723 137859 138513
56705 138513 139009 139631 140233 140570 140711 140775 140451 139284 137465 135891 135307 135756 136917 138436 139740 140156 139655
56688 139655 139045 138936 138884 138072 136509 134973 133974 133421 133243 133661 134640 135617 136035 135891 135533 135191 134957 135035 135654
56669A35654J006P82Po41n96r1J50r9k83K2M21L18o1O7R37J929K334J961R95r5
56649A44717n31K59J807K824K553J525P51N64O33O75O86O55N03L05K32K52J21
56632A58531k73p12q91p08l03J49N15O70N83M86P11J214J451J056M20K18N14Q20
56614A64451R61J187J428J224O54O00J586K947L606L266K337J234K82j88k43m50
56598A84882j040j407j065m94l93n46l07K72O63R10J454K094K118J396N44M9p8
56581A89052P9L07P7p53j319p09O47J504J500J282J137P53L58P58J890K633K472
56564B01668K324L189M932O831Q542R986J1061J1796J2180J1737J0083Q021O905
56551C09255O753O188M641L273L003K982K071O49j60k74m05o94q09j042k086l778
$$ plain form
56669 135654 136660 137442 137449 136808 136212 136121 136271 136172 135889 135911 136332 136650 136589 136656 137593 139522 141856 143817 144812 144717
56649 144717 144186 144445 146252 149076 151629 153154 153905 154469 155102 155777 156463 157118 157621 157926 158158 158410 158531
56632 158531 158258 157546 156655 155947 155644 155793 156308 156978 157561 158047 158758 159972 161423 162479 162899 163117 163631 164451
56614 164451 165412 166599 168027 169251 169905 170505 172091 175038 178644 181910 184247 185481 185763 185575 185332 184882
56598 184882 183842 182435 181370 180876 180483 179937 179630 179902 180565 181475 182929 185023 187141 188537 189081 189130 189052
56581 189052 189131 189438 189515 188762 187443 186734 187381 188885 190385 191667 192804 193557 193915 194673 196563 199196 201668
56564 201668 203992 207181 212113 218944 227486 237472 248533 260329 272509 284246 294329 302350 309255
56551 309255 316008 322196 326837 330110 333113 336095 338166 338815 338655 338381 337976 337282 336473 335431 333345 329567
56535C29567n087n415n232n361o120p186p925p838o997n904m967m328m191m653
56521B48363n158m865l862l210l363l484k846k064k051k534k578k081j794k081
56507B06392k489k471j887r54j68l7m73p82n97l81n92r40r80q91r59r06l91K91
56489A90785P32J130J675J807R88j90o43k73J49K78M46P03O17O7n38q87r73o50
56471A95223K36J318J892J770J387J082P69K86l51r82j207n56P72J701J443N92
56455B05375L42R29J544J577J131N07K7K16J275K377K415J500Q63J141J612J425
56439B24256P34K56K81N72P92O58P7o21r03o74m06m80p16o86j87O28J372J619
56421B26572J226N10p6m08o01o69n46l25j13J96O97J167J316J156Q45L88j77n83
$$ plain form
56535 329567 324480 319065 313833 308472 302352 295166 287241 279403 272406 266502 261535 257207 253016 248363
56521 248363 243205 238340 234478 231268 227905 224421 221575 219511 217460 214926 212348 210267 208473 206392
56507 206392 203903 201432 199545 198591 198423 198386 197913 197131 196534 196153 195561 194621 193641 192750 191791 190885 190494 190785
56489 190785 191517 192647 194322 196129 197117 196927 196284 196011 196160 196438 196884 197587 198204 198271 197733 196846 195873 195223
56471 195223 195459 196777 198669 200439 201826 202908 203677 203963 203612 202630 201423 200867 201639 203340 204783 205375
56455 205375 205717 206646 208190 209767 210898 211405 211432 211648 212923 215300 217715 219215 220078 221219 222831 224256
56439 224256 224990 225246 225527 226099 226891 227549 227626 227005 226102 225428 225022 224542 223826 223140 222953 223581 224953 226572
56421 226572 227798 228308 228232 227824 227223 226554 226008 225683 225570 225766 226463 227630 228946 230102 230947 231335 231158 230575
56403B30575p01q19j136j313r51k31M14Q43J022P61K55L45J376K307J957P53J93
56386B35650O96J215R94N55N91R22J096J190J451J680J554J182R98J275J948K679
56370B55676K954K490J600Q62M94L13K66M80Q78J182J273J163P29l6o23m77J77
56353B69401N47L10j19l53m72o19o83n48l27j69j10m3L02J128K046K224J457O81
56335B74653Q18J550J908J684J382J212J076J319K383L751M306L798L072K763
56321C05675K696K668K792K856K273J022j51p62j048j191q75N2J106J728J786
56306C20627J363O35J47M81J451K217K389K400K589K639K189J408O70J09k17k27
56290C40870O7N94J388K274K658K238J671J768K251K208J582J226J537K101K683
$$ plain form
56403 230575 229874 229055 227919 226606 225655 225424 225838 226681 227703 228464 228719 229064 230440 232747 234704 235457 235650
56386 235650 236346 237561 238555 239110 239701 240623 241719 242909 244360 246040 247594 248776 249774 251049 252997 255676
56370 255676 258630 261120 262720 263582 264076 264389 264655 265135 266013 267195 268468 269631 270360 270324 269701 269224 269401
56353 269401 269948 270258 270139 269786 269314 268695 268012 267464 267137 266968 266858 266815 267117 268245 270291 272515 273972 274653
56335 274653 275471 277021 278929 280613 281995 283207 284283 285602 287985 291736 296042 299840 302912 305675
56321 305675 308371 311039 313831 316687 318960 319982 319831 319069 318021 316830 315955 316007 317113 318841 320627
56306 320627 321990 322625 322772 323253 324704 326921 329310 331710 334299 336938 339127 340535 341205 341314 341097 340870
56290 340870 340937 341531 342919 345193 347851 350089 351760 353528 355779 357987 359569 360795 362332 364433 367116
56275C67116L439M038L760K795K342K990L964M398M374M320M268M217M448N050
56261D21519N775O611P767Q928R460R471R717J0314J0706J1175J2932J6170J9290
56248E59835K0965K1819K3242K5454K7715K9585L1060L2096L2853L3768L4666
56237H73058L4402L2205K8753K5161K1476J7004J1606N916N46m234q382j2149
56225A025362j5940j9592k2301k3637k4197k4764k5351k5513k5122k4267k2936
56214G71742k1292j9863j8983j8338j7419j6063j4395j2665j1313j0622j0187
56203F00602r346q221p552p436p094o153n158m481l726k636j680j260j108q92
56189E33859o28j85P14J648J734J076Q61J557K168J919J407J372J467J220J120
$$ plain form
56275 367116 370555 374593 378353 381148 383490 386480 390444 394842 399216 403536 407804 412021 416469 421519
56261 421519 427294 433905 441672 450600 460060 469531 479248 489562 500268 511443 524375 540545 559835
56248 559835 580800 602619 625861 651315 679030 708615 739675 771771 804624 838392 873058
56237 873058 907460 939665 968418 993579 1015055 1032059 1043665 1049581 1050127 1045893 1037511 1025362
56225 1025362 1009422 989830 967529 943892 919695 894931 869580 844067 818945 794678 771742
56214 771742 750450 730587 711604 693266 675847 659784 645389 632724 621411 610789 600602
56203 600602 591256 583035 575483 568047 560953 554800 549642 545161 541435 538799 537119 535859 534751 533859
56189 533859 533231 533046 533760 535408 537142 538218 539079 540636 542804 544723 546130 547502 548969 550189 551309
56174E51309J726K524K696K351K111K110K204K534L123L513L510L631M296N192
56160E92830N901O397O574O241N992O915Q879J0294J0319J0087J0936J2603J4094
56147G08062J5211J6194J6903J7450J8643K0843K3180K4818K6116K7773K9902
56136I45095L2866L7852M5582N5419O6701P9818R4941J10729J25269J37081J44352
56125A875705J44772J37854J26351J14006J02712R2928Q5271P9810P4606O6888
56115B900903N5445M0925K4753R052l472j1315j5641j9089k3939l2141m5436o3598
56103B816447q3437j01118j14887j24529j29484j29212j24532j16991j07507r6770
56093A687980q5957p5777o5777n5830m6965l9612l2522k4982j8444j4167j0888
$$ plain form
56174 551309 553035 555559 558255 560606 562717 564827 567031 569565 572688 576201 579711 583342 587638 592830
56160 592830 598731 605128 611702 617943 623935 630850 639729 650023 660342 670429 681365 693968 708062
56147 708062 723273 739467 756370 773820 792463 813306 836486 861304 887420 915193 945095
56136 945095 977961 1015813 1061395 1116814 1183515 1263333 1358274 1469003 1594272 1731353 1875705
56125 1875705 2020477 2158331 2284682 2398688 2501400 2594328 2679599 2759409 2834015 2900903
56115 2900903 2956348 2997273 3022026 3031078 3027606 3016291 3000650 2981561 2957622 2925481 2880045 2816447
56103 2816447 2733010 2631892 2517005 2392476 2262992 2133780 2009248 1892257 1784750 1687980
56093 1687980 1602023 1526246 1460469 1404639 1357674 1318062 1285540 1260558 1242114 1227947 1217059
56082A217059o923l007p72K94J935M246O076P356Q743R898J0319J0985J2896J4917
56068A294022J5393J4975J5440J6669J7213J7045J7167J7315J6582J5607J5652
56057A473080J6130J5579J4371J3996J4386J4499J4760J6230J8089J8786J8937
56046A648843K0344K2700K4232K4939K6244K7956K8752K9219L1244L4667L7496
56035A956636L9216M0796M1835M0995L9127L8690M0023M1277M1942M3311M5442
56024B409290M6911M7756M9609N2757N5953N9177O3522O8392P1834P3840P6390
56013C075431Q0228Q4324Q8300R2618R6765J00062J03581J08432J13184J16245
56003D059170J19409J25378J33033J39422J45086J52892J62557J71265J78988
$$ plain form
56082 1217059 1210136 1207129 1206357 1206651 1208586 1212832 1218908 1226264 1235007 1244905 1255224 1266209 1279105 1294022
56068 1294022 1309415 1324390 1339830 1356499 1373712 1390757 1407924 1425239 1441821 1457428 1473080
56057 1473080 1489210 1504789 1519160 1533156 1547542 1562041 1576801 1593031 1611120 1629906 1648843
56046 1648843 1669187 1691887 1716119 1741058 1767302 1795258 1824010 1853229 1884473 1919140 1956636
56035 1956636 1995852 2036648 2078483 2119478 2158605 2197295 2237318 2278595 2320537 2363848 2409290
56024 2409290 2456201 2503957 2553566 2606323 2662276 2721453 2784975 2853367 2925201 2999041 3075431
56013 3075431 3155659 3239983 3328283 3420901 3517666 3617728 3721309 3829741 3942925 4059170
56003 4059170 4178579 4303957 4436990 4576412 4721498 4874390 5036947 5208212 5387200
55994E387200J88297J99454K10661K22483K37000K53162K68154K82710K99743
55985G548864L18749L37302L57094L82212M12221M43464M76300N14236N56981
55976A1347423O01829O50963P09424P76661Q48649R27514J019890J126681J244644
55967A9253678J377627J535440J721892J935834K184410K483304K844403L277457
55959C6614045L805236M463704N288797O321365P626775R292978J1413730J4100642
55951I8927272J7502769K1740534K6721918L1934289L6339575L8474875L6860710
55944C08501942L0708828K0579136Q400030l369831j2889268j9528996k3612016
55937C08789825k5776970k6567333k6369586k5464919k4046950k2246680k0187435
$$ plain form
55994 5387200 5575497 5774951 5985612 6208095 6445095 6698257 6966411 7249121 7548864
55985 7548864 7867613 8204915 8562009 8944221 9356442 9799906 10276206 10790442 11347423
55976 11347423 11949252 12600215 13309639 14086300 14934949 15862463 16882353 18009034 19253678
55967 19253678 20631305 22166745 23888637 25824471 28008881 30492185 33336588 36614045
55959 36614045 40419281 44882985 50171782 56493147 64119922 73412900 84826630 98927272
55951 98927272 116430041 138170575 164892493 196826782 233166357 271641232 308501942
55944 308501942 339210770 359789906 368189936 364820105 351930837 332401841 308789825
55937 308789825 283012855 256445522 230075936 204611017 180564067 158317387 138129952
55930A38129952j8007945j5834503j3758594j1845436j0138987q651252p366430
55923E2526805o264550n331457m547952l887471l329618k863920k477992k153999
55915B1669846j879236j649161j457632j294063j152165j031783r30011q39317
55907A1436478p56338o84013o22916n68293n17428m72486m34010l98670l65235
55898F617089l36211l11789k88404k64918k44290k27493k11536j95000j80017
55889D357431j67290j54401j40494j27647j16189j03522q8791p3890n8849m0982
55879C285376j9935J011J9823L7147N1752N9220N6848M5941K8267M723k1377m4642
55867C504154o3288q0660r9374j17543j32161j42376j47807j47561j42851j37121
$$ plain form
55930 138129952 120122007 104287504 90528910 78683474 68544487 59893235 52526805
55923 52526805 46262255 40930798 36382846 32495375 29165757 26301837 23823845 21669846
55915 21669846 19790610 18141449 16683817 15389754 14237589 13205806 12275795 11436478
55907 11436478 10680140 9996127 9373211 8804918 8287490 7815004 7380994 6982324 6617089
55898 6617089 6280878 5969089 5680685 5415767 5171477 4943984 4732448 4537448 4357431
55889 4357431 4190141 4035740 3895246 3767599 3651410 3547888 3459097 3385207 3326358 3285376
55879 3285376 3265441 3266452 3286275 3323422 3375174 3434394 3491242 3537183 3565450 3570173 3548796 3504154
55867 3504154 3440866 3360206 3260832 3143289 3011128 2868752 2720945 2573384 2430533 2293412
55857B293412j31777j24779j14920j04134r4097q4001p3482o4511n8376n3573
55847A389762m8640m4389m1635l9247l6161l3057l0487k7668k4432k2088k1048
55836A020910j9923j8154j7099j7270j7013j5281j3304j2143j0990r315q364r004
55824H53050j0128j0664j1166j2094j2557j2051j1567j1774j1960j1739j1745
55813G25605j1695j0134p161m987m488l644r21K318M411O057Q347J0282J0470
55800G24460R553Q802P749N224J575k023n355q684j1529j3508j5250j7024j7639
55787F66351j6137j3559j1513j0043q335o597n802o253p567r369j1051j1662j0983
55774E37480r820q528o372l140j27J479K037K253J819K28k083m439o747q737r647
$$ plain form
55857 2293412 2161635 2036856 1921936 1817802 1723705 1639704 1566222 1501711 1443335 1389762
55847 1389762 1341122 1296733 1255098 1215851 1179690 1146633 1116146 1088478 1064046 1041958 1020910
55836 1020910 1000987 982833 965734 948464 931451 916170 902866 890723 879733 870418 862054 853050
55824 853050 842922 832258 821092 808998 796441 784390 772823 761049 749089 737350 725605
55813 725605 713910 703776 696615 691628 687140 683496 682575 684893 689304 695361 703708 713990 724460
55800 724460 734013 742815 750564 755788 757363 755340 749985 741301 729772 716264 701014 683990 666351
55787 666351 650214 636655 625142 615099 606764 600167 594365 588112 580545 571176 560125 548463 537480
55774 537480 527660 519132 512760 509620 509493 510972 513009 515262 517081 517309 515226 510787 504040 495303 485656
55759D85656r492r443j0014j0196r372q609q877r422r205q705q830r174q848q035
55745C57434p423o891o017n089m431l619k448j724j967k344k029j575j677j676
55731C08524p15N56R00L79j21m91j202k083k663l205m102m834m669l940l440l125
55715B75769k528j858j557j274m23P62J807K965M456N390M782L142J745P86n22
55700B93442k284l656m117l965l718l812m573n597n693m425l141l368m615n047
55686B35431l993k525j659j299r93n82J10J301K639L259K682J302j6n85l28L7
55670B34781l78j487k193j817r93n72l70K96J446K599L505M009L789L058K930
55655B48603M142N914O973P153P007O462M989K785O08j385l505n434o382o353
$$ plain form
55759 485656 476164 466721 456707 446511 437139 428530 419653 410231 401026 392321 383491 374317 365469 357434
55745 357434 350011 343120 337103 332014 327583 323964 321516 319792 317825 315481 313452 311877 310200 308524
55731 308524 307809 308365 309265 309644 309523 309032 307830 305747 303084 299879 295777 290943 286274 282334 278894 275769
55715 275769 273241 271383 269826 268552 268129 268891 270698 273663 278119 283509 288291 291433 293178 293964 293442
55700 293442 291158 287502 283385 279420 275702 271890 267317 261720 256027 251602 248461 245093 240478 235431
55686 235431 231438 228913 227254 225955 224962 224380 224490 225791 228430 231689 234371 235673 235657 235072 234744 234781
55670 234781 234403 232916 230723 228906 227913 227341 226971 227267 228713 231312 234817 238826 242615 245673 248603
55655 248603 252745 258659 265632 272785 279792 286254 291243 294028 294636 293251 289746 284312 277930 271577
55641B71577o278o773p533p986p828o972n627m435l853l576l081k540k470k746
55627A99879k698k117j465j171j345j946k637k675j724n72k69o95p95j77L72J09
55611A80074p17j351j453j227j021j067j358j650j670j395j096j118j594k161
55597A61196k124j214j36J76k31m90k39L9J05M00J019J268P84K62L78P94Q78O87
55579A63552N54M18K59N53J479K392K769L061L857M876N600O219P058P679P442
55564B17768O465N120L238P14j629k807k958l018l516m447n711o861o999n950
55550A89409m945n076n651n211l728k565k552l210l764l808l185k100j281j174
55536A41159j293r97m68j43J68O09M94o24j702j446k98K70M8Q7O44Q30K82k87
$$ plain form
55641 271577 265299 258526 250993 243007 235179 228207 222580 218145 214292 210716 207635 205095 202625 199879
55627 199879 197181 195064 193599 192428 191083 189137 186500 183825 182101 181529 181260 180565 179770 179593 179965 180074
55611 180074 179357 178006 176553 175326 174305 173238 171880 170230 168560 167165 166069 164951 163357 161196
55597 161196 159072 157858 157722 157898 157667 157177 156938 156977 157082 157482 158501 159769 160553 160815 161193 161987 162865 163552
55579 163552 164106 164524 164783 165336 166815 169207 171976 175037 178894 183770 189370 195589 202647 210326 217768
55564 217768 224233 229353 232591 233305 231676 228869 225911 222893 219377 214930 209219 202358 195359 189409
55550 189409 184464 179388 173737 168526 164798 162233 159681 156471 152707 148899 145714 143614 142333 141159
55536 141159 139866 138869 138401 138258 138426 139035 139529 138905 137203 135757 135459 135729 135777 135864 136508 137338 137620 137333
55518A37333m46n58p28n85l31o99j604k057j695j276j285j240p39j04M11J052
55502A25449J761J930J362O93M02K07k26p04r23q39m63Q2K89j70p11n16J57L89
55484A28169K71P42J705J711J30j663k060j110N1P51R58O48m5n40l79J33L66J28
55466A29966l57q54j134r38l09L07N13L28N4K0L88R30J071N92Mj85k04l89l49
55447A29454L78J206J196O06N05R66J062O30N50R44O54q11k195k151r92Q3N45
55430A32630M85n2q37j175p02NK63K11K75L73K85K98P44J289J352R18M55L15O06
55411A37738J279J968K115J594Q31J30o10j307j497j125q48j106j452j349j010
55396A35351r28j039r80p81p33q57r66j030j112j174j187j143q69k09M82N57K9
$$ plain form
55518 137333 136887 136329 135601 135016 134685 133986 132382 130325 128630 127354 126069 124829 124090 123986 124397 125449
55502 125449 127210 129140 130502 131195 131597 131804 131578 130874 129951 129112 128649 128731 129020 128850 128139 127623 127780 128169
55484 128169 128440 129182 130887 132598 132728 131065 129005 127895 127946 128697 129655 130303 130258 129718 129339 129472 129838 129966
55466 129966 129609 128755 127621 126683 126374 126681 127194 127522 127576 127596 127984 128914 129985 130577 130581 130396 130192 129803 129454
55447 129454 129832 131038 132234 132840 133345 134311 135373 136003 136553 137497 138151 137340 135145 132994 132002 132085 132630
55430 132630 133115 133063 132226 131051 130349 130354 130617 130828 131103 131476 131761 132059 132803 134092 135444 136362 136817 137132 137738
55411 137738 139017 140985 143100 144694 145525 145655 145045 143738 142241 141116 140268 139162 137710 136361 135351
55396 135351 134423 133384 132404 131623 130890 130033 129067 128037 126925 125751 124564 123421 122552 122343 122825 123382 123411
55379A23411l18l1M23M86K87J67R1n4r5J9o6m99q26o24r7M11R57J600J927J529
55359A28698P02J04k3R2J88J17j93o29q79q24o41m56k36l9pMK55N83N81L58M77
55338A28232R49J066M24m97j037j058p49l87l83q77j236p61J14L42J8K96J363
55321A25819J909J234L84L19L48m38j381j347o72n54j068j229o57O5M45M57J12
55304A23746m16n48r8J08n84j397j132n8N28K95J15L33K82l00o73l49J23J15j76
55285A19914k29L4M81J130J874K294K086J401N72j65o19o82n46n54p62r06p73
55268A24550l20M23J186J387P62p1k42K22M91J38l81n42m30l67l51j36L54R26
55250A27599J192Q17r7q70q55j96L42L28Q7J12M39P60Q27O13K29r9j57P9M31P13
$$ plain form
55379 123411 123093 123062 123485 123971 124258 124425 124516 124462 124367 124386 124320 123821 122995 122371 122274 122685 123642 125242 127169 128698
55359 128698 129400 129504 129481 129573 129761 129878 129685 129056 128177 127353 126712 126256 126020 125981 125974 125978 126233 126816 127397 127755 128232
55338 128232 129181 130247 130671 130174 129137 128079 127330 126943 126560 125683 124447 123686 123800 124142 124160 124456 125819
55321 125819 127728 128962 129346 129665 130013 129575 128194 126847 126175 125621 124553 123324 122667 122732 123177 123634 123746
55304 123746 123330 122782 122684 122792 122208 120811 119679 119621 120149 120444 120559 120892 121174 120874 120201 119852 119975 120090 119914
55285 119914 119685 119719 120200 121330 123204 125498 127584 128985 129557 129392 128773 128091 127545 126991 126229 125323 124550
55268 124550 124230 124653 125839 127226 127988 127917 127675 127897 128388 128526 128145 127603 127173 126806 126455 126319 126673 127599
55250 127599 128791 129608 129511 128641 127786 127590 127932 128260 128347 128459 128898 129658 130485 131098 131327 131228 131071 131150 131581 132294
55230A32294Q58Q52O23J16n27r47q81n39m01n52n33j64k0n45j089o75M58J117
55212A29445R05O44Q18Q05J63l99r7O94J171J237J166P67j16q36o59J38O94P50
55194A37290N87K40l51p56n43r4j11n32p61p20p95r28p05j80K02M43Q97J430J458
55175A36071Q39J8o19q78n04M61J251J196P48P98J239J204O30L82P65J075Q60
55158A45536N67N12K77l65q17n67p2j36q79j811k464k610k179j409p64m83l93
55141A31943k78r4J51M09M59J90r4m7J34O8n7J96N44K51n85r16k34O53P33L3p13
55120A32746j052r76m89L79J361J995J903J053n4n54q8O84Q41L73L0J13K16J19
55102A38600J17K86K54OR8P38J354J488J470J718J954J659Q91J09m67q91j126
$$ plain form
55230 132294 133152 134004 134627 134743 134216 133269 132388 131849 131448 130896 130363 130199 130179 129634 128545 127870 128328 129445
55212 129445 130350 130994 131812 132617 132780 132381 132284 132978 134149 135386 136552 137319 137203 136367 135708 135846 136540 137290
55194 137290 137877 138117 137766 137010 136467 136373 136262 135730 134969 134249 133454 132526 131821 131641 131843 132286 133183 134613 136071
55175 136071 136910 136928 136309 135431 134927 135388 136639 137835 138583 139381 140620 141824 142454 142836 143601 144676 145536
55158 145536 146103 146615 146892 146527 145710 145143 145071 144935 144056 142245 139781 137171 134992 133583 132819 132336 131943
55141 131943 131665 131571 131722 132131 132590 132780 132686 132639 132773 132841 132784 132980 133524 133775 133190 132274 132040 132693 133426 133459 132746
55120 132746 131694 130718 130229 130608 131969 133964 135867 136920 136866 136312 136224 136908 137749 138122 138152 138265 138481 138600
55102 138600 138717 139003 139257 139263 139361 140099 141453 142941 144411 146129 148083 149742 150633 150742 150275 149384 148258
55085A48258j017n54O9N56O31K74j93n36r15j428j603j049l02k72q42j040n91
55068A39446k89n63p67l22L39O27P02Q91R59O18J81K9l5k85m77l81l00m07j30
55049A39836R40K103K277J423L94k64n89n40l3M66K79m97j010p85k37M5j0j19
55031A43679j8M03R70J146N18n99j376j370q13j20N54J106J309J089P18N28N35
55014A48259M63Q3n43j108j347j243r24l98L70J119J299O56l71r97p81R1J040
54997A45668J516J333P93L41J55J60L62P67J034O85j55o86m23J34J65m29j024
54980A50396j043m17N61J409J674J284P08M71N99P51P58P50Q30Q98Q40P28O71
54963A61868O52N76M74N38P94Q10Q1j094j552n67J081J885J372M60Q6K51N30P95
$$ plain form
55085 148258 147241 146687 146756 147312 147943 148217 148024 147488 146573 145145 143542 142493 142191 141919 141077 140037 139446
55068 139446 139157 138594 137827 137505 137844 138471 139173 140064 141023 141641 141822 141851 141816 141531 141054 140673 140373 139966 139836
55049 139836 140776 142879 145156 146579 146973 146709 146120 145580 145547 146013 146292 145795 144785 144000 143763 143808 143798 143679
55031 143679 143661 144064 145034 146180 146698 146099 144723 143353 142540 142420 142974 144080 145389 146478 147196 147724 148259
55014 148259 148722 148805 148262 147154 145807 144564 143640 143242 143612 144731 146030 146686 146315 145318 144537 144628 145668
54997 145668 147184 148517 149310 149651 149806 149966 150328 151095 152129 152814 152659 151973 151550 151684 151849 151420 150396
54980 150396 149353 148936 149497 150906 152580 153864 154572 155043 155642 156393 157151 157901 158731 159629 160469 161197 161868
54963 161868 162520 163096 163570 164108 164902 165712 165793 164699 163147 162580 163661 165546 166918 167378 167464 167715 168245 169040
54945A69040J012Q69J78o88j136r26k49N41J038R96O09L81N71J089J885K989M121
54928A82320M879N410O276P452Q208Q246Q196Q537Q766Q224P060N673L851J252
54914B74350j659m055n785p235q345q608p945o945o139n645n429n418n354m985
54900A90803m398l830l259k566j864j290p13j0N61P69R49J605K669L605M121M323
54884A91475M411M629N267O261P089P534Q130R194R889R032O615L666Q16k032
54870B71976m685o444p110p372p760p996p642o834n978n264m756m486m200l514
54856A87935k531j854j752j850j812j800j973k118k139k348k845l065k520j610
54842A57718j166j380j645j362n10M42R10O14m5k37L52J007Q02k11j107j275r88
$$ plain form
54945 169040 170052 170921 171099 170411 169275 168349 168100 168641 169679 170675 171284 171665 172236 173325 175210 178199 182320
54928 182320 187199 192609 198885 206337 214545 222791 230987 239524 248290 256514 263574 269247 273098 274350
54914 274350 272691 268636 262851 255616 247271 238663 230718 223773 217634 211989 206560 201142 195788 190803
54900 190803 186405 182575 179316 176750 174886 173596 172883 172873 173434 174203 175152 176757 179426 183031 187152 191475
54884 191475 195886 200515 205782 212043 219132 226666 234796 243990 253879 262911 269526 273192 274008 271976
54870 271976 267291 260847 253737 246365 238605 230609 222967 216133 210155 204891 200135 195649 191449 187935
54856 187935 185404 183550 181798 179948 178136 176336 174363 172245 170106 167758 164913 161848 159328 157718
54842 157718 156552 155172 153527 152165 151655 152097 153007 153621 153576 153339 153691 154698 155500 155289 154182 152907 151919
54825A51919o41o9R57J957K037J045j34o42n65m97n30k89K24M65K15lK94Q54J193
54806A57790J301J363J209O65J58K31O40O35J24k04jL06M08O46J229J593J147
54789A69240K18l42j72M49J211J919K204J714P40J36M14J195J692J632J541K203
54773A85994L866N915P402P987Q243Q876R762J0099R513Q489P522O291M145J198
54759B85302j640l759n353o665p362p120o433o149o409o603o342n770m969l834
54745B06894k714k387k952l356k682j335l70o3Q6L35M56M52O67J132J538J996
54729A97697L103N011O992Q283Q892R204R191Q450O858M803K787R89p68k695m651
54714B64146o118o775o937p135p310o878n749m706m489m834m839m158l332k996
$$ plain form
54825 151919 151278 151209 152166 154123 156160 157205 157071 156429 155864 155367 154837 154548 154772 155237 155452 155449 155743 156597 157790
54806 157790 159091 160454 161663 162328 162486 162717 163357 163992 164116 163912 163911 164217 164625 165271 166500 168093 169240
54789 169240 169458 169116 168944 169393 170604 172523 174727 176441 177181 177317 177731 178926 180618 182250 183791 185994
54773 185994 189860 195775 203177 211164 219407 228283 238045 248144 257657 266146 273668 279959 284104 285302
54759 285302 283662 279903 274550 267885 260523 253403 246970 240821 234412 227809 221467 215697 210728 206894
54745 206894 204180 201793 198841 195485 192803 191468 191098 191035 191121 191456 191912 192364 193031 194163 195701 197697
54729 197697 200800 205811 212803 221086 229978 239182 248373 256823 263681 268484 271271 272260 271492 268797 264146
54714 264146 258028 251253 244316 237181 229871 222993 217244 212538 208049 203215 198376 194218 190886 187890
54700A87890l126l211k915k358j839j496j302j224j210j054n43J65N22K24l12
54685A68211l92J08O02N66Q1m14o85q29r79j089r55m16M05J086J281J057P48M61
54667A68847l3q32j526j513o67M46J084J011O50N72Q91J207J103N59j00n48o89
54650A70462o51o39p43q56p94m90ON98J088J156P04P0l38n51q02r15m55M68J103
54631A68421R81L73k94r03j298j139n20p3o6LM07M94k50j139j215p03n61r12j038
54612A60568p41n33m86o3P79J371J460J587J950J951J307P24P42Q00K05o42p94
54595A70185j85L70L72J11j0O4K28M45O38O86N87M65L61K19J1k47n21p88j041
54576A71950j247j231p71l5L53L5m34k83L04M12j38m60m4L48o0o75k84J115K240
$$ plain form
54700 187890 184764 181553 178638 176280 174441 172945 171643 170419 169209 168155 167612 167777 168299 168523 168211
54685 168211 167819 167927 168529 169095 169176 168762 168077 167248 166269 165180 164225 163809 164214 165300 166581 167638 168386 168847
54667 168847 168814 167982 166456 164943 164276 164722 165806 166817 167467 168039 168930 170137 171240 171799 171699 171151 170462
54650 170462 169811 169172 168429 167573 166779 166289 166295 166893 167981 169137 169841 169911 169573 169022 168220 167305 166850 167318 168421
54631 168421 169402 169775 169481 168578 167280 166141 165621 165548 165482 165485 165892 166386 166136 164997 163782 163079 162518 161606 160568
54612 160568 159827 159294 158808 158745 159524 160895 162355 163942 165892 167843 169150 169874 170616 171416 171621 170979 170185
54595 170185 170000 170370 170742 170853 170843 170907 171135 171580 172218 172904 173491 173956 174317 174536 174547 174300 173779 172991 171950
54576 171950 170703 169472 168701 168666 169019 169054 168620 168337 168641 169053 168915 168455 168411 168759 168699 168024 167740 168855 171095
54557A71095K222J536J077J027R97Q08N84L03k42r87j447j302q67o62n80jJ152
54540A74713K014J867J185R32J117Q54j44j011r04m6Q01J291J481J414J187J054
54524A87805J066R26N52L56N76P71N44K62M28O78K22q48j552j397r87j000j227
54507A87175j081n66k07k52m33m65l23kO04J340J636J103J50l54j39K09J59k1
54489A88533J85O16O75L52L08Q52J380J197M74N7M31J200J535J072L34J51O35
54472A99987R94O38L5lM60P45P99J168J748J670P81J75O29J431J560J203J118
54455B15138J141N72l41n75J6L48k77j224j595j485j486j595j349p71m45o35r30
54438B04507r62r83j323j651j314m06J85M8j17L85R73N86n64j099m62L41L60P4
$$ plain form
54557 171095 173317 174853 175930 176957 177954 178762 179346 179649 179407 178420 176973 175671 174804 174142 173562 173561 174713
54540 174713 176727 178594 179779 180711 181828 182682 182538 181527 180623 180577 181378 182669 184150 185564 186751 187805
54524 187805 188871 189797 190349 190705 191281 192052 192596 192858 193286 193964 194186 193338 191786 190389 189402 188402 187175
54507 187175 186094 185528 185321 185069 184636 184171 183848 183846 184450 185790 187426 188529 188679 188325 188186 188395 188554 188533
54489 188533 188718 189334 190009 190361 190669 191521 192901 194098 194572 194629 195060 196260 197795 198867 199201 199352 199987
54472 199987 200981 201619 201654 201651 202111 202856 203655 204823 206571 208241 209022 209197 209826 211257 212817 214020 215138
54455 215138 216279 216851 216510 215935 215951 216299 216022 214798 213203 211718 210232 208637 207288 206517 206072 205437 204507
54438 204507 203545 202562 201239 199588 198274 197868 198053 198101 197984 198369 199342 199928 199364 198265 197803 198144 198504 198578
54420A98578L10P24L79n75r81l46N51Q39N41J33j82l96l61L3N30P16M91J94K36
54401B01414O14Q38M97j40l18L27J340K014K068J593P68j5j90L53R54R61N56L28
54383B13962L74L77L16L80K49o91k241l218k726j158L19R89R70P37N66M16J74
54366B09795j27l70n72q32r22l78P14J397Q79l00q13k02O12O36m4o71q77r21j112
54347B05892j383j396r37j59M52N04J3p22j452k022k249k073j667j192n15L73
54331A91467Q95M08p31j238l71J057J614R12o4k56L07P82O22J07k15k83m71q96
54313A93646j171r46m15j42m67j216j819j674o20Q18J852K200K156J959J466O23
54297A96250k13o91q66r05q42p71q61q80l35N88Q93J57o85o13P1N12Q01J564K525
$$ plain form
54420 198578 198888 199612 199991 199416 198435 198089 198640 199479 200020 200153 199971 199575 199214 199247 199777 200493 200984 201178 201414
54401 201414 202028 202866 203363 203223 202905 203232 204572 206586 208654 210247 211015 211000 210810 211163 212117 213078 213634 213962
54383 213962 214336 214713 215029 215409 215658 214967 212726 209508 206782 205624 205943 206932 207902 208639 209205 209621 209795
54366 209795 209668 209298 208726 207894 206972 206594 207308 208705 209584 209284 208471 208269 208881 209517 209473 208802 207925 207004 205892
54347 205892 204509 203113 202176 202017 202469 202973 202986 202264 200812 198790 196541 194468 192801 191609 191094 191467
54331 191467 192362 192770 192039 190801 190430 191487 193101 194013 193949 193693 194000 194782 195404 195511 195296 195013 194542 193646
54313 193646 192475 191529 191114 190972 190505 189289 187470 185796 185176 185994 187846 190046 192202 194161 195627 196250
54297 196250 196037 195346 194480 193575 192733 191962 191101 190221 189886 190474 191367 191524 190839 190226 190297 190809 191610 193174 195699
54278A95699K767K250J759J399M99q10j332n98K74K37k71l01R5K18p1l61m88o07
54260B00358p20p29o88n65j61L71M08k63r25q49k50J55J60j1l22p66r57o33k91
54241A93322n64j161j233o79k99n46r56r69o47k99k5P0k89j091j741j666r51j29
54223A80147N10J041J451J440Q17r1o18m01K33O20M74P4k20l87n17m81j70J29
54205A84051J9l80m99j44J66r4o94r30n30J00N02O86Q74J020Q97N34K35J87K88
54186A86288M30O14O94L95j95n47m41m35j040j708j372L5J344J621J198Q90P63
54169A88534K90o28j421j562j050k43M35N61n2j052j623j154J67J406J651Q78
54153A85137k7k36J09K05k74q04q82p00o19m45J81R39J105O44L55P66J390J447
$$ plain form
54278 195699 198466 200716 202475 203874 204373 203563 202231 201633 201907 202144 201873 201572 201667 201885 201814 201453 200965 200358
54260 200358 199638 198909 198221 197656 197495 197866 198274 198011 197086 196237 195987 196142 196302 196291 195969 195203 194246 193613 193322
54241 193322 192758 191597 190364 189685 189386 188840 187884 186915 186268 185969 185944 186014 185725 184634 182893 181227 180276 180147
54223 180147 180657 181698 183149 184589 185406 185315 184697 184296 184529 185149 185623 185697 185477 185090 184573 184092 183922 184051
54205 184051 184070 183690 183191 183047 183213 183119 182425 181495 180965 181065 181567 182253 183127 184147 185044 185578 185813 186000 186288
54186 186288 186718 187332 188026 188421 188226 187679 187238 186803 185763 184055 182683 182718 184062 185683 186881 187771 188534
54169 188534 188824 188196 186775 185213 184163 183920 184355 184916 184864 183812 182189 181035 181202 182608 184259 185137
54153 185137 185110 184874 184983 185188 184914 184110 183228 182528 181909 181464 181645 182584 183689 184333 184688 185454 186844 188291
54135A88291R16M41M37P42J006J016N66m21j440j548l42J311K077J577O68K27
54119A95524K17J27j06r8K64N46K88m32r65o83L26J150R11k00j130j245q92n23
54101A93079QQ14J324J018L59J14J49j64o43n58m3q6q66j321p51K12P41R22J058
54082A95366Q60Q4p19r84r89j130r52R9J393J729J029M37P36J530K054K047J625
54065B04215R97M61K46K62L08M46O79N54k31r77o08P48J651J128j52q70n95J27
54047B08389P13R58Q57N65M63Q50J583K262K671K851K871K811K802K866K811K534
54031B38857K320K614L533M739N821O515O700O370N731N093M585M041L264K334
54017C02517J579J292J490J848J864J255K73m96p86r03j210j546j549j412j829
$$ plain form
54135 188291 189207 189648 190085 190827 191833 192849 193415 192994 191554 190006 189664 190975 193052 194629 195297 195524
54119 195524 195741 195868 195762 195664 195928 196474 196762 196330 195365 194682 195008 196158 197069 196869 195739 194494 193602 193079
54101 193079 193087 193901 195225 196243 196602 196716 196865 196701 196058 195500 195457 195371 194505 193184 192433 192645 193386 194308 195366
54082 195366 196226 196310 195591 194607 193618 192488 191536 191635 193028 194757 195786 196223 196959 198489 200543 202590 204215
54065 204215 205212 205673 205919 206181 206489 206935 207614 208168 207937 206960 206352 207100 208751 209879 209727 208857 208262 208389
54047 208389 209102 210060 210917 211482 211945 212795 214378 216640 219311 222162 225033 227844 230646 233512 236323 238857
54031 238857 241177 243791 247324 252063 257884 264399 271099 277469 283200 288293 292878 296919 300183 302517
54017 302517 304096 305388 306878 308726 310590 311845 312118 311622 310836 309933 308723 307177 305628 304216 302387
54002C02387l021m335n012n023m793m511m145l770l439k959k275j841k019k356
53988B52888k146j578j566k346l024k739j601k63P85J174O33n78j584j702j057
53973B35296k51J61j80j179j997j689m69L88K51o6K82Q62Q42M08L17N98P63Q91
53955B35228J391J920J658O24j95j27O66J866L265M248M044K886K027K194K690
53940B64385K566K000J922K680L730M466M882N383O227P254Q107Q645R113R838
53926C41198J0966J2614J4886J7408J9119J9074J7257J4200J0073M912m45m576
53914D76686o817p736q054p806o894n732m772l861k631j224j37M94R38J296J312
53899D25062P85j08j041j868k604l152l236k833k464k795l784m655m872m794n010
$$ plain form
54002 302387 299366 295031 290019 284996 280203 275692 271547 267777 264338 261379 259104 257263 255244 252888
53988 252888 250742 249164 247598 245252 242228 239489 237888 237625 238410 239584 240217 239639 238055 236353 235296
53973 235296 235045 235206 235026 233847 231850 230161 229692 230080 230331 230265 230547 231409 232251 232659 232976 233574 234337 235228
53955 235228 236619 238539 240197 240821 240626 240499 241165 243031 246296 250544 254588 257474 259501 261695 264385
53940 264385 266951 268951 270873 273553 277283 281749 286631 292014 298241 305495 313602 322247 331360 341198
53926 341198 352164 364778 379664 397072 416191 435265 452522 466722 476795 481707 481262 476686
53914 476686 469869 462133 454079 446273 439379 433647 428875 425014 422383 421159 421022 421516 422454 423750 425062
53899 425062 425847 425739 424698 422830 420226 417074 413838 411005 408541 405746 401962 397307 392435 387641 382631
53884C82631n429n568n411n391n668o032o410o839o951o237m833l504k718k339
53870C09301k274k665l297l503l006k317k032k159k456k874l297l379k970k415
53856B70657j999j570r84n70o68j076j310j263j211j292j318j052m94P0K68R1
53840B56279mL01O05K91m77q89o92n44r14j356j307r87r73j279j440j220p59j60
53822B44475N60J187J333Q45N0m50k98J95K73l26r82j071q58q47o14O30K434L291
53804B49827K706J855J709J782J422J189J849K953L541L639L936M452M652M497
53790B90009M393M381M275M297M527M272K978J485J073J531J467M42n20p43p85
53775C23082j150j407j171r27j181j661k026k552l448m177m161l722l526l567
$$ plain form
53884 382631 377202 371634 366223 360832 355164 349132 342722 335883 328932 322695 317862 314358 311640 309301
53870 309301 307027 304362 301065 297562 294556 292239 290207 288048 285592 282718 279421 276042 273072 270657
53856 270657 268658 267088 266104 265534 264866 263790 262480 261217 260006 258714 257396 256344 255850 255920 256188 256279
53840 256279 256275 256576 257181 257472 256995 256106 255414 254870 253956 252600 251293 250306 249333 248054 246614 245394 244635 244475
53822 244475 245035 246222 247555 248400 248450 248000 247702 247897 248170 247844 246862 245791 244933 244086 243472 244102 246536 249827
53804 249827 252533 254388 256097 257879 259301 260490 262339 265292 268833 272472 276408 280860 285512 290009
53790 290009 294402 298783 303058 307355 311882 316154 319132 320617 321690 323221 324688 325130 324610 323867 323082
53775 323082 321932 320525 319354 318427 317246 315585 313559 311007 307559 303382 299221 295499 291973 288406
53761B88406l361k882k534k416k171j644j153j036j173j124o44j4K17n4k17L28
53745B68528J334K122K718L862N826P910R431J0438J1015J0513Q323M984J777
53732C48781o99k858n003o642p176o838o464o495o600o312n741n320m994m133
53718B73506k506q85k67o86j290j500j444j328r95l71K10M33L40N9l85p18l97
53701B61776P32K103L102L680M017L973L391K581K060J932J888J657J113K54n93
53686B93666q67m57j1j17m79m33K4L74N34R25J561J827J375O22P8l10q35j420
53668B96057j747j740j597j427j154p11j50M36R58J267J151M99m90j262j324p80
53652B87986k72k13l18j35K29L05P4K9M43J005J355J485J513J460J488J933K758
$$ plain form
53761 288406 285045 282163 279629 277213 275042 273398 272245 271209 270036 268912 268268 268254 268471 268417 268200 268528
53745 268528 269862 271984 274702 278564 284390 292300 301731 312169 323184 333697 342020 347004 348781
53732 348781 348082 345224 340221 333579 326403 319565 313101 306606 300006 293694 287953 282633 277639 273506
53718 273506 271000 270115 269848 269162 267872 266372 264928 263600 262605 262234 262444 262877 263217 263276 262891 262173 261776
53701 261776 262508 264611 267713 271393 275410 279383 282774 285355 287415 289347 291235 292892 294005 294259 293666
53686 293666 292799 292342 292331 292214 291735 291302 291326 291700 292234 293159 294720 296547 297922 298544 298622 298312 297477 296057
53668 296057 294310 292570 290973 289546 288392 287681 287531 287967 288925 290192 291343 291842 291352 290090 288766 287986
53652 287986 287714 287501 287183 287048 287277 287582 287656 287685 288128 289133 290488 291973 293486 294946 296434 298367 301125
53635C01125L395L463L327L499L721L269K035P48ol99p84j013q50o35r69j791
53619C18135k280j835p37L38J126J748K208K322K101J797J562J335J142J209J637
53604C31808K259K834L186L111K473J552R31Q20Q88R12J132J570J527M42j046
53589C54399j714j296o57m50m33l82o63j408j860j287j64M23J88k11l35m20o66
53572C43064q39q57j151k011k979l268k647j600p76m93o37p80n38L1M73M66K41
53555C25699K29M79O45N20K92K52M23O52Q85J223J699K141K395K560K848L161
53539C46103L081K461J861K034L015M020M349M103L845L857M056M445N307O812
53525C99349Q650J0155J0791J0541R932R600R808J0386J1080J1794J2474J3051
$$ plain form
53635 301125 304520 307983 311310 314809 318530 321799 323834 324582 324576 324177 323393 322380 321530 320895 319926 318135
53619 318135 315855 314020 313283 313621 314747 316495 318703 321025 323126 324923 326485 327820 328962 330171 331808
53604 331808 334067 336901 340087 343198 345671 347223 348154 348974 349862 350774 351906 353476 355003 355445 354399
53589 354399 352685 351389 350732 350282 349849 349467 348804 347396 345536 344249 344085 344508 344696 344485 344150 343730 343064
53572 343064 342225 341368 340217 338206 335227 331959 329312 327712 326936 326443 325806 325026 324488 324519 324992 325458 325699
53555 325699 325928 326407 327052 327572 327864 328116 328539 329191 330076 331299 332998 335139 337534 340094 342942 346103
53539 346103 349184 351645 353506 355540 358555 362575 366924 371027 374872 378729 382785 387230 392537 399349
53525 399349 407999 418154 428945 439486 449418 459018 468826 479212 490292 502086 514560 527611
53513E27611J3727J4978J6933J8882J9867J9758J9424J9722K0659K1664K2277
53502G35502K2393K2058K1391K0606J9896J9277J8740J8447J8561J8956J9235
53491I55062J9102J8584J7897J7350J7312J8030J9219K0112K0144J9575J9152
53480A161539J9139J8983J8133J6861J5925J5590J5314J4438J2756J0303P148
53469A326129L668O87j215k392l719n580p646r599j1539j3530j5196j6118j6386
53456A227564j6527j6941j7581j8174j8618j9154k0092k1290k2079k1957k1219
53445A013932k0549k0050j9267j8217j7687j8066j8455j7653j5702j3688j2110
53434H22488j0335p917n684m797n079n033l571j156J027K586M097N996P939R417
$$ plain form
53513 527611 541338 556316 573249 592131 611998 631756 651180 670902 691561 713225 735502
53502 735502 757895 779953 801344 821950 841846 861123 879863 898310 916871 935827 955062
53491 955062 974164 992748 1010645 1027995 1045307 1063337 1082556 1102668 1122812 1142387 1161539
53480 1161539 1180678 1199661 1217794 1234655 1250580 1266170 1281484 1295922 1308678 1318981 1326129
53469 1326129 1329797 1330484 1329269 1326877 1323158 1317578 1309932 1300333 1288794 1275264 1260068 1243950 1227564
53456 1227564 1211037 1194096 1176515 1158341 1139723 1120569 1100477 1079187 1057108 1035151 1013932
53445 1013932 993383 973333 954066 935849 918162 900096 881641 863988 848286 834598 822488
53434 822488 812153 804236 798552 793755 788676 783643 780072 778916 779943 782529 786626 792622 800561 809978
53420H09978J0469J1405J2207J2814J3728J5562J7927J9508J9668J9403K0170
53409I82839K2173K4403K6062K7314K8577K9873L1042L2187L3492L4902L6260
53398A309124L7676L9508M1958M4733M7168M8695M9255M9252M9154M9204M9486
53387A815213M9977N0379N0240M9450M8442M7520M6255M3976M0820L7712L5301
53376B315285L3253L0856K7848K4443K0800J6902J2856Q997N537K242j430n825
53364B491764j0813j6079k1516k7123l2580l7383m1498m5418m9205n2055n3350
53353B104744n3712n4236n4957n4956n3947n2736n1900n0998m9619m8357m7953
53342A531373m8021m7493m5997m4113m2429m1047l9854l8647l7014l4731l2275
$$ plain form
53420 809978 820447 831852 844059 856873 870601 886163 904090 923598 943266 962669 982839
53409 982839 1005012 1029415 1055477 1082791 1111368 1141241 1172283 1204470 1237962 1272864 1309124
53398 1309124 1346800 1386308 1428266 1472999 1520167 1568862 1618117 1667369 1716523 1765727 1815213
53387 1815213 1865190 1915569 1965809 2015259 2063701 2111221 2157476 2201452 2242272 2279984 2315285
53376 2315285 2348538 2379394 2407242 2431685 2452485 2469387 2482243 2491240 2496777 2499019 2497589 2491764
53364 2491764 2480951 2464872 2443356 2416233 2383653 2346270 2304772 2259354 2210149 2158094 2104744
53353 2104744 2051032 1996796 1941839 1886883 1832936 1780200 1728300 1677302 1627683 1579326 1531373
53342 1531373 1483352 1435859 1389862 1345749 1303320 1262273 1222419 1183772 1146758 1112027 1079752
53331A079752l0404k9150k7760k5703k3223k0763j8412j6155j4216j2750j1516
53320H49700j0237q989p954o951n656m164k949k205j517l70J212K738L871M840
53306H11369O094P690R154J0080J0649J1443J2772J4440J6109J7662J9135K0459
53294I67056K1496K2221K2738K3161K3538K3897K4345K5047K6052K7061K7493
53283A234105K6897K5339K3260K1043J8848J6738J4761J2842J0845Q742O563M165
53271A424148J396j516l994n726o999q283r781j1543j3602j5691j7221j8049j9041
53258A294098k1215k4322k6965k8243k8684k9283l0168l0768l0859l0772l0701
53247I82118l0375k9585k8533k7526k6597k5681k4848k4192k3610k2946k2298
$$ plain form
53331 1079752 1049348 1020198 992438 966735 943512 922749 904337 888182 873966 861216 849700
53320 849700 839463 830474 822520 815569 809913 805749 802800 800595 799078 798708 799920 802658 806529 811369
53306 811369 817463 825153 834307 844387 855036 866479 879251 893691 909800 927462 946597 967056
53294 967056 988552 1010773 1033511 1056672 1080210 1104107 1128452 1153499 1179551 1206612 1234105
53283 1234105 1261002 1286341 1309601 1330644 1349492 1366230 1380991 1393833 1404678 1413420 1419983 1424148
53271 1424148 1425544 1424028 1420034 1414308 1407309 1399026 1389245 1377702 1364100 1348409 1331188 1313139 1294098
53258 1294098 1272883 1248561 1221596 1193353 1164669 1135386 1105218 1074450 1043591 1012819 982118
53247 982118 951743 922158 893625 866099 839502 813821 788973 764781 741171 718225 695927
53236F95927k1881k1641k1202k0295j9142j8177j7485j6691j5503j4144j3043
53225D96723j2183j1143r851q837q560q661q345p392o421o101o465p066p562p864
53211C80272p851p238n900m281l280l449m348m982m943m688m582m272l525l071
53197C13862l630m404l687j221J167J744Q12k16q37j583k650l475l600l148k439
53182B86695j753j448j642j844j523j000r91j333j049R9J016P13m12j295j607
53167B72626j683j526p26N77J482J355O97N21J056J492J148M82M41R71R85M3p52
53150B79189l27O41P36L0p0P38J040J9j115j012k51j81o38l02J038K122K032J127
53132B84816Q6p97j178o67L82R70P62M55N64P50P13P70R77O73l48j013l54Q52
$$ plain form
53236 695927 674046 652405 631203 610908 591766 573589 556104 539413 523910 509766 496723
53225 496723 484540 473397 463546 454709 446149 437488 429143 421751 415330 409229 402764 395698 388136 380272
53211 380272 372421 365183 359283 355002 351722 348273 343925 338943 334000 329312 324730 320458 316933 313862
53197 313862 310232 305828 302141 300920 302087 303831 304643 304427 303590 302007 299357 295882 292282 289134 286695
53182 286695 284942 283494 281852 280008 278485 277485 276494 275161 274112 274211 275227 275940 275528 274233 272626
53167 272626 270943 269417 268691 269268 270750 272105 272802 273323 274379 275871 277019 277501 277942 278913 279898 279941 279189
53150 279189 278862 279503 280239 280269 280199 280937 281977 281996 280881 279869 279618 279437 278799 278497 279535 281657 283689 284816
53132 284816 284902 284105 282927 282260 282642 283612 284374 284829 285393 286143 286856 287626 288603 289276 288928 287915 287561 288413
53114B88413R63k91j538j713j229j072j557k325k965l240l098k719k266j560l98
53099B63405P49R47k2j184j527j157r02j119j447j611j764k005k009j431m62K73
53083B48734L06k14n90k47N49Q09oj100j139N4J232J305O25J85J26k03r74j512
53065B47940j351q70o06m54l0N92R69R05N35l0p41j358j563j280o98n5L74K73
53047B42552l00o78k15P58J148M65m70n36L02J011Q52K65K33R69J607J282K63
53030B49508l41j8N15L77k63n38j65K72L21J72L2l21r63j413j279r22r33j200
53012B42841j116n67j40k54n88n11J46R13J134N99k07n92m29k70m92p55o30m14
52994B38668p14j418j731j277n53j43j02k90p62j399j616r17M50J714K242J872
$$ plain form
53114 288413 289376 289085 287547 285834 284605 283533 281976 279651 276686 273446 270348 267629 265363 263803 263405
53099 263405 264154 265101 265079 263895 262368 261211 260309 259190 257743 256132 254368 252363 250354 248923 248461 248734
53083 248734 249040 248826 248236 247989 248538 249347 249341 248241 247102 247156 248388 249693 250318 250503 250629 250426 249452 247940
53065 247940 246589 245719 245113 244659 244629 245221 246190 247095 247630 247600 246859 245501 243938 242658 241960 241905 242279 242552
53047 242552 242252 241574 241359 242117 243265 243730 243260 242724 243026 244037 244889 245154 245387 246356 247963 249245 249508
53030 249508 249167 249149 249664 250041 249778 249240 249075 249347 249668 249840 249872 249551 248588 247175 245896 244974 244041 242841
53012 242841 241725 241158 241018 240764 240176 239665 239811 240724 241858 242457 242250 241658 241229 240959 240467 239712 239082 238668
52994 238668 237954 236536 234805 233528 232975 232832 232730 232440 231678 230279 228663 227746 228196 229910 232152 234024
52978B34024Q80q0l26J92P99R89J028J375J785J656J018N62O68J020J221J214
52962B48025R87M06l48p35n41k19k02k62J2M06L19l61j115j466j351q94k45K39
52944B42655K05j90l27K4K85j81j129j713j538j000n99l90k07q6j44k83l97o85
52926B34300j390k224k405j509m9J013J273J154J197J319R83M1q80r98l12L66
52910B31879L68r6l14k4L52L86J37j26m14q93j426j546r20K75J505K234K219J579
52892B35175P41K33L80J038J604J434M85n62r57o70k28N9L13N11K47o21j537j793
52874B35852j313n32J17L27o4p15q01%Q74Q58K14K6O07J244J510J805K393K814
52856B45216K714K447K334K047J339O83N64O67M46jl52q57j898l088l622l377
$$ plain form
52978 234024 234904 234824 234498 234690 235489 236478 237506 238881 240666 242322 243340 243902 244570 245590 246811 248025
52962 248025 249012 249418 249070 248335 247794 247575 247373 247111 247123 247529 247848 247487 246372 244906 243555 242661 242416 242655
52944 242655 242860 242670 242343 242367 242652 242471 241342 239629 238091 237091 236492 236102 235895 235809 235665 235382 234985 234300
52926 234300 232910 230686 228281 226772 226723 227736 229009 230163 231360 232679 233662 233703 232823 231825 231513 231879
52910 231879 232247 232151 231837 231813 232165 232551 232688 232562 232148 231255 229829 228283 227363 227638 229143 231377 233596 235175
52892 235175 235916 236149 236529 237567 239171 240605 241090 240528 239571 238901 238673 238732 239045 239556 239803 239182 237645 235852
52874 235852 234539 234007 234124 234451 234387 233672 232871 232871 233745 234603 234817 234843 235450 236694 238204 240009 242402 245216
52856 245216 247930 250377 252711 254758 256097 256780 257344 258011 258457 258456 258104 257247 255349 252261 248639 245262
52840B45262k892k446j943j577j719k071j794p18K95N08K16J73O30J308J875K109
52824B37216J829J075K12l07k41L20R60J153O95j04q06j231j127O7K439M776N389
52807B52315L924J721J65o53j400k328l068l229k765k073j797k238k865k970k738
52792B30001l009l821m064k990j270pO15R81J074O82J85K12P06J027Q92N55K24
52775B21993q6k19oL31M41M39P28J241J460J154N80Rm67o40k31O24J324J322M86
52756B30483q55j941j926p90L40M38p4J7Q60J360R78N72R88J752J923J527J278
52739B36930J261R08J00n31n21j50J01J74K66L92M28L59K39L7k63n09m87j81J88
52720B38741L79K82j55q97j646j912j497q07m14l80l32k32m64j049j300p15J98
$$ plain form
52840 245262 242370 239924 237981 236404 234685 232614 230820 230102 230397 230905 231121 231294 231924 233232 235107 237216
52824 237216 239045 240120 240332 240025 239784 240104 241064 242217 242912 242808 242002 240771 239644 239711 242150 246926 252315
52807 252315 256239 257960 258125 257472 256072 253744 250676 247447 244682 242609 240812 238574 235709 232739 230001
52792 230001 226992 223171 219107 216117 214847 214840 215455 216436 217510 218192 218377 218589 219295 220322 221214 221769 221993
52775 221993 221907 221688 221682 222013 222454 222893 223621 224862 226322 227476 228056 228065 227598 226958 226727 227351 228675 229997 230483
52756 230483 229628 227687 225761 224971 225311 225749 225675 225692 226552 227912 228890 229462 230450 232202 234125 235652 236930
52739 236930 238191 239099 239199 238668 238147 237997 238098 238272 238538 238930 239358 239717 239956 239993 239730 239221 238734 238553 238741
52720 238741 239120 239402 239247 238350 236704 234792 233295 232488 232074 231694 231362 231130 230666 229617 228317 227602 227800
52703B27800N88M72N76J035J042L2j371j976j327l7R51J150P27K12L6K39N44O62
52685B31355M93J64n2N2L15L65K00L09Q62J181O17l04m23L93R84N56k17k46M54
52666B37058R34O70J07q1K45O55O86L48J71N51J120J153O57N09J240K211K501
52649B50735K124J757J548R83j98j502k290k418k180j933j812j607r70j0N52K29
52633B43008m13l11P37J886K442K651K994L291K928J752L20o71j016j135j654
52618B56809k644l300k716j071L36N03k55r44j198j319j399j096l54K64K44j84
52602B41676l58P4R07J632J755J045k52j475k028j853j312p26p7P89J843K689
52586B44329K807K100J180Q00R47Q63J98l33O0R76J261O79K67Q17J767K085J661
$$ plain form
52703 227800 228388 228860 229436 230471 231513 231545 230174 228198 226871 226834 227785 228935 229662 229874 229910 230149 230693 231355
52685 231355 231848 232012 231960 232012 232327 232692 232892 233201 234063 235244 235861 235557 235134 235527 236511 237067 236850 236604 237058
52666 237058 237992 238662 238769 238688 238933 239588 240274 240622 240793 241344 242464 243617 244274 244783 246023 248234 250735
52649 250735 252859 254616 256164 257147 256949 255447 253157 250739 248559 246626 244814 243207 242237 242227 242779 243008
52633 243008 242595 242284 243021 244907 247349 250000 252994 256285 259213 260965 261285 260614 259598 258463 256809
52618 256809 254165 250865 248149 247078 247414 247917 247662 246718 245520 244201 242802 241706 241352 241616 241860 241676
52602 241676 241318 241392 242299 243931 245686 246731 246479 245004 242976 241123 239811 239085 239008 239797 241640 244329
52586 244329 247136 249236 250416 251216 252163 253026 253224 252891 252951 253927 255188 255867 256134 256951 258718 260803 262464
52569B62464J131P76L04l73r06j131j303j530j492r52k51O9r5l51l16lK06p9q33
52550B55335j508j478o35N35J374J458P82k05p88o04k5K22j50q48j499j863j684
52533B48419q36K31P48N42K85N18R18R16O29O84J264J867J950J556J160J158J477
52516B63486J640J330Q75R68J764K611K862K615K309J965J264J84r46j866k472
52501B78589k522j810o71J07O6n47j167j454j377j099r00j020j401j672j429n33
52485B61160P19J660J714J054N46O95J018Q37M03M68R59J042N47L28Q41J330J099
52468B76420P39J192K170K639K568K924L878M231L114J320K14n9m86j635k970
52453B96259l672l528k865k122j605j392j283j030o85n25o44q41r39r99j107j214
$$ plain form
52569 262464 263595 264371 264675 264302 263396 262265 260962 259432 257940 256988 256737 256806 256711 256360 256044 256041 256247 256168 255335
52550 255335 253827 252349 251714 252249 253623 255081 255863 255658 254870 254266 254241 254463 254313 253465 251966 250103 248419
52533 248419 247583 247814 248562 249104 249389 249907 250825 251741 252370 253054 254318 256185 258135 259691 260851 262009 263486
52516 263486 265126 266456 267331 268299 270063 272674 275536 278151 280460 282425 283689 283873 282927 281061 278589
52501 278589 276067 274257 273586 273693 273759 273212 272045 270591 269214 268115 267215 266195 264794 263122 261693 261160
52485 261160 261879 263539 265253 266307 266853 267548 268566 269403 269806 270274 271233 272275 272822 273150 273991 275321 276420
52468 276420 277159 278351 280521 283160 285728 288652 292530 296761 299875 301195 301409 301350 300864 299229 296259
52453 296259 292587 289059 286194 284072 282467 281075 279792 278762 278077 277552 276908 276067 275128 274129 273022 271808
52437B71808j246j190r51m04K31M04r3o46m21N15J144O83m52j205j141p29m72
52420B65835k17L70J040J159O30Q3M2K99L92L42N17J029J636K166K579K763K797
52403B83462L291M862P111Q740Q886P840O204M059J432j000k488l181l839m638
52389C20741m995m517l591k844k533k490k369j826q87j06M0j49Q0Q89J654J924
52373B99021K037K561L493M337M618M176L106J725L89p17j471j670j293q08p56
52358C18748r97r41n82o04j283j942j931j532j350j273p21L98J569K323K471J867
52342C14220O09n97q81j30Q39J234R99O37O18J114J973K865L547M093M656N121
52326C40917N270N284N696O596P231O727N231L949L853M557M785L938K807K548
$$ plain form
52437 271808 270562 269372 268421 268017 268248 268652 268559 267913 267492 268007 269151 269834 269382 268177 267036 266307 265835
52420 265835 265618 265988 267028 268187 268817 268900 268942 269241 269633 269975 270492 271521 273157 275323 277902 280665 283462
52403 283462 286753 291615 298726 307466 316352 324192 330396 334455 335887 334887 332399 329218 325379 320741
52389 320741 315746 311229 307638 304794 302261 299771 297402 295576 294689 294583 294623 294474 294554 295443 297097 299021
52373 299021 301058 303619 307112 311449 316067 320243 323349 325074 325463 324746 323275 321605 320312 319504 318748
52358 318748 317751 316810 316228 315624 314341 312399 310468 308936 307586 306313 305592 305990 307559 309882 312353 314220
52342 314220 314829 314232 313351 313221 314060 315294 316293 316930 317548 318662 320635 323500 327047 331140 335796 340917
52326 340917 346187 351471 357167 363763 370994 377721 382952 386901 390754 395311 400096 404034 406841 409389
52312D09389L272M094M275L890L422L249L567M297M978N218N378O260P879R097
52298D78265Q868P382N582M004K560J226L15R2M65R80J109P01K53L45P45O17j78
52281E13331o94k21P26J303J554J933K225J961J533J799K688L289L306L400L862
52266E41995M089L723L448L968M870N220M845M449M625N211N565N187M198L315
52252F04708L183L665M043L961L728L653L546L111K442J799J259Q48P27R83J474
52237F43130K141L131M334N169N235M901M763M759M374L685L478M138M932M902
52223G03072M118L586L921M614M815M420M021M009M217M389M573M810M899M667
52209G64131M315M249M685N519O338O509N668M307L485L628M100M241M372N169
$$ plain form
52312 409389 412661 416755 421030 424920 428342 431591 435158 439455 444433 449651 455029 461289 469168 478265
52298 478265 487133 494515 500097 504101 506661 507887 508202 508294 508759 509739 510848 511549 511802 512147 512892 513509 513331
52281 513331 512637 512416 513142 514445 515999 517932 520157 522118 523651 525450 528138 531427 534733 538133 541995
52266 541995 546084 549807 553255 557223 562093 567313 572158 576607 581232 586443 592008 597195 601393 604708
52252 604708 607891 611556 615599 619560 623288 626941 630487 633598 636040 637839 639098 639946 640673 641656 643130
52237 643130 645271 648402 652736 657905 663140 668041 672804 677563 681937 685622 689100 693238 698170 703072
52223 703072 707190 710776 714697 719311 724126 728546 732567 736576 740793 745182 749755 754565 759464 764131
52209 764131 768446 772695 777380 782899 789237 795746 801414 805721 809206 812834 816934 821175 825547 830716
52195H30716O501P541P857P698P302O654N898N402N219N006M542L857K923J705
52181I08821M99l26r36j831l034m006m450m572m488m010l243k737k686k563j834
52166H68604p14J38L58J25n0L15J136J624J099%n64k44K06K20J65M77Q39P88N51
52147H75073O53J164J840K621L377L580K816J461K63m70r27j245j409j523j769
52132H85505k089k229j926r86N50K214L461M387N584P097Q213Q532Q565Q693Q412
52117I43983P275N938N258M872L766J969N22j55p21j553j993j363L1J437K641
52102I71907L949N611P544R373J0466J0291Q939P017M900K444l55k956m830o039
52088A028261o844p015o097m247k324j022k35N29J352J828J690J224R17Q80Q25
$$ plain form
52195 830716 837217 844758 852615 860313 867615 874269 880167 885569 890788 895794 900336 904193 907116 908821
52181 908821 909320 908994 908058 906227 903193 899187 894737 890165 885677 881667 878424 875687 873001 870438 868604
52166 868604 867890 868028 868386 868511 868461 868776 869912 871536 872635 872635 872071 871827 872033 872253 872418 872895 873734 874522 875073
52147 875073 875726 876890 878730 881351 884728 888308 891124 892585 892848 892378 891451 890206 888797 887274 885505
52132 885505 883416 881187 879261 878275 878825 881039 884500 888887 894471 901568 909781 918313 926878 935571 943983
52117 943983 951258 957196 962454 967326 971092 973061 973583 973428 972707 971154 969161 967798 967829 969266 971907
52102 971907 975856 981467 989011 998384 1008850 1019141 1028080 1035097 1039997 1042441 1042086 1039130 1034300 1028261
52088 1028261 1021417 1014402 1008305 1004058 1001734 1000712 1000477 1001006 1002358 1004186 1005876 1007100 1008017 1008897 1009722
52073A009722N49J94RN7K42M22M59L10J37K04N72J078J602K175K753L145L233
$$ plain form
52073 1009722 1010271 1010465 1010474 1010531 1010773 1011195 1011654 1011964 1012101 1012305 1012877 1013955 1015557 1017732 1020485 1023630 1026863
$$ [...]
##END NTUPLES=NMR SPECTRUM
##END=
