##TITLE=AC1672_MEXAD14363_8570953_oOEZZJ85Ot
##JCAMPDX= 6.0         $$ Bruker NMR JCAMP-DX V2.0
##DATA TYPE= NMR SPECTRUM
##DATA CLASS= NTUPLES
##ORIGIN= BRUKER
##OWNER= Administrator
$$ 1.72 TOPSPIN		Version 2.1
$$ 2014-04-11 14:05:33.250 -0700  Administrator@X
$$ Compression mode = diff/dup
##.OBSERVE FREQUENCY= 400.02188249412
##.OBSERVE NUCLEUS= ^1H
##.ACQUISITION MODE= SIMULTANEOUS (DQD)
##.ACQUISITION SCHEME= undefined
##.AVERAGES= 8
##.DIGITISER RES= 22
##SPECTROMETER/DATA SYSTEM= spect
##.PULSE SEQUENCE= zg30
##.SOLVENT NAME= COFFEE_meoh
##.SHIFT REFERENCE= INTERNAL, COFFEE_meoh, 1, 14.98509
##AUDIT TRAIL= $$ (NUMBER, WHEN, WHO, WHERE, PROCESS, VERSION, WHAT)
$$ ##TITLE= Audit trail, TOPSPIN		Version 2.1
$$ ##JCAMPDX= 5.01
$$ ##ORIGIN= Bruker BioSpin GmbH
$$ ##OWNER= Administrator
$$ $$ E:\/data/COFFEE/nmr/AC1672_MEXAD14363_8570953_oOEZZJ85Ot/10/pdata/1/auditp.txt
$$ ##AUDIT TRAIL=  $$ (NUMBER, WHEN, WHO, WHERE, PROCESS, VERSION, WHAT)
(   1,<2014-04-11 14:05:26.335 -0700>,<Administrator>,<X>,<go>,<TOPSPIN 2.1>,
      <created by zg
	started at 2014-04-11 14:04:20.100 -0700,
	POWCHK enabled, PULCHK disabled,
       configuration hash MD5:
       C8 4E 4E 5D D3 5C D8 9E 9F 52 82 E0 59 8A DE 15
       data hash MD5: 64K
       70 E1 9D BB FF 31 05 97 39 3C EC 04 DC 28 AC 00>)
(   2,<2014-04-11 14:05:29.612 -0700>,<Administrator>,<X>,<proc1d>,<TOPSPIN 2.1>,
      <Start of raw data processing
       efp LB = 0 FT_mod = 6 PKNL = 1 PHC0 = 0 PHC1 = 0 SI = 32K 
       data hash MD5: 32K
       E0 35 4B 1B 93 CC 1A 2C 6A 8A D3 F2 34 B3 CD BE>)
(   3,<2014-04-11 14:05:29.960 -0700>,<Administrator>,<X>,<proc1d>,<TOPSPIN 2.1>,
      <pk PHC0 = 94.91638 PHC1 = 0 
       data hash MD5: 32K
       DF 1C A2 74 3E F4 E8 8C 2A 5D 43 F9 23 74 11 82>)
(   4,<2014-04-11 14:05:30.066 -0700>,<Administrator>,<X>,<proc1d>,<TOPSPIN 2.1>,
      <abs ABSG = 1 
       data hash MD5: 32K
       D4 B4 41 50 FF 0C 40 E3 68 98 9A 99 E9 4C 77 3E>)
(   5,<2014-04-11 14:05:30.127 -0700>,<Administrator>,<X>,<proc1d>,<TOPSPIN 2.1>,
      <abs ABSG = 2 
       data hash MD5: 32K
       11 D9 7D 79 B7 FA 0C AA B8 56 DA CF 11 0B 7D 26>)
(   6,<2014-04-11 14:05:30.188 -0700>,<Administrator>,<X>,<proc1d>,<TOPSPIN 2.1>,
      <abs ABSG = 3 
       data hash MD5: 32K
       6E DA D9 F6 BA 20 98 8F 97 03 39 E6 E0 F0 E4 50>)
(   7,<2014-04-11 14:05:30.248 -0700>,<Administrator>,<X>,<proc1d>,<TOPSPIN 2.1>,
      <abs ABSG = 4 
       data hash MD5: 32K
       30 F5 AF 54 8C 01 5A EB 9C DE 2A E2 31 1E 7B B2>)
(   8,<2014-04-11 14:05:30.309 -0700>,<Administrator>,<X>,<proc1d>,<TOPSPIN 2.1>,
      <abs ABSG = 5 
       data hash MD5: 32K
       58 C1 6E 9D 08 F6 DF 03 74 DE C9 FD 8F A8 CE 50>)
$$ ##END=
$$ 
$$ $$ hash MD5
$$ $$ C6 07 07 31 05 56 23 29 12 81 99 CE 2C 3A 66 B2
##$RELAX= 
##$RELAX= 
##$RELAX= 
##$RELAX= 
##$RELAX= 
##$RELAX= 
##$RELAX= 
$$ Bruker specific parameters
$$ --------------------------
##$DU= <E:\>
##$EXPNO= 10
##$NAME= <AC1672_MEXAD14363_8570953_oOEZZJ85Ot>
$$ [...]
##$TP= (0..7)
150 150 150 150 150 150 150 150
##$TP07= 0
##$TPNAME0= <>
##$TPNAME1= <>
##$TPNAME2= <>
##$TPNAME3= <>
##$TPNAME4= <>
##$TPNAME5= <>
##$TPNAME6= <>
##$TPNAME7= <>
##$TPOAL= (0..7)
0.5 0.5 0.5 0.5 0.5 0.5 0.5 0.5
##$TPOFFS= (0..7)
0 0 0 0 0 0 0 0
##$TUNHIN= 0
##$TUNHOUT= 0
##$TUNXOUT= 0
##$USERA1= <user>
##$USERA2= <user>
##$USERA3= <user>
##$USERA4= <user>
##$USERA5= <user>
##$V9= 5
##$VALIST= <valist>
##$VCLIST= <CCCCCCCCCCCCCCC>
##$VD= 0
##$VDLIST= <DDDDDDDDDDDDDDD>
##$VPLIST= <PPPPPPPPPPPPPPP>
##$VTLIST= <TTTTTTTTTTTTTTT>
##$WBST= 1024
##$WBSW= 4
##$XGAIN= (0..3)
0 0 0 0
##$XL= 0
##$YL= 0
##$YMAX_a= 582953
##$YMIN_a= -495328
##$ZGOPTNS= <>
##$ZL1= 120
##$ZL2= 120
##$ZL3= 120
##$ZL4= 120
##$ABSF1= 14.98509
##$ABSF2= -5.573092
##$ABSG= 5
##$ABSL= 3
##$ALPHA= 0
##$AQORDER= 0
##$ASSFAC= 0
##$ASSFACI= 0
##$ASSFACX= 0
##$ASSWID= 0
##$AUNMP= <proc_prof1d_extract_pilot.lims>
##$AXLEFT= 0
##$AXNAME= <>
##$AXNUC= <1H>
##$AXRIGHT= 0
##$AXTYPE= 0
##$AXUNIT= <>
##$AZFE= 0.1
##$AZFW= 0.1
##$BCFW= 0
##$BC_mod= 0
##$BYTORDP= 0
##$COROFFS= 0
##$CY= 15
##$DATMOD= 1
##$DC= 0
##$DFILT= <>
##$DTYPP= 0
##$F1P= 0
##$F2P= 0
##$FCOR= 0.5
##$FTSIZE= 32768
##$FT_mod= 6
##$GAMMA= 0
##$GB= 0
##$INTBC= 1
##$INTSCL= 1
##$ISEN= 128
##$LB= 0
##$LEV0= 0
##$LPBIN= 0
##$MAXI= 10000
##$MC2= 0
##$MEAN= 0
##$ME_mod= 0
##$MI= 0
##$NCOEF= 0
##$NC_proc= -8
##$NLEV= 6
##$NOISF1= 0
##$NOISF2= 0
##$NSP= 0
##$NTH_PI= 0
##$NZP= 0
##$OFFSET= 14.98509
##$PC= 1
##$PHC0= 94.91638
##$PHC1= 0
##$PH_mod= 1
##$PKNL= yes
##$PPARMOD= 0
##$PPDIAG= 0
##$PPIPTYP= 0
##$PPMPNUM= 2147483647
##$PPRESOL= 1
##$PSCAL= 4
##$PSIGN= 0
##$PYNMP= <proc.py>
##$REVERSE= no
##$SF= 400.02
##$SI= 32768
##$SIGF1= 0
##$SIGF2= 0
##$SINO= 400
##$SIOLD= 32768
##$SPECTYP= <>
##$SREGLST= <1H.CDCl3>
##$SSB= 0
##$STSI= 32768
##$STSR= 0
##$SW_p= 8223.68421052631
##$SYMM= 0
##$S_DEV= 0
##$TDeff= 65536
##$TDoff= 0
##$TI= <>
##$TILT= no
##$TM1= 0
##$TM2= 0
##$TOPLEV= 0
##$USERP1= <user>
##$USERP2= <user>
##$USERP3= <user>
##$USERP4= <user>
##$USERP5= <user>
##$WDW= 1
##$XDIM= 32768
##$YMAX_p= 453343550
##$YMIN_p= -656884
##$CURPLOT= <Network HP LaserJet P1505>
##$CURPRIN= <$Network HP LaserJet P1505>
##$DFORMAT= <normdp>
##$LAYOUT= <+/1D_H.xwp>
##$LFORMAT= <normlp>
##$PFORMAT= <normpl>
##$SURQMSG= 1
$$ End of Bruker specific parameters
$$ ---------------------------------
##NTUPLES= NMR SPECTRUM
##VAR_NAME=  FREQUENCY,     SPECTRUM/REAL,   SPECTRUM/IMAG
##SYMBOL=    X,             R,               I
##VAR_TYPE=  INDEPENDENT,   DEPENDENT,       DEPENDENT
##VAR_FORM=  AFFN,          ASDF,            ASDF
##VAR_DIM=   32768,         32768,           32768
##UNITS=     HZ,            ARBITRARY UNITS, ARBITRARY UNITS
##FACTOR=    0.250966925370066, 1,           1
##FIRST=     8223.43324360094, -9125,        77798
##LAST=      0,             39275,           -43442
##MIN=       0,             -656884,         0
##MAX=       8223.43324360094, 453343550,    0
$$ Real data points
##PAGE= N=1
##DATA TABLE= (X++(R..R)), XYDATA
$$ [...]
19555D7241a52380A8535B794L10343a3561G8606M8771j4532a95607d0307l11830
$$ 47241 -152380 18535 2794 313137 -13561 78606 127377 112845 -195607 -40307 -352137
19544c52137B0745L57845B5653J15111c28749J4713L2103B32636d4450B35933
$$ -352137 20745 378590 25653 140764 -328749 -314036 -281933 232636 -44450 235933
19533E2533j8072E26J35378J99604c27024a13234D87598b29355G6007d36580C370
$$ 52533 34461 526 135904 335508 -327024 -113234 487598 -229355 76007 -436580 3370
19521c00287g5119K3238r7548n7133A58117a07385k28885D25998H8667a54875
$$ -300287 -75119 -51881 -149429 -206562 158117 -107385 -336270 425998 88667 -154875
19510a77656F0750a1233j54431k4414g5603p7756A61741a41268j15255A27393
$$ -177656 60750 -11233 -165664 -190078 -75603 -153359 161741 -141268 -256523 127393
19499B00355c5640j19507n625O9835B34146D5002b49344D9864L2231J3347b3676
$$ 200355 -35640 -155147 -160772 -90937 234146 45002 -249344 49864 82095 95442 -23676
19487b95769J31009G7207K6221c32206J27433C3925a25653J7168B02140a17720
$$ -295769 -164760 77207 103428 -332206 -204773 33925 -125653 -108485 202140 -117720
19476E8289b05890j0300g9872r0527p8836A3141i2735b1457k35844O3635d3996
$$ 58289 -205890 -216190 -79872 -170399 -249235 13141 -92735 -21457 -257301 -193666 -43996
19464a97029b1709l52257B78247A11689i5929d6692o097m03048J92139i2912j4340
$$ -197029 -21709 -373966 278247 111689 -95929 -46692 -52789 -455837 -263698 -92912 -107252
19453a07252A31938C9050a5674j9772m9353F3520L38001b03245k40855d2368r4704
$$ -107252 131938 39050 -15674 -35446 -84799 63520 401521 -203245 -444100 -42368 -137072
19442a37072B13482D4184b64654C20708q7460G9731b07235h5670j48585N6699
$$ -137072 213482 44184 -264654 320708 233248 79731 -207235 -85670 -234255 -177556
19432a77556D5232b63920G438a30489f0512k44998a02743L9336I8498g8446q6712
$$ -177556 45232 -263920 7438 -130489 -60512 -305510 -102743 -63407 98498 -78446 -165158
19421a65158L6117j08211B43141b46443a15950C9953K53677A04935b20632m393
$$ -165158 -129041 -237252 243141 -246443 -115950 39953 293630 104935 -220632 -225025
19411b25025l7029p3167M5683c8382m39442F5389a79294N1441F6273d64455f0402
$$ -225025 -262054 -335221 -289538 -38382 -477824 65389 -179294 -127853 66273 -464455 -60402
19399H4129c6519A53637F5979A8602a60397j25049A67844h5150j54861a917l24332
$$ 84129 -36519 153637 65979 18602 -160397 -285446 167844 -85150 -240011 -1917 -326249
19388c26249E324c5955k41652G1610J39266a87900N9418A33812Q7944p5448a26974
$$ -326249 5324 -35955 -277607 71610 210876 -187900 -128482 133812 221756 146308 -126974
19376B08218J7550e0128C19706a0692j15116j12911R8459a002C2503J43959m42
$$ 208218 225768 -50128 319706 -10692 -125808 -238719 -140260 -1002 32503 176462 176020
19365A76020a52146B33907A5506b00102N4860j45280b8634B35778A4887c47040
$$ 176020 -152146 233907 15506 -200102 -145242 -290522 -28634 235778 14887 -347040
19354b92713D3801K6455b51449a9743H5332g7124D9634b78807F6420b74965a12546
$$ -292713 43801 70256 -251449 -19743 85332 -77124 49634 -278807 66420 -274965 -112546
19342B8300N3016i7361a281k74142J3876C16702a97938h196C69556G5468e5436
$$ 28300 81316 -97361 -1281 -275423 -261547 316702 -197938 -8196 369556 75468 -55436
19330f2784J2981e388C64375j41370q3986e7134B14870a85186F9867J66645B0194
$$ -62784 -49803 -5388 364375 223005 139019 -57134 214870 -185186 69867 236512 20194
19318D7185a24596a0780A81565A7123a21156c4944k65250e107n195B3239J76449
$$ 47185 -124596 -10780 181565 17123 -121156 -34944 -300194 -5107 -10302 23239 199688
19307A99688A3646L5393k736b62443G4038b55780H8702a66155L2302B25560a99379
$$ 199688 13646 49039 46303 -262443 74038 -255780 88702 -166155 -133853 225560 -199379
19295a35161c6752A97792i411k07985A83794p5120c8527A6454M8226a8397F2860
$$ -135161 -36752 197792 -9411 -217396 183794 108674 -38527 16454 64680 -18397 62860
19283a08640A9883b4771n1022I5618L22549c16968a12708b6020A47219b90810
$$ -108640 19883 -24771 -75793 95618 418167 -316968 -112708 -26020 147219 -290810
19272c64161A44170k9304a73753L0580e875A111f8894m633j17798l13125A75035
$$ -364161 144170 114866 -173753 -143173 -5875 1111 -68894 -73527 -191325 -504450 175035
19260A47886i173A19396a23888p3885J8345d6880B26156e9924j58777O0840C6684
$$ 147886 -9173 119396 -123888 -197773 -179428 -46880 226156 -59924 -218701 -157861 36684
19248d12350B69757b24625J1896D0402A7913a00426C38652D9173j2996b49416
$$ -412350 269757 -224625 -212729 40402 17913 -100426 338652 49173 36177 -249416
19237b10031B07342C0830i831j53983a3701k48500j5528a08017B49586H6490l0000
$$ -210031 207342 30830 -9831 -163814 -13701 -262201 -277729 -108017 249586 86490 56490
19226E6490b2589B1418a20296l94392a45711j35718A0148b7242l5996H6558b37678
$$ 56490 -22589 21418 -120296 -514688 -145711 -281429 10148 -27242 -63238 86558 -237678
19214D3633j2537a81411Q2558A11505P1805b40610A00458e7638A4722c28133K5147
$$ 43633 31096 -181411 -98853 111505 183310 -240610 100458 -57638 14722 -328133 -302986
19203c02986a40560r1579p4143I8414K1739a03904L0875l43987a17181i52m62066
$$ -302986 -140560 -232139 -306282 98414 120153 -103904 -73029 -417016 -117181 -952 -463018
19192d63018J63035C4338e7601I7658b1131j11277f1586n7935A68969a00353j53353
$$ -463018 -299983 34338 -57601 97658 -21131 -132408 -61586 -119521 168969 -100353 -253706
19181b53706j7964A27232E840i4466A87726A5244b00490f7877j96729D9049a66351
$$ -253706 -271670 127232 5840 -94466 187726 15244 -200490 -67877 -264606 49049 -166351
19169a58434J3896E06K6397P345a87542E9475h9448B4406E903c34982A4385J64668
$$ -158434 -144538 506 26903 34248 -187542 59475 -89448 24406 5903 -334982 14385 179053
19157A79053D8344k2559e2607J5031a6351C7261a29770L0510j41968B57698e9316
$$ 179053 48344 25785 -52607 -37576 -16351 37261 -129770 -99260 -241228 257698 -59316
19145G7120a39651j10563I8447b57697d8121a0350k02223A23351a0419o3569L5398
$$ 77120 -139651 -250214 98447 -257697 -48121 -10350 -212573 123351 -10419 -73988 -38590
19134c8590A41018f5350j11918F6316O6510L1315b29401B01173I1424N8992a87306
$$ -38590 141018 -65350 -177268 66316 132826 164141 -229401 201173 91424 150416 -187306
19122b46859C7577h0764A15704a7237j97704F1437i3268j34604B05875A8367f1730
$$ -246859 37577 -80764 115704 -17237 -214941 61437 -93268 -227872 205875 18367 -61730
19110C0432b52886A33212A1825a6620q5728A04949b30050C2176b22482j21757
$$ 30432 -252886 133212 11825 -16620 -102348 104949 -230050 32176 -222482 -344239
19100c44239J67886n8770L7821M8641K8751k03464A45116f2155K3894C8908h8864
$$ -344239 -176353 -235123 -197302 -148661 -119910 -323374 145116 -62155 -38261 38908 -88864
19088a67519a8919j16915B65951E0842B4437K0106b96498E3537b82050A10529
$$ -167519 -18919 -135834 265951 50842 24437 44543 -296498 53537 -282050 110529
19077b22569E2878c14713d6888A04931h0262A5586c6498f498p4013b263A94357
$$ -222569 52878 -314713 -46888 104931 -80262 15586 -36498 -6498 -80511 -2263 194357
19065a12618D9318a28274B9079b1748j47020A28149M173B6820K86710H2840f6952
$$ -112618 49318 -128274 29079 -21748 -168768 128149 132322 26820 313530 82840 -66952
19053a81227B0501b55375d8286H8274l9302K2223J81749a39711P445d8443k57112
$$ -181227 20501 -255375 -48286 88274 48972 71195 252944 -139711 -132266 -48443 -305555
19042c05555B23354h126o2094q7866A91331c9552A59067b9835I6706b51723d8480
$$ -305555 223354 -8126 -70220 -158086 191331 -39552 159067 -29835 96706 -251723 -48480
19030D4952h4921A441K22826J19548F2934a17130A75603D9682J41899e1407H6405
$$ 44952 -84921 1441 224267 343815 62934 -117130 175603 49682 191581 -51407 86405
19018b24574A98210d42589B85295a08327M4963j04041g3935k3120A33162J08851
$$ -224574 198210 -442589 285295 -108327 -63364 -167405 -73935 -97055 133162 242013
19008B42013H806c48785B46302c2201k35850J6353A3094K0975L64a01486b4389
$$ 242013 8806 -348785 246302 -32201 -268051 -251698 13094 34069 34433 -101486 -24389
18996c84323d2482k65627a17778C25i7957j87462A38827a81501k8063h568A13949
$$ -384323 -42482 -308109 -117778 325 -97957 -285419 138827 -181501 -209564 -8568 113949
18984a19964A87569A2237a72561c3583C12c0496m0378n3644P887C2144f6267k22795
$$ -119964 187569 12237 -172561 -33583 312 -30496 -70874 -124518 -116631 32144 -66267 -289062
18972b89062g4409L6389j96059d56B5026P0589a88561M6403A9924a29315E9514
$$ -289062 -74409 -38020 -234079 -456 25026 95615 -188561 -142158 19924 -129315 59514
18960H1675g3583G4126c68225l6077J33323A25615d9280j5925j94470g552B9950
$$ 81675 -73583 74126 -368225 -404302 -270979 125615 -49280 -65205 -259675 -7552 29950
18948b81577A055K39810a41967k5792H3833e1303A13524J06370C4444c64913A95848
$$ -281577 1055 240865 -141967 -167759 83833 -51303 113524 219894 34444 -364913 195848
18936I8735D7283b60905C4210K04849a02581G0318a05249A20905k6635e419l25069
$$ 98735 47283 -260905 34210 239059 -102581 70318 -105249 120905 94270 -5419 -330488
18925c30488h3560a4361k8069q1658r1554M2775d1954n153a4801j22412m9996
$$ -330488 -83560 -14361 -42430 -124088 -215642 -172867 -41954 -47107 -14801 -137213 -187209
18914a87209K5590j28111f0599H5049a6777k7387A3568c6908j29855F8250b61188
$$ -187209 -161619 -289730 -60599 85049 -16777 -44164 13568 -36908 -166763 68250 -261188
18902B7912a68504k87712f2174m0660j9314k5500K2575E921g9165n480I4670a01854
$$ 27912 -168504 -456216 -62174 -102834 -122148 -147648 -125073 5921 -79165 -84645 94670 -101854
18889B08163E7505b2352k22843B15069E7772a50368D56058A0077Q7435K1788k8555
$$ 208163 57505 -22352 -245195 215069 57772 -150368 456058 10077 97512 119300 90745
18878I0745c08148A53004g825p1327j56622i7946k3429d7737a7528j90614j8357
$$ 90745 -308148 153004 -7825 -79152 -235774 -97946 -121375 -47737 -17528 -208142 -226499
18867b26499D1638f8972A52383i5430H6309B8792Q7182K5597e09935K22744A76746
$$ -226499 41638 -68972 152383 -95430 86309 28792 115974 141571 -509935 -287191 176746
18855C43544a17001A03355R0987c83568c124k49418E3952P5539P1323O0688A02788
$$ 343544 -117001 103355 194342 -383568 -3124 -252542 53952 129491 200814 261502 102788
18843b09931C7661b94749a09383A48231K39718g9560l2654M8187A51952e67128
$$ -209931 37661 -294749 -109383 148231 387949 -79560 -112214 -64027 151952 -567128
18832g5033A46725f9020k1902b5014k2571I723a43781B04418b77081P4051A64986
$$ -75033 146725 -69020 -90922 -25014 -47585 9723 -143781 204418 -277081 -203030 164986
18820D39243c37781A40936e2441p3562A10273J6258C2857e1850F1837P5726Q3371
$$ 439243 -337781 140936 -52441 -126003 110273 126531 32857 -51850 61837 137563 220934
18809B20934d6900j6566A19073b77455B57797G3238j7570a37805m2231b0805Q270
$$ 220934 -46900 -63466 119073 -277455 257797 73238 55668 -137805 -180036 -20805 -12535
18798a2535m12113A302P3300f3792l3522B2627f4779C905d43565a70665c6568
$$ -12535 -424648 1302 74602 -63792 -97314 22627 -64779 3905 -443565 -170665 -36568
18786A5015O934a55591e0628o3144M3289k40685J19288C0249a5794j72382J4503
$$ 15015 21949 -155591 -50628 -113772 -70483 -311168 -191880 30249 -15794 -188176 -173673
18775a73673M8720K4844j54383a15476B24601I3176k3524b59187g1781I1338l6588
$$ -173673 -124953 -100109 -254492 -115476 224601 93176 69652 -259187 -71781 91338 54750
18764E4750a96526j65510k28541C23192g8846k3964F2083Q6501b76673A7140b50545
$$ 54750 -196526 -362036 -590577 323192 -78846 -102810 62083 148584 -276673 17140 -250545
18752b93924A52566J57263i9432l4980C1451a46237A21917a80616o5319B92430
$$ -293924 152566 309829 -99432 -134412 31451 -146237 121917 -180616 -245935 292430
18741b00191m2574R7241e3400q8459C4973N0456b17330F6538i6325E8396M8488
$$ -200191 -242765 -145524 -53400 -141859 34973 85429 -217330 66538 -96325 58396 106884
18730A06884J030a04698I2847g8450k23944J17854A07669c9483p145j12921j47168
$$ 106884 107914 -104698 92847 -78450 -302394 -184540 107669 -39483 -46628 -159549 -306717
18719c06717l4477B19497a11778j71220h8518A49539F0303K409c267l73508a31745
$$ -306717 -341194 219497 -111778 -282998 -88518 149539 60303 62712 -3267 -376775 -131745
18707e1219J636G8895J21536f9940A33001A8621J9130J44298K7966b8353A10935
$$ -51219 -49583 78895 200431 -69940 133001 18621 37751 182049 210015 -28353 110935
18695a91393b7382J1573j20218a1944D8460c62760a30023j06965O6229D6142a3331
$$ -191393 -27382 -15809 -136027 -11944 48460 -362760 -130023 -236988 -170759 46142 -13331
18683A93641D2627b00320j26085A15285a59414A47313a10847A5778c10713r6815
$$ 193641 42627 -200320 -326405 115285 -159414 147313 -110847 15778 -310713 -407528
18673d07528a5520k51541I8243b71413g0938A54438b8196k07975J12130p0759
$$ -407528 -15520 -267061 98243 -271413 -70938 154438 -28196 -236171 -124041 -194800
18663a94800H794N3327J62131o1045f3219r4913k6167A60956b89207F5590C2299
$$ -194800 8794 62121 224252 163207 -63219 -158132 -184299 160956 -289207 65590 32299
18651a26384B20222c13224F3547b14623O5014r4445a4862o164C727L5282b38614
$$ -126384 220222 -313224 63547 -214623 -149609 -244054 -14862 -21026 3727 39009 -238614
18639b01709D3232b02362I7652b30883H4047J32854c14467J24118P0615e2714
$$ -201709 43232 -202362 97652 -230883 84047 216901 -314467 -190349 -119734 -52714
18628b76770J37670k44219a8697C5716a3802k93789M1939i7396p1348A14313c1361
$$ -276770 -139100 -383319 -18697 35716 -13802 -307591 -265652 -97396 -168744 114313 -31361
18616c94917K9331A45087A2016c36134a5246j51764B92446b74643J9837H2467
$$ -394917 -365586 145087 12016 -336134 -15246 -167010 292446 -274643 -254806 82467
18605i6824r5625k1238R9185a6287F8372M7283n914b69944b000i90A68922b4843
$$ -96824 -192449 -213687 -114502 -16287 68372 115655 109741 -269944 -2000 -990 168922 -24843
18592a44420j43071D6918J22133b02292B20450A5582j573J31260e5323k8160n6830
$$ -144420 -287491 46918 169051 -202292 220450 15582 14009 145269 -55323 -83483 -140313
18581a40313B8808K4560c06352B38260A1887b77394j8279K9533A2275K52247a93239
$$ -140313 28808 53368 -306352 238260 11887 -277394 -295673 -266140 12275 264522 -193239
18569D313c61561a78340o3081e6415B36508e3169o393A86052o3255l3527b04856
$$ 4313 -361561 -178340 -241421 -56415 236508 -53169 -59562 186052 122797 89270 -204856
18557d2325k88523J45355A04506a36190e4071r5506N147D344c02881a10444C2525
$$ -42325 -330848 -185493 104506 -136190 -54071 -149577 -144430 4344 -302881 -110444 32525
18545a81987k3440E4160J07612c9612j65988G8271N6914M8230b81956a4648j77547
$$ -181987 -205427 54160 161772 -39612 -205600 78271 135185 183415 -281956 -14648 -192195
18534a92195i5774j42066C10464c56168c6271j78342F0962d2307j08176j53032
$$ -192195 -95774 -237840 310464 -356168 -36271 -214613 60962 -42307 -150483 -303515
18524c03515d9554k73909I7102q098Q3894Q730a07444c2892F7222a46333c4898
$$ -303515 -49554 -323463 97102 89004 172898 181628 -107444 -32892 67222 -146333 -34898
18512b82881A11190l6995a68969k20876a04833j80783i1888k00477B08717L0783
$$ -282881 111190 74195 -168969 -389845 -104833 -285616 -91888 -292365 208717 239500
18502B39500j0240n0117a96396A92520a53684e8139j36031a1538l63003A54099
$$ 239500 229260 179143 -196396 192520 -153684 -58139 -194170 -11538 -374541 154099
18491b25756C7233a09432C10058g4858A09880j782a57539f1044A40032b53250
$$ -225756 37233 -109432 310058 -74858 109880 108098 -157539 -61044 140032 -253250
18480c0342C65285I3040c3340k89640c6158j5979A14394L7403d3506F2002d30257
$$ -30342 365285 93040 -33340 -322980 -36158 -52137 114394 151797 -43506 62002 -430257
18468a91430L4750J989A04985K45895j72021a8173B7632h3394l93239A3511K7715
$$ -191430 -156680 -154691 104985 350880 178859 -18173 27632 -83394 -476633 13511 41226
18457D1226K62691E0400a05680q6276g4160r3097A55800J8740a54876O0661C1171
$$ 41226 303917 50400 -105680 -191956 -74160 -167257 155800 174540 -154876 -94215 31171
18445e032j75286k22565f9166o5656e7808p5234J4476K4644f56H80b56568I1356
$$ -5032 -180318 -402883 -69166 -134822 -57808 -133042 -118566 -93922 -656 880 -256568 91356
18432a96155A31498C9476J233c29905a63775g7018r046G6452M1152d2365o8455
$$ -196155 131498 39476 40709 -329905 -163775 -77018 -86064 76452 117604 -42365 -110820
18421a10820n2715k2842r6737B41466b05952a8910F5800J73191k3219M0821a59415
$$ -110820 -163535 -186377 -283114 241466 -205952 -18910 65800 238991 215772 256593 -159415
18409e4319l6047E7746J36286K44635h6524k3789p1816B8232b27535B7527L38757
$$ -54319 -90366 57746 194032 438667 -86524 -110313 -182129 28232 -227535 27527 366284
18398C66284a22585n4790O1033B6729b25175j14063J35723f8504D2161a84235
$$ 366284 -122585 -177375 -116342 26729 -225175 -339238 -203515 -68504 42161 -184235
18387A38770a13852n1396B25194b39364Q468F6303a7802D408f9757j39061Q6223
$$ 138770 -113852 -165248 225194 -239364 -230896 66303 -17802 4408 -69757 -208818 -122595
18376a22595B1474K17678D1891a37173B62281A10135g2354I5071h6892C2456b1272
$$ -122595 21474 239152 41891 -137173 262281 110135 -72354 95071 -86892 32456 -21272
18364e5254j47398i4492c7715j15136f8649E2518d0912A78J34838C9378b68173
$$ -55254 -202652 -94492 -37715 -152851 -68649 52518 -40912 178 135016 39378 -268173
18352b31412C58429i0940k66410B14255B6027a91817K7037j52211J08499c8113
$$ -231412 358429 -90940 -357350 214255 26027 -191817 -164780 -316991 -208492 -38113
18341H8985b14152A2522a14477J3777q939j17808k9386B04781n1805c33645A69919
$$ 88985 -214152 12522 -114477 -100700 -109639 -227447 -256833 204781 152976 -333645 169919
18329f3169L1521F0621J67112f3694A05423F578b43778f9714b288A72137C3421
$$ -63169 -31648 60621 227733 -63694 105423 6578 -243778 -69714 -2288 172137 33421
18317I3664m1288A7451a07147I259j253b30624A35422b26768B46054a90792B1455
$$ 93664 52376 17451 -107147 9259 8006 -230624 135422 -226768 246054 -190792 21455
18305i3022L0920j73257P2765A52551b56203C5563i2122K2434E0380a05324r387
$$ -93022 -62102 -235359 -162594 152551 -256203 35563 -92122 -69688 50380 -105324 -114711
18294a14711B2890i5977l34459a36788F8187j1350a9366l12740p5279f1860j74934
$$ -114711 22890 -95977 -430436 -136788 68187 56837 -19366 -332106 -407385 -61860 -236794
18283b36794a4995A27669e3866o6619A71704g1706A6099d5315I2480a83373B96106
$$ -236794 -14995 127669 -53866 -120485 171704 -71706 16099 -45315 92480 -183373 296106
18271i6152n3996A08919b5656A57146a56864j36321o5526A84496b8323k24922
$$ -96152 -150148 108919 -25656 157146 -156864 -293185 -358711 184496 -28323 -253245
18261b53245e4945I9464b467A23473h8547H7003a43072C03995a65900d7982E2257
$$ -253245 -54945 99464 -2467 123473 -88547 87003 -143072 303995 -165900 -47982 52257
18249A23712a60560L8594F7492b377j49597B22219a52031j27360b8583A23848
$$ 123712 -160560 -121966 67492 -2377 -151974 222219 -152031 -279391 -28583 123848
18238d7564A36052b18441a05022j0671k7233E8519K17171m6982G8342a39948l19614
$$ -47564 136052 -218441 -105022 -115693 -142926 58519 275690 228708 78342 -139948 -459562
18227d59562a34781J9108B99385q3126a1668F3453b90807A08163n2677i3561c0018
$$ -459562 -134781 -115673 299385 216259 -11668 63453 -290807 108163 55486 -93561 -30018
18215e3178N434E2796j4805K03065b25916P6896a5748q399o3697A73239a14112
$$ -53178 -47744 52796 37991 241056 -225916 -149020 -15748 -24147 -87844 173239 -114112
18203c74745M8423N8187J18297J6295M7264K261D3818a3648j59677I2194K23564
$$ -374745 -326322 -268135 -149838 -133543 -86279 -84018 43818 -13648 -173325 92194 315758
18192C15758h4671m80A04132a00740A81913a03096a3824k39461a00812H6554a25638
$$ 315758 -84671 -85151 104132 -100740 181913 -103096 -13824 -253285 -100812 86554 -125638
18180B74409j25919o6450h3051A94839b41970a06784m0814A00903m2568A7920
$$ 274409 148490 82040 -83051 194839 -241970 -106784 -147598 100903 58335 17920
18169b31672A97592o9991A3796b06690C3280M0552i5079A02844m0710A2931J77267
$$ -231672 197592 127601 13796 -206690 33280 73832 -95079 102844 62134 12931 190198
18158A90198b0294A12082C811b37861c1234j33382B5032J99192D0188a2760F3785
$$ 190198 -20294 112082 3811 -237861 -31234 -164616 25032 224224 40188 -12760 63785
18146f7854b9394D1701J69216f4538K7916A40955F8864b2463D1068O7953C4669
$$ -67854 -29394 41701 210917 -64538 -36622 140955 68864 -22463 41068 109021 34669
18134I5056K1394D5392a56785p6420L3641O3602F1041O2485D958i6973B82322
$$ 95056 116450 45392 -156785 -233205 -199564 -135962 61041 123526 4958 -96973 282322
18122a23240J9796k16981b3959j58633j82722G3676J72401I1879d1853A46744
$$ -123240 -103444 -320425 -23959 -182592 -365314 73676 246077 91879 -41853 146744
18111a61748l6915O0729j14585E7854a86023k23319e8110l3289n0616A44004b98320
$$ -161748 -198663 -137934 -252519 57854 -186023 -409342 -58110 -91399 -142015 144004 -298320
18099H5176c23038A87275b68028J23156B33917a17479A20325D2120J45996h7686
$$ 85176 -323038 187275 -268028 -144872 233917 -117479 120325 42120 188116 -87686
18088a17999o0313j54827a769A13530a87254R0480A46504b55366d7063m1769A12360
$$ -117999 -178312 -333139 -1769 113530 -187254 -96774 146504 -255366 -47063 -88832 112360
18076B76090a47829j73108A06654h836I5039d6390A33882b28549F9299O87E006
$$ 276090 -147829 -320937 106654 -8836 95039 -46390 133882 -228549 69299 69986 5006
18064A8756R5546P4304b13808B50407g5524B14592a81899b4940l13N191p0546
$$ 18756 114302 188606 -213808 250407 -75524 214592 -181899 -24940 -25253 -20062 -90608
18053i0608B13890b2270k68549A09827n4162a93115E3575a14066A16656B6146
$$ -90608 213890 -22270 -290819 109827 55665 -193115 53575 -114066 116656 26146
18042b68810a31438j05191N7185A72224a37865r1297a12746n5990L3655O0642
$$ -268810 -131438 -236629 -179444 172224 -137865 -229162 -112746 -168736 -135081 -74439
18032g4439j8845o983C8204g0134A21698B0199c88577C9365J77983o4143A4197
$$ -74439 -93284 -100267 38204 -70134 121698 20199 -388577 39365 217348 153205 14197
18020h71A38612f6453A02064m7805K56156a96908q2628a0999n3643j29220f4342
$$ -871 138612 -66453 102064 54259 310415 -196908 -279536 -10999 -64642 -193862 -64342
18008b9323g90H0452C6250d8625J5943A30900c20739C01034f0860j37430n5492
$$ -29323 -790 80452 36250 -48625 -32682 130900 -320739 301034 -60860 -198290 -253782
17997b53782F0183a71065C44758B478c52176H418a61938l0367j26021e742H9582
$$ -253782 60183 -171065 344758 2478 -352176 8418 -161938 -192305 -318326 -5742 89582
17985A23600a70024g3978E1187h6480A59110C7859a90203l4827A07697c04152
$$ 123600 -170024 -73978 51187 -86480 159110 37859 -190203 -225030 107697 -304152
17974f8863p4688H8986a21044M4885C01413b22380j53734A7046a1793e402j037
$$ -68863 -143551 88986 -121044 -76159 301413 -222380 -376114 17046 -11793 -5402 -6439
17963f439k05669a6024r2713c9082q8726K546J9017p1348A00468a4578k29651
$$ -6439 -212108 -16024 -108737 -39082 -127808 -125262 -106245 -177593 100468 -14578 -244229
17952b44229A70777b17225J9291A20814O9545b24657a2317A3382a07049J2245
$$ -244229 170777 -217225 -197934 120814 190359 -224657 -12317 13382 -107049 -94804
17942i4804k62381B3099R8541D4403b1912q4911j74271P3170A12766o35b16962
$$ -94804 -357185 23099 121640 44403 -21912 -106823 -281094 -207924 112766 112131 -216962
17930A06207b24861r3964E2672a71245B98655a35802l7401j76473J64321C30604
$$ 106207 -224861 -318825 52672 -171245 298655 -135802 -173203 -349676 -185355 330604
17919A95396b82535m6056A17257b94507E5746c4280I3352a1354k2463C8282f8483
$$ 195396 -282535 -328591 117257 -294507 55746 -34280 93352 -11354 -33817 38282 -68483
17907C32325J23580h1480A7016J33318l2287a89112j04967k3289C4845J56408
$$ 332325 455905 -81480 17016 150334 118047 -189112 -294079 -317368 34845 191253
17897A91253H1932B2503g7955A20350b77757i6129H8793b67727A37717J13940
$$ 191253 81932 22503 -77955 120350 -277757 -96129 88793 -267727 137717 251657
17887B51657a41636j7636n7622r4032A66116A6793g6964K8091b1422r3013p1786
$$ 251657 -141636 -159272 -216894 -310926 166116 16793 -76964 -48873 -21422 -114435 -186221
17876a86221B32761B4697c62342h6351A28210b13599g1758A68314A7737a25575
$$ -186221 232761 24697 -362342 -86351 128210 -213599 -71758 168314 17737 -125575
17865G7679B4421b61999A27997b47103B9691R0545a68098A40943b47312A75112
$$ 77679 24421 -261999 127997 -247103 29691 120236 -168098 140943 -247312 175112
17854E80038D6557b24794B4318d3304A54798b12698C531i0087C12617D4834O5695
$$ 580038 46557 -224794 24318 -43304 154798 -212698 3531 -90087 312617 44834 110529
17843A10529n33D8646b96413A01633N7667c97606A01375a5491A07894K11319a28688
$$ 110529 109996 48646 -296413 101633 159300 -397606 101375 -15491 107894 319213 -128688
17831b24402f3960A59332M6030a67155A28727C769g529j57743H1935F460L95897
$$ -224402 -63960 159332 205362 -167155 128727 3769 -7529 -165272 81935 6460 402357
17820D02357c665B5813d1793p0418n1241F5257A0420a19790j17202j23062F510
$$ 402357 -3665 25813 -41793 -112211 -163452 65257 10420 -119790 -236992 -360054 6510
17808G3204J05513a28479A00652a97707n2983f7717F5963b13415b0685l04312
$$ 73204 178717 -128479 100652 -197707 -250690 -67717 65963 -213415 -20685 -324997
17798c24997I7285K56146q9827I0029c06493A67099a47515C567b33763A8264d5593
$$ -324997 97285 353431 263604 90029 -306493 167099 -147515 3567 -233763 18264 -45593
17786a15919r411n641l1422l0338A40325c7564K820B28015h3887A65696J51060
$$ -115919 -125330 -130971 -162393 -192731 140325 -37564 -34744 228015 -83887 165696 316756
17775C16756a04180a7891j40729B07695K27790b56588A52038b30105F4409b29363
$$ 316756 -104180 -17891 -158620 207695 435485 -256588 152038 -230105 64409 -229363
17764f2303A57730l8770C410a09870E3089J8808c308C2116j1304J7032e4045A544
$$ -62303 157730 118960 3410 -109870 53089 71897 -3308 32116 20812 37844 -54045 1544
17751F3809d6975I7438J68072h0954K4181A50463a13943F1751b12836n583g9678
$$ 63809 -46975 97438 265510 -80954 -56773 150463 -113943 61751 -212836 -218419 -79678
17739c4947B0122f0396k1634I8355l302a52562j1201C09357I6919Q1942d5755
$$ -34947 20122 -60396 -82030 98355 95053 -152562 -163763 309357 96919 178861 -45755
17727d6900k58193B50452k6776e4499q5909A34931a61170K3072p4473h1312p650
$$ -46900 -305093 250452 223676 -54499 -140408 134931 -161170 -138098 -212571 -81312 -88962
17716h8962I5716A7549P7575L4548b59716A32266k9791g5222n6433L1550j48282
$$ -88962 95716 17549 95124 129672 -259716 132266 102475 -75222 -131655 -100105 -248387
17705b48387a16899A50479j4510g7187D4841b0101k2640B50631c86218A94834
$$ -248387 -116899 150479 135969 -77187 44841 -20101 -42741 250631 -386218 194834
17694A87232b34955C5178J81131K26382c92035a03403I8934a63681l8628G7441
$$ 187232 -234955 35178 216309 442691 -392035 -103403 98934 -163681 -202309 77441
17683C97370b28752N1631A58234b13711A39048E0401e6092j28242n7230h8223
$$ 397370 -228752 -177121 158234 -213711 139048 50401 -56092 -184334 -241564 -88223
17672e1350n6442l4546E4854b51916H6432k3143j6036Q7781c60541I3215J4679
$$ -51350 -107792 -142338 54854 -251916 86432 63289 47253 135034 -360541 93215 107894
17661A07894d17464G4395c1031A596K68975J2184A09387c92971H951b49743G7698
$$ 107894 -417464 74395 -31031 1596 270571 282755 109387 -392971 8951 -249743 77698
17649A98798b4569E8483J71925E8477e5116A67573Q1786m4205b87156M1151E594
$$ 198798 -24569 58483 230408 58477 -55116 167573 249359 205154 -287156 -246005 5594
17637c59969g1733H3361J92443C4346b09547i996k50964e7400E9097K78200A54110
$$ -359969 -71733 83361 275804 34346 -209547 -9996 -260960 -57400 59097 337297 154110
17625B8001a89756O8998A36618J00486F3486J9161A0659c8206k03728A26621b41253
$$ 28001 -189756 -120758 136618 237104 63486 82647 10659 -38206 -241934 126621 -241253
17613A20972J14334I921c7170j43596A75771q0610a41437b7729C96492H4548a05509
$$ 120972 235306 9921 -37170 -180766 175771 95161 -141437 -27729 396492 84548 -105509
17601B0265c13730D9270J63489l1998c20032C3423L6873J12749J94287b99594
$$ 20265 -313730 49270 212759 180761 -320032 33423 70296 183045 377332 -299594
17590A9290b04200e5093B32034j14368b45304h0738L6593m3031A02805b04661
$$ 19290 -204200 -55093 232034 117666 -245304 -80738 -44145 -87176 102805 -204661
17579H2411e2284j43490g283m39345F0830J49452A7197a27495J1380C19799b60881
$$ 82411 -52284 -195774 -7283 -446628 60830 210282 17197 -127495 -116115 319799 -260881
17567b9878m7558k4883A74884a75119B82228k9913a21303l3514A22934D0027K05713
$$ -29878 -77436 -102319 174884 -175119 282228 252315 -121303 -154817 122934 40027 245740
17556B45740F3373f1034C6400N48h1083C25011B8041O3771B913c9232q2785N2865
$$ 245740 63373 -61034 36400 36948 -81083 325011 28041 91812 2913 -39232 -122017 -69152
17544f9152B95846e5231B27043m6110D7226a98077a5189k50621F3304a62722B95141
$$ -69152 295846 -55231 227043 180933 47226 -198077 -15189 -265810 63304 -162722 295141
17532A29521J35097a74343D14105h2942K7107k8919A08918m7860J3267M0622i1996
$$ 129521 264618 -174343 414105 -82942 -55835 -84754 108918 61058 74325 114947 -91996
17520A31189d0524E1354K20024d2719J0094A32499K27094A40796m3263b4976A86030
$$ 131189 -40524 51354 271378 -42719 -32625 132499 359593 140796 97533 -24976 186030
17508C6225O0142A1060J06185m0085J15761D4317L3130K5676g8980A01728C9442
$$ 36225 96367 11060 117245 77160 192921 44317 77447 103123 -78980 101728 39442
17496A73626C1927L7506e0B25612c8309B09705O95b99599f3996C7365K04072o2891
$$ 173626 31927 69433 -50 225612 -38309 209705 210400 -299599 -63996 37365 241437 178546
17484A78546n1781m4757k8921b5118A15761a57171G790M6886H898J49469K55143
$$ 178546 126765 82008 53087 -25118 115761 -157171 7790 54676 8898 158367 413510
17473D13510j02070j28375J43787A15981a07183A21700a03021A64451M5346e1424
$$ 413510 311440 183065 326852 115981 -107183 121700 -103021 164451 209797 -51424
17462I3677f5874B58287b09122A27589J55763A3404M29521I9051B4717O3071m095
$$ 93677 -65874 258287 -209122 127589 283352 13404 442925 99051 24717 87788 83693
17451H3693J68375b8602C38399e2288j39052D14920J489D7478J56410a7077C33188
$$ 83693 252068 -28602 338399 -52288 -191340 414920 416409 47478 203888 -17077 333188
17439B63748C3156a3854B53841n7388Q9785m6819J81519j85259j07636A9984J14562
$$ 263748 33156 -13854 253841 196453 286238 239419 420938 235679 128043 19984 134546
17428A34546b40108B9937L15531j39830o0640Q6966Q0382k4545A13361P4116C0297
$$ 134546 -240108 29937 345468 205638 144998 231964 312346 287801 113361 187477 30297
17416C33381J7319F8333L46354j70286J8782b34911A94424j4379q1552K37901
$$ 333381 350700 68333 414687 244401 263183 -234911 194424 180045 98493 336394
17406C36394c7349B76689j11016c1920A33773J76022a65595A91293L5589B020
$$ 336394 -37349 276689 165673 -31920 133773 309795 -165595 191293 226882 2020
17395A92837g414B40543b52348D78814j45854A8641e0396C45804E3506Q3828c2684
$$ 192837 -7414 240543 -252348 478814 332960 18641 -50396 345804 53506 137334 -32684
17383A14047R6481J58057C1430R5440b25569B21561o9212K3132h0907D15639j59007
$$ 114047 210528 368585 31430 126870 -225569 221561 152349 175481 -80907 415639 256632
17372B56632G2311c5293G2617h886o1712h488r6943D6728K46976E2022A6878J13901
$$ 256632 72311 -35293 72617 -8886 -70598 -8488 -105431 46728 293704 52022 16878 130779
17360A30779n8634J61278q4026K9033R379J68763A58032c8857D97262G0498j2636
$$ 130779 72145 233423 149397 178430 187809 356572 158032 -38857 497262 70498 57862
17349E7862J25352A8443b7591F5868K86107j30273K2301M034d5245A35505J45355
$$ 57862 183214 18443 -27591 65868 351975 221702 244003 248037 -45245 135505 280860
17338B80860d8259H1815L74923A42405J318g5809A36595E6337a73933O681Q0542
$$ 280860 -48259 81815 456738 142405 143723 -75809 136595 56337 -173933 -167252 -86710
17327h6710A83800b11846c1418B39185a89536B3094l820b3262B09756e9489C35188
$$ -86710 183800 -211846 -31418 239185 -189536 23094 19274 -23262 209756 -59489 335188
17315D29653P7559a29390M7951H5948L20984k9900a71625B1049K46608o3887J2840
$$ 429653 507212 -129390 -81439 85948 406932 377032 -171625 21049 267657 203770 216610
17304B16610H6217A5592L14918k4691j32451d79460A11039o724Q823M60935e6292
$$ 216610 86217 15592 330510 305819 173368 -479460 111039 104315 113138 574073 -56292
17292f5168I4716j396a9341j109B56999C005c6150B08952d0484O792L071n9750
$$ -65168 94716 93320 -19341 -20450 256999 3005 -36150 208952 -40484 -33692 -30621 -90371
17280i0371B98554d6267A76043c5879A08062j8541L3037D4829L9582L7311O9536
$$ -90371 298554 -46267 176043 -35879 108062 89521 122558 44829 84411 121722 191258
17269A91258c21193D9225Q2483J22616b5252B87153h0129B56814F450J21658i2860
$$ 191258 -321193 49225 131708 254324 -25252 287153 -80129 256814 6450 128108 -92860
17257a77182F3242K16080G9231f481q9099k1955B59194j8829j13366J72923j19094
$$ -177182 63242 279322 79231 -6481 -95580 -117535 259194 240365 126999 299922 180828
17246A80828b7413C6692N11195B67124K2453m8585a49870B70878J7030j1362D7115
$$ 180828 -27413 36692 547887 267124 289577 240992 -149870 270878 287908 276546 47115
17234B36825a43789A53964a00948A56441r783l4402Q3754J49240R0602A60757
$$ 236825 -143789 153964 -100948 156441 146658 112256 196010 345250 435852 160757
17223D2429c9524j475o005D37057r6376m4679a02066A03655Q9622q5552M32309
$$ 42429 -39524 -40999 -47004 437057 340681 296002 -102066 103655 193277 107725 540034
17212E40034A88326O8911j0026A2054K54147n5720G3190K55737I0542j2806b855
$$ 540034 188326 257237 247211 12054 266201 210481 73190 328927 90542 77736 -2855
17200a61964B67763F3852L38502j95154q5095m1990J90889B9792O8262D1150i7253
$$ -161964 267763 63852 402354 207200 122105 80115 271004 29792 98054 41150 -97253
17188C23286J59880A15348P4300J87685j49160a78808D52050j95633j25995Q6467
$$ 323286 483166 115348 189648 377333 228173 -178808 452050 256417 130422 216889
17178B16889Q1340l8431O2644N7024j88714J19424c8516C59806j42316K99063
$$ 216889 298229 259798 322442 379466 190752 310176 -38516 359806 217490 516553
17168E16553r1530j26452n5187J48912n5995a59706A09470K66294C1094K3660
$$ 516553 425023 298571 243384 392296 336301 -159706 109470 375764 31094 54754
17158E4754P0718K4542j6047K59490A62679J96625A28611K56333j27554J91343
$$ 54754 125472 150014 133967 393457 162679 359304 128611 384944 257390 448733
17148D48733m3102j11156g8585A01292M07609A97250f3558B67263L82689G0707
$$ 448733 405631 294475 -78585 101292 508901 197250 -63558 267263 649952 70707
17137D44920j03270j54332C1777L1764K54211A20763K77178A11261N9991K43472
$$ 444920 341650 187318 31777 63541 317752 120763 397941 111261 171252 414724
17127D14724J04357G0601N21744I2982L7214J66104o0839J73582a56671C40862
$$ 414724 519081 70601 592345 92982 130196 296300 235461 409043 -156671 340862
17116E51284A97027K63203j9220l8444A67411L16605k17018I9936F242M11089
$$ 551284 197027 460230 441010 402566 167411 484016 266998 99936 6242 417331
17106D17331k2284J04307B21694K11828j30837O3546n1844K11630r8411j45716
$$ 417331 395047 499354 221694 433522 302685 366231 314387 526017 427606 281890
17096B81890n4589J27937q1434J27495j77259M01789r1987B21540J7936J11565
$$ 281890 227301 355238 273804 401299 224040 625829 533842 221540 239476 351041
17086C51041O7564A09443L72937p8444J57096k11368L7755J01348q910M5548L2508
$$ 351041 418605 109443 482380 403936 561032 349664 387419 488767 479857 525405 557913
17075E57913k01025M37347l60397L7667P5890E699L35043L5803O093O9017j24415
$$ 557913 356888 794235 433838 471505 547395 5699 340742 376545 382638 451655 327240
17064C27240H3163M33029j29182j69723K24819q5695K06961k30430k1016Q672
$$ 327240 83163 516192 387010 217287 442106 356411 563372 332942 311926 320598
17054C20598R1636J18853o805B21947Q337M4488K42011j47549r8498r563K52896
$$ 320598 412234 531087 524282 221947 230284 274772 516783 369234 270736 261173 514069
17043E14069q1728J44463j56905L1014K26859M3176C51790L37178k69192j44005
$$ 514069 432341 576804 419899 450913 677772 720948 351790 688968 419776 275771
17033B75771K51062q5003J11028j4866l5767j44661A09321L49447O0457j68486
$$ 275771 526833 441830 552858 537992 502225 357564 109321 458768 519225 350739
17023C50739K68741r7833J1140A24040L7889J75310K36586j2172A5794O15687
$$ 350739 619480 521647 532787 124040 161929 337239 573825 561653 15794 631481
17013F31481k10153k3283J02415j46688K50135B34938J61900K77869j87779K48418
$$ 631481 421328 398045 500460 353772 603907 234938 396838 674707 486928 735346
17003G35346J06627j39516C22357J37563K60167m2341Q6467k9513J02336l90539
$$ 735346 841973 702457 322357 459920 720087 677746 764213 734700 837036 446497
16993D46497L19923l49949J86015j1875o6456M03180l92870K00115J53713l97862
$$ 446497 766420 416471 602486 590611 524155 927335 534465 734580 888293 490431
16983D90431J46383J25613j41988K02811K2973j64734K46059j49890k90803L49017
$$ 490431 636814 762427 620439 823250 846223 681489 927548 777658 486855 835872
16973H35872m2010j64037K86772R6345j54623j63159l7429K69586j39748M3411
$$ 835872 793862 629825 916597 1012942 858319 695160 657731 927317 787569 830980
16963H30980N7406o7352l2195P3723J1258N3685k56467j2304K69974l7234q5871
$$ 830980 888386 821034 788839 862562 873820 927505 671038 658734 928708 891474 805603
16952H05603n2100M8712J90421q2744P761j5501l801K14966J06089m00644L07558
$$ 805603 753503 802215 992636 909892 917653 902152 898351 1113317 1219406 818762 1126320
16941A126320j77671J34088K465j46521o4010N32902l03518J28323j29473J28717
$$ 1126320 948649 1082737 1085202 938681 874671 1407573 1104055 1232378 1102905 1231622
16931A231622j98193K80609l61918J71348k00678J37015R3238j16543O4535P1767
$$ 1231622 1033429 1314038 952120 1123468 922790 1059805 1153043 1036500 1101035 1172802
16921A172802J58251l94915K92899k84050J91336k09832L08856k61656M37276
$$ 1172802 1331053 936138 1229037 944987 1136323 926491 1235347 973691 1410967
16912A410967k99413J39727j06407k018J99877J9211O5762J18059J44675j21937
$$ 1410967 1111554 1251281 1144874 1142856 1342733 1361944 1427706 1545765 1690440 1568503
16902A568503M2699k77018L09200k65620R6963j51533j22958L8608L40761r031
$$ 1568503 1611202 1334184 1643384 1377764 1474727 1323194 1200236 1238844 1579605 1570574
16892A570574j0362L00571k47919K45734J22988k50480p5738j59110k4639K49147
$$ 1570574 1560212 1860783 1612864 1858598 1981586 1731106 1655368 1496258 1471619 1720766
16882A720766o370M13963K5208j71009J2146r0057K12781J25407J63340l00099
$$ 1720766 1714396 2128359 2153567 1982558 1994704 1904647 2117428 2242835 2406175 2106076
16872B106076j44120j2296K39537L6834N6118k5824k76343L10958L72275k88924
$$ 2106076 1961956 1949660 2189197 2226031 2282149 2256325 1979982 2290940 2663215 2374291
16862B374291P2737J55520K24372n81301M59635J44104n56022M72937k98606M9112
$$ 2374291 2447028 2602548 2826920 2245619 2705254 2849358 2293336 2766273 2467667 2516779
16852B516779N44613l75674J41312J63233l06764m7989J31558L77013L5824j9786
$$ 2516779 3061392 2685718 2827030 2990263 2683499 2635510 2767068 3144081 3179905 3160119
16842C160119n3186K57865K4774J02937k43434k29612N57768j56741M66357j93121
$$ 3160119 3106933 3364798 3389572 3492509 3249075 3019463 3577231 3420490 3886847 3693726
16832C693726M9909j46553K20627K13748o3848J37353L16934J43920p3082j46831
$$ 3693726 3743635 3597082 3817709 4031457 3967609 4104962 4421896 4565816 4492734 4345903
16822D345903J80640K86848m99075J7826P19470j54327O3684n5312M46264Q7746
$$ 4345903 4526543 4813391 4314316 4332142 5051612 4897285 4960969 4905657 5351921 5439667
16812E439667K48254L15280n14866N51609j85998K25972J70073J68746L76766
$$ 5439667 5687921 6003201 5488335 6039944 5853946 6079918 6249991 6418737 6795503
16803F795503O346L73291K09998k43269O9990M28601J46438K42308L74387L15893
$$ 6795503 6801849 7175140 7385138 7141869 7211859 7640460 7786898 8029206 8403593 8719486
16793H719486J67795K20662j89817Q90362j65716j198P30467L90311J2576O185
$$ 8719486 8887281 9107943 8918126 9808488 9642772 9641574 10372041 10762352 10774928 10781113
16783A0781113Q10046J7163P34548j97787N50755L33711L98762M19942P92832
$$ 10781113 11591159 11608322 12342870 12145083 12695838 13029549 13428311 13848253 14641085
16774A4641085j89019O07116N03173O82497N59282L30578Q75556N16351P36957
$$ 14641085 14452066 15059182 15562355 16244852 16804134 17134712 18010268 18526619 19263576
16765A9263576J138636L95947Q79541K56138J426098R35548J090168R67437J313792
$$ 19263576 20402212 20798159 21677700 21933838 23359936 24295484 25385652 26353089 27666881
16756B7666881J317196J320304J209518J877473J323255J732965J986623J851149
$$ 27666881 28984077 30304381 31513899 33391372 34714627 36447592 38434215 40285364
16748D0285364K274329J966183K744359K798659K475606K949389L285551L419382
$$ 40285364 42559693 44525876 47270235 50068894 52544500 55493889 58779440 62198822
16740F2198822L223140M198230L955031M302525M648321M870247M935636N291863
$$ 62198822 65421962 69620192 73575223 77877748 82526069 87396316 92331952 97623815
16732I7623815N874743N719843N935709O349721O205670O611334N520338O118717
$$ 97623815 103498558 109218401 115154110 121503831 127709501 134320835 139841173 145959890
16724A45959890N406199M996062M263158L667220K884226J599842M16231l79469
$$ 145959890 151366089 156362151 160625309 164292529 167176755 168776597 169192828 168813359
16716A68813359j199926k579612l339513m304803m569182n698277n565487o005576
$$ 168813359 167613433 165033821 161694308 157389505 152820323 147122046 141556559 135550983
16708A35550983o065487o265527o506695n983429n981670n732437n451108m846706
$$ 135550983 129485496 123219969 116713274 110729845 104748175 99015738 93564630 88717924
16700H8717924n312833m470774m510795l725981l918988l937965k697302l639536
$$ 88717924 83405091 78934317 74423522 70697541 66778553 62840588 60143286 56503750
16692E6503750k547403k613885l042868j961678k296955k108554k040055j555719
$$ 56503750 53956347 51342462 48299594 46337916 44040961 41932407 39892352 38336633
16684C8336633j818842j561952j767920p58770j841495j210703j445058j168027
$$ 38336633 36517791 34955839 33187919 32429149 30587654 29376951 27931893 26763866
16676B6763866q40613j077042j047558r65676j119148n16754j219586l95938p66971
$$ 26763866 25923253 24846211 23798653 22832977 21713829 21197075 19977489 19581551 18814580
16667A8814580q55702p28699r01535j69906p16112n10493m02938o13133j93301
$$ 18814580 17958878 17230179 16328644 16158738 15442626 14932133 14529195 13916062 13722761
16658A3722761m25623m52839m88599l30145m86043k50444l51744M6196j019833
$$ 13722761 13297138 12844299 12355700 12025555 11539512 11289068 10937324 10983520 9963687
16649I963687o5301l06436k86775k79730k34862l96458L47478o04433J7344j46540
$$ 9963687 9898386 9591950 9305175 9025445 8790583 8394125 8741603 8137170 8154514 8007974
16639H007974l27968p9821J39554l84042k70957j21455n65712K36591j35588j11696
$$ 8007974 7680006 7600185 7739739 7355697 7084740 6963285 6397573 6634164 6498576 6386880
16629F386880r9131k76590J41492k1994o07279J17439n4170j76680j53083k3051
$$ 6386880 6287749 6011159 6152651 6130657 5523378 5640817 5586647 5409967 5256884 5233833
16619E233833j45287m42728O03145n75259J69469j13665k91267J20364k3572j76591
$$ 5233833 5088546 4645818 5248963 4673704 4843173 4729508 4438241 4558605 4535033 4358442
16609D358442J94910n96675N7998J97375m67823L0178n2406k38736L0959n4765
$$ 4358442 4553352 3956677 4014675 4212050 3744227 3774405 3721999 3483263 3514222 3459457
16599C459457J27569k56178j51270L39927k74697r1775k56275K67407K754k54011
$$ 3459457 3587026 3330848 3179578 3519505 3244808 3153033 2896758 3164165 3166919 2912908
16589B912908j47365K47572k74519q4393M262N09520l62780m30043r8195J95179
$$ 2912908 2765543 3013115 2738596 2654203 2658465 3167985 2805205 2375162 2276967 2472146
16579B472146K9892j60372k93210M01943l11393P1064J23783k18447J72379j69968
$$ 2472146 2502038 2341666 2048456 2450399 2139006 2210070 2333853 2115406 2287785 2117817
16569B117817J15960j92873J82820J90888m98989K59968q2519M169k29959J0395
$$ 2117817 2233777 2040904 2223724 2414612 1915623 2175591 2093072 2097241 1867282 1877677
16559A877677K19981k29249L39869o34294Q9577k0240O3364L0047K7724k71775
$$ 1877677 2097658 1868409 2208278 1573984 1663561 1643321 1706685 1736732 1764456 1492681
16549A492681k43997K32325L23016R1866l5338j44437j53439O9492j54492P5022
$$ 1492681 1248684 1481009 1804025 1895891 1860553 1716116 1562677 1632169 1477677 1552699
16539A552699R8922l84006K30816r0032L15736m67252N19305o11412L65357l53529
$$ 1552699 1651621 1267615 1498431 1408399 1724135 1256883 1776188 1164776 1530133 1176604
16529A176604L71205j99456k94122L4333J92182J64171m27970K07851J04701p9532
$$ 1176604 1547809 1348353 1054231 1088564 1280746 1444917 1016947 1224798 1329499 1249967
16519A249967P4858j10042l57562P10797l10767q6459m4464p2955J1833k98610
$$ 1249967 1324825 1214783 857221 1568018 1257251 1170792 1126328 1053373 1065206 766596
16509G66596J90025k8581J13178j05378j09344M83627J78382G10107K46615q504
$$ 766596 956621 928040 1041218 935840 826496 1310123 1488505 710107 956722 948218
16499I48218j69393K01824L62300n61398L21098k89861N7193R7523j61107J99664
$$ 948218 778825 980649 1342949 781551 1102649 812788 869981 967504 806397 1006061
16489A006061k92574j0930M07351j85304k48818K44186j33591r7942K21779J60830
$$ 1006061 713487 702557 1109908 924604 675786 919972 786381 688439 910218 1071048
16479A071048l67325K7572J54006j72878J17745Q6922n3772k3225j76200R9799
$$ 1071048 703723 731295 885301 712423 830168 917090 863318 840093 663893 763692
16469G63692j67231J68087N333k77035K09037n1450L24086j35461j12820k34473
$$ 763692 596461 764548 769881 492846 701883 650433 974519 839058 726238 491765
16459D91765M36843j17839k98907K89603p1921j83817L11288j12739N2090n1229
$$ 491765 928608 810769 511862 801465 729544 545727 857015 744276 796366 745137
16449G45137C39079L16612r131l0719j07564k10435M01577j68493K9039J47133
$$ 745137 339079 655691 646560 615841 508277 297842 699419 530926 559965 707098
16439G07098r7662p5871j39242J73750K3934j45071l0102K38194j11515K1653
$$ 707098 609436 533565 394323 568073 592007 446936 416834 655028 543513 565166
16429E65166L3733O1132p8994k55062M68140l03419R9175r6577O2487L3526j94976
$$ 565166 598899 660031 581037 325975 794115 490696 589871 493294 555781 589307 394331
16418C94331L34399B56036J56858l7792P6521J92555B59118L24336j50503L58807
$$ 394331 728730 256036 412894 375102 451623 644178 259118 583454 432951 791758
16408G91758l50634l8754j01154H0728K64075l3080J58630J22195A64643J73384
$$ 791758 441124 402370 301216 80728 344803 311723 470353 592548 164643 338027
16398C38027K74706k29359K31329o6118B65777K53868J39442J01746C22396J12841
$$ 338027 612733 383374 614703 548585 265777 519645 659087 760833 322396 435237
16388D35237J19915k60856J66455r2499J74193k03798m6263L61725k33593J14375
$$ 435237 555152 294296 460751 368252 542445 338647 292384 654109 420516 534891
16378E34891j06979n1302O2355B02132F0913O5977L62899J5558L2170B01823J56705
$$ 534891 427912 376610 438965 202132 60913 126890 489789 505347 537517 201823 358528
16367C58528J94864A61414N8756N348G3823K55676K2481A72188J34814J17698
$$ 358528 553392 161414 220170 225518 73823 329499 351980 172188 307002 424700
16357D24700h4458D90893p7566j61815F4461M72876k08721k1013J62057L0758
$$ 424700 -84458 490893 413327 251512 64461 537337 328616 307603 469660 500418
16347E00418j51875N8164N7614j98525J85194A63252J76458A06367M35676k38205
$$ 500418 348543 406707 464321 265796 450990 163252 339710 106367 542043 303838
16337C03838m8337M395j5989p4931L913J916J59706G2102K79932O5637o9042N73
$$ 303838 255501 259896 243907 168976 172889 174805 334511 72102 352034 417671 348629 349202
16325C49202J14408A69751c01019B95634n2484J77687O8060A42044J64950h9257
$$ 349202 463610 169751 -301019 295634 243150 420837 488897 142044 306994 -89257
16314D58283j72984J12815j59323r1275O0175M1611R1565A17086K22890j52198
$$ 458283 285299 398114 238791 147516 207691 249302 340867 117086 339976 187778
16304A87778p1375M1441K23511r0665a41423A27709a25939A28342J52837J82756
$$ 187778 116403 157844 381355 290690 -141423 127709 -125939 128342 281179 463935
16294D63935A70412K3961E3540R4434a71217C90393c13577b0295p794C18063H7235
$$ 463935 170412 194373 53540 147974 -171217 390393 -313577 -20295 -28089 318063 87235
16282C04490J22688j62300O8906m514e6924B11326A6463J62230J42238p4260q0767
$$ 304490 427178 264878 333784 329270 -56924 211326 16463 178693 320931 246671 165904
16271A65904C3934J09343a15495D03214j34280l2684N3467D4a9460j23976C88130
$$ 165904 33934 143277 -115495 403214 268934 236250 289717 44 -19460 -143436 388130
16259A3748J26404J04443p2720j8542n8608a9422D13804A49626k0443A9113M2360
$$ 13748 140152 244595 171875 153333 94725 -19422 413804 149626 129183 19113 61473
16248F1473J90535j13682K33018D0213J37772J99403L6043b8183C98453j74159
$$ 61473 252008 138326 371344 40213 177985 377388 413431 -28183 398453 224294
16238B24294J76660j09052o2504h9349b3464A44336b2871B30395L28665C0286
$$ 224294 400954 291902 229398 -89349 -23464 144336 -22871 230395 559060 30286
16227g7530B24419K02039h9686C86403A78723F8366L45523a50587B32437p0590
$$ -77530 224419 426458 -89686 386403 178723 68366 413889 -150587 232437 161847
16217A61847n0841b6755r995H7209K67806A01362J62619j19307M5044K24148A82779
$$ 161847 111006 -26755 -36750 87209 355015 101362 263981 144674 189718 413866 182779
16205B3183K47469G6624K42016d3310D11729E8071P1152D9445K1959d0849D1559
$$ 23183 270652 76624 318640 -43310 411729 58071 129223 49445 71404 -40849 41559
16193A94199j6837a0513G5215J99474A12734a65963B4584c40846b0697p7835A5802
$$ 194199 177362 -10513 75215 274689 112734 -165963 24584 -340846 -20697 -98532 15802
16181F8489k8076J40551a05540C7564g0693h651A98771e4133a247l17690B10619
$$ 68489 40413 180964 -105540 37564 -70693 -8651 198771 -54133 -1247 -318937 210619
16169d6278G9476J57310D3635J40948K30524H3633J51201b19060A63156C2869
$$ -46278 79476 236786 43635 184583 415107 83633 234834 -219060 163156 32869
16158C6471c30287D07103A34075J63198d21228H5939a20329a9662D60499b52571
$$ 36471 -330287 407103 134075 297273 -421228 85939 -120329 -19662 460499 -252571
16147a19922D90814a85969P2373B54197B6317K48867b31093A10643b31903B16562
$$ -119922 490814 -185969 -113596 254197 26317 275184 -231093 110643 -231903 216562
16136d9148B52511O360g6331j062C90921F3810M0369i2937c7109B6389Q5078n3657
$$ -49148 252511 258871 -76331 -77393 390921 63810 104179 -92937 -37109 26389 111467 57810
16124E7810b86924C81678A50105b84360A39379B855J08890a27138e6505k4955
$$ 57810 -286924 381678 150105 -284360 139379 2855 111745 -127138 -56505 -81460
16114h1460L8028o1484A59729g2746j8834C39279a13601A96200f3231m14647B30457
$$ -81460 -43432 -104916 159729 -72746 -91580 339279 -113601 196200 -63231 -477878 230457
16102B18239o3220a2142C22925r9376j10179A3044J67649d6250n6412n3007E8154
$$ 218239 155019 -12142 322925 223549 113370 13044 180693 -46250 -102662 -155669 58154
16090a6467A50395F4132N9015l3882k2534k3274L54684a15158A96158n7805b05753
$$ -16467 150395 64132 123147 89265 66731 43457 398141 -115158 196158 138353 -205753
16078a42211m1504C96626j85590G8394B0788h0620a8128k88349a9319C64317I7937
$$ -142211 -183715 396626 211036 78394 20788 -80620 -18128 -306477 -19319 364317 97937
16066A76804f6757B90957k2429B0240J04289J14703G9463q649b21831B60173K28652
$$ 176804 -66757 290957 268528 20240 124529 239232 79463 70814 -221831 260173 488825
16055D88825e8197B55981a4317n3509j27621A15648g1369k00009q7279f9566m68769
$$ 488825 -58197 255981 -14317 -67826 -195447 115648 -71369 -271378 -358657 -69566 -538335
16044e38335a57224a161k44887A48335h5123A62109m4593A0882h3666a5359j37329
$$ -538335 -157224 -1161 -246048 148335 -85123 162109 117516 10882 -83666 -15359 -152688
16033a52688D35502c59591A31968a8659k5838J3307I1399b23947A1791L65332
$$ -152688 435502 -359591 131968 -18659 -44497 -31190 91399 -223947 11791 377123
16023C77123a65235g2146B34214A08147a72988B7310b5219A77690c5169J5827
$$ 377123 -165235 -72146 234214 108147 -172988 27310 -25219 177690 -35169 -19342
16013a9342E7510F990a53433B96727j31380R6690a81245k35927C1630e1695A48136
$$ -19342 57510 6990 -153433 296727 165347 262037 -181245 -417172 31630 -51695 148136
16001g5449o4615A51329a24470B27755a82836A7578K27585n1640l4952b12367
$$ -75449 -140064 151329 -124470 227755 -182836 17578 245163 193523 158571 -212367
15990D8872g6464j07971A55704J34307F9240a28779J1A21526j9823L10492A47082
$$ 48872 -76464 -184435 155704 290011 69240 -128779 -128768 121526 101703 412195 147082
15978b41397A10521a25013A01888a45497j7422A5311p279L16280A60132G9383
$$ -241397 110521 -125013 101888 -145497 -162919 15311 8032 324312 160132 79383
15967G4236K3721N5466J03102C0925M0262a14482B05655C2982J74006a51127d9278
$$ 74236 97957 153423 256525 30925 71187 -114482 205655 32982 206988 -151127 -49278
15955c51684a59073e2131A89970a03560D89576a60888n4922A445a7106o1333k52131
$$ -351684 -159073 -52131 189970 -103560 489576 -160888 -215810 1445 -17106 -78439 -330570
15944c30570a08968A33576d36339A301b02751d9905C0149c0574j64084j157B1907
$$ -330570 -108968 133576 -436339 1301 -202751 -49905 30149 -30574 -194658 -195815 21907
15932B12626a38258A16850a33484o0376L9535A3977b03506l3165c6585a2502B69846
$$ 212626 -138258 116850 -133484 -193860 -154325 13977 -203506 -236671 -36585 -12502 269846
15920A60397c80891B9312K3772c06321A50494c39799E7236J44068a44726H1344
$$ 160397 -380891 29312 53084 -306321 150494 -339799 57236 201304 -144726 81344
15909g2990C6895d25063B857b06059L7502A54580K4288a9089I5464e6599F037
$$ -72990 36895 -425063 2857 -206059 -168557 154580 178868 -19089 95464 -56599 6037
15897a68613A19764K60478A20502j8320e1398j22275f3784A63498C0242b94033
$$ -168613 119764 380242 120502 102182 -51398 -173673 -63784 163498 30242 -294033
15886A02446h2303B8441i982A95484b7877B83200a01989L5271O250b2702n5559
$$ 102446 -82303 28441 -9982 195484 -27877 283200 -101989 -66718 -60468 -22702 -78261
15875g8261C1491K01838o7423b7542j21792r5973B32b01972C8206a54288d6708
$$ -78261 31491 233329 165906 -27542 -149334 -245307 232 -201972 38206 -154288 -46708
15863c14480d7898B9816g8287K8952B44028Q9044d20433F6756J40121C4443a86528
$$ -314480 -47898 29816 -78287 -49335 244028 333072 -420433 66756 206877 34443 -186528
15851D88467H4573b22649p4591H3813O8510h931k09128R3184A12457E5822J5801
$$ 488467 84573 -222649 -297240 83813 152323 -8931 -218059 -124875 112457 55822 71623
15840G1623J00984B9770d293j27461H49a14578A0209P9661J4708E0910g766A15868
$$ 71623 172607 29770 -4293 -131754 849 -114578 10209 89870 104578 50910 -7766 115868
15827A23454J38151a42421J0420j32371A41377c71130B73130h293q1282c107k59529
$$ 123454 261605 -142421 -132001 -264372 141377 -371130 273130 -8293 -89575 -3107 -262636
15816b62636f3224C4604K59913a54333q1700R3724j91558G2899K14857I3801R7562
$$ -262636 -63224 34604 294517 -154333 -236033 -142309 -333867 72899 287756 93801 191363
15805A91363f1922B28923a16851D2884L27311I3983C3809M174A5819J40938g9717
$$ 191363 -61922 228923 -116851 42884 370195 93983 33809 37983 15819 156757 -79717
15793E099b24234e7082r3023m1215B69969a0572l48595g3984l2849p6571l34316
$$ 5099 -224234 -57082 -150105 -191320 269969 -10572 -359167 -73984 -106833 -183404 -517720
15782e17720J87800J56441b8861B02380C1006R4190C0588b7613j65525F5065i0862
$$ -517720 -329920 -173479 -28861 202380 31006 125196 30588 -27613 -193138 65065 -90862
15770i105r9125l01632B56029c41814a64498j48556a28216A61603A7066a13446
$$ -9105 -108230 -409862 256029 -341814 -164498 -313054 -128216 161603 17066 -113446
15759a23248B42753B6582R582J29981a10326B11261c04302q362C1886a08753B46694
$$ -123248 242753 26582 36164 166145 -110326 211261 -304302 -312664 31886 -108753 246694
15747b5736j89339O7264A07820N913J97404b46422r998j79156D99324g1952a0369
$$ -25736 -215075 -147811 107820 113733 311137 -246422 -256420 -435576 499324 -71952 -10369
15735C9109J96740L06247a00188j1751n6069p7735g2798k03130a30435C11953
$$ 39109 235849 542096 -100188 -111939 -168008 -245743 -72798 -275928 -130435 311953
15724A08358l9023K97738a76979h4580A18334a07681A37277O4298a65331j91548
$$ 108358 69335 367073 -176979 -84580 118334 -107681 137277 201575 -165331 -356879
15714c56879J66520Q7292c1871j41105p6182b9184j74467C8761K79594c28979
$$ -356879 -190359 -103067 -31871 -172976 -249158 -29184 -203651 38761 318355 -328979
15703D5605J75877g9265m2740I5056b67875o7709e4354p6992c4974A59119f8966
$$ 45605 221482 -79265 -122005 95056 -267875 -335584 -54354 -131346 -34974 159119 -68966
15691H3494D0704a69033J9061E2292b91686A8958a54112F3048h9829R66C49875
$$ 83494 40704 -169033 -149972 52292 -291686 18958 -154112 63048 -89829 -88863 349875
15679B9939a59899F4299b15759A09947a13099F1930a20916I5928m632A673c16652
$$ 29939 -159899 64299 -215759 109947 -113099 61930 -120916 95928 91296 1673 -316652
15667A97675b47328a04123A85381b62525P6835H1840c72310a38628B10880a95375
$$ 197675 -247328 -104123 185381 -262525 -185690 81840 -372310 -138628 210880 -195375
15656a79596B40294L1311I3714P7071J38407g9865k0896A12613L6679p3238K3448
$$ -179596 240294 271605 93714 170785 309192 -79865 -100761 112613 149292 76054 99502
15645I9502m3159a7715k29796G0218a13728L0217E5893b70413A17211c6674N744
$$ 99502 56343 -17715 -247511 70218 -113728 -83511 55893 -270413 117211 -36674 -30930
15634c0930A72800c00715I5912l7968B3800b1805m5407d275k54160I87a06578
$$ -30930 172800 -300715 95912 57944 23800 -21805 -67212 -4275 -258435 987 -106578
15622g5809B51261E999J03444a59648G131R2887e7046B7734b43975A79397G8063
$$ -75809 251261 5999 109443 -159648 7131 100018 -57046 27734 -243975 179397 78063
15610G87d5029p8162N1246l4224A96950a90963D4692b58513i8194A1268a3251
$$ 787 -45029 -123191 -71945 -106169 196950 -190963 44692 -258513 -98194 11268 -13251
15598A04275e6228A70822a78526i744m26690d5503j66386J05682b7599B16706
$$ 104275 -56228 170822 -178526 -9744 -436434 -45503 -211889 -106207 -27599 216706
15587A08064a02190A08155A3899b12602a04182G947e8594a7081l9398j76240D4967
$$ 108064 -102190 108155 13899 -212602 -104182 7947 -58594 -17081 -56479 -232719 44967
15575A96711a98087f2723A1418a4636E1199a18072b4855j78066j64977J77824
$$ 196711 -198087 -62723 11418 -14636 51199 -118072 -24855 -202921 -367898 -190074
15565a90074o37R1280B958K43896d3805B90466g899q118B5249d193o8334j11547
$$ -190074 -190711 -99431 2958 246854 -43805 290466 -7899 -16017 25249 -4193 -72527 -184074
15553a84074N6558C8628J30982a53909m5790Q5377j16621b1911j5923j87334R6443
$$ -184074 -127516 38628 169610 -153909 -199699 -114322 -230943 -21911 -37834 -225168 -128725
15542a28725a5324k47890D07313C2967J15034R2762J8941g4414A73120O194b8460
$$ -128725 -15324 -263214 407313 32967 148001 240763 259704 -74414 173120 179314 -28460
15530a5359A76251M6459a32961c3459j79399b2545j00033j00838P8417M444f4990
$$ -15359 176251 222710 -132961 -33459 -212858 -22545 -122578 -223416 -144999 -140555 -64990
15518B80529j18211c1507o5455F6291J02750R4760F6816N7326j7126a08163j55111
$$ 280529 162318 -31507 -96962 66291 169041 263801 66816 124142 107016 -108163 -263274
15507b63274c6169j40956k49458B58767j25883l5390R2258q8879K65829j12275
$$ -263274 -36169 -177125 -426583 258767 132884 97494 189752 100873 366702 254427
15497B54427l5051a02661a7008B64616a94940H3868M376C4156J34148b2294l3606
$$ 254427 219376 -102661 -17008 264616 -194940 83868 88244 34156 168304 -22294 -55900
15486e5900E0707b00802J800i7096j34235O8864a0293A19749B507J7611i9452
$$ -55900 50707 -200802 -199002 -97096 -231331 -162467 -10293 119749 2507 20118 -99452
15474A72035A2781a84509q5606K7019A28809Q3180b73749G9691J5629a34030H0228
$$ 172035 12781 -184509 -270115 -243096 128809 211989 -273749 79691 95320 -134030 80228
15462d1427C58706j13647a07384B58072a35459H7765D990d0927m7105j50252c7933
$$ -41427 358706 245059 -107384 258072 -135459 87765 4990 -40927 -88032 -238284 -37933
15450c44785B23405b1681C4615J99290b10959j38950B02269J3156a4587G8955
$$ -344785 223405 -21681 34615 233905 -210959 -349909 202269 215425 -14587 78955
15439b41948C13300b50671j8075J08942j70339A08660C4348m771d8845D2732h4542
$$ -241948 313300 -250671 -268746 -159804 -330143 108660 34348 29577 -48845 42732 -84542
15427e1782A21572O0698b48735A68732c7246D96M9101h7907L9126n8460n3069
$$ -51782 121572 182270 -248735 168732 -37246 496 49597 -87907 -48781 -107241 -160310
15416a60310Q0138A07576B0567L11888F6682g1144B92884F4936a26529G9240a56952
$$ -160310 -80172 107576 20567 332455 66682 -71144 292884 64936 -126529 79240 -156952
15404C3034a40487A43747a51271r7843A50652a43131o8346M3124A16000N784j0146
$$ 33034 -140487 143747 -151271 -249114 150652 -143131 -211477 -168353 116000 121784 111638
15393A11638O8292c2372j3358j63151A3438g9888C9053b85795D27924D8447e3311
$$ 111638 179930 -32372 -45730 -208881 13438 -79888 39053 -285795 427924 48447 -53311
15381a716o5876k37627L4867l5540B79886k0452A02342M2752b41733g2870c0869
$$ -1716 -67592 -305219 -270352 -305892 279886 259434 102342 145094 -241733 -72870 -30869
15369d31139C38140B1069b10456i9543l1739A867b34066A30585b88882h5183A397
$$ -431139 338140 21069 -210456 -99543 -131282 1867 -234066 130585 -288882 -85183 1397
15357e8261A9940a9748C57298B0195a0723B9082a79346K9925B29547a06549p2663
$$ -58261 19940 -19748 357298 20195 -10723 29082 -179346 -149421 229547 -106549 -179212
15346a79212I6139b01483A11427a24179D092M0355H606J33885A4823c43622a41082
$$ -179212 96139 -201483 111427 -124179 4092 44447 8606 142491 14823 -343622 -141082
15334G3623L65534c3190A1658h6453k12004B72873m5656a09166q5223A15295N0540
$$ 73623 439157 -33190 11658 -86453 -298457 272873 227217 -109166 -194389 115295 165835
15323A65835l6134d05178B99658d5029o2023J0021d3527n8832A94930k2663J1124
$$ 165835 129701 -405178 299658 -45029 -107052 -97031 -43527 -102359 194930 172267 183391
15312A83391a3251j44858r2386D2389h0838A27499a05845l08194G917j189O4465
$$ 183391 -13251 -158109 -250495 42389 -80838 127499 -105845 -414039 7917 6728 71193
15301G1193C2159J10852n9440c5833H8422e5452I3597h9741D2905b21430F3687
$$ 71193 32159 143011 83571 -35833 88422 -55452 93597 -89741 42905 -221430 63687
15289I2195b42728e8851A5822J09976h5851A77370J53472a19731m6086f7545j06593
$$ 92195 -242728 -58851 15822 125798 -85851 177370 330842 -119731 -165817 -67545 -174138
15278a74138C81992N123g3667A01018d5517I731g4604A58249g1213E7318Q1230
$$ -174138 381992 387115 -73667 101018 -45517 9731 -74604 158249 -71213 57318 138548
15267A38548l0624f8548C5509d9481b2994C12753E6034k0729a51568G5831K21981
$$ 138548 107924 -68548 35509 -49481 -22994 312753 56034 35305 -151568 75831 297812
15256B97812J620A09515M22518G6834J9042K55056J64989B31357I3155K24817
$$ 297812 299432 109515 532033 76834 95876 350932 515921 231357 93155 317972
15246C17972C8450E669J57659L29729A55183K8440A2973J07703n7580b24740B76858
$$ 317972 38450 5669 163328 493057 155183 183623 12973 120676 63096 -224740 276858
15234e4677C34345h435C3226i4425B55800a44183B92388p8151N8669a70658c0488
$$ -54677 334345 -8435 33226 -94425 255800 -144183 292388 214237 272906 -170658 -30488
15222C55748a76168M7749E4207K43977b59068E80168A6961d2588l1367l2348C70002
$$ 355748 -176168 -128419 54207 298184 -259068 580168 16961 -42588 -73955 -106303 370002
15210B63924I9701g5521B33543a48268B13612J20851I6178M6930J60310G4206
$$ 263924 99701 -75521 233543 -148268 213612 334463 96178 143108 303418 74206
15199B50388c2074k48852J07376D2240a00878D047J8625d8671A04976A9222M3929
$$ 250388 -32074 -280926 -173550 42240 -100878 4047 22672 -48671 104976 19222 63151
15188F3151d193B97036a68949c6275B02278a80332A42844n6073C5986f3916k16248
$$ 63151 -4193 297036 -168949 -36275 202278 -180332 142844 86771 35986 -63916 -280164
15177b80164A79270o461C2319c6539B39147f2783A70979J6957c3854r358D8588
$$ -280164 179270 172809 32319 -36539 239147 -62783 170979 187936 -33854 -43212 48588
15165i5503A33346a59332A04873M5061b9865H6500a0776j9413F289L42452j17340
$$ -95503 133346 -159332 104873 149934 -29865 86500 -10776 -30189 6289 348741 231401
15154B31401q1104F4140f8241E4919d4951b726E5732K40388j17147a69088B7091
$$ 231401 150297 64140 -68241 54919 -44951 -2726 55732 296120 178973 -169088 27091
15142A24213K46139f399A52231J85958A23854R8549E620J35375J83430a23975
$$ 124213 370352 -6399 152231 338189 123854 222403 5620 140995 324425 -123975
15131h8258B6417L23071A55887n582A5893M29239D6853j0846a81978A18221C3993
$$ -88258 26417 349488 155887 150305 15893 445132 46853 36007 -181978 118221 33993
15119A08328i1327B42171L5324a36880C20810A11481M02065A1391a23336I8278
$$ 108328 -91327 242171 277495 -136880 320810 111481 513546 11391 -123336 98278
15108a42170M2221A31257M28540a9288A45681J68220j39901E4390c29227E093
$$ -142170 -99949 131257 559797 -19288 145681 313901 174000 54390 -329227 5093
15097F0877d4049j1096j49664E7870K14389B1254J04398e5302A66064D2241K18965
$$ 60877 -44049 -55145 -204809 57870 272259 21254 125652 -55302 166064 42241 261206
15086B61206i5926p974n896C6397a46555b4810C67232A3847J6888a37783b2074
$$ 261206 -95926 -103900 -109796 36397 -146555 -24810 367232 13847 30735 -137783 -22074
15074A27176F123J94121p6187J3866J82038I1208j9111l446J39840G5192j5415
$$ 127176 6123 200244 124057 137923 319961 91208 72097 68651 208491 75192 59777
15063E9777J13677a26668E6023c2086A02253a88775I0848J49986d2682G8916e8603
$$ 59777 173454 -126668 56023 -32086 102253 -188775 90848 240834 -42682 78916 -58603
15051A24397p635M64680d5129A73688l1513k8924J76415A42203J8493Q9417a6144
$$ 124397 116762 581442 -45129 173688 142175 113251 289666 142203 160696 250113 -16144
15039E9817K81595F0418O5425K1988b26648B56844q7177p0722K8008M39602e6713
$$ 59817 341412 60418 125843 147831 -226648 256844 169667 98945 126953 566555 -56713
15027D20712a18264B15561A02751J37952I0171j0588C7378a08390B77094A9531
$$ 420712 -118264 215561 102751 240703 90171 79583 37378 -108390 277094 19531
15016C19243F3330L03090d9459G476b21705C40659E6705J33950a23229A35277
$$ 319243 63330 366420 -49459 7476 -221705 340659 56705 190655 -123229 135277
15005C97718a06098c9781C18011A01157J66095C7019M79272A93189K52829B4747
$$ 397718 -106098 -39781 318011 101157 267252 37019 516291 193189 446018 24747
14994B38224q5400E1925J72800o0209K51723k4989k1270j80283K26794B342f3268
$$ 238224 152824 51925 224725 164516 416239 391250 369980 189697 416491 2342 -63268
14982a40170B89497J26746A28773j0508J72764r7014K87261n8161a07291o700
$$ -140170 289497 416243 128773 118265 291029 194015 481276 423115 -107291 -113991
14972a13991I451J42260J09586L9073B1524b1629k27493A77316C9928K65408p5806
$$ -113991 9451 151711 261297 300370 21524 -21629 -249122 177316 39928 305336 229530
14961B29530k3029p2597c9158B45939G4038J97770L51978C8976e2469j85651g6355
$$ 229530 206501 133904 -39158 245939 74038 271808 623786 38976 -52469 -238120 -76355
14949a01626B17771N6099o6560k3020J72326m5073J23392k4717G1140L20261I3766
$$ -101626 217771 273870 207310 184290 356616 311543 434935 410218 71140 391401 93766
14937A47786C1602K31378P5444j5871F5788l1249N60193k69366j48792n5366j6333
$$ 147786 31602 262980 338424 322553 65788 34539 594732 325366 176574 121208 104875
14926A04875N7778P1543b08556D19860D0231K65125j8081K04142j95583N57j41782
$$ 104875 162653 234196 -208556 419860 40231 305356 287275 491417 295834 296391 154609
14915A54609J60320l2459O7103L10500C09522O5273J9584j85217M0620L10994
$$ 154609 314929 282470 349573 660073 309522 374795 394379 209162 249782 560776
14905E60776A23099J38362e685D6829M07138A72484P460N845K94934B02844G2209
$$ 560776 123099 261461 -5685 46829 453967 172484 179944 185789 480723 202844 72209
14893A2774L31257K1794K50010M7828C24892J11265j89754L05333A44773K5027
$$ 12774 344031 365825 615835 663663 324892 436157 246403 551736 144773 169800
14883A69800J55183j38116K92148A76263p3317A8864b51947E8477f2589B34816
$$ 169800 324983 186867 479015 176263 102946 18864 -251947 58477 -62589 234816
14872B22489o9177o4107K54025K89364I7294L64421P7484B54777m5189M2075N38753
$$ 222489 153312 89205 343230 632594 97294 461715 539199 254777 209588 251663 790416
14861G90416A97167K50058j69627A12027Q2312r6651P0520L16784F4776J55409
$$ 790416 197167 447225 277598 112027 194339 97688 168208 484992 64776 220185
14851B20185J27058j08661J69382j34378K53504j95516n411j24131K8477M6968
$$ 220185 347243 238582 407964 273586 527090 331574 326163 202032 230509 277477
14841B77477m5149J21325J07053k07590L61808k23840Q498j11756m336K07635
$$ 277477 232328 353653 460706 253116 614924 391084 399582 287826 283490 491125
14831D91125J68164k35696j26978q643L58415j46389B5932N52654j48296K81447
$$ 491125 659289 423593 296615 287972 646387 499998 25932 578586 430290 711737
14821G11737l28057R8771n1388P0167j49221o7398J52521A94358J28442n6140
$$ 711737 383680 482451 431063 501230 352009 284611 437132 194358 322800 266660
14811B66660L74822a72835D09553A93863K53234o333J19076Q0056k76831K26008
$$ 266660 641482 -172835 409553 193863 447097 440764 559840 639896 363065 589073
14801E89073A91161K15338K26524B95755J07995K92584C00168M18584k37367L5712
$$ 589073 191161 406499 633023 295755 403750 696334 300168 718752 481385 517097
14791E17097k06075K16815O5028M2487A43001L49060j93774J14974Q1529J78758
$$ 517097 311022 527837 592865 635352 143001 492061 298287 413261 494790 673548
14781F73548B62723M0823o1142K98115J63967k71282Q7369B38289M02125n8155
$$ 673548 262723 303546 242404 540519 704486 433204 520573 238289 640414 582259
14771E82259j56412K31936J29868m8314k25300J31531B26134o9102J39357M13183
$$ 582259 425847 657783 787651 739337 514037 645568 226134 157032 296389 709572
14761G09572A49922K95784K45853j08338O1752j13525n0574K61205l50595A44197
$$ 709572 149922 445706 691559 583221 644973 531448 480874 742079 391484 144197
14750F54432O2427k21392j08585j13352K68274o596j16941R7220M9201j53698
$$ 654432 716859 495467 386882 273530 541804 535208 418267 515487 564688 410990
14740D10990J10415E8249K57006K45169P6001k2848K0875m5289N3976m6963k69520
$$ 410990 521405 58249 315255 560424 636425 613577 634452 589163 643139 596176 326656
14729C26656J55579J70392m2976K07268j5768C13183p4995J18896K26233j67148
$$ 326656 482235 652627 609651 816919 801151 313183 238188 357084 583317 416169
14719D16169J61375J21576j39607k2422l1689K14446N4384J18228l67080J96966
$$ 416169 577544 699120 559513 537091 505402 719848 774232 892460 525380 722346
14709G22346M5129k84858o9294L23103k55197J40928J991j00153J23130J66623
$$ 722346 767475 482617 413323 736426 481229 622157 624148 523995 647125 813748
14699H13748L09560m12397k96502K51399k31373N98625m23407O8830j83643K31714
$$ 813748 1123308 710911 414409 665808 434435 1033060 609653 678483 494840 726554
14689G26554j90740L03782j96325r3040Q7586J05222j9898K13110J07657m05556
$$ 726554 535814 839596 643271 550231 637817 743039 723141 936251 1043908 638352
14679F38352L91872m06211K06273J37891j91418K5146K08491k55118k72509M31856
$$ 638352 1030224 624013 830286 968177 776759 801905 1010396 755278 482769 914625
14669I14625k11956L70096k70248k81652M06957k71114m8433P8035K70951j27469
$$ 914625 702669 1072765 802517 520865 927822 656708 608275 686310 957261 829792
14659H29792l47257N90104n11175M11121l98512K26429o8465j28250N19078E33276
$$ 829792 482535 1072639 561464 972585 574073 800502 732037 603787 1122865 533276
14648A053132j88359J7731J77601j35062k13707J02227M6032r6741J85154M36588
$$ 1053132 864773 882504 1060105 925043 711336 813563 859595 762854 948008 1384596
14638A384596k28730m3410k45836j45632K25512P8275k01780J73815N3822O5343
$$ 1384596 1155866 1112456 866620 720988 946500 1024775 822995 996810 1050632 1115975
14628A115975m16873J55782J74632K17630m34504J25660j12015J60611L4330N358
$$ 1115975 699102 854884 1029516 1247146 812642 938302 826287 986898 1021228 1026586
14618A026586J87447J76935k52277j0400q2255K00273l09899M56126m24413M83088
$$ 1026586 1214033 1390968 1138691 1128291 1046036 1246309 936410 1392536 968123 1451211
14608A451211L349j88445R3349p5450j23978o7106K49203J00764j98722K22025
$$ 1451211 1454560 1266115 1359464 1284014 1160036 1092930 1342133 1442897 1244175 1466200
14598A466200L9760k03710M5353o3734M67195k82447r1092k53914J38358L06607
$$ 1466200 1505960 1302250 1347603 1283869 1751064 1468617 1377525 1123611 1261969 1568576
14588A568576l02520N2600Q0870j96826N5453J39663J41560j55581J10856J15339
$$ 1568576 1266056 1318656 1399526 1202700 1258153 1397816 1539376 1383795 1494651 1609990
14578A609990M3637j21351R222K26044R2438J23450r8723K7462j42824J10845
$$ 1609990 1653627 1532276 1541498 1767542 1859980 1983430 1884707 1912169 1769345 1880190
14568A880190M36541m74856J15948J87851j62229L3896K31017j16664k80245J37105
$$ 1880190 2316731 1841875 1957823 2145674 1983445 2017341 2248358 2131694 1851449 1988554
14558A988554O07996l57224L85298j25733N04996J60627M62625N38976P98921
$$ 1988554 2596550 2239326 2624624 2498891 3003887 3164514 3627139 4166115 4965036
14549D965036J254789M586070R785214J2007755M306617j8251137G938797l311801
$$ 4965036 6219825 10805895 20591109 32598864 36905481 18654344 7938797 4626996
14541D626996j749543m97903m21419j68303L6456K37541l26408l3199j37711K16088
$$ 4626996 2877453 2379550 1958131 1789828 1826284 2063825 1737417 1704218 1566507 1782595
14531A782595K41945M6628k57868N9639Q0466k28173O4204K92589j58724l3043
$$ 1782595 2024540 2071168 1813300 1872939 1953405 1725232 1789436 2082025 1923301 1890258
14521A890258J38844M2283n953J71888j71169J40734k40063M31256j38112p2050
$$ 1890258 2029102 2071385 2065432 2237320 2066151 2206885 1966822 2398078 2259966 2187916
14511B187916M80300n45939M88380k45859J49572J05970j96355j74950J83607
$$ 2187916 2668216 2122277 2610657 2364798 2514370 2620340 2423985 2249035 2432642
14502B432642m2138M05890j46716M71409o99245J04586K9385J34309J81769k89584
$$ 2432642 2390504 2796394 2649678 3121087 2421842 2526428 2555813 2690122 2871891 2582307
14492B582307L69855j47261K54737P1545J06738j32104P8619l01283J78469k75755
$$ 2582307 2952162 2804901 3059638 3131183 3237921 3105817 3184436 2883153 3061622 2785867
14482B785867K69749O8822k39489K791M2065J08383L07353k43531J72459K58695
$$ 2785867 3055616 3124438 2884949 2887740 2929805 3038188 3345541 3102010 3274469 3533164
14472C533164J05370N308l51817K47936J30520J23987k92188k27903M46954N8289
$$ 3533164 3638534 3643842 3292025 3539961 3670481 3794468 3502280 3274377 3721331 3779620
14462C779620l23065M91547m78785O02650j89342K9821J34668J16723K86958n33213
$$ 3779620 3456555 3948102 3469317 4071967 3882625 3912446 4047114 4163837 4450795 3917582
14452C917582M62899p1857j37621L48840L27066m12181J7471K20809N5946K50924
$$ 3917582 4380481 4308624 4171003 4519843 4846909 4434728 4452199 4673008 4728954 4979878
14442D979878j00603M1278K97259l28793K45562K12352j40992J32733L32046m28945
$$ 4979878 4879275 4920553 5217812 4889019 5134581 5346933 5205941 5338674 5670720 5241775
14432E241775J68077L81640j8634O2833J46589m35498O37120r4542K649K91228
$$ 5241775 5409852 5791492 5772858 5835691 5982280 5546782 6183902 6089360 6092009 6383237
14422F383237J84728L9628n2227P6766J27959O5664O2967J8598J5790J89402m1670
$$ 6383237 6567965 6607593 6555366 6632132 6760091 6825755 6888722 6907320 6923110 7112512 7070842
14411G070842M2214N54376k81052L16352j39467J50223J49688M96675L03947m95704
$$ 7070842 7113056 7667432 7386380 7702732 7563265 7713488 7863176 8359851 8663798 8168094
14401H168094L87828K29297J36487K0092q7952L39916j9724L25994k46466L33779
$$ 8168094 8555922 8785219 8921706 8941798 8853846 9193762 9174038 9500032 9253566 9587345
14391I587345L04146J76587l54071M80733J29633K96301Q739K54439L24038j24073
$$ 9587345 9891491 10068078 9714007 10194740 10324373 10620674 10629413 10883852 11207890 11083817
14381A1083817N74632j16790L72533L24400p0453M22147M70198q5611O12965J2692
$$ 11083817 11658449 11541659 11914192 12238592 12168139 12590286 13060484 12974873 13587838 13600530
14371A3600530L90106K25947K37448K41042M97907L88480M48275K52354N20447
$$ 13600530 13990636 14216583 14454031 14695073 15192980 15581460 16029735 16282089 16802536
14362A6802536L98175K88663L17039O46615K77037M13585M27643N10473R06041
$$ 16802536 17200711 17489374 17806413 18453028 18730065 19143650 19571293 20081766 20987807
14353B0987807M31058L35202M09717Q36665M57107N65271N63458P27708Q20487
$$ 20987807 21418865 21754067 22163784 23000449 23457556 24022827 24586285 25313993 26134480
14344B6134480N84624P03310P22367O97198R06709L90928J179366P34099J006508
$$ 26134480 26719104 27422414 28144781 28841979 29748688 30139616 31318982 32053081 33059589
14335C3059589P55321O01691J265336Q90780J362155R99799J223935J293410J267405
$$ 33059589 33814910 34416601 35681937 36572717 37934872 38934671 40158606 41452016 42719421
14326D2719421J288491J478979J758604R53684J640154J736083J718324K287353
$$ 42719421 44007912 45486891 47245495 48199179 49839333 51575416 53293740 55581093
14318E5581093J512850K193617K803077K318784K264405L016014K684176L291369
$$ 55581093 57093943 59287560 62090637 64409421 66673826 69689840 72374016 75665385
14310G5665385L346739L519435L948715L994129M329305M443542M685965N271215
$$ 75665385 79012124 82531559 86480274 90474403 94803708 99247250 103933215 109204430
14302A09204430N726237N707170O342485O346134O938742P335942P736280Q023256
$$ 109204430 114930667 120637837 126980322 133326456 140265198 147601140 155337420 163360676
14294A63360676R325881R333003J0104818J0683195J1321515J2322331J2233964
$$ 163360676 172686557 182019560 192124378 202807573 214129088 226451419 238685383
14287B38685383J3304235J3851592J4197996J4705715J5570363J5630262J6480324
$$ 238685383 251989618 265841210 280039206 294744921 310315284 325945546 342425870
14280C42425870J5878124J6346608J5629190J4711842J3786209J2723596J0762850
$$ 342425870 358303994 374650602 390279792 404991634 418777843 431501439 442264289
14273D42264289Q230782K848479k644032k841891O91735l813949n097601p772999
$$ 442264289 450495071 453343550 450699518 447857627 448549362 444735413 439637812 431864813
14265D31864813r790960j0571045j1899479j3996125j4890694j4946827j5444990
$$ 431864813 422073853 411502808 399603329 385607204 370716510 355769683 340324693
14258C40324693j6102348j6118316j5620157j5221712j4453277j3816570j3212570
$$ 340324693 324222345 308104029 292483872 277262160 262808883 248992313 235779743
14251B35779743j2630291j1804701j1230967j0356092r533529r324527q590630
$$ 235779743 223149452 211344751 200113784 189757692 180224163 170899636 162309006
14244A62309006p565432p175697p215009p036139o231150n697000m910025n269544
$$ 162309006 154743574 147567877 140352868 133316729 127085579 121388579 116478554 111209010
14236A11209010m919074m554761m491359l844027l817209l059011m064897l150596
$$ 111209010 106289936 101735175 97243816 93399789 89582580 86523569 82458672 79308076
14228G9308076l237502l213181k772869k653787k650959k667602k214554k204063
$$ 79308076 76070574 72857393 70084524 67430737 64779778 62112176 59897622 57693559
14220E7693559j926743k110469j614905j996378j537821j666779j101960j491431
$$ 57693559 55766816 53656347 52041442 50045064 48507243 46840464 45738504 44247073
14212D4247073j771758j454771j508586q51003j577141n55050j220889j157266
$$ 44247073 42475315 41020544 39511958 38660955 37083814 36528764 35307875 34150609
14204C4150609j138940j070571q48481o38095p71998p53489q15032q47175o11148
$$ 34150609 33011669 31941098 31092617 30454522 29682524 28929035 28114003 27266828 26655680
14195B6655680n44764n63593p28295r30892j30372o52580j114132l7739p62885
$$ 26655680 26110916 25547323 24819028 23888136 23757764 23105184 21991052 21953313 21190428
14186B1190428N2549m69624q17167m0301m45103n86161k96684k71846p28922q1686
$$ 21190428 21242977 20773353 19956186 19915885 19470782 18884621 18587937 18316091 17587169 17505483
14176A7505483j95098l84960k00097l96911m39396O4338l21827n97624j35449
$$ 17505483 17310385 16925425 16725328 16328417 15889021 15953359 15631532 15033908 14898459
14167A4898459j52305q43409M34780l77211o19188j76174r766r2175m69937n02720
$$ 14898459 14746154 13902745 14337525 13960314 13341126 13164952 13155186 13063011 12593074 12090354
14157A2090354j04080K9411k73122j52031k17923k26524m11839j01984k65222
$$ 12090354 11986274 12015685 11742563 11590532 11372609 11146085 10734246 10632262 10367040
14148A0367040k11205J93911l28482j80543j53437K13882o16023k99924j20348
$$ 10367040 10155835 10349746 10021264 9840721 9687284 9901166 9285143 8985219 8864871
14139H864871J09963j2577j03221k13079k46276j34580J15177n02792R6101Q3570
$$ 8864871 8974834 8962257 8859036 8645957 8399681 8265101 8380278 7877486 7973587 8057157
14129H057157o34852K69384k9171m09544j77295N9443j94075l629j52692Q79P5431
$$ 8057157 7422305 7691689 7662518 7252974 7075679 7135122 6941047 6937418 6784726 6785605 6861036
14118F861036j31503l23074k76584L29390o03668L11339l07902J98142K5874o43270
$$ 6861036 6729533 6406459 6129875 6459265 5855597 6166936 5859034 6057176 6083050 5439780
14108E439780K23971J07120k74610J74783j96151L2551l67349j49952M43895j12726
$$ 5439780 5663751 5770871 5496261 5671044 5474893 5507444 5140095 4990143 5434038 5321312
14098E321312k90779l77030K55716J18010k30356J57166j27778j31870n04702
$$ 5321312 5030533 4653503 4909219 5027229 4796873 4954039 4826261 4694391 4189689
14089D189689M44189J14224l27035o1364k8599r5459o6311J81159k5415j90913
$$ 4189689 4633878 4748102 4421067 4359703 4331104 4235645 4169334 4350493 4325078 4134165
14079D134165k49850Q6337L97469k78857q4732m4434k20805J90247j40832l42623
$$ 4134165 3884315 3970652 4368121 4089264 4004532 3960098 3739293 3929540 3788708 3446085
14069C446085K71050P2836m22628N30467o44888K71255l02162L40735J02474o2564
$$ 3446085 3717135 3789971 3367343 3897810 3252922 3524177 3222015 3562750 3665224 3602660
14059C602660k88989L4934Q6350k23994K32171O6137n16408N2295L0675J65573
$$ 3602660 3313671 3348605 3434955 3210961 3443132 3509269 2992861 3045156 3075831 3241404
14049C241404k12344j73413L2535k25391L43696k95972l4243J82501o28308O10404
$$ 3241404 3029060 2855647 2888182 2662791 3006487 2710515 2676272 2858773 2230465 2840869
14039B840869j94236l5867J66431J11935l46454O1965k65544L65108j01154j52715
$$ 2840869 2646633 2610766 2777197 2889132 2542678 2604643 2339099 2704207 2603053 2450338
14029B450338K0838K456K9246N1925j10104k04194j32103K1969j59893L4578M84181
$$ 2450338 2471176 2473632 2502878 2554803 2444699 2240505 2108402 2130371 1970478 2005056 2489237
14018B489237p495n95352L04016O238J55697l95970J6592K11961M8352r0557j61466
$$ 2489237 2481742 1886390 2190406 2196644 2352341 1956371 1972963 2184924 2233276 2142719 1981253
14007A981253M09372m2247n0094k51165N7431k02623r3107J43558k79229J19823
$$ 1981253 2390625 2348378 2298284 2047119 2104550 1901927 1808820 1952378 1673149 1792972
13997A792972m669k90141J42961N02120p22529K39086L32009L89406O07558K962486
$$ 1792972 1788303 1498162 1641123 2143243 1420714 1659800 1991809 2381215 2988773 5951259
13987E951259Q346529J3776119J0701723j5120215j1497096m424739k181759j446524
$$ 5951259 14297788 28073907 38775630 23655415 12158319 7733580 5551821 4105297
13979D105297m33873l72748j25237m65252j09850l24335K60783K420J9747m06223
$$ 4105297 3671424 3298676 3173439 2708187 2598337 2274002 2534785 2537205 2556952 2150729
13969B150729O9551j16812r5281r3383K32595k04607O7681k02076N7108k9509
$$ 2150729 2220280 2103468 2008187 1914804 2147399 1942792 2010473 1808397 1865505 1835996
13959A835996Q0000r5519M8378o6310J74751Q9209k25403J09908j68845J44642
$$ 1835996 1915996 1820477 1868855 1802545 1977296 2066505 1841102 1951010 1782165 1926807
13949A926807r0673j86231Q5561j33097n313j152R5912l503j36623K5742R3100
$$ 1926807 1836134 1649903 1735464 1602367 1597054 1595902 1691814 1688311 1551688 1577430 1670530
13938A670530K92206j65229L5829m46356k26581L21840J13267k26413r9557M01659
$$ 1670530 1962736 1797507 1833336 1386980 1160399 1482239 1595506 1369093 1269536 1671195
13928A671195j86015J8058k08691K44747j3305q2689k7429j66470J71907m08289
$$ 1671195 1485180 1503238 1294547 1539294 1525989 1443300 1415871 1249401 1421308 1013019
13918A013019R4731J74284J16488j01912J2114o5968Q6580q6080k11027p8026
$$ 1013019 1107750 1282034 1398522 1296610 1308724 1242756 1329336 1243256 1032229 954203
13908I54203J53702L53663j88210K77784j24051m21530M58308k92206K42501k47387
$$ 954203 1107905 1461568 1273358 1551142 1427091 1005561 1463869 1171663 1414164 1166777
13898A166777R8062j90073k78544L50383J1004p7345P6808L19981l10033J65300
$$ 1166777 1264839 1074766 796222 1146605 1157609 1080264 1157072 1477053 1167020 1332320
13888A332320j97927j52453L21218p1973k54705K7941J01479k32014K84547k17537
$$ 1332320 1134393 981940 1303158 1231185 976480 1004421 1105900 873886 1158433 940896
13878I40896k716J41392K59667F50482M86326j22131k17031J69179K22731K54306
$$ 940896 938180 1079572 1339239 650482 1136808 1014677 797646 966825 1189556 1443862
13868A443862r2041k87054j53389k52232K46644Q5305K0641n7554k57003N69420
$$ 1443862 1351821 1064767 911378 659146 905790 991095 1011736 954182 697179 1266599
13858A266599q7894m01653J20540K61801m34416J54048n382r1071k59208L18236
$$ 1266599 1178705 777052 897592 1159393 724977 879025 873643 782572 523364 841600
13848H41600l0759K32245j35926k29399l0148L40167p2164m4871j18171K83658
$$ 841600 810841 1043086 907160 677761 647613 987780 915616 870745 752574 1036232
13838A036232r6343P5027j50112J44352k05938M3492n5656l63828K18506L57195
$$ 1036232 939889 1014916 864804 1009156 803218 846710 791054 427226 645732 1002927
13828A002927k3910K4007J35910l05595j24973L5509L6499J95929m57278J40242
$$ 1002927 979017 1003024 1138934 833339 708366 743875 780374 976303 519025 659267
13818F59267j1618l3589J05247K28537l84776L57585l21376q2511B05934M85865
$$ 659267 647649 614060 719307 947844 563068 920653 599277 516766 205934 691799
13808F91799O7934j1665p6772m1674Q9978j55969L45788l46466K7948k2429j47366
$$ 691799 759733 748068 671296 629622 719600 563631 909419 562953 590901 568472 421106
13797D21106K80033j98482K05599L22328E01933l111L91739J41097m71337J46901
$$ 421106 701139 502657 708256 1030584 501933 498822 890561 1031658 560321 707222
13787G07222j54266l3796L74215j67023K98588k30169j04375Q9110M9963J61037
$$ 707222 552956 519160 893375 726352 1024940 794771 690396 779506 829469 990506
13777I90506B87110M28533C26931O54665m62978J26152P3630k17469o5491K24312
$$ 990506 287110 715643 326931 981596 518618 644770 718400 500931 435440 659752
13767F59752k7257J96677l28309j75308R9616L82998m8894M6902k65467n0693
$$ 659752 632495 829172 500863 325555 425171 808169 759275 806177 540710 490017
13757D90017l0437K95855p7835j34396M08749C63874j4670J98432o457j54977
$$ 490017 459580 755435 677600 543204 951953 363874 349204 547636 541179 386202
13747C86202p5296Q9963L68173j19743C13745J29858O9644L1768K37650l23425
$$ 386202 310906 400869 769042 649299 313745 443603 513247 545015 782665 459240
13737D59240O1919J99689A82029M84042k63574q7696M68264l79523K20645B59368
$$ 459240 521159 720848 182029 666071 402497 314801 783065 403542 624187 259368
13726G20941C31251J07572j69876J78224J14011k01330o4184J05054L94783k33260
$$ 720941 331251 438823 268947 447171 561182 359852 295668 400722 795505 562245
13716E62245J61884k24092J36312B59333L57112k46252l683N5832A78063J04633
$$ 562245 724129 500037 636349 259333 616445 370193 366510 422342 178063 282696
13706B82696j28830K41570K57176m3313O2138k28791K24164B70288J47655O8570
$$ 282696 153866 395436 652612 609299 671437 442646 666810 270288 417943 486513
13696D86513j28511J89721j25074J80978B35557L3109M7079K8937J43200j8049
$$ 486513 358002 547723 422649 603627 235557 268666 315745 344682 487882 469833
13686D69833N4550J03286B17645l0088J5500j4896K74159J04367N6630q8648o0718
$$ 469833 524383 627669 217645 187557 203057 188161 462320 566687 623317 534669 473951
13675D73951b05250A96206R4521J65901O5346B55544J03838J54564o6353j00938
$$ 473951 -205250 196206 290727 456628 521974 255544 359382 513946 447593 346655
13665C46655p1411K43199m6697j59670K6349L605N6428j52037L3390M57850B52366
$$ 346655 275244 518443 471746 312076 338425 342030 398458 246421 279811 737661 252366
13653C76152J71957k69069r3319R9398K55447A38552K13538M9798j01069J14446
$$ 376152 548109 279040 185721 285119 540566 138552 352090 401888 300819 415265
13643D15265A90834K02349R5807C0839M27734n4807J938A15503O941K09786J73335
$$ 415265 190834 393183 488990 30839 458573 403766 405704 115503 122444 332230 505565
13632E05565j12455j47470L25017P3234j62644A41459Q4491L6666K77407j42872
$$ 505565 393110 245640 570657 643891 481247 141459 225950 262616 540023 397151
13622C97151j23907D8115P2363K71810j56992H1122K83828j02035J56909A90068
$$ 397151 273244 48115 120478 392288 235296 81122 364950 262915 419824 190068
13611D53430j63444J5877j05746J57380J25811j72179L872J13035C994L01688
$$ 453430 289986 305863 200117 357497 483308 311129 315001 428036 3994 305682
13601C05682n9184J55161o3940l2102q8953n75M6568J51164j18938A45684N14373
$$ 305682 246498 401659 337719 305617 216664 216089 262657 413821 294883 145684 660057
13590F60057B89732A09895L02809A07277J1574l0928K54652j32764D1752L84110
$$ 660057 289732 109895 412704 107277 118851 87923 342575 209811 41752 425862
13580D25862K69726r5573j71618M8958L3315j81233C6361K16518H2763Q2357Q1623
$$ 425862 695588 600015 428397 477355 510670 329437 36361 252879 82763 165120 246743
13569B46743N6719e155C58301q904J6078m7505L0113j63913D5937a26835B49113
$$ 246743 303462 -5155 358301 349397 365475 317970 348083 184170 45937 -126835 249113
13557A50389M33977c22583C35706q3271L23137B24847R8595A5326L31578q5547
$$ 150389 584366 -322583 335706 252435 575572 224847 323442 15326 346904 261357
13547B61357D3068J48416a1874A08433L1488M04636N6785F8949J47181O4953M1256
$$ 261357 43068 191484 -11874 108433 139921 544557 601342 68949 216130 281083 322339
13536C22339k1210c585D38541B8506P8347K54425F6599C113J5484N24506l9825
$$ 322339 301129 -3585 438541 28506 106853 361278 66599 3113 18597 543103 503278
13525E03278j15808j03013M6055K8780m0772K8278H5933L79020O0315A57935K68162
$$ 503278 387470 284457 330512 359292 318520 346798 85933 464953 525268 157935 426097
13514D26097r7398I2347L70647F7417L38391A08980e6449B81796M0243m1462k9823
$$ 426097 328699 92347 462994 67417 405808 108980 -56449 281796 322039 280577 250754
13503B50754o0819J38615A21258n0897K55911A25617J73003Q5710j77504l1547
$$ 250754 189935 328550 121258 70361 326272 125617 298620 384330 206826 175279
13493A75279R2470m9853P7900a48755E33551B11583O1311g884C21018g914C26811
$$ 175279 267749 217896 295796 -148755 533551 211583 272894 -7884 321018 -7914 326811
13481C84834A77752J9040J17328l1575k2163k8563M1617J90075k06993L59827
$$ 384834 177752 196792 314120 282545 260382 231819 273436 463511 256518 616345
13471F16345A23747Q7301J03057B8486K82138j50527K8537e5788B8414K25259
$$ 616345 123747 211048 314105 28486 310624 160097 188634 -55788 28414 253673
13461B53673A12704j919R5706f7890A37118i1225A90989J21277B6381L91773a7256
$$ 253673 112704 110785 206491 -67890 137118 -91225 190989 312266 26381 418154 -17256
13449C26195m1205r2652J10964J19284j12903m147L9992G3406K31187M4539A06669
$$ 326195 284990 192338 303302 422586 309683 305536 345528 73406 304593 349132 106669
13437F2405J52655j03811K04793J08461j22519H8101A6984L02748l3486a18114
$$ 62405 215060 111249 316042 424503 301984 88101 16984 319732 286246 -118114
13426A0420b23775C56771K38720A50254c3550B72088B3416Q4712J62181K35438
$$ 10420 -223775 356771 595491 150254 -33550 272088 23416 108128 270309 505747
13416E05747B42103H1464j3914M0485L07670L0632A60726E4480K54310k5678k6348
$$ 505747 242103 81464 67550 108035 415705 446337 160726 54480 308790 283112 256764
13405B56764r5718M6469J91306A99332P9430b72140A20845N0395K0213Q5766k1769
$$ 256764 161046 207515 398821 199332 278762 -272140 120845 171240 191453 277219 255450
13394B55450L6868m2968l1203o9123a80247I5477R4274k6200f2479D7207a31554
$$ 255450 292318 249350 218147 149024 -180247 95477 189751 163551 -62479 47207 -131554
13382g8310A66427K12986a33394B71692b5128A51171M8216k4715J14457p209j0321
$$ -78310 166427 379413 -133394 271692 -25128 151171 199387 174672 289129 281920 271599
13371B71599N1251e8409D96074j74154d8418B15541H0098d9003b0447I0156P7733
$$ 271599 322850 -58409 496074 321920 -48418 215541 80098 -49003 -20447 90156 167889
13360A67889K45910A35483E7909e6246A99417n6402k2514j4907a58469A12922
$$ 167889 413799 135483 57909 -56246 199417 143015 120501 105594 -158469 112922
13349B3229K61896J20990j81722E4981L66455J94588j09005H6816N2538J54445
$$ 23229 285125 406115 224393 54981 421436 616024 507019 86816 139354 293799
13339B93799k2350j08559L0026a09411E41153A73694K09493r8972P7835a41055
$$ 293799 271449 162890 192916 -109411 541153 173694 383187 284215 362050 -141055
13328A70826F5960J57969P5572J41928A77358J00913A22363a8546D88734b07964
$$ 170826 65960 223929 299501 441429 177358 278271 122363 -18546 488734 -207964
13317B45529k8710K22567j9350b3297C80129A14464R3038G8273J77854j10139
$$ 245529 216819 439386 420036 -23297 380129 114464 207502 78273 256127 145988
13307A45988K48654H4552A0566L26928A59844J22136D5386b5072q0115B60079
$$ 145988 394642 84552 10566 337494 159844 281980 45386 -25072 -105187 260079
13296E99566k60515h6164b7840j547A03170J03325J16045j29879q4163K65702
$$ 599566 339051 -86164 -27840 -29387 103170 206495 322540 192661 108498 374200
13286C74200A19063B9823K68552G662K31470L861H324b16488E7639K92230A0685
$$ 374200 119063 29823 298375 7662 239132 242993 8324 -216488 57639 349869 10685
13274b2216r1212b7819A46445K2082k1901b22477H0464P334L98065B2565K15370
$$ -22216 -113428 -27819 146445 168527 146626 -222477 80464 87798 485863 22565 237935
13263B37935n9135a7780m01812c7576A69032J36398i2708B01754C5460K81010
$$ 237935 178800 -17780 -419592 -37576 169032 305430 -92708 201754 35460 316470
13253C16470q7919j8057P6469j5975h7292L4257H241N4156Q5476p0590d5656a7981
$$ 316470 228551 210494 286963 270988 -87292 -53035 8241 62397 147873 77283 -45656 -17981
13240A58101J634o6349J03088H7666J23400A2224N2268J29735a8723j60260A31499
$$ 158101 159735 93386 196474 87666 211066 12224 64492 194227 -18723 -178983 131499
13228F2854p990j9155b89145g1217L0329C97355a71115A64217D916a6068A86706
$$ 62854 54864 35709 -289145 -71217 -40888 397355 -171115 164217 4916 -16068 186706
13216c1607j20666I5610b9804B38913J35765O5716a17650B44772P8864E0487Q7222
$$ -31607 -152273 95610 -29804 238913 374678 440394 -117650 244772 323636 50487 137709
13205A37709a70110A90515K50999k07491J15875A10532b02214C19398a3433r9010
$$ 137709 -170110 190515 441514 234023 349898 110532 -202214 319398 -13433 -112443
13195a12443B3645O4280c8787B50256A24482a2390B14321j2753r2882f0995A91382
$$ -112443 23645 87925 -38787 250256 124482 -12390 214321 201568 108686 -60995 191382
13183a00873A83179m6616g6674k0454D28058j92330I4304c1530D86923a1425j87640
$$ -100873 183179 136563 -76674 -97128 428058 235728 94304 -31530 486923 -11425 -199065
13172a99065A47975e0310D40907H1836C2605L11387H7606P083a10233A2874l708
$$ -199065 147975 -50310 440907 81836 32605 343992 87606 94689 -110233 12874 9166
13161I166Q9000L8589J52325A33820a55912L5552J3404C45294h8265H3348a39194
$$ 9166 98166 136755 289080 133820 -155912 -120360 -106956 345294 -88265 83348 -139194
13149A41977M1419L5286b29977J10924j33348A50221E7224J88866A7845a89432
$$ 141977 183396 218682 -229977 -119053 -252401 150221 57224 246090 17845 -189432
13138B47556B1974b09004I9023J64369j29441M9994C9706M6816B7888b24631B84574
$$ 247556 21974 -209004 99023 263392 133951 183945 39706 86522 27888 -224631 284574
13126B70188n5804r3169k7681c5203B14596H7222P2942b22714q8774H7685a78529
$$ 270188 214384 121215 93534 -35203 214596 87222 160164 -222714 -311488 87685 -178529
13114I8052e1046F0645a39377I2132a28880D1623b64037D11484I3291K0380k6157
$$ 98052 -51046 60645 -139377 92132 -128880 41623 -264037 411484 93291 113671 87514
13103H7514B4677b15427A22662b67040A37031M890C4128Q5062d8329m0536I0340
$$ 87514 24677 -215427 122662 -267040 137031 141921 34128 119190 -48329 -88865 90340
13091F7875c30212B3729J01787B8799c4720E1464c0997j63018C06315j40522g6031
$$ 67875 -330212 23729 125516 28799 -34720 51464 -30997 -194015 306315 165793 -76031
13079B59706e2510A43390a44644A63627P2952a40575f0930B02570B4564R9763
$$ 259706 -52510 143390 -144644 163627 236579 -140575 -60930 202570 24564 124327
13069A24327l8566C4488J54894R0041I5358O2747m3a34247A34316J75895f2072
$$ 124327 85761 34488 189382 279423 95358 158105 158062 -134247 134316 310211 -62072
13057C69868A16565A6197a58797E7167K9678J68961A1300M51495F4245J19281
$$ 369868 116565 16197 -158797 57167 86845 255806 11300 462795 64245 183526
13047A83526j7945E536N4695B4579J33413B4639b37340C81979A34981E5942K89760
$$ 183526 165581 5536 60231 24579 157992 24639 -237340 381979 134981 55942 345702
13036C45702J28387A24186L52850B26145M1414a30024K0461A37473J07786m4711
$$ 345702 474089 124186 477036 226145 267559 -130024 -109563 137473 245259 200548
13026B00548K4192c5087D9909a55126m122A05857h829q0589B61285J12879I6432
$$ 200548 224740 -35087 49909 -155126 -159248 105857 -8829 -89418 261285 374164 96432
13014A53490n4240J41040H1278K73169G595d51395C6092J89345J6341J08619A06520
$$ 153490 99250 240290 81278 354447 7595 -451395 36092 225437 241778 350397 106520
13002B30620J74542j55360m2648k8272F7066J82246c881A27468C9405a1484n7151
$$ 230620 405162 249802 207154 178882 67066 249312 -3881 127468 39405 -11484 -68635
12991f8635A05497J43737a45482A13215C1296J64223n8430K09218e0909F676K54702
$$ -68635 105497 249234 -145482 113215 31296 195519 137089 346307 -50909 6676 261378
12980B61378a87311M2407e8998B38758I3036J32442d8788j0985G3108a80439B05543
$$ 261378 -187311 -144904 -58998 238758 93036 225478 -48788 -59773 73108 -180439 205543
12968E7026a39261J9633k14156A47302d4809q778C03688A42127a37694B01952
$$ 57026 -139261 -119628 -333784 147302 -44809 -53587 303688 142127 -137694 201952
12957B99102A20539D1286R0016J46656H2527K55416F5463b1007D9834a18516L7719
$$ 299102 120539 41286 131302 277958 82527 337943 65463 -21007 49834 -118516 -80797
12946h0797A17089a4026B56376A16289J51343M974A14965l061a54655e570A40927
$$ -80797 117089 -14026 256376 116289 267632 272606 114965 111904 -154655 -5570 140927
12934B25112q3104M3570J37541A55338C9791O9755e0905A26071c1517A29910K49033
$$ 225112 142008 185578 323119 155338 39791 109546 -50905 126071 -31517 129910 378943
12923C78943b3912J548k70759B14817a02195j8824q5567B1074J37865o1780J35995
$$ 378943 -23912 -22364 -293123 214817 -102195 -121019 -206586 21074 158939 97159 233154
12912B33154J11958A03220B8300N7726R7011b3522q2781E1015M4319K7689i1851
$$ 233154 345112 103220 28300 86026 183037 -23522 -106303 51015 95334 123023 -91851
12900b83933B49265P0618e6740m0671j04170o8299d793B6395O0178K05f0116J7413
$$ -283933 249265 319883 -56740 -97411 -201581 -269880 -4793 26395 86573 86778 -60116 -42703
12888d2703n7832A11631C0247L24866a75496A38301h8735p5954a7937j08906K7993
$$ -42703 -100535 111631 30247 355113 -175496 138301 -88735 -164689 -17937 -126843 -98850
12877i8850L6675a1610E9353N7363a66985d1668A38184I290K01019F3240c03921
$$ -98850 -62175 -11610 59353 116716 -166985 -41668 138184 9290 210309 63240 -303921
12865b55418H9108b35107d5604A768J75891E1120h505B73742a05981b8348m7847
$$ -255418 89108 -235107 -45604 1768 177659 51120 -8505 273742 -105981 -28348 -76195
12854g6195k20582b4686A97273F9086L3586K35319a37663e6918J7528B50501a24048
$$ -76195 -296777 -24686 197273 69086 102672 337991 -137663 -56918 -39390 250501 -124048
12842B10761l3386c4043D14639h2641m710l4180B16710c02391B69058G0161a10530
$$ 210761 177375 -34043 414639 -82641 -87351 -121531 216710 -302391 269058 70161 -110530
12830H7182J33935B5342c8016m63721A96166F8875J87908c10634n501e353D575
$$ 87182 221117 25342 -38016 -501737 196166 68875 256783 -310634 -316135 -5353 4575
12818a26759c1382k5684B2631O2841k9055b8229Q319B1022J71329a34695k8422
$$ -126759 -31382 -57066 22631 85472 56417 -28229 -19910 21022 192351 -134695 -163117
12807a63117f6092a5971l1869B39327b9111j66664A17097H700a27357C4162a84583
$$ -163117 -66092 -15971 -47840 239327 -29111 -195775 117097 8700 -127357 34162 -184583
12795A13750D7727a59756n954B66418n6521f8788C80114j59823e2287G9413c85392
$$ 113750 47727 -159756 -165710 266418 209897 -68788 380114 220291 -52287 79413 -385392
12783A03836Q4589f4177A13181O4784a00432i29C04728b56713c7412D8902J3686
$$ 103836 188425 -64177 113181 177965 -100432 -929 304728 -256713 -37412 48902 62588
12772F2588J17987h3949F5910j3937a48240A28213E8812K03380b24932b0652C33295
$$ 62588 180575 -83949 65910 51973 -148240 128213 58812 262192 -224932 -20652 333295
12760B23158a52106c0288A58515d8873C48464F4755J58334n3783E01h948n8748
$$ 223158 -152106 -30288 158515 -48873 348464 64755 223089 169306 501 -8948 -67696
12749f7696B89449a36302e1686A40182b10829M0871c4052B05553E1148R4499J68233
$$ -67696 289449 -136302 -51686 140182 -210829 -169958 -34052 205553 51148 145647 313880
12738C13880j08820a4680A59348b73717D5648d1167j2797B08894q7379M3572M9154
$$ 313880 205060 -14680 159348 -273717 45648 -41167 -53964 208894 121515 165087 214241
12727B14241g9590J1237j09883h5290j77467A85177K3154J90624a04665F1755
$$ 214241 -79590 -68353 -178236 -85290 -262757 185177 208331 398955 -104665 61755
12716b64648B95644j01102D9089c4382A36599b0509k204B09558Q9088P0472a33098
$$ -264648 295644 194542 49089 -34382 136599 -20509 -22713 209558 298646 369118 -133098
12704C6479d2288A59765J3492G5456b05909q2835h2530m1414k05860a3941B77508
$$ 36479 -42288 159765 173257 75456 -205909 -288744 -82530 -123944 -329804 -13941 277508
12692A46758L7062a61650M2704l0969I8182h466A80760a76083M7001N4604A34713
$$ 146758 183820 -161650 -118946 -149915 98182 -8466 180760 -176083 -129082 -74478 134713
12680a26613A60934b39410b7394D45196a62203A24989K24893b53016A15077J04831
$$ -126613 160934 -239410 -27394 445196 -162203 124989 349882 -253016 115077 219908
12670B19908h6460C8992J3051K04425E5481J2721J48049a4596A21954l2058K0544
$$ 219908 -86460 38992 52043 256468 55481 68202 216251 -14596 121954 89896 110440
12659A10440F61b28101D47786B14257r4028K16539E9946R7036J41983A43676K14937
$$ 110440 661 -228101 447786 214257 120229 336768 59946 156982 298965 143676 358613
12648C58613A37933i656A80497G1808f3291k4589C3665a70513A35650b98396a23981
$$ 358613 137933 -9656 180497 71808 -63291 -87880 33665 -170513 135650 -298396 -123981
12636B00638r6137g9821G4140K61502j2848e901A88840n5578k7841K15484j18410
$$ 200638 104501 -79821 74140 335642 322794 -5901 188840 133262 105421 320905 202495
12625B02495K35621a38556I5886P9544J33793A08048J87682j04528G2396a71250
$$ 202495 438116 -138556 95886 175430 309223 108048 295730 191202 72396 -171250
12614C3831P5371Q0695o7779b93958J24650A68648H0869a03416l8740B6402J8094
$$ 33831 109202 189897 122118 -293958 -169308 168648 80869 -103416 -142156 26402 44496
12603D4496L68136a02598A07375b66403F4160e0787A70444a7269m7871F4227a99900
$$ 44496 412632 -102598 107375 -266403 64160 -50787 170444 -17269 -65140 64227 -199900
12591f811B34817f2400o6980e9282B3370i1778A02742c3296E7772a08417E6441
$$ -6811 234817 -62400 -129380 -59282 23370 -91778 102742 -33296 57772 -108417 56441
12579D37063A55585E3685a94879a2850j55373a6651m3634o4384j9294N153O519
$$ 437063 155585 53685 -194879 -12850 -168223 -16651 -60285 -124669 -143963 -138810 -132291
12568a32291A50024B8784N0028a64775D38533a76408B57690H8299J1901O98k6085
$$ -132291 150024 28784 78812 -164775 438533 -176408 257690 88299 100200 100898 74813
12557G4813R5056b7416I6766J19214F2400J22708h9837A80346H8935J83669j17707
$$ 74813 169869 -27416 96766 215980 62400 185108 -89837 180346 88935 272604 154897
12546A54897b18339E7098a19665j70461b9078A26728M5087D2882f5026B22079
$$ 154897 -218339 57098 -119665 -290126 -29078 126728 171815 42882 -65026 222079
12535c01182a08330A62673d3057A44824M1916a53312B62074J05254G2867k7296
$$ -301182 -108330 162673 -43057 144824 186740 -153312 262074 367328 72867 45571
12525D5571K09054A11245K11488j7760F4966J17130k0875J27214J17025i800k54898
$$ 45571 254625 111245 322733 304973 64966 182096 161221 288435 405460 -9800 -264698
12514b64698a00589j05253D07887b16943D4954a51435A07451i2046j79856h0698
$$ -264698 -100589 -205842 407887 -216943 44954 -151435 107451 -92046 -271902 -80698
12503B2050a60383A6458K38215a19770J9948B68047A08485C5512J6457J64764
$$ 22050 -160383 16458 254673 -119770 -99822 268047 108485 35512 51969 216733
12493B16733A3701c51526a8965f44C09955a85458A61201R5104R437g6060m6666
$$ 216733 13701 -351526 -18965 -644 309955 -185458 161201 256305 265742 -76060 -122726
12482a22726A67964o6941N529E1553g1221q0730A72429l2429b02216j15169D28088
$$ -122726 167964 101023 106552 51553 -71221 -151951 172429 140000 -202216 -317385 428088
12470a56860A0717J52467A6719a79320Q5049K8377k66286J02384a05186C21209
$$ -156860 10717 163184 16719 -179320 -94271 -65894 -332180 -229796 -105186 321209
12459d9488J2849j02576A13538a75816N4886A08098g7876B865d6783A07038g2764
$$ -49488 -36639 -139215 113538 -175816 -120930 108098 -77876 2865 -46783 107038 -72764
12447a4485A55803c6219C9039b10753n5207H2359J64383b24720a01931l5398F724
$$ -14485 155803 -36219 39039 -210753 -265960 82359 246742 -224720 -101931 -137329 6724
12435d2871I709b07989M2686p5084A97330M977r389o4605F0764i9374j15905c5291
$$ -42871 9709 -207989 -165303 -240387 197330 202307 192918 128313 60764 -99374 -215279 -35291
12422D0216d6407A14680K65859A37584e38919B00597G4115j5214f7895A43743
$$ 40216 -46407 114680 380539 137584 -538919 200597 74115 58901 -67895 143743
12411c5903A7318b40126C15351b81468J13792l55151b23029P0419b1233A81188
$$ -35903 17318 -240126 315351 -281468 -167676 -522827 -223029 -152610 -21233 181188
12400B77163G7162J01971j1841G1650a16495M4241b7146H032a02395l2743d4028
$$ 277163 77162 179133 167292 71650 -116495 -72254 -27146 8032 -102395 -135138 -44028
12388d1784H7142K504K3944b10000C76780A61842h8373C4483B840h8383N560A18462
$$ -41784 87142 89646 113590 -210000 376780 161842 -88373 34483 2840 -88383 -82823 118462
12375a11839D927L84947g3896a4338C50534C9093J45915b91692g5014k81690A7917
$$ -111839 4927 389874 -73896 -14338 350534 39093 185008 -291692 -75014 -356704 17917
12363B04061a57236k0769L3506H3799a81806N1677C384P1016e24102a56885A9556
$$ 204061 -157236 -178005 -144499 83799 -181806 -130129 3384 74400 -524102 -156885 19556
12351a14193b5591A79202a0491A13611d9529I3071a99740A85231c39188J67330
$$ -114193 -25591 179202 -10491 113611 -49529 93071 -199740 185231 -339188 -171858
12341a71858J5967I938c94137a19528A19777b5248k32317A5246c13518a31066
$$ -171858 -155891 9938 -394137 -119528 119777 -25248 -257565 15246 -313518 -131066
12330a67679B08206c42425G0619a97419A72500K841a59800c5125b434r0683A74529
$$ -167679 208206 -342425 70619 -197419 172500 175341 -159800 -35125 -2434 -93117 174529
12318C7187J67383J2197A1991a40557A39812a67912B22069A01230Q2397J98840
$$ 37187 204570 216767 11991 -140557 139812 -167912 222069 101230 183627 382467
12308C82467D1921J08764c3033A37698a19558j92100R8630B01819a94127n6688
$$ 382467 41921 150685 -33033 137698 -119558 -311658 -213028 201819 -194127 -250815
12298b50815B3293K22837a2459l12669C57845e2548k24315J14568H374h7021A26818
$$ -250815 23293 246130 -12459 -325128 357845 -52548 -276863 -162295 8374 -87021 126818
12286B17594B8559b78216A26385j3710B325Q570M6175b77189A70786b0929C18535
$$ 217594 28559 -278216 126385 112675 2325 10895 57070 -277189 170786 -20929 318535
12274B30586K26038r6301j07787n628L5589A05682a15616F6508P497e7823H9750
$$ 230586 456624 360323 252536 246908 282497 105682 -115616 66508 74005 -57823 89750
12262A30688K80943d5882B4540K32143j00373K06398j3291A47075D5751J8775
$$ 130688 411631 -45882 24540 256683 156310 362708 349417 147075 45751 64526
12252F4526a93447M9302f5935D68627b5023A44321M5179c36052j9426A67012J7159
$$ 64526 -193447 -144145 -65935 468627 -25023 144321 189500 -336052 -355478 167012 184171
12241A84171n0442J12195r027E105J58130m5617j1032b15258b5806C3482M3484
$$ 184171 133729 245924 236897 5105 163235 117618 106586 -215258 -25806 33482 76966
12230G6966K33502p793I0286i3191D63568j29873b34845A37351j9437K20063J74657
$$ 76966 310468 302675 90286 -93191 463568 333695 -234845 137351 117914 337977 512634
12219E12634A91149L26324B39859N0485j15163J21003A20359J53822q7886k6011
$$ 512634 191149 517473 239859 290344 175181 296184 120359 274181 186295 160284
12209A60284d4447A80071L7903e0421I3757h417A96456a9207B66614j03899J36376
$$ 160284 -44447 180071 217974 -50421 93757 -8417 196456 -19207 266614 162715 299091
12198B99091p5468a78694b2597G815K25990k7940Q9002J2590A44517l1299b5483
$$ 299091 223623 -178694 -22597 7815 233805 205865 294867 307457 144517 113218 -25483
12186a1011D31020o9032j27619H3017a4829M90A17522c4665A43090e1A03175O598
$$ -11011 431020 361988 234369 83017 -14829 -14339 117522 -34665 143090 -51 103175 109773
12174A09773n2638P4232l438e099G2529a23436D2117a20686A38720C1619K24386
$$ 109773 57135 131367 127929 -5099 72529 -123436 42117 -120686 138720 31619 256005
12163B56005a05074E9217d8141K2982n9201m7800c9403B53151a4701k64598Q0677
$$ 256005 -105074 59217 -48141 -25159 -84360 -132160 -39403 253151 -14701 -279299 -198622
12152a98622M4991a3889B21522l3572m3578b79234n819C1546b25185B07172K03869
$$ -198622 -153631 -13889 221522 187950 144372 -279234 -285053 31546 -225185 207172 411041
12141D11041j36892n7034I6250A7978J54327f8270G6129c01519R8048A68519L6106
$$ 411041 274149 217115 96250 17978 172305 -68270 76129 -301519 -203471 168519 204625
12130B04625K72385j89696F4870B5735J05741j5817c8987j47847B04312m4350
$$ 204625 477010 287314 64870 25735 131476 115659 -38987 -186834 204312 159962
12120A59962c31527b5677j8386B4211a3900D29044p179j79762c4086A13663J8959
$$ 159962 -331527 -25677 -44063 24211 -13900 429044 421865 242103 -34086 113663 132622
12109A32622g6490A29500b50089Q1172d2491C20019E4628h0545G1910a2921n655
$$ 132622 -76490 129500 -250089 -168917 -42491 320019 54628 -80545 71910 -12921 -18576
12098a8576B53040a89375A98525P2706F1087O1261B3947K11301L8827E5362b11536
$$ -18576 253040 -189375 198525 271231 61087 122348 23947 235248 274075 55362 -211536
12086B3478g1000F4354M0100J20766a91940J4425N4828r9607I948b4237C8467
$$ 23478 -71000 64354 104454 225220 -191940 -177515 -122687 -222294 9948 -24237 38467
12074a57141A89555c05335H9176a41495c1733I4821e3538J0428j56648M4893f1444
$$ -157141 189555 -305335 89176 -141495 -31733 94821 -53538 -43110 -199758 -154865 -61444
12062D04946R99093j53520B86866K2134c7459B513J4697i1287M2867o3141G4515
$$ 404946 1404039 1250519 286866 309000 -37459 2513 17210 -91287 -48420 -111561 74515
12050i5034D0104a137p3804B22755a38857F8859a7315k35228B86543b10462D81593
$$ -95034 40104 -1137 -74941 222755 -138857 68859 -17315 -252543 286543 -210462 481593
12038c9731j80607A31718B3100k820N5783J52310e996A28477a5095B20465f1245
$$ -39731 -220338 131718 23100 20280 76063 228373 -5996 128477 -15095 220465 -61245
12026B26180a66607b1301A51440l1691e4366A66615b15196a01348L5130p3771
$$ 226180 -166607 -21301 151440 119749 -54366 166615 -215196 -101348 -66218 -139989
12016a39989G5021a24249A1303b01314d6567B42851m9707b22578R8676k3252c7264
$$ -139989 75021 -124249 11303 -201314 -46567 242851 193144 -222578 -123902 -147154 -37264
12004h8843b5306H5488a74034A04035B6196a1594M806B81931J5046d10170C04305
$$ -88843 -25306 85488 -174034 104035 26196 -11594 -6788 281931 296977 -410170 304305
11992c10200h8751A5191b59722Q1168j97168D4631L3875k9904K19036C7372R7326
$$ -310200 -88751 15191 -259722 -178554 -375722 44631 78506 48602 267638 37372 134698
11981A34698i4020m5951j11560e9992C70360a79249A31505J03702c38392H4654
$$ 134698 -94020 -139971 -251531 -59992 370360 -179249 131505 235207 -338392 84654
11970a43490g206k80620c3273j67770A20754g8100a1305k0322q7127d5213B3492
$$ -143490 -7206 -287826 -33273 -201043 120754 -78100 -11305 -31627 -118754 -45213 23492
11958f9621p5488c332B1204a53176B6194O2383J7534l3625L55022A53306O6048
$$ -69621 -145109 -3332 21204 -153176 26194 88577 106111 72486 427508 153306 219354
11947B19354j4788c45557E7587q99L12219f1468l90289a99813A33710a01833c0024
$$ 219354 204566 -345557 57587 56688 368907 -61468 -451757 -199813 133710 -101833 -30024
11935G2952l052a38052k83427G4360e8743A03148K4666A6968b31192H1804a61690
$$ 72952 69900 -138052 -421479 74360 -58743 103148 127814 16968 -231192 81804 -161690
11923D01746a35158H7515C1502g439p4635j05840j07964a07939B6255K21132b46242
$$ 401746 -135158 87515 31502 -7439 -82074 -187914 -295878 -107939 26255 247387 -246242
11911A94979a0298A09321L37104A15903a25690A63717J35701r8044a14592f604
$$ 194979 -10298 109321 446425 115903 -125690 163717 299418 201374 -114592 -6604
11900b50658B49458c64817J13861g4055p5387l6268K9666l33749f5759B6983L4784
$$ -250658 249458 -364817 -250956 -74055 -149442 -185710 -156044 -489793 -65759 26983 61767
11889F1767P5231a045F9336K8177P6189a74465k62401A10914J8675d09238A55041
$$ 61767 136998 -1045 69336 97513 173702 -174465 -436866 110914 129589 -409238 155041
11877g191B684K02180a38033O3298H7269e4432a8319A91322m1484J91441C9457
$$ -7191 2684 204864 -138033 -74735 87269 -54432 -18319 191322 149838 341279 39457
11865a00522A02912K81008e9918K9543A98061a02296C30521A16474I017A219K92809
$$ -100522 102912 383920 -59918 -30375 198061 -102296 330521 116474 9017 1219 294028
11854B94028i1808j86243D168R8964a12259n3467f4520k04322p953A7737g6849
$$ 294028 -91808 -278051 4168 103132 -112259 -165726 -64520 -268842 -276795 17737 -76849
11842a2182l27321A48355b5277l0450k9373d0296o9902j65205j43471h6365k2539
$$ -12182 -339503 148355 -25277 -55727 -85100 -40296 -110198 -275403 -418874 -86365 -108904
11831a08904F2102M9549a25391l75864c662j62590L8920b497j26466j82990A20021
$$ -108904 62102 111651 -125391 -501255 -3662 -166252 -127332 -2497 -128963 -311953 120021
11819c32011J15554M1984b200k26142c9904F4790a25484d5438l4561A06255b39769
$$ -332011 -216457 -174473 -2200 -228342 -39904 64790 -125484 -45438 -79999 106255 -239769
11807a13801A79838c2136j15009C8888f6613J988k46656D1102K30951i3362R792
$$ -113801 179838 -32136 -147145 38888 -66613 -64625 -311281 41102 272053 -93362 -83570
11796h3570J4627A11450E0377P0715a15308a4396k8272B09701P3531O1559a04082
$$ -83570 -68943 111450 50377 121092 -115308 -14396 -42668 209701 283232 344791 -104082
11784A35977R5616a70359a3871j32824A86441k9107c61417d8742j21160E4163
$$ 135977 231593 -170359 -13871 -146695 186441 157334 -361417 -48742 -169902 54163
11773e0280a3939C8530a53573o629B680J24313f8755D4384P8565J79960a65535
$$ -50280 -13939 38530 -153573 -160202 2680 126993 -68755 44384 122949 302909 -165535
11761h3197G4514c63154E8558b3729j7967r5775K002e6742A88225O7886b37747
$$ -83197 74514 -363154 58558 -23729 -41696 -137471 -135469 -56742 188225 256111 -237747
11749a16020j23467j46032B977c29281i0101k6411A5468d801j04494m3199b6219
$$ -116020 -239487 -385519 2977 -329281 -90101 -116512 15468 -4801 -109295 -152494 -26219
11737f7386m1917k69223J31734H4453e851I1382f7947A61686g1535A91482h8531
$$ -67386 -109303 -378526 -246792 84453 -5851 91382 -67947 161686 -71535 191482 -88531
11725g5993o8863A22739J02861G6254N8074n4077b587q9476F9874j0967L2861
$$ -75993 -144856 122739 225600 76254 134328 80251 -2587 -92063 69874 58907 91768
11714I1768b61054B90527a95843d0657B28035C9237K4243N3785n0608J70036n7119
$$ 91768 -261054 290527 -195843 -40657 228035 39237 63480 117265 66657 236693 179574
11703A79574K7424P446C1326K77780f1813B2017L7059P0021n8544e652G3445i7427
$$ 179574 206998 214444 31326 309106 -61813 22017 59076 129097 70553 -5652 73445 -97427
11690I7953l5776k6884J33903k8806m8587Q5550E5156J11384D3594J09704E0525
$$ 97953 62177 35293 169196 140390 91803 177353 55156 166540 43594 153298 50525
11678b23426B47777A11539N4633l2545a54140P4864A80411J46598D4107b81626
$$ -223426 247777 111539 166172 133627 -154140 -79276 180411 327009 44107 -281626
11667B27907i2874B37118K10707A15873J46469b52605c0064p7791D4070a92975
$$ 227907 -92874 237118 447825 115873 262342 -252605 -30064 -107855 44070 -192975
11656A35281B8541b37455a3885C89569a64457F5440b5209k18081i1369G5004K84767
$$ 135281 28541 -237455 -13885 389569 -164457 65440 -25209 -243290 -91369 75004 359771
11645C59771b03439f7447G3276c6804k00473E198J00390A956J3531b48192G2490
$$ 359771 -203439 -67447 73276 -36804 -237277 5198 105588 1956 15487 -248192 72490
11633b65071g0943A1759K790M522a11829o1511e1898k78881g1004r1338o0940
$$ -265071 -70943 11759 14549 19071 -111829 -173340 -51898 -330779 -71004 -162342 -223282
11622b23282h4162k43854B0592P9420J33611b37827i6561a9114A84156K3531c65587
$$ -223282 -84162 -328016 20592 100012 233623 -237827 -96561 -19114 184156 207687 -365587
11610i1753q9418f2825B72758d49550D4110b46192J3457A43148a24378A03980
$$ -91753 -181171 -62825 272758 -449550 44110 -246192 -232735 143148 -124378 103980
11599A76122O6675e62277A73932D3892J35626a22150B01549I347d4308A82722
$$ 176122 242797 -562277 173932 43892 179518 -122150 201549 9347 -44308 182722
11588A06892k2825J58451D2665J32367J07737A13953a64291A51980l0924b3746
$$ 106892 84067 242518 42665 175032 282769 113953 -164291 151980 121056 -23746
11577H5591J56694n2904m4755p0258a94355A35990a4507k07083i103j28060B1645
$$ 85591 242285 189381 144626 74368 -194355 135990 -14507 -221590 -9103 -137163 21645
11565G0732J7876J21625a53058A89801p6911E4205O4999E2885K5422L7212a946
$$ 70732 88608 210233 -153058 189801 112890 54205 119204 52885 78307 115519 -1946
11553D3531J63062c1691r4261l7865I2005C1911J29290J42926A9948d6139C88809
$$ 43531 206593 -31691 -125952 -163817 92005 31911 161201 304127 19948 -46139 388809
11541A33743K39217d7119F2450g0353j50530b7380H8761g3277B84671F8608g5745
$$ 133743 372960 -47119 62450 -70353 -220883 -27380 88761 -73277 284671 68608 -75745
11529G1019B5850d7585j35938a3697j51459d2301a7C7941d2507k1737r4183B9366
$$ 71019 25850 -47585 -183523 -13697 -165156 -42301 -17 37941 -42507 -64244 -158427 29366
11516E4984h8045A58846J38363C2920j3503J72706R034e2884E10069G1688a43766
$$ 54984 -88045 158846 297209 32920 19417 192123 201157 -52884 510069 71688 -143766
11504A61957o0326K64962a20151B28543l5516I3900b54177C68931C1240j3903
$$ 161957 101631 366593 -120151 228543 193027 93900 -254177 368931 31240 17337
11494A7337Q6753j3109l433Q5671E3522J04747L9361O4220r1418m4960m9875N9557
$$ 17337 104090 90981 87548 173219 53522 158269 197630 261850 170432 125472 75597 135154
11482A35154q312f4127c1413B97162P513H2925R9503i9746a9546A79926q8667
$$ 135154 126842 -64127 -31413 297162 304675 82925 182428 -99746 -19546 179926 91259
11471I1259a40300A69173e0498a3876B30961o9262D2070J57383l6777K0827j6376
$$ 91259 -140300 169173 -50498 -13876 230961 161699 42070 199453 162676 183503 167127
11460A67127p5771M2332J61902H0631r845K36126G2520a0264j64179m0452e409
$$ 167127 91356 133688 295590 80631 70786 306912 72520 -10264 -174443 -214895 -5409
11448A06339a26164d076k19252h3611B33688i4829B70061J98633A59631J07969
$$ 106339 -126164 -4076 -223328 -83611 233688 -94829 270061 468694 159631 267600
11438B67600b44212E5971J58970o5387j2794j852K1890b18184J5597C59769i7186
$$ 267600 -244212 55971 214941 149554 136760 134908 156798 -218184 -202587 359769 -97186
11426A33218l9894J80519c08942A6526J00975N7962d7160H7818d6603j53665c049
$$ 133218 93324 273843 -308942 16526 117501 175463 -47160 87818 -46603 -200268 -3049
11414A98572b42291A53740K5785a68568N2946A49181b11322K996C25484a43367
$$ 198572 -242291 153740 179525 -168568 -115622 149181 -211322 -208326 325484 -143367
11403b74089a26868A51076a77707j0616M9213d9490B07740p6214d7060A08278
$$ -274089 -126868 151076 -177707 -188323 -139110 -49490 207740 131526 -47060 108278
11392A52356c9267A7374c48809J71060Q4984j99920I1359b46332Q1788j82424
$$ 152356 -39267 17374 -348809 -177749 -92765 -292685 91359 -246332 -164544 -346968
11382c46968B84783m3859c9122B42880e8991A42654q57J05868b10341R7045I9384
$$ -346968 284783 240924 -39122 242880 -58991 142654 141797 247665 -210341 -113296 99384
11370B51508a09682B00896a4782C59287A642L08566a70808B82371A5076K15235
$$ 251508 -109682 200896 -14782 359287 1642 310208 -170808 282371 15076 230311
11360B30311c73451d2165A48963d2734D9151a92920A00061O9327A5046e3621r018
$$ 230311 -373451 -42165 148963 -42734 49151 -192920 100061 169388 15046 -53621 -62639
11349f2639j12781D8989f1094A99685a88597a5457q7365G6842K10368C819J65783
$$ -62639 -175420 48989 -61094 199685 -188597 -15457 -102822 76842 287210 3819 169602
11338A69602a03740d2831A19419e6823C3922a70018B27947G8968K36123a84410
$$ 169602 -103740 -42831 119419 -56823 33922 -170018 227947 78968 315091 -184410
11327i2354A03217f4156B8207r055i7659A19448a5620A86660a03780m1686j14302
$$ -92354 103217 -64156 28207 19152 -97659 119448 -15620 186660 -103780 -145466 -259768
11316b59768C595b36113a7341k16636k38667a11394e0428j17421A19354B3301
$$ -259768 3595 -236113 -17341 -233977 -472644 -111394 -50428 -167849 119354 23301
11305a35905j1866B9071O6897a83232B57255a32126d1459J3898k81704E6010h1170
$$ -135905 -147771 29071 95968 -183232 257255 -132126 -41459 -27561 -309265 56010 -81170
11293A55642r640b53596p7060A79838c65667A271a36744A78021a71027A30063
$$ 155642 146002 -253596 -330656 179838 -365667 1271 -136744 178021 -171027 130063
11282b13603B35375j09104Q3299a85249k556B22292H8712h3614k7045a5436m03327
$$ -213603 235375 126271 209570 -185249 -187805 222292 88712 -83614 -110659 -15436 -418763
11271d18763A67921a9359r9944H203a5403C43352I1624a22254C27082A50520K62687
$$ -418763 167921 -19359 -119303 8203 -15403 343352 91624 -122254 327082 150520 413207
11260D13207G3191a50438A26781a3687q3747n4854L5492A27938a91428a2870k05410
$$ 413207 73191 -150438 126781 -13687 -97434 -152288 -116796 127938 -191428 -12870 -218280
11249b18280a9262j08205j41821B34874J08439f0569H375Q6895a55912O5520j39567
$$ -218280 -19262 -127467 -269288 234874 343313 -60569 8375 95270 -155912 -90392 -229959
11238b29959a04526G9163b83033b580k8250O307k29097a9538n3382b2410B4832
$$ -229959 -104526 79163 -283033 -2580 -30830 -24523 -253620 -19538 -72920 -22410 24832
11226h6510j04673b1787k7802A67085G98O0139f7493B74730j07179c9954k8819
$$ -86510 -191183 -21787 -49589 167085 798 60937 -67493 274730 167551 -39954 -68773
11215f8773r372A760J87860a07054F2162d23721a39808O9644A1780b83277b7283
$$ -68773 -78145 1760 189620 -107054 62162 -423721 -139808 -70164 11780 -283277 -27283
11203d35325B39379i9356n6157k6312C13389d5829o7470B28694D5741K02806f1463
$$ -435325 239379 -99356 -155513 -181825 313389 -45829 -113299 228694 45741 248547 -61463
11191a40691A74798f8239k00296G7082a00128j81027a03875B3893a95618e1586
$$ -140691 174798 -68239 -268535 77082 -100128 -281155 -103875 23893 -195618 -51586
11180e1341l08190c3467j75417A07583L3440a44462D21672a16075B683L8006N0022
$$ -51341 -359531 -33467 -208884 107583 141023 -144462 421672 -116075 2683 40689 90711
11169I0711a19376a221j30950j54199e3222A33959c9020j86481D09071A97909
$$ 90711 -119376 -1221 -132171 -286370 -53222 133959 -39020 -225501 409071 197909
11158d63099b2961H6588O6744F8244b6493J602A41575J1398l0359K1076B7439
$$ -463099 -22961 86588 153332 68244 -26493 -24891 141575 152973 122614 143690 27439
11146d02534A97555b11380N3908B56708F276J29228l0116e248I5417L149m3649
$$ -402534 197555 -211380 -157472 256708 6276 135504 105388 -5248 95417 98566 54917
11135E4917a62320A23882b29501A88061a39812B97960a65982C62170h7125A54845
$$ 54917 -162320 123882 -229501 188061 -139812 297960 -165982 362170 -87125 154845
11124A82389D5214b04580A11077N3226a23149j6704M7068A20976Q6082J5147d0639
$$ 182389 45214 -204580 111077 164303 -123149 -139853 -92785 120976 207058 222205 -40639
11112a57618l101M6518N1862L681j03234A51768D2104J72260E4452J04668k6707
$$ -157618 -160719 -114201 -62339 -58658 -161892 151768 42104 214364 54452 159120 132413
11101A32413a58139B84676O3335A32244K8689q298F9926K36307J02476j87438
$$ 132413 -158139 284676 348011 132244 160933 152635 69926 306233 408709 221271
11091B21271A5625K56052F4524J08312J05368l1513l4825k0341J33818k5279j13594
$$ 221271 15625 271677 64524 172836 278204 246691 211866 191525 325343 300064 186470
11080A86470c2484C86030q8963K37822I7333N0578M69237G8104K09010J85947
$$ 186470 -32484 386030 297067 534889 97333 147911 617148 78104 287114 473061
11070D73061j84102P6769j73097K3181k9521K51346k590k14137L28034k46331
$$ 473061 288959 365728 192631 215812 186291 437637 435047 220910 548944 302613
11060C02613M15075A86360M98457j32705J18645j80680N07094l10319l36691R5486
$$ 302613 717688 186360 684817 552112 670757 490077 997171 686852 350161 445647
11050D45647K08081K55425j63809k21463K02770q1077J50050j11474m7769O5685
$$ 445647 653728 909153 745344 523881 726651 645574 795624 684150 636381 702066
11040G02066m927r4800K76011j14295J38784j23910J42816k45328O1471K6450
$$ 702066 697139 602339 878350 764055 902839 778929 921745 676417 737888 764338
11030G64338J28424k11823j01248M7216k52698K87296L7432n0136k45476L27454
$$ 764338 892762 680939 579691 626907 374209 661505 698937 648801 403325 730779
11020G30779l43033J95320K07324Q5821l13407r2228j52919M96021l01835n4465
$$ 730779 387746 583066 790390 876211 562804 470576 317657 813678 511843 457378
11010D57378J83255M5750l37508L89520k72742P6964n7756k02418J87101j20630
$$ 457378 640633 686383 348875 738395 465653 542617 484861 282443 469544 348914
11000C48914L90492J69065C22326L45459N6204J24994k92715K09434m8987n40
$$ 348914 739406 908471 322326 667785 723989 848983 556268 765702 716715 716175
10990G16175j54455J8346K83954l8416K16833q4979O9956k0887J11055L207M5164
$$ 716175 561720 580066 864020 825604 1042437 957458 1027414 1006527 1117582 1120789 1165953
10979A165953L29715L38059q1060K32675R5052N25327j58052N83978j54873j03561
$$ 1165953 1495668 1833727 1752667 1985342 2080394 2605721 2447669 3031647 2876774 2773213
10969B773213K3292n7824j18158n39003j20693k27448m45299L76798L0068J17513
$$ 2773213 2796505 2738681 2620523 2081520 1960827 1733379 1288080 1664878 1694946 1812459
10959A812459j66299R4686k01998j30821l09376K24201l38847j17630k07282L6984
$$ 1812459 1646160 1740846 1538848 1408027 1098651 1322852 984005 866375 659093 696077
10949F96077L6418k81543n7248j0728j23445j28332E5023d397A32614J0958a68932
$$ 696077 732495 450952 393704 382976 259531 131199 55023 -4397 132614 143572 -168932
10937c6828G3611J16050I0319B7750b11240B5909L96385a85239J5342D7596p403
$$ -36828 73611 189661 90319 27750 -211240 25909 422294 -185239 -169897 47596 40193
10926D0193J92579e9667B26153O1648j34444a00214B57453n2117H9734e2252l06399
$$ 40193 232772 -59667 226153 287801 153357 -100214 257453 205336 89734 -52252 -358651
10915c58651B15056f0767j9566I5668J1651C3886b08874O8619o0602B14339E5425
$$ -358651 215056 -60767 -80333 95668 107319 33886 -208874 -140255 -200857 214339 55425
10903B4842g2349B06623h6199I0047F4M3421J37640G2988b1449N07k17865b4193
$$ 24842 -72349 206623 -86199 90047 64 43485 181125 72988 -21449 -20942 -238807 -24193
10890g0563j1001b8453A40299b49074J19187A74371a8009k83199D5449A6401g5746
$$ -70563 -81564 -28453 140299 -249074 -129887 174371 -18009 -301208 45449 16401 -75746
10878c74699J14492b6715j00038H7926i4179c4378k80400a8631E9231c5223C40995
$$ -374699 -260207 -26715 -126753 87926 -94179 -34378 -314778 -18631 59231 -35223 340995
10866a18127r4446A15516a27557F6365g7555K3949r0341L6610C15358d6034c951
$$ -118127 -212573 115516 -127557 66365 -77555 -53606 -143947 -107337 315358 -46034 -3951
10854b77921J03936D5207O2187D319a95146f1023F5492M9325L6416d5716j44100
$$ -277921 -173985 45207 107394 4319 -195146 -61023 65492 114817 151233 -45716 -189816
10843a89816A53187b59591A22056b13163B34452C9917b01508O5012e7975J3679
$$ -189816 153187 -259591 122056 -213163 234452 39917 -201508 -136496 -57975 -44296
10833d4296J9086j47071B717b91175J19686I2261a75083E0821J8420c72980A26099
$$ -44296 -25210 -172281 2717 -291175 -171489 92261 -175083 50821 69241 -372980 126099
10821A7661d20186B01347l8908a79219P8468l3501n5128A94967h9783j05543c1511
$$ 17661 -420186 201347 162439 -179219 -100751 -134252 -189380 194967 -89783 -195326 -31511
10809b63218e0809A87439A3326a68966B06058b54676F1716g657j87390A72833
$$ -263218 -50809 187439 13326 -168966 206058 -254676 61716 -7657 -195047 172833
10798A12590D0119L9638K5366j9340J68425r9494o3284f6118H5822a7692A66425
$$ 112590 40119 79757 105123 85783 254208 154714 91430 -66118 85822 -17692 166425
10786b56600I3358b85560A29003a58560F4994f7913A17399P705J69369e9498A06586
$$ -256600 93358 -285560 129003 -158560 64994 -67913 117399 125104 294473 -59498 106586
10774g5975G816c41142A75893i0256D3692J49582a294D2477h2045j15792P3053
$$ -75975 7816 -341142 175893 -90256 43692 193274 -1294 42477 -82045 -197837 -124784
10763a24784k9835L0868r6945a07075o2817R836a2042q536r9224A74366c14471
$$ -124784 -154619 -123751 -220696 -107075 -169892 -160056 -12042 -20578 -119802 174366 -314471
10751a5247I0023b48218J2089F4158h1745j3950B79068G4820h8289j47695R9553
$$ -15247 90023 -248218 -236129 64158 -81745 -95695 279068 74820 -88289 -235984 -136431
10740a36431C5078c36295R4922C3806M4907J6852N0374M8839a50289k91045I6613
$$ -136431 35078 -336295 -241373 33806 78713 95565 145939 194778 -150289 -441334 96613
10728a65773j28342d0436G171a17056A4613R9803a34898F3142a60547B0168a85558
$$ -165773 -294115 -40436 7171 -117056 14613 114416 -134898 63142 -160547 20168 -185558
10716f2282n6771B02712c0612k9116A25670a31715l33792J65205k04873B0262
$$ -62282 -119053 202712 -30612 -59728 125670 -131715 -465507 -300302 -505175 20262
10705a08413A9683J42142J2324e9386m4784n38535I409a97154j5263g6898D7210
$$ -108413 19683 161825 174149 -59386 -104170 -642705 9409 -197154 -212417 -76898 47210
10693B47830l0977b61460C57262h0414A27125b0208C04319a72635A09334J59717
$$ 247830 216853 -261460 357262 -80414 127125 -20208 304319 -172635 109334 269051
10683B69051e591j19030k09649i987k47591h344r0250a1998l52720g4957A30163
$$ 269051 -5591 -124621 -334270 -9987 -257578 -8344 -98594 -11998 -364718 -74957 130163
10671a61994c2981j68474b5819B55503d13848i4640a2186m6353j10627I4107c71142
$$ -161994 -32981 -201455 -25819 255503 -413848 -94640 -12186 -58539 -169166 94107 -371142
10659a9297D1612g8020A8202M8098a44967O097F3553d4017j12214f301o9404l1692
$$ -19297 41612 -78020 18202 66300 -144967 -138870 63553 -44017 -156231 -6301 -75705 -107397
10647a07397j33337Q3330l4026L4248M2896j13005N5088d148k8452r9254m8963
$$ -107397 -240734 -157404 -191430 -157182 -114286 -227291 -172203 -4148 -32600 -131854 -180817
10636a80817H9112P7177e1475l8520j23621g1801l46757J14558B41140n9747b12027
$$ -180817 89112 166289 -51475 -89995 -213616 -71801 -418558 -304000 241140 181393 -212027
10624a68587j00164c5029G6913h6750j30507I5219e3157H8119a28155B49120b91839
$$ -168587 -268751 -35029 76913 -86750 -217257 95219 -53157 88119 -128155 249120 -291839
10612c57275B57627g5299B3677Ec36205J34264A6309a36333m2501C5323J94460
$$ -357275 257627 -75299 23677 5 -336205 -201941 16309 -136333 -178834 35323 229783
10601B29783A03448J77757b6925k02213j21404a23707j0056A12272b29700d0362
$$ 229783 103448 281205 -26925 -229138 -350542 -123707 -133763 112272 -229700 -40362
10590i0674j70593B25830b51003B01085B7456g1965o7891G1541c62853J28130
$$ -90674 -261267 225830 -251003 201085 27456 -71965 -139856 71541 -362853 -234723
10580b34723g2027l19901e5180k72169a0059C67622g7054D4489g8721A47943p3719
$$ -234723 -72027 -391928 -55180 -327349 -10059 367622 -77054 44489 -78721 147943 74224
10569G4224e828E2880b3129k75672F5818h9678D7166J98422D605b30306B6389
$$ 74224 -5828 52880 -23129 -298801 65818 -89678 47166 245588 4605 -230306 26389
10557A60234a42138e7519B37331a13854B04628d79753a60041j82689C42571I6124
$$ 160234 -142138 -57519 237331 -113854 204628 -479753 -160041 -342730 342571 96124
10546a28954B9345J10440J70984a02219I098J4193a14068j34999a15695B09626
$$ -128954 29345 139785 310769 -102219 9098 23291 -114068 -249067 -115695 209626
10535E7485J8595a03731L5687F9412a3997l1026C0708e5736j22085A9362f8317
$$ 57485 76080 -103731 -68044 69412 -13997 -45023 30708 -55736 -177821 19362 -68317
10523e4518d132A60466k5541b85730A30611a85012M9428A86887a92112F4777K43753
$$ -54518 -4132 160466 134925 -285730 130611 -185012 -135584 186887 -192112 64777 308530
10512C08530p1617C5738J41321M7645b66587P7900G5271A4586L610J13205k7671
$$ 308530 236913 35738 177059 224704 -266587 -188687 75271 14586 18196 131401 103730
10501A03730c61800b5994L258B14079c363C6656b19256E19247b3819D64017B1398
$$ 103730 -361800 -25994 -22736 214079 -3363 36656 -219256 519247 -23819 464017 21398
10489b02408r9755C40727G7501J61919h5704B57722E6157O14460j51279j07919
$$ -202408 -302163 340727 77501 239420 -85704 257722 56157 670617 519338 411419
10479D11419o9461h138A55840J59389c4862H4028l013a24717K2432j63457J11428
$$ 411419 341958 -8138 155840 315229 -34862 84028 81015 -124717 -102285 -265742 -154314
10468a54314g0472k6471B3947M9290a69273E4427J99710b09006A4608i2053k8219
$$ -154314 -70472 -96943 23947 73237 -169273 54427 254137 -209006 14608 -92053 -120272
10457a20272C6998i7876I0201n129M9397b2637A80296a58675I8518c91052f3397
$$ -120272 36998 -97876 90201 85072 134469 -22637 180296 -158675 98518 -391052 -63397
10445D8538a61923B79246A6570b26964A440c65463C14524j43042b03064C9993
$$ 48538 -161923 279246 16570 -226964 1440 -365463 314524 171482 -203064 39993
10434C063L3204b36674H7478b19044A79774a31690a3995j7670m51497d8012A45160
$$ 3063 36267 -236674 87478 -219044 179774 -131690 -13995 -31665 -483162 -48012 145160
10422b7208j9788m3203r5474d6646j6466A49705b29801A91380H9244J25605g4429
$$ -27208 -46996 -90199 -185673 -46646 -63112 149705 -229801 191380 89244 214849 -74429
10410a61376a3926C6918b35149E084d9223A29253R2762o4836f0257A94276n6498
$$ -161376 -13926 36918 -235149 5084 -49223 129253 222015 157179 -60257 194276 137778
10399A37778a52615D4391a30706B58472H922d0527B33133q1707K1288J01504m4625
$$ 137778 -152615 44391 -130706 258472 8922 -40527 233133 151426 172714 274218 229593
10388B29593n1298N057M0725L0933c2777A07113f5877A25206j0429m3487J67806
$$ 229593 178295 183352 224077 255010 -32777 107113 -65877 125206 114777 71290 239096
10377B39096l2078E8855Q8865J03852j04795N552J59294a08965a0796A70598Q0929
$$ 239096 207018 58855 147720 251572 146777 152329 311623 -108965 -10796 170598 251527
10366B51527K84949j74718D6885K26266O1406j21080N7933K08747C0201g6832
$$ 251527 536476 361758 46885 273151 334557 213477 271410 480157 30201 -76832
10355A77439n7518L02448q7934J13779J22663j54843o4381L95q7959M7097K64918
$$ 177439 119921 422369 334435 448214 570877 416034 351653 352048 264089 311186 576104
10344E76104A24570L02078A30697J12504J02472J9904b13599G8103M20774k01963
$$ 576104 124570 426648 130697 243201 345673 365577 -213599 78103 498877 296914
10334B96914l5482j06133h0501A06589e238j03690C18301F6896K05276a48595
$$ 296914 261432 155299 -80501 106589 -5238 -108928 318301 66896 272172 -148595
10323A65206e3194C76639A32968J58332j03783K7540j8858b24138A32354e72k63418
$$ 165206 -53194 376639 132968 291300 187517 215057 196199 -224138 132354 -572 -263990
10312b63990B10035a398l35197a21804B70298B6691D454J34389j8604k3394J28741
$$ -263990 210035 -1398 -336595 -121804 270298 26691 4454 138843 120239 96845 225586
10301B25586a67786k89292C1012e6390B99984c08607a04110A32538K17023A1322
$$ 225586 -167786 -457078 31012 -56390 299984 -308607 -104110 132538 349561 11322
10290d9565B5440c3065G1455a31176k152b1260F7335J49211c36076a52751n312
$$ -49565 25440 -33065 71455 -131176 -133328 -21260 67335 216546 -336076 -152751 -158063
10279a58063n0616f2333j31506c8171p1468I3689b04162E3842b9720m3432n0191
$$ -158063 -208679 -62333 -193839 -38171 -109639 93689 -204162 53842 -29720 -73152 -123343
10268a23343D23787a03530G1354J83325M162f0997B87980J42486j43652k6014
$$ -123343 423787 -103530 71354 254679 258841 -60997 287980 430466 286814 260800
10258B60800K87023A72093J18587a24309B80098a69406B55763k126a91275f8927
$$ 260800 547823 172093 290680 -124309 280098 -169406 255763 253637 -191275 -68927
10247b15527h9680A21221h995j44854A98719p8354C3451k817K45183C037K76082
$$ -215527 -89680 121221 -8995 -153849 198719 120365 33451 30634 275817 3037 279119
10236B79119c59770A78310h4926j14588d9447l3312G7455Q7012b58036j31638
$$ 279119 -359770 178310 -84926 -199514 -49447 -82759 77455 164467 -258036 -389674
10226c89674A04946a16083A12742l787l0234C8547O420c02610F5298b30707C44159
$$ -389674 104946 -116083 112742 108955 78721 38547 44967 -302610 65298 -230707 344159
10214A6499c8295C222a4808A604c27481I9257f4187j6564r762L5788a6247m6009
$$ 16499 -38295 3222 -14808 1604 -327481 99257 -64187 -80751 -90513 -54725 -16247 -62256
10202f2256j25349I9892a70621f2170j11423j70870A68906a0076j3128C7253c1176
$$ -62256 -187605 99892 -170621 -62170 -173593 -344463 168906 -10076 -23204 37253 -31176
10190f7649E4690M66774b02742j6587f603j49796h816j04632q3022B74496A15186
$$ -67649 54690 521464 -202742 -219329 -6603 -156399 -8816 -113448 -196470 274496 115186
10178I7861j8373b64436a26291B23462k8866b65299A73327b42651r1848J64122
$$ 97861 79488 -264436 -126291 223462 194596 -265299 173327 -242651 -334499 -170377
10168a70377P1678d093l86755a46573A90868B7877K9682L7280c10235h3558j6344
$$ -170377 -98699 -4093 -390848 -146573 190868 27877 57559 94839 -310235 -83558 -99902
10157i9902C255a50245E8997b83042a24915j66086a00402j37966A22472a43058
$$ -99902 3255 -150245 58997 -283042 -124915 -291001 -100402 -238368 122472 -143058
10146f3562E8125J02546a40830j99504a31641k60817B98114c07815g5225l70146
$$ -63562 58125 160671 -140830 -340334 -131641 -392458 298114 -307815 -75225 -445371
10136d45371A24987d45125A50288a12772b9309E6400P6880m5334c00389A95001
$$ -445371 124987 -445125 150288 -112772 -29309 56400 133280 87946 -300389 195001
10125F8627c21855B13549e1314j7460c2638j59108B3428K92107a58145P7860l20462
$$ 68627 -321855 213549 -51314 -68774 -32638 -191746 23428 315535 -158145 -80285 -400747
10114d00747J40558i6815A5245b06751M6657N3409F9245c52225b586j03089A08884
$$ -400747 -260189 -96815 15245 -206751 -160094 -106685 69245 -352225 -2586 -105675 108884
10102A18818L3542e815A27037J40742E418a17809j10970F7267a44406n0269b722
$$ 118818 152360 -5815 127037 267779 5418 -117809 -228779 67267 -144406 -194675 -2722
10090B03205R9179L1940C1990J28211f062k56162A35453a40840M4511G2205c6916
$$ 203205 302384 334324 31990 160201 -6062 -262224 135453 -140840 -96329 72205 -36916
10078i7294J1098p9519J6878m3945E1248D192K3556L0447d9478C50532A19834
$$ -97294 -86196 -165715 -148837 -192782 51248 4192 27748 58195 -49478 350532 119834
10066h8348A19229O7079k4836a42975D53551a5438k74909L7772l759A3243L4203
$$ -88348 119229 186308 161472 -142975 453551 -15438 -290347 -252575 -256334 13243 47446
10055D7446J23515B230c22663Q0418K7008j15306m73P4910O350g9978l7784A56529
$$ 47446 170961 2230 -322663 -242245 -215237 -330543 -331016 -256106 -249756 -79978 -117762 156529
10042f5217j32908k05947R9634J27056p427E9257d22823M2473a09531j03323a6575
$$ -65217 -198125 -404072 -304438 -177382 -184809 59257 -422823 -380350 -109531 -212854 -16575
10030c4692r5324C57970A14817a22219l34852e3583H885c41464c461l8682p9658
$$ -34692 -130016 357970 114817 -122219 -457071 -53583 8885 -341464 -3461 -42143 -121801
10019a21801e9196n2120D0491J07678n5970j5196c03388D28540a70236A13472
$$ -121801 -59196 -111316 40491 148169 92199 77003 -303388 428540 -170236 113472
10008A06484Q994b5618k77817a14836j80051J27445A09574b31214A16686b57598
$$ 106484 115478 -25618 -303435 -114836 -294887 -167442 109574 -231214 116686 -257598
9997c11239a541l05788a46978F1048g880j61659c0395A3358M6889A9095D500K0070
$$ -311239 -1541 -307329 -146978 61048 -7880 -169539 -30395 13358 60247 19095 4500 24570
9985B4570b96922C5587e7354A71015a70565g8939C35751a26909f1966A1023M6909
$$ 24570 -296922 35587 -57354 171015 -170565 -78939 335751 -126909 -61966 11023 57932
9974E7932c45209B9384a03660I2237a90772r83j0700b0402j8643j29938l9087
$$ 57932 -345209 29384 -103660 92237 -190772 -191755 -202455 -20402 -39045 -168983 -208070
9963b08070E1807h7191A80044d23574c8535j72272m583i1712B5784b03666m3330
$$ -208070 51807 -87191 180044 -423574 -38535 -210807 -215390 -91712 25784 -203666 -246996
9952b46996R6228A82805a66866I7198H920d14451e3952K0981n7303r2999i262
$$ -246996 -150768 182805 -166866 97198 8920 -414451 -53952 -32971 -90274 -183273 -9262
9940C8366b0370A92768I1022e7415m82017B05687a83244j82919A8513c20430A24886
$$ 38366 -20370 192768 91022 -57415 -539432 205687 -183244 -366163 18513 -320430 124886
9928a43398M1770k04017C15560b82094H8878C3802J59759O0880a41822e3927j01120
$$ -143398 -101628 -305645 315560 -282094 88878 33802 193561 254441 -141822 -53927 -155047
9917a55047j910A27252a1558l69187J13080l7267G716b56601K7966J3367d836
$$ -155047 -156957 127252 -11558 -380745 -267665 -304932 7716 -256601 -228635 -215268 -4836
9905A58516G4140b7990B13034n1430a66088M4265m3290E7895g3378p2126A2335
$$ 158516 74140 -27990 213034 161604 -166088 -121823 -165113 57895 -73378 -145504 12335
9893E3397f8174A55020b11217A65070d4140j68235A05271a5057p7202C03597E8328
$$ 53397 -68174 155020 -211217 165070 -44140 -212375 105271 -15057 -92259 303597 58328
9881A16064g2380A77524p062a62244a2512q6201j4751j34536k47210a59138B85124
$$ 116064 -72380 177524 170462 -162244 -12512 -98713 -113464 -248000 -495210 -159138 285124
9869b22181A25849e256j80573A1420J9914i3379m1898I4708a54282F7221a25180
$$ -222181 125849 -5256 -185829 11420 31334 -93379 -135277 94708 -154282 67221 -125180
9857a03047p4003l1891j12715a13622r5663j6206A3339b38161o0634B1970L4169
$$ -103047 -177050 -208941 -321656 -113622 -209285 -225491 13339 -238161 -298795 21970 56139
9846E6139J56534a12841C06717D8325K41684a6341A79052h6135k40769J09520
$$ 56139 212673 -112841 306717 48325 290009 -16341 179052 -86135 -326904 -217384
9836b17384H2955J41586M209a20833M8761A87975b15029K4564f3979C02486n5251
$$ -217384 82955 224541 228750 -120833 -72072 187975 -215029 -190465 -63979 302486 247235
9825B47235a22817N0912j42221J8992f9299n7031p5182e0572b4077j96289h3751
$$ 247235 -122817 -71905 -214126 -195134 -69299 -126330 -201512 -50572 -24077 -220366 -83751
9813D3404b61915A39271a74594c4233j39520K3151e1358D3669i1011B60479G3968
$$ 43404 -261915 139271 -174594 -34233 -173753 -150602 -51358 43669 -91011 260479 73968
9801H4605B5461c8408q3008I9328c1488j12757r84j536j74584c3337A29965b60147
$$ 84605 25461 -38408 -121416 99328 -31488 -144245 -145229 -146765 -321349 -33337 129965 -260147
9788D0781c71620k54710f5909A0337d4027q7993c172j10100b9676j8827E9128
$$ 40781 -371620 -626330 -65909 10337 -44027 -132020 -3172 -113272 -29676 -48503 59128
9776a01543d9290j25969f9383j39930B147e0759j34042H4680a6793E1724J43963
$$ -101543 -49290 -175259 -69383 -209313 2147 -50759 -184801 84680 -16793 51724 195687
9765A95687a1607q8340n3313M6481K2224j33034g7813j68150A11581a18735B95659
$$ 195687 -11607 -99947 -153260 -106779 -84555 -217589 -77813 -245963 111581 -118735 295659
9753a20889L3718q5713C3002g7267J5812A28705i2987r078l2307K5932c8214j46816
$$ -120889 -87171 -172884 33002 -77267 -61455 128705 -92987 -102065 -134372 -108440 -38214 -185030
9741a85030A64941m5389K188l2119g937l80525c6223C17913a32794k2753o6784
$$ -185030 164941 119552 121740 89621 -7937 -388462 -36223 317913 -132794 -155547 -222331
9730b22331B0234J8453e2201A58404n6288c53728i4136J2993K6102k09616i7142
$$ -222331 20234 38687 -52201 158404 102116 -353728 -94136 -81143 -55041 -264657 -97142
9718d0917B9613f9177a4273j94579J5906b1443E1862c4554A71768c18678e1979
$$ -40917 29613 -69177 -14273 -208852 -192946 -21443 51862 -34554 171768 -318678 -51979
9706b53349Q3392A67072l886a23846G681d2263q8324a9519C7385b7093C79384
$$ -253349 -169957 167072 163186 -123846 7681 -42263 -130587 -19519 37385 -27093 379384
9694h5929A46851g0834n6242B06057f8741a9070E7701h796F6200b52811a03352
$$ -85929 146851 -70834 -127076 206057 -68741 -19070 57701 -8796 66200 -252811 -103352
9682A36833A5159a6936l8541o8439h184H3779b81811J24974O3908k97226I292
$$ 136833 15159 -16936 -55477 -123916 -8184 83779 -281811 -156837 -92929 -390155 9292
9670c5266A1255a96999A1531c41256e3600A71605n4204b12590G3102D811c30102
$$ -35266 11255 -196999 11531 -341256 -53600 171605 117401 -212590 73102 4811 -330102
9658F6922h248I2253a77284j12846G3015e61A00712i7755K4969H0974a06048j85902
$$ 66922 -8248 92253 -177284 -290130 73015 -561 100712 -97755 -72786 80974 -106048 -291950
9646b91950f6043n4588j08560f0768j80586R9773A21646J33373r8240a82524M4375
$$ -291950 -66043 -120631 -229191 -60768 -241354 -141581 121646 255019 156779 -182524 -138149
9635a38149A42488k343l1343a28654f1437G597h0468p4712k53032B5853j969K4684
$$ -138149 142488 140145 108802 -128654 -61437 7597 -80468 -155180 -408212 25853 23884 48568
9623D8568k2765h119A5838a3502P34l33650C2429d7678O394A9540J25388j8294
$$ 48568 25803 -8119 15838 -13502 -12768 -346418 32429 -47678 -41284 19540 144928 126634
9611A26634A5972O5457B6740J13805a96459B1903a04474C38304r0846H1538c440
$$ 126634 15972 81429 26740 140545 -196459 21903 -104474 338304 247458 81538 -3440
9599d0617A7598a8089l78647a9584p5951B93449e1651A53513C7502M8087c45232
$$ -40617 17598 -18089 -396736 -19584 -95535 293449 -51651 153513 37502 85589 -345232
9587d7779m14397a24262j50387j77690l1937J55929A57083a86793A7561c92937
$$ -47779 -462176 -124262 -274649 -452339 -484276 -328347 157083 -186793 17561 -392937
9576a45999L343q7495F4147c40965J21577a03320n4795A8755Q4174L2211e8753
$$ -145999 -142656 -230151 64147 -340965 -219388 -103320 -158115 18755 102929 135140 -58753
9564G0558P7235E3385K4412J00991P2015b42105a19583A43254a61295I712d2581
$$ 70558 147793 53385 77797 178788 250803 -242105 -119583 143254 -161295 9712 -42581
9552a68133H5338a24744b0271k1862A31560a10766N3403l4836j06666C19981a57962
$$ -168133 85338 -124744 -20271 -42133 131560 -110766 -57363 -92199 -198865 319981 -157962
9540b38289P9300A06026b58557a27466a2959o8139E6428a24275B1747b59740L1618
$$ -238289 -158989 106026 -258557 -127466 -12959 -81098 56428 -124275 21747 -259740 -228122
9529b28122B9541N6325c3707r0875C87176j88624h2827j49281E3125A619d894
$$ -228122 29541 85866 -33707 -124582 387176 198552 -82827 -232108 53125 1619 -4894
9517B6861b9291p917A1631i4548L0869k04639A66786j2106l5177n1093a76408
$$ 26861 -29291 -37208 11631 -94548 -63679 -268318 166786 154680 119503 68410 -176408
9505f3751j52242n7255B4750Q3253i8922H5143b55624B13123I713J05731c3727
$$ -63751 -215993 -273248 24750 108003 -98922 85143 -255624 213123 9713 115444 -33727
9493c9029H9313r761b13020j9143Q9096O190k9295h293A72149l1875b990k61582
$$ -39029 89313 79552 -213020 -232163 -143067 -136877 -166172 -8293 172149 140274 -2990 -264572
9481b64572F7893i3743n6556e1495A59640m7446I687g5419G3543a68013E8480
$$ -264572 67893 -93743 -150299 -51495 159640 112194 9687 -75419 73543 -168013 58480
9469C761L56448a29094k49402B15741d04654d4974D2068P0011E4976c04959G78
$$ 3761 360209 -129094 -378496 215741 -404654 -44974 42068 112079 54976 -304959 778
9457a83074N1703C04128d63708A89669h2065k7795j15205A00450a70070H2355
$$ -183074 -131371 304128 -463708 189669 -82065 -109860 -225065 100450 -170070 82355
9446h7049A97684F4554b35019P0519M7753A40413b1749B93694a48909m6351A08396
$$ -87049 197684 64554 -235019 -164500 -116747 140413 -21749 293694 -148909 -195260 108396
9434a0756m3095k69710A8580i2960E6236b39692e0770q7417A37972a46975E0007
$$ -10756 -53851 -323561 18580 -92960 56236 -239692 -50770 -138187 137972 -146975 50007
9422b62935Q0134B29337p8006a29755F6622N1837P9230a90635p7878c4473E0570
$$ -262935 -182801 229337 151331 -129755 66622 118459 197689 -190635 -268513 -34473 50570
9410c0980A86642a01060m9962A8355K5069a40935A38735E9723b88609i1015l3217
$$ -30980 186642 -101060 -151022 18355 43424 -140935 138735 59723 -288609 -91015 -124232
9399a24232A3216i4991G3378c41906F5387h7698C7565K1638O6654C7636b49657
$$ -124232 13216 -94991 73378 -341906 65387 -87698 37565 59203 125857 37636 -249657
9387B71294c25621J01874A17577c37333a27386K9274l7191j37156c2323j72519
$$ 271294 -325621 -223747 117577 -337333 -127386 -98112 -135303 -272459 -32323 -204842
9377b04842d0319j85342B61013c45387Q5119A96785a06836k0725n3129A99022
$$ -204842 -40319 -225661 261013 -345387 -260268 196785 -106836 -127561 -180690 199022
9366c48946I6269g7963A67137c74107B01536f5913o739C4225o569J32588a76695
$$ -348946 96269 -77963 167137 -374107 201536 -65913 -72652 34225 27656 160244 -176695
9354a01897L2384k05717a14702q4285K5339A07978e5807B7242R4821C8316b09788
$$ -101897 -69513 -275230 -114702 -198987 -173648 107978 -55807 27242 122063 38316 -209788
9342a50353A80005b00641f8886A84820B2734h0711j78023K3960d5274E1546a86133
$$ -150353 180005 -200641 -68886 184820 22734 -80711 -258734 -234774 -45274 51546 -186133
9330a69741E8646b28717D2224J21174a09484F8878i5941n7903A08128a02932q0750
$$ -169741 58646 -228717 42224 163398 -109484 68878 -95941 -153844 108128 -102932 -183682
9319a83682r5595B35610p3379c30652h8813o9093k37338J27596A3248b19124A66628
$$ -183682 -279277 235610 162231 -330652 -88813 -157906 -395244 -267648 13248 -219124 166628
9307f2076j457k7912p3351j7080d9434o4187n0481I2898i0537j32871B044i48
$$ -62076 -63533 -91445 -164796 -181876 -49434 -113621 -164102 92898 -90537 -223408 2044 -948
9294B5853b38408A02613b17755A01325Q6245a7513j54848J1391q5467j72062a11785
$$ 25853 -238408 102613 -217755 101325 187570 -17513 -172361 -160970 -246437 -418499 -111785
9282b30120a02182d0728B32623a87033A11051B8170b12308k53082A55507a48833
$$ -230120 -102182 -40728 232623 -187033 111051 28170 -212308 -465390 155507 -148833
9271b5289k38163a8055j3054r1292o6382C1142a90406h3161B0729J45702a4985
$$ -25289 -263452 -18055 -31109 -122401 -188783 31142 -190406 -83161 20729 166431 -14985
9259A77041a86776A04776a00461L4547p6476J9072B56126I3721J53200c09103
$$ 177041 -186776 104776 -100461 -65914 -142390 -123318 256126 93721 246921 -309103
9248A75626e3259j13401j94984h8790I8949a32542m5580N5150n6464A8888L3644
$$ 175626 -53259 -166660 -361644 -88790 98949 -132542 -178122 -122972 -179436 18888 52532
9237E2532f8985l23954H1813c2598j69111M5592d6159j61639C6820b07173E2637
$$ 52532 -68985 -392939 81813 -32598 -201709 -156117 -46159 -207798 36820 -207173 52637
9225A16574N1214h0756I244g7214A01309b09494G1823Q199b13793E981O0236b0713
$$ 116574 167788 -80756 9244 -77214 101309 -209494 71823 80022 -213793 5981 66217 -20713
9212a46071F3502a75846A09998a98223L5460B54995d46363a53739k47703a63582
$$ -146071 63502 -175846 109998 -198223 -162763 254995 -446363 -153739 -401442 -163582
9201e47537A34072e9075B71691E061a14055k05255f6460j44779A81975b657n6175
$$ -547537 134072 -59075 271691 5061 -114055 -319310 -66460 -211239 181975 -2657 -58832
9190e8832C8418b51804D2986O5972l025a98958F6241a75380l5048g0718j54413
$$ -58832 38418 -251804 42986 108958 105933 -198958 66241 -175380 -210428 -70718 -225131
9179b25131p8497j414e0129m20990A11786b33481A6008a31039k25205a8895A5534
$$ -225131 -303628 -305042 -50129 -471119 111786 -233481 16008 -131039 -356244 -18895 15534
9167a06693j71892A23518K7688D7545e477A57462e6233k27053J0242A97264B4283
$$ -106693 -278585 123518 151206 47545 -5477 157462 -56233 -283286 -273044 197264 24283
9155b95929a14639A72105j2949i5461O008l5329o4078A34426h8087c8868I9487
$$ -295929 -114639 172105 159156 -95461 -89453 -124782 -188860 134426 -88087 -38868 99487
9143A98a53111A090a16069A19090j7218a73851A19246c6753A47264C7079Q6904
$$ 198 -153111 1090 -116069 119090 101872 -173851 119246 -36753 147264 37079 123983
9132A23983e6463j95011N7286i5597o4596A71237c86693G0760b10919e916B03864
$$ 123983 -56463 -251474 -194188 -95597 -160193 171237 -386693 70760 -210919 -5916 203864
9120A6983K3340c59520J26730d6748J4834k0959B0165c16814b9686k8368a4676
$$ 16983 40323 -359520 -232790 -46748 -31914 -52873 20165 -316814 -29686 -58054 -14676
9108A9454a51914j24939a35076h8A4662f0170a3931F8656b54140h0990n8784j52152
$$ 19454 -151914 -276853 -135076 -88 14662 -60170 -13931 68656 -254140 -80990 -139774 -291926
9096b91926A30798b01208R7096b2372k21220C716a47175p0091B635a47105e1941
$$ -291926 130798 -201208 -104112 -22372 -243592 3716 -147175 -217266 2635 -147105 -51941
9084d60059c8452m1763B61429a66009J4218C37110H4019a13668a1425C4181J528
$$ -460059 -38452 -80215 261429 -166009 -151791 337110 84019 -113668 -11425 34181 35709
9073C5709a38404k0092K8405A49188b7580E1645L7389c58208h8419B02583E6394
$$ 35709 -138404 -158496 -130091 149188 -27580 51645 89034 -358208 -88419 202583 56394
9061G3809J08740a48782K3162N2306m5099A07729f1396E2373i665l4097j84017
$$ 73809 182549 -148782 -125620 -73314 -118413 107729 -61396 52373 -9665 -43762 -227779
9050b27779a01872I5501G202a4748H9670b57259a07469B55830c95987C75014f1821
$$ -227779 -101872 95501 7202 -14748 89670 -257259 -107469 255830 -395987 375014 -61821
9038A66105k4123a03308G9739a28457a3237j74970j32857p1997J74544N6157A28182
$$ 166105 141982 -103308 79739 -128457 -13237 -188207 -321064 -393061 -218517 -162360 128182
9026A26210b55701g2099a3129j01430L2225A30413b9883m4921m5118A15370b93266
$$ 126210 -255701 -72099 -13129 -114559 -82334 130413 -29883 -74804 -119922 115370 -293266
9014A76929d6816q368m92925I7683a30343Q748F7744R106a53764b4770k18294
$$ 176929 -46816 -55184 -548109 97683 -130343 -121595 67744 76850 -153764 -24770 -243064
9003b43064A3067J84536o2860f0691o7184j04130B49054b76526r7009N5455M6377
$$ -243064 13067 197603 134743 -60691 -127875 -232005 249054 -276526 -373535 -318080 -271703
8992b71703c1749p9996A47151c55133E4491c80280a4203k95793D0075b39344d3488
$$ -271703 -31749 -111745 147151 -355133 54491 -380280 -14203 -309996 40075 -239344 -43488
8980d6237B65436c4996r963H5900a06705B92436a11376j10388j0652M0887A49765
$$ -46237 265436 -34996 -44959 85900 -106705 292436 -111376 -221764 -232416 -191529 149765
8968i5775j83341N3042h8739c1320m5622o3788H2315h546E5069n754c3817A69858
$$ -95775 -279116 -226074 -88739 -31320 -76942 -140730 82315 -8546 55069 49315 -33817 169858
8955a08641n1960C15447j20700b2674A46957J75426b1472A06463h4012B11191
$$ -108641 -160601 315447 194747 -22674 146957 322383 -21472 106463 -84012 211191
8944i2218m39232A16360G170i8788b1192o2515n1935f429A6026c9576F7269C101
$$ -92218 -531450 116360 7170 -98788 -21192 -83707 -135642 -6429 16026 -39576 67269 3101
8931c8860l5802E3875K90368A12565d1679C03953C5498P43548J890995K227152
$$ -38860 -74662 53875 344243 112565 -41679 303953 35498 779046 2670041 4897193
8921D897193j593697G93236A60717J1236P5661d6414q6353l0701H3067E78J4685
$$ 4897193 3303496 793236 160717 171953 247614 -46414 -132767 -163468 83067 578 15263
8910A5263a88277b1413B11120A4111a24674D7794c771k44697A01398B0970a55795
$$ 15263 -188277 -21413 211120 14111 -124674 47794 -3771 -248468 101398 20970 -155795
8898A56804c22981k1441R6387H1581K70333d9483A35482n7003a37538d2729o8241
$$ 156804 -322981 -344422 -248035 81581 351914 -49483 135482 78479 -137538 -42729 -110970
8887a10970l2653O7910j40521l83183G1862K00711c74962O0527O5095p749a24037
$$ -110970 -143623 -75713 -216234 -599417 71862 272573 -374962 -314435 -249340 -257089 -124037
8875G5518c72670A57601a07680j47336E0052N0810a69950n541d9517A41758N5222
$$ 75518 -372670 157601 -107680 -255016 50052 100862 -169950 -175491 -49517 141758 196980
8864A96980H1335f6288E6636K47744c63069a79905e1637k8454F6210a81824B66778
$$ 196980 81335 -66288 56636 304380 -363069 -179905 -51637 -80091 66210 -181824 266778
$$ [...]
##END NTUPLES=NMR SPECTRUM
##END=
