##TITLE=AC1672_MEXAD14363_8570953_oOEZZJ85Ot
##JCAMPDX= 6.0         $$ Bruker NMR JCAMP-DX V2.0
##DATA TYPE= NMR SPECTRUM
##DATA CLASS= NTUPLES
##ORIGIN= BRUKER
##OWNER= Administrator
$$ 1.72 TOPSPIN		Version 2.1
$$ 2014-04-11 14:18:32.869 -0700  Administrator@X
$$ Compression mode = diff/dup
##.OBSERVE FREQUENCY= 400.02188249412
##.OBSERVE NUCLEUS= ^1H
##.ACQUISITION MODE= SIMULTANEOUS (DQD)
##.ACQUISITION SCHEME= undefined
##.AVERAGES= 64
##.DIGITISER RES= 22
##SPECTROMETER/DATA SYSTEM= spect
##.PULSE SEQUENCE= noesygpps1d.comp
##.SOLVENT NAME= COFFEE_meoh
##.SHIFT REFERENCE= INTERNAL, COFFEE_meoh, 1, 14.96077
##AUDIT TRAIL= $$ (NUMBER, WHEN, WHO, WHERE, PROCESS, VERSION, WHAT)
$$ ##TITLE= Audit trail, TOPSPIN		Version 2.1
$$ ##JCAMPDX= 5.01
$$ ##ORIGIN= Bruker BioSpin GmbH
$$ ##OWNER= Administrator
$$ $$ E:\/data/COFFEE/nmr/AC1672_MEXAD14363_8570953_oOEZZJ85Ot/12/pdata/1/auditp.txt
$$ ##AUDIT TRAIL=  $$ (NUMBER, WHEN, WHO, WHERE, PROCESS, VERSION, WHAT)
(   1,<2014-04-11 14:18:27.463 -0700>,<Administrator>,<X>,<go>,<TOPSPIN 2.1>,
      <created by zg
	started at 2014-04-11 14:06:57.601 -0700,
	POWCHK enabled, PULCHK disabled,
       configuration hash MD5:
       C8 4E 4E 5D D3 5C D8 9E 9F 52 82 E0 59 8A DE 15
       data hash MD5: 64K
       EF 01 F1 CC 20 D0 B3 79 05 98 79 E1 7E 01 81 8F>)
(   2,<2014-04-11 14:18:30.494 -0700>,<Administrator>,<X>,<proc1d>,<TOPSPIN 2.1>,
      <Start of raw data processing
       efp LB = 0.3 FT_mod = 6 PKNL = 1 PHC0 = 0 PHC1 = 0 SI = 128K 
       data hash MD5: 128K
       C8 6C CF AB 1E F9 B7 81 A0 07 98 63 14 7E 90 57>)
(   3,<2014-04-11 14:18:31.619 -0700>,<Administrator>,<X>,<proc1d>,<TOPSPIN 2.1>,
      <pk PHC0 = -81.79321 PHC1 = 0 
       data hash MD5: 128K
       77 A6 9E E1 29 A5 16 44 85 A3 B7 E3 AA 63 48 FC>)
(   4,<2014-04-11 14:18:32.166 -0700>,<Administrator>,<X>,<proc1d>,<TOPSPIN 2.1>,
      <abs ABSG = 1 
       data hash MD5: 128K
       50 A8 AA 6E 04 2F A2 DE A9 4A 51 64 F3 38 AA 89>)
(   5,<2014-04-11 14:18:32.275 -0700>,<Administrator>,<X>,<proc1d>,<TOPSPIN 2.1>,
      <abs ABSG = 2 
       data hash MD5: 128K
       9C FA 79 6A B7 58 41 D5 91 73 2C 70 68 35 E1 C1>)
(   6,<2014-04-11 14:18:32.416 -0700>,<Administrator>,<X>,<proc1d>,<TOPSPIN 2.1>,
      <abs ABSG = 3 
       data hash MD5: 128K
       9F 2D 82 48 EA 3D A9 BE 90 BE 26 F4 F9 60 81 C9>)
(   7,<2014-04-11 14:18:32.541 -0700>,<Administrator>,<X>,<proc1d>,<TOPSPIN 2.1>,
      <abs ABSG = 4 
       data hash MD5: 128K
       15 EC A3 B9 9E 89 82 35 18 54 9B 7B 18 29 2F 11>)
(   8,<2014-04-11 14:18:32.619 -0700>,<Administrator>,<X>,<proc1d>,<TOPSPIN 2.1>,
      <abs ABSG = 5 
       data hash MD5: 128K
       F1 02 05 7F 0A B4 A1 D9 D1 DD A8 09 69 DB 5F E3>)
$$ ##END=
$$ 
$$ $$ hash MD5
$$ $$ 37 D6 B0 28 1A 99 A1 4D 1B A8 C9 67 CA 7D 20 8D
##$RELAX= 
##$RELAX= 
##$RELAX= 
##$RELAX= 
##$RELAX= 
##$RELAX= 
##$RELAX= 
##$RELAX= 
$$ Bruker specific parameters
$$ --------------------------
##$DU= <E:\>
##$EXPNO= 12
$$ [...]
##$TP07= 0
##$TPNAME0= <>
##$TPNAME1= <>
##$TPNAME2= <>
##$TPNAME3= <>
##$TPNAME4= <>
##$TPNAME5= <>
##$TPNAME6= <>
##$TPNAME7= <>
##$TPOAL= (0..7)
0.5 0.5 0.5 0.5 0.5 0.5 0.5 0.5
##$TPOFFS= (0..7)
0 0 0 0 0 0 0 0
##$TUNHIN= 0
##$TUNHOUT= 0
##$TUNXOUT= 0
##$USERA1= <user>
##$USERA2= <user>
##$USERA3= <user>
##$USERA4= <user>
##$USERA5= <user>
##$V9= 5
##$VALIST= <valist>
##$VCLIST= <CCCCCCCCCCCCCCC>
##$VD= 0
##$VDLIST= <DDDDDDDDDDDDDDD>
##$VPLIST= <PPPPPPPPPPPPPPP>
##$VTLIST= <TTTTTTTTTTTTTTT>
##$WBST= 1024
##$WBSW= 4
##$XGAIN= (0..3)
0 0 0 0
##$XL= 0
##$YL= 0
##$YMAX_a= 5707438
##$YMIN_a= -11824279
##$ZGOPTNS= <>
##$ZL1= 120
##$ZL2= 120
##$ZL3= 120
##$ZL4= 120
##$ABSF1= 14.96077
##$ABSF2= -5.597412
##$ABSG= 5
##$ABSL= 3
##$ALPHA= 0
##$AQORDER= 0
##$ASSFAC= 0
##$ASSFACI= 0
##$ASSFACX= 0
##$ASSWID= 0
##$AUNMP= <proc_prof1d_extract.lims>
##$AXLEFT= 0
##$AXNAME= <>
##$AXNUC= <1H>
##$AXRIGHT= 0
##$AXTYPE= 0
##$AXUNIT= <>
##$AZFE= 0.1
##$AZFW= 0.1
##$BCFW= 0
##$BC_mod= 0
##$BYTORDP= 0
##$COROFFS= 0
##$CY= 15
##$DATMOD= 1
##$DC= 0
##$DFILT= <>
##$DTYPP= 0
##$F1P= 0
##$F2P= 0
##$FCOR= 0.5
##$FTSIZE= 131072
##$FT_mod= 6
##$GAMMA= 0
##$GB= 0
##$INTBC= 1
##$INTSCL= 1
##$ISEN= 128
##$LB= 0.3
##$LEV0= 0
##$LPBIN= 0
##$MAXI= 10000
##$MC2= 0
##$MEAN= 0
##$ME_mod= 0
##$MI= 0
##$NCOEF= 0
##$NC_proc= -2
##$NLEV= 6
##$NOISF1= 0
##$NOISF2= 0
##$NSP= 0
##$NTH_PI= 0
##$NZP= 0
##$OFFSET= 14.96077
##$PC= 1
##$PHC0= -81.79321
##$PHC1= 0
##$PH_mod= 1
##$PKNL= yes
##$PPARMOD= 0
##$PPDIAG= 0
##$PPIPTYP= 0
##$PPMPNUM= 2147483647
##$PPRESOL= 1
##$PSCAL= 4
##$PSIGN= 0
##$PYNMP= <proc.py>
##$REVERSE= no
##$SF= 400.020009729376
##$SI= 131072
##$SIGF1= 0
##$SIGF2= 0
##$SINO= 400
##$SIOLD= 131072
##$SPECTYP= <>
##$SREGLST= <1H.CDCl3>
##$SSB= 0
##$STSI= 131072
##$STSR= 0
##$SW_p= 8223.68421052631
##$SYMM= 0
##$S_DEV= 0
##$TDeff= 65536
##$TDoff= 0
##$TI= <>
##$TILT= no
##$TM1= 0
##$TM2= 0
##$TOPLEV= 0
##$USERP1= <user>
##$USERP2= <user>
##$USERP3= <user>
##$USERP4= <user>
##$USERP5= <user>
##$WDW= 1
##$XDIM= 131072
##$YMAX_p= 367528971
##$YMIN_p= -12606
##$CURPLOT= <Network HP LaserJet P1505>
##$CURPRIN= <$Network HP LaserJet P1505>
##$DFORMAT= <normdp>
##$LAYOUT= <+/1D_H.xwp>
##$LFORMAT= <normlp>
##$PFORMAT= <normpl>
##$SURQMSG= 1
$$ End of Bruker specific parameters
$$ ---------------------------------
##NTUPLES= NMR SPECTRUM
##VAR_NAME=  FREQUENCY,     SPECTRUM/REAL,   SPECTRUM/IMAG
##SYMBOL=    X,             R,               I
##VAR_TYPE=  INDEPENDENT,   DEPENDENT,       DEPENDENT
##VAR_FORM=  AFFN,          ASDF,            ASDF
##VAR_DIM=   131072,        131072,          131072
##UNITS=     HZ,            ARBITRARY UNITS, ARBITRARY UNITS
##FACTOR=    0.0627417313425164, 1,          1
##FIRST=     8223.62146879497, 972,          -56242
##LAST=      0,             2625,            -56783
##MIN=       0,             -12606,          0
##MAX=       8223.62146879497, 367528971,    0
$$ Real data points
##PAGE= N=1
##DATA TABLE= (X++(R..R)), XYDATA
$$ [...]
61689D91209k416j995j891j907k081k670l337l248k318j600j856k546k702k235
$$ 491209 488793 486798 484907 483000 480919 478249 474912 471664 469346 467746 465890 463344 460642 458407
61675D58407j679j278j017j114j651k100j923j376j079j040r07q24j173j599j284
$$ 458407 456728 455450 454433 453319 451668 449568 447645 446269 445190 444150 443243 442419 441246 439647 438363
61660D38363l11K13l49j279j568j218r41j008r50k89Q43J882K458K748L201L885
$$ 438363 438052 438265 437916 436637 435069 433851 432910 431902 430952 430663 431506 433388 435846 438594 441795 445680
61644D45680M339M237L922L890L902L241J819M30l11p05j364k324l202l830m288
$$ 445680 450019 454256 458178 462068 465970 469211 471030 471460 471149 470444 469080 466756 463554 459724 455436
61629D55436m475m139l314k397j731j340j063o71J35J541L225M391M495L973L824
$$ 455436 450961 446822 443508 441111 439380 438040 436977 436306 436441 437982 441207 445598 450093 454066 457890
61614D57890M338M512L187O01j818l284m539o494q645r686r365q767q691q678
$$ 457890 462228 466740 469927 470528 468710 465426 460887 454393 445748 436062 426697 417930 409239 400561
61600D00561p927o510n155m363m171m416m799m940m701m291l864l332k754k420
$$ 400561 392634 386124 380969 376606 372435 368019 363220 358280 353579 349288 345424 342092 339338 336918
61586C36918k337k135j817k015k981l946m117l786l594l261k109o01j09r93k082
$$ 336918 334581 332446 330629 328614 325633 321687 317570 313784 310190 306929 304820 304219 304110 303117 301035
61571C01035k354k135k126k242k110j975k219k516k180j157j8P75J047P02r7p22
$$ 301035 298681 296546 294420 292178 290068 288093 285874 283358 281178 280021 280003 280778 281825 282527 282430 281708
61555B81708o45p4M79R37J417J557R27K0o6R43K147K701K693K550K290J855J559
$$ 281708 281063 280989 281468 282405 283822 285379 286306 286326 286260 287203 289350 292051 294744 297294 299584 301439 302998
61538C02998J720K202K772L487M249M403L526K307J896K272K071L66j984l369
$$ 302998 304718 306920 309692 313179 317428 321831 325357 327664 329560 331832 333903 334269 332285 328916
61524C28916l417l246l704m213l866l081l206m496n409m504k353q52r41j828k328
$$ 328916 325499 322253 318549 314336 310470 307389 304183 299687 294278 289774 287421 286569 285628 283800 281472
61509B81472k135j560q61k45k0k22m76n52o98j067j176n62L30N31j83r16p15L88
$$ 281472 279337 277777 276916 276671 276651 276429 275953 275401 274703 273636 272460 271898 272228 272759 272576 271660 270945 271333
61491B71333J520J919J563R90O65N96M82J75j54l14k91r9L12Q69J278J333J129
$$ 271333 272853 274772 276335 277325 277990 278586 279068 279243 279089 278775 278484 278385 278697 279566 280844 282177 283306
61474B83306Q27M22o1l74l37k12m18r10j143o88K90J214J600J371P91J65l59p17
$$ 283306 284133 284555 284494 284120 283783 283571 283153 282243 281100 280412 280702 281916 283516 284887 285678 285843 285484 284767
61456B84767p78m45J12N90R03J156J282J049N90M50R36J653K040K028J931J943
$$ 284767 283989 283544 283656 284246 285149 286305 287587 288636 289226 289676 290612 292265 294305 296333 298264 300207
61440C00207K100K478L089L763M334M819N200N287M998M451L648K437J092L46
$$ 300207 302307 304785 307874 311637 315971 320790 325990 331277 336275 340726 344374 346811 347903 348249
61426C48249M25N70R9n18l11P52J779K153J987J546R94O62Q13J108R90M78o4q03
$$ 348249 348674 349244 349343 348825 348514 349266 351045 353198 355185 356731 357725 358387 359200 360308 361298 361776 361712 360909
61408C60909k184l770m392l718k779k531k683k501k015j821k168k754l144l004
$$ 360909 358725 354955 350563 346845 344066 341535 338852 336351 334336 332515 330347 327593 324449 321445
61394C21445k311j584j462j811j756r58j55q6m61n91m71n27p08n76m1O83J560
$$ 321445 319134 317550 316088 314277 312521 311563 311408 311322 310861 310270 309799 309272 308564 307988 307947 308630 310190
61377C10190K604L407L502L067K654K349J776R66N43R16J731K373K632K736K935
$$ 310190 312794 316201 319703 322770 325424 327773 329549 330515 331058 331974 333705 336078 338710 341446 344381
61362C44381L194L232K888K502K671L435M073M075M000M795O488Q164R212R939
$$ 344381 347575 350807 353695 356197 358868 362303 366376 370451 374451 379246 385734 393898 403110 413049
61348D13049J0814J1652J1898J1352J0310R219Q310P526O665N681M754L961L090
$$ 413049 423863 435515 447413 458765 469075 478294 486604 494130 500795 506476 511230 515191 518281
61335E18281K073J332J181J057n8k265m427n454n422n161n171n339n331m879l930
$$ 518281 520354 521686 522867 523924 523866 521601 517174 511720 506298 501137 495966 490627 485296 480417 476487
61320D76487k919k610l253m060m025l065j926j073l55L43Q17J184K067L679N273
$$ 476487 473568 470958 467705 463645 459620 456555 454629 453556 453201 453544 454361 455545 457612 461291 466564
61305D66564O112O590P711R630J1387J2044J1363R429O420K993J15j851l342m587
$$ 466564 472676 479266 486977 496607 507994 520038 531401 540830 547250 550243 550358 548507 545165 540578
61291E40578n152m971m977n891o929o768n429m149l561l130k433j846j580j080
$$ 540578 535426 530455 525478 519587 512658 505890 500461 496312 492751 489621 487188 485342 483762 482682
61277D82682O8J406K390L228M319N431O091O384O636O631N966M983M630N278O283
$$ 482682 482750 484156 486546 489774 494093 499524 505615 511999 518635 525266 531232 536215 540845 546123 552406
61262E52406O925P396Q492J0503J2715J4141J4598J4697J4771J4259J2571J0094
$$ 552406 559331 566727 575219 585722 598437 612578 627176 641873 656644 670903 683474 693568
61250F93568P682N427K818M8j910k791l539m932o574p847q955j0197j1046j0816
$$ 693568 701250 706677 709495 709543 707633 704842 701303 696371 689797 681950 672995 662798 651752 640936
61236F40936r738q525p350o143n398n614o231o113m929l257j581q9P91P43L54
$$ 640936 631198 622673 615323 609180 603782 598168 591937 585824 580895 577638 576057 575968 576759 577502 577856
61221E77856N46J208J436J097J020J460J565Q79K93Q00K058K924K960K712K737
$$ 577856 578402 579610 581046 582143 583163 584623 586188 587067 587360 588160 590218 593142 596102 598814 601551
61206F01551K877K509J380K61N46K746N605P388P916Q491R913J1680J3337J5318
$$ 601551 604428 606937 608317 608578 609124 611870 617475 624863 632779 641270 651183 662863 676200 691518
61192F91518J7842K0028K1046K1274K1412K1051J9253J6120J2864J0384Q640P267
$$ 691518 709360 729388 750434 771708 793120 814171 833424 849544 862408 872792 881432 888699
61180H88699O040M733L223J827R03J76j006k762m548o066p666r698j1883j3633
$$ 888699 894739 899472 902695 904522 905425 905601 904595 901833 897285 891219 883553 873855 861972 848339
61166H48339j4615j4901j4746j4479j4399j4611j5043j5544j5872j5675j4748
$$ 848339 833724 818823 804077 789598 775199 760588 745545 730001 714129 698454 683706
61155F83706j3359j1951j0545q717o302l820j977q56Q8J241K296K534J564m40
$$ 683706 670347 658396 647851 639134 632832 629012 627035 626179 626267 627508 629804 632338 633902 633462
61141F33462l043n818q274r866j0394j0163r591q711p343n526l453j172J229L286
$$ 633462 630419 624601 616327 606461 596067 585904 576313 567602 560259 554733 551280 550108 551337 554623
61127E54623M572N428O720Q742J0993J3089J5319J7881K0235K1675K2175K2235
$$ 554623 559195 564623 571343 580085 591078 604167 619486 637367 657602 679277 701452 723687
61115G23687K2269K2546K3310K4414K5159K4974K4133K3299K2592K1607K0094
$$ 723687 745956 768502 791812 816226 841385 866359 890492 913791 936383 957990 978084
61104I78084J8176J5986J3586J1096Q428N039O20m199q347j1586j4595j7839k0977
$$ 978084 996260 1012246 1025832 1036928 1045356 1050395 1051015 1046816 1038469 1026883 1012288 994449 973472
61091I73472k3582k5732k7513k8533k8450k7635k6796k6138k5280k3930k2268
$$ 973472 949890 924158 896645 868112 839662 812027 785231 759093 733813 709883 687615
61080F87615k0715j9546j8765j8056j6959j5254j3254j1588j0622j0141r565q430
$$ 687615 666900 647354 628589 610533 593574 578320 565066 553478 542856 532715 523150 514720
61068E14720o756n059l993l811m098m135l510k407j261k27Q66K099L184L736L756
$$ 514720 507964 502905 498912 495101 491003 486868 483358 480951 479690 479463 480329 482428 485612 489348 493104
61053D93104L744M258N465P074Q615R789J0647J1500J2645J4197J6089J8052J9616
$$ 493104 496848 501106 506571 513645 522260 532049 542696 554196 566841 581038 597127 615179 634795
61040F34795K0428K0762K1356K2457K3298K3015K1830K0690J9908J8933J7577
$$ 634795 655223 675985 697341 719798 743096 766111 787941 808631 828539 847472 865049
61029H65049J6512J6215J6250J6211J6545J7724J9174K0068K0778K2529K5838
$$ 865049 881561 897776 914026 930237 946782 964506 983680 1003748 1024526 1047055 1072893
61018A072893L0367L6293M4761N6747P2544R2641J17987J48784J84019K22875
$$ 1072893 1103260 1139553 1184314 1241061 1313605 1406246 1524233 1673017 1857036 2079911
61008B079911K65651L12449L62176M13725M65460N09170N24702M87282L87654
$$ 2079911 2345562 2658011 3020187 3433912 3899372 4408542 4933244 5420526 5808180
60999E808180K46599J06134L517m7046n0997k0563K8172O8977O7994K515j20348
$$ 5808180 6054779 6160913 6164430 6117384 6066387 6045824 6073996 6142973 6210967 6213482 6093134
60988F093134k65572l91949m73713n06505m99803m67089m20284l67994l15656
$$ 6093134 5827562 5435613 4961900 4455395 3955592 3488503 3068219 2700225 2384569
60979B384569k66579k22879j85628j54770j29524j08964r2137p8193o6794n8063
$$ 2384569 2117990 1895111 1709483 1554713 1425189 1316225 1224088 1145895 1079101 1021038
60969A021038n1735m6751m2167l8030l4756l1980k8882k5500k2669k0578j8316
$$ 1021038 969303 922552 880385 842355 807599 775619 746737 721237 698568 677990 659674
60958F59674j5347j2572j1160j0926j0676r823q781p899o964n904n108m663l967
$$ 659674 644327 631755 620595 609669 598993 589170 580389 572490 565526 559622 554514 549851 545884
60945E45884k644j331r83j676k664l414m010m655n355o088o808p287p359p349
$$ 545884 543240 541909 540926 539250 536586 533172 529162 524507 519152 513064 506256 498969 491610 484261
60931D84261p716q287q347p592o522n717n235m953m892m886m444l356k085j067
$$ 484261 476545 468258 459911 452319 445797 440080 434845 429892 425000 420114 415670 412314 410229 409162
60917D09162j49Q50J441J121M26N16J657K870L270L076L034L366L696L722L604
$$ 409162 409013 409863 411304 412425 412851 413367 415024 417894 421164 424240 427274 430640 434336 438058 441662
60902D41662L743M320N007N112M244K774J406L72n91j571k330k842l465m284m829
$$ 441662 445405 449725 454732 459844 464088 466862 468268 468640 468049 466478 464148 461306 457841 453557 448728
60887D48728m831m764n183n886o188n894n390m952m474l844l135k379j603j105
$$ 448728 443897 439133 433950 428064 421876 415982 410592 405640 401166 397322 394187 391808 390205 389100
60873C89100j196j559j395l80R50K049L095M429N718O232N846N191M814M690M630
$$ 389100 387904 386345 384950 384570 385520 387569 390664 395093 400811 407043 412889 418080 422894 427584 432214
60858D32214M675M913N297N829O523P099P004O031M611L312K390J961K094K427
$$ 432214 436889 441802 447099 452928 459451 466550 473554 479585 484196 487508 489898 491859 493953 496380
60844D96380K204J250M41N50R78M84j025k348k729k752l210l980m533m882n399
$$ 496380 498584 499834 500275 500825 501803 502287 501262 498914 496185 493433 490223 486243 481710 476828 471429
60829D71429o109o739p093o942n953m343l172l322m345m996m759m188l832l558
$$ 471429 465320 458581 451488 444546 438593 434250 431078 427756 423411 418415 413656 409468 405636 402078
60815D02078l084k527k091j667j115o44o21j057j456j192k9J636L068L868M251
$$ 402078 398994 396467 394376 392709 391594 390950 390329 389272 387816 386624 386595 388231 391299 395167 399418
60800C99418M606M942N008M775M526M528M892N657O758P928Q863R447R680R637
$$ 399418 404024 408966 413974 418749 423275 427803 432695 438352 445110 453038 461901 471348 481028 490665
60786D90665R678J0366J1777J3143J3698J3695J4008J4913J5886J6532J7025J7554
$$ 490665 500343 510709 522486 535629 549327 563022 577030 591943 607829 624361 641386 658940
60774F58940J8053J8631J9638K0978K2006K2400K2629K3233K4130K4989K5726
$$ 658940 676993 695624 715262 736240 758246 780646 803275 826508 850638 875627 901353
60763I01353K6127K5587K3852K1563J9371J6805J2881P723K691j270m691q624
$$ 901353 927480 953067 976919 998482 1017853 1034658 1047539 1055262 1057953 1056683 1051992 1043368
60751A043368j3129j7279k0300k2265k3644k4655k5219k5360k5347k5404k5425
$$ 1043368 1030239 1012960 992660 970395 946751 922096 896877 871517 846170 820766 795341
60740G95341k5121k4472k3850k3583k3544k3275k2485k1301j9984j8568j6856
$$ 795341 770220 745748 721898 698315 674771 651496 629011 607710 587726 569158 552302
60729E52302j4724j2352j0101q185o561n118l900l059k635k482k414k360k386
$$ 552302 537578 525226 515125 506940 500379 495261 491361 488302 485667 483185 480771 478411 476025
60716D76025k576k905l170l146k873k617k514k476k522k951l899m963n563n651
$$ 476025 473449 470544 467374 464228 461355 458738 456224 453748 451226 448275 444376 439413 433850 428199
60702D28199n672n932o254o314n992n410m883m764n109n509n494m995m194l160
$$ 428199 422527 416595 410341 404027 398035 392625 387742 382978 377869 372360 366866 361871 357677 354517
60688C54517k091j574j985k652k388r84M76R37M07m76j149j075J06J807K577J731
$$ 354517 352426 350852 348867 346215 343827 342843 343319 344256 344663 344187 343038 341963 342069 343876 346453 348184
60672C48184L97J55J012J613J220N44M80Q82R45L03o42j221j175q56p53p33o3
$$ 348184 348581 348736 349748 351361 352581 353125 353605 354487 355432 355735 355093 353872 352697 351841 351088 350355 350292
60655C50292J575L385M280M178L923M069M441M850N503O418P005O653N423L964
$$ 350292 351867 355252 359532 363710 367633 371702 376143 380993 386496 392914 399919 406572 411995 415959
60641D15959K963K788L254L611L169K065J063M50l65j828l395m160l968l380k829
$$ 415959 418922 421710 424964 428575 431744 433809 434872 435322 434957 433129 429734 425574 421606 418226 415397
60626D15397k396k266k768l798m674m808m260l504k857k286j653r99n60n35q37
$$ 415397 413001 410735 407967 404169 399495 394687 390427 386923 384066 381780 380127 379128 378568 378033 377196
60611C77196j184j449j747k109k306k202j989j783j268k25O79L54j250k740k694
$$ 377196 376012 374563 372816 370707 368401 366199 364210 362427 361159 360934 361613 361967 360717 357977 355283
60596C55283j233K95Q53N06j68q34j384j652j481r36k61L32P25R28J141J621K392
$$ 355283 354050 354345 355198 355704 355536 354702 353318 351666 350185 349249 348988 349320 350045 350973 352114 353735 356127
60579C56127L188L865M625N619O587P173P584Q375R591J0584J0988J1378J2441
$$ 356127 359315 363180 367805 373424 380011 387184 394768 403143 412734 423318 434306 445684 458125
60566D58125J3735J3912J2271R459O480L509K17l177n843p332q022q383q283p271
$$ 458125 471860 485772 498043 507502 513982 517491 517708 514531 508688 501356 493334 484951 476668 469397
60552D69397n264k610K44K905N062O710Q200R734J0974J1507J1626J2142J3345
$$ 469397 464133 461523 461767 464672 469734 476444 484644 494378 505352 516859 528485 540627 553972
60539E53972J4474J4395J2575R318N397J645j396l711n584p053p789p570o679
$$ 553972 568446 582841 595416 604734 610131 611776 610380 606669 601085 594032 586243 578673 571994
60526E71994n650m836m334m043l677l002k269k052k369k390j410K18J624K581
$$ 571994 566344 561508 557174 553131 549454 546452 544183 542131 539762 537372 535962 536180 537804 540385
60512E40385L488M402M872M902N373P144J0141J3672J7269K0927K4786K8941L3455
$$ 540385 543873 548275 553147 558049 563422 570566 580707 594379 611648 632575 657361 686302 719757
60499G19757L8237M2912M6920M9649N0540M9292M6086M1368L5182K6984J6344
$$ 719757 757994 800906 847826 897475 948015 997307 1043393 1084761 1119943 1146927 1163271
60488A163271L746r548k2292l3667m3031m9731n3391n4195n2673m9325m4670l9570
$$ 1163271 1167017 1157469 1135177 1101510 1058479 1008748 955357 901162 848489 799164 754494 714924
60476G14924l5042l1514k8489k5306k2127j9750j8471j7609j6319j4479j2519
$$ 714924 679882 648368 619879 594573 572446 552696 534225 516616 500297 485818 473299
60465D73299j0798r482q608p882o745n145l916l774m190m003l062k404k668l170
$$ 473299 462501 453019 444411 436529 429784 424639 420723 416949 412759 408756 405694 403290 400622 397452
60451C97452k970k204j792k167k855l150k815k108j473j150j020p63k59L06O32
$$ 397452 394482 392278 390486 388319 385464 382314 379499 377391 375918 374768 373748 372985 372726 373032 373664
60436C73664M57l27j441k156j901r96l88o04j268j679j471o82L25R47Q10L44M10
$$ 373664 374121 373794 372353 370197 368296 367300 366912 366308 365040 363361 361890 361208 361533 362480 363290 363634 364044
60419C64044J174J861J871J594J689K094K246J963J497R46R9j058k107k475j925
$$ 364044 365218 367079 368950 370544 372233 374327 376573 378536 380033 380979 381078 380020 377913 375438 373513
60404C73513p81K78Q11J030J331J608J443R88R60J546K054J977J755J955K293
$$ 373513 372732 373010 373821 374851 376182 377790 379233 380221 381181 382727 384781 386758 388513 390468 392761
60389C92761K172J737J695K275K972L217K847K061J310J045J271J590J892K569
$$ 392761 394933 396670 398365 400640 403612 406829 409676 411737 413047 414092 415363 416953 418845 421414
60375D21414L634M265L773K580J588J018O09M95R39J460J274N04K6R7R3l01n45
$$ 421414 425048 429313 433086 435666 437254 438272 438881 439376 440315 441775 443049 443553 443579 443676 443769 443468 442923
60358D42923k17L08N41N95Q55J450K378L653N001N858N997N766N438M716L256
$$ 442923 442706 443014 443555 444150 445005 446455 448833 452486 457487 463345 469342 475108 480546 485262 488518
60343D88518J350k91j255j703k039k500k992l262l256l151k982k474j596r58j194
$$ 488518 489868 489577 488322 486619 484580 482080 479088 475826 472570 469419 466437 463963 462367 461409 460215
60328D60215k054k684k716k489k293k050j787j685j514p06P08J873K187K088K386
$$ 460215 458161 455477 452761 450272 447979 445929 444142 442457 440943 440237 440945 442818 445005 447093 449479
60313D49479L308M588O120P998J0155J2395J4630J6884J9091K1007K2130K1779
$$ 449479 452787 457375 463495 471493 481648 494043 508673 525557 544648 565655 587785 609564
60301F09564J9587J6008J1909P588K595l296r354j4369j7509j8597j7980j6381
$$ 609564 629151 645159 657068 664656 667251 663955 654601 640232 622723 604126 586146 569765
60289E69765j4538j2800j1213r996r399r131q515p381o215n293m340l299k697
$$ 569765 555227 542427 531214 521218 511819 502688 494173 486792 480577 475284 470944 467645 464948
60276D64948k832l261l543l861m340m456l800k901k465k314j849j258j248j793
$$ 464948 462116 458855 455312 451451 447111 442655 438855 435954 433489 431175 429326 428068 426820 425027
60262D25027k078j717j216j003p66q6P89J204Q61P6n66p18m93k19M0M76J027J235
$$ 425027 422949 421232 420016 419013 418247 418161 418950 420154 421015 421091 420525 419807 419314 419095 419135 419611 420638 421873
60244D21873R24N41M72L64k79j104j236m16P57J721K404K812K823K565K460K694
$$ 421873 422797 423338 423810 424174 423895 422791 421555 421139 421896 423617 426021 428833 431656 434221 436681 439375
60228D39375L026L183L123K856K466K254K397K508K083J406J356K179L122L497
$$ 439375 442401 445584 448707 451563 454029 456283 458680 461188 463271 464677 466033 468212 471334 474831
60214D74831L464L466L563L702M061M605M887M812N021N834O293N221K958J203
$$ 474831 478295 481761 485324 489026 493087 497692 502579 507391 512412 518246 524539 529760 532718 533921
60200E33921J056K016K998L483L479L018K282J750J718J887J786J382R41M58l60
$$ 533921 534977 536993 539991 543474 546953 549971 552253 554003 555721 557608 559394 560776 561717 562175 561815
60185E61815j614k988m076m661m753m456l880l094k283j839k073k643k664j750
$$ 561815 560201 557213 553137 548476 543723 539267 535387 532293 530010 528171 526098 523455 520791 519041
60171E19041o71n39j453k430k655k203j506p63j46Kl15m38K26J349K064K027J629
$$ 519041 518370 517831 516378 513948 511293 509090 507584 506821 506675 506677 506362 505924 506150 507499 509563 511590 513219
60154E13219J268J004Q98J171J786K361K670K945L417L865L931L665L502L737
$$ 513219 514487 515491 516389 517560 519346 521707 524377 527322 530739 534604 538535 542200 545702 549439
60140E49439M273M873N462O054O478O339N415M071K999K410J789O72n67j179j072
$$ 549439 553712 558585 564047 570101 576579 582918 588333 592404 595403 597813 599602 600274 599707 598528 597456
60125E97456q80j008j178j085r19r09q55m88JK52L52O99J315J706J440O16k96
$$ 597456 596576 595568 594390 593305 592386 591477 590622 590134 590135 590387 590739 591438 592753 594459 595899 596515 596219
60108E96219q78j030r66r97j270j757k488l537m660n160m459k756r74lk8m85n86
$$ 596219 595341 594311 593345 592348 591078 589321 586833 583296 578636 573476 569017 566261 565287 565284 565256 564771 564185
60091E64185qQ75J523J963K727M000N152N415M732L694K763K085J809K091K583
$$ 564185 564177 565052 566575 568538 571265 575265 580417 585832 590564 594258 597021 599106 600915 603006 605589
60076F05589K412J031j044k679l310l508m197n533o748p123o861o742p120p549
$$ 605589 608001 609032 607988 605309 601999 598491 594294 588761 582013 574890 568029 561287 554167 546618
60062E46618p449o772n880n018m214l595l440l832m351m404l873l232k838k290
$$ 546618 539169 532397 526517 521499 517285 513690 510250 506418 502067 497663 493790 490558 487720 485430
60048D85430r10J103K620K949K761L071L829M265M289M494M828M419L021J668
$$ 485430 484520 485623 488243 491192 493953 497024 500853 505118 509407 513901 518729 523148 526169 527837
60034E27837J215J067J43j469k657k843k629k975m242n983p298p530o942o522
$$ 527837 529052 530119 530262 528793 526136 523293 520664 517689 513447 507464 500166 492636 485694 479172
60020D79172o837p397p426o831n988n134m466m359m744m737l676k229j582j776
$$ 479172 472335 464938 457512 450681 444693 439559 435093 430734 425990 421253 417577 415348 413766 411990
60006D11990j852j395q62l53O96K270L390L509L361L722M114L632K477J783K075
$$ 411990 410138 408743 407881 407528 408224 410494 413884 417393 420754 424476 428590 432222 434699 436482 438557
59991D38557K759L075K972K928L270L863M297M381M406M705N002M614L439K219
$$ 438557 441316 444391 447363 450291 453561 457424 461721 466102 470508 475213 480215 484829 488268 490487
59977D90487J599J366R82L62l02j029j809k250k086j775j906k236k046j332q75
$$ 490487 492086 493452 494434 494796 494494 493465 491656 489406 487320 485545 483639 481403 479357 478025 477150
59962D77150j093j557j835k028k212k030j306n72m08o41o11m4P23J139Q11k45
$$ 477150 476057 474500 472665 470637 468425 466395 465089 464517 464109 463468 462857 462813 463536 464675 465486 465241
59946D65241j347j544p13L9l76j636k471k272j526q04j48L29J27q85j970k287
$$ 465241 463894 462350 461637 461676 461300 459664 457193 454921 453395 452591 452443 452772 452899 452014 450044 447757
59930D47757j749q09J85J028J448J377J149J045R20O54N98J017J458J342R10R09
$$ 447757 446008 445199 445384 446412 447860 449237 450386 451431 452351 453005 453603 454620 456078 457420 458330 459239
59914D59239J494K131K493K660K498J701O01J51P25J647K158K275K295K141J745
$$ 459239 460733 462864 465357 468017 470515 472216 472817 472968 473693 475340 477498 479773 482068 484209 485954
59899D85954J520J880K611L238L658L917L743K898J829J304J478J808J944K148
$$ 485954 487474 489354 491965 495203 498861 502778 506521 509419 511248 512552 514030 515838 517782 519930
59885E19930K733L460L845L830L892M417N117N318M859M351M228L940K634N42
$$ 519930 522663 526123 529968 533798 537690 542107 547224 552542 557401 561752 565980 569920 572554 573096
59871E73096j155j908k435l474m621n051m759m475m590m820m732m150l203k324
$$ 573096 571941 570033 567598 564124 559503 554452 549693 545218 540628 535808 531076 526926 523723 521399
59857E21399j973k080k059j665j402j679k083j938j235m86m5m2n59j273j444q92
$$ 521399 519426 517346 515287 513622 512220 510541 508458 506520 505285 504799 504754 504712 504153 502880 501436 500544
59841E00544m64q54j477j457j123j366j904j539j22J089J260R83J032J302J427
$$ 500544 500080 499226 497749 496292 495169 493803 491899 490360 490238 491327 492587 493570 494602 495904 497331
59826D97331J528J684J484P41l6m60j036k355m039n138n273m826m239l666l198
$$ 497331 498859 500543 502027 502768 502732 502272 501236 498881 494842 489704 484431 479605 475366 471700 468502
59811D68502k914k721k404j903j376j129j405k046k426k048j175m72j38P9J29
$$ 468502 465588 462867 460463 458560 457184 456055 454650 452604 450178 448130 446955 446483 446345 446424 446553
59796D46553l01r39r93l70n2p52j949k755l092l373l649l766l876m007l600k299
$$ 446553 446252 445313 444320 443950 443898 443146 441197 438442 435350 431977 428328 424562 420686 416679 413079 410780
59780D10780q94n48j159j448p05L65P97N66L31N22J124J969K830L419L602L543
$$ 410780 409886 409338 408179 406731 406026 406391 407188 407754 408085 408607 409731 411700 414530 417949 421551 425094
59764D25094L400L101K633K375K782L681M240L829K770J989J980K430K837L141
$$ 425094 428494 431595 434228 436603 439385 443066 447306 451135 453905 455894 457874 460304 463141 466282
59750D66282L497L814L883L809L824L761L226K353J844K075K569K642K219J731
$$ 466282 469779 473593 477476 481285 485109 488870 492096 494449 496293 498368 500937 503579 505798 507529
59736E07529J417J130P16K93Q7J29J42j34m85k48R32K434L152K649J487M25k33
$$ 507529 508946 510076 510792 511085 511172 511301 511443 511309 510824 510576 511508 513942 517094 519743 521230 521655 521422
59719E21422m41j24N35J008J015R19J182J669J895J748J590J634J674J479J234
$$ 521422 520981 520857 521392 522400 523415 524334 525516 527185 529080 530828 532418 534052 535726 537205 538439
59704E38439J430K268L282L719L341K744K586K724K495J698P97J96j47k71k7L95
$$ 538439 539869 542137 545419 549138 552479 555223 557809 560533 563028 564726 565523 565719 565572 565301 565274 565669
59688E65669L27n17j465j616r39k44k45r28j730k040j701j203j234j923k772l396
$$ 565669 565996 565479 564014 562398 561459 561215 560970 560042 558312 556272 554571 553368 552134 550211 547439 544043
59672E44043l922m439m629m295l916m062m526m495l554k135j002n79o89p63l61
$$ 544043 540121 535682 531053 526758 522842 518780 514254 509759 506205 504070 503068 502489 501800 501037 500676
59657E00676M00J043J402J772K271K542K389K282K712L338L291K266Q01n00j599
$$ 500676 501076 502119 503521 505293 507564 510106 512495 514777 517489 520827 524118 526384 527185 526685 525086
59642E25086k735l824m419m286l861l926m627n094m396k837j717j780k419k675
$$ 525086 522351 518527 514108 509822 505961 502035 497408 492314 487918 485081 483364 481584 479165 476490
59628D76490k396k054j888j775j679j718j895k059k111k079k166k649l434l763
$$ 476490 474094 472040 470152 468377 466698 464980 463085 461026 458915 456836 454670 452021 448587 444824
59614D44824k938j394l37j52K0P54J378J193Q12J267K405L115K846J974R30r2
$$ 444824 441886 440492 440155 440003 440023 440777 442155 443348 444160 445427 447832 450947 453793 455767 456697 456605
59598D56605p57p74m42l13m15m44m99p83r10m06K36J15n86p50j22K26m01j305
$$ 456605 455848 455074 454632 454319 453904 453460 452961 452178 451268 450862 451098 451213 450627 449877 449755 449981 449580 448275
59580D48275j635j654k058k735l088l061l104l337l415l098k427j551o91j54P
$$ 448275 446640 444986 442928 440193 437105 434044 430940 427603 424188 421090 418663 417112 416421 416267 416274
59565D16274J60N50Q32N05l00q72p31p3N91J027J368J800K248K458K410K476K978
$$ 416274 416434 416984 417816 418321 418021 417149 416418 416345 416936 417963 419331 421131 423379 425837 428247 430723 433701
59548D33701L691M078L978L813M080M984O547Q666J0950J2898J4377J5561J6199
$$ 433701 437392 441470 445448 449261 453341 458325 464872 473538 484488 497386 511763 527324 543523
59535E43523J5364J2351P633K592j458l802m272l194j407K47J555K868M316N417
$$ 543523 558887 571238 578871 581463 580005 576203 571931 568737 567330 567577 569132 572000 576316 581733
59521E81733N616M940L839K548R20j079l064m669o082p799r849j1561j2173j1540
$$ 581733 587349 592289 596128 598676 599596 598517 595453 590784 584702 576903 567054 555493 543320 531780
59507E31780j0141q688p739p411p315o926o210n591n205m565l326k032j521j800
$$ 531780 521639 512951 505212 497801 490486 483560 477350 471759 466554 461989 458663 456631 455110 453310
59493D53310k023j620q30m2Q04J797K483K293J372N68N23J071J586J707J567J518
$$ 453310 451287 449667 448837 448795 449599 451396 453879 456172 457544 458112 458635 459706 461292 462999 464566 466084
59477D66084J836K578L507M144M149L689L165K638J849R78Q24J775K956L128K276
$$ 466084 467920 470498 474005 478149 482298 485987 489152 491790 493639 494617 495441 497216 500172 503300 505576
59462E05576J622K068L303M582N640O463O902P067P583Q878J0423J1170J0623
$$ 505576 507198 509266 512569 517151 522791 529254 536156 543223 550806 559684 570107 581277 591900
59449E91900R203P703O644N860M542J975j538m814p050q445r461j0058j0101r900
$$ 591900 601103 608806 615450 621310 625852 627827 626289 621475 614425 605980 596519 586461 576360 566460
59435E66460r764r495q814p890o855n378l300j251J28J197K725M701O531Q103
$$ 566460 556696 547201 538387 530497 523642 518264 514964 513713 513841 515038 517763 522464 528995 537098
59421E37098R784J1547J3098J4724J7017J9581K1046K0803J9900J9695J9996J8945
$$ 537098 546882 558429 571527 586251 603268 622849 643895 664698 684598 704293 724289 743234
59409G43234J4645O855k631j1109j6674j8966j8528j6048j2311q163l978K00L422
$$ 743234 757879 764734 762103 750994 734320 715354 696826 680778 668467 660304 656326 656526 659948
59396F59948L568o35p759j4841j9936k2638k2847k0733j7666j5454j4223j2519
$$ 659948 663516 662881 655122 640281 620345 597707 574860 554127 536461 521007 506784 494265
59384D94265r817p431o351n652m051j918n63l44n27n19k17M55J501K479K868K740
$$ 494265 484448 477017 470666 465014 460963 459045 458482 458138 457611 457092 456875 457330 458831 461310 464178 466918
59368D66918K596K738L167L822M495M755M424L943M001M899O491Q368R945J0720
$$ 466918 469514 472252 475419 479241 483736 488491 492915 496858 500859 505758 512249 520617 530562 541282
59354E41282J0824J1045J2047J3826J6000J8228K0089K1033K0892K0210J9751
$$ 541282 552106 563151 575198 589024 605024 623252 643341 664374 685266 705476 725227
59343G25227J9795J9948J9417J7463J4055J0132O787M105J246k233n736q471j0276
$$ 725227 745022 764970 784387 801850 815905 826037 832824 836929 838175 835942 830206 821735 811459
59330H11459j1466j2352j3255j4371j5385j5661j5072j4149j3267j2284j1179
$$ 811459 799993 787641 774386 760015 744630 728969 713897 699748 686481 674197 663018
59319F63018j0354r876r149p771o205n097m470m003l600l203k617j969j903k751
$$ 663018 652664 642788 633639 625868 619663 614566 610096 606093 602493 599290 596673 594704 592801 590050
59305E90050l944m713m946m939m715m188l579l131k722k180j679j346r04j94L34
$$ 590050 586106 581393 576447 571508 566793 562605 559026 555895 553173 550993 549314 547968 547064 546870 547204
59290E47204K50r0O4R06K027L104M173N312O423P266P510P032O341O289P157Q384
$$ 547204 547454 547364 547428 548334 550361 553465 557638 562950 569373 576639 584149 591181 597522 603811 610968 619352
59274F19352R511J0794J2427J3760J3940J2982J1607J0214Q623O691M626K647
$$ 619352 628863 639657 652084 665844 679784 692766 704373 714587 723210 729901 734527 737174
59262G37174P36j245l316n264o789p924r178j0822j2189j2346j1453j0643j0392
$$ 737174 737910 736665 733349 728085 721296 713372 704194 693372 681183 668837 657384 646741 636349
59249F36349r921q583o899n674m885m108l292k392r20J299L497M824N327N407
$$ 636349 626428 617845 610946 605272 600387 596279 592987 590595 589675 590974 594471 599295 604622 610029
59235F10029M922L728K490J933J662P48q22k299l547n146p126q697r386r654j0091
$$ 610029 614951 618679 621169 623102 624764 625512 624690 622391 618844 613698 606572 597875 588489 578835 568744
59220E68744j0658j0949j0671r787q507p265o382n806n372n048m628l633k002
$$ 568744 558086 547137 536466 526679 518172 510907 504525 498719 493347 488299 483671 480038 478036
59207D78036m67L02N20O53N40p6n57K8J497K761L361L853M585N099M990M583M419
$$ 478036 477569 477871 478391 479044 479584 479508 478951 478979 480476 483237 486598 490451 495036 500135 505125 509708 514127
59190E14127M638N145N857O528O777O523O083N727N454N237N117N053N014N211
$$ 514127 518765 523910 529767 536295 543072 549595 555678 561405 566859 572096 577213 582266 587280 592491
59176E92491N856O681P100O866O296N884N973O635P606Q324Q420Q064P673P360
$$ 592491 598347 605028 612128 618994 625290 631174 637147 643782 651388 659712 668132 676196 683869 691229
59162F91229O942O209M988L190J079q31k407m061o025p886r183j0003j0577j0828
$$ 691229 698171 704380 709368 712558 713637 712806 710399 706338 700313 692427 683244 673241 662664 651836
59148F51836j0691j0377r904q966p701o827o502n874m552l478l445l610k801j499
$$ 651836 641145 630768 620864 611898 604197 597370 590868 584994 580442 576964 573519 569909 567108 565609
59134E65609j028j323j173l66J39J16M44J352J923J863K255L913O143P877Q999
$$ 565609 564581 563258 562085 561719 561858 561974 562418 563770 565693 567556 569811 573724 579867 587744 596743
59119E96743R831J0260J0252J0419J1238J2198J2479J2149J1990J2374J2855J2803
$$ 596743 606574 616834 627086 637505 648743 660941 673420 685569 697559 709933 722788 735591
59107G35591J2039J0875R747Q838Q037P253O457N406L727J634M2o21j161k497
$$ 735591 747630 758505 768252 777090 785127 792380 798837 804243 807970 809604 809646 809025 807864 805367
59093H05367m223n168n019m417l788l152k923l661m923n535n258n194o235q042
$$ 805367 801144 795976 790957 786540 782752 779600 776677 773016 768093 762558 757300 752106 745871 737829
59079G37829r783j1046j1786j2103j2302j2516j2246j1052r536q694q419p807
$$ 737829 728046 717000 705214 693111 680809 668293 656047 644995 635459 626765 618346 610539
59067F10539o834o377o458o049m945m282m562m732m042l402l758m366m014l022
$$ 610539 603705 597328 590870 584821 579876 575594 571032 566300 562258 558856 555098 550732 546718 543696
59053E43696k641l060l367l109k717k432j915r66O0P16Q90P99P83J014J270J304
$$ 543696 541055 537995 534628 531519 528802 526370 524455 523489 523549 524265 525155 525954 526737 527751 529021 530325
59037E30325J407K099L129L540K969K137J757J715J832K478L894N576P063Q654
$$ 530325 531732 533831 536960 540500 543469 545606 547363 549078 550910 553388 557282 562858 569921 578575
59023E78575J0642J2488J3543J3987J4296J4237J3241J1448R580P988O423M601
$$ 578575 589217 601705 615248 629235 643531 657768 671009 682457 692037 700025 706448 711049
59011G11049K418m3k311l595l622l050k583k060r60O13K052L089L966M923N961
$$ 711049 713467 713424 711113 707518 703896 700846 698263 696203 695243 695856 697908 700997 704963 709886 715847
58996G15847O900P311O679N037L123J645O55q4o64j334k612m644o808q432r429
$$ 715847 722747 730058 736737 741774 744897 746542 747197 747113 746449 745115 742503 737859 731051 722619 713190
58981G13190r865r539q525p500o926o317m981k980q32J226L073M314M843N354
$$ 713190 703325 693786 685261 677761 670835 664518 659537 656557 655725 656951 660024 664338 669181 674535
58967F74535O517P989Q958R389R948J0944J1962J2453J2072J0666Q465O093L951
$$ 674535 681052 689041 697999 707388 717336 728280 740242 752695 764767 775433 783898 789991 793942
58954G93942J815o38l350o294r674j3094j5293j5581j5012j5071j5609j5184j3234
$$ 793942 795757 795119 791769 785475 775801 762707 747414 731833 716821 701750 686141 670957 657723
58941F57723j0758q845p570o567n768n257m997m910m851m505l738k957k579k354
$$ 657723 646965 638120 630550 623983 618215 612958 607961 603051 598200 593695 589957 587000 584421 582067
58927E82067j867j487j962l129l878l550k636j860j361j072j194j754k196j841
$$ 582067 580200 578713 576751 573622 569744 566194 563558 561698 560337 559265 558071 556317 554121 552280
58913E52280o36Q97K194K971L221L208L362L979N008O120P007P719Q664J0092
$$ 552280 551644 552541 554735 557706 560927 564135 567497 571476 576484 582604 589611 597330 605994 616086
58899F16086J1511J1994J1279J0221R847J0286J0968J1579J2368J3742J5924J8877
$$ 616086 627597 639591 650870 661091 670938 681224 692192 703771 716139 729881 745805 764682
58887G64682K2028K4322K5029K4447K3451K2415K0923J8412J4724J0118N207P31
$$ 764682 786710 811032 836061 860508 883959 906374 927297 945709 960433 970551 975758 976489
58875I76489k993o400j0133j4169j7764k0179k1209k1128k0400j9411j8196j6519
$$ 976489 973496 967096 956963 942794 925030 904851 883642 862514 842114 822703 804507 787988
58863G87988j4408j2420j1160j0674j0514j0241r643q793q139q267r301j0613
$$ 787988 773580 761160 750000 739326 728812 718571 708928 700135 691996 683729 674428 663815
58851F63815j1382j1232j0231q679p160o334o295o407o142n706n499n368m960
$$ 663815 652433 641201 630970 622291 615131 608797 602502 596095 589953 584247 578748 573380 568420
58838E68420m438m283m485m527m093l477l242l734m709n319m782l280j884j301
$$ 568420 563982 559699 555214 550687 546594 543117 539875 536141 531432 526113 521331 518051 516167 514866
58824E14866j139o81P9O78R97J290J661K048K484K947L139K864K460K392K667
$$ 514866 513727 513046 513125 513803 514800 516090 517751 519799 522283 525230 528369 531233 533693 536085 538752
58809E38752K948L019K808K202J245L14k31m55o16q18j053j291j367j187j059
$$ 538752 541700 544719 547527 549729 550974 551288 551057 550602 549986 549168 548115 546824 545457 544270 543211
58794E43211j390j918j959j552j547k222k675k044n32J235L025M535N097M677
$$ 543211 541821 539903 537944 536392 534845 532623 529948 527904 527372 528607 531632 536167 541264 545941
58780E45941M376M995N813N712M881M317M186L761K637J018q82k835m321n164
$$ 545941 550317 555312 561125 566837 571718 576035 580221 583982 586619 587637 586755 583920 579599 574435
58766E74435n996p241q076p472n865m676m398m234l515k420j344n14j27r0K48
$$ 574435 568439 561198 553122 545650 539785 535109 530711 526477 522962 520542 519198 518684 518557 518467 518715
58751E18715J269K257K303J726J603K130K580K724L129M017M911N596O429P494
$$ 518715 519984 522241 524544 526270 527873 530003 532583 535307 538436 542453 547364 552960 559389 566883
58737E66883Q357Q772Q940Q951Q756Q621Q837R057Q669P853P318P080O361M819
$$ 566883 575240 584012 592952 601903 610659 619280 628117 637174 645843 653696 661014 668094 674455 679274
58723F79274L013J550N19j61n37q13j034o87O72K512L763M110M021L743L119K264
$$ 679274 682287 683837 684356 684195 683658 682845 681811 681124 681796 684308 688071 692181 696202 699945 703064 705328
58707G05328J521P96j97j272k253l792o534r695j1733j2451j3108j4328j5318
$$ 705328 706849 707645 707448 706176 703923 700131 693597 683902 672169 659718 646610 632282 616964
58694F16964j5376j4877j4252j3253j1755j0294r162p928o430n371n268n549n348
$$ 616964 601588 586711 572459 559206 547451 537157 527995 520067 513637 508266 502998 497449 492101
58681D92101m693m299m565n199n510m928l525k158j638j744j550n41J099L153
$$ 492101 487408 483109 478544 473345 467835 462907 459382 457224 455586 453842 452292 451751 452850 456003
58667D56003N485P585Q827R290R653J0204J0594J0473R675P906N093J957o07k530
$$ 456003 461488 469073 477900 487190 496843 507047 517641 528114 537789 545695 550788 552745 552138 549608
58653E49608m206n408n629n209n032n168n075m913n329n930n497l932k497j776
$$ 549608 545402 539994 534365 529156 524124 518956 513881 508968 503639 497709 492212 488280 485783 484007
58639D84007r45M55J462J231M41L07J007J837K228J953J091K11m4J24j80j160
$$ 484007 483062 483517 484979 486210 486651 486958 487965 489802 492030 493983 495074 495285 495241 495365 495185 494025
58623D94025j958j837r23M42K108L651M495M884N718P137Q275Q717R069R665R814
$$ 494025 492067 490230 489307 489749 491857 495508 500003 504887 510605 517742 526017 534734 543803 553468 563282
58608E63282Q901P222N225K921N27j256k222k996l898m363m044l618l828m531
$$ 563282 572183 579405 584630 587551 588078 586822 584600 581604 577706 573343 569299 565681 561853 557322
58594E57322n112n177m469k988j462p22l43J050L754O468Q143R176J0231J1136
$$ 557322 552210 547033 542564 539576 538114 537392 537049 538099 541853 548321 556464 565640 575871 587007
58580E87007J1626J1979J2146J1401R622P901P046O509N617M794M676M985N325
$$ 587007 598633 610612 622758 634159 643781 651682 658728 665237 670854 675648 680324 685309 690634
58567F90634O164Q040J0487J2730J4817J7172J9626K1654K2997K3441K2604K0532
$$ 690634 696798 704838 715325 728055 742872 760044 779670 801324 824321 847762 870366 890898
58555H90898J7910J5078J1664P692M177J862K42j426k985m043n010o500q329r993
$$ 890898 908808 923886 935550 943242 947419 949281 949523 948097 945112 941069 936059 929559 921230 911237
58541I11237j1576j3430j5393j7021j8249j9280k0154k0765k0846j9907j7753
$$ 911237 899661 886231 870838 853817 835568 816288 796134 775369 754523 734616 716863
58530G16863j5185j3231j1729r709p237n500m750l776j959l39J56J64N80J190
$$ 716863 701678 688447 676718 667009 659772 654272 649522 645746 643787 643448 643604 643768 644348 645538
58516F45538J539J985K756L132K661K112K184K254J575P03N19P37N41m1n64j173
$$ 645538 647077 649062 651818 654950 657611 659723 661907 664161 665736 666439 666958 667695 668236 668195 667631 666458
58500F66458k072k689k529k206k589l544m429n155n775n735m620l096k055j330
$$ 666458 664386 661697 659168 656962 654373 650829 646400 641245 635470 629735 625115 622019 619964 618634
58486F18634j32J690L640N301O475P091P626Q917J0998J2788J3507J3561J3440
$$ 618634 618502 620192 623832 629133 635608 642699 650325 659242 670240 683028 696535 710096 723536
58473G23536J2655J0439O828K459j874n136o564o771p257q376q914q096o586n059
$$ 723536 736191 746630 753458 755917 754043 748907 742343 735572 728315 719939 711025 702929 696343 691284
58459F91284l277j250K81J292K827N046O654P069P382Q097P881N838L100P26j999
$$ 691284 688007 686757 687038 688330 691157 696203 702857 709926 717308 725405 733286 739124 742224 742950 740951
58444G40951n455p890p804o555o317o742n939l670j414J1R21J527K006L097M992
$$ 740951 735496 727606 719802 713247 706930 700188 694249 690579 689165 689176 690097 691624 693630 696727 701719
58429G01719O457O596O569P868R951J1315J1968J2810J3474J2782J0846Q864P130
$$ 701719 708176 714772 721341 729209 739160 750475 762443 775253 788727 801509 812355 821219 828349
58416H28349M932K065r49l703n847o841o910p286q453r220q734q062q282q507
$$ 828349 833281 835346 834397 830694 824847 818006 811096 803810 795357 786137 777403 769341 761059 752552
58402G52552p464n754m645l832k291k96J328K888M896O503O680N973N349M431
$$ 752552 745088 739334 734689 730857 728566 728270 729598 732486 737382 743885 750565 756538 761887 766318
58388G66318K643Q26j44j045k658l810l227k001j939k657k602j816j387j180m24
$$ 766318 768961 769787 769643 768598 765940 762130 758903 756902 754963 752306 749704 747888 746501 745321 744897
58373G44897N26J103K076L992N476N360N017O160P824Q257Q220R442J1234J1840
$$ 744897 745423 746526 748602 752594 758070 763430 768447 774607 782431 790688 798908 808350 819584 831424
58359H31424J1912J3201J4859J4454J2049R896Q643P068N084L852L269K414K026
$$ 831424 843336 856537 871396 885850 897899 907795 916438 923506 928590 932442 935711 938125 940151
58346I40151L539O006P069O656O766P997R176J0083J1540J3191J3979J4491J6023
$$ 940151 943690 949696 956765 963421 970187 978184 987360 997443 1008983 1022174 1036153 1050644 1066667
58333A066667J7860J8146J6870J5287J3357J0551Q107P383P050N029K081K40q55
$$ 1066667 1084527 1102673 1119543 1134830 1148187 1158738 1166845 1174228 1181278 1186307 1188388 1188628 1187773
58320A187773k490l388j717Q18J288O91K171N148O199N138N164P202R083J0224
$$ 1187773 1185283 1181895 1180178 1180996 1182284 1182975 1185146 1190294 1196493 1201631 1206795 1213997 1223080 1233304
58306A233304J2174J4484J4986J4405J5698J8548J9444J7704J6429J6917J7065
$$ 1233304 1245478 1259962 1274948 1289353 1305051 1323599 1343043 1360747 1377176 1394093 1411158
58295A411158J6035J5605J6101J5691J4564J5096J7112J7710J6541J6466J8181
$$ 1411158 1427193 1442798 1458899 1474590 1489154 1504250 1521362 1539072 1555613 1572079 1590260
58284A590260J9164J8802J9494K1686K2822K2384K2970K5178K6329K5513K5029
$$ 1590260 1609424 1628226 1647720 1669406 1692228 1714612 1737582 1762760 1789089 1814602 1839631
58273A839631K5740K5783K4913K5317K7262K8788L0252L4037L9307M2678M4533
$$ 1839631 1865371 1891154 1916067 1941384 1968646 1997434 2027686 2061723 2101030 2143708 2188241
58262B188241M8707N5280N9968O1561O3359O6256O7171O5702O5457O7135O7181
$$ 2188241 2236948 2292228 2352196 2413757 2477116 2543372 2610543 2676245 2741702 2808837 2876018
58251B876018O5001O4641O7452P0092P1546P4985Q0891Q5616Q8667R3893J01612
$$ 2876018 2941019 3005660 3073112 3143204 3214750 3289735 3370626 3456242 3544909 3638802 3740414
58240C740414J07525J11244J17576J27345J35669J41586J50224J62759J73752
$$ 3740414 3847939 3959183 4076759 4204104 4339773 4481359 4631583 4794342 4968094
58231D968094J81377J90710K03752K16147K27055K41917K61930K81450K99493
$$ 4968094 5149471 5340181 5543933 5760080 5987135 6229052 6490982 6772432 7071925
58222G071925L22515L52045L81469M09372M43462M86613N32100N77629O30434
$$ 7071925 7394440 7746485 8127954 8537326 8980788 9467401 9999501 10577130 11207564
58213A1207564O93304P60355Q32236R19887J027340J147814J283370J449979J656442
$$ 11207564 11900868 12661223 13493459 14413346 15440686 16588500 17871870 19321849 20978291
58204B0978291J899342K187059K546299K996431L544985M221205N085180O188591
$$ 20978291 22877633 25064692 27610991 30607422 34152407 38373612 43458792 49647383
58196D9647383P555885R213663J1188570J3443444J5859977J8326513K0805714
$$ 49647383 57203268 66416931 77605501 91048945 106908922 125235435 146041149
58189A46041149K3277791K5661415K7804573K9401404K9745197K7661828K2057802
$$ 146041149 169318940 194980355 222784928 252186332 281931529 309593357 331651159
58182C31651159J2849773J401890j0049723j9501576k5911132k9202141k9886572
$$ 331651159 344500932 345902822 335853099 316351523 290440391 261238250 231351678
58175B31351678k8707432k6400859k3548304k0540086j7632079j4993967j2705108
$$ 231351678 202644246 176243387 152695083 132154997 114522918 99528951 86823843
58168H6823843j0761371r126227p768339o651530n724940m944685m288083l736113
$$ 86823843 76062472 66936245 59167906 52516376 46791436 41846751 37558668 33822555
58160C3822555l261509k845035k485484k182283j922960j696259j502168j339931
$$ 33822555 30561046 27716011 25230527 23048244 21125284 19429025 17926857 16586926
58152A6586926j199767j074787r68317q81707q06800p37542o77423o28482n84154
$$ 16586926 15387159 14312372 13344055 12462348 11655548 10918006 10240583 9612101 9027947
58143I027947n39755m99427m66011m34077l99548l66626l38943l12844k85591
$$ 9027947 8488192 7988765 7522754 7088677 6689129 6322503 5983560 5670716 5385125
58134E385125k61361k42999k26119k07403j90735j79288j69189j56905j45621
$$ 5385125 5123764 4880765 4654646 4447243 4256508 4077220 3908031 3751126 3605505
58125C605505j38436j32157j23500j15021j09305j03528r5214q7542q3519q0399
$$ 3605505 3467069 3334912 3211412 3096391 2987086 2883558 2788344 2700802 2617283 2536884
58115B536884p4959o9097o5327o1867n6903n2809n1515n0493m7658m5555m6403
$$ 2536884 2461925 2392828 2327501 2265634 2208731 2155922 2104407 2053914 2006256 1960701 1914298
58104A914298m7710m7126m6925m9285n1542n0661m8272m7006m5812m3055m0348
$$ 1914298 1866588 1819462 1772537 1723252 1671710 1621049 1572777 1525771 1479959 1436904 1396556
58093A396556l9156l7321l3024k8647k6796k5936k3709k1120j9793j8465j5973
$$ 1396556 1357400 1320079 1287055 1258408 1231612 1205676 1181967 1160847 1141054 1122589 1106616
58082A106616j4359j5336j6917j6958j6794j7949j8658j7369j6232j7314j8574
$$ 1106616 1092257 1076921 1060004 1043046 1026252 1008303 989645 972276 956044 938730 920156
58071I20156j7447j5414j5035j5368j4348j3000j3242j3891j2840j1102j0842
$$ 920156 902709 887295 872260 856892 842544 829544 816302 802411 789571 778469 767627
58060G67627j1295j0429q876q625r335r276q611q623r067r051r104r804r912q352
$$ 767627 756332 745903 737027 728402 719067 709791 701180 692557 683490 674439 665335 655531 645619 637267
58046F37267o406n559n119m196m011n654p636q180q042q482q602p279n716n386
$$ 637267 630861 625302 620183 615987 611976 606322 598686 590506 582464 573982 565380 558101 552385 546999
58032E46999n384m474l768m638n979o248o288p383q383p683o219n703n677n067
$$ 546999 541615 537141 533373 528735 522756 516508 510220 502837 494454 486771 480552 474849 469172 464105
58018D64105m761n694o278m861k990l080m350m354l107k398k208j181K59M71l63
$$ 464105 459344 453650 447372 442511 439521 436441 432091 427737 424630 422232 420024 418843 419102 419573 419210
58003D19210o94l95m62o53p2N89J5j266j724j364j052m46J016K075J280k56l94
$$ 419210 418516 418121 417659 417006 416934 417523 417538 416272 414548 413184 412132 411686 412702 414777 416057 415801 415407
57986D15407O09R13M58P08J599J596M76n24j050j700k171j682r44j301k257k165
$$ 415407 416016 416929 417387 418095 419694 421290 421766 421242 420192 418492 416321 414639 413695 412394 410137 407972
57970D07972j028l15k45L30J468J882J240O49O81P85P70J141J895K438K636K691
$$ 407972 406944 406629 406384 406714 408182 410064 411304 411953 412634 413419 414189 415330 417225 419663 422299 424990
57954D24990K259R71n53j533k200k988l368k845k246k416k664k052j133p34j73
$$ 424990 427249 428220 427667 426134 423934 420946 417578 414733 412487 410071 407407 405355 404222 403488 403315
57939D03315J435L230M033M560O015P575P702P026P399Q697R101Q089O639M903
$$ 403315 404750 407980 412013 416573 422588 430163 437865 444891 452290 460987 470088 478177 484816 489719
57925D89719K132j244l872n626p409r027r481r155r350r843r202p533o599o944
$$ 489719 491851 490607 486735 481109 473700 464673 455192 446037 436687 426844 417642 410109 403510 396566
57911C96566p104n970m100k365j020l40m91p57l34J90l41j629k386k454k709l217
$$ 396566 389462 383492 379392 377027 376007 375667 375176 374419 374085 374275 373934 372305 369919 367465 364756 361539
57895C61539l252k867k651k324j433q97j778k988k536p63R1o55j473j473j457
$$ 361539 358287 355420 352769 350445 349012 348115 346337 343349 340813 340050 340141 339486 338013 336540 335083
57880C35083j839j914j635j956k954l568l621m076m983n146m234l317k917k417
$$ 335083 333244 331330 329695 327739 324785 321217 317596 313520 308537 303391 299157 295840 292923 290506
57866B90506j756j703k094j732m92L39L12M48J249J992K505L607N245O123N879
$$ 290506 288750 287047 284953 283221 282729 283068 283380 283828 285077 287069 289574 293181 298426 304549 310428
57851C10428N704O093N923M654L517L504L814L305K034N21j096k422k716k204
$$ 310428 316132 322225 328148 332802 336319 339823 343637 346942 348976 349497 348401 345979 343263 341059
57837C41059k068k511k326j071j6q0m07L9Q98J448J931K732L399L466L316L317
$$ 341059 338991 336480 334154 333083 333067 332987 332580 332619 333517 334965 336896 339628 343027 346493 349809 353126
57821C53126K987J860L00j104k201k911l154l460m568o133o941o736o559o929
$$ 353126 356113 357973 358273 357169 354968 352057 348903 345443 340875 334742 327801 321065 314506 307577
57807C07577p103o589n956n578m973m010l477l679l759l014j828o72N25J504J486
$$ 307577 300474 293885 287929 282351 277378 273368 269891 266212 262453 259439 257611 256939 257464 258968 260454
57792B60454N17k25n5M53Q11J344K117K526K609L281M613N391N135M992N673O163
$$ 260454 260971 260746 260691 261144 261955 263299 265416 267942 270551 273832 278445 283836 288971 293963 299636 305799
57776C05799N573M735M710N010M657L809L000J862l0j896k786l093l840n061o083
$$ 305799 311372 316107 320817 325827 330484 334293 337293 339155 339125 337229 334443 331350 327510 322449 316366
57761C16366o849p770q731r215r092q548p666o664n979n601n007m110l480l159
$$ 316366 309517 301747 293016 283801 274709 266161 258495 251831 245852 240251 235244 231134 227654 224495
57747B24495k358q76K65L47Nk6j10p37j460j742j905k167j856o36L78P5r14j200
$$ 224495 222137 221261 221526 221873 221878 221852 221742 221005 219545 217803 215898 213731 211875 211239 211617 211692 210778 209578
57729B09578o62k78m14o23p14q64q55k64O94J304J248P37N4m85n08l1M35O20P88
$$ 209578 208916 208638 208224 207601 206887 206023 205168 204904 205598 206902 208150 208887 208941 208456 207948 207917 208352 208972 209760
57710B09760J005Q01O1n77p03o54n68J13J475K507K518K231K496K836K380J468
$$ 209760 210765 211566 211627 211050 210347 209693 209125 209238 210713 213220 215738 217969 220465 223301 225681 227149
57694B27149J062J110P56k58j422k360k945k797j678j77P96J086J292J982L400
$$ 227149 228211 229321 230077 229819 228397 226037 223092 220295 218617 218440 219236 220322 221614 223596 226996
57679B26996N531P943J0063J2072J4967J9208K4088K8973L4299M0555M7163N3348
$$ 226996 232527 240470 250533 262605 277572 296780 320868 349841 384140 424695 471858 525206
57667E25206N9153O4304O6499O2122M8891K7536J555k3986m4289n7011o2844o3689
$$ 525206 584359 648663 715162 777284 826175 853711 855266 831280 786991 729980 667136 603447
57655F03447o0770n4928m7678m0667l4490k8934k3998j9828j6130j2643r844q299
$$ 603447 542677 487749 440071 399404 364914 335980 311982 292154 276024 263381 253537 245238
57643B45238p666p088o238n276m247l234k642k520k160j085N4L65j01p82j561
$$ 245238 237572 230484 224246 218970 214723 211489 208847 206327 204167 203082 203136 203501 203400 202618 201057
57628B01057k404k746k281j755j934k343k109j500j424j849j960j561j147q63
$$ 201057 198653 195907 193626 191871 189937 187594 185485 183985 182561 180712 178752 177191 176044 175181
57614A75181n11l34o62j006o19K20N47J73k70n53r86j433j345p55k88j09J51M90
$$ 175181 174670 174336 173674 172668 172049 172269 172816 172989 172719 172166 171180 169747 168402 167647 167359 167250 167401 167891
57596A67891M77Q1k95o09j104j590j643j405j256r21Q9J245J377M04m64l80K11
$$ 167891 168368 168449 168154 167545 166441 164851 163208 161803 160547 159626 159715 160960 162337 162741 162277 161897 162108
57579A62108N81O96Q08Q39N92N2p02j533k123k271k230k288k217j722j184j209
$$ 162108 162689 163385 164193 165032 165624 165676 164974 163441 161318 159047 156817 154529 152312 150590 149406 148197
57563A48197j676j985k032k050j743n92R76J827J635J295J564K126K316K036J613
$$ 148197 146521 144536 142504 140454 138711 138119 139095 140922 142557 143852 145416 147542 149858 151894 153507
57548A53507J286J183J347J598J613J246N64l08j052j157n39J18R8n06j150j648
$$ 153507 154793 155976 157323 158921 160534 161780 162344 162036 160984 159827 159288 159406 159504 158998 157848 156200
57532A56200j998j883j153m45m90r98j115p27m15l81l41k99m48m25L14J373J772
$$ 156200 154202 152319 151166 150721 150231 149233 148118 147391 146976 146595 146254 145955 145507 145082 145396 146769 148541
57515A48541J381J042J100R64L60j1M17J162J417J070N93L25K89L66L78K01j12
$$ 148541 149922 150964 152064 153028 153388 153377 153794 154956 156373 157443 158036 158361 158650 159016 159394 159595 159483
57498A59483n31j139j802k021j564r44p28o86l01K57M15K20K41N78Q24Q55Q67
$$ 159483 158952 157813 156011 153990 152426 151482 150754 150068 149767 150024 150439 150659 150900 151478 152302 153157 154024
57481A54024P41K23l90m81n4L72N85O24J93r22j976j931j008m65p91j212j193
$$ 154024 154765 154988 154598 154117 154063 154435 155020 155644 155837 154915 152939 151008 150000 149535 148744 147532 146339
57464A46339j245j786k219j772o07N29J248J692K070K277J931P75p17j484r99
$$ 146339 145094 143308 141089 139317 138710 139239 140487 142179 144249 146526 148457 149232 148515 147031 146032
57449A46032P1P83J089J375J479J075N54N43P88O25K17J62K44j27n36j00P94Q40
$$ 146032 146103 146886 147975 149350 150829 151904 152458 153001 153789 154414 154631 154793 155037 154910 154374 154274 155068 155908
57431A55908M8j55P07J401J129P61J095J407Q38Mm6M68N63J17j86j30k29q29j587
$$ 155908 155956 155801 156508 157909 159038 159799 160894 162301 163139 163143 163097 163565 164128 164245 164059 163929 163700 162871 161284
57412A61284j882j373l11N95Q74Q83J188J536J134jq50q12m29l59m40j81M43J096
$$ 161284 159402 158029 157718 158313 159187 160070 161258 162794 163928 163927 163077 162265 161836 161477 161037 160856 161299 162395
57394A62395J491J422Q64J88k05m21o52m48P01K180K767K365K064K342K434J776
$$ 162395 163886 165308 166172 166360 166155 165734 165082 164634 165335 167515 170282 172647 174711 177053 179487 181263
57378A81263Q92L85J52P7L80Q58P70%o63p99q49r02l22Q70J481Q19j95m63j71
$$ 181263 182155 182540 182692 182769 183149 184007 184777 184777 184114 183315 182466 181564 181242 182112 183593 184412 184217 183754 183583
57359A83583RJ53N76R84J088J209J465J203J39q21p92j24M48R72J630J840J226
$$ 183583 183592 183745 184321 185305 186393 187602 189067 190270 190409 189588 188796 188672 189120 190092 191722 193562 194788
57342A94788O21Q57J296Q51j6J36J515K752K711J545M6j040j069JJ127J031l23
$$ 194788 195409 196266 197562 198413 198397 198533 200048 202800 205511 207056 207102 206062 204993 204994 206121 207152 206829
57325B06829j715k117j548o22P3K16l9j38J87N11M48L47O41R05M78k33o8J142
$$ 206829 205114 202997 201449 200827 200900 201116 201077 200939 201126 201637 202085 202432 203073 203978 204456 204223 204155 205297
57307B05297K094J678M82K2P88J667J414K73l48K90J400J894J836J951K260K199
$$ 205297 207391 209069 209551 209573 210361 212028 213442 213715 213367 213657 215057 216951 218787 220738 222998 225197
57291B25197J791J672J937K106K252K932L788L563K029O62O98J613K176K021J490
$$ 225197 226988 228660 230597 232703 234955 237887 241675 245238 247267 247929 248627 250240 252416 254437 255927
57276B55927Q58M84Q45J728K203J968J824K248K664K762L223M183M369K994J340
$$ 255927 256785 257269 258114 259842 262045 264013 265837 268085 270749 273511 276734 280917 285286 288280 289620
57261B89620J085K027K917L578M591N594N602M705L964L835L994M344M973N423
$$ 289620 290705 292732 295649 299227 303818 309412 315014 319719 323683 327518 331512 335856 340829 346252
57247C46252N270N108N774O909P555P836Q670J0022J0898J1014J1196J1985J3036
$$ 346252 351522 356630 362404 369313 376868 384704 393374 403396 414294 425308 436504 448489 461525
57234D61525J4103J5549J7583J9845K1852K3302K4022K4210K4512K5219K5781
$$ 461525 475628 491177 508760 528605 550457 573759 597781 621991 646503 671722 697503
57223F97503K5789K5874K6684K7702K8047K7996K8489K9593L0682L1733L3056
$$ 697503 723292 749166 775850 803552 831599 859595 888084 917677 948359 980092 1013148
57212A013148L4130L4130L3427L3182L3496L3365L2399L1263L0309K9088K7339
$$ 1013148 1047278 1081408 1114835 1148017 1181513 1214878 1247277 1278540 1308849 1337937 1365276
57201A365276K5383K3454K1713K0723K0788K0963J9992J8192J6943J6488J5751
$$ 1365276 1390659 1414113 1435826 1456549 1477337 1498300 1518292 1536484 1553427 1569915 1585666
57190A585666J4454J3751J4261J4972J4767J3914J3391J3654J4516J5573J6421
$$ 1585666 1600120 1613871 1628132 1643104 1657871 1671785 1685176 1698830 1713346 1728919 1745340
57179A745340J7053J8015J9499K0636K0776K0935K2602K5398K7680K9230L1446
$$ 1745340 1762393 1780408 1799907 1820543 1841319 1862254 1884856 1910254 1937934 1967164 1998610
57168A998610L4646L7284L8358L8656L8802L7959L5626L3078L1655L0901K9734
$$ 1998610 2033256 2070540 2108898 2147554 2186356 2224315 2259941 2293019 2324674 2355575 2385309
57157B385309K8304K7371K6777K5866K4817K4287K4224K3995K3354K2462K1334
$$ 2385309 2413613 2440984 2467761 2493627 2518444 2542731 2566955 2590950 2614304 2636766 2658100
57146B658100J9961J8634J7617J6936J6882J7909J9480J9936J8304J5539J3204
$$ 2658100 2678061 2696695 2714312 2731248 2748130 2766039 2785519 2805455 2823759 2839298 2852502
57135B852502J1500R529O934M309K214O05q24k262l621m369l736j358K455P182
$$ 2852502 2864002 2873531 2880465 2884774 2886988 2887593 2886769 2884507 2880886 2876517 2872781 2871423 2873878 2881060
57121B881060J2486J8102K3843K9784L5910M1607M6302N0656N6294O4207P4321
$$ 2881060 2893546 2911648 2935491 2965275 3001185 3042792 3089094 3139750 3196044 3260251 3334572
57110C334572Q6630J01579J18982J37861J58077J81139K08824K41871K80808L27286
$$ 3334572 3421202 3522781 3641763 3779624 3937701 4118840 4327664 4569535 4850343 5177629
57100E177629L83916M53537N39284O44840P74040R30536J117516J336090J582634
$$ 5177629 5561545 6015082 6554366 7199206 7973246 8903782 10021298 11357388 12940022
57091A2940022J847748K117798K377103K610087K804590K954729L058762L112425
$$ 12940022 14787770 16905568 19282671 21892758 24697348 27652077 30710839 33823264
57083C3823264L105296L024945K863510K618915K291004J879489J387594Q29161
$$ 33823264 36928560 39953505 42817015 45435930 47726934 49606423 50994017 51823178
57075E1823178K33797l56220r00014j375565j785145k141681k448750k693612
$$ 51823178 52056975 51700755 50800741 49425176 47640031 45498350 43049600 40355988
57067D0355988k857426k929380k912125k818571k666785k476360k265840k050834
$$ 40355988 37498562 34569182 31657057 28838486 26171701 23695341 21429501 19378667
57059A9378667j842700j647706j467268j300155j145420j003468q75149p60885
$$ 19378667 17535967 15888261 14420993 13120838 11975418 10971950 10096801 9335916
57051I335916o60822n74811n01912m40438l88748l45603l10004k81359k59613
$$ 9335916 8675094 8100283 7598371 7157933 6769185 6423582 6113578 5832219 5572606
57042E572606k44422k34200k26783k20955k16407k12303k07100k00255j93046
$$ 5572606 5328184 5093984 4867201 4646246 4429839 4217536 4010436 3810181 3617135
57033C617135j86971j81806j75934j68255j59178j49886j41041j32432j23675
$$ 3617135 3430164 3248358 3072424 2904169 2744991 2595105 2454064 2321632 2197957
57024B197957j15011j07140j00313r4051q7924q2098p6819p1878o7064o2726n9275
$$ 2197957 2082946 1975806 1875493 1781442 1693518 1611420 1534601 1462723 1395659 1332933 1273658
57013A273658n6500n3946n1609m9526m7150m3942m0333l7227l4673l1966k8890
$$ 1273658 1217158 1163212 1111603 1062077 1014927 970985 930652 893425 858752 826786 797896
57002G97896k5960k3325k0447j7067j3592j0251o659k683J017L852O120Q417J0631
$$ 797896 771936 748611 728164 711097 697505 687254 680595 677912 678929 682781 688901 697318 707949
56989G07949J2082J2454J2121J1619J1200J0831J0326R346P441M205m76o253j2356
$$ 707949 720031 732485 744606 756225 767425 778256 788582 797928 805369 809574 809098 802845 790489
56976G90489j7892k2195k5009k6433k6679k5794k3690k0641j7520j5118j3282
$$ 790489 772597 750402 725393 698960 672281 646487 622797 602156 584636 569518 556236
56965E56236j1182q460n582k934k42K777N756Q188J0113J1785J2819J2158Q859
$$ 556236 545054 536594 531012 528078 527836 530613 536369 544557 554670 566455 579274 591432 600291
56952F00291K859m660j1662j6550j9374k1190k2235k1557j8804j5268j2386j0045
$$ 600291 603150 598490 586828 570278 550904 529714 507479 485922 467118 451850 439464 429419
56940D29419p242l811m38K576N545Q633J1751J4978J8342K1311K3174K3589K2129
$$ 429419 422177 418366 417928 420504 426049 434682 446433 461411 479753 501064 524238 547827 569956
56927E69956J7815J0122K42r572j7720k3679k7140k7915k6667k4642k2584k0518
$$ 569956 587771 597893 598135 588563 570843 547164 520024 492109 465442 440800 418216 397698
56915C97698j8486j6625j4703j2472j0442r343q938q304p304o649o451n829m287
$$ 397698 379212 362587 347884 335412 324970 315627 306689 298385 291081 284432 277981 272152 267865
56902B67865k583j650j468j328p21M66K037L552M730N823P189Q619R786J1153
$$ 267865 265282 263632 262164 260836 260115 260581 262618 266170 270900 276723 283912 292531 302317 313470
56888C13470J3503J6547J9032K0341K0892K0649J8452J3472O519p59p250j2367
$$ 313470 326973 343520 362552 382893 403785 424434 442886 456358 462877 462118 454868 442501
56876D42501j5503j6328j5257j2964r826o252l003m21K244O033J0946J6067K0832
$$ 442501 426998 410670 395413 382449 372623 366371 363368 362947 365191 371224 382170 398237 419069
56863D19069K5565L0737L6205M1283M5162M6980M5681M0121K9734J5339p15j5567
$$ 419069 444634 475371 511576 552859 598021 645001 690682 730803 760537 775876 775161 759594
56851G59594k7176l4741l8175l7765l4331k9141k3271j7102j0491l149N125J4194
$$ 759594 732418 697677 659502 621737 587406 558265 534994 517892 507401 504252 509377 523571
56839E23571K3465L2362M0970M9845N9038O7666P4523P8489P8006P0721N4691
$$ 523571 547036 579398 620368 670213 729251 796917 871440 949929 1027935 1098656 1153347
56828A153347L0420J629k6231m8563o3290p0709p2217o9305o3304n5402m6546
$$ 1153347 1183767 1185396 1159165 1110602 1047312 976603 904386 835081 771777 716375 669829
56817F69829l7332k8087j8875r562j63Q923J7401K5699L4476M3407N1066N6028
$$ 669829 632497 604410 585535 575973 575810 584733 602134 627833 662309 705716 756782 812810
56805H12810N7168N2806M1011K1943q91k2729m0643n3840o1994o4764o2716n7375
$$ 812810 869978 922784 963795 985738 984847 962118 921475 867635 805641 740877 678161 620786
56793F20786n0181m2166l4466k7946k2297j6417r816k945L754J0130J5765K0156
$$ 620786 570605 528439 493973 466027 443730 427313 417497 414552 418306 428436 444201 464357
56781D64357K3518K6359K8137K7177K2202J3291J492j1510k3377l1974l6734l8548
$$ 464357 487875 514234 542371 569548 591750 605041 606533 595023 571646 539672 502938 464390
56769D64390l8298l6344l3296l0070k6938k3619k0440j8256j6900j5031j2086
$$ 464390 426092 389748 356452 326382 299444 275825 255385 237129 220229 205198 193112
56758A93112r204p594o990o468n796n214m625l905l303k915k348j500j054j444
$$ 193112 183908 176314 169324 162856 157060 151846 147221 143316 140013 137098 134750 133250 132196 130752
56744A30752k004j904j363j175j531k014k425k813k989k661j980j463j368j496
$$ 130752 128748 126844 125481 124306 122775 120761 118336 115523 112534 109873 107893 106430 105062 103566
56730A03566j490j137n80k30k56j85N13J539K038J816J522J550J534J174P36M42
$$ 103566 102076 100939 100359 100129 99873 99688 100201 101740 103778 105594 107116 108666 110200 111374 112110 112552
56714A12552J49m0L02R90J088K49n83m08N10J232J423J398J297R39K44n71j087
$$ 112552 112701 112661 112963 113953 115041 115290 114707 114299 114809 116041 117464 118862 120159 121098 121342 120771 119684
56697A19684q32K22J292J441P37Q3j15k95o63q07n97n24p06n71K9M13K10n5q6
$$ 119684 118852 119074 120366 121807 122544 122627 122512 122217 121554 120747 120150 119626 118920 118349 118378 118791 119001 118946 118860
56678A18860l82j105j465j034n84p57r42l99M41Q32Q97R45N64m42j088m92O58
$$ 118860 118478 117373 115908 114874 114290 113533 112591 112192 112633 113465 114362 115307 115871 115429 114341 113849 114507
56661A14507J151J072J249J551J254O27O04J114J182O64M46Q61J202J012P36Q24
$$ 114507 115658 116730 117979 119530 120784 121411 122015 123129 124311 124975 125421 126282 127484 128496 129232 130056
56645A30056J100J362J760K360K934L276L276K795K001J553J823K226K080J738
$$ 130056 131156 132518 134278 136638 139572 142848 146124 148919 150920 152473 154296 156522 158602 160340
56631A60340J924K307J850N12n30n19o3j84j082k103k412j659m50M3n76j271r28
$$ 160340 162264 164571 166421 166933 166403 165884 165821 165637 164555 162452 160040 158381 157931 157974 157398 156127 155199
56614A55199J02O15L39K0l4k99q95j286j284j359j620j499q36m04q98k032l062
$$ 155199 155301 155916 156255 156275 156241 155942 155047 153761 152477 151118 149498 147999 147163 146759 145861 143829 140767
56597A40767l583l485k712j557o78l58p1P55J881K457K037J046K65K0k3k51n22
$$ 140767 137184 133699 130987 129430 128752 128394 128323 129078 130959 133416 135453 136499 136764 136784 136761 136510 135988
56580A35988l98R7N03O46P88Q92N36j10q0J027K236K528K270K442L086L560L896
$$ 135988 135590 135687 136190 136836 137624 138516 139052 138942 138862 139889 142125 144653 146923 149365 152451 156011 159907
56563A59907M782O329P891Q992R563R489Q747P860P247O345M338J575p33k079
$$ 159907 164689 171018 178909 187901 197464 206953 215700 223560 230807 237152 241490 243065 242332 240253
56549B40253k881l244k728j446l63j29m69r09j277j400j187j100j695k548k607
$$ 240253 237372 234128 231400 229954 229591 229462 228993 228084 226807 225407 224220 223120 221425 218877 216270
56534B16270j752j044j206j806k246k564k857k815k382k073k178k272j954j454
$$ 216270 214518 213474 212268 210462 208216 205652 202795 199980 197598 195525 193347 191075 189121 187667
56520A87667j125r56r95j478k195k388j820j291j473j899j733j072o88q04q87
$$ 187667 186542 185586 184591 183113 180918 178530 176710 175419 173946 172047 170314 169242 168554 167750 166863
56505A66863n51m5K26K27J60J22J0l00p62j174j337j202q42l66L3J67P1l2p9k14
$$ 166863 166312 166267 166493 166720 166880 167002 167012 166712 165950 164776 163439 162237 161395 161029 161062 161229 161300 161268 161189 160975
56485A60975l69k09K81O49O59O93R89J103P15L84P01J102N29p77j286j03J851
$$ 160975 160606 160397 160678 161327 161986 162679 163668 164771 165486 165870 166571 167673 168202 167425 166139 166036 167887
56468A67887K990K770J955J551J783K066J761R56K58m0j64k18L1M52M15k39p92
$$ 167887 170877 173647 175602 177153 178936 181002 182763 183719 183977 183937 183773 183555 183586 184038 184453 184214 183422
56451A83422p41n22n39l29N06J271J125L91p2j86l50m05l6L66L81M84J085J327
$$ 183422 182681 182159 181620 181291 181797 183068 184193 184584 184512 184326 183976 183571 183535 183901 184282 184766 185851 187178
56433A87178K69j239j517n02L62M44M00M39o4r47j006J52J394J663J139M80M6
$$ 187178 187447 186208 184691 184189 184551 184995 185395 185834 185770 184823 183817 183969 185363 187026 188165 188645 188691
56416A88691J63Q99J444Q51m20r84o41n27j051j248o11O5K13L91R53J259R49P14
$$ 188691 188854 189753 191197 192048 191628 190644 190003 189476 188425 187177 186566 186631 186844 187235 188188 189447 190396 191110
56398A91110J010J208Q36N15Q36J365J509J397J185N58l37n01M68J509J499P95
$$ 191110 192120 193328 194164 194679 195515 196880 198389 199786 200971 201529 201192 200691 201159 202668 204167 204962
56382B04962M40O74J033J288J461J385R95N86L60J51j12k13j52k00k20K31J017
$$ 204962 205402 206076 207109 208397 209858 211243 212238 212824 213184 213335 213223 213010 212858 212658 212438 212669 213686
56365B13686J461J449J501J630J259N16L09P92J019N82K35M29N28K30K59R29J295
$$ 213686 215147 216596 218097 219727 220986 221502 221811 222603 223622 224204 224439 224868 225396 225626 225885 226814 228109
56348B28109P51K00N57J186J010L21K36R90J844K241K157J694J084P64R34J383
$$ 228109 228860 229060 229617 230803 231813 232134 232370 233360 235204 237445 239602 241296 242380 243144 244078 245461
56332B45461J932K543K854K475J874K010K935L771M154M407M257K920Q93j03L57
$$ 245461 247393 249936 252790 255265 257139 259149 262084 265855 270009 274416 278673 281593 282486 282383 282740
56317B82740O84j26r30n72Q9k70j212j462r99p52r16q81l61M89J518K400K591
$$ 282740 283424 283298 282368 281796 281885 281615 280403 278941 277942 277190 276274 275393 275032 275521 277039 279439 282030
56300B82030K151J845J967J954J629J595J988K097J893K314L409L791K921K169
$$ 282030 284181 286026 287993 289947 291576 293171 295159 297256 299149 301463 304872 308663 311584 313753
56286C13753K585L259L219L158L884M622M543M375M854N108M342L734M636O177
$$ 313753 316338 319597 322816 325974 329858 334480 339023 343398 348252 353360 357702 361436 366072 372249
56272C72249O734O647P292Q459Q854Q487Q429Q780Q922R273J0753J2890J4394
$$ 372249 378983 385630 392922 401381 410235 418722 427151 435931 444853 454126 464879 477769 492163
56259D92163J5313J6858J9250K1579K3587K5977K9063L2519L6346M0748M5355
$$ 492163 507476 524334 543584 565163 588750 614727 643790 676309 712655 753403 798758
56248G98758M9761N4355N9466O4320O8163P1652P5558P8833P9621P7701P4308
$$ 798758 848519 902874 962340 1026660 1094823 1166475 1242033 1320866 1400487 1478188 1552496
56237A552496P0053O4598N7861M9961M0427K8995J6738M929o531j8087k8717l7033
$$ 1552496 1622549 1687147 1745008 1794969 1835396 1864391 1881129 1886058 1879527 1861440 1832723 1795690
56225A795690m3421m9138n3970n6897n8465o0217o1980o2120o0434n8571n7369
$$ 1795690 1752269 1703131 1649161 1592264 1533799 1473582 1411602 1349482 1289048 1230477 1173108
56214A173108n5865n3330n0313m7241m3730l9902l6729l4540l2500l0008k7463
$$ 1173108 1117243 1063913 1013600 966359 922629 882727 845998 811458 778958 748950 721487
56203G21487k5235k3037k0680j8462j6564j4868j3431j2314j1080r281p247n600
$$ 721487 696252 673215 652535 634073 617509 602641 589210 576896 565816 556535 549288 543688
56191E43688m421l606l468l980m211l550k782k795l020k480j512j027q51k75M82
$$ 543688 539267 535661 532193 528213 524002 520452 517670 514875 511855 509375 507863 506836 505985 505710 506192
56176E06192Q35J119J769K157J798J698K712L629K870J269Q84J867K741L176M099
$$ 506192 507027 508146 509915 512072 513870 515568 518280 521909 524779 526048 526932 528799 531540 534716 538815
56161E38815N431O130O383P453R371J0764J1088J1179J1613J2219J3101J4589
$$ 538815 544246 550376 556759 564212 573583 584347 595435 606614 618227 630446 643547 658136
56149F58136J6446J8515K1620K6271L1377L6009M1444M9316N8704O7486P5827
$$ 658136 674582 693097 714717 740988 772365 808374 849818 899134 957838 1025324 1101151
56138A101151Q5690R7290J08485J17360J23053J24361J20062J10743R8417Q4674
$$ 1101151 1186841 1284131 1392616 1509976 1633029 1757390 1877452 1988195 2086612 2171286
56128B171286P1067O0255N4091N0881M6820L9824L0025J7697L501r982j9958k6450
$$ 2171286 2242353 2302608 2356699 2407580 2454400 2494224 2524249 2541946 2545447 2535465 2515507 2489057
56116B489057l1453l6049m0914m8397o0592p5904r0544j02621j11738j15874j12875
$$ 2489057 2457604 2421555 2380641 2332244 2271652 2195748 2105204 2002583 1890845 1774971 1662096
56105A662096j04529r5134q6100p5732o3994n3261m4316l5789k7890k2542j9352
$$ 1662096 1557567 1462433 1376333 1300601 1236607 1183346 1139030 1103241 1075351 1052809 1033457
56094A033457j5502j0437o690n306m313k616j610j857j815r07m67p02p3J522K308
$$ 1033457 1017955 1007518 1000828 995522 991209 988593 986983 985126 983311 982404 981937 981235 981162 982684 984992
56079I84992K010K295L388L764L587M744P008Q124Q066R134J1414J2498J2227
$$ 984992 987002 989297 992685 996449 1000036 1004780 1011788 1019912 1027978 1037112 1048526 1061024 1073251
56066A073251J3089J5203J5772J4536J4767J7429J9355J8841J8260J9162J9571
$$ 1073251 1086340 1101543 1117315 1131851 1146618 1164047 1183402 1202243 1220503 1239665 1259236
56055A259236J8279J7255J7620J7490J5988J5171J5954J6293J5347J5205J6609
$$ 1259236 1277515 1294770 1312390 1329880 1345868 1361039 1376993 1393286 1408633 1423838 1440447
56044A440447J7293J6449J6413J8050J8985J8278J8199J9544J9975J8921J9098
$$ 1440447 1457740 1474189 1490602 1508652 1527637 1545915 1564114 1583658 1603633 1622554 1641652
56033A641652K1156K2038K0858K1089K4492K8175L0242L2908L7445M1466M3953
$$ 1641652 1662808 1684846 1705704 1726793 1751285 1779460 1809702 1842610 1880055 1921521 1965474
56022A965474M7467N2617N6001N6480N7770O1813O5491O6894O8802P2736P5775
$$ 1965474 2012941 2065558 2121559 2178039 2235809 2297622 2363113 2430007 2498809 2571545 2647320
56011B647320P6605P8453Q2652Q5737Q6395Q8540R3891R8518J00493J03693J10025
$$ 2647320 2723925 2802378 2885030 2970767 3057162 3145702 3239593 3338111 3438604 3542297 3652322
56000C652322J15499J18254J22682J31053J39080J44551J51996J63739J74976
$$ 3652322 3767821 3886075 4008757 4139810 4278890 4423441 4575437 4739176 4914152
55991D914152J83096J92917K07016K20309K30291K42964K61931K81711K98804
$$ 4914152 5097248 5290165 5497181 5717490 5947781 6190745 6452676 6734387 7033191
55982G033191L19059L46595L76148M04321M37182M78427N21824N64276O13988
$$ 7033191 7352250 7698845 8074993 8479314 8916496 9394923 9916747 10481023 11095011
55973A1095011O76387P45157Q17173R01993J005790J121625J247770J399161J587556
$$ 11095011 11771398 12516555 13333728 14235721 15241511 16363136 17610906 19010067 20597623
55964B0597623J808817K064994K379950K777682L268841L879199M667812N694183
$$ 20597623 22406440 24471434 26851384 29629066 32897907 36777106 41444918 47139101
55956D7139101O991107Q588198J0521578J2783751J5302284J8011158K0898115
$$ 47139101 54130208 62718406 73239984 86023735 101326019 119337177 140235292
55949A40235292K3922729K6931023K9699331L1931227L2997616L1717430K6768297
$$ 140235292 164158021 191089044 220788375 252719602 285717218 317434648 344202945
55942C44202945J7697195N628831p112009j8167578k6103669l0587575l2039354
$$ 344202945 361900140 367528971 360416962 342249384 316145715 285558140 253518786
55935B53518786l1228847k8986351k6005118k2763085j9570708j6637445j4075973
$$ 253518786 222289939 193303588 167298470 144535385 124964677 108327232 94251259
55928I4251259j1898616j0066580q542883p291162o258420n392502m664431m055035
$$ 94251259 82352643 72286063 63743180 56452018 50193598 44801096 40136665 36081630
55920C6081630l535757l081395k686977k353733k070151j821811j607293j428746
$$ 36081630 32545873 29464478 26777501 24423768 22353617 20531806 18924513 17495767
55912A7495767j277400j142593j025331r29552q48955p75008p09461o56930o12788
$$ 17495767 16218367 15075774 14050443 13120891 12271936 11496928 10787467 10130537 9517749
55903I517749n69624n28540m93429m60829m25621l90487l60259l32776l04279
$$ 9517749 8948125 8419585 7926156 7465327 7039706 6649219 6288960 5956184 5651905
55894E651905k77763k57322k39881k20972k03183j90629j80434j67854j54854
$$ 5651905 5374142 5116820 4876939 4655967 4452784 4262155 4081721 3913867 3759013
55885C759013j45504j37582j26672j14478j05383r8517r0391q1943p6201p2268
$$ 3759013 3613509 3475927 3349255 3234777 3129394 3030877 2940486 2858543 2782342 2710074
55875B710074o7939o4982o5839o8337o9296o9849p1795p2544o9429o5322o4155
$$ 2710074 2642135 2577153 2511314 2442977 2373681 2303832 2232037 2159493 2090064 2024742 1960587
55864A960587o4362o2515n9952n9860o0865n9477n6294n4148n2615m9582m5766
$$ 1960587 1896225 1833710 1773758 1713898 1653033 1593556 1537262 1483114 1430499 1380917 1335151
55853A335151m2709l8871l2645k6655k4252k4288k3977k3976k5834k7427k6136
$$ 1335151 1292442 1253571 1220926 1194271 1170019 1145731 1121754 1097778 1071944 1044517 1018381
55842A018381k3917k4000k5028k3700k0776j9237j8654j6677j4111j3243j2936
$$ 1018381 994464 970464 945436 921736 900960 881723 863069 846392 832281 819038 806102
55831H06102j0631p608p118q639r063q285q607r764r537q445r049j1127j2148
$$ 806102 795471 787863 780745 772106 763043 754758 746151 736387 726850 718405 709356 698229 686081
55818F86081j1916j2403j3547j3422j2125j1447j1158r543p197o362o873o471
$$ 686081 674165 661762 648215 634793 622668 611221 600063 590520 583323 576961 570088 563617
55806E63617m817l606l020j591O07J989K443L273M474M946M875N088M787K769
$$ 563617 558800 555194 552174 550583 551190 553179 555622 558895 563369 568315 573190 578278 583065 585834
55792E85834J06j360k215m114o311o746n768n434o024o481p470j0416j4137j5926
$$ 585834 585940 584580 582365 578251 571940 565194 559426 553992 547968 541487 534017 523601 509464 493538
55778D93538j5551j4897j4236j2297r586p937o938m412o31J492P69p53j189r17
$$ 493538 477987 463090 448854 436557 426971 419034 412096 407684 407053 408545 409314 408561 407372 406455
55764D06455q31j034j704l026m099l902l196l392m107m035l657m527o377p538
$$ 406455 405624 404590 402886 399860 395761 391859 388663 385271 381164 377129 373472 368945 362568 355030
55750C55030p805q257q685p899o280n335n038m288l513m037n191n011l631l077
$$ 355030 347225 338968 330283 322384 316104 310769 305731 301443 297930 293893 288702 283691 280060 276983
55736B76983l741l927k981k085j751j136j21L89L43M28J75j361l296l836l311
$$ 276983 273242 269315 266334 264249 262498 261362 261241 261630 261973 262401 262576 261215 257919 254083 250772
55721B50772l648m976n527m812m080l565k244m32K96M9O30K198K850J990J297
$$ 250772 247124 242148 236621 231809 227729 224164 221920 221488 221784 221833 222463 224661 227511 229501 230798
55706B30798J725K294K456K963L606K855N47j481k340l216m738n719n444m910
$$ 230798 232523 234817 237273 240236 243842 246697 247244 245763 243423 240207 235469 229750 224306 219396
55692B19396m747m125k749j786j758j511l68O30O34L83O91J175J375J645K194
$$ 219396 214649 210524 207775 205989 204231 202720 202352 202982 203616 203999 204690 205865 207240 208885 211079
55677B11079K643L012L662M009L048J299L58K26o51k382l042j796l09j08o25q81
$$ 211079 213722 216734 220396 224405 227453 228752 229110 229336 228685 226303 223261 221465 221156 221048 220423 219542
55661B19542j007j100m37R94J890J624J230J512J786J423J051J273J608J543J286
$$ 219542 218535 217435 216998 217992 219882 221506 222736 224248 226034 227457 228508 229781 231389 232932 234218
55646B34218P97m58k186l244l451l859m731n091m758m888n767o088n315m738n163
$$ 234218 235015 234557 232371 229127 225676 221817 217086 211995 207237 202349 196582 190494 185179 180441 175278
55631A75278n433m489l129k469k201j625r24l33N74J646J709M25p72p31k32m54
$$ 175278 169845 165356 162227 159758 157557 155932 155008 154675 155249 156895 158604 159029 158257 157526 157294 156840
55615A56840j190j682k022k534k835k661k511k668k553j907j466j601j558q82
$$ 156840 155650 153968 151946 149412 146577 143916 141405 138737 136184 134277 132811 131210 129652 128770
55601A28770l68p11j293j192m72K63O16K82p58j537r64L25N18o55j487j056m46
$$ 128770 128402 127691 126398 125206 124734 124997 125613 125895 125137 123600 122636 122961 123479 122824 121337 120281 119835
55584A19835m96l91N19J455J911K756M364N492N343M972N285N438M717M249N030
$$ 119835 119339 118948 119467 120922 122833 125589 129953 135445 140788 145760 151045 156483 161200 165449 170479
55569A70479N892N255L540J999N02j585l480m026l760m013m737m956m702m723
$$ 170479 176371 181626 185166 187165 187667 186082 182602 178576 174816 170803 166066 161110 156408 151685
55555A51685m887m533l915l700l573k778j610r28o85l05rl50r66j084q06o20j63
$$ 151685 146798 142265 138350 134650 131077 128299 126689 125761 125076 124771 124762 124412 123446 122362 121556 120936 120773
55538A20773J065K316K342J268L35R3P8N6K64N02J87o54j378j656j656j502j255
$$ 120773 121838 124154 126496 127764 128099 128192 128270 128326 128590 129092 129279 128625 127247 125591 123935 122433 121178
55521A21178j168j321j338j112j224k003k746k615j802j095q51j011j478j795
$$ 121178 120010 118689 117351 116239 115015 113012 110266 107651 105849 104754 103903 102892 101414 99619
55507I9619j264j25L06n68j628j721j311j347j517j034k86k26p25q75n24k51j03
$$ 99619 98355 98230 98536 97968 96340 94619 93308 91961 90444 89410 89124 88898 88173 87298 86774 86523 86420
55490H6420L53R87J164P18Lo88j086p92J25Q90J033R38Q10J70q76j032L03J697
$$ 86420 86773 87760 88924 89642 89645 88957 87871 87079 87204 88094 89127 90065 90875 91045 90169 89137 89440 91137
55472I1137J574M33k90n29j101j696j338m06k57r53j162k63Q90J442J395R46K21
$$ 91137 92711 93144 92854 92325 91224 89528 88190 87784 87527 86574 85412 85149 86039 87481 88876 89822 90043
55455I0043k77o3M54M99J34k0kk97p33p69o14q32j110o82J57L61j83o02n61n45
$$ 90043 89766 89703 90157 90656 90790 90770 90768 90471 89738 88969 88355 87523 86413 85731 85888 86249 86066 85464 84903 84358
55435H4358o18l04K48K82j69j80N44J203J243R87O79j7j108j816j537n99K75O68
$$ 84358 83740 83436 83684 83966 83797 83617 84161 85364 86607 87594 88273 88256 87148 85332 83795 83196 83471 84139
55417H4139N62K05N9K63K89l21j105j233o51M7N95J033J072M10m20n65n8L46L95
$$ 84139 84701 84906 84965 85228 85517 85196 84091 82858 82207 82254 82849 83882 84954 85364 84944 84379 84321 84667 85062
55398H5062M82O72O19L41K33L02K34O4N8J54K46N85J099R50j66j024n39K59l69
$$ 85062 85544 86216 86835 87176 87409 87711 87945 88009 88067 88221 88467 89052 90151 91101 90935 89911 89372 89631 89262
55379H9262j944k296q49O14P63K81O1k22q51j033k18P76R79O41M73M41K17k8m9
$$ 89262 87318 85022 84173 84787 85550 85831 85892 85670 84819 83786 83568 84344 85323 85964 86437 86878 87095 87067 87018
55360H7018j41m90o67l53L0K0j71k13k23k46J47J044J689J453P42K84L1m81j162
$$ 87018 86877 86387 85720 85367 85397 85417 85246 85033 84810 84564 84711 85755 87444 88897 89639 89923 89954 89473 88311
55341H8311j491j320r12m24M5J80j71n68m52N7L55K20J7O4K52L29K26k1m07p77
$$ 88311 86820 85500 84588 84164 84209 84389 84218 83650 83198 83255 83610 83830 83847 83911 84163 84492 84718 84697 84290 83513
55321H3513p34L2J173J801J396M88P8L93O85L45l45p52o78k77K69O10K55o75j251
$$ 83513 82779 82811 83984 85785 87181 87669 87747 88140 88825 89170 88825 88073 87395 87118 87387 87997 88252 87577 86326
55302H6326q44NL83K47J92L91N05M00K50J61K02N26R37P58k37j221j312o97p0
$$ 86326 85482 85487 85870 86117 86309 86700 87205 87605 87855 88016 88218 88744 89681 90439 90202 88981 87669 86972 86902
55283H6902M75J086J311P17p3r0M97P11L51Q3J45Q0k81o16q53j093r49m4R83J048
$$ 86902 87377 88463 89774 90491 90418 90328 90825 91536 91887 91970 92115 92195 91914 91298 90445 89352 88403 88359 89342 90390
55263I0390K62k06J55O67P40N43K63k25p72r81r32j038j187r36m86m38o65n19
$$ 90390 90652 90446 90601 91268 92008 92551 92814 92589 91817 90836 89904 88866 87679 86743 86257 85819 85154 84635
55245H4635n1Q4j39j59lj18j81N01J445J394M09p3M93J009O87R1k17n17q02l63
$$ 84635 84584 84668 84529 84370 84367 84249 84068 84569 86014 87408 87817 87744 88237 89246 89933 90024 89807 89290 88488 88125
55225H8125P56J318O90k33o05p47r61o84K16P45L79P4N98J107O09l18n87l24k38
$$ 88125 88881 90199 90889 90656 90051 89304 88343 87659 87875 88620 88999 89073 89671 90778 91387 91069 90482 90158 89920
55206H9920j39N28J375J619J324R75L90p17j724j835j346j075r72m78K40N40N02
$$ 89920 89781 90309 91684 93303 94627 95602 95992 95275 93551 91716 90370 89295 88323 87845 88085 88625 89127
55189H9127O61Q51M42l87p27l24J24P4k16j88M22J469K348K243J063j02q9R55
$$ 89127 89788 90639 91081 90694 89967 89643 89767 89841 89625 89437 89859 91328 93676 95919 96982 96880 96791 97746
55171I7746J896K053J651J045K39p52j599j894j366r1J364K167J977J272P16M60
$$ 97746 99642 101695 103346 104391 104630 103878 102279 100385 99019 98928 100292 102459 104436 105708 106424 106884
55155A06884K63ql22n37m43n4N2p08j929k504k074j447j299j353j167q74o04n8
$$ 106884 107147 107139 106817 106280 105837 105783 105835 105127 103198 100694 98620 97173 95874 94521 93354 92480 91876 91818
55137I1818P26J019L98n71j151j219q02K19J371J603P80J29M26Q25M51n2J59M05
$$ 91818 92544 93563 93961 93390 92239 91020 90218 90437 91808 93411 94191 94320 94746 95571 96022 95970 96129 96534
55119I6534l56j472j445l70K25j68m90m0M92L49j55k55K77J075J531J134K1r02
$$ 96534 96178 94706 93261 92891 93116 92948 92458 92418 92910 93259 93104 92849 93126 94201 95732 96866 96887 95985
55101I5985r26l39K02O37J075J040K05n94l02O49Q58N5o39m95j0L46Q82J770K396
$$ 95985 95059 94720 94922 95559 96634 97674 97879 97285 96983 97632 98490 98545 97906 97411 97401 97747 98629 100399 102795
55082A02795K140J111k29j488k193j956j121n34m40k48L69Q91P41P0o92j397j926
$$ 102795 104935 106046 105817 104329 102136 100180 99059 98525 98085 97837 98206 99097 99838 99908 99216 97819 95893
55065I5893j896j096M9P85O99l4q76j296j116n19K67J103J661J478O46K4J68N93
$$ 95893 93997 92901 92950 93735 94434 94400 93524 92228 91112 90593 90860 91963 93624 95102 95748 95772 95940 96533
55047I6533O02M49P66J264J009q3j062j238q42k87L55R18J035O96L22R5j90n59
$$ 96533 97135 97584 98350 99614 100623 100540 99478 98240 97398 97111 97466 98384 99419 100115 100437 100532 100342 99783
55029I9783p30o71o64p19o05m81p62j198r66J09J126J287Q06K90r6l81l32J33
$$ 99783 99053 98382 97718 96999 96394 95913 95151 93953 92987 93096 94222 95509 96315 96605 96509 96128 95796 95929
55011I5929N85O17M44M39M38J2o60p95l4R55J107J47j055j345m60Q20J615J692
$$ 95929 96514 97131 97575 98014 98452 98464 97804 97009 96975 97930 99037 99184 98129 96784 96324 97144 98759 100451
54993A00451J256N14k32m36J91J173J718J567J041M77J4k22k41k68l66p5R74K303
$$ 100451 101707 102221 101989 101553 101744 102917 104635 106202 107243 107720 107734 107512 107271 107003 106637 106562 107536 109839
54975A09839K932K505J562P47J96k70p74j222j263n58O55J535J521R61M76J36
$$ 109839 112771 115276 116838 117585 117781 117511 116737 115515 114252 113694 114349 115884 117405 118366 118842 118978
54959A18978k44m94m32m54r41j407j132l83j05m84p75n05J7M86R91J500J731J638
$$ 118978 118734 118240 117808 117354 116413 115006 113874 113491 113386 112902 112127 111622 111639 112125 113116 114616 116347 117985
54941A17985J372P51m21j492j440l25O18O07J30j35k57m64m20K75J407K509L430
$$ 117985 119357 120108 119687 118195 116755 116430 117048 117655 117785 117650 117393 116929 116509 116784 118191 120700 124130
54924A24130M196M783N364O308P577Q548Q731Q311P695O933N809M144J874p85
$$ 124130 128326 133109 138473 144781 152358 160906 169637 177948 185643 192576 198385 202529 204403 203618
54910B03618l175m644n220n451n618n718o021o776p329o578m623l008k779l159
$$ 203618 200443 195799 190579 185128 179510 173792 167771 160995 153666 147088 142465 139457 136678 133519
54896A33519k852j863j193j199j238p92j69Q7L5K75J138K087K198J368P51J472
$$ 133519 130667 128804 127611 126412 125174 124382 124213 124300 124335 124610 125748 127835 130033 131401 132152 133624
54880A33624L161M393M549M512N364P061Q607R012P887N629L221J389p8j756l456
$$ 133624 136785 141178 145727 150239 155603 162664 171271 180283 188170 193799 197020 198409 198331 196575 193119
54865A93119m464m795n248n995o216n530m801m899n434n438m669l612k691k084
$$ 193119 188655 183860 178612 172617 166401 160871 156070 151171 145737 140299 135630 132018 129327 127243
54851A27243j858j779j374o60l06o95j297j476j324j255j245j092r34r45r17n97
$$ 127243 125385 123606 122232 121572 121266 120571 119274 117798 116474 115219 113974 112882 111948 111003 110086 109489
54835A09489j02L54P38Q39L33m77o67m6L15l80j268j002K41R70M20o66j221j002
$$ 109489 109387 109741 110479 111318 111651 111174 110507 110461 110776 110396 109128 108126 108367 109337 109757 109091 107870 106868
54817A06868m30LO2j00o8L21P18P52N17K33j01l83j92N57J198J196R70J120J383
$$ 106868 106438 106441 106503 106403 106335 106656 107374 108126 108643 108876 108775 108392 108200 108757 109955 111151 112121 113241 114624
54798A14624J082L13k75n55q35r47m85J49P0o25q51j80N18N49M04P14J128J068
$$ 114624 115706 116019 115744 115189 114354 113407 112922 113071 113141 112516 111665 111485 112003 112552 112956 113670 114798 115866
54780A15866Q66J195J829J972J668J813K701L456L320K767K741L325L879M210
$$ 115866 116732 117927 119756 121728 123396 125209 127910 131366 134686 137453 140194 143519 147398 151608
54766A51608M821N906O884P244P233P208O828N570L681J871K25j791m215o274
$$ 151608 156429 162335 169219 176463 183696 190904 197732 203302 206983 208854 209079 207288 203073 196799
54752A96799p344p564p322o827o334o122n933n134l808k832k547k149j056kQ1
$$ 196799 189455 181891 174569 167742 161408 155286 149353 144219 140411 137579 135032 132883 131827 131825 131906
54737A31906l94l44K69N21J41j29K29Q49J324J788K389K898L178L479L969M410
$$ 131906 131512 131168 131437 131958 132099 131970 132199 133048 134372 136160 138549 141447 144625 148104 152073 156483
54721A56483M691N201O265P412P582O129L482P67j196k558l949n400o194o011
$$ 156483 161174 166375 172640 180052 187634 193763 197245 198012 196816 194258 190309 184909 178715 172704
54707A72704n603n802o257n946m681l289k325j517p07m80j264k423k879k355j527
$$ 172704 167101 161299 155042 149096 144415 141126 138801 137284 136577 136097 134833 132410 129531 127176 125649
54692A25649j027q38o49m18l82o28r00q86o65o44r73j215q33P8Q36R44N12p2n68
$$ 125649 124622 123784 123135 122717 122335 121707 120807 119921 119256 118612 117639 116424 115591 115669 116505 117449 117961 117889 117321
54673A17321q37o97m0Q60J397J030j82j499k007j420k79O62J127J274J229R27
$$ 117321 116484 115787 115747 116607 118004 119034 118852 117353 115346 113926 113647 114309 115436 116710 117939 118866
54657A18866M32j2k88n90j094j560j507p62K39Q56R50R50J160J287R75N54O73
$$ 118866 119298 119286 118998 118408 117314 115754 114247 113485 113724 114580 115530 116480 117640 118927 119902 120456 121129
54640A21129J195J147O0j211j518q70k85l57o15l68K82N68M1q86j368j104o46
$$ 121129 122324 123471 123531 122320 120802 119932 119647 119290 118675 118307 118589 119157 119198 118312 116944 115840 115194
54623A15194o16q58o98NO14O33L40K59M35O15O82O24L64L4L3M28O88M53J85M46
$$ 115194 114578 113720 113022 113027 113641 114274 114614 114873 115308 115923 116605 117229 117593 117627 117660 118088 118776 119229 119414 119860
54603A19860R32Q83K63k78m96p64j111q88K02J369J611Q99O5l02l39l69l98k82
$$ 119860 120792 121675 121938 121660 121164 120400 119289 118401 118603 119972 121583 122482 122547 122245 121906 121537 121139 120857
54585A20857j34k25n24o24k18M55Q49P04K44p8Q0P19J319J117j5j155j282n17
$$ 120857 120723 120498 119974 119350 119132 119587 120436 121140 121384 121306 121386 122105 123424 124541 124526 123371 122089 121572
54567A21572J64L63N33Q22O32k07p61k09R41J571J390R03M50K8k56l07m20q21
$$ 121572 121736 122099 122632 123454 124086 123879 123118 122909 123850 125421 126811 127714 128164 128192 127936 127629 127209 126388
54549A26388j078o36K77R47J163J207J133P45K19m3n4r8k8N37J404J929J899J649
$$ 126388 125310 124674 124951 125898 127061 128268 129401 130146 130365 130322 130268 130170 130142 130679 132083 134012 135911 137560
54531A37560J287O25j55n13l55j47j50k08l10o28q76m75M68J117J062P50N01n2
$$ 137560 138847 139472 139317 138804 138449 138302 138152 137944 137634 137006 136130 135655 136123 137240 138302 139052 139553 139501
54513A39501j111k033k086j399o32j86j40m64q29o60Q7N86J62p38j089o20K4L57
$$ 139501 138390 136357 134271 132872 132240 132054 131914 131450 130621 129961 130048 130634 130796 130058 128969 128349 128373 128730
54495A28730O36J260J976K026J031m87j498j410m87O23J460J711J082k11j112
$$ 128730 129366 130626 132602 134628 135659 135172 133674 132264 131777 132400 133860 135571 136653 136442 135330
54480A35330o47P88J747J437M73j91l57l21k02k5Q1K25P89J645J882R25m29q34
$$ 135330 134683 135471 137218 138655 139128 138937 138580 138259 138057 138032 138113 138338 139127 140772 142654 143579 143150 142316
54462A42316m3R31J146N72l47j263j894j944j400n86J92Q16J063O31l11q99m09
$$ 142316 142273 143204 144350 144922 144575 143312 141418 139474 138074 137488 137680 138496 139559 140190 139879 138980 138571
54445A38571P81J480J001p7p05n76k68l01n42n87m01k53k54k30OM35Q49R83P45
$$ 138571 139352 140832 141833 141756 141051 140475 140207 139906 139364 138777 138376 138123 137869 137639 137645 138080 138929 139912 140657
54426A40657L89L31N95P45M72O2J2L97R13J313J480J221M13o61j412j442q47j58
$$ 140657 141046 141377 141972 142717 143189 143251 143263 143660 144573 145886 147366 148587 149000 148339 146927 145485 144638 144480
54408A44480Kn90j360j423n79M47R79J121J197J139R14R23J238J077q5j356j472
$$ 144480 144482 143892 142532 141109 140530 140977 141956 143077 144274 145413 146327 147250 148488 149565 149480 148124 146652
54391A46652n93R5L02P53J469J482N59j48J13N51K45l82m26M8L68M07L94J61m01
$$ 146652 146059 146154 146456 147209 148678 150160 150719 150571 150684 151235 151480 151098 150672 150720 151088 151495 151889 152050 151649
54372A51649o51O7J229J686J226O60M56K28l27q18q05m18j2L03N31N54K95n8k81
$$ 151649 150998 151065 152294 153980 155206 155866 156322 156550 156223 155405 154600 154182 154170 154473 155004 155558 155853 155795 155514
54353A55514l43l96n82r53j393j595j292n43K74P99R50Q39N44L3o49j184j111
$$ 155514 155171 154775 154193 153240 151847 150252 148960 148417 148691 149490 150440 151279 151823 151856 151207 150023 148912
54336A48912l23O85J270J270J021Q01N88L76L47N91Q98J020R64R43J136J544J943
$$ 148912 148589 149274 150544 151814 152835 153636 154224 154600 154947 155538 156436 157456 158420 159363 160499 162043 163986
54319A63986K024J654R59O7r87j927k251j941j775k365l197l352k855k460k280
$$ 163986 166010 167664 168623 168690 167703 165776 163525 161584 159809 157444 154247 150895 148040 145580 143300
54304A43300j709p03o2q7l2O11J186R18Q4n24o90o40m02RK64J95J60L41K83k57
$$ 143300 141591 140888 140826 140739 140707 141318 142504 143422 143506 142982 142292 141652 141250 141259 141523 141718 141878 142219 142502 142245
54284A42245n60QP56N05o10j248p73J2K21J6J7K80M29L26J78J63L46P91J456K016
$$ 142245 141685 141693 142449 142954 142344 141096 140323 140335 140556 140572 140589 140869 141298 141624 141802 141965 142311 143102 144558 146574
54264A46574K033J474Q86Q57J309J530J123N55M39N41J85n29p31j89K25j38p52
$$ 146574 148607 150081 150967 151824 153133 154663 155786 156341 156780 157321 157506 156977 156246 156057 156282 156144 155392
54247A55392q39n73o46j137j588j748j601r63J01P76K74r53j574r81J25Q24R32
$$ 155392 154553 153980 153334 152197 150609 148861 147260 146297 146398 147174 147448 146495 144921 143940 144065 144889 145821
54230A45821P69M81j7p26j372j528r86j38K47r7n84n44o3L53M96M19L8n60p41
$$ 145821 146590 147071 147054 146328 144956 143428 142442 142304 142551 142454 141870 141326 141263 141616 142112 142531 142569 142009 141268
54211A41268k8R99J243N15l29o61p33r09j013p75l80j83k21l08l32k50J8M12P40
$$ 141268 141240 142239 143482 143997 143668 143007 142274 141365 140352 139577 139197 139014 138793 138485 138153 137903 137921 138333 139073
54192A39073R17R96R08M65k40p27o44k06J03J74M06J114J991K348J911J164P08
$$ 139073 139990 140986 141894 142359 142119 141392 140748 140542 140645 140819 141225 142339 144330 146678 148589 149753 150461
54175A50461M90L6p23j295j315r15l86M9P3m92j163j186o57m61q31q53O0J046
$$ 150461 150951 150987 150264 148969 147654 146739 146353 146402 146475 145983 144820 143634 142977 142516 141685 140832 140892 141938
54157A41938R80Q1n54n03j92J03M21O03M44K17K68M11L53L83P40Q63J82p27r22
$$ 141938 142918 142999 142445 141942 141750 141853 142274 142877 143321 143538 143806 144217 144570 144953 145693 146556 146738 146011 145089
54138A45089o50q32j235p13P05J543J057K86L25Q40J057J040J132R88K54m74l83
$$ 145089 144439 143607 142372 141659 142364 143907 144964 145250 145575 146415 147472 148512 149644 150632 150886 150412 150029
54121A50029K76N20M1n12n64k25J08L04M73O26N77J30n82j105j191j072r81o83
$$ 150029 150305 150825 150866 150354 149790 149565 149673 149977 150450 151076 151653 151783 151201 150096 148905 147833 146852 146169
54103A46169K7O43M43m09j026r69n73j15M77J032J114P94O48P64O25O4m71q29
$$ 146169 146196 146839 147282 146873 145847 144878 144305 144190 144667 145699 146813 147607 148255 149019 149644 149708 149237 148408
54085A48408j330j758j348j52O86O10M85R50J188L73o96o87J84O06J86k49j18
$$ 148408 147078 145320 143972 143820 144506 145116 145601 146551 147739 148112 147416 146729 146913 147519 147705 147456 147338
54068A47338L47R33J701K353K328J668R27K98m15r45o81K35Q52P41N70R47J447
$$ 147338 147685 148618 150319 152672 155000 156668 157595 157893 157478 156533 155852 156087 156939 157680 158250 159197 160644
54051A60644J253L29n66p56k19N91J214J537J795K220K771L260L570L522K821
$$ 160644 161897 162226 161660 160904 160685 161276 162490 164027 165822 168042 170813 174073 177643 181165 183986
54036A83986J557M95L88J089J790K065K118K136J938J424Q64N53N35P51J096J287
$$ 183986 185543 186038 186426 187515 189305 191370 193488 195624 197562 198986 199850 200403 200938 201689 202785 204072
54020B04072J052N57K52L04N20R10J796L226M721N881O863P869Q454P765N451
$$ 204072 205124 205681 205933 206237 206757 207667 209463 212689 217410 223291 230154 238023 246477 254242 259693
54005B59693K040j519m546o828q338q949q557p450o259n396m751m161l873m137
$$ 259693 261733 260214 255668 248840 240502 231553 222996 215546 209287 203891 199140 194979 191106 186969
53991A86969m531m269l213k092j516j239o43L72J282J578J213N60P7l7L9k0k88
$$ 186969 182438 178169 174956 172864 171348 170109 169466 169838 171120 172698 173911 174471 174548 174511 174550 174530 174242
53974A74242n82p47q15q38q61j020j350j491r82k1N48L18JN30J776K646K460J628
$$ 174242 173660 172913 172098 171260 170399 169379 168029 166538 165556 165535 166083 166401 166402 166932 168708 171354 173814 175442
53956A75442R25O20N45O15Q19R51P76M53M55J011J813K390K561K448K180J857
$$ 175442 176367 176987 177532 178147 178966 179917 180693 181146 181601 182612 184425 186815 189376 191824 194004 195861
53940A95861J682J921K617L491M220M784N389O059O457O233N464M554L674K580
$$ 195861 197543 199464 202081 205572 209792 214576 219965 226024 232481 238714 244178 248732 252406 254986
53926B54986J109l63j249j417j222r62o94n62p73j140j110n48p8k38o97q19o70
$$ 254986 256095 255732 254483 253066 251844 250882 250188 249626 248853 247713 246603 246055 245977 245739 245042 244223 243553
53909B43553p92j195j316r97p60j009j495j891k274k732k980k835k631k736k942
$$ 243553 242761 241566 240250 239253 238493 237484 235989 234098 231824 229092 226112 223277 220646 217910 214968
53894B14968k823k410k072j898j691j491j555j798j756j285q46q61j048p42K21
$$ 214968 212145 209735 207663 205765 204074 202583 201028 199230 197474 196189 195343 194482 193434 192692 192913
53879A92913J257J682J401Q05J68n45j270j575j166m14Kl3K3M43P50M48j29k31
$$ 192913 194170 195852 197253 198058 198226 197681 196411 194836 193670 193256 193258 193225 193248 193691 194441 194889 194760 194529
53861A94529K58P14P60Q21J444K492L417M138N158O717Q317R365J0086J1319J3314
$$ 194529 194787 195501 196261 197082 198526 201018 204435 208573 213731 220448 228765 238130 248216 259535 272849
53846B72849J5086J5112J2614Q039K617k351o007q171r272r929j0481j0829j0625
$$ 272849 287935 303047 315661 323700 326317 323966 317959 309788 300516 290587 280106 269277 258652
53833B58652r589p926o399n716n723n594m962m350m188m021l289k360j966j922
$$ 258652 249063 241137 234738 229022 223299 217705 212743 208393 204205 200184 196895 194535 192569 190647
53819A90647j401l97J35j97n85k83K93L80R4J59P91J530J947K031J927J776J726
$$ 190647 189246 188849 188984 188787 188202 187919 188212 188592 188686 188845 189636 191166 193113 195144 197071 198847 200573
53802B00573J820J907J828J573J240R41Q60J035J142Q55M46M77Q56Q15O6o92p74
$$ 200573 202393 204300 206128 207701 208941 209882 210742 211777 212919 213774 214220 214697 215553 216368 216434 215742 214968
53785B14968m20k52l59m61n17o62q35r66j202j568j803j844k001k274k089j280
$$ 214968 214548 214296 213937 213476 212959 212297 211462 210496 209294 207726 205923 204079 202078 199804 197715 196435
53769A96435o86j025j775j946j523j184j024n75R2L72J25k34n24p90n81N21J686
$$ 196435 195749 194724 192949 191003 189480 188296 187272 186697 186789 187161 187286 187052 186528 185738 185157 185678 187364
53752A87364J344o35k435k486j267k98j67l55l23M0O90J413J767J557J138Q58
$$ 187364 188708 188073 185638 183152 181885 181587 181420 181065 180742 180782 181472 182885 184652 186209 187347 188205
53736A88205N98K56K04O60J054P60J66J91R05J460J416J234J291J256R25R07J771
$$ 188205 188803 189059 189263 189923 190977 191737 191903 192094 192999 194459 195875 197109 198400 199656 200581 201488 203259
53719B03259K960L333K676J952K020K702L311L469L139K295J149L83N70J356J739
$$ 203259 206219 209552 212228 214180 216200 218902 222213 225682 228821 231116 232265 232648 233218 234574 236313
53704B36313J286O77R15K226L928N110N281M655L914L611L643L492K911K100J258
$$ 236313 237599 238276 239191 241417 245345 250455 255736 260391 264305 267916 271559 275051 277962 280062 281320
53689B81320L51m63p14k43L99M90n6p78j272j402j178p35l35p0J98M28K49m69
$$ 281320 281671 281208 280494 280251 280650 281140 281084 280306 279034 277632 276454 275719 275384 275314 275512 275940 276189 275720
53671B75720j208j356r99o66n89o26p50r96j119q21l19j42l32l91n9L07K71j37
$$ 275720 274512 273156 272157 271491 270902 270276 269526 268530 267411 266590 266271 266129 265797 265406 265347 265654 265925 265788
53653B65788n92q33p47l67Q2L23K39j11n46p05k22P15J298J080P05J074J970K305
$$ 265788 265196 264363 263616 263249 263331 263654 263893 263782 263236 262531 262309 263024 264322 265402 266107 267181 269151 271456
53635B71456J691R99J130J893K429K271J660J212J516K647L873M193L462K621
$$ 271456 273147 274146 275276 277169 279598 281869 283529 284741 286257 288904 292777 296970 300432 303053
53621C03053K551L102L480L293K845K551K525K693L106L927N086O010N989N011
$$ 303053 305604 308706 312186 315479 318324 320875 323400 326093 329199 333126 338212 344222 350211 355222
53607C55222L930L471L338K842K132K063K823L511L304K418J576J097R00Q83Q96
$$ 355222 359152 362623 365961 368803 370935 372998 375821 379332 382636 385054 386630 387727 388627 389510 390406
53592C90406O52R8m62q43j230j672j786j374r44j123j817k368k390k022j616j505
$$ 390406 391058 391156 390694 389851 388621 386949 385163 383789 382845 381722 379905 377537 375147 373125 371509 370004
53576C70004j944k776l316l004k055j183p68o60o65p20o71l02K79O79P63Q32J145
$$ 370004 368060 365284 361968 358964 356909 355726 354958 354298 353633 352913 352242 351940 352219 352898 353661 354493 355638
53559C55638J595J993K425K960L289L007K303J907K176K518K137J171N45O57P84
$$ 355638 357233 359226 361651 364611 367900 370907 373210 375117 377293 379811 381948 383119 383664 384321 385105
53544C85105J79p29q80m6R91J698K431L541M580M995N101N718O929P973Q414Q804
$$ 385105 385284 384555 383675 383629 384620 386318 388749 392290 396870 401865 406966 412684 419613 427586 436000 444804
53528D44804R809J1116J1813J1716J1709J2550J3844J4717J5128J5853J7173J8420
$$ 444804 454613 465729 477542 489258 500967 513517 527361 542078 557206 573059 590232 608652
53516F08652J9044J9440K0196K1129K1756K2263K3212K4478K5334K5464K5245
$$ 608652 627696 647136 667332 688461 710217 732480 755692 780170 805504 830968 856213
53505H56213K5002K4723K4509K4590K4755K4574K4252K4495K5266K5505K4498
$$ 856213 881215 905938 930447 955037 979792 1004366 1028618 1053113 1078379 1103884 1128382
53494A128382K2849K1599K1010K0746K0686K0860K0973K0655J9950J9120J8190
$$ 1128382 1151231 1172830 1193840 1214586 1235272 1256132 1277105 1297760 1317710 1336830 1355020
53483A355020J7193J6538J6578J7033J7334J7403J7438J7094J5536J2561R129
$$ 1355020 1372213 1388751 1405329 1422362 1439696 1457099 1474537 1491631 1507167 1519728 1528857
53472A528857O419M667L128J070j512m237p000j0027j3180j5645j6703j6641j6475
$$ 1528857 1535276 1539943 1543071 1544141 1542629 1538392 1531392 1521365 1508185 1492540 1475837 1459196 1442721
53459A442721j6852j7606j8444j9452k0732k2002k2906k3399k3534k3210k2477
$$ 1442721 1425869 1408263 1389819 1370367 1349635 1327633 1304727 1281328 1257794 1234584 1212107
53448A212107k1798k1678k2017k2118k1320j9605j7659j6230j5290j3956j1615
$$ 1212107 1190309 1168631 1146614 1124496 1103176 1083571 1065912 1049682 1034392 1020436 1008821
53437A008821q895p046o401o115n394m220k782r94J029K724L838M877O300P863
$$ 1008821 999926 992880 986479 980364 974970 970750 967968 966974 968003 970727 974565 979442 985742 993605
53423I93605R234J0709J2705J4929J6758J8119J9387K0674K1847K3046K4628K6592
$$ 993605 1002839 1013548 1026253 1041182 1057940 1076059 1095446 1116120 1137967 1161013 1185641 1212233
53411A212233K8525L0101L1359L2630L4312L6433L8382L9567M0499M2521M6054
$$ 1212233 1240758 1270859 1302218 1334848 1369160 1405593 1443975 1483542 1524041 1566562 1612616
53400A612616M9809N2349N3784N5118N6619N7756N8442N9180O0138O0906O1215
$$ 1612616 1662425 1714774 1768558 1823676 1880295 1938051 1996493 2055673 2115811 2176717 2237932
53389B237932O1141O0642N9582N8120N6430N4205N1104M7594M4503M1912L9206
$$ 2237932 2299073 2359715 2419297 2477417 2533847 2588052 2639156 2686750 2731253 2773165 2812371
53378B812371L6156L3007K9616K5435K0630J6178J2534Q976M578r22p492j5275
$$ 2812371 2848527 2881534 2911150 2936585 2957215 2973393 2985927 2994903 2999481 2998559 2991067 2975792
53366B975792k4051l2854m0633m6954n1739n4919n6775n8096n9408o0406o0594
$$ 2975792 2951741 2918887 2878254 2831300 2779561 2724642 2667867 2609771 2550363 2489957 2429363
53355B429363o0111n9426n8532n7038n4924n2720n0949m9794m9288m9403m9894
$$ 2429363 2369252 2309826 2251294 2194256 2139332 2086612 2035663 1985869 1936581 1887178 1837284
53344A837284n0293n0172m9339m7806m5746m3409m0951l8320l5422l2416k9724
$$ 1837284 1786991 1736819 1687480 1639674 1593928 1550519 1509568 1471248 1435826 1403410 1373686
53333A373686k7656k6050k4346k2181j9872j8120j7233j6823j6369j5754j5127
$$ 1373686 1346030 1319980 1295634 1273453 1253581 1235461 1218228 1201405 1185036 1169282 1154155
53322A154155j4545j4021j3622j3129j1934r765p335n703n039m491l269j310J016
$$ 1154155 1139610 1125589 1111967 1098838 1086904 1077139 1069804 1064101 1059062 1054571 1051302 1049992 1051008
53309A051008L337N229O330O825P474Q887J0967J3209J5282J7111J8642J9794
$$ 1051008 1054345 1059574 1065904 1072729 1080203 1089090 1100057 1113266 1128548 1145659 1164301 1184095
53297A184095K0682K1731K3427K5829K8304L0042L0861L1206L1250L0550K8966
$$ 1184095 1204777 1226508 1249935 1275764 1304068 1334110 1364971 1396177 1427427 1457977 1486943
53286A486943K7246K6080K4975K3015K0377J8138J6670J5240J3300J1153Q952
$$ 1486943 1514189 1540269 1565244 1588259 1608636 1626774 1643444 1658684 1671984 1683137 1692089
53275A692089O082K176j944n106p206r159j1646j4518j7261j9580k1515k3350
$$ 1692089 1698171 1700347 1698403 1693297 1686091 1676932 1665286 1650768 1633507 1613927 1592412 1569062
53263A569062k5404k7744l0020l1706l2492l2543l2428l2667l3178l3371l2918
$$ 1569062 1543658 1515914 1485894 1454188 1421696 1389153 1356725 1324058 1290880 1257509 1224591
53252A224591l2130l1287l0104k8454k7156k7161k8163k8965k9157k9353k9760
$$ 1224591 1192461 1161174 1131070 1102616 1075460 1048299 1020136 991171 962014 932661 902901
53241I02901k9619k8502k7006k5705k4318k2578k0916j9582j8016j5864j3891
$$ 902901 873282 844780 817774 792069 767751 745173 724257 704675 686659 670795 656904
53230F56904j2818j2051j0712r327r153j0079j0642j0180r701j0177j1130j1534
$$ 656904 644086 632035 621323 611996 602843 592764 582122 571942 562241 552064 540934 529400
53218E29400j1332j1294j1746j2168j1978j1248j0511j0048r469q167o178m420
$$ 529400 518068 506774 495028 482860 470882 459634 449123 439075 429606 421439 415261 410841
53206D10841l852m496n602o501p009p127o825o257n770n593n656n717n542n037
$$ 410841 406989 402493 396891 390390 383381 376254 369429 363172 357402 351809 346153 340436 334894 329857
53192C29857m404m035m060m092l731l095k625k519k733l273m029m424l820k336
$$ 329857 325453 321418 317358 313266 309535 306440 303815 301296 298563 295290 291261 286837 283017 280681
53178B80681q37m9l9m92j001j101n45K32L79l49j222j436j020n63l58k19N7M28
$$ 280681 279844 279795 279756 279264 278263 277162 276617 276849 277228 276879 275657 274221 273201 272638 272280 272061 272118 272546
53160B72546O83N78p5j150k114k436k072j429q50l64P9L78L43q1p49j397j755
$$ 272546 273229 273807 273732 272582 270468 268032 265960 264531 263681 263317 263396 263774 264117 264036 263287 261890 260135
53143B60135j656j163o02l85o78j224j529j276n82J14M03J71l40o96n71o1M33
$$ 260135 258479 257316 256714 256329 255651 254427 252898 251622 251040 251154 251557 251728 251388 250692 250121 250060 250493
53126B50493N94M91L10O0l21o59o36k45J20J80J12K57O45J012J169J082P20Q1
$$ 250493 251087 251578 251888 251948 251627 250968 250332 250087 250207 250387 250499 250756 251401 252413 253582 254664 255384 255465
53108B55465o41j215j684k239k750k801k333j853j764j821j599j136p12l06J30
$$ 255465 254824 253609 251925 249686 246936 244135 241802 239949 238185 236364 234765 233629 232917 232611 232741
53093B32741J18q13k089k414j390m4N68N48N13N53M69M73P94J006N74j53l16K09
$$ 232741 232859 232046 229957 227543 226153 226109 226677 227225 227738 228291 228760 229233 230027 231033 231607 231454 231138 231347
53075B31347O85O20K43j00l36m25l22k96o27r97p69O2Q54J297J692K098K016J186
$$ 231347 232032 232652 232895 232795 232459 232034 231712 231416 230789 229792 229023 229085 229939 231236 232928 235026 237042 238228
53057B38228N0q80j481j612r42L56J365J367O36j04n14o68o92p79j103j396j112
$$ 238228 238278 237398 235917 234305 233363 233719 235084 236451 237087 236983 236469 235801 235109 234330 233227 231831 230719
53040B30719k92K73R0l93n89n56n08k70K01L47j62o95n37o3j53q05j198r48m91
$$ 230719 230427 230700 230790 230397 229808 229252 228744 228474 228675 229022 228860 228165 227628 227565 227412 226607 225409 224461 223970
53021B23970k46j74j55j57l3L38P76J048J267J556J628J210O21L05O7m99j065
$$ 223970 223724 223550 223395 223238 223205 223543 224319 225367 226634 228190 229818 231028 231649 231954 232021 231522 230457
53004B30457q75N9Q41Q44K72l97r03j094r14n88l16J31R49J645J582J005O86O88
$$ 230457 229582 229641 230482 231326 231598 231201 230298 229204 228290 227702 227386 227517 228466 230111 231693 232698 233384 234072
52986B34072M33o5j18K80K37m71p53K05J627K294K197K111K116J647Q12N13J167
$$ 234072 234505 234440 234322 234602 234839 234368 233615 233820 235447 237741 239938 242049 244165 245812 246624 247137 248304
52969B48304K053K285J873J515J635J975K039J683J113M41m95j666k508k465j754
$$ 248304 250357 252642 254515 256030 257665 259640 261679 263362 264475 264916 264421 262755 260247 257782 256028
52954B56028j210j236j454j466j489j857k286k075j010K42O87r6j449k134j550
$$ 256028 254818 253582 252128 250662 249173 247316 245030 242955 241945 242187 242874 242778 241329 239195 237645
52939B37645m07Q7l65r55r13l40K19M24K03m16j124j462j355j200j188j010m92
$$ 237645 237238 237325 236960 236005 235092 234752 234971 235395 235598 235182 234058 232596 231241 230041 228853 227843 227351
52922B27351p5j31k60K30J267J948J555K52j126j821j656j020l58K83J061J815
$$ 227351 227276 227145 226885 227115 228382 230330 231885 232137 231011 229190 227534 226514 226156 226439 227500 229315
52906B29315K062J630Q71J54m66r59j149j056r37q65o70m62o04r27p53nM59K03
$$ 229315 231377 233007 233878 234032 233566 232607 231458 230402 229465 228600 227930 227468 226864 225937 225184 225179 225638 225841
52888B25841M5P10J453J144J24l03K3j2q45j502j250o54l95j58N22J137R66L26
$$ 225841 225886 226596 228049 229193 229317 229014 229037 229025 228180 226678 225428 224774 224379 224221 224743 225880 226846 227172
52870B27172J21M31M96M8k41K46J279K160K445K098J393Q48R17J502J913J554
$$ 227172 227293 227724 228220 228268 228027 228273 229552 231712 234157 236255 237648 238496 239413 240915 242828 244382
52854B44382N03o69j509j942k068j938j665j588k090l130m021l967k878j538q02
$$ 244382 244885 244216 242707 240765 238697 236759 235094 233506 231416 228286 224265 220298 217420 215882 215080
52839B15080q25j163j437j550j396q07L9N17J71p30j425j413p67J01P48Q25K77
$$ 215080 214255 213092 211655 210105 208709 207902 207941 208458 208629 207899 206474 205061 204294 204395 205143 205968 206245
52822B06245m39o44j02O78J006P86N32P14J237J643J636J337J097J177J583K088
$$ 206245 205806 205162 205060 205738 206744 207530 208062 208776 210013 211656 213292 214629 215726 216903 218486 220574
52806B20574K329J953Q37o70j884k366k360k373k357j722l74O99M18r88k126k059
$$ 220574 222903 224856 225693 225023 223139 220773 218413 216040 213683 211961 211587 212286 212704 211716 209590 207531
52790B07531j297r36j232j420p69N79J804K244J940J458J265J312J267J026Q01
$$ 207531 206234 205298 204066 202646 201877 202456 204260 206504 208444 209902 211167 212479 213746 214772 215573
52775B15573P13N81K39j62l46k69q7Q0J65O6j99l51j57J73J74k70p96j103j254
$$ 215573 216286 216867 217106 216944 216598 216329 216242 216322 216487 216553 216354 216003 215846 216019 216193 215923 215127 214024 212770
52756B12770j281r15q6N76L44n47j002m32N82J244J641K229K748K429J281K69
$$ 212770 211489 210574 210488 211064 211408 210861 209859 209427 210009 211253 212894 215123 217871 220300 221581 221850
52740B21850L9J93J09j49k50k57l03j02N84J316J524J427J592J867J553O45n4
$$ 221850 221889 222082 222191 222042 221792 221535 221232 221130 221714 223030 224554 225981 227573 229440 230993 231638 231584
52723B31584j79l10r15j609j838j652j266n24N86J446J478R72N63K41l72j032
$$ 231584 231405 231095 230180 228571 226733 225081 223815 223291 223877 225323 226801 227773 228336 228577 228205 227173
52707B27173r74j00O74N37k46p98p04l21j82l08k01N36J574K071J608P16K11K59
$$ 227173 226199 226099 226773 227310 227064 226266 225562 225241 225059 224751 224550 225086 226660 228731 230339 231055 231266 231525
52689B31525M18M30M56N75N43K57K1J52N52Q69R00O54J96l45p22p38m87k73l10
$$ 231525 231943 232373 232829 233404 233947 234204 234225 234377 234929 235798 236698 237352 237548 237203 236481 235743 235256 234983 234673
52670B34673m93n47l55r4J4Q0M13R67J198P69J63J77Q69J475J396Q37L16l6l72
$$ 234673 234180 233633 233278 233184 233198 233278 233691 234658 235856 236625 236788 236965 237834 239309 240705 241542 241858 241822 241450
52651B41450o90q55r16j040j191j166q91m94j32M4j18n43p85m74N1K8o59j097
$$ 241450 240760 239905 238989 237949 236758 235592 234701 234207 234075 234119 234001 233458 232673 232199 232250 232278 231619 230522
52633B30522l61J307K767L261L104L044L331L532L038J661j04j365j603j245j205
$$ 230522 230161 231468 234235 237496 240600 243644 246975 250507 253545 255206 255102 253737 252134 250889 249684
52618B49684j775k303k200j804j807k088j845q39J51L62Mk62k91l98n47k61O12
$$ 249684 247909 245606 243406 241602 239795 237707 235862 235023 235174 235536 235540 235278 234987 234589 234042 233781 234393
52601B34393J525J914J847J758J779J658J294R20P23N37J40l58o19m70N0Q71J820
$$ 234393 235918 237832 239679 241437 243216 244874 246168 247088 247811 248348 248488 248130 247511 247041 247091 247962 249782
52584B49782K431K247J452Q51Q71R77M34o08j288j209q56q03j024j193j260j308
$$ 249782 252213 254460 255912 256763 257634 258611 259045 258437 257149 255940 255084 254281 253257 252064 250804 249496
52568B49496j200p08OM10J77m31q22o81k35P4J57L65Q60J159O04o82j724j657
$$ 249496 248296 247588 247594 248004 248181 247750 246928 246247 246012 246086 246243 246608 247468 248627 249231 248549 246825 245168
52550B45168o04N20Q74K84p47j454j406p87j16K98M64M17K08J14M01Q33Q51L97
$$ 245168 244564 245084 245958 246242 245495 244041 242635 241848 241732 242030 242494 242911 243119 243233 243634 244467 245318 245715
52532B45715Q6K50L71j33r65j348j089p12n98o01m65j81J51M53N76M20K46N55
$$ 245715 245801 246051 246422 246289 245324 243976 242887 242175 241577 240976 240511 240330 240481 240934 241510 241930 242176 242731
52514B42731J533K760L619L786L372K786K445K425K353J844J017L13j89r08k102
$$ 242731 244264 247024 250643 254429 257801 260587 263032 265457 267810 269654 270671 270984 270795 269887 267785
52499B67785l336l828l233j963q26m71r90j860k322j985j146m31j57j16JJ64J32
$$ 267785 264449 260621 257388 255425 254599 254128 253138 251278 248956 246971 245825 245394 245237 245121 245122 245286 245418
52482B45418j36l38k45O2M18Q66J464J964K020J697J462J581J817J823J561J258
$$ 245418 245282 244944 244699 244761 245179 246045 247509 249473 251493 253190 254652 256233 258050 259873 261434 262692
52466B62692J162J431K023K591K731K419J985J573J000K35m10p81j171j722k024
$$ 262692 263854 265285 267308 269899 272630 275049 277034 278607 279607 279842 279432 278651 277480 275758 273734
52451B73734j725j301j509k273k685k205j295p22o17n53k63Oj20o58j216j414
$$ 273734 272009 270708 269199 266926 264241 262036 260741 260019 259402 258849 258586 258592 258472 257814 256598 255184
52435B55184j199p25o9O48J028P14J3l24q6P0l71r37p84J77J240J775J664J136
$$ 255184 253985 253260 253191 253839 254867 255581 255594 255270 255184 255254 254883 253946 253162 253339 254579 256354 258018 259154
52417B59154O94R96K222L667M449M609M934N838P011Q077Q879Q970P598M609R05
$$ 259154 259848 260844 263066 266733 271182 275791 280725 286563 293574 301651 310530 319500 327098 331707 332612
52402C32612k347m639o053o721o698o132n256m240l206k198j124K9Q89R01J8j116
$$ 332612 330265 325626 319573 312852 306154 300022 294766 290526 287320 285122 283998 284027 284916 285817 285835 284719
52386B84719j704j413m46O12J129R71P94J356K502L323L371L167L300L657L893
$$ 284719 283015 281602 281156 281768 282897 283868 284662 286018 288520 291843 295214 298381 301681 305338 309231
52371C09231M144M696N299N396M793L789K709J746J039N67J17l13k74N05J425
$$ 309231 313375 318071 323370 328766 333559 337348 340057 341803 342842 343409 343526 343213 342939 343444 344869
52356C44869J534P37K1K78J335K322K725K760K887L233L588L867M364N483P129
$$ 344869 346403 347140 347161 347439 348774 351096 353821 356581 359468 362701 366289 370156 374520 380003 387132
52341C87132Q569R080Q712Q276Q587R827J1564J3184J4241J4672J4880J5547J7066
$$ 387132 395701 404781 413493 421769 430356 440183 451747 464931 479172 493844 508724 524271 541337
52328E41337J9041K0557K1123K1262K1840K2873K3399K2706K1277K0057J9046
$$ 541337 560378 580935 602058 623320 645160 668033 691432 714138 735415 755472 774518
52317G74518J7275J4255J0891Q621Q014Q452Q925Q688P434N320L018J371P45P79
$$ 774518 791793 806048 816939 825560 833574 842026 850951 859639 867073 872393 875411 876782 877527 878306
52303H78306Q30N43j14j133k437l616m072l727l357l811m991n998o260o067n818
$$ 878306 879136 879679 879565 878432 875995 872379 868307 864580 861223 857412 852421 846423 840163 834096 828278
52288H28278n273l981k013J31K172M090N805P258Q726J0494J2311J3621J4314
$$ 828278 823005 819024 817011 817142 819314 823404 829209 836467 845193 855687 867998 881619 895933
52275H95933J4696J4849J4575J4071J3925J4245J4310J3430J1724R782P933O236
$$ 895933 910629 925478 940053 954124 968049 982294 996604 1010034 1021758 1031540 1039473 1045709
52263A045709M786L696K918K332J845J306N22m38j241j688j880j947k015k474
$$ 1045709 1050495 1054191 1057109 1059441 1061286 1062592 1063114 1062676 1061435 1059747 1057867 1055920 1053905 1051431
52249A051431l734n530o993p683q046q533q794q243p008n727m750m073l789l916
$$ 1051431 1047697 1042167 1035174 1027491 1019445 1010912 1002118 993875 986867 981140 976390 972317 968528 964612
52235I64612l942l187j664j26Q01J077J005J006J614L073M758N518M966M117M357
$$ 964612 960670 957483 955819 955693 956494 957571 958576 959582 961196 964269 969027 974545 979511 983628 987985
52220I87985N890P464P698O523N256N188O231P102O907O184O122O982P781P507
$$ 987985 993875 1001339 1009037 1015560 1020816 1026004 1032235 1039337 1046244 1052428 1058550 1065532 1073313 1080820
52206A080820O204M706L712L377L651M488N645O517O530N722M780M361M468M618
$$ 1080820 1087024 1091730 1095442 1098819 1102470 1106958 1112603 1119120 1125650 1131372 1136152 1140513 1144981 1149599
52192A149599M460M040L534K959K214J224j5j413k814m113n346o495p376p864
$$ 1149599 1154059 1158099 1161633 1164592 1166806 1168030 1168015 1166602 1163788 1159675 1154329 1147834 1140458 1132594
52178A132594q082q085p608o503n229m430m070l611k979k637k684k578j954j059
$$ 1132594 1124512 1116427 1108819 1102316 1097087 1092657 1088587 1084976 1081997 1079360 1076676 1074098 1072144 1071085
52164A071085m8J359L068M235M213L439K810K618K595K482K060J148J81J92J494
$$ 1071085 1071037 1072396 1075464 1079699 1083912 1087351 1090161 1092779 1095374 1097856 1099916 1101064 1101245 1101437 1102931
52149A102931K870K917J833J027J287K174L046L693M079M263M610N336O015O254
$$ 1102931 1105801 1108718 1110551 1111578 1112865 1115039 1118085 1121778 1125857 1130120 1134730 1140066 1146081 1152335
52135A152335O630P993J0055J1745J2901J4411J6509J8301J9374K0563K2422K4092
$$ 1152335 1158965 1166958 1177013 1188758 1201659 1216070 1232579 1250880 1270254 1290817 1313239 1337331
52123A337331K4595K4336K4231K4130K3269K1785K0473J9249J7144J3882J0391
$$ 1337331 1361926 1386262 1410493 1434623 1457892 1479677 1500150 1519399 1536543 1550425 1560816
52112A560816P410M537J219k079m439n765o809p985q900r093q744q276p724o933
$$ 1560816 1568226 1572763 1573982 1571903 1567464 1561699 1554890 1546905 1538005 1528912 1520168 1511892 1504168 1497235
52098A497235o192o023o276o118n229m484m866o107p053p140o680n822m143j599
$$ 1497235 1491043 1485020 1478744 1472626 1467397 1462913 1458047 1451940 1444887 1437747 1431067 1425245 1421102 1419503
52084A419503R59K771M141N919Q357J0954J3158J4751J5757J6374J6821J7002
$$ 1419503 1420462 1423233 1427374 1433293 1441650 1452604 1465762 1480513 1496270 1512644 1529465 1546467
52072A546467J6468J5122J3650J2832J2510J1779J0063P611M987K571O41o41j588
$$ 1546467 1562935 1578057 1591707 1604539 1617049 1628828 1638891 1646502 1651489 1654060 1654701 1654060 1652472
52059A652472l030n525q694j1587j3681j5228j6629j7820j8547j9034j9890k1289
$$ 1652472 1649442 1643917 1635223 1623636 1609955 1594727 1578098 1560278 1541731 1522697 1502807 1481518
52047A481518k2573k3036k2815k2633k2813k2899k2282k0776j8559j5923j3184
$$ 1481518 1458945 1435909 1413094 1390461 1367648 1344749 1322467 1301691 1283132 1267209 1254025
52036A254025j0560q065n751l991l124k832k455j992k168l257m503n177n660o705
$$ 1254025 1243465 1235400 1229649 1225658 1222534 1219702 1217247 1215255 1213087 1209830 1205327 1200150 1194490 1187785
52022A187785q109q883q709q405q813r770j0491j0547j0192r951j0135j0686j1347
$$ 1187785 1179676 1170793 1162084 1153679 1144866 1135096 1124605 1114058 1103866 1093915 1083780 1073094 1061747
52009A061747j2019j2890j4164j5692j7046j7941j8457j8870j9372j9887k0106
$$ 1061747 1049728 1036838 1022674 1006982 989936 971995 953538 934668 915296 895409 875303
51998H75303j9722j8770j7532j6126j4407j2460j0859j0095r942r800r496r339
$$ 875303 855581 836811 819279 803153 788746 776286 765427 755332 745390 735590 726094 716755
51986G16755r464r644r762r976j0287j0377j0135j0031j0602j1697j2550j2495
$$ 716755 707291 697647 687885 677909 667622 657245 647110 637079 626477 614780 602230 589735
51974E89735j1471r858q055o173m129j961k2J342K272L298M653N872O321N970
$$ 589735 578264 568406 560351 554178 550049 548088 548066 549408 551680 554978 559631 565503 571824 577794
51960E77794N379M942M486L598K113J29k161m414o053o628o338n845n467m795
$$ 577794 583173 588115 592601 596199 598312 598441 596280 591866 585813 579185 572847 567002 561535 556740
51946E56740l267r15J719M206O448Q424J0138J1736J3218J4060J3658J2212J0633
$$ 556740 553473 552558 554277 558483 564931 573355 583493 595229 608447 622507 636165 648377 659010
51933F59010R228P138L559r24m894p687r754j1599j3169j4396j5541j6635j7158
$$ 659010 668238 675376 678935 678011 673117 665430 655676 644077 630908 616512 600971 584336 567178
51920E67178j6671j5393j3839j2239j0711r538q816q055o775n278m265l708k827
$$ 567178 550507 535114 521275 509036 498325 488787 479971 471916 465141 459863 455598 451890 449063
51907D49063j218O06K105L462M995O286O673O344O147O288N869M100J318j578
$$ 449063 447845 448451 450556 454018 459013 465299 471972 478316 484463 490751 496620 500720 502038 500460
51893E00460m240o799q966r961r504q275p075n907m252j989L99K461M284O202
$$ 500460 496220 489421 480455 470494 460990 452715 445640 439733 435481 433492 433891 436352 440636 446838
51879D46838Q276J0311J2271J4406J6814J9015K0259K0350J9877J9373J8338J5519
$$ 446838 455114 465425 477696 492102 508916 527931 548190 568540 588417 607790 626128 641647
51867F41647J0259L335l723r847j4766j8366k0269k0215j8558j6124j3576j1024
$$ 641647 651906 655241 651518 641671 626905 608539 588270 568055 549497 533373 519797 508773
51855E08773q311n499l072j608j340j945k774l286l439l630m255n200n897n895
$$ 508773 500462 494963 491891 490283 488943 486998 484224 480938 477499 473869 469614 464414 458517 452622
51841D52622n274m407l567k923k743l103l468k975j467J56Q71O93N06R04J495
$$ 452622 447348 442941 439374 436451 433708 430605 427137 424162 422695 422851 423722 424415 424921 425825 427320
51826D27320J546Q68j42j153k212l312l957l555k152n26N62J038J300J592J870
$$ 427320 428866 429734 429592 428439 426227 422915 418958 415403 413251 412725 413287 414325 415625 417217 419087
51811D19087K095K317K408K061J139r2j220j983k392k651l005l488l813l633k943
$$ 419087 421182 423499 425907 427968 429107 429015 427795 425812 423420 420769 417764 414276 410463 406830 403887
51796D03887k057j292q65r57j517k075k127j740j344r60j46J084J903J640P27
$$ 403887 401830 400538 399673 398716 397199 395124 392997 391257 389913 388953 388807 389891 391794 393434 394161
51781C94161J25P6j00j019k386l181k507m37J815K887K721K803M449P140R070
$$ 394161 394286 394362 394262 393243 390857 387676 385169 384732 386547 389434 392155 394958 399407 406547 415617
51766D15617R268Q501P993P845P178N410K871K52k141m369o437q108r152r561
$$ 415617 424885 433386 441379 449224 456402 461812 464683 464935 462794 458425 451988 443880 434728 425167
51752D25167r343q370o642m660l164k464k347k559k952l038k064P7K484M314N829
$$ 425167 415824 407454 400812 396152 392988 390524 388177 385618 382666 379628 377564 377641 380125 384439 390268
51737C90268P697R616J0392R474P612N840M403L034J698O60Q7k4K47N79L45q55
$$ 390268 397965 407581 417973 427447 435059 440899 445302 448336 450034 450694 450781 450757 451004 451583 451928 451073
51721D51073k582l798l889l293k904k983k869j927n80M4m64j200j040j1R14J240
$$ 451073 448491 444693 440804 437511 434607 431624 428755 426828 426248 426292 425828 424628 423588 423577 424491 425731
51705D25731J527K437L679M297L751K427J084R2o34j141j163m93N71J490K071
$$ 425731 427258 429695 433374 437671 441422 443849 444933 445025 444391 443250 442087 441594 442165 443655 445726
51690D45726K430K355J245j021l584n435o315o537o295n702n127m819m318k942
$$ 445726 448156 450511 451756 450735 447151 441716 435401 428864 422569 416867 411740 406921 402603 399661
51676C99661p52J476L135M060M169L547K862K905L546L884L558L157L195L388
$$ 399661 398909 400385 403520 407580 411749 415296 418158 421063 424609 428493 432051 435208 438403 441791
51662D41791L226K562J326n51k493l244k056M74L107M953N454M250J670j141l320
$$ 441791 445017 447579 448905 448354 445861 442617 440561 441035 444142 449095 454549 458799 460469 459328 456008
51647D56008n060o761q038q298p854p534p511p354o953o568o041m907l349k259
$$ 456008 450948 444187 436149 427851 419997 412463 404952 397598 390645 384077 378036 373129 369780 367521
51633C67521k109k409k375j748p75O4K61l42j248j718j512r33k94K92P22R90J324
$$ 367521 365412 363003 360628 358880 358105 358169 358430 358088 356840 355122 353610 352677 352383 352675 353397 354387 355711
51616C55711J785J935J421O31J76k8m11p45m36L13P54R99K015L920N529O130O542
$$ 355711 357496 359431 360852 361483 361659 361631 361220 360475 360039 360352 361106 362105 364120 368040 373569 379699 386241
51599C86241P659Q880R057Q169O997N567L165k08l356n083n287m756m365m363
$$ 386241 393900 402780 411837 420006 427003 432570 435735 435527 432171 427088 421801 417045 412680 408317
51585D08317m154k841l14K434M461N916P530R470J1359J3103J4892J6591J7853
$$ 408317 404163 401322 401008 403442 407903 413819 421349 430819 442178 455281 470173 486764 504617
51572E04617J8750J9613K0353K0764K1354K2868K4888K5968K5591K5168K6456
$$ 504617 523367 542980 563333 584097 605451 628319 653207 679175 704766 729934 756390
51561G56390K9669L3737L7837M1855M5510M7734M7071M2555L4383K3923J2819
$$ 756390 786059 819796 857633 899488 944998 992732 1039803 1082358 1116741 1140664 1153483
51550A153483J904q815j9139k8192l5285m0646m4731m7337m8014m7123m5624m3885
$$ 1153483 1155387 1146572 1127433 1099241 1063956 1023310 978579 931242 883228 836105 790481 746596
51538G46596m1388l7762l3552k9672k6560k4023k1605j8848j5573j2223r695q473
$$ 746596 705208 667446 633894 604222 577662 553639 532034 513186 497613 485390 475695 467222
51526D67222q073p537o467n310m715m777n075n155m863m247l410k578k105k163
$$ 467222 459149 451612 445145 439835 435120 430343 425268 420113 415250 411003 407593 405015 402910 400747
51512D00747k424k324j696r74o47p55j057j435j852k084j828j053J3J159K190
$$ 400747 398323 395999 394303 393329 392682 391927 390870 389435 387583 385499 383671 382618 382631 383790 385980
51497C85980K686K290J290N39M95O49K98m36q07n98m93j087j993k359k079j957
$$ 385980 388666 390956 392246 392785 393280 393929 394227 393791 392984 392386 391893 390806 388813 386454 384375 382418
51481C82418k630l733m379m214l623l083k654k162j505o19N82J974L093L544L488
$$ 382418 379788 376055 371676 367462 363839 360756 358102 355940 354435 353816 354398 356372 359465 363009 366497
51466C66497L463L687L764L221K152J115M47q9q66j792k325k090j295m71L3K55
$$ 366497 369960 373647 377411 380632 382784 383899 384346 384257 383391 381599 379274 377184 375889 375418 375451 375706
51450C75706M93J046J902K646K927L202M537P252J0118J1468J0918R308P199M411
$$ 375706 376199 377245 379147 381793 384720 387922 392459 399711 409829 421297 432215 441523 448722 453133
51436D53133J186j302k142j690p90K17R48L15k398o021q304q289o987n712m770
$$ 453133 454319 453017 450875 449185 448395 448612 449560 449875 447477 441456 433152 424863 417876 412164 407394
51421D07394l975l425l132k630j607m92J46M34Q84J553J973J830J285O41K7n83
$$ 407394 403419 399994 396862 394232 392625 392133 392279 392713 393597 395150 397123 398953 400238 400879 400906 400323
51405D00323j192j664j778j468r62m51K43J368K651L484L708L834M397N537P239
$$ 400323 399131 397467 395689 394221 393259 392808 393051 394419 397070 400554 404262 408096 412493 418030 425269
51390D25269R431J1692J3511J5120J7486K1137K5589L0294L5467M1412M7565N3016
$$ 425269 434700 446392 459903 475023 492509 513646 539235 569529 604996 646408 693973 746989
51378G46989N7546O1457O4533O5791O4176N9140N0890M0613L0014J9891R419k458
$$ 746989 804535 865992 930525 996316 1060492 1119632 1170522 1211135 1241149 1261040 1270459 1268001
51366A268001j5247k7266l7521m6190n3374n8493o1145o1690o0567n7873n3921
$$ 1268001 1252754 1225488 1187967 1141777 1088403 1029910 968765 907075 846508 788635 734714
51355G34714m9490m5005m0131l4603k8935k3904j9817j6697j4640j3423j2282
$$ 734714 685224 640219 600088 565485 536550 512646 492829 476132 461492 448069 435787
51344D35787j0688r042q014p521o888n851m817m192l993m017l988l608k814j974
$$ 435787 425099 416057 408043 400522 393634 387783 382966 378774 374781 370764 366776 363168 360354 358380
51330C58380j469j216q74m53l22o25j110j522j779j767j329n92K0K32J86J46J72
$$ 358380 356911 355695 354821 354368 354046 353421 352311 350789 349010 347243 345914 345322 345342 345574 345760 345906 346078
51313C46078J93K68N49R35J005L80p14j432j111r3N67L35j99k34Q5j26j240k586
$$ 346078 346271 346539 347088 348023 349028 349408 348694 347262 346151 346058 346625 346960 346761 346527 346612 346486 345246 342660
51295C42660l266l121k685k481k505k381j767p32L23J105J736K490L331L921M057
$$ 342660 339394 336273 333588 331107 328602 326221 324454 323722 324045 325150 326886 329376 332707 336628 340685
51280C40685L908L767L775L857L804L393K699K239K514L341L923L727L013K363
$$ 340685 344593 348360 352135 355992 359796 363189 365888 368127 370641 373982 377905 381632 384645 387008
51266C87008J926J428O84j98j079j934k700l273l649l902l992l795l361k955k778
$$ 387008 388934 390362 391046 390848 389769 387835 385135 381862 378213 374311 370319 366524 363163 360208 357430
51251C57430k801k897k991l004k866k662k567k511k134j255k36L73M01N3m98j155
$$ 357430 354629 351732 348741 345737 342871 340209 337642 335131 332997 331742 331506 331879 332280 332333 331835 330680
51235C30680j614j454o25M03J090J238R59N57M43Q03J269J296R70J023J759K534
$$ 330680 329066 327612 326987 327390 328480 329718 330677 331234 331677 332480 333749 335045 336015 337038 338797 341331
51219C41331K594K021J384R43P32J058K124L338L769L325K805K709K685K246J423
$$ 341331 343925 345946 347330 348273 349005 350063 352187 355525 359294 362619 365424 368133 370818 373064 374487
51204C74487N15j94l79P6N37J07j081j765j229l17j72o47q09n03m27q24j059n73
$$ 374487 375002 374808 374429 374505 375042 375149 374068 372303 371074 370757 370585 369938 369129 368626 368199 367375 366316 365743
51186C65743M18J369J972K148J940J570J264J053R42J127J602J821J288M14N9
$$ 365743 366161 367530 369502 371650 373590 375160 376424 377477 378419 379546 381148 382969 384257 384671 384730
51171C84730L11M07o7o80j051j450k089k516k198j305m09J54K62k41j243k172
$$ 384730 385041 385448 385381 384701 383650 382200 380111 377595 375397 374092 373683 373837 374099 373858 372615 370443
51155C70443k557k512k312j897j197n63l38l02j02J49K25L83Q64J174O94j84m98
$$ 370443 367886 365374 363062 361165 359968 359405 359067 358765 358663 358812 359037 359420 360284 361458 362152 361968 361470
51138C61470j31J61J26K86O91O16j4k02N01R59J97q42n65Q40J691J356R94J674
$$ 361470 361339 361500 361626 361912 362603 363219 363205 363003 363504 364463 364660 363818 363253 364093 365784 367140 368134 369808
51120C69808K945L818M119M280M475M547M330L744K853K092J884J867J191k28
$$ 369808 372753 376571 380690 384970 389445 393992 398322 402066 404919 407011 408895 410762 411953 411725
51106D11725j400j574j088n01K70J308J921J444L58l49n07o26o92j41J060K195
$$ 411725 410325 408751 407663 407162 407432 408740 410661 412105 412463 412114 411607 410981 410289 410148 411208 413403
51090D13403K737K721K217J307O05R06K035K813K475J442M92j08l38j00L52M43
$$ 413403 416140 418861 421078 422385 422990 423896 425931 428744 431219 432661 433153 433045 432707 432607 432959 433402
51074D33402J06LM47Q43P33O54J232K102K586K935L896N404O733P764Q993J0301
$$ 433402 433508 433511 433958 434801 435534 436188 437420 439522 442108 445043 448939 454343 461076 468840 477833 488134
51058D88134J0719R712P873O045M490L353L217M578P067R680J1540J2292J2045
$$ 488134 498853 508565 516438 522483 526973 530326 533543 538121 545188 554868 566408 578700 590745
51045E90745J1277J0506R808Q761P047M840K506L10j424k364k796l841o490j0485
$$ 590745 602022 612528 622336 631097 638144 642984 645490 645800 644376 642012 639216 635375 628885 618400
51031F18400j4529j7468j8869j8618j6759j3877j1119r296q113o626m405j934
$$ 618400 603871 586403 567534 548916 532157 518280 507161 497865 489752 483126 478721 476787
51019D76787N6J377K395L503M729N818O454O489O096N770O002O778P452P299O305
$$ 476787 476843 478220 480615 484118 488847 494665 501119 507608 513704 519474 525476 532254 539706 547005 553310
51004E53310N345N417O609P955Q453Q209Q316R492J1203J2389J2815J3143J3778
$$ 553310 558655 564072 570681 578636 587089 595298 603614 613106 624309 636698 649513 662656 676434
50991F76434J4233J4022J3543J3589J4280J5108J5896J6911J7837J7391J4641
$$ 676434 690667 704689 718232 731821 746101 761209 777105 794016 811853 829244 843885
50980H43885J0381O584M410L387K629K261L098N317Q216J1338J5005J9460K4100
$$ 843885 854266 860850 865260 868647 871276 873537 876635 881952 890168 901506 916511 935971 960071
50967I60071K8201L2002L6288M1105M5628M9308N2322N4751N6143N6306N5787
$$ 960071 988272 1020274 1056562 1097667 1143295 1192603 1244925 1299676 1355819 1412125 1467912
50956A467912N4976N3380N0442M6651M3049L9955L6966L3960L1225K8616K5686
$$ 1467912 1522888 1576268 1626710 1673361 1716410 1756365 1793331 1827291 1858516 1887132 1912818
50945A912818K2796K1158K1156K1378J9941J6513J2344Q692N841L552J684Q4j734
$$ 1912818 1935614 1956772 1977928 1999306 2019247 2035760 2048104 2056796 2062637 2066189 2067873 2067957 2066223
50932B066223m417q331j3381j9160k5110l0677l5586m0079m4768m9958n5077n8956
$$ 2066223 2061806 2053475 2040094 2020934 1995824 1965147 1929561 1889482 1844714 1794756 1739679 1680723
50920A680723o0821o0929o0104n8837n6973n4172n0366m5804m0978l6497l2804
$$ 1680723 1619902 1558973 1498869 1440032 1383059 1328887 1278521 1232717 1191739 1155242 1122438
50909A122438k9871k7330k4900k2555k0342j8313j6630j5446j4558j3493j2057
$$ 1122438 1092567 1065237 1040337 1017782 997440 979127 962497 947051 932493 919000 906943
50898I06943j0573r407q439p308n977m881m493m851n457n604m875l476j992p50
$$ 906943 896370 886963 878524 871216 865239 860358 855865 851014 845557 839953 835078 831602 829610 828860
50884H28860M23J807L269M382M887M859M470L883L436L608M580N917P021P861
$$ 828860 829283 831090 834359 838741 843628 848487 852957 856840 860276 863884 868464 874381 881402 889263
50870H89263Q990J0774J2873J4742J6307J7855J9419K0866K2535K5084K8527L1998
$$ 889263 898253 909027 921900 936642 952949 970804 990223 1011089 1033624 1058708 1087235 1119233
50858A119233L4917L7855M1800M6931N2759N9134O6285P3999Q1542Q8633R5716
$$ 1119233 1154150 1192005 1233805 1280736 1333495 1392629 1458914 1532913 1614455 1703088 1798804
50847A798804J03062J10124J16197J21208J25363J28349J29422J28170J24761
$$ 1798804 1901866 2011990 2128187 2249395 2374758 2503107 2632529 2760699 2885460
50838B885460J19379J11739J01389Q8458P4050N9691M6335L4048K2896J3783P965
$$ 2885460 3004839 3116578 3217967 3306425 3380475 3440166 3486501 3520549 3543445 3557228 3565193
50827C565193N659N831P495J0798J6304K3624L1155L7061M0174M0022L6408K9093
$$ 3565193 3570852 3576683 3584178 3594976 3611280 3634904 3666059 3703120 3743294 3783316 3819724 3848817
50815C848817J7849K872j4834l3691n2362p0303q7475j03759j18709j31552j41197
$$ 3848817 3866666 3869538 3854704 3821013 3768651 3698348 3610873 3507114 3388405 3256853 3115656
50804C115656j46522j47100j43594j37233j28964j19272j08574r7340q5842p4166
$$ 3115656 2969134 2822034 2678440 2541207 2412243 2292971 2184397 2087057 2001215 1927049
50794A927049o2577n1550m1355l1860k2973j5069q784m365j528J74R67R91M87
$$ 1927049 1864472 1812922 1771567 1739707 1716734 1701665 1692881 1688516 1686988 1687162 1688129 1689120 1689607
50781A689607l47j603l490n921q469j0808j2944j4981j6915j8774k0714k2834
$$ 1689607 1689260 1687657 1684167 1678246 1669777 1658969 1646025 1631044 1614129 1595355 1574641 1551807
50769A551807k5104k7576l0320l2924l4540l4811l4350l3803l2940l1236k9036
$$ 1551807 1526703 1499127 1468807 1435883 1401343 1366532 1332182 1298379 1265439 1234203 1205167
50758A205167k7220k5810k3868k0895j7526j4530j1932r418o989m670k140Q89
$$ 1205167 1177947 1152137 1128269 1107374 1089848 1075318 1063386 1053968 1046979 1042309 1040169 1041058
50746A041058M253P626J0849J3776J6274J8662K1666K5568K9885L4224L8798M3753
$$ 1041058 1045311 1052937 1063786 1077562 1093836 1112498 1134164 1159732 1189617 1223841 1262639 1306392
50734A306392M8574N2796N6716O0727O4494O7442O9665P1546P2871P3097P2256
$$ 1306392 1354966 1407762 1464478 1525205 1589699 1657141 1726806 1798352 1871223 1944320 2016576
50723B016576P0669O8038O3697N7650N0403M1859L1405J9372P455k734j0793j6815
$$ 2016576 2087245 2155283 2218980 2276630 2327033 2368892 2400297 2419669 2427124 2424390 2413597 2396782
50711B396782k0388k0923j8593j4238q493j486O533J4539K0941K4521K5265K4063
$$ 2396782 2376394 2355471 2336878 2322640 2314147 2312661 2319194 2333733 2354674 2379195 2404460 2428523
50699B428523K1384J6555Q668k064j4459k7486m0535n2639o2506o9577p4218p6575
$$ 2428523 2449907 2466462 2475130 2473066 2458607 2431121 2390586 2337947 2275441 2205864 2131646 2055071
50687B055071p5999p2225o6282n9523n2173m3716l4261k4700j5567o592K462J1234
$$ 2055071 1979072 1906847 1840565 1781042 1728869 1685153 1650892 1626192 1610625 1604033 1606495 1617729
50675A617729J9295K6720L3728M0063M5061M8267M9683M9484M7753M4591M0349
$$ 1617729 1637024 1663744 1697472 1737535 1782596 1830863 1880546 1930030 1977783 2022374 2062723
50664B062723L5528L0446K5180J9903J5116J1283Q316N670K992M49j643l309m825
$$ 2062723 2098251 2128697 2153877 2173780 2188896 2200179 2208495 2214165 2217157 2217606 2215963 2212654 2207829
50651B207829o319p521p937p213n456l114m68K685O615J1114J5670K0095K4567
$$ 2207829 2201510 2193989 2186052 2178839 2173383 2170269 2169801 2172486 2179101 2190215 2205885 2225980 2250547
50638B250547K9014L2848L5478L6769L6944L6365L5552L4949L4510L3811L2589
$$ 2250547 2279561 2312409 2347887 2384656 2421600 2457965 2493517 2528466 2562976 2596787 2629376
50627B629376L0456K5816J5961n93k1885m3166n9866o9757p2820p0125o3159n3561
$$ 2629376 2659832 2685648 2701609 2701016 2679131 2635965 2576099 2506342 2433522 2363397 2300238 2246677
50615B246677m2790l1952k1856j2972n376R17N507P878Q123O899M454J80o509
$$ 2246677 2203887 2171935 2150079 2137107 2131731 2132648 2138155 2146033 2154156 2161055 2165509 2165689 2159180
50602B159180j5121k4322l3092m1209m8711n5319o0563o4165o6087o6317o4850
$$ 2159180 2144059 2119737 2086645 2045436 1996725 1941406 1880843 1816678 1750591 1684274 1619424
50591A619424o1900n8003n3780m9548m5317m1095l7056l3227k9286k4945k0524
$$ 1619424 1557524 1499521 1445741 1396193 1350876 1309781 1272725 1239498 1210212 1185267 1164743
50580A164743j6651j3378j0089o490l211q59J024L366N999P604P466O560O373
$$ 1164743 1148092 1134714 1124625 1118135 1114924 1114065 1115089 1118455 1124454 1132058 1139524 1146084 1152457
50567A152457P199Q275R253J0640J2770J5194J7513K0257K4275K9467L4675L8924
$$ 1152457 1159656 1167931 1177184 1187824 1200594 1215788 1233301 1253558 1277833 1307300 1341975 1380899
50555A380899M2370M5783M9317N2111N3141N2201M9900M6857M3270L9326L5611
$$ 1380899 1423269 1469052 1518369 1570480 1623621 1675822 1725722 1772579 1815849 1855175 1890786
50544A890786L2844L1300L0907L1721L3905L7197M0870M4393M7856N1597N5674
$$ 1890786 1923630 1954930 1985837 2017558 2051463 2088660 2129530 2173923 2221779 2273376 2329050
50533B329050N9983O4584O9643P5100Q0719Q6361R2057R7803J03338J07973J10671
$$ 2329050 2389033 2453617 2523260 2598360 2679079 2765440 2857497 2955300 3058638 3166611 3277282
50522C277282J10587J07706J02728R6119Q7474P6017O1529M4559K6042O966j1870
$$ 3277282 3387869 3495575 3598303 3694422 3781896 3857913 3919442 3964001 3990043 3997009 3985139
50511C985139l0158m8010o5340q1376r5031j05489j12129j14321j11889j05622
$$ 3985139 3954981 3906971 3841631 3760255 3665224 3559735 3447606 3333285 3221396 3115774
50501C115774r6670q5502p1961n6370l9823k3324p257Q056K1831L3209M1669M6606
$$ 3115774 3019104 2933602 2861641 2805271 2765448 2742124 2734867 2742923 2764754 2797963 2839632 2886238
50489B886238M6900M1431L0056J3864n383k5941m6353o5453q2123r5260j04269
$$ 2886238 2933138 2974569 3004625 3018489 3013106 2987165 2940812 2875359 2793236 2697976 2593707
50478B593707j09541j11987j12017j09414j04365r8031r1698q5825q0287p5149
$$ 2593707 2484166 2372179 2260162 2150748 2046383 1948352 1856654 1770829 1690542 1615393
50468A615393p0539o6063o1113n5700n0413m5465m0436l5099l0010k5871k2636
$$ 1615393 1544854 1478791 1417678 1361978 1311565 1266100 1225664 1190565 1160555 1134684 1112048
50457A112048j9605j6283j2840r715p064m673k369l22J112J867K288K791L479
$$ 1112048 1092443 1076160 1063320 1053605 1046541 1041868 1039499 1039177 1040289 1042156 1044444 1047235 1050714
50444A050714M229M999N789O406O548O243O003O319P071P727Q129Q873J0682J3465
$$ 1050714 1054943 1059942 1065731 1072137 1078685 1084928 1090931 1097250 1104321 1112048 1120177 1129050 1139732 1153197
50430A153197J6322J8503K0057K1386K2555K3427K4283K5691K7730K9773L1281
$$ 1153197 1169519 1188022 1208079 1229465 1252020 1275447 1299730 1325421 1353151 1382924 1414205
50419A414205L2384L3573L5230L7667M1178M5592N0103N4030N7539O1144O4621
$$ 1414205 1446589 1480162 1515392 1553059 1594237 1639829 1689932 1743962 1801501 1862645 1927266
50408A927266O7030O7727O6852O4744O1425N6916N1499M5308L7921K8804J8018
$$ 1927266 1994296 2062023 2128875 2193619 2255044 2311960 2363459 2408767 2446688 2475492 2493510
50397B493510O203o036j8404l0655m2442n3351o2862p0236p4803p6547p6096p3928
$$ 2493510 2499713 2493677 2475273 2444618 2402176 2348825 2285963 2215727 2140924 2064377 1988281 1914353
50385A914353o9889o3684n5655m6650l7207k7351j7244p587Q88P987J3758J7873
$$ 1914353 1844464 1780780 1725125 1678475 1641268 1613917 1596673 1589086 1589974 1597961 1611719 1629592
50373A629592J9662J8741J5351J0046L293m640j3504k2796l1656l9173m4914m8932
$$ 1629592 1649254 1667995 1683346 1693392 1696685 1692045 1678541 1655745 1624089 1584916 1540002 1491070
50361A491070n1164n1312m9664m7505m5979m4739m2578l9317l6172l3976l2054
$$ 1491070 1439906 1388594 1338930 1291425 1245446 1200707 1158129 1118812 1082640 1048664 1016610
50350A016610k9374k6083k3070k0527j7843j4780j1956j0009q842p821o457m783
$$ 1016610 987236 961153 938083 917556 899713 884933 872977 862968 854126 846305 839848 835065
50338H35065l291k464k188j788q86K7K99J27L34J208K179K668K683K499K289K296
$$ 835065 831774 829310 827122 825334 824448 824475 824774 824901 825235 826443 828622 831290 833973 836472 838761 841057
50322H41057K858L910M793M928M451L964L881M242M927N785O735P981R845J2242
$$ 841057 843915 847825 852618 857546 861997 865961 869842 874084 879011 884796 891531 899512 909357 921599
50308I21599J4503J6116J7391J8952K0745K2012K2339K2134K1862K1212J9425
$$ 921599 936102 952218 969609 988561 1009306 1031318 1053657 1075791 1097653 1118865 1138290
50297A138290J6291J2418Q532M894J548j177k691k749j829p99j45M90J885M371
$$ 1138290 1154581 1166999 1175531 1180425 1181973 1180796 1178105 1175356 1173527 1172728 1172583 1173073 1174958 1179329
50283A179329P459J0538J3632J6895J9182J7881J1055l00j2706k2939k9803l3409
$$ 1179329 1186788 1197326 1210958 1227853 1247035 1264916 1275971 1275671 1262965 1240026 1210223 1176814
50271A176814l3878l1528k7608k3733k0588j7816j5154j2869j1060r249p064m734
$$ 1176814 1142936 1111408 1083800 1060067 1039479 1021663 1006509 993640 982580 973331 966267 961533
50259I61533k529j85K584N405P559Q864R693J0228J0238R642Q875Q417Q231P870
$$ 961533 959004 958819 961403 966808 974367 983231 992924 1003152 1013390 1023032 1031907 1040324 1048555 1056425
50245A056425O956N417L447J376m69k017l453m957o468p768q674r111r156r104
$$ 1056425 1063381 1068798 1072245 1073621 1073152 1071135 1067682 1062725 1056257 1048489 1039815 1030704 1021548 1012444
50231A012444r300r681r664q758p232n790m574k891j19L485P227J0954J5132K0020
$$ 1012444 1003144 993463 983799 975041 967809 962019 957445 954554 954435 957920 965147 976101 991233 1011253
50217A011253K5230L0301L5289M0464M5573M9742N2165N2690N1693M9596M6636
$$ 1011253 1036483 1066784 1102073 1142537 1188110 1237852 1290017 1342707 1394400 1443996 1490632
50206A490632M3066L9312L5765L2577K9753K7409K5509K3317J9415J2643K911
$$ 1490632 1533698 1573010 1608775 1641352 1671105 1698514 1724023 1747340 1766755 1779398 1782309
50195A782309r014k2236l5839m8530n8835o5879o9695p0685o9110o5249n9690
$$ 1782309 1773295 1751059 1715220 1666690 1607855 1541976 1472281 1401596 1332486 1267237 1207547
50184A207547n3169m6311l9638l3572k8260k3613j9772j7396j7140j8908k1707
$$ 1207547 1154378 1108067 1068429 1034857 1006597 982984 963212 945816 928676 909768 888061
50173H88061k4157k5150k4286k1972j9027j6044j3214j0708q805p464o113m276
$$ 888061 863904 838754 814468 792496 773469 757425 744211 733503 724698 717234 711121 706845
50161G06845k174l44J119K451L565M057M008M149N013O183O759O376N424M345
$$ 706845 704671 704327 705446 707897 711462 715519 719527 723676 728689 734872 741631 748007 753431 757776
50147G57776L053J300o45k026k425k263k139j933j068M28J744K355K768L785N496
$$ 757776 760829 762129 761484 759458 757033 754770 752631 750698 749630 750058 751802 754157 756925 760710 766206
50132G66206P395R111J0428J0927J0322R100Q205Q006Q081Q027P991Q254Q818
$$ 766206 773601 782712 793140 804067 814389 823489 831694 839700 847781 855808 863799 872053 880871
50119H80871R571J0486J1392J1908J1858J1562J1547J2129J3323J5009J7061J9524
$$ 880871 890442 900928 912320 924228 936086 947648 959195 971324 984647 999656 1016717 1036241
50107A036241K2578K6195K9991L3807L8263M4206N1651N9788O8050P6462Q4817
$$ 1036241 1058819 1085014 1115005 1148812 1187075 1231281 1282932 1342720 1410770 1487232 1572049
50096A572049R2280R8200J02660J05671J06503J04480J00132R4886Q9894Q5688
$$ 1572049 1664329 1762529 1865189 1970860 2077363 2181843 2281975 2376861 2466755 2552443
50086B552443Q2536Q0293P7922P3922O7293N7541M4003K6029M125j9855m3796
$$ 2552443 2634979 2715272 2793194 2867116 2934409 2991950 3035953 3061982 3066107 3046252 3002456
50075C002456o6097q5341j00197j10329j16712j20393j21426j19547j15339j09838
$$ 3002456 2936359 2851018 2750821 2640492 2523780 2403387 2281961 2162414 2047075 1937237
50065A937237j03279r5169q5552p5410o5786n7210m9923m3817l8021l1580k4983
$$ 1937237 1833958 1738789 1653237 1577827 1512041 1454831 1404908 1361091 1323070 1291490 1266507
50054A266507k0066j7713j6508j4518j1715r494q295p098n231l377k363k077k132
$$ 1266507 1246441 1228728 1212220 1197702 1185987 1176493 1168198 1161100 1155869 1152492 1150129 1148052 1145920
50041A145920k709l950n275o041o468p090p705p739p433p689q677r413r037p933
$$ 1145920 1143211 1139261 1133986 1127945 1121477 1114387 1106682 1098943 1091510 1083821 1075144 1065731 1056694 1048761
50027A048761p178p305p985q679r181r605j0061j0422j0394r869r174q859r178
$$ 1048761 1041583 1034278 1026293 1017614 1008433 998828 988767 978345 967951 958082 948908 940049 930871
50014I30871r837j0227r906q907p720o838o198n236l620j710r5J224K813N069
$$ 930871 921034 910807 900901 891994 884274 877436 871238 866002 862382 860672 860577 861801 864614 869683
50000H69683P808J0563J2958J4730J5629J5503J4359J2427J0263Q626P987Q088
$$ 869683 877491 888054 901012 915742 931371 946874 961233 973660 983923 992549 1000536 1008624
49988A008624Q246Q049P613P323P557Q635J0735J3767J7531K1971K7130L2948
$$ 1008624 1016870 1024919 1032532 1039855 1047412 1056047 1066782 1080549 1098080 1120051 1147181 1180129
49976A180129L9139M5145N0077N3039N3773N2717N0179M5965M0382L5090L2005
$$ 1180129 1219268 1264413 1314490 1367529 1421302 1474019 1524198 1570163 1610545 1645635 1677640
49965A677640L1350L1658L1630L1100K9891K6689J9754Q466o157k2004l6716m8626
$$ 1677640 1708990 1740648 1772278 1803378 1833269 1859958 1879712 1888178 1882021 1860017 1823301 1774675
49953A774675n7353o3321o6508o6327o2977n8165n3762n0204m6756m3011l9302
$$ 1774675 1717322 1654001 1587493 1521166 1458189 1400024 1346262 1296058 1249302 1206291 1166989
49942A166989l6018l3249l1197l0228l0338l0963l1498l1747l1803l1691l1168
$$ 1166989 1130971 1097722 1066525 1036297 1005959 974996 943498 911751 879948 848257 817089
49931H17089k9799k7399k4453k1788j9601j7234j4244j1312r446q582p615n794
$$ 817089 787290 759891 735438 713650 694049 676815 662571 651259 641813 633231 625616 619822
49919F19822l425j221M21J389J728J854K324L167L760L769L911N329Q240J1517
$$ 619822 616397 615176 615597 616986 618714 620568 622892 626059 629819 633588 637499 642828 651068 662585
49905F62585J3636J4044J3535J3405J4185J5285J5749J5099J3366J0681P323L892
$$ 662585 676221 690265 703800 717205 731390 746675 762424 777523 790889 801570 808893 812785
49893H12785R47j578m180o970r505j1473j3053j4478j5647j6470j7080j7502j7406
$$ 812785 813732 812154 807974 801004 791499 780026 766973 752495 736848 720378 703298 685796 668390
49880F68390j6591j5386j4252j3267j2293j1361j0399q967o804m472k882k142
$$ 668390 651799 636413 622161 608894 596601 585240 574841 565874 559070 554598 551716 549574
49868E49574j481l33J069K316L442M619N793P021Q713J1006J3237J4657J5390
$$ 549574 548093 547760 548829 551145 554587 559206 564999 572020 580733 591739 604976 619633 635023
49855F35023J6076J6719J6577J5268J3235J0901Q131M963K258R06N77j08k169
$$ 635023 651099 667818 684395 699663 712898 723799 731930 736893 739151 740057 740634 740526 738357
49842G38357n379q692j1192j2578j3097j3107j2666j1652j0296r172q349p045
$$ 738357 732978 724286 713094 700516 687419 674312 661646 649994 639698 630526 622177 615132
$$ [...]
##END NTUPLES=NMR SPECTRUM
##END=
