##TITLE=AC1674_BRAAN14382_8571041_oG2NHC0tQb
##JCAMPDX= 6.0         $$ Bruker NMR JCAMP-DX V2.0
##DATA TYPE= NMR SPECTRUM
##DATA CLASS= NTUPLES
##ORIGIN= BRUKER
##OWNER= Administrator
$$ 1.72 TOPSPIN		Version 2.1
$$ 2014-04-11 18:57:28.564 -0700  Administrator@X
$$ Compression mode = diff/dup
##.OBSERVE FREQUENCY= 400.02188249412
##.OBSERVE NUCLEUS= ^1H
##.ACQUISITION MODE= SIMULTANEOUS (DQD)
##.ACQUISITION SCHEME= undefined
##.AVERAGES= 8
##.DIGITISER RES= 22
##SPECTROMETER/DATA SYSTEM= spect
##.PULSE SEQUENCE= zg30
##.SOLVENT NAME= COFFEE_meoh
##.SHIFT REFERENCE= INTERNAL, COFFEE_meoh, 1, 14.98509
##AUDIT TRAIL= $$ (NUMBER, WHEN, WHO, WHERE, PROCESS, VERSION, WHAT)
$$ ##TITLE= Audit trail, TOPSPIN		Version 2.1
$$ ##JCAMPDX= 5.01
$$ ##ORIGIN= Bruker BioSpin GmbH
$$ ##OWNER= Administrator
$$ $$ E:\/data/COFFEE/nmr/AC1674_BRAAN14382_8571041_oG2NHC0tQb/10/pdata/1/auditp.txt
$$ ##AUDIT TRAIL=  $$ (NUMBER, WHEN, WHO, WHERE, PROCESS, VERSION, WHAT)
(   1,<2014-04-11 18:57:21.283 -0700>,<Administrator>,<X>,<go>,<TOPSPIN 2.1>,
      <created by zg
	started at 2014-04-11 18:56:15.064 -0700,
	POWCHK enabled, PULCHK disabled,
       configuration hash MD5:
       C8 4E 4E 5D D3 5C D8 9E 9F 52 82 E0 59 8A DE 15
       data hash MD5: 64K
       33 E0 66 B8 E8 87 BB 91 CF A4 75 24 09 B0 FD 78>)
(   2,<2014-04-11 18:57:24.267 -0700>,<Administrator>,<X>,<proc1d>,<TOPSPIN 2.1>,
      <Start of raw data processing
       efp LB = 0 FT_mod = 6 PKNL = 1 PHC0 = 0 PHC1 = 0 SI = 32K 
       data hash MD5: 32K
       90 20 B8 2D 22 AF 2F E1 F6 1E 8D 00 0E 9D 94 E2>)
(   3,<2014-04-11 18:57:24.564 -0700>,<Administrator>,<X>,<proc1d>,<TOPSPIN 2.1>,
      <pk PHC0 = 92.74109 PHC1 = 0 
       data hash MD5: 32K
       E1 0B 07 19 1E 4F 4D 52 1C 87 56 0E 4B 84 1D 5B>)
(   4,<2014-04-11 18:57:24.689 -0700>,<Administrator>,<X>,<proc1d>,<TOPSPIN 2.1>,
      <abs ABSG = 1 
       data hash MD5: 32K
       2E 5E 0E C0 E7 C0 F4 56 43 9F 56 89 5C 42 6B 6B>)
(   5,<2014-04-11 18:57:24.736 -0700>,<Administrator>,<X>,<proc1d>,<TOPSPIN 2.1>,
      <abs ABSG = 2 
       data hash MD5: 32K
       C3 A5 A3 14 FE 77 32 3D 0B A9 A0 14 EE 65 13 BD>)
(   6,<2014-04-11 18:57:24.830 -0700>,<Administrator>,<X>,<proc1d>,<TOPSPIN 2.1>,
      <abs ABSG = 3 
       data hash MD5: 32K
       6D C1 01 F1 3A A2 48 82 A6 4D CD 4C 4C 07 93 29>)
(   7,<2014-04-11 18:57:24.924 -0700>,<Administrator>,<X>,<proc1d>,<TOPSPIN 2.1>,
      <abs ABSG = 4 
       data hash MD5: 32K
       B8 AC DB 1B 7F 65 FD F1 4B 93 C3 4B 8F DC 91 E7>)
(   8,<2014-04-11 18:57:25.033 -0700>,<Administrator>,<X>,<proc1d>,<TOPSPIN 2.1>,
      <abs ABSG = 5 
       data hash MD5: 32K
       66 C5 C2 25 C9 49 2A 20 D1 EF 31 B9 44 3D CC BA>)
$$ ##END=
$$ 
$$ $$ hash MD5
$$ $$ 14 F9 B8 56 82 8F CB DD A4 21 4C F7 4D 34 1C 12
##$RELAX= 
##$RELAX= 
##$RELAX= 
##$RELAX= 
##$RELAX= 
##$RELAX= 
##$RELAX= 
$$ Bruker specific parameters
$$ --------------------------
##$DU= <E:\>
##$EXPNO= 10
##$NAME= <AC1674_BRAAN14382_8571041_oG2NHC0tQb>
$$ [...]
##$TP= (0..7)
150 150 150 150 150 150 150 150
##$TP07= 0
##$TPNAME0= <>
##$TPNAME1= <>
##$TPNAME2= <>
##$TPNAME3= <>
##$TPNAME4= <>
##$TPNAME5= <>
##$TPNAME6= <>
##$TPNAME7= <>
##$TPOAL= (0..7)
0.5 0.5 0.5 0.5 0.5 0.5 0.5 0.5
##$TPOFFS= (0..7)
0 0 0 0 0 0 0 0
##$TUNHIN= 0
##$TUNHOUT= 0
##$TUNXOUT= 0
##$USERA1= <user>
##$USERA2= <user>
##$USERA3= <user>
##$USERA4= <user>
##$USERA5= <user>
##$V9= 5
##$VALIST= <valist>
##$VCLIST= <CCCCCCCCCCCCCCC>
##$VD= 0
##$VDLIST= <DDDDDDDDDDDDDDD>
##$VPLIST= <PPPPPPPPPPPPPPP>
##$VTLIST= <TTTTTTTTTTTTTTT>
##$WBST= 1024
##$WBSW= 4
##$XGAIN= (0..3)
0 0 0 0
##$XL= 0
##$YL= 0
##$YMAX_a= 639056
##$YMIN_a= -541939
##$ZGOPTNS= <>
##$ZL1= 120
##$ZL2= 120
##$ZL3= 120
##$ZL4= 120
##$ABSF1= 14.98509
##$ABSF2= -5.573092
##$ABSG= 5
##$ABSL= 3
##$ALPHA= 0
##$AQORDER= 0
##$ASSFAC= 0
##$ASSFACI= 0
##$ASSFACX= 0
##$ASSWID= 0
##$AUNMP= <proc_prof1d_extract_pilot.lims>
##$AXLEFT= 0
##$AXNAME= <>
##$AXNUC= <1H>
##$AXRIGHT= 0
##$AXTYPE= 0
##$AXUNIT= <>
##$AZFE= 0.1
##$AZFW= 0.1
##$BCFW= 0
##$BC_mod= 0
##$BYTORDP= 0
##$COROFFS= 0
##$CY= 15
##$DATMOD= 1
##$DC= 0
##$DFILT= <>
##$DTYPP= 0
##$F1P= 0
##$F2P= 0
##$FCOR= 0.5
##$FTSIZE= 32768
##$FT_mod= 6
##$GAMMA= 0
##$GB= 0
##$INTBC= 1
##$INTSCL= 1
##$ISEN= 128
##$LB= 0
##$LEV0= 0
##$LPBIN= 0
##$MAXI= 10000
##$MC2= 0
##$MEAN= 0
##$ME_mod= 0
##$MI= 0
##$NCOEF= 0
##$NC_proc= -8
##$NLEV= 6
##$NOISF1= 0
##$NOISF2= 0
##$NSP= 0
##$NTH_PI= 0
##$NZP= 0
##$OFFSET= 14.98509
##$PC= 1
##$PHC0= 92.74109
##$PHC1= 0
##$PH_mod= 1
##$PKNL= yes
##$PPARMOD= 0
##$PPDIAG= 0
##$PPIPTYP= 0
##$PPMPNUM= 2147483647
##$PPRESOL= 1
##$PSCAL= 4
##$PSIGN= 0
##$PYNMP= <proc.py>
##$REVERSE= no
##$SF= 400.02
##$SI= 32768
##$SIGF1= 0
##$SIGF2= 0
##$SINO= 400
##$SIOLD= 32768
##$SPECTYP= <>
##$SREGLST= <1H.CDCl3>
##$SSB= 0
##$STSI= 32768
##$STSR= 0
##$SW_p= 8223.68421052631
##$SYMM= 0
##$S_DEV= 0
##$TDeff= 65536
##$TDoff= 0
##$TI= <>
##$TILT= no
##$TM1= 0
##$TM2= 0
##$TOPLEV= 0
##$USERP1= <user>
##$USERP2= <user>
##$USERP3= <user>
##$USERP4= <user>
##$USERP5= <user>
##$WDW= 1
##$XDIM= 32768
##$YMAX_p= 466941293
##$YMIN_p= -784552
##$CURPLOT= <Network HP LaserJet P1505>
##$CURPRIN= <$Network HP LaserJet P1505>
##$DFORMAT= <normdp>
##$LAYOUT= <+/1D_H.xwp>
##$LFORMAT= <normlp>
##$PFORMAT= <normpl>
##$SURQMSG= 1
$$ End of Bruker specific parameters
$$ ---------------------------------
##NTUPLES= NMR SPECTRUM
##VAR_NAME=  FREQUENCY,     SPECTRUM/REAL,   SPECTRUM/IMAG
##SYMBOL=    X,             R,               I
##VAR_TYPE=  INDEPENDENT,   DEPENDENT,       DEPENDENT
##VAR_FORM=  AFFN,          ASDF,            ASDF
##VAR_DIM=   32768,         32768,           32768
##UNITS=     HZ,            ARBITRARY UNITS, ARBITRARY UNITS
##FACTOR=    0.250966925370066, 1,           1
##FIRST=     8223.43324360094, 177827,       -3019
##LAST=      0,             77015,           -121727
##MIN=       0,             -784552,         0
##MAX=       8223.43324360094, 466941293,    0
$$ Real data points
##PAGE= N=1
##DATA TABLE= (X++(R..R)), XYDATA
$$ [...]
$$ plain form
19549 105472 -50683 196777 -119112 24689 13560 -5431 346066 -76187 185730 -187433 256693
19537 43265 -174905 -69711 -156818 -136440 -103019 124848 113593 84467 -165039 -128260 39485
19525 -59138 -7493 -353460 2569 -141088 -156526 -103067 220742 13489 56424 -83312 223846
19513 -141557 156484 -10794 172655 99903 72033 -141613 -122552 182589 179838 -351646 193653
19501 446278 360041 -233976 -6704 -222988 15290 -100554 330861 111136 -155078 -252057
19491 -252057 -186127 51117 -417669 55742 -254892 -40178 206386 -105037 80795 65314 -210293
19479 -120438 -302033 27867 138756 62334 42619 -1292 -384759 -230932 -346287 192966
19468 -192362 -76633 -131878 36373 -182681 177161 221108 -14943 11722 -302344 -6141 -23482
$$ packed form
19549A05472e0683A96777a19112B4689j1129e431C46066g6187A85730a87433B56693
19537D3265a74905f9711q7107K0378L3421A24848j1255k9126a65039L6779C9485
19525e9138g493l45967B569a41088j5438N3459B20742A3489M2935h3312B23846
19513a41557A56484a0794A72655p2752k7870a41613J9061A82589k751c51646A93653
19501D46278q6237b33976f704k16284A5290a00554C30861A11136a55078r6979
19491b52057O5930E1117d17669E5742b54892d0178B06386a05037H0795j5481b10293
19479a20438j81595B7867J10889F2334j9715a292l83467J53827j15355A92966
19468a92362g6633n5245C6373a82681A77161M3947a4943A1722c02344f141j7341
$$ plain form
19457 -23482 -189100 -126780 45365 65581 -217031 71291 -331573 -125544 7955 -447293 -155857
19445 -329908 57026 -81910 -282187 49967 31640 -309470 -149498 138999 252028 -25770
19434 -222590 -17455 155864 119882 269955 -90750 329538 28143 -267247 -183765 481411
19423 67774 -185363 -769 -2040 -213383 181520 -128033 -13604 -288962 194604 74078 -176485
19411 -125634 -148902 35165 52198 78383 -291043 31312 -68515 -136921 144636 -178736 144264
19399 -232744 177188 76017 -187880 40949 -149029 221423 -324271 -287787 43916 -83829
19388 155617 55544 120116 77658 138766 -6337 -492904 498773 -173665 -180263 -128424 41278
19376 -308616 -228630 73751 48051 18322 -287628 -204668 -271605 -384195 -130769 -231998 164956
$$ packed form
19457b3482j65618O2320D5365K0216b17031G1291c31573a25544G955d47293a55857
19445c29908E7026h1910k00277D9967j8327c09470a49498A38999J13029b5770
19434b22590a7455A55864l5982J50073i0750C29538B8143b67247Q3482D81411
19423F7774a85363g69j271k11343A81520a28033a3604k75358A94604G4078a76485
19411a25634k3268C5165J7033K6185b91043C1312f8515o8406A44636a78736A44264
19399b32744A77188G6017a87880D0949a49029B21423c24271L6484D3916h3829
19388A55617E5544O4572m2458O1108f337m86567D98773a73665o598N1839D1278
19376c08616P9986G3751k5700A8322b87628Q2960o6937j12590a30769j01229A64956
$$ plain form
19364 -152753 -18062 -116010 77866 -160578 -107937 -127557 -11078 -284382 -97410 -198323 -65071
19352 38928 210441 -257952 -155560 226176 -240934 -320246 -269009 -142302 -1305 34458 122468
19341 122468 -24787 64561 19740 -62776 -80006 316035 -175130 -25584 397652 -218024 -320747
19330 -320747 -81961 -90895 -104776 157047 197774 -207838 -88644 -366331 68423 -173988 -114580
19319 -114580 -68828 -139208 -172662 296 -54226 -168780 76769 -100009 -365790 -199228 171475
19307 -111827 -165605 163768 -112181 -23576 314419 61143 -97645 -16831 160657 -161336
19296 5396 -258464 263775 -145016 -63836 -62483 121687 31381 -109907 -99564 133832 -115064
19284 -129588 -206169 -280456 43423 -227799 62698 280894 -467025 -90093 -242317 -147532 54763
$$ packed form
19364a52753a8062r7948G7866a60578N2641j9620a1078k73304i7410j00913f5071
19352C8928J71513b57952J02392B26176b40934p9312N1237J26707a305C4458Q8010
19341A22468b4787F4561A9740f2776j7230C16035a75130b5584C97652b18024j02723
19330c20747h1961q934j3881A57047M0727b07838h8644k77687F8423a73988N9408
19319a14580M5752p0380l3454B96e4226j14554G6769a00009k65781J66562A71475
19307a11827n3778A63768a12181b3576C14419F1143i7645a6831A60657a61336
19296E396b58464B63775a45016f3836J353A21687C1381a09907J0343A33832a15064
19284a29588p6581p4287D3423b27799F2698K18196d67025i0093j52224R4785E4763
$$ plain form
19272 141979 257196 -229132 63814 -169105 84575 -178295 -227845 48424 -28963 -165523
19262 -165523 55901 71237 -61275 150937 171416 152734 -238931 -153077 -266198 -187279 165841
19250 55598 -85294 -45804 -247519 1470 -164560 109237 86952 -44524 133643 182468 -474901
19238 -675090 -115664 288901 34468 53365 406304 -34365 29186 29958 26880 -51531 38854
19226 -127395 30147 -370756 94971 -15468 -85377 119263 -51580 -200318 90158 -170527 37682
19214 -167129 -140664 -264601 83577 -105029 -77024 438621 44662 53827 306918 -296244 -110470
19202 34062 -144757 -51989 45760 38173 -29389 -82434 -143812 -108938 -75221 -63195 -90265 85925
19189 -153600 148888 -205233 -47124 -264298 -105450 10003 -97996 -190686 -155277 253169
$$ packed form
19272A41979J15217b29132F3814a69105H4575a78295m9550D8424b8963j36560
19262a65523E5901J5336f1275A50937K0479j8682b38931Q5854j13121P8919A65841
19250E5598h5294L9490k01715A470a64560A09237k2285d4524A33643M8825d74901
19238f75090a15664B88901C4468J8897L52939c4365B9186P72l078e1531C8854
19226a27395C0147c70756I4971a5468o9909A19263e1580j48738I0158a70527C7682
19214a67129K6465j23937H3577a05029K8005D38621D4662R165K53091b96244a10470
19202C4062a44757e1989D5760p587b9389n3045o1378L4874L3717J2026k7070H5925
19189a53600A48888b05233d7124k17174a05450A0003i7996r2690L5409B53169
$$ plain form
19178 -86643 130075 -248855 179938 79293 275015 -377549 -173862 -39760 -286983 -183420
19168 -183420 129609 -418682 -54271 -376620 23187 212187 -81339 -120356 146932 83242
19158 83242 -25448 132697 167500 -33858 -114428 32992 -213483 91706 48676 444056 175550
19146 166041 -342159 -37944 212176 -59986 347341 38967 -345022 -103833 -96962 -167184 91695
19134 -270892 356651 6892 -447464 59952 -311484 52294 -36775 -49011 13139 -192872 -37414
19122 54006 7474 -157985 166985 -102259 143233 325708 132184 -84637 -271776 -95689
19111 -96917 -289938 -158854 -283110 -60694 327334 -111961 189627 -61267 -68143 -262928
19101 -262928 -109810 112443 -201674 58783 212227 -103659 -266205 -150076 53752 126313
$$ packed form
19178h6643A30075b48855A79938G9293J95722c77549a73862c9760k47223J03563
19168a83420A29609d18682e4271l22349B3187J89000h1339l9017A46932o3690
19158H3242b5448A32697L4803c3858q0570C2992b13483I1706m3030L95380A75550
19146A66041c42159c7944B12176e9986C47341C8967c45022a03833O871p0222I1695
19134b70892C56651F892d47464E9952c11484E2294c6775j2236A3139a92872c7414
19122E4006G474a57985A66985a02259A43233J82475A32184h4637j87139i5689
19111i6917j93021J31084j24256f0694C27334a11961A89627f1267o876j94785
19101b62928a09810A12443b01674E8783J53444a03659j62546J16129E3752P2561
$$ plain form
19091 126313 -78235 -22431 -223415 -248997 164020 -295226 -105237 -450735 -180641 114295
19080 61228 151353 -8711 225695 4853 -135387 -254501 8282 205319 -60249 231479 -31947
19068 -227694 -157180 186080 -183925 237408 -51277 235600 -85591 147948 -239914 49945
19057 211776 -400813 -261814 -9980 6470 -11849 65599 -171479 -69990 41204 -78658 -53886
19046 -53886 38418 -112864 -272058 151796 174562 107128 -319912 -290278 -15131 532 -126656
19034 -223154 -166618 -269916 493345 -188158 -187506 136490 19495 144686 -60993 30277 116222
19023 116222 279983 36152 76017 142484 71488 85124 -318734 291336 -96711 -8957 -64632
19012 -64632 -16422 42206 157267 159005 -77569 -65764 66908 265954 46805 -69096 16350
$$ packed form
19091A26313g8235b2431k00984k5582A64020b95226a05237l45498a80641A14295
19080F1228R0125h711B25695D853a35387j19114H282J97037f0249B31479c1947
19068b27694P0514A86080a83925B37408e1277B35600h5591A47948b39914D9945
19057B11776d00813J38999i980F470a1849F5599a71479f9990D1204g8658K4772
19046e3886C8418a12864j59194A51796K2766o7434c19912K9634a5131E32a26656
19034b23154N6536j03298D93345a88158O52A36490A9495J25191f0993C0277Q5945
19023A16222J63761C6152L9865O6467p0996J3636c18734B91336i6711h957n5675
19012f4632a6422D2206J15061J738g7569J1805F6908J99046D6805f9096A6350
$$ plain form
19000 39938 66170 72803 -92372 -129466 -167948 -86507 -243460 -335179 34160 -174879 -33010
18988 -159439 -274734 182619 46916 -214208 -89509 225651 -122533 -201210 -77326 -140528
18978 -140528 -35062 -279871 65930 -135804 -121392 -293913 -139415 -105105 -273394 -287952
18968 -287952 -19292 -127151 -170266 -27116 12950 175332 219241 -289743 -227182 -294132 87166
18956 110103 93779 -169167 152222 -70460 9150 200516 201710 -21034 -89862 444542 -241310
18944 64241 85625 84083 165039 155782 235307 72672 138926 -491514 -120276 -121343 37557 16817
18931 89063 89470 -233024 152552 36992 78110 -19683 -38489 -90951 69752 117298 -457583
18919 -184835 -258196 -314237 -218723 -306056 -327990 -309675 -30022 -263867 139118 97900 -68327
$$ packed form
19000C9938K6232O633i2372l7094l8482Q1441j56953r1719C4160a74879c3010
18988a59439j15295A82619D6916b14208h9509B25651a22533p8677g7326o3202
18978a40528c5062k44809F5930a35804J4412j72521a39415L4310j68289j4558
18968b87952a9292j07859m3115b7116A2950J62382M3909b89743O2561o6950H7166
18956A10103j6324a69167A52222g0460I150J91366J194b1034o8828D44542b41310
18944F4241K1384j542Q0956r257P9525G2672O6254d91514a20276j067C7557A6817
18931H9063M07b33024A52552C6992M1118a9683j8806n2462F9752M7546d57583
18919a84835p3361n6041R5514q7333k1934J8315c0022k33845A39118m1218f8327
$$ plain form
18907 274139 -180504 -164073 180982 -198294 31131 -98986 -61992 113939 -431296 -176247
18896 107039 -15293 -15183 365846 32631 -112210 76797 -184233 -113952 105558 -15167 -116108
18885 -116108 94726 99958 -239994 -60532 219714 -309254 64898 -193865 -105671 29334 -267488
18873 -394541 133386 63055 -23916 -396719 -137153 78709 -404162 -423500 19923 172312
18863 172312 -331006 -46359 -114296 -168232 -119410 -133978 -5383 76224 -2337 -189577 -251625
18852 -251625 17679 -32256 98905 5008 -123904 150216 179129 183009 -262973 -19562 -306355
18841 -306355 -73590 120724 -73458 365164 -349504 -167836 46452 -34424 -17626 75126 40309
18830 40309 166054 -66583 -118746 4812 -266905 -219552 73980 -120536 80492 -147638 53818
$$ packed form
18907B74139a80504J6431A80982a98294C1131i8986L6994A13939d31296a76247
18896A07039a5293J10C65846C2631a12210G6797a84233P0281A05558a5167j00941
18885a16108I4726N232b39994f0532B19714c09254F4898a93865Q8194B9334b67488
18873c94541A33386F3055b3916l72803a37153G8709d04162j9338A9923J52389
18863A72312c31006d6359o7937n3936M8822j4568e383G6224b337j87240o2048
18852b51625A7679c2256I8905E008a23904A50216K8913L880b62973a9562k86793
18841c06355g3590A20724g3458C65164c49504a67836D6452c4424J6798G5126l4817
18830D0309J25745f6583n2163D812b66905M7353G3980a20536H0492a47638E3818
$$ plain form
18818 -11982 -132069 68204 -19080 57596 104483 -200181 -241347 307001 336152 235548 360863
18807 360863 -7401 84154 402730 57712 -468 -4956 26102 -196493 -89373 182371 -29555 114697
18794 53551 -85892 -82687 -151464 151768 -186739 -53149 210855 -21386 -317608 -43529 -167094
18783 -167094 -44318 -102287 -245004 -77576 -95768 2517 -164230 -103237 106506 -248453 -78032
18771 -29810 -15678 32421 163652 -151576 -83319 -75051 7909 -116414 -50505 -354785 253931
18759 174048 138817 95374 -10740 12446 -236046 42779 32429 71110 -119958 49809 118205
18748 118205 -203836 -408 -54726 239438 -257417 278113 -206494 -409081 -183941 -94117
18738 -94117 -171727 -113502 122862 -149972 -220621 -170926 145100 143275 228616 26932 48325
$$ packed form
18818a1982j20087F8204a9080E7596M6887b00181m1166C07001K9151j00604J25315
18807C60863g401H4154L18576E7712d68m488B6102a96493h9373A82371b9555A14697
18794E3551h5892L205o8777A51768a86739e3149B10855b1386k96222d3529j23565
18783a67094d4318n7969j42717g7576j8192B517a64230O0993A06506b48453g8032
18771b9810J4132C2421J31231a51576O8257Q268G909a16414e0505l04280B53931
18759A74048l5231m3443a0740A2446b36046D2779j0350L8681a19958D9809O8396
18748A18205b03836d08n4318B39438b57417B78113b06494k02587a83941Q9824
18738i4117p7610N8225A22862a49972p0649M9695A45100j825Q5341B6932K1393
$$ plain form
18727 48325 114259 175435 98496 -108825 56047 40315 -142307 99040 -173464 -31416 974
18715 -197826 -67824 -21091 -273086 120577 -288897 -172597 55224 -30829 -105340 -108203 -216936
18704 -216936 90659 81136 -48402 -173872 -181543 177578 -142226 -324866 -125181 -258592 -121667
18692 519111 -3569 38442 -366924 83377 -100327 -229975 -145898 -47392 -148160 -155429 185336
18680 -51727 -80339 -176854 -119530 -307 -155000 233005 -308356 -205125 89983 -303392 -34808
18668 -441694 131424 -274185 294583 354447 -99319 34240 -186258 131047 13621 -190010
18657 -235230 -23508 -175317 -88301 -129229 102635 -23776 -48088 -45025 -89849 216561 -64183
18645 108740 -438636 38703 -158538 48098 -78281 -52436 -19447 -106896 -146766 230360 -304245
$$ packed form
18727D8325O5934O1176p6939a08825E6047j5732a42307I9040a73464c1416I74
18715a97826f7824b1091k51995A20577b88897J16300E5224c0829p4511k863j08733
18704b16936I0659r523d8402j25470p671A77578a42226j82640a25181j33411a21667
18692E19111c569C8442c66924H3377a00327j29648Q4077d7392j00768p269A85336
18680e1727k8612r6515N7324c07j54693B33005c08356J03231H9983c03392c4808
18668d41694A31424b74185B94583N9864i9319C4240a86258A31047A3621a90010
18657b35230b3508j51809Q7016m0928A02635b3776k4312L063m4824B16561f4183
18645A08740d38636C8703a58538D8098g8281K5845a9447q7449l9870B30360c04245
$$ plain form
18633 -185815 146610 48487 42982 178285 593 -272386 -66174 -172466 -55490 -19789 -129198
18622 -129198 -81713 63240 343068 70564 78733 123534 91981 -139663 -177684 -58776 274223
18610 223304 173990 384326 -201897 562 -53501 61673 -80754 64429 132047 -27234 59369
18598 345615 -199378 -236632 -45941 -30153 -38045 -244041 -116888 -231598 -71012 106228 -199299
18586 -198974 -354695 -82591 -63643 51924 -220573 65008 -78875 -58380 -303856 -179589 -119965
18575 -119965 -86361 25522 -65677 -131381 24087 29359 128203 -92449 -40515 -211690 -119661
18564 -119661 -45457 159333 -163336 300295 -693830 145213 -107997 -42860 -68487 -150517
18554 -150517 -68526 37024 -49842 -145106 -426349 -236293 -32413 -310839 66040 294336 -130157
$$ packed form
18633a85815A46610D8487n505J35303E93b72386f6174j06292e5490a9789j09409
18622a29198M7485F3240K79828G0564Q169M4801l1553a39663l8021e8776B74223
18610B23304m9314K10336b01897E62e3501F1673h0754F4429O7618b7234E9369
18598C45615a99378l7254d5941J5788p892k05996a16888j14710g1012A06228a99299
18586a98974j55721h2591J8948E1924b20573F5008g8875K0495k45476J24267N9624
18575a19965L3604B5522f5677o5704B4087N272R8844i2449d0515j71175R2029
18564a19661d5457A59333a63336C00295f93830A45213a07997d2860k5627q2030
18554a50517f8526C7024d9842r5264k81243J90056c2413k78426F6040K28296a30157
$$ plain form
18542 29997 99037 36836 131844 -99309 93761 205019 167118 17147 -263146 -55618 76327
18530 -4235 162459 264158 -464807 -140235 -404623 97398 177631 -108984 -50448 114678
18519 -72291 76158 76310 143263 -455584 -99226 134354 143046 46366 -211136 149753 -234757
18507 -283613 -44387 -47377 -233244 -142698 -24391 -106466 -84310 -136919 -70911 -8867 172248
18495 -246716 -9266 140533 -128204 116303 46746 -309680 -218463 96850 -10625 -239094 -68875
18483 -141622 -212276 -326887 313630 203308 -5350 -81071 -210165 220130 55205 96670 -172684
18471 182167 -158493 -90775 -236295 287084 251547 -19633 204237 234672 82003 149419 88605
18460 88605 -238590 -99591 -132458 -70458 172680 161825 -130550 59412 104543 273636 -193474
$$ packed form
18542B9997O9040C6836R5008i9309I3761J11258l7901A7147b63146e5618G6327
18530d235A62459J01699d64807a40235k64388I7398Q0233a08984e0448A14678
18519g2291G6158J52O6953d55584i9226A34354Q692D6366b11136A49753b34757
18507b83613d4387k990j85867R0546b4391q2075K2156n2609O6008h867A72248
18495b46716i266A40533a28204A16303D6746c09680R1217I6850a0625k28469f8875
18483a41622p0654j14611C13630j10322e350p5721j29094B20130E5205M1465a72684
18471A82167a58493O7718j45520B87084l5537a9633B04237L0435H2003O7416o0814
18460H8605b38590i9591l2867O2000A72680j0855a30550E9412M5131J69093a93474
$$ plain form
18448 -25642 -137029 165209 54067 280322 -307250 -148341 94669 -306034 21579 -88648
18437 24741 209628 -124667 -183704 161388 51964 -81225 -106112 28359 -225600 -262259 -181548
18426 -181548 129494 -106099 188525 242612 -26719 110291 -151245 -109467 17792 45230
18416 45230 -128565 -25381 133355 145326 -73546 -199259 -264938 152241 -271409 -275459 -113907
18404 158957 118451 -405813 207783 72843 100614 -49263 17603 -21362 -85749 93396 173686
18393 173686 -381488 369747 112104 -178489 -25087 -226469 68536 -53215 -87912 -178767
18383 -178767 142350 71533 -320 -324931 21732 -5620 138358 122274 -271278 44689 283380
18372 283380 -297537 249645 -241096 51012 -144568 30788 -147708 -46739 289938 -99561
$$ packed form
18448b5642j11387A65209E4067K26255c07250a48341I4669c06034B1579h8648
18437B4741J84887a24667n9037A61388E1964h1225k4887B8359b25600l6659Q0711
18426a81548A29494a06099A88525N4087b6719A10291a51245M1778A7792K7438
18416D5230a28565b5381A33355J1971g3546j25713o5679A52241b71409m050a13907
18404A58957m0506d05813B07783G2843K7771d9263A7603b1362o4387I3396Q0290
18393A73686c81488C69747A12104a78489b5087k01382F8536e3215l4697r0855
18383a78767A42350p0817c20l24611B1732e620A38358j6084b71278D4689K38691
18372B83380b97537B49645b41096E1012a44568C0788a47708d6739B89938i9561
$$ plain form
18361 -286837 132953 -30797 -22730 -296168 32110 197771 -250186 3186 -54614 -27676 59895
18349 -156669 -336490 62659 10000 148485 -228150 -167987 -349326 -64042 -112328 -68744 -40659
18338 -40659 182338 -178297 -66502 281571 27771 -472788 67651 -69072 -298732 45488 -441997
18326 214519 -300757 -184938 103506 -59895 -29648 212014 118263 -60397 54980 -34196 -28718
18315 -28718 -374961 -236815 -211175 163054 20789 98169 -102739 -271541 158449 -294449
18304 -423554 179587 -14064 337392 128872 106140 -269093 -196631 166182 -259682 -215929
18294 -215929 134888 -336968 -206706 -208426 145011 -234786 21581 -67518 -17363 120059
18283 -197990 -104765 -292439 -37106 -172330 175138 -188865 -127677 -261714 18795 -276265
$$ packed form
18361b86837A32953c0797Q067k73438C2110J65661b50186C186e4614K6938E9895
18349a56669j79821F2659A0000J38485b28150O0163j81339f4042m8286M3584K8085
18338d0659A82338a78297f6502B81571B7771d72788F7651f9072k29660D5488d41997
18326B14519c00757J15819A03506e9895b9648B12014r3751f0397E4980c4196N478
18315b8718l46243J38146K5640A63054B0789P7380a02739j68802A58449b94449
18304d23554A79587a4064C37392A28872k2732b69093P2462A66182b59682M3753
18294b15929A34888c36968J30262j720A45011b34786B1581f7518a7363A20059
18283a97990R3225j87674c7106j35224A75138a88865O1188j34037A8795b76265
$$ plain form
18272 -510560 -137616 106099 4680 -143643 126583 -356762 -164943 -71809 -254477 373716
18261 -166841 -93810 -52685 -1623 140347 -246584 101124 79628 121282 409118 213707 -271993
18249 209826 83436 -210679 -288666 -162482 -15946 14689 -3176 143758 -57584 -144630 111894
18237 9400 -238975 184980 -212639 243868 -122448 -154070 79188 -282289 23375 -78454 -104616
18226 -104616 -115326 47931 -35131 136237 199671 140739 -117113 -109755 -304778 -81370 -48253
18215 -48253 -48941 88737 15681 -281261 68186 -138674 -201116 18384 115529 -366994 -24459
18203 -197254 -4609 -351419 101636 -17603 -377256 -53836 82030 84699 21997 -117369 55369
18191 -104508 97491 65412 -188239 87537 -245216 -171314 161120 6091 11620 -137871 282472
$$ packed form
18272e10560a37616A06099D680a43643A26583c56762a64943g1809j82668C73716
18261a66841P3031M1125a623A40347b46584A01124k1496M1654K87836j95411b71993
18249B09826H3436b10679p7987J26184a5946A4689c176A43758e7584q7046A11894
18237I400b38975A84980b12639B43868a22448l1622G9188b82289B3375g8454k6162
18226a04616j0710D7931c5131A36237O3434n8932a17113P358j95023h1370L3117
18215d8253o88H8737A5681b81261F8186a38674o2442A8384R7145c66994b4459
18203a97254d609l46810A01636a7603l59653e3836H2030K669B1997a17369E5369
18191a04508I7491l2079a88239H7537b45216P3902A61120F091N529a37871B82472
$$ plain form
18179 -470201 -99529 -177481 298145 -136304 -284006 -203858 -129882 -28580 112168 51066 1243
18167 197021 -8601 -79625 -130712 294018 -243105 -181181 -248745 -25641 -439560 -116620 -89990
18156 -89990 -20009 -75575 -60093 -248093 -121232 -267079 -302344 -106851 -203567 -20464 -195512
18145 -195512 -219485 276954 -47166 -39461 -136187 70034 56003 -242187 150902 35460 -147881
18133 241543 -387210 -192005 -42313 301472 -362759 -3644 130426 -239068 228520 25301
18122 -124909 -319566 -3436 -217239 23563 271563 -12583 30684 -137307 -48960 -39175 266067
18110 47833 -247906 222367 226561 21468 182267 -124944 17168 64609 204983 224826 -272318
18098 -362831 -14405 -422315 -65390 -120472 -167062 13968 204139 173196 344720 -122216 -53313
$$ packed form
18179d70201i9529p7952B98145a36304j47702Q0148P3976b8580A12168E1066A243
18167A97021h601p1024n1087B94018b43105O1924o7564b5641m13919a16620K6630
18156h9990b0009n5566J5482j88000a21232j45847l5265a06851r6716b0464j75048
18145a95512k3973B76954d7166P705r6726G0034j4031b42187A50902C5460a47881
18133B41543c87210a92005d2313C01472c62759c644A30426b39068B28520B5301
18122a24909j94657c436k13803B3563K48000a2583C0684a37307d8960R785B66067
18110D7833b47906B22367M194B1468J60799a24944A7168M7441J40374J9843b72318
18098c62831a4405m07910f5390n5082m6590A3968J90171l0943J71524a22216e3313
$$ plain form
18086 119760 -89071 -61327 -46657 -21511 156646 -224842 101846 -86198 -176228 -75850 448990
18074 -110817 -284928 -37032 86108 -129228 100383 -52161 -214786 204292 -302574 -207135
18064 -207135 234435 -4384 64372 -67346 19963 -268665 88785 80805 -129424 -90585 48099
18052 -7887 255943 145786 113596 106913 74568 -230917 291554 -213945 -46305 -429881 164845
18040 -165722 125473 3541 -13368 -220353 -186489 -67498 -209680 115327 -136249 -14794 176626
18028 -20137 302896 -101287 103581 144910 -425252 -251182 20722 -257481 -17171 391988
18017 -121026 -105858 272539 -269589 52707 23259 306577 59946 -135660 -35404 -193860
18007 -193860 -14000 -27664 79526 -281847 -184292 -201039 -165416 240302 -50412 -123412 -214943
$$ packed form
18086A19760h9071K7744J4670b1511A56646b24842A01846h6198r0030g5850D48990
18074a10817j74111c7032H6108a29228A00383e2161j62625B04292c02574R5439
18064b07135B34435d384F4372f7346A9963b68665H8785p980a29424L8839D8099
18052g887B55943j10157l2190o683l2345b30917B91554b13945d6305l83576A64845
18040a65722A25473C541a3368k06985L3864f7498j42182A15327a36249a4794A76626
18028b0137C02896a01287A03581M1329d25252J74070B0722b57481a7171C91988
18017a21026J5168B72539b69589E2707B3259K83318E9946a35660c5404j58456
18007a93860a4000j3664G9526b81847R7555j6747L5623B40302e0412p3000r1531
$$ plain form
17996 -214943 91541 273392 85711 -52116 -149147 -11416 -67866 -220829 88615 -66379 31079
17984 88170 -252639 69563 -407621 392548 -136178 -266021 157747 -263261 170552 -117811
17973 -100923 27535 137712 -132636 -483635 -364282 -106208 -331423 28533 172089 30159
17962 11221 178610 126748 -351869 -287594 4485 65097 21109 -88300 135254 494927 -109198
17950 75773 -42190 35847 -364668 -38365 67342 -51994 -58420 -226927 -127950 -82791 -86235 -415145
17938 -415145 190996 -150425 -213539 77521 174170 56470 -375550 -40617 157429 115925 -260277
17926 -185433 -67113 56763 90909 -126746 128556 48005 -217372 243160 -419297 16305
17915 -7619 -166743 -89297 -267075 -195742 -156069 -301874 -393131 188505 -205024 395467 149099
$$ packed form
17996b14943I1541J81851H5711e2116r7031a1416n6450j52963H8615f6379C1079
17984H8170b52639F9563d07621C92548a36178j29843A57747b63261A70552a17811
17973a00923B7535J10177a32636l50999J19353a06208k25215B8533J43556C0159
17962A1221J67389n1862c51869O4275D485O0612B1109h8300A35254L59673a09198
17950G5773d2190C5847c64668c8365F7342e1994o426j68507R8977M5159l444l28910
17938d15145A90996a50425o3114G7521R6649E6470c75550d0617A57429m1504b60277
17926a85433f7113E6763L4146a26746A28556D8005b17372B43160d19297A6305
17915g619j59124P7446j77778P1333L9673j45805r1257A88505b05024C95467A49099
$$ plain form
17903 -362278 44060 -88606 -5927 -239172 223270 55591 163823 213858 -75960 -28555 162322
17891 -13953 -295150 13931 -243491 131326 208208 167134 38633 141230 46600 -270477 -111168
17879 352517 -29835 106788 -47472 147734 -201296 -52144 -158250 -274872 -58224 -240019
17869 -240019 124172 239000 26560 -76494 -186885 92006 -146146 -112430 -90554 320380
17858 -148693 -147418 -48346 45054 -45005 -117350 263686 165972 30653 -175848 124094 345744
17847 345744 -35030 61178 -187490 -275959 27571 188852 -226987 153588 -121560 138421
17836 169110 89316 -3048 240738 53000 -389617 61013 -408093 -10296 5106 -144148 -132044
17825 -132044 -153405 101790 -146187 -90334 -145104 194371 -141349 -142460 42315 -175317 274623
$$ packed form
17903c62278D4060h8606e927k33245B23270E5591J08232N0035g5960b8555A62322
17891a3953k81197A3931b43491A31326P6882m1074C8633J02597D6600b70477a11168
17879C52517b9835A06788d7472A47734b01296e2144j06106j16622e8224j81795
17869b40019A24172J14828B6560g6494j10391I2006a46146L3716K1876C20380
17858a48693J275d8346D5054d5005p2345B63686r7714C0653a75848A24094K21650
17847C45744c5030F1178a87490q8469B7571J61281b26987A53588a21560A38421
17836A69110p9794c048B40738E3000c89617F1013d08093a0296E106a44148J2104
17825a32044k1361A01790a46187N5853n4770A94371a41349j111D2315a75317B74623
$$ plain form
17813 -11453 247955 125421 -135270 -6043 27421 -121580 -28820 123929 -114658 -8404 -220714
17802 -220714 179709 -187721 -109086 -17990 188544 284616 -43068 85288 217652 13838 -421507
17790 -117642 -188178 -141527 -119161 -85654 -435676 -416044 265847 -7728 -6458 -55267 -136310
17779 -136310 217155 -74104 -68366 96188 -129946 -130970 139368 -381412 324193 -480701 -178921
17767 -212050 -97925 -1679 153407 213359 -26424 218829 -383223 247550 -201101 -55206 -145232
17756 -145232 102244 120451 155131 61727 155734 72694 101880 -226959 -91622 150464 -97706
17744 -13318 263802 -206813 -284815 44311 147363 -229462 175395 -45918 199950 -14469
17733 65642 90159 39155 44211 442114 -7097 -114849 -84426 63594 -57147 -215307 -93940
$$ packed form
17813a1453B47955j22534a35270f043B7421a21580b8820A23929a14658h404k12310
17802b20714A79709a87721P8635a7990A88544R6072d3068H5288J32364A3838d21507
17790a17642p0536M6651K2366L3507l50022J9632B65847g728J270m8809q1043
17779a36310B17155g4104N738I6188a29946j024A39368c81412C24193d80701a78921
17767b12050i7925a679A53407N9952b6424B18829c83223B47550b01101e5206r0026
17756a45232A02244J8207L4680F1727R4007G2694K9186b26959i1622A50464i7706
17744a3318B63802b06813p8002D4311J03052b29462A75395d5918A99950a4469
17733F5642K4517C9155N056L97903g097j07752L0423F3594e7147j58160i3940
$$ plain form
17721 -148277 -115711 321046 237 -124534 -14168 329502 94028 -35121 38641 367551 107495
17709 61995 -146805 -5879 60629 183850 187224 71169 -33314 81049 146462 49081 -163421
17697 -92949 196858 118800 -52629 -69148 99272 -92774 -186538 460940 13115 63650 155371
17686 155371 -73484 70262 -146681 161588 -163063 55263 -227967 76109 191353 6396 -99904
17674 -189230 -150600 -60309 -147904 -14638 273916 68515 -228638 29412 -246841 -136612 344668
17662 71262 4163 32015 -55879 -216785 318927 132096 47388 180716 190811 -121976 -38435
17650 172628 107339 487399 -135770 110255 189779 86300 139799 -62559 -18981 -142923 -263393
17639 -263393 257151 -144812 -196403 -50042 -52336 149325 45696 -115350 -19738 -18903 -201812
$$ packed form
17721a48277L2566C21046B37a24534a4168C29502I4028c5121C8641L28910A07495
17709F1995a46805e879F0629J23221L374G1169c3314H1049O5413D9081a63421
17697i2949A96858p8058e2629j6519I9272i2774r3764D60940A3115N0535R1721
17686A55371g3484G0262a46681A61588a63063E5263b27967G6109J15244F396i9904
17674a89230L8630f0309q7595a4638B73916F8515b28638B9412b46841J10229C44668
17662G1262D163K7852e5879j60906C18927A32096D7388J33328J0095a21976c8435
17650A72628o5289L80060a35770A10255P9524H6300N3499f2559a8981j23942j20470
17639b63393B57151a44812n1591e0042k294A49325D5696a15350a9738Q35j82909
$$ plain form
17628 -201812 -183687 -57143 -82248 17270 -33797 -22010 157118 70802 -223229 174365 -187743
17616 -256671 -78667 -72833 255884 -168481 51435 130736 -300210 -115511 -160454 -815 -508527
17605 -508527 -113631 -181414 -166315 -76007 -14163 36041 172550 -120920 119098 248892
17595 248892 44963 175166 111673 -63801 -274128 131480 278803 -174909 257147 100714
17584 163701 37602 467753 -198488 -122435 -95100 387687 -178189 -6258 99022 -45572 340055
17572 -52619 -87434 319046 -84046 295787 230700 264165 -23482 283071 103250 192412 231459
17561 231459 306951 42043 -24678 154917 487606 -143035 -53302 -33843 297979 320907 73827
17549 -210151 -21411 33740 426815 905 443010 198247 -156447 85993 468650 -48058 -74282
$$ packed form
17628b01812J8125e7143k5105A7270c3797J1787A57118G0802b23229A74365a87743
17616b56671g8667N834B55884a68481E1435P9301c00210a15511m4943h15n07712
17605e08527a13631o7783J5099g6007a4163C6041J36509a20920A19098J29794
17595B48892D4963J30203o3493f3801k10327A31480J47323a74909B57147A00714
17584A63701C7602M30151a98488P6053K7335C87687a78189f258I9022d5572C40055
17572e2619l4815C19046h4046B95787o5087L3465b3482B83071A03250Q9162L9047
17561B31459P5492D2043b4678A54917L32689a43035e3302J9459B97979K2928G3827
17549b10151b1411C3740L93075I05M42105A98247a56447H5993L82657d8058k6224
$$ plain form
17538 -74282 -172939 18614 -194640 -133849 13677 10699 -124432 273763 -64147 -244711 7423
17526 94369 -119606 123471 153884 -194625 -13250 426611 185082 -52860 -12321 506910
17515 228410 15771 -95325 241865 202349 -95501 -150969 37217 171584 -132574 -75106 -17632
17503 202333 10845 -47660 -39681 241257 84468 106234 -99139 -257848 91414 228001 143248
17492 143248 164935 -8175 -136305 555551 265758 -259862 244615 -128322 16195 274889
17482 274889 245862 -32511 225009 115538 -83093 347742 272958 -6595 58294 182286 249955
17471 249955 -53635 122173 121924 103406 470528 105676 -11725 56832 220482 601780 -25051
17459 174340 406969 -64902 118426 198770 170436 -116271 4282 236626 463755 -19907 409561
$$ packed form
17538g4282r8657A8614a94640O0791A3677k978a24432B73763f4147j80564G423
17526I4369a19606A23471L0413a94625a3250D26611A85082e2860a2321E06910
17515B28410A5771i5325B41865l9516i5501n5468C7217J34367a32574N7468a7632
17503B02333A0845d7660P979B41257H4468K1766i9139j58709I1414J36587q4753
17492A43248K1687h175j28130E55551B65758b59862B44615a28322A6195K58694
17482B74889k9027c2511B25009j09471h3093C47742p4784f595E8294J23992O7669
17471B49955e3635A22173k49j8518L67122A05676a1725E6832J63650L81298b5051
17459A74340K32629f4902A18426Q0344k8334a16271D282K32344K27129a9907D09561
$$ plain form
17447 515931 240858 134216 209640 345918 283282 184810 -140830 149571 355245 -31421
17436 107445 83521 -21801 273575 567722 310200 340938 379157 6152 48750 319544 -6979
17424 250908 382944 286607 143087 570970 414575 125938 337093 153077 445847 273784
17414 273784 697284 304744 11118 287153 -62359 426243 206120 140119 269105 -371098
17403 -183006 152946 163468 103786 64708 -114351 86220 210519 169883 25867 96138 193037
17392 193037 44862 157455 198883 189804 -258928 44890 62735 -78206 -107261 356215 254387
17381 254387 -33122 261846 113493 8817 177114 -90417 89852 40801 205252 471834 -39789
17369 252103 93494 -165219 170199 -30254 25403 -132741 -34364 215082 -93580 140967
$$ packed form
17447E15931B40858j06642P5424J36278o2636r8472a40830A49571K05674c1421
17436A07445k3924b1801B73575K94147k57522L0738L8219F152M2598K70794f979
17424B50908J32036r6337A43087M27883j56395A25938K11155A53077K92770j72063
17414B73784M23500C04744A1118K76035f2359D26243B06120o6001J28986c71098
17403a83006A52946J0522n9682l9078a14351H6220J24299m0636B5867P0271R6899
17392A93037D4862J12593M1428r079b58928D4890J7845g8206k9055C56215j01828
17381B54387c3122B61846A13493H817J68297i0417H9852D0801J64451K66582c9789
17369B52103I3494a65219A70199c0254B5403a32741c4364B15082i3580A40967
$$ plain form
17358 -152864 -117997 289214 194623 174174 -25326 67178 317093 263673 308313 71535 377924
17347 377924 -75331 312990 -43255 10252 -51838 146498 268386 346493 5500 353101 80036
17335 153177 253884 39914 53809 68038 51315 -81576 -141707 100982 -27739 199035 125741
17324 125741 -92119 262497 35848 68064 -15611 137288 148287 330843 221455 232558 163086
17313 163086 -11737 28583 348240 84477 271045 350590 188996 608694 27725 332805
17303 332805 126896 -177340 113690 466729 39956 331633 135208 83834 259904 145872
17293 145872 -15769 161081 343836 -252084 155541 447027 317615 80681 15546 531242
17283 531242 39423 -11983 -100330 215077 39176 -160790 306318 68670 448077 194743
$$ packed form
17358a52864L4867B89214r4591k0449b5326F7178K49915n3420M4640G1535L06389
17347C77924g5331C12990d3255A0252e1838A46498J21888P8107E500L47601H0036
17335A53177J00707C9914J3895J4229j6723h1576o0131A00982b7739A99035p3294
17324A25741i2119B62497C5848L2216a5611A37288J0999J82556j09388J1103o9472
17313A63086a1737B8583L19657H4477J86568P9545j61594M19698B7725L05080
17303C32805A26896a77340A13690L53039C9956K91677A35208n1374J76070j14032
17293A45872a5769A61081J82755b52084A55541K91486j29412H0681A5546N15696
17283E31242C9423a1983q8347B15077C9176a60790C06318F8670L79407A94743
$$ plain form
17272 -71144 139483 326672 95760 399415 52358 156251 240781 243764 119218 167125 330977
17261 330977 263724 354860 268588 284665 141071 553012 367174 233219 35002 54733 205917
17250 205917 264718 228025 28664 56420 32563 328607 251063 156491 506500 144210 456585
17239 456585 391253 96604 128223 413075 108583 195352 267875 211597 -1903 96300 119819
17228 119819 427548 7134 199211 324248 185378 253805 103009 435944 603130 210854
17217 332174 171554 132004 185561 246183 108409 510573 463564 -103778 212631 232707
17207 232707 74511 340272 145329 62168 211645 415937 132042 26336 247360 334344
17197 334344 336499 35520 37421 189387 134521 423246 -51164 339392 374746 96716 298018
$$ packed form
17272g1144A39483J87189I5760L03655E2358J03893Q4530K983A19218M7907J63852
17261C30977o7253R1136q6272J6077A41071M11941j85838j33955C5002J9731J51184
17250B05917N8801l6693B8664K7756k3857K96044p7544r4572L50009A44210L12375
17239D56585o5332I6604L1619K84852A08583Q6769P2523n6278a903I6300K3519
17228A19819L07729G134J92077J25037j38870O8427A03009L32935J67186B10854
17217C32174j60620l9550N3557O0622A08409M02164m7009a03778B12631K0076
17207B32707G4511K65761A45329F2168J49477K04292A32042B6336K21024Q6984
17197C34344K155C5520J901J51966n4866K88725e1164C39392L5354I6716K01302
$$ plain form
17186 298018 274367 235461 377778 189193 397902 539185 246181 212826 -111873 112511
17175 22803 147519 155674 151261 274915 15502 405729 390718 108173 77612 266078 247542
17164 247542 165926 239807 111835 84283 537253 267179 157256 374358 223989 295783
17154 295783 390534 86555 23189 602136 421349 156344 80527 242523 185456 458453
17144 458453 257702 534788 371685 256960 80037 233142 416516 318704 319951 730322
17134 730322 321191 409770 342431 213254 349062 490829 195826 479418 398588 160872
17123 564564 453607 370112 558375 407834 441823 284963 291709 540226 249580 273165
17113 273165 548174 306366 330116 219645 397822 498176 485778 517097 485528 337041
$$ packed form
17186B98018k3651l8906J42317j88585K08709J41283B46181l3355a11873A12511
17175B2803J24716Q155m413J23654A5502L90227j5011A08173l0561J88466j8536
17164B47542q1616P3881A11835k7552M52970B67179j09923K17102j50369P1794
17154B95783R4751H6555B3189N78947j80787A56344p5817J61996n7067K72997
17144D58453k00751K77086j63103j14725H0037J53105J83374r7812J247M10371
17134G30322C21191Q8579o7339j29177J35808J41767A95826K83592q0830A60872
17123E64564j10957q3495J88263j50541L3989j56860O746K48517B49580K3585
17113B73165K75009k41808K3750j10471J78177J00354j2398L1319l1569j48487
$$ plain form
17103 337041 184958 302937 279245 314797 395383 253001 296973 251600 303875 338228 127283
17091 475077 521234 240583 392045 148160 229767 298643 396023 452288 470360 554712 832161
17080 832161 238163 432316 145690 150009 346435 665038 584972 389898 387371 826583
17070 826583 578924 166231 626007 244838 199985 423135 112756 511597 676807 666102
17060 666102 472759 410263 456839 477936 645769 500716 746865 622017 679504 228670
17049 481242 612963 544121 652983 575974 703535 608035 674124 433976 477772 695140
17039 695140 756801 512114 573948 556996 626030 592128 875507 624882 725865 546170
17029 546170 447622 766994 729616 617330 588106 473907 817042 719438 831790 648732
$$ packed form
17103C37041j52083J17979k3692L5552Q0586j42382M3972m5373N2275L4353A27283
17091D75077M6157B40583J51462A48160Q1607O8876R7380N6265J8072Q4352K77449
17080H32161B38163J94153A45690M319J96426L18603q0066j95074k527M39212
17070H26583k47659A66231M59776B44838m4853K23150A12756L98841J65210j0705
17060F66102j93343o2496M6576K1097J67833j45053K46149j24848N7487B28670
17049D81242J31721o8842J08862p7009J27561r5500O6089k40148M3796K17368
17039F95140O1661k44687O1834j6952O9034l3902K83379k50625J00983j79695
17029E46170r8548L19372l7378j12286k9224j14199L43135r7604J12352j83058
$$ plain form
17019 648732 338037 691304 1094339 347975 835187 1106664 556264 630857 749925 834305
17009 834305 628537 660973 594685 501730 965355 754957 736488 697454 621273 830969 579414
16998 579414 810388 686461 866920 726243 713400 845350 861744 1230669 900675 552444
16988 552444 371052 740891 435977 730975 870325 677321 1127414 782667 645753 1102630
16978 1102630 1134976 1235756 958637 774570 948895 1075267 1063243 1252428 905733 766077
16968 766077 962595 1110564 952899 1395780 832843 1068136 1156902 1105552 1033921 1271120
16958 1271120 758243 931147 915540 1157952 1531496 1405283 926253 1031707 1233411 1031638
16948 1031638 1081202 1075513 1070173 1160155 1236414 833216 1501476 1185932 1165281 1135909 1460497
$$ packed form
17019F48732l10695L53267M03035C47975M87212K71477n50400P4593J19068Q4380
17009H34305k05768L2436o6288r2955M63625k10398j8469l9034p6181K09696k51555
16998E79414K30974j23927J80459j40677j2843J31950J6394L68925l29994l48231
16988E52444j81392L69839l04914K94998J39350j93004M50093l44747j36914M56877
16978A102630L2346J00780k77119j84067J74325J26372j2024J89185l46695j39656
16968G66077J96518J47969j57665M42881n62937K35293Q8766n1350p1631K37199
16958A271120n12877J72904j5607K42412L73544j26213m79030J05454K01704k01773
16948A031638M9564n689n340Q9982P6259m03198O68260l15544k0651k9372L24588
$$ plain form
16937 1460497 1550288 1210438 1487674 1222390 1344764 1199455 1340488 1344312 1313420 1326280
16927 1326280 1462011 1693162 1559978 1552101 1347976 1511208 1424959 1648688 1515543 1725379
16917 1725379 1603750 1423210 1801026 1655564 1636159 1562465 1697178 1746631 1374200 1386774
16907 1386774 1816295 1581205 1647155 1908538 1890033 1712208 1762919 1652719 1804379 1737649
16897 1737649 1773933 1791512 1790965 2159937 1977785 1502466 1753887 2218112 1930628 2146009
16887 2146009 2071385 2002872 2168888 2131785 1766195 2067905 2541926 2445569 2111596 2421849
16877 2421849 2468698 2243899 2398303 2215260 2547932 2272759 2614306 2797952 2829301 2285997
16867 2285997 2603180 2807389 2762726 2928935 2619229 2816354 3057112 2595691 3047681 3110400
$$ packed form
16937A460497Q9791l39850K77236k65284J22374j45309J41033L824l0892J2860
16927A326280J35731K31151j33184p877k04125J63232q6249K23729j33145K09836
16917A725379j21629j80540L77816j45462j9405p3694J34713M9453l72431J2574
16907A386774M29521k35090O5950K61383j8505j77825N0711j10200J51660o6730
16897A737649L6284J7579n47L68972j82152m75319K51421M64225k87484K15381
16887B146009p4624o8513J66016l7103l65590L01710M74021r6357l33973L10253
16877B421849M6849k24799J54404j83043L32672k75173L41547J83646L1349n43304
16867B285997L17183K04209m4663J66209l09706J97125K40758m61421M51990O2719
$$ plain form
16857 3110400 3338991 3161659 3239353 3296234 3137779 3372080 3456146 3082561 3506205 3495411
16847 3495411 3374672 3439376 3445953 3687776 3855473 3984884 3906971 3901323 3752901 4146294
16837 4146294 4339562 4421305 3890698 4138296 4470355 4214194 4659321 4658835 4635499 4791301
16827 4791301 4786840 4986223 4922610 5120012 5243360 5007264 5248447 5822858 5680315 5897263
16817 5897263 5801415 5892088 6245907 6076742 6432278 6283729 6419672 6833602 7196678 6891492
16807 6891492 7098067 7487626 7655099 7774603 8109904 8049992 8211542 8456189 8601761 8824375
16797 8824375 8968049 9228383 9239851 9661781 10039105 10551125 10434194 10507143 10794858 11020890
16787 11020890 11875252 11570626 12232450 12841769 12777215 13219819 13410943 13680438 14176000
$$ packed form
16857C110400K28591j77332P7694N6881j58455K34301Q4066l73585M23644j0794
16847C495411j20739O4704O577K41823J67697J29411p7913n648j48422L93393
16837D146294J93268Q1743n30607K47598L32059k56161M45127m86k3336J55802
16827D791301m461J99383o3613J97402J23348k36096K41183N74411j42543K16948
16817E897263r5848R0673L53819j69165L55536j48549J35943M13930L63076l05186
16807F891492K06575L89559J67473J19504L35301n9912J61550K44647J45572K22614
16797H824375J43674K60334J1468M21930L77324N12020j16931P2949K87715K26032
16787A1020890Q54362l04626O61824O09319o4554M42604J91124K69495M95562
$$ plain form
16778 14176000 14753842 15121025 15668087 16386783 16837015 16913292 17782059 18798690 19093773
16769 19093773 19838971 20312169 21008285 21773065 23052260 23394179 24277599 25438659 26417077
16760 26417077 27393722 28367294 29556641 30788220 32162371 33543439 34841161 36579856
16752 36579856 38441509 39653290 41914422 43365451 45618442 48176612 50292103 53214181
16744 53214181 56322642 58525453 61954032 64990347 68636652 72431559 76601702 80873743
16736 80873743 85288032 90061076 94967869 100688979 106387767 112008671 118044774 124601594
16728 124601594 131223326 137437312 144093549 150757247 156786622 162972054 168014694 172786209
16720 172786209 176803719 179754664 182262238 182931055 183181385 181988330 179722129 176475216
$$ packed form
16778A4176000N77842L67183N47062P18696M50232P6277Q68767J016631K95083
16769A9093773P45198M73198O96116P64780J279195L41919Q83420J161060R78418
16760B6417077R76645R73572J189347J231579J374151J381068J297722J738695
16752C6579856J861653J211781K261132J451029K252991K558170K115491K922078
16744E3214181L108461K202811L428579L036315L646305L794907M170143M272041
16736H0873743M414289M773044M906793N721110N698788N620904O036103O556820
16728A24601594O621732O213986O656237O663698O029375O185432N042640M771515
16720A72786209M017510K950945K507574O68817K50330j193055k266201l246913
$$ plain form
16712 176475216 172341763 167743254 162156085 156217777 149892526 143221263 136745637 129853214
16704 129853214 123527318 116969689 110619620 104516004 99160009 93802278 88439355 83640996
16696 83640996 79016442 74531441 70353580 66589607 63230638 59804164 56812438 53389892
16688 53389892 50942259 48539025 46381700 43899110 41914194 39837830 38123815 36317605
16680 36317605 34783508 33064448 31630008 30183598 29062580 27348417 26548945 25654514
16672 25654514 24260588 23577382 22594098 22214965 21108743 20285558 19689016 19041316 18404655
16663 18404655 17592683 16973619 16364245 15959035 15354242 14875092 14269868 13765740 13269688
16654 13269688 13166537 12222489 11750864 12272973 11715788 11256457 10957096 10621857 10162598
$$ packed form
16712A76475216m133453m598509n587169n938308o325251o671263o475626o892423
16704A29853214o325896o557629o350069o103616n355995n357731n362923m798359
16696H3640996m624554m485001m177861l763973l358969l426474k991726l422546
16688E3389892k447633k403234k157325k482590j984916k076364j714015j806210
16680C6317605j534097j719060j434440j446410j121018j714163p99472q94431
16672B5654514j393926o83206r83284l79133j106222q23185n96542o47700o36661
16663A8404655q11972o19064o09374m05210o04793m79150o05224n04128m96052
16654A3269688j03151r44048m71625N22109n57185m59331k99361l35239m59259
$$ plain form
16645 10162598 9884163 9726957 9692132 9660753 8842877 8705337 8324135 8386412 8180645 7841793
16635 7841793 7504115 8011277 7327380 7303261 6786244 6934973 6673385 6559068 6559612 6351100
16625 6351100 6144574 5997098 5734613 5770899 5598550 5376337 5396981 5450304 5021093 5189613
16615 5189613 4906931 4930729 4574592 4381644 4749360 4070690 4396678 4240757 3882401 4168002
16605 4168002 4108933 3980657 3888878 3875185 3843209 4016466 3666008 3751075 3540987 3938006
16595 3938006 3650795 3499618 3552033 3616537 3053575 3250832 3241485 3002697 3330545 2654414
16585 2654414 3003972 3099015 3176611 3095841 2716435 2786272 2848953 2869302 2831167 2764903 2570031
16574 2570031 2586320 2525875 2663210 2535814 2460425 2518565 2350160 2333743 2083404 2313928
$$ packed form
16645A0162598k78435j57206l4825l1379q17876j37540l81202O2277k05767l38852
16635G841793l37678N07162o83897k4119n17017J48729k61588j14317N44k08512
16625F351100k06526j47476k62485L6286j72349k22213K0644N3323m29211J68520
16615E189613k82682K3798l56137j92948L67716o78670L25988j55921l58356K85601
16605D168002n9069j28276r1779j3693l1976J73257l50458Q5067k10088L97019
16595C938006k87211j51177N2415O4504n62962J97257r347k38788L27848o76131
16585B654414L49558R5043P7596q0770l79406O9837O2681K0349l8135o6264j94872
16574B570031J6289o0445J37335j27396p5389N8140j68405j6417k50339K30524
$$ plain form
16564 2313928 2399698 2057136 2086636 2165278 2093931 2364473 1950251 1898957 1622443 1847355
16554 1847355 1751596 1728188 1884570 1780353 1893140 1981078 2057801 1404189 1747285 1750044
16544 1750044 1333527 1662125 1868376 1970387 1597226 1463448 1738502 1707219 1339875 1754040
16534 1754040 1641402 1314705 1481275 1731054 1380253 1314573 1358527 1313371 1438414 1342410
16524 1342410 1148798 1284231 1600103 1158391 1161056 1139731 943488 1443675 1072129 1084950
16514 1084950 1110307 1246876 1002448 1044400 1114159 1058687 1100006 965846 1095117 1128449
16504 1128449 971348 933050 1140198 878049 670224 1090110 676602 1201099 1027238 923450
16494 923450 1283465 1027880 967844 1061033 932200 754924 885214 931619 754182 812303
$$ packed form
16564B313928Q5770l42562K9500P8642p1347K70542m14222n1294k76514K24912
16554A847355r5759k3408J56382j04217J12787Q7938P6723o53612L43096K759
16544A750044m16517L28598K06251J02011l73161j33778K75054l1283l67344M14165
16534A754040j12638l26697J66570K49779l50801o5680M3954m5156J25043r6004
16524A342410j93612J35433L15872m41712K665k1325j96243N00187l71546J2821
16514A084950K5357J36569k44428M1952O9759n5472M1319j34160J29271L3332
16504A128449j57101l8298K07148k62149k07825M19886m13508N24497j73861j03788
16494I23450L60015k55585o0036R3189j28833j77276J30290M6405j77437N8121
$$ plain form
16484 812303 970984 850025 863463 793277 818074 931356 1075588 1089440 693345 773857
16474 773857 681682 632052 914058 664752 888829 832589 813746 669902 790376 699576
16464 699576 319835 634971 644554 718804 651092 411938 668971 632040 623768 661047 393485
16453 393485 494872 532726 556994 394697 630422 906114 544993 459334 684070 748348
16443 748348 480775 430204 646532 278816 682823 538926 691525 743683 362440 482652
16433 482652 751778 693423 264442 455606 418947 325404 547655 458989 632197 488654
16423 488654 85911 498680 600506 581772 445312 552072 602495 652034 415751 712069
16413 712069 442024 498686 428104 450835 358082 397862 497526 489815 371032 320345 673229
$$ packed form
16484H12303J58681j20959J3438p0186K4797J13282J44232J3852l96095Q0512
16474G73857r2175m9630K82006k49306K24077n6240j8843j43844J20474r0800
16464F99576C19835L15136R583P4250o7712k39154K57033l6931q272L7279k67562
16453C93485J01387L7854K4268j62297K35725K75692l61121q5659K24736O4278
16443G48348k67573n0571K16328B78816M04007j43897J52599N2158C62440J20212
16433D82652K69126n8355B64442J91164l6659r3543K22251q8666J73208j43543
16423D88654H5911M12769J01826j8734j36460J06760N0423M9539k36283K96318
16413G12069k70045N6662p0582K2731r2753L9780R9664p711j18783n0687L52884
$$ plain form
16402 673229 379212 746683 619505 717798 475356 274914 320240 367853 157859 109989
16392 109989 890608 617026 437212 391765 208507 433472 531697 430194 259198 471079
16382 471079 559376 557342 266383 74630 204804 299580 382443 479304 519193 563503 189622
16370 249095 385666 339338 47084 261784 105655 573658 311899 427425 443812 544646
16360 544646 265224 73840 13993 58664 -113354 355648 358688 109136 318223 313091 107773
16348 408969 285562 13731 459996 73188 51803 291422 277141 373569 211061 55920 406710
16337 406710 410211 324265 254812 140895 315968 316984 433000 327697 137673 426097 97620
16325 327092 390510 156714 354352 33717 362232 122257 140511 287164 -5248 140346
$$ packed form
16402F73229k94017L67471j27178R8293k42442k00442M5326M7613A57859m7870
16392A09989P80619k73582j79814m5447j83258K24965R8225j01503j70996K11881
16382D71079Q8297k034B66383G4630J30174R4776Q2863R6861L9889M4310A89622
16370B49095J36571m6328D7084K14700A05655M68003k61759J15526J6387J00834
16360E44646B65224G3840A3993M4671a13354C55648L040A09136K09087n132A07773
16348D08969j23407A3731M46265G3188k1385K39619j4281R6428j62508E5920L50790
16337D06710L501q5946o9453j13917J75073J016J16016j05303A37673K88424I7620
16325C27092O3418A56714J97638C3717L28515A22257J8254J46653e248A40346
$$ plain form
16314 150337 375170 98647 381314 7917 71843 134211 401261 231324 337194 240061 60327
16302 -50254 310791 296745 399511 297278 25289 -35897 189602 190471 567078 301445 222231
16291 222231 297031 204890 98027 30968 84527 170164 442269 277181 97669 -6078 285775
16279 174062 149976 157655 323200 305616 352676 -246121 -157867 117886 -20446 191285 358789
16268 358789 60869 58419 273588 -63627 -51296 4100 287285 123042 10430 205421 -63997
16256 114109 38026 99991 150575 326650 22691 224615 45115 306455 -156527 34593 259559
16245 259559 201915 78112 145631 12923 -170413 -73512 33101 340105 -70972 -6611 238599
16233 242875 108497 212680 57660 -20601 164643 149228 -84456 91785 378681 21857 25638
$$ packed form
16314A50337K24833I8647K82667G917O3926O2368K67050j69937J05870r7133F0327
16302e0254C10791j4046J02766j02233B5289c5897A89602Q69L76607k65633p9214
16291B22231P4800r2141I8027C0968N3559Q5637K72105j65088I7669f078B85775
16279A74062k4086P679J65545j7584M7060b46121Q8254A17886b0446A91285J67504
16268C58789F0869k450K15169f3627J2331D100K83185A23042A0430J94991f3997
16256A14109C8026O1965N0584J76075B2691K01924D5115K61340a56527C4593K24966
16245B59559n7644G8112O7519A2923a70413g3512C3101L07004g0972f611B38599
16233B42875A08497J04183E7660b0601A64643j5415h4456I1785K86896B1857L781
$$ plain form
16222 25638 156565 88339 291149 72034 -291232 -36454 255038 145325 52168 74725 196542
16211 196542 -115998 168277 -89724 167424 175970 -262976 121155 232861 233563 102222 212579
16200 212579 162782 247077 228998 -270126 240478 220635 27105 98749 302193 -40337 366335
16188 41871 -35051 96729 -31466 -144750 416806 472367 154731 -202003 -132771 -129165 111929
16176 24268 131080 15565 -340299 311282 -260214 -249902 58215 151856 329088 255491 164640
16165 164640 164762 80324 -316895 150953 194677 -58091 191435 -137715 281742 -166706 87713
16153 144531 -241751 -280146 2435 -357247 -70222 -170538 -109539 125246 285134 140263
16142 64200 73624 214745 -57068 252714 72193 188542 -317340 55997 -183143 52687 196623
$$ packed form
16222B5638J30927o8226K02810G2034b91232c6454B55038j09713E2168K2557J21817
16211A96542a15998A68277h9724A67424Q546b62976A21155J11706P02A02222J10357
16200B12579m9797Q4295j8079b70126B40478j9843B7105P1644K03444d0337C66335
16188D1871c5051I6729c1466j13284D16806N5561A54731b02003O9232L606A11929
16176B4268J06812A5565c40299C11282b60214J0312E8215R3641J77232p3597r0851
16165A64640J22H0324c16895A50953M3724e8091A91435a37715B81742a66706H7713
16153A44531b41751l8395B435c57247g0222j00316O0999A25246J59888A40263
16142F4200R424J41121e7068B52714G2193J16349c17340E5997a83143E2687J43936
$$ plain form
16131 196623 184965 -10007 93858 167279 59845 119012 41967 -174669 258243 186663 -29307
16119 -73823 76177 4382 -24373 30091 -62486 96221 48674 152507 180159 51950 92565 156173
16107 156173 -379573 92169 -191630 194266 166090 -239202 -81811 196738 -59358 206385
16096 231669 -3693 268869 -7331 78530 58140 230964 -91723 31116 5956 199382 44711
16084 -525596 -194306 234152 -35180 204053 59714 87851 99181 -143514 -95393 -57395 141171
16072 -64034 -76338 98444 -10851 -258376 4012 -163496 100002 165350 2779 -124586 6509
16060 -26076 249253 83126 -162349 110252 -234624 255653 -38614 16429 196704 188307 157155
16049 157155 -282287 47913 -139404 9992 150569 142568 -50264 -142269 -1944 -24635 -124575
$$ packed form
16131A96623j1658a0007I3858P3421E9845N9167D1967a74669B58243p1580b9307
16119g3823G6177D382b4373C0091f2486I6221m7547J03833K7652E1950M0615O3608
16107A56173c79573I2169a91630A94266k8176b39202h1811A96738e9358B06385
16096B31669c693B68869g331G8530k0390J72824i1723C1116E956J93426D4711
16084e25596a94306B34152c5180B04053E9714K8137J1330a43514M8121L7998A41171
16072f4034j2304I8444a0851k47525D012a63496A00002O5348B779a24586F509
16060b6076B49253H3126a62349A10252b34624B55653c8614A6429J80275q397l1152
16049A57155b82287D7913a39404I992J40577q001e0264r2005a944k2691r9940
$$ plain form
16038 -124575 -205047 32790 -125121 122844 13790 -177135 -391852 380922 -60628 6207 289218
16027 289218 -12266 -101940 144897 -38681 -25442 -22436 109905 -276009 -107356 -93111 162060
16015 -128647 339883 185221 31403 32958 3484 -24122 60884 545 -25198 -57574 58054 -144715
16002 -427486 -166916 133861 -117309 -66436 -166773 -20228 91746 154276 44171 -204427
15991 25729 234178 -27718 -334189 239683 40041 -196244 19727 -137495 -27229 386662
15980 602262 -92430 421056 86878 174838 182606 204745 -106227 -176011 -180304 286333 -38766
15968 -79649 151994 96016 -142875 -297576 -316051 -81014 6958 -142022 -69014 -155113 -48901
15956 -136284 -56822 14319 -268161 -209856 -265124 19531 -260681 104919 -129497 207162
$$ packed form
16038a24575q0472C2790a25121A22844A3790a77135k14717C80922f0628F207K83011
16027B89218a2266q9674A44897c8681J3239L006A09905b76009a07356J4245A62060
16015a28647C39883j54662C1403J555C484b4122F0884E45b5198l2376E8054a44715
16002d27486a66916A33861a17309N0873j00337b0228I1746O2530D4171b04427
15991B5729K08449b7718l06471B39683D0041a96244A9727a37495b7229C86662
15980F02262i2430D21056H6878Q7960P768K2139a06227o9784m293B86333c8766
15968g9649A51994n5978a42875j54701j8475h1014F958a42022f9014q6099d8901
15956a36284e6822A4319b68161N8305n5268A9531b60681A04919a29497B07162
$$ plain form
15945 60662 -18512 -141782 -30664 -332241 -114725 -271873 -72768 -359939 -164824 156710
15934 -221692 244030 -96818 -184858 261007 40557 30474 -100006 107744 -105425 -225359
15924 -225359 69049 17191 -219648 97435 125619 14182 -125006 77073 -142355 -240724 -285391
15913 -285391 266317 -213309 186992 -250632 -228729 26531 -77494 347203 -33565 -153254
15903 -153254 -71254 33524 -202926 -227380 275613 -169347 198685 -3663 -385409 66301 -80585
15891 -240291 -141821 11003 -84571 242031 -91928 334172 -133460 118577 116021 23607 -105449
15879 -342506 -167337 -28214 -168562 -164076 86763 122205 63341 -150113 183077 -20954 -177073
15868 -177073 -159911 13039 71499 32986 156630 94421 -201118 -245194 -19961 -40375 109036
$$ packed form
15945F0662a8512j23270c0664l01577a14725j57148g2768k87171a64824A56710
15934b21692B44030i6818q8040B61007D0557j0083a00006A07744a05425j19934
15924b25359F9049A7191b19648I7435K8184A4182a25006G7073a42355r8369m4667
15913b85391B66317b13309A86992b50632K1903B6531g7494C47203c3565j19689
15903a53254g1254C3524b02926k4454B75613a69347A98685c663l81746F6301h0585
15891b40291R8470A1003h4571B42031i1928C34172a33460A18577k556B3607a05449
15879c42506a67337b8214j40348M486H6763L5442n8864a50113A83077b0954j56119
15868a77073J7162A3039N8460C2986J23644o2209b01118m4076a9961k0414A09036
$$ plain form
15856 281117 -80122 -159305 41230 -119078 -35976 -107859 70453 -59391 234026 -45431 143483
15844 -232230 19237 -360566 96799 112527 129600 8824 21532 56020 317910 -69881 194073
15832 -32333 121101 -15048 -22549 -7195 -189557 20731 99689 -128571 -50115 -53334 -174491
15821 -174491 -254784 10751 9657 -61274 93515 -226031 -57518 -266424 -179490 -31438 51755
15809 -128297 -18597 -6964 132621 120959 -22940 -173038 -289921 204028 305895 68093 191933
15798 191933 -95140 34843 -581741 333856 287756 -245741 -107209 113445 -267686 -237326
15788 -237326 31036 -221824 -23414 -71818 -139799 53569 -135944 100058 -241703 17851 56045
15777 56045 -275298 -19420 147981 5127 166747 91943 -243982 -175914 20894 5177 -67201
$$ packed form
15856B81117h0122p9183D1230a19078c5976p1883G0453e9391B34026d5431A43483
15844b32230A9237c60566I6799J5728J7073H824J2708L4488K61890f9881A94073
15832c2333A21101a5048p501g195j82362B0731P8958a28571e0115l219j21157
15821a74491q0293A0751j094f1274I3515b26031e7518k08906Q6934c1438E1755
15809a28297a8597f964A32621j1662b2940j50098j16883B04028J01867F8093J23840
15798A91933i5140C4843e81741C33856m6100b45741a07209A13445b67686L0360
15788b37326C1036b21824b3414m8404o7981E3569a35944A00058b41703A7851L8194
15777E6045b75298a9420A47981E127J61620p4804b43982O8068B0894E177f7201
$$ plain form
15765 301041 342875 85591 44003 -4761 -95960 79935 -16794 -109480 -97179 41428 264611
15754 264611 1946 285742 10202 193739 304166 309428 91256 37962 127921 -30590 82850
15742 185046 -3678 523606 107880 44034 -116438 -255018 -63516 -301880 46069 68419 -163274
15730 -198560 -371797 -68034 -224653 -107574 86591 -39734 -140030 -209213 13327 -13762 -257469
15719 -257469 -264683 -21430 21748 -217002 -63437 -35610 -138273 -90161 22288 -147534 -260787
15708 -260787 -54291 -17484 16278 -79725 221708 97088 57099 -192909 68573 -264427 -194700
15697 -194700 -34164 -103522 283693 165176 307578 57861 339001 -71506 -28326 -97620 -166837
15686 -166837 123935 -79398 362849 -30351 7042 136196 133552 19770 133858 -46110 -76048
$$ packed form
15765C01041M1834H5591m1588d761r1199G9935a6794r2686J2301D1428K23183
15754B64611A946K83796A0202J83537J10427N262I1256C7962Q9959c0590H2850
15742A85046c678E23606A07880D4034a16438j38580f3516k38364D6069K2350a63274
15730a98560j73237f8034j56619a07574H6591c9734j00296o9183A3327a3762k43707
15719b57469p214b1430B1748b17002f3437K7827j02663M8112B2288a47534j13253
15708b60787e4291a7484A6278g9725B21708I7088l9989a92909F8573b64427O9727
15697a94700c4164o9358B83693j18517J42402E7861K81140g1506b8326o9294o9217
15686a66837A23935g9398C62849c0351G042J29154k644A9770J14088d6110k9938
$$ plain form
15675 -76048 252319 -250009 202969 140870 -20528 197293 -100796 83636 75236 395839 64604
15663 -126164 -245565 -147208 114434 38822 -14992 21913 -231094 75157 63163 68758 289716
15652 289716 -9440 -286957 30355 184339 -171101 -130043 9285 -162040 58308 117560 48357
15640 135577 -153105 -2188 153506 -65448 -11344 -98368 63180 77162 -248447 -96380 202670
15628 -201246 29373 -78851 -20072 -125787 254910 138346 -70875 506719 -92010 -101581 -33651
15616 -108443 -284915 -244091 -259300 -81595 -85655 -135913 -43530 -318320 20335 -128813 238370
15604 -136852 99977 -78325 -209894 78082 -231423 31393 253065 46039 168827 -12572 -9725
15593 -9725 7948 -342571 -13028 57755 95918 115970 -119657 100917 -180526 -116966 -226443
$$ packed form
15675g6048B52319b50009B02969o2099b0528A97293a00796H3636q400L20603F4604
15663a26164j19401R8357A14434C8822a4992B1913b31094G5157j1994N595K20958
15652B89716i440k77517C0355J53984a71101M1058I285a62040E8308N9252D8357
15640A35577a53105b188A53506f5448a1344q7024F3180J3982b48447i6380B02670
15628b01246B9373g8851b0072j05715B54910j16564g0875E06719i2010r571c3651
15616a08443j76472M0824j5209h1595m060n0258d3530k74790B0335a28813B38370
15604a36852I9977g8325j31569G8082b31423C1393K21672D6039J22788a2572K847
15593i725G948c42571a3028E7755L8163K0052a19657A00917a80526O3560j09477
$$ plain form
15582 -226443 -20390 -50876 -148175 -183593 236905 40541 -51530 -265723 -89209 -44392 56055
15570 56346 131670 410036 -112872 -12284 -41949 -105872 -249729 1747 168721 -92313 -10923
15558 88141 9137 -5509 51129 99580 144241 -280980 -271857 -180298 1435 -104383 -114592 324157
15545 -261002 -351699 73827 74852 74795 93725 -257217 -74064 148273 389297 -53123 -209260
15534 -209260 -46271 -230776 -214070 -176923 -144213 -138411 223985 -7915 296683 -61887 -210111
15523 -210111 141495 68090 -16121 -115838 114257 -107448 99995 -89032 62343 80670 328068
15512 328068 -161111 -199720 -15929 279009 -128771 286368 -353204 -298305 -184623 346574
15501 33473 -334228 -109090 198446 -119191 -316739 17956 -162939 19719 -62306 165227
$$ packed form
15582b26443b0390l0486r7299l5418B36905D0541e1530k14193h9209d4392E6055
15570E6346P5324K78366a12872a2284k9665o3923j43857A747J66974i2313a0923
15558H8141I137e509E1129M8451M4661b80980R123R1559A435a04383j0209C24157
15545b61002r0697G3827J025n7J8930b57217g4064A48273K41024e3123j56137
15534b09260d6271j84505J6706L7147L2710N802B23985g915B96683f1887j48224
15523b10111A41495F8090a6121r9717A14257a07448I9995h9032F2343J8327K47398
15512C28068a61111l8609a5929B79009a28771B86368c53204N4899J13682C46574
15501C3473c34228a09090A98446a19191j97548A7956a62939A9719f2306A65227
$$ plain form
15490 64456 160708 -76178 -55525 -238503 48732 196558 24106 105970 69855 -81682 19078
15478 313361 266958 362277 -173231 -38831 -35121 -101880 49454 -245114 -101561 -142871 -56321
15466 -111094 -45090 481740 -218718 -17497 -44746 -211047 -97365 120416 40124 117634 -153492
15454 144822 -220444 246603 -111593 46809 -330638 9679 -100559 39837 -2433 -66672 -71032
15443 -71032 -102116 100375 -45985 -162501 -40407 204640 -24077 -212911 86774 -45403 56225
15431 -122811 -210386 264189 97347 1065 -327147 -58577 73436 -40642 59801 -94748 173648
15419 13898 -43609 146888 52304 219290 8660 -75144 -52789 101274 -368861 -207264 52171
15407 100809 428469 -45849 -223081 -100869 311233 -306464 -242797 -51980 83565 -53125
$$ packed form
15490F4456R6252g6178K0653j82978D8732J47826B4106Q1864l6115h1682A9078
15478C13361m6403R5319a73231c8831L710o6759D9454b45114a01561m1310e6321
15466a11094d5090D81740b18718a7497k7249j66301i7365A20416D0124P7510a53492
15454A44822b20444B46603a11593D6809c30638I679a00559C9837b433o4239m360
15443g1032l1084A00375d5985j16516d0407B04640b4077j88834H6774d5403E6225
15431a22811q7575B64189I7347A065c27147e8577G3436d0642E9801i4748A73648
15419A3898d3609A46888E2304J66986H660g5144K2355A01274c68861J61597E2171
15407A00809L27660d5849j77232a00869C11233c06464O3667e1980H3565e3125
$$ plain form
15396 82792 193136 -227746 -138968 291463 112491 235276 -14025 -62686 -10828 3690 -135791
15384 222456 -65092 56040 -143599 -186563 -35836 173369 -19932 -698 260947 107671 -70444
15372 61682 -144583 383 -15773 205736 -191598 27109 11010 208533 -9631 -177673 -98665
15361 -98665 60921 -181750 92216 -178785 -50865 -287711 -198083 9635 -252819 41276 -123499
15349 163912 -134814 223507 145477 -42758 78358 65750 200715 3843 -291609 99226 255135
15338 255135 39866 -485617 19748 -180933 36883 -162508 123955 195981 -149298 191652
15327 -108196 155434 91814 156963 -216433 -85511 93045 303560 -257894 343448 -64785
15316 -86086 147939 242331 -119825 -15542 120814 -69456 -120542 -41634 -106179 -10310 266
$$ packed form
15396H2792J10344b27746Q8778B91463A12491J22785a4025m8661a0828C690a35791
15384B22456f5092E6040a43599m2964c5836A73369a9932f98B60947A07671g0444
15372F1682a44583C83a5773B05736a91598B7109A1010J97523i631j68042P9008
15361i8665F0921a81750I2216a78785e0865k36846Q9628I635b52819D1276a23499
15349A63912a34814B23507p8030d2758G8358j2608J34965C843b91609I9226J55909
15338B55135C9866d85617A9748a80933C6883a62508A23955P2026a49298A91652
15327a08196A55434o3620O5149b16433h5511I3045K10515b57894C43448f4785
15316h6086A47939R4392a19825a5542A20814f9456n1086d1634o4545a0310B66
$$ plain form
15304 205475 130302 -87466 227464 20094 67614 59327 -18298 116771 -127138 304956 -72791
15292 -236614 -137942 -81669 -39123 31854 -255048 -93723 -148070 95987 -86037 -178072 -31474
15280 -253195 147682 303858 219913 110973 314896 -39008 -45348 264361 -172384 -39432
15269 313002 -159122 232603 247966 379388 -145180 135423 209917 -258464 41482 79111
15259 79111 307599 188340 121126 372019 177718 77740 18963 121960 190466 -92048 220729
15247 536497 1005115 1764310 1229387 1935401 991631 996569 370849 22622 87878 50497
15237 50497 -46000 226634 208230 147977 -45460 59281 73628 -3771 -35125 133069 -50819
15225 -52121 48631 -157444 -55545 78263 -80650 144153 167264 252133 175922 69708 159635
$$ packed form
15304B05475p5173h7466B27464B0094M7520q287a8298A16771a27138C04956g2791
15292b36614R8672N6273c9123C1854b55048i3723n4347I5987h6037r2035c1474
15280b53195A47682J56176q3945j08940K03923c9008o340B64361a72384c9432
15269C13002a59122B32603J5363J31422a45180A35423P4494b58464D1482L7629
15259G9111K28488j19259o7214K50893A77718G7740A8963J02997O8506i2048B20729
15247E36497M68618P59195n34923P06014r43770M938C70849B2622O5256l7381
15237E0497d6000B26634j8404o0253d5460E9281J4347c771l1354A33069e0819
15225e2121D8631a57444e5545G8263h0650A44153K3111Q4869p6211F9708Q9927
$$ plain form
15214 159635 58939 219754 -82501 348700 -26989 245827 18309 144341 256524 149139
15204 149139 157635 -22300 29419 59063 -92301 354251 -108468 220588 5722 -22590 47968
15192 -272198 -357821 139980 82819 -182394 99709 249128 -127447 -14655 6672 232112 -172031
15180 -260085 5556 111488 -8887 -223593 974 85902 81203 263507 -57868 3101 18632 101208
15168 101208 201524 79746 -4860 -230039 176418 262684 -90143 -130622 128159 -64063 -428523
15157 -428523 85701 128671 164626 -156771 7662 -42265 72933 75976 -99104 -107071 16424 358692
15145 358692 -5956 -32049 -56802 66391 -172719 321438 -27243 -17921 159641 2623 239784
15134 239784 91192 151022 456171 278344 342368 127378 -208584 487283 -80879 35496
$$ packed form
15214A59635E8939J60815h2501C48700b6989B45827A8309J26032J12183j07385
15204A49139Q496b2300B9419K9644i2301C54251a08468B20588E722b2590D7968
15192b72198q5623A39980n7161a82394I9709J49419a27447a4655F672K25440a72031
15180b60085E556J05932h887k14706I74Q4928m699J82304e7868C101J5531Q2576
15168A01208J00316G9746d860k25179A76418Q6266i0143m0479A28159f4063l64460
15157d28523H5701M2970L5955a56771G662d2265G2933L043i9104p967A6424L42268
15145C58692e956k6093k4753F6391a72719C21438b7243R322A59641B623K37161
15134B39784I1192N9830L05149j77827O4024A27378b08584D87283h0879C5496
$$ plain form
15123 446025 -160014 218604 -47194 55641 175804 315791 8677 141755 122450 328172
15113 328172 -143080 129055 -132478 117020 11840 -65595 30473 121661 136214 -44775 96076
15101 250666 30851 -100385 -152101 284661 42250 -116269 -55999 142895 419039 -12175
15090 203152 -128805 15525 150122 -125801 50665 -115392 118438 173084 -176282 261991
15079 462398 287505 -90579 233322 -120658 30893 32381 -51271 450565 448370 62706 -79636
15067 108128 447083 156765 185710 -189563 64853 43326 152085 46687 189411 -7505 206301
15055 369255 141662 114961 230993 -66020 260587 53656 -177203 -1365 482430 -164439
15044 131845 453378 378999 283940 -49203 69804 578906 376930 151208 110643 151597 32128
$$ packed form
15123D46025a60014B18604d7194E5641J20163J39987H677J33078j9305K05722
15113C28172a43080A29055a32478A17020A1840f5595C0473R1188J4553d4775I6076
15101B50666C0851a00385n1716B84661D2250a16269e5999A42895K76144a2175
15090B03152a28805A5525J34597a25801E0665a15392A18438N4646a76282B61991
15079D62398j74893i0579B33322a20658C0893J488e1271D50565k195F2706g9636
15067A08128L38955A56765K8945a89563F4853k1527J08759D6687J42724g505B06301
15055C69255A41662k6701J16032f6020B60587E3656a77203a365D82430a64439
15044A31845L21533p4379r5059d9203F9804N09102k01976A51208m0565M0954C2128
$$ plain form
15032 526544 275247 240182 51732 111008 -126718 593906 41094 200712 130753 47728 -168278
15020 374726 101205 118431 -92853 296962 121008 458335 23122 -22775 162194 220277
15010 220277 -92791 250856 281253 23894 102142 279971 164180 97516 37535 330006 159538
14998 196838 220649 366545 45695 -34693 -77909 394355 198760 255955 -151949 30935 160539
14987 160539 213766 255064 -183868 140731 75768 62130 127937 267833 328862 429010 242309
14976 242309 253706 253035 303495 -20369 222771 64563 395716 406150 588324 198900 323921
14965 323921 102325 159546 135750 -107026 475034 -48520 14235 -91661 307012 223087 232115
14954 232115 419213 141647 209276 326988 109434 -49009 374003 190281 382984 376019
$$ packed form
15032E26544k51297l5065E1732N9276a26718E93906D1094J59618o9959D7728a68278
15020C74726A01205J7226i2853B96962A21008L37327B3122b2775A62194N8083
15010B20277i2791B50856L0397B3894P8248J77829j15791o6664C7535K92471A59538
14998A96838K3811J45896D5695c4693m3216C94355j95595N7195a51949C0935J29604
14987A60539N3227M1298a83868A40731o4963j3638O5807J39896O1029J00148j86701
14976B42309J1397o71N0460b0369B22771F4563L31153J0434J82174A98900J25021
14965C23921A02325N7221k3796a07026D75034d8520A4235i1661C07012q3925R028
14954B32115J87098A41647O7629J17712A09434d9009C74003j83722J92703o965
$$ plain form
14944 376019 300398 402692 77846 40163 119318 468364 526203 214338 245350 287213 -113835
14932 71400 439750 176809 116164 362619 563364 101384 384863 231150 480725 6098
14921 385813 420200 -98694 129075 78825 212914 238645 287471 481209 367467 227844
14911 227844 431739 574617 549627 354905 441761 20758 197225 343758 454864 308868
14901 308868 -38468 49208 196679 124105 202986 158880 655818 202993 391840 221657
14891 221657 323043 341576 175678 302499 260107 238022 263564 589240 202851 307462
14881 307462 309126 340670 137154 386983 327784 441560 228741 183012 612115 178451
14870 393952 445654 446451 43114 295268 441632 403239 520730 270384 371143 275891 572887
$$ packed form
14944C76019p5621J02294G7846l7683P9155L49046N7839B14338L1012M1863a13835
14932G1400L68350A76809o0645K46455K00745A01384K83479j53713K49575F098
14921C85813L4387i8694A29075n0250J34089K5731M8826J93738j13742j39623
14911B27844K03895J42878k4990j94722Q6856B0758J76467J46533J11106j45996
14901C08868c8468D9208J47471p2574P8881m4106M96938B02993J88847j70183
14891B21657J01386J8533j65898J26821m2392k2085K5542L25676B02851J04611
14881C07462J664L1544A37154K49829n9199J13776k12819m5729M29103A78451
14870C93952N1702P97D3114K52154J46364l8393J17491k50346J00759r5252K96996
$$ plain form
14859 572887 512754 424274 412235 723255 335146 581831 91836 472707 357213 231537
14849 231537 480700 103655 514465 524456 173903 633184 266037 353967 660337 198936
14838 261181 321151 444995 612264 232543 569961 534427 392205 156225 344656 621956
14828 621956 527852 546273 228377 859595 525264 397667 541613 323146 735858 558668
14818 558668 383223 426205 507620 471665 465664 723936 652629 372195 615311 490806 610504
14807 610504 342990 701269 550092 513979 446930 695261 685015 782173 293992 865742
14797 865742 317769 578250 493992 565682 735357 423557 360576 441613 895149 757042
14787 757042 697485 551096 639908 749957 564931 441714 643292 55427 326432 864206
$$ packed form
14859E72887o0133q8480j2039L11020C35146K46685I1836L80871j15494j25676
14849B31537K49163A03655M10810R991A73903M59281B66037Q7930L06370A98936
14838B61181N9970J23844J67269B32543L37418l5534j42222A56225J88431K77300
14828F21956r4104J8421B28377O31218l34331j27597J43946k18467M12712j77190
14818E58668j75445M2982Q1415l5955o001K58272p1307k80434K43116j24505J19698
14807F10504k67514L58279j51177l6113o7049K48331j0246R7158B93992N71750
14797H65742C17769K60481q4258P1690J69675l11800o2981Q1037M53536j38107
14787G57042n9557j46389Q8812J10049j85026j23217K01578E5427K71005N37774
$$ plain form
14777 864206 633145 770128 584426 641354 447842 1018033 432928 558282 599613 375197
14767 375197 676402 407400 459118 631809 664225 642273 439793 796766 671105 200699
14756 464078 670469 649578 784208 616774 472585 412753 637656 524509 659605 506669
14746 506669 673800 446930 739009 542300 626175 853839 647198 764277 940986 682641
14736 682641 865702 685540 743988 921426 620861 649850 578945 816065 820670 570834
14726 570834 723179 523236 552881 807859 418027 836250 900576 1069304 738738 447316
14716 447316 785239 856456 446651 546643 966517 862642 782823 822429 699674 906507
14706 906507 853418 861269 723920 926877 641244 889257 640484 642359 790855 1051088
$$ packed form
14777H64206k31061J36983j85702N6928j93512N70191D32928J25354M1331k24416
14767C75197L01205k69002N1718J72691L2416k1952k02480L56973j25661B00699
14756D64078K06391k0891J34630j67434j44189n9832K24903j13147J35096j52936
14746E06669J67131k26870K92079j96709Q3875K27664k06641J17079J76709k58345
14736F82641J83061j80162N8448J77438l00565K8989p0905K37120M605k49836
14726E70834J52345j99943K9645K54978l89832M18223O4326J68728l30566k91422
14716D47316L37923P1217m09805R9992M19874j03875p9819L9606j22755K06833
14706I06507n3089P851j37349K02957k85633K48013k48773J875J48496K60233
$$ plain form
14696 1051088 757291 802671 1080453 705109 1107383 861865 829795 941054 745638 925357
14686 925357 947300 1137614 1013815 1067076 731555 452552 705112 983273 1039337 1208173
14676 1208173 1258290 878080 894010 990695 1274996 725657 915752 701717 784323 1117136
14666 1117136 1029357 866481 906935 1332482 1198684 961144 955466 806408 905259 899139 949013
14655 949013 1181579 1238048 1049840 1132447 1135863 952314 1045382 1184998 1003412 1400267
14645 1400267 1073246 1081792 1182513 994239 1339668 1188169 1318722 1283780 1074065 1433702
14635 1433702 1499707 1063644 1527477 1245896 1282733 1018521 1333133 1488418 971884 1358818
14625 1358818 1276002 1271498 1432805 1238258 1456607 1300440 1155887 1380297 1566703 1423645
$$ packed form
14696A051088k93797M5380K77782l75344M02274k45518l2070J11259j95416J79719
14686I25357K1943J90314j23799N3261l35521k79003K52560K78161N6064J68836
14676A208173N0117l80210J5930R6685K84301n49339J90095k14035Q2606L32813
14666A117136q7779j62876M0454M25547j33798k37540n678j49058R8851o120M9874
14655I49013K32566N6469j88208Q2607L416j83549R3068J39616j81586L96855
14645A400267l27021Q546J00721j88274L45429j51499J30553l4942k09715L59637
14635A433702O6005m36063M63833k81581L6837k64212L14612J55285n16534L86934
14625A358818q2816m504J61307j94547K18349j56167j44553K24410J86406j43058
$$ plain form
14615 1423645 1364267 1430336 1300479 1361838 1573227 1590748 1619254 1454550 1412332 1424004 1609631
14604 1609631 1651492 2052127 1703590 1261794 1909621 1624038 1763007 1536521 1745747 1751415
14594 1751415 1754758 1817646 1852091 1808586 1953809 1484154 1715461 1643711 1626949 1825544 1478672
14583 1478672 2035478 1657776 2179981 2176867 1900374 2201452 1981664 2146255 1852540 1908154
14573 1908154 2009330 2079757 2574369 1888926 2557444 1895331 2296620 2312264 2476737 2428797
14563 2428797 2536378 2618624 2365852 2702065 2684847 2833007 2929804 3162483 2932716 3198248
14553 3198248 3950949 3762991 4655733 5748009 7366099 10822864 17905725 36164271
14545 36164271 48723505 22526931 12363245 7370535 3475468 2615066 2143723 2089698
$$ packed form
14615A423645n9378O6069j29857O1359K11389J7521K8506j64704m2218J1672J85627
14604A609631M1861M00635l48537m41796O47827k85583J38969k26486K09226N668
14594A751415L343O2888L4445m3505J45223m69655K31307p1750j6762J98595l46872
14583A478672N56806l77702N22205l114k76493L01078k19788J64591k93715N5614
14573A908154J01176P0427M94612o85443O68518o62113M01289J5644J64473m7940
14563B428797J07581Q2246k52772L36213j7218J48160R6797K32679k29767K65532
14553C198248P52701j87958Q92742J092276J618090L456765P082861J8258546
14545C6164271J2559234B2526931j0163686m992710C475468q60402m71343n4025
$$ plain form
14537 2089698 1879667 1885367 2040467 2271490 1738006 2054933 1953815 2217678 2179499 2256239
14527 2256239 2265345 2070708 2130772 2345514 2523599 2606040 2544320 2674236 2339487 2600300
14517 2600300 2528327 2874358 2578774 2916621 3137168 2626134 2786907 2940068 2587214 2997106
14507 2997106 3028302 2675346 3015896 3162241 2962532 3059128 2800243 3097586 2945038 3206136
14497 3206136 3215706 3015981 3262262 3371480 3324555 3466734 3431367 3338141 3574401 3303125
14487 3303125 3423777 3730951 3862330 3578696 3801386 3580224 3831093 4017732 4006732 4062393
14477 4062393 3838036 4059047 4267679 4330613 4244916 4179450 3993104 4136954 4172966 4332630
14467 4332630 4273692 4421220 4753960 4444773 4774891 4578259 4872946 4568183 4811989 5135070
$$ packed form
14537B089698k10031N700J55100K31023n33484L16927j01118K63863l8179P6740
14527B256239R106j94637O0064K14742J78085Q2441o1720J29916l34749K60813
14517B600300p1973L46031k95584L37847K20547n11034J60773J53161l52854M09892
14507B997106L1196l52956L40550J46345j99709R6596k58885K97343j52548K61098
14497C206136R570j99725K46281J09218m6925J42179l5367r3226K36260k71276
14487C303125J20652L07174J31379k83634K22690k21162K50869J86639j1000N5661
14477D062393k24357K21011K08632O2934q5697o5466j86346J43850L6012J59664
14467D332630n8938J47528L32740l09187L30118j96632K94687l04763K43806L23081
$$ plain form
14457 5135070 4947490 5135591 5090844 4783220 5178775 5336845 5361657 4947879 5236682 5291867
14447 5291867 5361689 5555314 5464818 5698163 5743505 6038746 5757165 6238688 6024442 6445539
14437 6445539 6278047 6408526 6333065 6475369 6455257 6679299 6561620 6377081 7073014 6942113
14427 6942113 7226911 7189661 7296370 7171361 7457513 7443804 7803264 7913591 7496034 7850342
14417 7850342 7968597 8218099 8412370 8582749 8453927 8777970 8842538 8914363 9582094 9067056
14407 9067056 9182526 9853413 9581378 10117632 9957556 10191016 10380258 10323038 10707488 10429760
14397 10429760 10799449 11100820 11128856 11283251 11292583 12077596 11845539 11981466 12338954 12597793
14387 12597793 13027723 13127499 13227705 13603497 13630101 14204108 14440289 14652693 14945843 15179638
$$ packed form
14457E135070j87580J88101m4747l07624L95555J58070K4812m13778K88803N5185
14447E291867O9822J93625r0496K33345M5342K95241k81581M81523k14246M21097
14437F445539j67492J30479p5461J42304k0112K24042j17679j84539O95933j30901
14427F942113K84798l7250J06709j25009K86152j3709L59460J10327m17557L54308
14417G850342J18255K49502J94271J70379j28822L24043O4568P1825O67731n15038
14407I067056J15470O70887k72035N36254j60076K33460J89242n7220L84450k77728
14397A0429760L69689L01371K8036J54395R332P85013k32057J35927L57488K58839
14387A2597793M29930R9776J00206L75792K6604N74007K36181K12404K93150K33795
$$ plain form
14377 15179638 15418663 15484582 15990651 16285547 16605341 16874309 17515797 17550924 17828166 17977726
14367 17977726 18593059 19185343 19710121 20093674 20485360 20925868 21550357 21820853 22290885
14358 22290885 22823060 23317414 23942728 24406366 25013293 25447053 25857698 27008935 27919025
14349 27919025 28114247 28670906 29544655 30121316 30983738 32059561 32762610 33656329 34377866
14340 34377866 35555651 36517865 37177554 38270855 39274238 40633121 41748662 43131364
14332 43131364 44446924 45503971 47250901 48694766 50163015 51584466 53556209 54877668
14324 54877668 57061675 58826264 60844787 63194780 65546580 67578748 70455376 73135412
14316 73135412 75558103 78878387 81388416 84797528 88245442 91434556 95617824 99575714
$$ packed form
14377A5179638K39025O5919N06069K94896L19794K68968O41488L5127K77242J49560
14367A7977726O15333N92284N24778L83553L91686M40508O24489K70496M70032
14358B2290885N32175M94354O25314M63638O06927M33760M10645J151237R10090
14349B7919025J95222N56659Q73749N76661Q62422J075823P03049Q93719P21537
14340C4377866J177785R62214O59689J093301J003383J358883J115541J382702
14332D3131364J315560J057047J746930J443865J468249J421451J971743J321459
14324E4877668K184007J764589K018523K349993K351800K032168K876628K680036
14316G3135412K422691L320284K510029L409112L447914L189114M183268L957890
$$ plain form
14308 99575714 103772161 108414848 112997009 117838074 123599501 129118792 135462371 141600079
14300 141600079 148595214 155543224 163267683 171101943 179835236 189073295 198735989 208484716
14292 208484716 219069129 230389005 241836545 254128699 266908106 280115638 294018745
14285 294018745 308491701 323381467 338372351 353779309 369148248 383995796 399104221
14278 399104221 413356822 426906359 439310519 450396391 458719568 462766148 463802217
14271 463802217 465170797 466941293 463165356 459106926 453303696 448661962 440629685 429655736
14263 429655736 417174167 403107700 388270280 372300185 356217473 340086122 324249988
14256 324249988 308366337 293261628 278876835 265845277 253042324 239631081 227819104
$$ packed form
14308I9575714M196447M642687M582161M841065N761427N519291O343579O137708
14300A41600079O995135O948010P724459P834260Q733293R238059R662694R748727
14292B08484716J0584413J1319876J1447540J2292154J2779407J3207532J3903107
14285B94018745J4472956J4889766J4990884J5406958J5368939J4847548J5108425
14278C99104221J4252601J3549537J2404160J1085872Q323177M046580J036069
14271D63802217J368580J770496l775937m058430n803230m641734q032277j0973949
14263D29655736j2481569j4066467j4837420j5970095j6082712j6131351j5836134
14256C24249988j5883651j5104709j4384793j3031558j2802953j3411243j1811977
$$ plain form
14249 227819104 216576059 205644485 195456033 185503531 176706603 168824434 160520854
14242 160520854 152834145 145676382 139069252 132441745 126933512 121743059 116241906 111000251
14234 111000251 106122263 101755781 97696292 94415131 90540543 86823253 82975155 80000679
14226 80000679 77056847 74301547 71494276 68877445 66548163 64010230 62064575 60141234
14218 60141234 57658451 55906568 54014323 52121997 50860059 49617077 47708897 46078551
14210 46078551 44636877 43686227 42414767 41492788 40654024 39188070 37790147 36977427 35917093
14201 35917093 35197005 34148491 33108525 32511878 31311446 30413254 29585936 29278090 28782826
14192 28782826 27561787 27105882 25944328 25839693 25135548 24736116 23953875 23391626 22994719
$$ packed form
14249B27819104j1243045j0931574j0188452r952502q796928p882169q303580
14242A60520854p686709p157763o607130o627507n508233n190453n501153n241655
14234A11000251m877988m366482m059489l281161l874588l717290l848098k974476
14226H0000679k943832k755300k807271k616831k329282k537933j945655j923341
14218F0141234k482783j751883j892245j892326j261938j242982j908180j630346
14210D6078551j441674r50650j271460r21979q38764j465954j397923q12720j060334
14201C5917093p20088j048514j039966n96647j200432q98192q27318l07846m95264
14192B8782826j221039m55905j161554j04635p04145l99432p82241n62249l96907
$$ plain form
14183 22994719 22466711 21945247 21352096 20935947 20628829 19888219 19752409 19402242 18731053
14174 18731053 18581026 18330073 18059469 17395001 17416641 16835830 16453957 16314571 15938871
14165 15938871 16074733 15107314 14994846 14809849 14671993 14436593 13946702 13734325 13464026
14156 13464026 13399984 13014486 13010906 12520120 12350589 12439548 12017489 12025449 11622781 11931140
14146 11931140 11139160 10969765 10949872 10477237 10681176 10477164 10610474 10270947 10183818 10022207
14136 10022207 9697486 9669839 9471845 9324687 8960664 9083292 9084423 8830047 8863855 8268008
14126 8268008 8491039 8592133 8355540 8296113 8052586 8057659 8008984 8053108 7648670 7676969
14116 7676969 7540330 7172523 7379872 7298193 7023108 7021456 6789060 6937867 6619282 6740562
$$ packed form
14183B2994719n28008n21464n93151m16149l07118p40610j35810l50167o71189
14174A8731053j50027k50953k70604o64468K1640n80811l81873j39386l75700
14165A5938871J35862r67419j12468j84997j37856k35400m89891k12377k70299
14156A3464026o4042l85498l580m90786j69531Q8959m22059P960m02668L08359
14146A1931140p91980j69395j9893m72635K03939k04012J33310l39527q7129j61611
14136A0022207l24721k7647j97994j47158l64023J22628J131k54376L3808n95847
14126H268008K23031J01094k36593n9427k43527N073m8675M4124m04438K8299
14116G676969j36639l67807K07349q1679k75085j652k32396J48807l18585J21280
$$ plain form
14106 6740562 6560544 6459382 6220189 6251787 6274980 5729771 6024606 6048578 6034431 5912337
14096 5912337 5548853 5931637 5338958 5694717 5485155 5604079 5373301 5334164 5490533 5280166
14086 5280166 5274495 4938973 5106791 5049408 4973651 5072454 5056773 4646163 4650582 4746458 4464507
14075 4464507 4257488 4259405 4345132 4573543 4538883 4205157 4308585 4178751 4114773 4195218
14065 4195218 4098910 4223591 4003422 4097017 4143952 4151123 4020676 4205984 4062673 3530120
14055 3530120 3610009 3957536 3705342 3644834 3388241 3738078 3376787 3375194 3367786 3171111
14045 3171111 3512066 3459237 3292143 3140064 3033758 3064460 3380309 3105603 3076755 3265129
14035 3265129 3285208 2926627 2968820 3318762 3300005 3184393 3155038 3097587 2720075 2967565
$$ packed form
14106F740562j80018j01162k39193L1598K3193n45209K94835K3972j4147j22094
14096E912337l63484L82784n92679L55759k09562J18924k30778l9137J56369k10367
14086E280166n671l35522J67818n7383p5757R8803j5681m10610M419R5876k81951
14075D464507k07019J917Q5727K28411l4660l33726J03428j29834o3978Q0445
14065D195218r6308J24681k20169R3595M6935P171j30447J85308j43311n32553
14055C530120P9889L47527k52194o0508k56593L49837l61291j593p408j96675
14045C171111L40955n2829j67094j52079j06306L0702L15849k74706k8848J88374
14035C265129K0079l58581M2193L49942j8757j15612k9355n7451l77512K47490
$$ plain form
14025 2967565 2873350 2777358 2990826 2779135 2543569 2840605 2395385 2811994 2566147 2634626
14015 2634626 2415528 2499772 2643986 2335311 2526277 2278270 2379710 2251663 2381245 2379658
14005 2379658 2407562 2227287 2182132 2256138 1966641 2446503 2058818 2137151 1805339 1782285
13995 1782285 1848344 2040455 1876260 2127159 2368565 2806497 3677090 6003109 10851750
13986 10851750 26888439 50502920 28669497 15333601 9065488 6027705 4955752
13979 4955752 3882491 3904960 3421628 2990464 2978416 2781576 2683851 2962380 2617098 2757948
13969 2757948 2511717 2396279 2498219 2310209 2440250 2259862 2284014 2329875 1779347 2101873
13959 2101873 2399842 1934104 2282354 1676009 1825028 1826498 1967932 1812151 1921585 1748951
$$ packed form
14025B967565r4215r5992K13468k11691k35566K97036m45220M16609k45847O8479
14015B634626k19098Q4244J44214l08675J90966k48007J01440j28047J29582j587
14005B379658K7904j80275m5155P4006k89497M79862l87685P8333l31812k3054
13995A782285O6059J92111j64195K50899K41406M37932Q70593K326019M848641
13986A0851750J6036689K3614481k1833423j3335896o268113l037783j071953
13979D955752j073261K2469m83332m31164j2048j96840r7725K78529l45282J40850
13969B757948k46231j15438J01940j88010J30041j80388K4152M5861n50528L22526
13959B101873K97969m65738L48250o06345J49019J470J41434j55781J09434j72634
$$ plain form
13949 1748951 2169269 2008321 1960401 1852907 1840976 1537944 1997883 1531161 2084246 1765125
13939 1765125 2211204 1773931 1592676 1653236 1852972 1871836 1789249 1739310 1712804 1783373
13929 1783373 1398788 1570743 1864026 1511003 1512606 1507534 1599271 1649051 1413420 1169002
13919 1169002 1601932 1825759 1615965 1667209 1222187 1452668 1695174 1337423 1365506 1728179
13909 1728179 1576546 1365793 1330263 1556235 1478355 1518897 1340440 1414267 1288058 1451481
13899 1451481 1111474 1203214 1377693 1273648 1354230 990639 1505733 1210451 1364790 1107409
13889 1107409 1416015 1471889 1088164 1593877 1510567 1390084 1140146 796186 1087991 1414218
13879 1414218 1534464 1156624 1341919 1079274 1376413 1493136 1146558 1130243 1102949 1079359
$$ packed form
13949A748951M20318j60948m7920j07494j1931l03032M59939m66722N53085l19121
13939A765125M46079m37273j81255O0560J99736J8864q2587m9939k6506P0569
13929A783373l84585J71955K93283l53023J603n072R1737M9780k35631k44418
13919A169002M32930K23827k09794N1244m45022K30481K42506l57751K8083L62673
13909A728179j51633k10753l5530K25972p7880M0542j78457P3827j26209J63423
13899A451481l40007R1740J74479j04045Q0582l63591N15094k95282J54339k57381
13889A107409L08606N5874l83725N05713q3310j20483k49938l43960K91805L26227
13879A414218J20246l77840J85295k62645K97139J16723l46578j6315k7294k3590
$$ plain form
13869 1079359 1255199 1556270 1102193 1353324 1054882 1070327 1086033 1300698 745559 1191923
13859 1191923 919166 813000 957327 1272049 970992 1471776 1229226 866916 1178178
13850 1178178 1250100 1220360 1211780 958877 1104883 1438151 1270028 823229 913172 1169265
13840 1169265 871154 745044 812630 754570 1014611 1024137 948731 616307 959728 820595
13830 820595 1270148 1062873 967558 832757 949190 961061 824618 724959 897679 1045608
13820 1045608 1043401 1044509 1091717 1170747 519276 987162 928155 713838 851333 809677 887684
13809 887684 1014243 598423 915095 1157243 751726 956684 776457 514354 832961 786975
13799 786975 592165 876101 967831 671137 888029 703457 853515 875647 894608 984252
$$ packed form
13869A079359J75840L01071m54077K51131k98442J5445J5706K14665n55139M46364
13859A191923k72757j06166J44327L14722l01057N00784k42550l62310L11262
13850A178178P1922k9740q580k52903J46006L33268j68123m46799Q9943K56093
13840A169265k98111j26110O7586n8060K60041R526p5406l32424L43421j39133
13830H20595M49553k07275r5315j34801J16433J1871j36443r9659J72720J47929
13820A045608k207J108M7208P9030E19276M67886n9007k14317J37495m1656P8007
13809H87684J26559m15820L16672K42148m05517K04958j80227k62103L18607m5986
13799G86975j94810K83936R1730k96694K16892j84572J50058K2132J8961Q9644
$$ plain form
13789 984252 841857 936802 935734 1067943 842358 840545 155622 1136751 942067 848832 1012533
13778 1012533 916876 1056269 1224160 538941 668956 763149 463522 1032946 841675 909804
13768 909804 881707 819621 837516 524528 592642 770627 1087032 817454 712237 724386
13758 724386 713843 302683 503379 575449 678614 375236 799340 995536 891429 927485
13748 927485 548733 599473 805563 485351 478313 340518 704456 748830 664930 602507 878417
13737 878417 545550 490980 606941 713464 653345 493134 283983 589899 337745 554061
13727 554061 796098 621815 887831 772368 430722 554167 739163 672360 567552 628732
13717 628732 524094 380609 595565 76891 710702 756818 724964 562093 974673 576640
$$ packed form
13789I84252j42395R4945j068J32209k25585j813A55622R81129j94684r3235J63701
13778A012533r5657J39393J67891E38941J30015R4193k99627N69424j91271O8129
13768I09804k8097o2086J7895l12988O8114J77985L16405k69578j05217J2149
13758G24386j0543C02683K00696P2070J03165l03378M24104J96196j04107L6056
13748I27485l78752N0740K06090l20212p038j37795L63938M4374q3900o2423K75910
13737H78417l32867n4570J15961J06523o0119j60211k09151L05916k52154K16316
13727E54061K42037j74283K66016j15463l41646J23445J84996o6803j04808O1180
13717F28732j04638j43485K14956G6891O33811M6116l1854j62871M12580l98033
$$ plain form
13707 576640 658054 520905 475884 439976 408656 204379 644713 464707 538128 1217975
13697 1217975 622892 692334 505770 719370 697583 398809 516585 638923 394723 306161
13687 306161 285686 356452 595052 396342 579042 335001 374356 230254 231741 543905
13677 543905 696398 527132 220693 329154 404099 577750 339559 525895 510036 505931
13667 505931 549903 259553 175183 426393 632079 453351 557964 146754 740932 598511
13657 598511 249203 567933 584033 476746 360871 395135 557259 412124 381395 757148
13647 757148 693022 587025 388324 351515 253501 289966 472013 416351 451428 376555 248286
13636 248286 477216 426035 279288 200191 356733 375322 622543 610502 321236 713793
$$ packed form
13707E76640Q1414j37149m5021l5908l1320k04277M40334j80006P3421O79847
13697A217975n95083O9442j86564K13600k1787k98774J17776J22338k44200q8562
13687C06161k0475P0766K38600j98710J82700k44041L9355j44102J487L12164
13677E43905J52493j69266B20693J08461P4945J73651k38191J86336j5859m105
13667E05931M3972B59553q4370K51210K05686j78728J04613A46754N94178j42421
13657E98511B49203L18730J6100j07287j15875L4264J62124j45135l0729L75753
13647G57148o4126j05997j98701l6809r8014L6465J82047n5662L5077p4873j28269
13636B48286K28930n1181j46747p9097J56542J8589K47221j2041k89266L92557
$$ plain form
13626 713793 73310 541291 697705 297034 259167 351879 421673 613191 -38966 350823
13615 346116 180606 565432 226195 468881 120186 675181 452539 337717 79805 411105
13605 411105 532977 279017 515536 395785 259649 447360 393091 308421 417296 533517
13595 533517 361133 428194 533501 434026 514874 260645 430658 375275 88059 365521
13585 365521 383680 279477 192398 2552 -5480 248831 529816 481398 403348 101148 593425
13574 593425 -54224 513204 596895 -13554 382886 354333 280991 344204 538085 374096 408651
13563 408651 242826 429154 -11733 253142 408135 218869 343074 284896 308267 217618
13553 217618 464510 14145 207291 58132 107753 330314 393013 637352 384552 373729
$$ packed form
13626G13793G3310M67981J56414B97034l7867R2712O9794J91518c8966C50823
13615C46116j65510L84826B26195K42686A20186N54995k22642j14822G9805L31300
13605D11105J21872k53960K36519j19751j36136J87711n4269q4670J08875J16221
13595E33517j72384O7061J05307r9475Q0848k54229J70013n5383H8059K77462
13585C65521J8159j04203q7079B552e480B48831K80985m8418p8050A01148M92277
13574E93425e4224E13204Q3691a3554C82886k8553p3342O3213J93881j63989L4555
13563D08651j65825J86328a1733B53142J54993j89266J24205n8178K3371r0649
13553B17618K46892A4145J93146E8132M9621K22561O2699K44339k52800j0823
$$ plain form
13543 373729 640951 450007 133275 296418 363540 33174 213432 614766 222955 412444
13533 412444 213834 394709 136655 334036 182389 190718 214853 61717 136937 207366 249969
13522 249969 237912 391125 100802 30852 296345 147574 356439 117857 149622 33522
13511 322124 322160 391109 375637 285316 79932 365323 279384 223674 47164 189862 215849 514045
13499 514045 458196 538903 216951 157159 284424 340650 147285 -47620 152476 232488 328874
13488 328874 299355 228393 252333 105805 127748 476467 -6771 152143 369661 274392 243410
13477 243410 131934 227598 271123 -101241 243695 -92981 147597 348802 65034 273129
13467 273129 74449 375454 129017 341271 179168 271009 344342 303602 225024 517451
$$ packed form
13543C73729K67222j90944A33275J63143O7122C3174J80258M01334B22955J89489
13533D12444j98610J80875A36655J97381j51647Q329K4135F1717P5220P0429M2603
13522B49969j2057J53213A00802C0852K65493A47574K08865A17857L1765C3522
13511C22124L6O8949j5472r0321G9932K85391q5939n5710D7164J42698K5987K98196
13499E14045n5849Q0707B16951n9792J27265N6226A47285d7620A52476Q0012R6386
13488C28874k9519p0962K3940A05805K1943L48719f771A52143K17518r5269l0982
13477B43410j11476R5664M3525a01241B43695i2981A47597K01205F5034K08095
13467B73129G4449L01005A29017K12254j62103R1841P3333m0740p8578K92427
$$ plain form
13457 517451 177400 292391 -45218 532702 -84043 542587 371928 -7809 219408 366245
13447 366245 273073 248681 633519 41902 325794 243693 237504 124357 -51093 126774 316714
13436 316714 97210 282790 155996 211019 29202 487137 531267 452560 443286 145930 380229
13425 380229 160818 159530 261024 -66788 -38682 105929 356202 240658 136536 -219528
13414 163694 5501 318835 453983 447846 88900 273314 -171953 254857 85446 261540 427112
13403 427112 248533 48884 534495 318156 171727 113963 513879 91856 18292 168733
13393 168733 327280 122752 56731 187717 87874 225252 410464 -77713 434254 111789
13382 -61809 265383 191827 356383 251933 -607 497641 148294 -47097 344836 6168 153352
$$ packed form
13457E17451A77400J14991d5218E32702h4043E42587j70659g809B19408J46837
13447C66245r3172k4392L84838D1902K83892q2101o189j13147e1093A26774J89940
13436C16714I7210J85580j26794N5023B9202M57935M4130p8707r274A45930K34299
13425C80229A60818j288J01494f6788K8106A05929K50273j15544j04122b19528
13414A63694E501L13334J35148o137H8900J84414a71953B54857H5446J76094J65572
13403D27112j78579D8884M85611k16339j46429n7764L99916I1856A8292J50441
13393A68733J58547A22752E6731J30986H7874J37378J85212g7713D34254A11789
13382f1809B65383p3556J64556j04450f07D97641A48294d7097C44836F168J47184
$$ plain form
13371 153352 42939 380965 319764 170092 136466 131997 131644 188939 176032 170840 45833 488080
13359 488080 222491 175624 223666 154871 181467 196838 -71169 332089 225871 83352 154310
13348 154310 167166 416209 362590 229376 382599 -71188 351627 128596 124939 86071 91619
13337 91619 463785 41888 182396 526466 195106 221720 181674 156542 299177 182279
13327 182279 431009 314882 365488 74859 329694 284567 522780 257644 317013 -7658 301712
13315 398334 173148 122442 71159 324733 198707 104351 472430 142061 128335 304115
13305 304115 605328 23597 311885 -152438 119028 338152 338070 266067 -106481 -206904 945
13293 637672 30368 183528 -176644 378480 34385 131012 395693 162321 388419 -409161
$$ packed form
13371A53352D2939L38026o1201j49672l3626m469l53N7295j2907n192D5833M42247
13359D88080B22491m6867M8042o8795K6596J5371g1169C32089j06218H3352P0958
13348A54310J2856K49043n3619j33214J53223g1188C51627A28596l657l8868N548
13337I1619L72166D1888J40508L44070A95106K6614m0046k5132J42635j16898
13327A82279K48730j16127N0606G4859K54835m5127K38213B57644N9369g658C01712
13315C98334A73148n0706n1283K53574j26026r4356L68079A42061j3726J75780
13305C04115L01213B3597K88288a52438A19028K19124q2p2003a06481j00423I45
13293F37672C0368J53160a76644C78480C4385R6627K64681A62321K26098d09161
$$ plain form
13282 136358 9268 388975 53878 59699 -78052 138469 67105 507896 290807 324724 287657
13271 287657 600847 274251 -167595 -98435 259139 253143 -25371 161782 176934 -477814
13260 319219 61014 97152 377218 76907 -61719 427263 520280 -128467 -73084 -146006 127081
13248 119331 99887 130850 322838 288283 266553 158203 36987 289624 374124 48032 -122943
13236 91286 535062 -237270 6782 422664 357010 244679 232494 271255 184622 142930 426427
13225 426427 175927 -159397 82450 464938 -75904 107320 267840 570576 84203 -151047
13214 319030 -133668 88705 415613 343073 -48634 15398 97304 379619 198944 110789 12557
13202 166076 -89053 77337 223585 104938 155 104487 65103 214394 206340 220437 -91906
$$ packed form
13282A36358I268L79707E3878N821g8052A38469F7105M40791k17089L3917l7067
13271B87657L13190B74251a67595O9160B59139n996b5371A61782J5152d77814
13260C19219F1014L6138K80066G6907f1719D27263R3017a28467N5383p2922A27081
13248A19331j9444L0963J91988l4555k1730j08350C6987K52637Q4500D8032a22943
13236I1286M43776b37270F782M15882o5654j12331j2185L8761q6633m1692K83497
13225D26427A75927a59397H2450L82488g5904A07320J60520L02736H4203a51047
13214C19030a33668H8705L26908p2540d8634A5398Q1906K82315j80675q8155A2557
13202A66076h9053G7337J46248A04938A55J04332l9384J49291q054J4097i1906
$$ plain form
13190 -111868 155214 104841 -262397 287672 -55312 101558 -46158 -150059 137831 115811
13180 115811 299569 -154299 20167 26188 24672 17049 -172828 4353 -143816 85176 376235
13169 376235 149066 174239 18980 142715 153219 211851 290563 331601 123704 205722 88961
13157 107414 223719 -94542 126077 237874 -45625 83213 208220 233791 10701 30037 3379
13145 -244008 127549 -230034 156588 336263 -141690 196215 -221713 -4753 -134433 -97422
13135 -97422 -84286 -826 -119834 185056 315678 -40564 -136064 -214793 112029 -125835 -131405
13124 -131405 -116746 -147455 74671 174688 58660 -62990 -34969 215755 142363 -4665 -41995
13113 -41995 264171 185100 -40397 259292 -88155 109402 -171007 -143522 -184732 -269499 181360
$$ packed form
13190a11868A55214n0373b62397B87672e5312A01558d6158j03901A37831k2020
13180A15811J83758a54299B0167O021j516p623a72828D353a43816H5176K91059
13169C76235A49066K5173A8980J23735J0504N8632P8712M1038A23704Q2018H8961
13157A07414J16305i4542A26077J11797d5625H3213J25007K5571A0701J9336C379
13145b44008A27549b30034A56588J79675a41690A96215b21713d753j29680L7011
13135i7422J3136h26j19008A85056J30622d0564r5500p8729A12029a25835n570
13124a31405J4659l0709G4671J00017E8660f2990K8021B15755p3392d665l7330
13113d1995B64171p9071d0397B59292h8155A09402a71007K7485m1210q4767A81360
$$ plain form
13101 264608 -221938 56450 147657 249304 148902 187452 151450 -103537 319169 -31766
13090 195092 364908 156507 -360011 -167034 -39006 300800 11228 318937 489087 -96158
13079 259023 -6424 -42994 -42715 40080 204253 68709 13860 -262945 -64618 201327 247868
13068 247868 -101853 128531 209609 -59872 -63574 166047 94494 196548 -92280 37719 -35008
13056 211407 304490 112721 -121608 -20549 184645 385491 -139718 -80095 335622 73593
13045 215237 460753 -74019 248203 383796 -222034 154505 251573 349649 202446 210576
13035 210576 -217754 94135 5345 -119970 248921 -42870 -164178 -186469 60872 127953 321757
13024 321757 5943 113120 292440 343021 217874 138322 -249595 123905 176135 258300 86467
$$ packed form
13101B64608b21938E6450R1207J01647j00402L8550l6002a03537C19169c1766
13090A95092J69816A56507c60011a67034c9006C00800A1228L07709J70150i6158
13079B59023f424l6570K79D0080J64173F8709A3860b62945f4618B01327M6541
13068B47868a01853A28531Q1078e9872l702A66047p1553J02054i2280C7719c5008
13056B11407R3083A12721a21608b0549A84645K00846a39718N9623C35622G3593
13045B15237K45516g4019B48203J35593b22034A54505R7068R8076j47203Q130
13035B10576b17754I4135E345a19970B48921d2870j21308k2291F0872O7081J93804
13024C21757E943J07177J79320N0581j25147p9552b49595A23905N2230Q2165H6467
$$ plain form
13012 261483 -66600 309574 370930 274574 17482 128117 188321 197186 61795 110258 -199761
13000 128132 101631 343588 155768 -33891 163592 208196 226546 652849 279078 -81615
12989 -198042 256321 -157334 206345 92237 -169402 10596 195512 58256 76267 140963
12979 140963 357209 -51891 170831 358241 40199 653 53992 18801 12618 -116849 298347
12967 123072 200438 160033 -34618 -72950 -35034 -19979 -54095 158431 116575 -61158 279467
12955 73674 149608 -8473 -14022 87147 165508 262666 353073 2622 72357 -63293 84001 -158942
12942 244306 -72478 -83738 57370 25212 -40219 283626 210730 47219 -254669 127027 240969
12931 240969 -122486 -108890 -32392 204247 157804 199616 196630 96543 -19871 134624 -116727
$$ packed form
13012B61483f6600C09574O1356r6356A7482J10635O0204Q865F1795M8463a99761
13000A28132k6501K41957A55768c3891A63592M4604J8350M26303B79078h1615
12989a98042B56321a57334B06345I2237a69402A0596J84916E8256J8011O4696
12979A40963K16246e1891A70831J87410D0199F53N3339A8801o183a16849B98347
12967A23072P7366m0405c4618l8332c5034J5055l4116A58431m1856f1158B79467
12955G3674P5934h473n549H7147P8361R7158R0407B622O9735f3293H4001a58942
12942B44306g2478j1260E7370B5212d0219B83626p2896D7219b54669A27027J13942
12931B40969a22486J3596c2392B04247m6443M1812k986I6543a9871A34624a16727
$$ plain form
12919 37349 -65832 -17257 -167307 80667 67854 357313 119871 -59620 -201930 80575 -196747
12907 113489 113799 292434 32127 48340 334116 165960 409600 -82882 12881 -7049 12854
12895 -26348 228510 131403 165290 67528 437493 -55101 110830 179616 383834 -13049 52154
12883 156452 460282 217642 87992 113518 -179916 10330 169316 151447 -100344 -14634
12872 -111149 127142 57939 45737 -124387 93661 78426 -10001 128771 493091 270459
12862 270459 165635 157307 142698 -99984 278361 124495 49243 55302 -139129 95883 -20452
12850 263616 22349 251205 145025 196742 -70747 -15496 35504 -16447 74309 44220 174265
12839 174265 -182828 -242412 -121778 33901 -242264 -82523 -281643 -120 -387265 -111921 5625
$$ packed form
12919C7349f5832a7257j50050H0667j2813K89459A19871e9620j42310H0575a96747
12907A13489L10J78635C2127J6213K85776A65960K43640h2882A2881g049A2854
12895b6348B28510r7107L3887F7528L69965e5101A10830O8786K04218a3049E2154
12883A56452L03830B17642H7992K5526a79916A0330J58986j7869a00344a4634
12872a11149A27142E7939j2202a24387I3661j5235a0001A28771L64320k22632
12862B70459j04824q328j4609i9984B78361A24495D9243O059a39129I5883b0452
12850B63616B2349K28856j06180N1717g0747a5496C5504a6447G4309l0089J30045
12839A74265a82828n9584J20634C3901b42264h2523j99120a20l87145a11921E625
$$ plain form
12827 124951 -42263 91295 -38569 -13284 253858 61087 -73350 37687 205655 -507899 -254612
12816 -254612 -98673 -355019 -235873 -28869 238546 37631 -156075 -124684 123731 -152792
12805 118525 -13430 -100979 38191 -28544 193917 164558 -52188 188859 -58857 -48787 192167
12793 -244027 -395442 165958 99533 246440 216897 314639 -95978 256461 67303 -112562
12782 -42082 330311 -160611 -139638 -401100 -27715 116534 106053 -290838 83828 -55238 99148
12770 -233230 57794 -33895 -217004 -6924 67131 170794 14937 115017 -299536 -299177 -191899
12759 -191899 96124 171006 -720 -44254 -4328 258288 214784 -36315 109775 65353 -55036 -263359
12747 -263359 76055 111944 -264641 387969 127757 17929 -79660 214241 83275 295490
$$ packed form
12827A24951d2263I1295c8569a3284B53858F1087g3350C7687J67968e07899K53287
12816b54612i8673k56346J19146b8869B38546C7631a56075L1391A23731a52792
12805A18525a3430q7549C8191b8544A93917k9359e2188A88859e8857J0070A92167
12793b44027j51415A65958o6425J46907k9543R7742i5978B56461F7303a12562
12782d2082C30311a60611K0973k61462b7715A16534j0481b90838H3828e5238I9148
12770b33230E7794c3895j83109f924F7131J03663A4937J00080b99536L59J07278
12759a91899I6124P4882g20m3534d328B58288m3504c6315A09775m4422e5036k08323
12747b63359G6055L5889b64641C87969A27757A7929g9660B14241H3275K12215
$$ plain form
12737 295490 219783 27224 16083 -121358 347201 -68090 173975 129684 196384 74864 19635
12725 5555 28247 -105145 73133 -333132 -324819 -134593 -16432 236361 -73033 86847 -42256
12713 172877 49317 46911 168088 172959 -44233 197909 -11948 311567 366371 49669 370880
12702 370880 153519 275032 314531 354058 -33253 118502 19250 -82554 -94549 253829 -105660
12690 -18846 346304 41417 103472 176900 285115 62513 253814 79501 -367563 186917 152850
12679 152850 129991 -157614 378972 389853 292037 265889 271126 -17447 66098 -119322 189581
12667 325654 -44894 238062 193887 -56291 227076 55345 -47855 330997 864 -125269 123293
12655 -14572 140906 306168 64220 374104 18995 414722 -127387 153728 140208 -183847
$$ packed form
12737B95490p5707B7224j1141a21358C47201f8090A73975m4291O6700G4864A9635
12725E555K2692a05145G3133c33132Q313a34593a6432B36361g3033H6847d2256
12713A72877D9317k406J21177M871d4233A97909a1948C11567N4804D9669L21211
12702C70880A53519J21513L9499L9527c3253A18502A9250h2554j1995B53829a05660
12690a8846C46304D1417O2055P3428J08215F2513J91301G9501c67563A86917l4067
12679A52850k2859a57614C78972J0881r7816k6148N237a7447F6098a19322A89581
12667C25654d4894B38062m4175e6291B27076E5345d7855C30997H64a25269A23293
12655a4572A40906J65262F4220L09884A8995L95727a27387A53728j3520a83847
$$ plain form
12644 -236387 418650 131519 77230 -52089 -200193 144502 93119 249773 288737 -50865
12633 -348574 259116 175533 175409 85201 368986 50708 243646 180324 48857 206971 371292
12622 371292 146589 71513 124526 317695 -8610 96198 -321694 182509 -181405 -230939 100276
12610 57869 67798 8265 -3274 398163 -21295 187821 25286 318640 -70492 1318 323819 124160
12597 -3463 92345 231279 325047 310300 -423182 -164719 131126 -173303 103017 -12570 -38696
12586 -38696 202507 146028 -147395 -202491 196718 -49707 153982 48442 -14754 105594 247106
12575 247106 284979 44569 8629 251959 -2979 -60236 -60558 -51937 110649 177106 155783 116610
12563 116610 53075 65773 208176 -199232 16672 82118 -330902 96669 178068 95507 58478
$$ packed form
12644b36387D18650A31519n4289e2089j48104A44502n1383J56654L8964e0865
12633c48574B59116q3583j24H5201K83785E0708J92938o3322D8857J58114J64321
12622C71292A46589G1513N3013J93169h610I6198c21694A82509a81405m9534A00276
12610E7869R929H265c274C98163b1295A87821B5286K93354g0492A318L22501A24160
12597c463I2345J38934R3768j4747d23182a64719A31126a73303A03017a2570k6126
12586c8696B02507n6479a47395n5096A96718d9707A53982D8442a4754A05594J41512
12575B47106L7873D4569H629K43330b979n7257l22Q621A10649O6457k1323l9173
12563A16610E3075J2698J42403a99232A6672O5446c30902I6669Q1399q2561l7029
$$ plain form
12552 58478 -54167 31605 101331 -205773 -313468 280319 304997 379962 -276362 71097 39458
12541 39458 -45917 152446 -120075 16500 426025 -122956 275869 106460 193760 146450
12531 146450 43854 145474 108299 -70312 86788 -62151 150932 340075 78654 436483 483321
12520 483321 119358 -96728 -62148 310073 -180603 10898 269355 112239 48295 196946
12510 196946 -46356 -8596 -48341 172726 -1827 -122727 -60311 -260124 -4538 -112287 -139993
12499 -139993 231482 161771 -68302 194309 -50339 276480 359982 44447 -18178 102950 246840
12488 246840 86535 294166 129252 -82326 16656 -149051 211940 -92638 -292769 196509
12477 -52204 211329 -24963 -17692 120267 32333 -286684 130326 -125863 267144 51721 414524
$$ packed form
12552E8478e4167C1605O9726b05773j07695B80319K4678P4965b76362G1097l1639
12541C9458d5917A52446a20075A6500M09525a22956B75869A06460Q7300m7310
12531A46450D3854J01620l7175g0312H6788f2151A50932J89143G8654L57829M6838
12520D83321A19358i6728L4580C10073a80603A0898K58457A12239D8295J48651
12510A96946d6356h596l9745A72726a827j20900f0311j99813d538j07749k7706
12499a39993B31482o9711f8302A94309e0339B76480Q3502D4447a8178A02950J43890
12488B46840H6535K07631A29252h2326A6656a49051B11940i2638k00131A96509
12477e2204B11329b4963P271A20267C2333b86684A30326a25863B67144E1721L62803
$$ plain form
12466 414524 136843 19820 -277672 -30274 -138222 -39208 -301682 -5300 -24327 -101530 -40854
12454 363856 269234 -139835 -177061 -132111 201280 102814 225928 395732 -28495 -99433 -189149
12443 -189149 -128890 -62886 -61502 -100007 -124190 -56296 82418 -129753 -141446 -271280 -129636
12431 -39958 -159008 88430 -203472 9561 14577 -124847 -160370 187723 -174483 -47043 149006
12419 111172 -82356 -26104 218814 -3978 35098 31773 41387 -251926 285616 -133218 -204565
12408 -204565 124718 -89237 -170530 -68381 99045 -169240 42250 153311 -95135 -135330 -239107
12397 -239107 245273 21434 -179490 -296061 -17999 324154 239673 20967 282296 -50772
12386 -324734 129142 -26704 -141139 -283361 55482 -80966 -67760 -72554 -40896 -136863 -47694
$$ packed form
12466D14524A36843A9820b77672c0274j07948c9208k62474e300j9027p7203d0854
12454C63856r4622a39835l7226M4950B01280r8466J23114J69804b8495p0938q9716
12443a89149O0259f2886J384l8505k4183e6296H2418a29753j1693j29834a29636
12431c9958j19050H8430b03472I561N016a24847l5523A87723a74483d7043A49006
12419A11172h2356b6104B18814c978C5098l325R614b51926B85616a33218p1347
12408b04565A24718h9237q1293f8381I9045a69240D2250J11061i5135m0195j03777
12397b39107B45273B1434a79490j16571a7999C24154q4481B0967K61329e0772
12386c24734A29142b6704j14435j42222E5482h0966J3206m794L1658r5967d7694
$$ plain form
12374 110012 52335 -6247 -95481 26586 358515 28159 -195214 104979 115108 -52757 -98484
12363 -98484 85100 -165328 222900 29359 -333903 84778 21506 39785 -159753 -169010 182500
12351 -190393 348030 38385 4367 -120186 143689 -16102 183066 217262 -40165 -381539 -193391
12340 -193391 -24384 139827 225857 23621 29125 -131313 99163 111239 122703 93371 -138653
12328 69778 64583 -225717 70521 -23032 -272693 79765 211712 52811 -164010 138355 150535
12317 150535 207234 -9086 -99766 34458 432998 -113838 -248112 32899 38780 89326 183439
12306 183439 185956 -60860 -162260 -101826 -94757 -209143 34608 -119989 15552 61834 39045
12295 39045 -33210 -114766 204153 176924 11048 188689 210744 -150356 -109538 199008 106743
$$ packed form
12374A10012E2335f247q9234B6586L31929B8159a95214A04979J0129e2757m5727
12363i8484H5100a65328B22900B9359c33903H4778B1506J8279a59753r257A82500
12351a90393C48030C8385D367a20186A43689a6102A83066L4196d0165l41374J88148
12340a93391b4384A39827Q6030B3621N504a31313I9163J2076J1464k9332a38653
12328F9778n195b25717G0521b3032k49661G9765J31947E2811a64010A38355J2180
12317A50535N6699i086r0680C4458L98540a13838j34274C2899N881N0546R4113
12306A83439K517f0860j01400O0434P069j14386C4608a19989A5552M6282k2789
12295C9045c3210q1556B04153k7229A1048J77641K2055a50356M0818A99008r2265
$$ plain form
12284 106743 -65279 -44864 -85274 347122 353960 28659 16157 -169601 31439 325862 -167746
12272 362775 432301 104173 170682 267983 181640 61853 128720 526410 266451 49672 24554
12260 -74276 401300 129209 23899 136619 149089 -131881 176983 209634 108044 -246140
12249 157129 83608 294938 -49239 210752 579479 -39106 -167512 58078 233223 -98374
12238 78086 -63346 77613 -97402 138271 -112078 109320 -173406 11789 132279 109608 234252
12227 234252 342243 229966 84026 58081 130954 46400 11091 481466 318275 213940
12217 213940 352980 230299 44026 419180 -131766 203081 -139729 78504 91969 63333
12207 63333 352448 320253 53199 441478 267112 321547 190157 312619 309135 302718 52397
$$ packed form
12284A06743f5279K0415m0410C47122O838B8659j2502a69601C1439K94423a67746
12272C62775O9526A04173O6509R7301q6343F1853O6867L97690k59959D9672B4554
12260g4276D01300A29209B3899J12720J2470a31881A76983L2651j01590b46140
12249A57129p3521K11330d9239B10752L68727c9106j28406E8078J75145i8374
12238G8086f3346G7613i7402A38271a12078A09320a73406A1789J20490k2671J24644
12227B34252J07991j12277H4026k5945P2873D6400A1091M70375j63191j04335
12217B13940J39040j22681D4026L75154a31766B03081a39729G8504J3465k8636
12207F3333K89115l2195E3199L88279j74366N4435j31390J22462l484o417E2397
$$ plain form
12195 246781 305633 74659 456714 179233 184194 -100302 388604 91693 160055 -151994 100143
12183 167945 193056 244818 136349 -193137 66993 -8020 286560 193372 342676 -60249 319838
12171 -208269 -72184 135632 267495 101253 15812 353116 147505 61012 79763 -77093
12160 84523 -134578 223006 92746 520190 154427 -216262 173531 -99913 48487 361113
12150 361113 150641 252698 72461 -30377 356231 -99509 68567 -47711 10604 294029 -18429
12138 -152474 122396 180814 -39310 415708 -32235 -110782 19612 -282418 -25321 165381 56067
12126 501260 -210271 32495 163724 195394 228353 325471 53751 -243923 -78586 -10596 -48481
12115 -48481 -67330 -129474 96552 -122963 -204051 243610 -63981 -168640 116620 87776 223386
$$ packed form
12195B46781N8852G4659L82055A79233M961a00302C88604I1693O8362a51994A00143
12183A67945K5111N1762j08469a93137F6993h020B86560r3188J49304f0249C19838
12171b08269g2184A35632J31863A01253A5812L37304A47505F1012J8751g7093
12160H4523a34578B23006I2746M27444A54427b16262A73531i9913D8487L12626
12150C61113A50641J02057G2461c0377C56231i9509F8567d7711A0604K83425a8429
12138a52474A22396N8418c9310D15708c2235p8547A9612b82418b5321A65381E6067
12126E01260b10271C2495J31229L1670L2959R7118E3751b43923g8586a0596l7885
12115d8481j8849o2144I6552a22963q1088B43610f3981j04659A16620k8844J35610
$$ plain form
12104 223386 168232 345467 -161941 -195682 -19000 85401 185469 206185 90043 -12092 186024
12092 50969 309457 168004 -215709 -222274 16767 -85933 97625 -107792 34636 -46431 -133086
12081 -133086 -79096 -274955 197442 120932 254532 -110213 -272936 -236064 -20699 -269215
12071 -269215 17468 -120343 -71073 122220 431825 669023 2003065 1057989 442629 214843
12060 178974 -32065 -283898 235256 19185 -162921 105328 -38488 -102122 397460 -265149
12049 238768 -72323 257317 93420 23295 -84717 129547 10425 -293986 -55839 -249054 -28071
12037 2700 143416 -391925 -6434 32062 -151478 -158495 212136 -124763 -380617 -157860 -14910
12025 -192773 -137998 -46864 67488 -8578 -282776 37668 -149887 37365 -155223 104778 -145262
$$ packed form
12104B23386n5154J77235a61941l3741a9000H5401J00068K0716I0043a2092A86024
12092E0969K58488j41453b15709o565A6767h5933I7625a07792C4636d6431q6655
12081a33086N3990j95859A97442p6510J33600a10213j62723L6872b0699k48516
12071b69215A7468a20343M9270A22220L09605K37198J334042r45076D42629B14843
12060A78974c2065k51833B35256A9185a62921A05328c8488o3634C97460b65149
12049B38768g2323B57317I3420B3295h4717A29547A0425b93986e5839j93215b8071
12037B700J40716c91925f434C2062a51478p017B12136a24763k55854a57860a4910
12025a92773N4775d6864F7488h578k74198C7668a49887C7365a55223A04778a45262
$$ plain form
12013 -114043 -52464 94366 -196780 -34376 124809 80329 -255868 -23794 -30092 -265509 38658
12001 213340 -294324 -8201 97613 178681 -83542 -65336 -285240 147449 161802 20388 -31040
11989 -20657 -207724 -131591 5688 117444 -276847 297499 131238 135657 -49136 -240065 -147665
11978 -147665 -32298 264923 77270 373907 324596 -181488 -101111 -156304 128795 -167442
11967 80428 35258 -206549 75495 -100546 -62017 37021 -79512 -74634 -46450 169057 -34591
11955 246538 363629 -177998 183208 -131419 -56413 166802 -22500 -55130 76266 -109916
11944 21351 140735 -69595 -87204 -114944 619290 47787 17881 330203 -168574 190551 276670
11933 276670 -107482 298400 -131424 -51672 218223 -7109 -162669 5805 235170 -166391
$$ packed form
12013a14043e2464I4366a96780c4376A24809m4480b55868b3794o298k35417C8658
12001B13340b94324h201I7613Q1068h3542J8206k19904A47449J4353B0388c1040
11989b0657j87067P6133E688J11756b76847B97499A31238M419d9136j90929R2400
11978a47665c2298B64923G7270K96637m9311a81488Q0377n5193A28795a67442
11967H0428C5258b06549G5495a00546L8529C7021g9512M878K8184A69057c4591
11955B46538J17091a77998A83208a31419e6413A66802b2500l2630G6266a09916
11944B1351J19384f9595j7609k7740F19290D7787A7881L12322a68574A90551Q6119
11933B76670a07482B98400a31424e1672B18223g109j55560E805K29365a66391
$$ plain form
11922 -51151 24835 -29575 158449 237559 -166913 65417 -256524 322443 -293553 300165
11911 116806 -338122 -159268 -30493 -174505 291979 104039 -45079 49084 158622 -191420
11900 -79938 -219753 -158455 244351 -128437 130691 218134 -162374 18117 70704 43541 -77263
11888 169428 6078 39734 -87350 46822 -225400 -312998 -117955 -160221 -46068 -66485 47067
11876 -112541 -143287 -17043 287905 -242450 -6750 4415 28933 -77786 70726 73466 185960
11865 185960 208105 -269189 -210823 58821 119121 54696 -44517 -96485 -129773 -50017 14546
11853 -35135 -69932 430140 -275171 -266639 -62803 20737 -174103 -81100 1618 -255735 -48152
11841 -384502 -28469 -127601 -25263 64486 -185478 457423 -103893 -233587 -253053 109946
$$ packed form
11922e1151B4835b9575A58449P9110a66913F5417b56524C22443b93553C00165
11911A16806c38122a59268c0493j44012B91979A04039d5079D9084J09538a91420
11900g9938j39815O1298B44351a28437A30691Q7443a62374A8117N2587k7163g7263
11888A69428F078L3656h7350D6822b25400q7598a17955m2266d6068k0417D7067
11876a12541l0746a7043B87905b42450f750D415K4518g7786G0726K740J12494
11865A85960K2145b69189N8366E8821O0300E4696d4517n1968l3288e0017A4546
11853c5135l4797D30140b75171Q532f2803B0737a74103h1100A618b55735d8152
11841c84502b8469r9132b5263F4486a85478D57423a03893j29694j9466A09946
$$ plain form
11830 -212332 -164981 -60883 -206009 -72710 68090 -94313 -222092 -149923 -109444 55068 -55036
11818 -173398 -61149 -3777 -252870 351662 -254585 29891 -167504 -95848 39289 -91445 59952
11806 -326458 84268 -76404 306512 216287 -95723 243594 -233691 -63921 -50716 -88715 -314532
11795 -314532 -47661 -4240 56586 270056 -37530 401482 251238 249167 -56686 -111310 -2860
11783 406777 332629 24377 -229391 -137349 -14677 -157915 174779 -289154 -220812 -259616 153205
11771 -38069 125384 61714 -299028 382379 -276942 -46751 115065 -59730 155817 -235750
11760 -215608 107746 192336 -30209 -60873 717 -226592 -85085 -87540 -9511 -190683 -166575 -192079
11748 -192079 -81980 166070 -56788 -154490 97561 -116365 129256 -25256 127518 18750 -51079
$$ packed form
11830b12332M7351f0883j45126g2710F8090i4313j27779P2169M0479E5068e5036
11818a73398f1149c777k49093C51662b54585B9891a67504P1656C9289i1445E9952
11806c26458H4268g6404C06512r0225i5723B43594b33691f3921J3205l7999k25817
11795c14532d7661d240E6586K13470c7530D01482j50244k071e6686n4624b860
11783D06777p4148B4377b29391R2042a4677j43238A74779b89154O8342l8804A53205
11771c8069A25384F1714b99028C82379b76942d6751A15065e9730A55817b35750
11760b15608A07746Q4590c0209l0664G17b26592h5085k455i511j81172K4108k5504
11748a92079h1980A66070e6788r7702I7561a16365A29256b5256A27518A8750e1079
$$ plain form
11736 -40045 -30059 -139210 49535 -87355 75988 94131 -309926 77739 -208292 131012 -106174
11724 35982 -67063 43058 236631 148836 -122673 -108015 -86561 445252 -111979 -91174 -78370
11713 -78370 38507 -4446 -241571 223469 -50688 97767 37396 64145 161703 309203 178374
11702 178374 184313 -151210 -95938 73269 58599 220252 445750 -85199 215685 -30521 133433
11690 336601 134263 249781 -49067 -150385 70876 119916 118882 11628 9397 314408 225977
11679 225977 88260 23746 30157 149208 17634 -234013 81360 18167 78050 16627 114322
11668 114322 -3191 -261314 39484 -76818 -196449 7471 -141731 -94887 6902 -151618 55973
11656 152425 202209 257891 -122513 -50084 -85932 -12610 470177 16348 -116646 -18663 159280
$$ packed form
11736d0045R986j09151D9535h7355G5988J8143c09926G7739b08292A31012a06174
11724C5982f7063D3058J93573q7795a22673J4658K1454D45252a11979K0805J2804
11713g8370C8507d446k37125B23469e0688I7767C7396K6749R7558J47500j30829
11702A78374N939a51210N5272G3269j4670J61653K25498h5199B15685c0521A33433
11690C36601A34263J15518d9067j01318G0876M9040j034A1628k231L05011q8431
11679B25977H8260B3746O411J19051A7634b34013H1360A8167N9883A6627R7695
11668A14322c191k58123C9484g6818j19631G471a41731M6844F902a51618E5973
11656A52425M9784N5682a22513e0084l5848a2610D70177A6348a16646a8663A59280
$$ plain form
11644 75616 -13567 -1122 36357 120151 142812 -185353 76816 -12443 347971 -76785 -157756
11633 -157756 -82896 -89500 -138471 61569 35095 37628 117512 585616 235793 91460 33215
11621 255948 227480 72349 158239 39841 38289 131953 -11834 -121257 20669 -317602 -259307
11610 -259307 89178 -44772 -16650 139057 -11895 16812 149655 -179704 -325374 298125
11599 -194133 207093 131833 553562 -129196 108278 234732 -96169 240206 277241 -3268
11588 56140 43708 31595 -14081 467894 133293 229615 -123258 19468 74863 231851 -129082
11576 53825 491841 -216459 269478 251218 452515 384718 430284 285405 125804 52551
11565 209437 -62977 90778 -113316 -157509 201815 130552 227781 -116861 171078 46168 81432
$$ packed form
11644G5616a3567a122C6357Q3794K2661a85353G6816a2443C47971g6785q0971
11633a57756P4860o604m8971F1569k6474K533P9884M68104B35793I1460C3215
11621B55948k8468G2349Q5890C9841j552R3664a1834j09423B0669c17602N8295
11610b59307H9178d4772a6650A39057a1895A6812J32843a79704j45670B98125
11599a94133B07093p5260M21729a29196A08278J26454i6169B40206L7035c268
11588E6140j2432j2113a4081D67894A33293R6322a23258A9468N5395J56988a29082
11576E3825M38016b16459B69478j8260K01297o7797M5566j44879A25804E2551
11565B09437f2977I0778a13316m4193B01815p1263R7229a16861A71078D6168L5264
$$ plain form
11554 81432 217270 39378 -233244 435960 155118 -333703 261738 41529 110315 10779
11543 176173 144533 -224842 259354 399871 180432 263810 4824 61578 -73986 -251969 260987
11531 263276 150410 323005 -97147 306697 80380 316966 222841 -10262 62752 101929 -313020
11519 -92880 299870 6251 -17014 -91434 48328 -70972 140964 -73438 81718 114616 77651
11508 77651 28210 -54410 308772 143687 31136 50166 350496 42329 80594 327866 138562
11496 112251 175903 226493 415946 219467 202960 264145 194524 -327895 119500 389791
11486 389791 210231 162336 284659 52869 86559 428373 39297 -142822 -112440 178088
11475 241694 7861 458046 211912 297354 74343 -44740 340739 -61861 240841 106978 -74948
$$ packed form
11554H1432J35838C9378b33244D35960A55118c33703B61738D1529O8786A0779
11543A76173l1640b24842B59354J40517A80432Q3378D824N6754g3986j77983B60987
11531B63276j12866J72595i7147C06697H0380K36586r4125a0262F2752L9177c13020
11519i2880B99870F251a7014p4420D8328g0972A40964g3438H1718L2898l6965
11508G7651B8210e4410C08772A43687C1136J9030L00330D2329L8265K47272A38562
11496A12251O3652N0590J89453j96479j6507O1185o9621c27895A19500K70291
11486C89791j79560m7895J22323E2869L3690L41814C9297a42822L0382A78088
11475B41694G861M50185B11912Q5442G4343d4740C40739f1861B40841A06978g4948
$$ plain form
11463 366846 164431 -189450 -55668 56823 299828 265699 -108072 -43664 -61210 -17817 94751
11451 199935 54152 123369 -6546 -18170 128025 4758 -10275 52478 259670 257860 90957 17952
11438 -84662 -55846 192230 -96082 189583 -80480 -322669 -60350 43659 335976 10899 309995
11427 309995 -47211 -96995 192560 17950 -6700 86205 -172145 -70421 136737 -138850 163075
11415 75407 -52931 -57393 -178239 116391 66974 227871 -89363 -125867 317944 60342 204855
11404 204855 195207 116715 11554 131171 36263 -178450 -114079 432535 -61204 -336424 122422
11392 24262 41464 64700 -80315 -115231 28446 238377 -120614 -27145 -100981 273474 -14413
11380 -190159 -162685 233758 175374 51674 38820 57612 9752 72124 318595 390495 270602
$$ packed form
11463C66846A64431a89450e5668E6823K43005l4129a08072d3664j7546a7817I4751
11451A99935E4152O9217f546j1624A28025D758a0275E2478K07192j810I0957A7952
11438h4662K8816A92230i6082A89583h0480k42189f0350D3659K92317A0899K99096
11427C09995d7211m9784A92560A7950f700H6205a72145g0421A36737a38850A63075
11415G5407e2931m462j20846A16391m9417J60897h9363l6504C17944F0342J44513
11404B04855r648p8492A1554J19617C6263a78450O4371D32535f1204k75220A22422
11392B4262J7202K3236h0315l4916B8446K09931a20614b7145p3836B73474a4413
11380a90159K7474B33758n8384E1674j2854J8792I752O2372K46471P1900j19893
$$ plain form
11369 270602 181015 -93096 128080 82790 14201 -62492 -245830 -3397 157216 28417 93022
11358 93022 50465 -67514 172395 58945 -334863 182525 306158 291292 50423 -18846 85006
11346 -9180 193620 127354 427553 274543 -148484 66022 81573 129637 18324 9065 126387
11335 126387 17567 -199374 -248226 -59765 425154 -51532 -117874 36214 -162398 -228782 -122213
11324 -122213 -147880 223779 113311 -7532 32224 -73967 -102258 61189 10031 -85159 -342826
11313 -342826 205980 -99877 -9517 -114317 -213540 -65497 -49884 -3320 69408 -50433 85096
11301 272135 -62511 -67279 -94916 -269942 119725 166568 199414 -214390 -154219 -282459 83076
11289 238921 -100396 64235 28966 -98040 30794 96891 -49495 -166128 253381 419428 68263
$$ packed form
11369B70602q9587i3096A28080m5290A4201f2492j83338c397A57216B8417O4605
11358I3022m2557f7514A72395E8945c34863A82525J23633j4866E0423a8846H5006
11346i180A93620o6266L00199j53010a48484F6022J5551M8064A8324I065J17322
11335A26387A7567a99374m8852e9765D25154e1532o6342C6214a62398o6384J06569
11324a22213k5667B23779j10468g532C2224g3967k8291F1189A0031h5159k57667
11313c42826B05980i9877i517j04800r9223f5497J5613c320F9408e0433H5096
11301B72135f2511m768k7637j75026A19725M6843L2846b14390O0171j28240H3076
11289B38921a00396F4235B8966i8040C0794O6097d9495j16633B53381J66047F8263
$$ plain form
11277 76774 -242718 -163544 -244629 259065 -59472 -9028 125763 -346227 -53225 -258958 145775
11265 120685 -127098 120649 -422536 -131195 19956 102026 -160701 -197761 -87998 -114015
11255 -114015 -147819 33806 -150507 89243 -273188 -229250 -123114 297454 -232116 -98524
11244 222122 -47808 -38319 208169 196564 -170092 -239528 -179546 -74941 140833 55107 -82258
11232 -136111 -111044 -28437 -120908 18660 306257 67486 -32185 -325219 -126420 -109316 -251262
11221 -251262 -139204 59379 127427 -19523 -34809 -253627 257427 102618 260710 44888
11210 222970 170972 -90137 -105340 120034 -111383 -5264 53149 -262892 -107893 -247448 171579
11198 121061 15390 1925 46314 -134747 -108720 2381 4335 52015 69194 -357103 50730 -101834
$$ packed form
11277G6774b42718P9174q1085B59065e9472i028A25763c46227e3225k05733A45775
11265A20685a27098A20649d22536a31195A9956Q2070a60701l7060h7998k6017
11255a14015l3804C3806a50507H9243b73188M3938J06136B97454b32116i8524
11244B22122d7808R489B08169j1605a70092o9436N9982g4941A40833E5107h2258
11232a36111K5067b8437r2471A8660K87597F7486c2185k93034a26420J7104j41946
11221b51262J12058E9379O8048a9523j5286k18818B57427A02618J58092D4888
11210B22970n1998i0137j5203A20034a11383e264E3149b62892a07893j39555A71579
11198A21061A5390A925M4389a34747K6027B381J954M7680J7179c57103E0730a01834
$$ plain form
11185 58573 -150153 129142 -109155 18281 83320 -153468 253244 109055 -391729 -10900
11174 181386 241600 -139641 162366 -103976 191448 71469 169236 -66977 -78804 2867 50500
11163 50500 194816 15011 260555 -7930 -249133 101805 -138735 9573 -210759 -156729 361564
11151 -38718 -179127 21604 188357 131979 -51532 31290 107503 -195913 87635 -257879 -133369
11140 -133369 178726 -312472 -100389 -18927 -63737 253818 72874 270549 282246 112638
11129 -31635 110809 -16413 96497 -63256 259839 13075 -151785 165174 21047 -188297 278466
11117 110741 158559 152127 -41120 12058 189532 44889 110301 -133223 -215473 120543 186635
11106 186635 245636 406749 -40314 -153850 27276 114705 182673 296645 69244 373626 226894
$$ packed form
11185E8573a50153A29142a09155A8281O5039a53468B53244A09055c91729a0900
11174A81386O0214a39641A62366a03976A91448G1469R7767f6977j1827B867M7633
11163E0500J44316A5011K45544g930k41203A01805a38735I573b10759N4030C61564
11151c8718j40409B1604J66753n6378e1532C1290P6213a95913H7635b57879J24510
11140a33369A78726c12472a00389a8927m4810B53818G2874J97675J1697A12638
11129c1635A10809a6413I6497f3256B59839A3075a51785A65174B1047a88297B78466
11117A10741M7818o432d1120A2058J77474D4889O5412a33223q2250A20543O6092
11106A86635N9001J61113d0314j13536B7276Q7429O7968J13972F9244L04382j46732
$$ plain form
11095 226894 -5580 117327 412775 196969 347317 137685 142828 91412 -21655 -55465 269087
11083 429171 312104 -35385 594046 261605 106483 122092 385073 326477 259127 130695
11073 130695 397572 372292 201541 416931 436238 643297 540540 179483 146341 331662
11063 331662 454529 130992 330114 549966 456301 785835 860462 646587 371542 647347
11053 647347 620480 897710 455140 972965 783909 703763 730661 973626 790120 934621
11043 934621 1023140 530881 655230 540271 801269 905249 605534 732596 603328 834730
11033 834730 869475 418521 670718 537495 596375 641805 1049303 868295 1034428 769249
11023 769249 802676 632299 734429 967226 828265 897870 580783 906093 242627 682208
$$ packed form
11095B26894e580A17327K95448A96969J50348A37685N143n1416b1655l3810B69087
11083D29171j17067c5385E94046B61605A06483J5609K62981n8596o7350j28432
11073A30695K66877k5280j70751K15390J9307K07059j02757A79483l3142J85321
11063C31662J22867A30992J99122K19852r3665L29534P4627k13875k75045K75805
11053F47347k6867K77230m42570N17825j89056q0146K6898K42965j83506J44501
11043I34621Q8519m92259J24349j14959K60998J03980k99715J27062j29268K31402
11033H34730L4745D18521K52197j33223N8880M5430M07498j81008J66133k65179
11023G69249L3427j70377J02130K32797j38961O9605l17087L25310B42627M39581
$$ plain form
11013 682208 781285 609754 402635 356147 492014 639511 980429 639877 770358 392878
11003 392878 439316 729597 952246 688309 732277 1084863 672513 351621 614144 473199
10993 473199 795434 1015546 555813 772462 1032908 691075 740921 906287 1276008 875124
10983 875124 1310440 1144463 1242631 1569435 1168527 1558707 1668060 1835861 1892799 2435786
10973 2435786 2282276 2950351 3212697 3042580 2955578 3134159 2813054 2593295 2131846 2583284
10963 2583284 2055189 2041274 1861136 2085058 2311715 2147021 2492663 2201877 2281137 2103848
10953 2103848 2228971 1778388 1344996 1365863 848863 956633 719351 296121 546791 78431
10942 599460 213099 139125 623208 277360 185824 45086 233214 239862 131147 341316
$$ packed form
11013F82208R9077j71531k07119m6488J35867J47497L40918l40552J30481l77480
11003C92878M6438K90281K22649k63937M3968L52586m12350l20892K62523j40945
10993D73199L22235K20112m59733K16649K60446l41833M9846J65366L69721m00884
10983H75124M35316j65977R8168L26804m00908L90180J09353J67801N6938N42987
10973B435786j53510O68075K62346j70117q7002J78581l21105k19759m61449M51438
10963B583284n28095j3915j80138K23922K26657j64694L45642k90786P9260j77289
10953B103848J25123m50583m33392K0867n17000J07770k37282B96121K50670G8431
10942E99460B13099p3974M84083B77360r1536D5086J88128O648j08715K10169
$$ plain form
10932 341316 -131142 193998 197584 -273736 714 357951 -242544 -313680 445240 45478 -279902
10920 -58255 354558 -117094 2915 145128 -162580 32436 132860 -95491 87935 57762 -22886
10908 119683 -330472 -176778 -33685 135813 -61198 270700 73458 -60617 236891 273788
10898 273788 -54268 82868 -352365 -60810 -76978 -70386 166400 232555 38017 -64529 34933
10886 253278 53878 -11558 -333813 305371 54592 -69427 71605 -190504 -72031 -163300 141615
10874 -308393 16147 192 94370 -68581 -103913 200492 41497 19430 150486 -109491 69360
10862 -169950 181618 101774 171877 -62301 146198 -49540 30177 -178180 263080 364567
10852 364567 -311981 250503 61223 105623 -37190 64768 -133054 -64456 224867 -192932
$$ packed form
10932C41316a31142A93998L586b73736G14L57237b42544p1136D45240D5478b79902
10920e8255C54558a17094B915J42213a62580C2436J00424i5491H7935l0173b2886
10908A19683c30472J53694c3685A35813f1198B70700G3458f0617B36891L6897
10898B73788e4268H2868c52365f0810j6168O592A66400O6155C8017f4529C4933
10886B53278E3878a1558l22255C05371E4592f9427G1605a90504g2031r1269A41615
10874c08393A6147A92R4178f8581l5332B00492D1497A9430J31056a09491F9360
10862a69950A81618p9844P0103f2301A46198d9540C0177a78180B63080J01487
10852C64567c11981B50503F1223M4400c7190F4768a33054f4456B24867a92932
$$ plain form
10841 -202486 72680 111683 -82685 131740 90581 217183 -44313 175730 136623 227672 60421
10829 168185 -214181 52024 107968 -160039 -30566 -112281 -47225 -50494 -5079 167573 -106713
10817 137697 -60986 -30191 -91487 -64957 -231291 90851 -84317 -258390 196459 43152 153343
10806 153343 -256664 -31222 -14662 -98193 -97422 -112707 -92298 98127 -406950 44503 -72257
10794 20546 -170494 -237694 183001 -10713 123402 139106 107638 32732 -13521 87828 -283396
10782 192670 282898 -121212 -261277 169029 -245307 -131712 -38655 240471 -12786 -171544
10772 -171544 -194174 95206 -78664 -294173 -435359 -42381 77118 19082 -308295 -131084 33632
10760 -121434 -248828 -40785 257273 -38047 23757 -278504 -109993 38376 82885 -79995 -20494
$$ packed form
10841b02486G2680L9003h2685A31740m1159J26602d4313A75730l9107R1049F0421
10829A68185b14181E2024N5944a60039c0566q1715d7225l269e079A67573a06713
10817A37697f0986c0191o1296K6530j66334I0851h4317j74073A96459D3152J10191
10806A53343b56664c1222a4662q3531P71j5285K0409I8127d06950D4503g2257
10794B0546a70494o7200A83001a0713A23402J5704l1468C2732a3521H7828b83396
10782A92670R0228a21212j40065A69029b45307J13595c8655B40471a2786j58758
10772a71544k2630I5206g8664k15509j41186d2381G7118A9082c08295a31084C3632
10760a21434j27394d0785B57273c8047B3757b78504a09993C8376M4509g9995b0494
$$ plain form
10748 176928 -74134 193232 -57602 -135468 124612 -258161 -97416 42658 332635 -4049 295157
10736 -149761 -293002 -52919 99015 140661 319837 142003 57040 -53594 -186604 56596 -83657
10724 72794 -36312 -315434 -325235 -205709 -8029 289810 -160006 -194477 -119634 36985 -117749
10712 -81618 100056 18737 -31850 -56050 67372 69386 186200 -174144 -39047 -206996 -432313
10701 -432313 83184 98346 -117489 115613 17538 -166546 -204871 277239 -224195 191409
10690 -41301 -145419 128384 -121719 -141970 -293586 9896 -141423 112185 36908 -272390
10679 -8936 -177795 205476 -919 115624 180833 75242 113859 260619 44214 122630 325932
10668 325932 -81898 96837 92269 -79154 -80332 -193801 -221187 -163224 -57630 -155732 -469811
$$ packed form
10748A76928g4134A93232e7602p7866A24612b58161i7416D2658K89977d049B95157
10736a49761j43241e2919I9015M1646J79176A42003E7040e3594j33010E6596h3657
10724G2794c6312k79122r801J19526h029B89810a60006l4471P4843C6985a17749
10712h1618A00056A8737c1850k4200F7372K014J16814a74144c9047j67949k25317
10701d32313H3184J5162a17489A15613A7538a66546l8325B77239b24195A91409
10690d1301j04118A28384a21719k0251j51616I896a41423A12185C6908b72390
10679h936j68859B05476i19A15624O5209G5242L8617J46760D4214P8416K03302
10668C25932h1898I6837m568g9154j178j13469k7386N7963e7630r8102l14079
$$ plain form
10657 -469811 87198 -173274 -231655 54196 -172263 -4067 -166135 -51399 432 -25657 320607
10645 -246484 -299445 403725 -189815 644918 20401 -171 -163810 -402331 -216254 236190
10634 -153782 -315572 -254802 -211754 -73951 -80782 -210429 -127723 -51271 -81377 7670 -47924
10622 33163 -168500 72611 -75220 -59045 -216087 -161065 -133451 143695 -219205 8367 -168634
10610 -75641 -193438 39619 -207002 -20481 -170290 97892 -197650 -201404 -55359 -162346 17330
10598 139308 -17299 19480 -64263 38884 -259784 -392934 -99703 228013 106204 -184407
10587 53260 -77560 -71860 -148056 160855 59538 -75789 -92656 -99562 -26228 -100904 48397 -256116
10574 67560 152844 -66183 -143902 201661 -293653 -169614 40230 -220926 -121347 138484 -16068
$$ packed form
10657d69811H7198a73274n8381E4196a72263d067j62068e1399D32b5657C20607
10645b46484n2961D03725a89815F44918B0401a71j63639k38521J86077B36190
10634a53782j61790O0770M3048g3951o831j29647Q2706e1271l0106G670d7924
10622C3163a68500G2611g5220J6175j57042N5022K7614A43695b19205H367a68634
10610g5641j17797C9619b07002b0481j49809I7892a97650l754e5359j06987A7330
10598A39308a7299A9480f4263C8884b59784j33150i9703B28013A06204a84407
10587E3260g7560N700p6196A60855E9538g5789j6867o906b6228p4676D8397b56116
10574F7560Q5284f6183p7719B01661b93653J24039D0230b20926R9579A38484a6068
$$ plain form
10562 194025 19011 69969 -236939 -9243 -130591 -34583 167711 -4185 184337 -106884 298494
10550 77572 45413 242367 -51690 102913 -74032 -125490 -35947 -92471 -207301 -231738 -295117
10539 -295117 -39450 -14894 -156413 -203998 288605 -205150 -99076 -291701 -1234 225061 126630
10528 126630 40820 14613 329484 59788 205557 164262 -182545 25326 -78539 194484 -189416
10516 31851 1833 220175 213058 189515 -266573 145827 -212850 -233750 21229 209265 104363
10504 -10847 -249825 263826 48086 -346507 123592 2700 294406 46914 109390 -59082 -18203
10492 -55668 54182 30882 -53329 -217686 19329 81639 59677 -51680 53832 169777 -306473
10480 114890 443827 309590 653395 513565 432754 181482 214690 165407 189917 504318
$$ packed form
10562A94025A9011N0958b36939i243j21348c4583A67711d185A84337a06884B98494
10550G7572l2159J96954e1690A02913g4032n1458c5947n6524j14830k4437o3379
10539b95117c9450a4894j41519m7585B88605b05150i9076j92625a234B25061r8431
10528A26630D0820A4613L14871E9788J45769m1295a82545B5326g8539A94484a89416
10516C1851A833K18342p117k3543b66573A45827b12850k0900B1229J88036A04363
10504a0847k38978B63826D8086c46507A23592B700K91706D6914O2476e9082a8203
10492e5668E4182k3300e3329j64357A9329O2310k1962e1680E3832J15945c06473
10480A14890L28937j34237L43805j39830q0811A81482L3208m9283K4510L14401
$$ plain form
10470 504318 36444 332223 244059 -161936 260211 96201 -496438 60303 -204246 -7056 -117797
10459 -117797 58702 166976 179786 -414288 141544 -123236 -96955 -204706 -113560 -65763
10449 -65763 -295367 75834 236260 -241741 235540 87456 -81272 6937 190675 71956 -29962
10437 -237518 -295759 -61481 -12441 71397 46540 159202 106188 -199639 118024 -186434 21667
10425 -119305 -330124 -339331 198518 -10275 145063 227759 -72982 -175005 217546 79325 32768
10413 -92719 214638 -230595 -130959 242791 112058 -354241 -58983 18566 265798 16893
10402 59563 338551 186800 214636 -161175 -93282 32647 -119425 -43880 -169542 56465 -208647
10390 266958 -40250 199851 61291 54475 -190121 -96521 78063 -63324 4930 117944 -36278
$$ packed form
10470E04318C6444K95779q8164a61936B60211I6201d96438F0303b04246g056j10741
10459a17797E8702J08274J2810d14288A41544a23236K6281j07751R1146M7797
10449f5763k29604G5834J60426b41741B35540H7456h1272F937J83738G1956b9962
10437b37518n8241f1481a2441G1397k4857J12662n3014a99639A18024a86434B1667
10425a19305k10819r207A98518a0275A45063Q2696g2982j02023B17546G9325C2768
10413i2719B14638b30595R9636B42791A12058c54241e8983A8566K47232A6893
10402E9563K78988j51751K7836a61175O7893C2647a19425d3880j25662E6465b08647
10390B66958d0250A99851F1291o816a90121R3600G8063f3324D930J13014c6278
$$ plain form
10378 114950 212290 256524 29092 260378 508224 207377 374023 93490 214129 93600
10367 412928 563679 354989 724251 469210 606919 420734 430948 226752 180963 342960
10357 342960 404986 204259 317399 -76450 399741 407479 313265 663038 902885 494240
10347 494240 427406 554537 405406 132207 359455 511745 63894 315386 226930 219461
10337 219461 148067 -27815 112579 54254 66303 4584 133499 62914 108591 -43011 36344
10325 -166186 107539 -164655 493953 100622 63482 15477 563954 269447 239484 333685
10315 333685 132786 302292 177106 68343 -398918 -44223 -57389 295018 363919 -104466
10304 -248212 -155990 -280991 184163 -151177 -248852 -97703 -94405 77398 -140566 63370 -140769
$$ packed form
10378A14950R7340M4234B9092K31286K47846B07377J66646I3490J20639I3600
10367D12928J50751k08690L69262k55041J37709j86185J0214k04196m5789J61997
10357C42960O2026k00727J13140g6450C99741P738r4214L49773K39847m08645
10347D94240o6834J27131j49131A32207K27248J52290F3894K51492q8456p469
10337B19461p1394b7815A12579E4254J2049D584J28915F2914M5677d3011C6344
10325a66186A07539a64655D93953A00622l7140A5477N48477B69447k9963R4201
10315C33685A32786J69506j25186F8343c98918d4223j3166B95018O8901a04466
10304b48212R2222j25001A84163a51177r7675i7703L298G7398a40566F3370a40769
$$ plain form
10292 132324 -105252 -47739 218419 255872 -162883 -104640 -380188 -240026 89246 -63166
10281 -102649 67977 -170203 74441 -287348 92801 -23538 134643 111002 -9776 -74250 21954
10269 154787 173378 -108575 204433 -50255 7279 92993 157463 -114822 35774 201251 306751
10258 306751 104968 512460 631376 110472 518841 51437 409484 214058 440096 154479
10247 -145467 99032 -4882 102563 -133510 76446 36495 -65513 -108875 182174 -238326 51102
10235 -110871 -150853 -138197 9331 129350 -292416 -52546 167945 -265163 67470 16230 73053
10224 73053 236619 -1724 -181274 79205 -220351 -81536 -227582 27346 -234261 -289124 -218080
10213 -218080 142818 -221807 -282983 -146334 -135401 -67069 -59825 122891 -129505 27367 -201313
$$ packed form
10292A32324a05252d7739B18419L7453a62883N8243k75548J40162H9246f3166
10281a02649F7977a70203G4441b87348I2801b3538A34643k3641i776o4474B1954
10269A54787J8591a08575B04433e0255G279Q5714O4470a14822C5774J65477J05500
10258C06751A04968M07492J18916A10472M08369E1437L58047j95426K26038A54479
10247a45467I9032d882A02563a33510G6446C6495f5513m3362A82174b38326E1102
10235a10871l9982J2656I331J20019b92416e2546A67945b65163F7470A6230N6823
10224G3053J63566a724j79550G9205b20351h1536j46046B7346b34261n4863P1044
10213b18080A42818b21807o1176J36649J0933f7069P244A22891a29505B7367b01313
$$ plain form
10201 -232810 -329462 -7959 190578 13582 -187975 127484 -69506 68848 -107176 40697 -126259
10189 -105274 -79963 92904 -202905 -230611 -81459 -5656 129789 -52097 -50183 186090 264565
10178 264565 -22940 68551 -56048 131180 -61560 -22810 138173 -236654 27289 86533 43275
10167 43275 260743 -204447 -30392 56179 -228685 102080 -36642 -59856 81694 -71830 -3139
10155 28031 383526 -413917 -35395 -120202 -273700 46809 -216388 -144761 -62153 124434 -238417
10143 22932 269393 212161 96065 139747 -251364 -122376 177040 -367831 -313788 -124205
10132 263306 -34683 254975 -208774 55370 -396315 29777 -147085 -80711 -134042 -85983 -143203
10121 -143203 -263012 131423 79210 19410 -408021 -441291 -164053 -64177 -64904 -4715 9491
$$ packed form
10201b32810r6652g959A90578A3582a87975A27484f9506F8848a07176D0697a26259
10189a05274K5311I2904b02905k7706h1459e656A29789e2097J914A86090P8475
10178B64565b2940F8551e6048A31180f1560b2810A38173b36654B7289N9244m3258
10167D3275K17468b04447c0392E6179b28685A02080c6642k3214H1694g1830c139
10155B8031L55495d13917c5395q4807j53498D6809b16388P1627f2153A24434b38417
10143B2932K46461n7232I6065M3682b51364a22376A77040c67831N4043a24205
10132B63306c4683B54975b08774E5370c96315B9777a47085O6374n3331M8059n7220
10121a43203j19809A31423n2213A9410d08021l3270a64053f4177p27d715I491
$$ plain form
10109 -206605 -36278 -294553 -315754 91358 -269805 -145285 14999 -188609 -292137 -119521
10098 172192 -931 -299861 226886 31162 -7480 101512 -342322 26001 -153548 170137 205012
10087 205012 19421 30155 -310701 203253 129443 -168673 31957 62784 -268303 -345501 -136862
10075 366498 57278 98358 -45006 144519 -77949 -25452 -477088 -27565 -223973 18493 -145486
10063 224 5391 300346 114055 -131699 -38203 -308906 59293 32138 -157909 83166 -146163
10051 -239465 51855 -187834 -184668 -34755 105185 81689 180441 -128682 -115226 -327066 -239748
10040 -239748 -356443 -195330 -37330 277857 -173880 159759 152083 -41610 -96516 -173867 -315681
10029 -315681 -149328 34923 -68380 53198 -4478 256867 -259621 18964 -78895 -140037 -6882
$$ packed form
10109b06605c6278k58275k1201I1358b69805J24520A4999a88609j03528a19521
10098A72192i31k98930B26886C1162g480A01512c42322B6001a53548A70137L4875
10087B05012A9421J0734c10701B03253p3810a68673C1957L0827b68303p7198a36862
10075C66498E7278M1080d5006A44519g7949b5452m51636b7565j96408A8493a45486
10063B24N167K94955A14055a31699c8203k70703E9293k7155a57909H3166a46163
10051b39465E1855a87834L166c4755A05185k3496R8752a28682J3456k11840Q7318
10040b39748j16695J61113c7330B77857a73880A59759p676d1610n4906p7351j41814
10029c15681a49328C4923f8380E3198d478B56867b59621A8964g8895o1142f882
$$ plain form
10017 98584 67405 -55475 -148040 -27638 -335197 -121651 -291556 -61077 -118727 265440 -149974
10005 -290452 -22421 -156943 -109660 -119254 -69875 -338046 -158810 168149 61106 -59256 -107376
9994 -107376 -415935 93816 -42604 -115534 -31730 -6908 -111154 26288 -93531 -156133 -219288
9983 -219288 -15045 -22590 8937 -85520 65193 -165716 -47819 -442370 270638 166725 -176407
9971 -227537 -215747 -214966 -264647 321700 -298381 -202050 -1847 362820 -81633 -507566 31309
9959 -120432 -36576 -5903 -232644 -238096 -140687 -211221 24033 68604 205004 98204 -194666
9947 110255 204334 -101269 291473 -157342 132997 -207723 -14366 -180836 103985 196798
9937 196798 156493 -43654 -193845 -287331 -216563 -86654 50669 -87787 -229705 -105557 7727
$$ packed form
10017I8584l1179e5475r2565b7638l07559a21651j69905f1077n7650B65440a49974
10005b90452b2421j34522M7283r594M9379k68171a58810A68149F1106e9256m8120
9994a07376l08559I3816d2604p2930c1730f908j04246B6288i3531o2602o3155
9983b19288a5045p545H937h5520F5193a65716d7819l94551B70638j03913a76407
9971b27537J1790P81m9681C21700b98381R6331a847C62820h1633m25933C1309
9959a20432c6576e903k26741n452R7409p0534B4033M4571J36400I8204a94666
9947A10255R4079a01269B91473a57342A32997b07723a4366j66470A03985R2813
9937A96798m0305d3654j50191r3486P0768h6654E0669h7787j41918a05557G727
$$ plain form
9925 -165209 -382712 395248 -7301 -50612 86979 -416628 -274610 12181 1045 -63965 -421578
9914 -421578 -238664 63794 54451 -140411 -51779 -64938 -208539 8198 -257816 49965 59553
9903 59553 -93249 -164047 190661 40936 -26286 -28914 192772 -15096 -53140 -8896 -254703 -159187
9891 -159187 227163 -34019 134477 18785 198767 138699 3796 -226 54036 -134860 159748
9879 -214568 -87491 48400 -196706 -324768 -375227 163770 51203 -183533 -263584 -214468 -160986
9868 -160986 173412 -263210 -233611 -111357 -142906 -35804 -308887 38507 -306574 117792
9857 -172350 -184562 -204103 270533 26023 187240 -125892 22451 325368 -549271 87292 108615
9846 108615 -155106 -156577 188048 -269357 60566 -6614 -153916 -197065 -162768 -174418 176075
$$ packed form
9925a65209k17503C95248g301m3311H6979d16628J42018A2181A045f3965l57613
9914d21578J82914F3794r343a40411e1779j3159j43601H198b57816D9965R588
9903E9553i3249p0798A90661D0936b6286k628A92772a5096l8044h896k45807R5516
9891a59187B27163c4019A34477A8785J79982o0068C796b26E4036a34860A59748
9879b14568h7491D8400a96706j28062n0459A63770E1203a83533q0051M9116N3482
9868a60986A73412b63210K9599a11357l1549c5804k73083C8507c06574A17792
9857a72350j2212j9541B70533B6023J61217a25892B2451L02917e49271H7292K1323
9846A08615a55106j471A88048b69357F0566f614j47302m3149L4297j1650A76075
$$ plain form
9834 -336713 71238 131107 -17291 -205895 -203484 -37888 -22411 -176013 -372741 -351411 165022
9822 -161988 5437 129340 -66491 -126915 -222223 -159886 -116033 -52485 -15674 -242554 -75888
9810 78344 -104898 8619 -200045 -190068 -13769 -6521 -115584 137762 -308091 -228781 90013
9798 81369 -86119 -448862 24949 -122484 -123068 -103786 25709 -393851 -13863 -113767 -110691 -144855
9786 -144855 175981 11181 -290491 -138667 7935 -156878 -238882 -42027 -375231 -76517 71482
9774 40080 -7992 55305 117863 -242534 -209933 157646 267771 -75211 -339125 -186979 161830
9762 -347586 -220410 -379509 217345 133474 -85393 -189738 272570 -730 -202725 -160885 -162234
9751 -162234 75610 -541482 11802 -82068 -43823 -128630 -180354 113052 272615 -145822 -7188
$$ packed form
9834c36713G1238N9869a7291j88604K411c7888J5477j53602j96728K1330A65022
9822a61988E437J23903f6491o0424r5308O2337M3853e2485a5674k26880g5888
9810G8344a04898H619b00045R977a3769f521j09063A37762c08091P9310I0013
9798H1369h6119l62743B4949a22484n84J9282B5709c93851a3863r9904L076l4164
9786a44855A75981A1181b90491a38667G935a56878q2004d2027l33204g6517G1482
9774D0080g992E5305O2558b42534L2601A57646J10125g5211k63914J52146A61830
9762c47586J27176j59099B17345q3871h5393j04345B72570g30k01995M1840j349
9751a62234G5610e41482A1802h2068L8245q4807n1724A13052J59563a45822g188
$$ plain form
9739 -225110 -142967 -256520 -115339 -370244 214139 -119738 -106321 23284 146974 112285
9729 112285 -316422 -296742 -193313 126992 -81324 91982 -110778 -413750 -25765 -330916
9719 -330916 -69312 65075 146330 71570 47472 -115786 -8344 111147 -189280 -118873 -438545
9708 -438545 117775 159363 -111372 -177298 -4020 439066 -24281 129143 336412 -284754 -168467
9697 -168467 20589 -175567 -126211 -24857 19863 -53555 7713 68128 -180074 316953 -54607
9685 8259 -103493 24834 -177800 -40068 -80134 -133072 -65808 -14187 68062 -108645 -162378
9674 -162378 158836 188700 66820 -36345 -180092 -275862 144527 5077 -51337 -390713 -94320
9662 -253865 -16095 -72642 -64265 80122 152447 -339313 135638 -70391 -188073 -161611 -159059
$$ packed form
9739b25110Q2143j13553a15339k54905B14139a19738J3417B3284J23690l4689
9729A12285c16422J9680J03429A26992h1324I1982a10778l02972b5765l05151
9719c30916f9312F5075Q1255G1570k4098a15786h344A11147a89280P0407l19672
9708d38545A17775M1588a11372o5926d020D39066b4281A29143K07269b84754J16287
9697a68467B0589a75567M9356b4857A9863e3555G713O0415a80074C16953e4607
9685H259a03493B4834a77800d0068m0066n2938f5808a4187F8062a08645n3733
9674a62378A58836K9864F6820c6345j43747r5770A44527E077e1337l39376i4320
9662b53865a6095n6547Q377H0122P2325c39313A35638g0391j17682K6462K552
$$ plain form
9651 -159059 -104241 -44591 57610 -271412 -15128 295789 -477 -137669 -121209 -183525 -77451
9639 -389423 -90026 -204146 -167497 -5357 -173219 -30855 175799 -178456 345771 -70235 -306392
9628 -306392 -52411 2408 124360 78140 1235 -57850 -79992 -274055 -286907 -179121 -406785
9617 -406785 -196441 -50358 131980 -405857 -16104 -111721 -83824 -5505 234712 84680 -80862
9605 -38468 -235247 39013 31660 -81130 -147907 -29315 31052 -6235 219788 -187974 153951
9593 -198087 -393998 -145595 -7243 -34721 37952 8195 59175 -160965 -15580 -134911 -194383
9582 -194383 165271 250471 40702 44718 88147 -105211 286510 225065 -248658 -75927 144130
9570 -261986 86891 423 41682 -238700 26955 -205342 -878 -403324 -51637 11696 -54189 172840
$$ packed form
9651a59059N4818d4591E7610b71412a5128B95789d77j37192J6460o2316g7451
9639c89423i0026j14120L6649e357j67862c0855A75799a78456C45771g0235k36157
9628c06392e2411B408J21952m6220A235e7850k2142j94063j2852J07786k27664
9617d06785a96441e0358A31980d05857a6104r5617K7897e505B34712H4680h0862
9605c8468j96779C9013p353h1130o6777b9315C1052f235B19788a87974A53951
9593a98087j95911a45595g243k7478C7952H195N0980a60965a5580j19331n9472
9582a94383A65271Q5200D0702M016M3429a05211B86510o1445b48658g5927A44130
9570b61986H6891D23M1259b38700B6955b05342h78m02446e1637A1696e4189A72840
$$ plain form
9557 -133905 58590 125972 147254 20746 63967 -283965 -318874 412552 -44775 -166343 -124290
9546 -124290 254330 122007 -11854 171182 -219053 -201950 272522 219846 201494 133008 -85702
9534 -44727 -215932 -70656 -164358 -60947 143379 -89395 22465 -235275 -249265 -157595 -51790
9522 55014 138714 -123789 -145039 -218294 -117386 -22902 -32916 -44641 -55434 -32820 -617901
9511 -617901 90380 -286579 -417187 34934 91001 261359 -212607 -229305 -429053 -307060
9501 -307060 -30379 -51204 169429 -61510 59201 -80748 -36593 -181076 28635 -66012 18482
9489 -155661 440727 -266398 -380030 -278419 96880 -73731 -14098 160444 97452 -8269 190688
9477 -240825 107831 75546 -1784 -238010 205021 90936 205223 114288 -384951 210067 110588
$$ packed form
9557a33905E8590O7382K1282B0746M3221b83965l4909D12552d4775j21568M2053
9546a24290B54330A22007a1854A71182b19053J7103B72522n2676j8352o8486h5702
9534d4727j71205g0656r3702f0947A43379h9395B2465b35275j3990R1670e1790
9522E5014Q3700a23789k1250p3255J00908b2902j0014j1725j0793K2614n85081
9511f17901I0380b86579j30608C4934N6067J70358b12607j6698j99748J21993
9501c07060c0379k0825A69429f1510E9201h0748c6593j44483B8635f6012A8482
9489a55661D40727b66398j13632J01611I6880g3731a4098A60444o2992h269A90688
9477b40825A07831l2285a784k36226B05021I0936J14287r0935c84951B10067r9479
$$ plain form
9466 110588 -278851 -194000 -126540 -183157 -96398 -137623 58283 78067 240482 -187246 -25758
9454 4479 -333179 60167 33332 -117452 -358031 -189124 -102952 -224875 -236650 105517 -291469
9442 140630 -259997 2844 -161847 -164391 195947 118225 -136856 54837 -191889 41195 -222227
9430 -148642 -58523 -413189 30848 -233722 253802 -137018 -48091 -108871 -326006 -45978 -34838
9419 -34838 4301 288883 -230386 -247297 82784 6075 136132 47978 -342704 -287375 28931
9407 10149 21037 -114606 -150556 212192 68713 26563 -106660 9031 372287 -143509 -82599
9396 -82599 246041 80348 -107025 -196594 136299 -252671 -90447 -260608 -80359 -223947 115903
9384 379620 -80797 -182154 -79632 -41659 -96834 -175291 -281858 -7145 150144 -128729 -123631
$$ packed form
9466A10588b78851Q4851O7460n6617Q6759m1225E8283J9784J62415a87246b5758
9454D479c33179F0167k6835a17452k40579J68907Q6172j21923j1775A05517b91469
9442A40630b59997B844a61847k544A95947p7722a36856E4837a91889D1195b22227
9430a48642e8523l54666C0848b33722B53802a37018d8091o0780k17135d5978J1140
9419c4838D301K84582b30386j6911H2784F075J30057D7978c42704N5329B8931
9407A0149J0888a14606l5950B12192F8713B6563a06660I031L63256a43509O0910
9396h2599B46041H0348a07025q9569A36299b52671i0447j70161h0359j43588A15903
9384C79620h0797j01357g9632L7973n5175p8457j06567g145A50144a28729N098
$$ plain form
9373 -123631 44278 -186527 263553 -297637 5038 -335383 -82328 43206 -112170 -148177 25686
9361 -74556 -126540 -107499 22078 -64656 -26521 -57138 -180744 -133171 129622 -97837 34112
9349 -51406 -154240 -181532 -245804 -278803 113438 -348510 146628 -195223 -17651 -44372 1904
9337 -100929 -168054 -234078 -7541 52206 55771 39863 -36701 203280 -388867 -10734 68921 172914
9325 172914 -204416 123719 73536 99286 137933 239538 -113302 -82332 -54046 1701 -90864
9313 -291063 -52526 -193819 281830 439882 -208597 -300523 -157021 -396122 262073 -227810
9302 76293 -306226 -422541 65005 -70728 -62053 29589 269806 -181304 46222 -437907 -133751
9290 -21378 322704 -157114 355823 -161083 -99620 214203 133160 -65646 -94244 72939 94160
$$ packed form
9373a23631D4278a86527B63553b97637E038c35383h2328D3206a12170l6007B5686
9361g4556n1984J9041B2078f4656b6521l0617j23606M7573A29622i7837C4112
9349e1406j02834k7292o4272l2999A13438c48510A46628a95223a7651k6721A904
9337a00929o7125o6024g541E2206L565j5908c6701B03280c88867a0734F8921J03993
9325A72914b04416A23719n0183K5750L8647J01605a13302L0970K8286A701i0864
9313b91063e2526j41293B81830J58052b08597r1926J43502k39101B62073b27810
9302G6293c06226j16315F5005g0728Q675B9589K40217a81304D6222d37907a33751
9290b1378C22704a57114C55823a61083O1463B14203q1043f5646k8598G2939K1221
$$ plain form
9279 94160 -28894 -287479 30502 -53519 45387 38603 136404 -168463 -23127 -142804 -136798 -29320
9266 -28266 71807 121854 -177981 246965 12192 -36741 288946 -107408 11580 -184588 -131874
9255 -131874 -278000 -234822 -207664 -243292 -316915 -146580 -118996 34888 -31185 -75040 -126992
9244 -126992 -209554 1011 -91694 313301 346967 -167810 211793 50485 76117 -131166 -167517
9233 -167517 -30346 -277871 -30983 -140774 -88413 225467 -55630 -37574 -47710 -423967 -136859
9221 67375 -303316 -222765 270304 -275112 9352 132099 127500 -15288 49657 -58746 -126854
9210 -126854 25957 -122906 -346396 -164996 -243512 268674 -279157 -78713 104343 -188430
9199 -289545 52020 131829 -217043 -423144 45967 -432582 -61670 -163320 -326954 92458 263048
$$ packed form
9279I4160b8894k58585C0502e3519D5387o784R7801a68463b3127j19677O006b9320
9266b8266G1807N0047a77981B46965A2192c6741B88946a07408A1580a84588N2714
9255a31874j46126M3178K7158l5628p3623a46580K7584C4888c1185m3855n1952
9244a26992q2562A011i1694C13301L3666a67810B11793E0485K5632a31166l6351
9233a67517c0346k47525c0983j09791N2361B25467e5630J8056j0136l76257a36859
9221F7375c03316Q0551B70304b75112I352J22747m599a5288D9657e8746o8108
9210a26854B5957a22906k23490a64996p8516B68674b79157g8713A04343a88430
9199b89545E2020P9809b17043k06101D5967d32582f1670j01650j63634I2458J70590
$$ plain form
9188 263048 -190065 157205 -192953 64359 -103428 108518 15519 -187495 -121662 4294 26919
9177 26919 -25805 -672 86982 -276703 -235331 100555 -57485 -101915 -161317 -192812 8236 -261421
9164 159610 60040 -62312 21526 213107 -341420 22464 -128389 203389 -195063 239732
9153 -68738 -254999 -1537 -220601 -206527 -79682 -178175 -131355 120546 205872 -28505 -391115
9142 -391115 11250 -54262 -23035 -82608 -115092 115626 -286604 78766 210944 24195 177907
9131 177907 200066 -151051 101908 29833 -58133 -121974 166909 142586 66493 35578 -56774
9119 161784 290963 127147 -260908 -26412 -77836 131307 239662 -275998 -258189 -21102
9108 146641 -242420 139686 206541 -273682 -361700 -17443 -119675 -261324 -7745 -243805 -33246
$$ packed form
9188B63048a90065A57205a92953F4359a03428A08518A5519a87495O5833D294K2625
9177B6919b5805f72H6982b76703M1372A00555e7485m4430n9402l1495H236b61421
9164A59610F0040f2312B1526J91581c41420B2464a28389B03389a95063B39732
9153f8738j86261a537k19064J4074g9682r8493M6820A20546Q5326b8505l62610
9142c91115A1250e4262b3035n9573l2484A15626b86604G8766J32178B4195J53712
9131A77907K2159a51051A01908B9833e8133o3841A66909k4323F6493l0915e6774
9119A61784J29179A27147b60908b6412n1424A31307J08355b75998J7809b1102
9108A46641b42420A39686O6855b73682q8018a7443j02232j41649g745k36060c3246
$$ plain form
9096 -511336 -231377 72839 -147650 243046 -322699 -325227 54150 210046 63083 -153552 -63622
9084 -194042 28606 -62236 -36516 -45744 -128084 -6087 -260281 -82652 -232113 152671 -177568
9072 -350877 91480 184241 -104024 346640 60284 -143332 -222208 -285241 -246725 -100106 -242079
9061 -242079 -42248 -110635 -48210 -42230 146725 175836 -350651 -17347 -221576 36150 -249936
9049 139441 -148269 -320723 -366842 -181702 -45045 -152513 -41585 84129 -105417 -138276 42637
9037 -14830 -44954 -239308 -188033 -125280 -22938 -68304 -123963 -46482 119297 49537 -124287
9025 -183110 134633 48732 46930 -293474 -11332 67740 -196616 -134362 -63533 -511810 113395
9013 -187011 92966 113285 -148139 -65060 -95339 -211148 89711 -267647 -276450 -26103 119713
$$ packed form
9096e11336b31377G2839a47650B43046c22699k528E4150J55896F3083a53552f3622
9084a94042B8606f2236K5720r228q2340f087k54194h2652j49461A52671a77568
9072c50877I1480R2761a04024C46640F0284a43332p8876o3033L8516a00106j41973
9061b42079d2248o8387d8210N980A46725K9111c50651a7347k04229C6150b49936
9049A39441a48269j72454m6119a81702d5045j07468d1585H4129a05417l2859D2637
9037a4830l0124j94354N1275O2753b2938m5366n5659d6482A19297D9537a24287
9025a83110A34633D8732j802b93474a1332F7740a96616O2254f3533m48277A13395
9013a87011I2966K0319a48139f5060l0279j15809H9711b67647q803b6103A19713
$$ plain form
9001 24726 340366 -356329 -141575 -117258 449922 121706 55250 -38811 -227833 -53644 -334307
8990 -334307 -340862 -337517 299161 -83986 107738 -107927 -47639 40018 58801 -92099 -335288
8979 -335288 -250385 362733 97910 214044 -80010 -78941 -74266 -40730 -306803 179474 -211468
8967 52819 -96991 -102982 86749 109058 241166 146642 -35747 -359681 -60920 -70446 136430 -20888
8954 33240 -203563 6652 -408021 62799 -121458 -279511 -159761 105513 -24639 -71469 -372158
8943 -372158 -147922 -181784 -87900 39653 -144922 -61238 -158948 -44544 56096 36988 -334430
8931 -124745 -99727 -2226 -180525 -135292 57710 276043 -33665 311836 724354 2555768 7272598
8920 7272598 1877807 1202354 172826 411736 164775 341362 -330779 -62242 54295 -56783
$$ packed form
9001B4726L15640c56329a41575K4317D49922A21706E5250c8811j89022e3644k80663
8990c34307o555L345B99161h3986A07738a07927d7639D0018J8783i2099k43189
8979c35288Q4903C62733I7910J16134h0010J069M675L3536k66073A79474b11468
8967E2819i6991n991H6749K2309J32108r4524c5747l23934f0920r526A36430b0888
8954C3240b03563F652d08021F2799a21458j58053J19750A05513b4639m6830l00689
8943c72158a47922l3862h7900C9653a44922f1238r7710d4544E6096j9108c34430
8931a24745K5018b226j78299M5233E7710K18333c3665C11836M12518J831414M716830
8920G272598A877807o75453A72826K38910A64775J76587c30779f2242E4295e6783
$$ plain form
8909 -184169 -28041 273988 147915 -280183 -221583 -271611 118195 -199569 -84646 -388262
8899 -388262 296494 142646 -311 -130708 141818 -316206 -332745 122347 141893 -218720 165856
8887 -229560 -10408 -273236 -86884 198555 128163 -123551 -231003 76145 6749 -38491 -91802
8876 -91802 -198746 128157 -366483 -267249 -201674 -30969 -108425 213553 199353 -55596 -108578
$$ packed form
8909a84169b8041B73988j26073b80183N8600n0028A18195a99569h4646l03616
8899c88262B96494A42646c11j30397A41818c16206j6539A22347J9546b18720A65856
8887b29560a0408k62828h6884A98555p0392a23551j07452G6145F749c8491n3311
8876i1802j06944A28157c66483R9234O5575c0969p7456B13553j4200e5596n2982
$$ [...]
##END NTUPLES=NMR SPECTRUM
##END=
