##TITLE=AC1675_BRAAN14383_8571173_fninPGIxMx
##JCAMPDX= 6.0         $$ Bruker NMR JCAMP-DX V2.0
##DATA TYPE= NMR SPECTRUM
##DATA CLASS= NTUPLES
##ORIGIN= BRUKER
##OWNER= Administrator
$$ 1.72 TOPSPIN		Version 2.1
$$ 2014-04-11 15:10:10.131 -0700  Administrator@X
$$ Compression mode = diff/dup
##.OBSERVE FREQUENCY= 400.02188249412
##.OBSERVE NUCLEUS= ^1H
##.ACQUISITION MODE= SIMULTANEOUS (DQD)
##.ACQUISITION SCHEME= undefined
##.AVERAGES= 8
##.DIGITISER RES= 22
##SPECTROMETER/DATA SYSTEM= spect
##.PULSE SEQUENCE= zg30
##.SOLVENT NAME= COFFEE_meoh
##.SHIFT REFERENCE= INTERNAL, COFFEE_meoh, 1, 14.98509
##AUDIT TRAIL= $$ (NUMBER, WHEN, WHO, WHERE, PROCESS, VERSION, WHAT)
$$ ##TITLE= Audit trail, TOPSPIN		Version 2.1
$$ ##JCAMPDX= 5.01
$$ ##ORIGIN= Bruker BioSpin GmbH
$$ ##OWNER= Administrator
$$ $$ E:\/data/COFFEE/nmr/AC1675_BRAAN14383_8571173_fninPGIxMx/10/pdata/1/auditp.txt
$$ ##AUDIT TRAIL=  $$ (NUMBER, WHEN, WHO, WHERE, PROCESS, VERSION, WHAT)
(   1,<2014-04-11 15:10:02.943 -0700>,<Administrator>,<X>,<go>,<TOPSPIN 2.1>,
      <created by zg
	started at 2014-04-11 15:08:57.240 -0700,
	POWCHK enabled, PULCHK disabled,
       configuration hash MD5:
       C8 4E 4E 5D D3 5C D8 9E 9F 52 82 E0 59 8A DE 15
       data hash MD5: 64K
       1D A0 44 B1 18 02 07 71 D4 1F 4E 5A B9 29 52 AC>)
(   2,<2014-04-11 15:10:05.990 -0700>,<Administrator>,<X>,<proc1d>,<TOPSPIN 2.1>,
      <Start of raw data processing
       efp LB = 0 FT_mod = 6 PKNL = 1 PHC0 = 0 PHC1 = 0 SI = 32K 
       data hash MD5: 32K
       70 B6 92 9F 6C 28 3D 07 98 C8 D7 86 FC 84 1D 38>)
(   3,<2014-04-11 15:10:06.303 -0700>,<Administrator>,<X>,<proc1d>,<TOPSPIN 2.1>,
      <pk PHC0 = 93.09814 PHC1 = 0 
       data hash MD5: 32K
       39 15 F6 A9 55 95 24 31 97 7F E5 FE 08 88 A9 F5>)
(   4,<2014-04-11 15:10:06.412 -0700>,<Administrator>,<X>,<proc1d>,<TOPSPIN 2.1>,
      <abs ABSG = 1 
       data hash MD5: 32K
       0C 88 62 BB A1 AC FF D0 68 7F 44 0E 05 9D 5F 54>)
(   5,<2014-04-11 15:10:06.553 -0700>,<Administrator>,<X>,<proc1d>,<TOPSPIN 2.1>,
      <abs ABSG = 2 
       data hash MD5: 32K
       EB FE 98 76 A3 E5 05 D8 BC 21 74 38 0F FA CD 87>)
(   6,<2014-04-11 15:10:06.709 -0700>,<Administrator>,<X>,<proc1d>,<TOPSPIN 2.1>,
      <abs ABSG = 3 
       data hash MD5: 32K
       E5 D1 44 83 75 C1 38 33 6B 9C B5 6A A9 C1 0E 12>)
(   7,<2014-04-11 15:10:06.787 -0700>,<Administrator>,<X>,<proc1d>,<TOPSPIN 2.1>,
      <abs ABSG = 4 
       data hash MD5: 32K
       A8 E8 53 52 B5 53 41 E7 96 35 9D EB CB EA FF 0C>)
(   8,<2014-04-11 15:10:06.834 -0700>,<Administrator>,<X>,<proc1d>,<TOPSPIN 2.1>,
      <abs ABSG = 5 
       data hash MD5: 32K
       21 8F 8F 86 E9 68 A0 7A 7A 98 D2 6C CF F6 BE 67>)
$$ ##END=
$$ 
$$ $$ hash MD5
$$ $$ 06 5F A3 3A 6D 6E DE 6F 24 09 0B ED 32 45 5D 25
##$RELAX= 
##$RELAX= 
##$RELAX= 
##$RELAX= 
##$RELAX= 
##$RELAX= 
##$RELAX= 
$$ Bruker specific parameters
$$ --------------------------
##$DU= <E:\>
##$EXPNO= 10
##$NAME= <AC1675_BRAAN14383_8571173_fninPGIxMx>
$$ [...]
150 150 150 150 150 150 150 150
##$TP07= 0
##$TPNAME0= <>
##$TPNAME1= <>
##$TPNAME2= <>
##$TPNAME3= <>
##$TPNAME4= <>
##$TPNAME5= <>
##$TPNAME6= <>
##$TPNAME7= <>
##$TPOAL= (0..7)
0.5 0.5 0.5 0.5 0.5 0.5 0.5 0.5
##$TPOFFS= (0..7)
0 0 0 0 0 0 0 0
##$TUNHIN= 0
##$TUNHOUT= 0
##$TUNXOUT= 0
##$USERA1= <user>
##$USERA2= <user>
##$USERA3= <user>
##$USERA4= <user>
##$USERA5= <user>
##$V9= 5
##$VALIST= <valist>
##$VCLIST= <CCCCCCCCCCCCCCC>
##$VD= 0
##$VDLIST= <DDDDDDDDDDDDDDD>
##$VPLIST= <PPPPPPPPPPPPPPP>
##$VTLIST= <TTTTTTTTTTTTTTT>
##$WBST= 1024
##$WBSW= 4
##$XGAIN= (0..3)
0 0 0 0
##$XL= 0
##$YL= 0
##$YMAX_a= 591847
##$YMIN_a= -503786
##$ZGOPTNS= <>
##$ZL1= 120
##$ZL2= 120
##$ZL3= 120
##$ZL4= 120
##$ABSF1= 14.98509
##$ABSF2= -5.573092
##$ABSG= 5
##$ABSL= 3
##$ALPHA= 0
##$AQORDER= 0
##$ASSFAC= 0
##$ASSFACI= 0
##$ASSFACX= 0
##$ASSWID= 0
##$AUNMP= <proc_prof1d_extract_pilot.lims>
##$AXLEFT= 0
##$AXNAME= <>
##$AXNUC= <1H>
##$AXRIGHT= 0
##$AXTYPE= 0
##$AXUNIT= <>
##$AZFE= 0.1
##$AZFW= 0.1
##$BCFW= 0
##$BC_mod= 0
##$BYTORDP= 0
##$COROFFS= 0
##$CY= 15
##$DATMOD= 1
##$DC= 0
##$DFILT= <>
##$DTYPP= 0
##$F1P= 0
##$F2P= 0
##$FCOR= 0.5
##$FTSIZE= 32768
##$FT_mod= 6
##$GAMMA= 0
##$GB= 0
##$INTBC= 1
##$INTSCL= 1
##$ISEN= 128
##$LB= 0
##$LEV0= 0
##$LPBIN= 0
##$MAXI= 10000
##$MC2= 0
##$MEAN= 0
##$ME_mod= 0
##$MI= 0
##$NCOEF= 0
##$NC_proc= -8
##$NLEV= 6
##$NOISF1= 0
##$NOISF2= 0
##$NSP= 0
##$NTH_PI= 0
##$NZP= 0
##$OFFSET= 14.98509
##$PC= 1
##$PHC0= 93.09814
##$PHC1= 0
##$PH_mod= 1
##$PKNL= yes
##$PPARMOD= 0
##$PPDIAG= 0
##$PPIPTYP= 0
##$PPMPNUM= 2147483647
##$PPRESOL= 1
##$PSCAL= 4
##$PSIGN= 0
##$PYNMP= <proc.py>
##$REVERSE= no
##$SF= 400.02
##$SI= 32768
##$SIGF1= 0
##$SIGF2= 0
##$SINO= 400
##$SIOLD= 32768
##$SPECTYP= <>
##$SREGLST= <1H.CDCl3>
##$SSB= 0
##$STSI= 32768
##$STSR= 0
##$SW_p= 8223.68421052631
##$SYMM= 0
##$S_DEV= 0
##$TDeff= 65536
##$TDoff= 0
##$TI= <>
##$TILT= no
##$TM1= 0
##$TM2= 0
##$TOPLEV= 0
##$USERP1= <user>
##$USERP2= <user>
##$USERP3= <user>
##$USERP4= <user>
##$USERP5= <user>
##$WDW= 1
##$XDIM= 32768
##$YMAX_p= 457805395
##$YMIN_p= -894752
##$CURPLOT= <Network HP LaserJet P1505>
##$CURPRIN= <$Network HP LaserJet P1505>
##$DFORMAT= <normdp>
##$LAYOUT= <+/1D_H.xwp>
##$LFORMAT= <normlp>
##$PFORMAT= <normpl>
##$SURQMSG= 1
$$ End of Bruker specific parameters
$$ ---------------------------------
##NTUPLES= NMR SPECTRUM
##VAR_NAME=  FREQUENCY,     SPECTRUM/REAL,   SPECTRUM/IMAG
##SYMBOL=    X,             R,               I
##VAR_TYPE=  INDEPENDENT,   DEPENDENT,       DEPENDENT
##VAR_FORM=  AFFN,          ASDF,            ASDF
##VAR_DIM=   32768,         32768,           32768
##UNITS=     HZ,            ARBITRARY UNITS, ARBITRARY UNITS
##FACTOR=    0.250966925370066, 1,           1
##FIRST=     8223.43324360094, -144450,      -396268
##LAST=      0,             -221301,         -51255
##MIN=       0,             -894752,         0
##MAX=       8223.43324360094, 457805395,    0
$$ Real data points
##PAGE= N=1
##DATA TABLE= (X++(R..R)), XYDATA
$$ [...]
19544B36509A03375J09279o4469C3685e6336A08735h0246D3785K37609a41879
$$ 236509 103375 212654 148185 33685 -56336 108735 -80246 43785 281394 -141879
19533b20382L0745B22841r6283c60941F2496f6012A1173b25375a04596D5910K5568
$$ -220382 -189637 222841 126558 -360941 62496 -66012 11173 -225375 -104596 45910 71478
19522G1478o836c4383B77862a63887A5572b37649G1547c00897H6534k5139K6664
$$ 71478 64642 -34383 277862 -163887 15572 -237649 71547 -300897 86534 61395 88059
19511H8059c9782A11042c58411A06590e5024p74j70350b6126A09927e7759j54110
$$ 88059 -39782 111042 -358411 106590 -55024 -55798 -226148 -26126 109927 -57759 -211869
19500b11869f7026l23135d3280j42521j90121a16407N1874D9233d12815e3232
$$ -211869 -67026 -390161 -43280 -185801 -375922 -116407 -64533 49233 -412815 -53232
19489E8480b96045i3625j33106a01904j85861C7625a39417j4609B80217d8265
$$ 58480 -296045 -93625 -226731 -101904 -287765 37625 -139417 -154026 280217 -48265
19478g3117j49099A09501K2201Q1749C39f088B67995a02139j39647b6782n49141
$$ -73117 -222216 109501 131702 213451 339 -6088 267995 -102139 -241786 -26782 -575923
19467e75923D05857b99156a10937c8477A12929R9650g1461j16505L6356j61274
$$ -575923 405857 -299156 -110937 -38477 112929 212579 -71461 -187966 -151610 -312884
19457c12884J31777N9760M9693j90762e9453a6903B4771b34878P5361E5831J92469
$$ -312884 -181107 -121347 -71654 -262416 -59453 -16903 24771 -234878 -159517 55831 248300
19446B48300b52902M9794B34215B0402c20052L2806a19628L261F2848J36522a07388
$$ 248300 -252902 -203108 234215 20402 -320052 -287246 -119628 -116367 62848 199370 -107388
19434d02597a49911k3417d7786k5000j49746A92811b5754j02076D9119e5442j42375
$$ -402597 -149911 -173328 -47786 -72786 -222532 192811 -25754 -127830 49119 -55442 -197817
19423a97817j27739M5309O6712K1449r6626e9724B77929d79534A1398a69010A4502
$$ -197817 -325556 -280247 -213535 -192086 -288712 -59724 277929 -479534 11398 -169010 14502
19411d6385b1994o2115p3377E126b8779J2150B67263h3706F3627a2950C1128b54256
$$ -46385 -21994 -84109 -157486 5126 -28779 -16629 267263 -83706 63627 -12950 31128 -254256
19398b14283c9405l40998J35600i6694o6074a3534G6692i4250j39257F3731b77310
$$ -214283 -39405 -380403 -244803 -96694 -162768 -13534 76692 -94250 -233507 63731 -277310
19386A20938J62482a93534p5140h0092A77227o4791d57036C38357f3169k4984
$$ 120938 283420 -193534 -268674 -80092 177227 112436 -457036 338357 -63169 -88153
19376h8153Q740A33319j8034E667e538r7620k32807n3835G3594d10143a77229
$$ -88153 -79413 133319 115285 5667 -5538 -103158 -335965 -389800 73594 -410143 -177229
19364A53192n7960d7541F6923J2744a37435j70905n8687h2215c2969A4503a8532
$$ 153192 95232 -47541 66923 79667 -137435 -308340 -367027 -82215 -32969 14503 -18532
19352b28589A32870a90170h2353K61j59591c9264G7422k8298B4498a8614B64372
$$ -228589 132870 -190170 -82353 -82092 -241683 -39264 77422 49124 24498 -18614 264372
19340C88379A0716a68128A02066l6582a48300j00973N5617f9538A4588d9329I03
$$ 388379 10716 -168128 102066 65484 -148300 -249273 -193656 -69538 14588 -49329 903
19328C4700j5213b9217B0433K78317d8968A7960J80539j2862c46484a21820a6657
$$ 34700 19487 -29217 20433 298750 -48968 17960 198499 185637 -346484 -121820 -16657
19316a09759B60038h7819j25999A32407h4526l1523A58570c21404M410g8209m9813
$$ -109759 260038 -87819 -213818 132407 -84526 -116049 158570 -321404 -316994 -78209 -128022
19305a28022K9718k42651N8763a23359A0823J38794h622l0393l7458I5130f063
$$ -128022 -98304 -340955 -282192 -123359 10823 149617 -8622 -39015 -76473 95130 -6063
19293a47636H9547b23049P5261I1502a76366O4964A45625F8993f5653k58668a38234
$$ -147636 89547 -223049 -147788 91502 -176366 -111402 145625 68993 -65653 -324321 -138234
19281a45582F287a59716R677k68964J83505j18687J15603A65978E2328d10466
$$ -145582 6287 -159716 -150039 -419003 -235498 -354185 -238582 165978 52328 -410466
19270c39326B94200F3822a24240m449M0427k14949a3563k06877B04000C6734L6528
$$ -339326 294200 63822 -124240 -128689 -88262 -303211 -13563 -220440 204000 36734 73262
19259G3262J36962o7674B688a5955k39636g4163j66479B799P1745Q5154b91697
$$ 73262 210224 142550 2688 -15955 -255591 -74163 -240642 2799 74544 159698 -291697
19247G9147d332m2606A84019F510a32282C20428d13636a4904B03883c06732A03300
$$ 79147 -4332 -46938 184019 6510 -132282 320428 -413636 -14904 203883 -306732 103300
19235H0258I033J15337L5658g5504o3403j59795a06224q3516b9701j08935G8382
$$ 80258 9033 124370 160028 -75504 -138907 -298702 -106224 -189740 -29701 -138636 78382
19223A92644d6557J5800l20136J32088f9022j1336j45521A12912e9481j66241
$$ 192644 -46557 -30757 -350893 -218805 -69022 -80358 -225879 112912 -59481 -225722
19213b25722d8186D974d8435p1798B02853b74757B55K05143a03171B0544K3130
$$ -225722 -48186 4974 -48435 -120233 202853 -274757 255 205398 -103171 20544 43674
19202D3674a9199B72601b25344b2732j88691k3852f7308A84424G9306b70308i9408
$$ 43674 -19199 272601 -225344 -22732 -211423 -235275 -67308 184424 79306 -270308 -99408
19190A53757c14506b0776q4114J7710j5519J9681E5881K20623J7955b71657J28249
$$ 153757 -314506 -20776 -104890 -87180 -102699 -83018 55881 276504 294459 -271657 -143408
19179a43408m2695E5205c22021B97a20652N2667H0691A8012a43130J3269K2507
$$ -143408 -186103 55205 -322021 297 -120652 -67985 80691 18012 -143130 -129861 -107354
19168a07354r4148B3102b89680A58993b23368F9538a45477B2374P3058b02859
$$ -107354 -201502 23102 -289680 158993 -223368 69538 -145477 22374 95432 -202859
19157a03238B20128c07392N1693R8783J4030a6958q1136K6167K7715C7306b4413
$$ -103238 220128 -307392 -255699 -156916 -142886 -16958 -98094 -71927 -44212 37306 -24413
19145d52756a15924e0938k54962A04472c8831j42830A13394k5640O444c24363
$$ -452756 -115924 -50938 -305900 104472 -38831 -181661 113394 87754 94198 -324363
19134A88878n3427c02427J03697j61471e4189p7075A76841q5741a95342e4624
$$ 188878 135451 -302427 -198730 -360201 -54189 -131264 176841 91100 -195342 -54624
19123a9920l57446J88395N143d9078A26031b02752I2477a08116c2547A81568f4658
$$ -19920 -377366 -188971 -183828 -49078 126031 -202752 92477 -108116 -32547 181568 -64658
19111d3975A03622D3153c52221H7670b30624j7524I6084i9026A57901a3578A24515
$$ -43975 103622 43153 -352221 87670 -230624 -248148 96084 -99026 157901 -13578 124515
19099c9111P21k10788J2477B928J60441E3493J06376a52089e4592n6972A06702
$$ -39111 -38390 -249178 -236701 2928 163369 53493 159869 -152089 -54592 -111564 106702
19087B90121A0634d5922n1078K6006j13673i266A10455B8154L1468a17277A27969
$$ 290121 10634 -45922 -97000 -70994 -184667 -9266 110455 28154 59622 -117277 127969
19075E6522J7395K88346f259E2093a27717A99894G891L2287P0325a93170C47648
$$ 56522 73917 362263 -6259 52093 -127717 199894 7891 40178 110503 -193170 347648
19063B5235d5494J9945j07576C04533a16809l4084d1987k61991B34673a80325
$$ 25235 -45494 -25549 -133125 304533 -116809 -150893 -41987 -303978 234673 -180325
19052i8462l64728b8327F4969i540A33098a1699j86679h4539r0412J6668p1600
$$ -98462 -463190 -28327 64969 -9540 133098 -11699 -198378 -84539 -174951 -158283 -229883
19041b29883B8629a04996o6069O1524j33441l4777A1493h7662d0865A15998k216
$$ -229883 28629 -104996 -171065 -109541 -242982 -277759 11493 -87662 -40865 115998 113782
19030A13782Q8796f6333B19306d6408A21005J47466E2915A3553M0014a56628B85634
$$ 113782 202578 -66333 219306 -46408 121005 268471 52915 13553 53567 -156628 285634
19018E9334J28802a48500A31279b15565A86354d14111B07037b4123j61590A03758
$$ 59334 188136 -148500 131279 -215565 186354 -414111 207037 -24123 -185713 103758
19007c84475a07798I7077A2550O7808J23328a99881B765e5580r0310g446H1121
$$ -384475 -107798 97077 12550 80358 203686 -199881 2765 -55580 -145890 -7446 81121
18995a03107j73611g8548j41800j18952a59161r2811N6490j71674A59833J14353
$$ -103107 -276718 -78548 -220348 -339300 -159161 -251972 -195482 -367156 159833 274186
18985B74186a02822L3695K5788l7011j61965A3156c1171K588k03302A80680i6129
$$ 274186 -102822 -69127 -43339 -80350 -242315 13156 -31171 -28583 -231885 180680 -96129
18973c54330A1852a542l78722B91662b96277A6367g8613A22461B1612a66435B72558
$$ -354330 11852 -1542 -380264 291662 -296277 16367 -78613 122461 21612 -166435 272558
18961A36977b21234b9789k52518D4711a10659M3435k75306J65545b6228k78495
$$ 136977 -221234 -29789 -282307 44711 -110659 -67224 -342530 -176985 -26228 -304723
18951c04723G5545Q9073e7501g325B22799O296b11352B32882b01428A08723a82775
$$ -304723 75545 164618 -57501 -7325 222799 229095 -211352 232882 -201428 108723 -182775
18939e79748I7932b01081d7698B2542J01788E2856b48149J21355j80073A5663
$$ -579748 97932 -201081 -47698 22542 124330 52856 -248149 -126794 -306867 15663
18928b9932B0250d3448j62169D0945b55894D80144A10503D0847j2870K57789c36024
$$ -29932 20250 -43448 -205617 40945 -255894 480144 110503 40847 27977 285766 -336024
18916a69040C9721h8519B82759b25515G4128P3836a60683C8148a6012o7313k1999
$$ -169040 39721 -88519 282759 -225515 74128 147964 -160683 38148 -16012 -83325 -105324
18905a05324a2083B4509a43581f3530A66948K2309d6045A0732f5143n0101N2673
$$ -105324 -12083 24509 -143581 -63530 166948 189257 -46045 10732 -65143 -115244 -62571
18894f2571n0978e1434l996k25639f2111l8348j173j12947j67500a90124c5064
$$ -62571 -113549 -51434 -55430 -281069 -62111 -100459 -101632 -214579 -382079 -190124 -35064
18882e51563A44232a75332c0788P640j36463A78913J7465n1607a33524G2351Q311
$$ -551563 144232 -175332 -30788 -23148 -159611 178913 196378 144771 -133524 72351 80662
18871H0662J37308g2064C3208P9697J6935J16021r7123c7052B32778b06931j37656
$$ 80662 217970 -72064 33208 112905 129840 245861 148738 -37052 232778 -206931 -344587
18860c44587i3423b4156H085J2669b9057B299a59921A23464D1903J68684o8685
$$ -344587 -93423 -24156 8085 20754 -29057 2299 -159921 123464 41903 210587 141902
18849A41902D1482a10926F1566K26864b50730a6641o5211J9641A85385c70438
$$ 141902 41482 -110926 61566 288430 -250730 -16641 -81852 -62211 185385 -370438
18838B30848B9287K17184a63914A02132J5321b0960j33500B04265a80893B0721
$$ 230848 29287 246471 -163914 102132 117453 -20960 -154460 204265 -180893 20721
18827a32738d0922B43823n4033a53248k9461j36492D5314H67R4087c03545G9534
$$ -132738 -40922 243823 189790 -153248 -182709 -319201 45314 867 94954 -303545 79534
18815A39501l6116a80932h6214A26248o2045P9607K10674m7999I7121a04363B14779
$$ 139501 103385 -180932 -86214 126248 64203 143810 354484 306485 97121 -104363 214779
18803i4146c7005B8641J4573J49414r4916b79429B09282F4183d1866j85912K9289
$$ -94146 -37005 28641 43214 192628 97712 -279429 209282 64183 -41866 -227778 -198489
18792a98489q0656k0634A02656f9602j26802j54447m8915J85623g2923k81000
$$ -198489 -279145 -299779 102656 -69602 -196404 -350851 -399766 -214143 -72923 -353923
18782c53923d0443j90341a7504A96455H6462J38942a74248m6735L7343k6054O2343
$$ -353923 -40443 -230784 -17504 196455 86462 225404 -174248 -220983 -183640 -209694 -147351
18771a47351H960f4425j42108g1137j01187K1872e9833C20324A01599e1267i274
$$ -147351 8960 -64425 -206533 -71137 -172324 -150452 -59833 320324 101599 -51267 -9274
18759a8468k66496j08546A82594e31180a39422B67243a26939p1528r547A12713
$$ -18468 -284964 -393510 182594 -531180 -139422 267243 -126939 -198467 -208014 112713
18748A33322N4867a00775j61250D8868a62524c9186B53952i0783A40068a0010
$$ 133322 188189 -100775 -262025 48868 -162524 -39186 253952 -90783 140068 -10010
18737c0452H8630A9060a15720k26786A58825e75251A38552k7130C077Q7622a86514
$$ -30452 88630 19060 -115720 -342506 158825 -575251 138552 111422 3077 90699 -186514
18725a74693j01388A35589b50850H9791a36493D2413L00341C7406R227a83696
$$ -174693 -276081 135589 -250850 89791 -136493 42413 342754 37406 46633 -183696
18714a40143A15243k9132a00170M8136C17264B204a51427M3399A15202c79331
$$ -140143 115243 86111 -100170 -52034 317264 2204 -151427 -108028 115202 -379331
18703f0555B34086q8725f9482e31k69944e5216K3293l51216B04080b31330C75
$$ -60555 234086 145361 -69482 -531 -270475 -55216 -31923 -383139 204080 -231330 375
18691d08998a10050a1355k1763b876j97058h1858c0215q9065D8831R4924n5477
$$ -408998 -110050 -11355 -33118 -2876 -199934 -81858 -30215 -119280 48831 143755 88278
18680H8278b39208j5341M2178D4422j6065a58784I0027j4388b93207C0575b28375
$$ 88278 -239208 -254549 -212371 44422 28357 -158784 90027 75639 -293207 30575 -228375
18668b68873H7347c10003I413c16219B55675b0412C68002I8566e4776l51217A06762
$$ -268873 87347 -310003 9413 -316219 255675 -20412 368002 98566 -54776 -405993 106762
18656A95898b965k51195A4697R1307c4136d60C7978c39179a39887B8826M8183
$$ 195898 -2965 -254160 14697 106004 -34136 -460 37978 -339179 -139887 28826 77009
18645G7009j4833k0807b89771G5595l743P525J58128a73301C12218e2643A8243
$$ 77009 62176 41369 -289771 75595 71852 79377 237505 -173301 312218 -52643 18243
18633b36019M3219N407P3059M3035k9135n30891h5438b0166o837r7683k06605
$$ -236019 -192800 -187393 -114334 -71299 -100434 -631325 -85438 -20166 -27003 -124686 -331291
18622c31291A12635j8797C9476K1273g0128j0888a7969A82071k9867a84191I197
$$ -331291 112635 93838 39476 60749 -70128 -81016 -17969 182071 152204 -184191 9197
18610A7349J05852i3838K1171r8412m3041H872a058j17904B48120d26645J28513
$$ 17349 123201 -93838 -72667 -171079 -214120 8872 -1058 -118962 248120 -426645 -298132
18599b98132b8922k07636N3242B1218E997b95382b5910C5644l075M6065K4508
$$ -298132 -28922 -236558 -183316 21218 5997 -295382 -25910 35644 32569 78634 103142
18588A03142C7514b59373N5544h3957j40824i1421k1427H6888a93360O0745A64026
$$ 103142 37514 -259373 -203829 -83957 -224781 -91421 -112848 86888 -193360 -132615 164026
18576A16945D7327j5681g072B229b66142J07568j81990a16806k92457A87651a50181
$$ 116945 47327 31646 -7072 2229 -266142 -158574 -340564 -116806 -409263 187651 -150181
18564c67295Q9420A38903g2205k40870g5100K7912B58150G2303i0151j11702B07343
$$ -367295 -277875 138903 -72205 -313075 -75100 -47188 258150 72303 -90151 -201853 207343
18552A16446K77150f1336G9143a02971m098B14110a89662b0912k22136a06196
$$ 116446 393596 -61336 79143 -102971 -107069 214110 -189662 -20912 -243048 -106196
18541f0300j99456O2583j94212A10412h1937J6367b0410j30600r6406M591A31440
$$ -60300 -259756 -197173 -391385 110412 -81937 -65570 -20410 -151010 -247416 -242825 131440
18529C0243a05483l9609l4301g0721j06843d9619j52162B1924a16494M9096k53586
$$ 30243 -105483 -145092 -179393 -70721 -177564 -49619 -201781 21924 -116494 -67398 -320984
18518c20984a14221b0056B56148i4072M740A01131i4192L2833l26402C01121o0897
$$ -320984 -114221 -20056 256148 -94072 -89332 101131 -94192 -61359 -387761 301121 240224
18507B40224C412c75099a51675J9740q3732E6326b92469J31929A58052b11409
$$ 240224 3412 -375099 -151675 -131935 -215667 56326 -292469 -160540 158052 -211409
18496E127J0194a2470k10741A2763J87199b67210D13750a85617b1380k90319B13173
$$ 5127 15321 -12470 -223211 12763 199962 -267210 413750 -185617 -21380 -311699 213173
18484g4304n3164q8801J9618m661i6468A37a28019n1297I1281c8998j19623b7931
$$ -74304 -127468 -216269 -196651 -201312 -96468 137 -128019 -179316 91281 -38998 -158621 -27931
18471b47282j52960a04855B78912g4427k99196J07969c9992j0431k2737j50221
$$ -247282 -400242 -104855 278912 -74427 -373623 -265654 -39992 -50423 -73160 -223381
18461b23381l940g1305A3288d93138D10942A72466M2149B7294g0169j16550j73783
$$ -223381 -227321 -71305 13288 -493138 410942 172466 214615 27294 -70169 -186719 -360502
18450c60502A70925a47357C526b28851h9922k9822r0296q1779a20639a1934r9653
$$ -360502 170925 -147357 3526 -228851 -89922 -119744 -210040 -291819 -120639 -11934 -111587
18439a11587o113q7180f50A23549a93198B24817G2500c71764f8095J1132j96287
$$ -111587 -117700 -204880 -650 123549 -193198 224817 72500 -371764 -68095 -56963 -253250
18428b53250h8035o6916C1917J02427K26522c62839J58998A33785J13280a46002
$$ -253250 -88035 -154951 31917 134344 360866 -362839 -203841 133785 247065 -146002
18417A57976g8368c3022k95279B68401j28440a34085A42159A1649J60893d1915
$$ 157976 -78368 -33022 -328301 268401 139961 -134085 142159 11649 172542 -41915
18406D72024a82014E9249I382K26549a05711F8062f7827k2000j68254A17158Q3342
$$ 472024 -182014 59249 9382 235931 -105711 68062 -67827 -89827 -258081 117158 200500
18395B00500i8458k35119c1479A26562a36725j94798I0104N5544p0427N8738g7032
$$ 200500 -98458 -333577 -31479 126562 -136725 -331523 90104 145648 75221 133959 -77032
18383b2013A75159J09049a00860A08702R02c58642g0159H5872h6306j05708k6623
$$ -22013 175159 284208 -100860 108702 109604 -358642 -70159 85872 -86306 -192014 -218637
18372b18637a00303A11905c83369a03734M0999k96631A31442B7308J65834F7030
$$ -218637 -100303 111905 -383369 -103734 -62735 -359366 131442 27308 193142 67030
18361a9684n2034A50610g1369A5590b0686E8728d65735B07277E9869c1507j80400
$$ -19684 -71718 150610 -71369 15590 -20686 58728 -465735 207277 59869 -31507 -211907
18350b11907d0503a3730C9566M3834J25031a26339o2290l0884A7358b772j49758
$$ -211907 -40503 -13730 39566 83400 208431 -126339 -188629 -219513 17358 -2772 -152530
18339a52530p4269G8839b08640A85405b1921A15459A783L5549b39408Q858b7289
$$ -152530 -226799 78839 -208640 185405 -21921 115459 1783 37332 -239408 -230550 -27289
18327a32114a3442j96008B18732A8385J05108J69639a0639k37473I0139b85056
$$ -132114 -13442 -209450 218732 18385 123493 293132 -10639 -248112 90139 -285056
18316E9016Q0578d06315a64702B59794A27848h9117k96618c3685B1978P1031b71025
$$ 59016 139594 -406315 -164702 259794 127848 -89117 -385735 -33685 21978 93009 -271025
18304D3794f1799r5179j2471c4165l5962A13476p457J22628a26019a6768k45752
$$ 43794 -61799 -156978 -169449 -34165 -70127 113476 106019 228647 -126019 -16768 -262520
18293b62520F1633l15a46794j20311d3462j8156l3955I7341a47233E3739M36587
$$ -262520 61633 61318 -146794 -267105 -43462 -61618 -95573 97341 -147233 53739 490326
18282D90326A12741f3803F1355b0764B7797K03079a94740l0452Q4979B05901q881
$$ 490326 112741 -63803 61355 -20764 27797 230876 -194740 -225192 -140213 205901 197020
18271A97020a27126N9605j55038f7029r4168h207q1284B20447g7977j19190P0459
$$ 197020 -127126 -67521 -222559 -67029 -161197 -8207 -89491 220447 -77977 -197167 -126708
18260a26708d4926E4098g3349r944D4530K968b69497G8618P5927a08562d6773
$$ -126708 -44926 54098 -73349 -83293 44530 47498 -269497 78618 154545 -108562 -46773
18248a05750j33827A7894N7461J13123l7187a05317A57502o9844a88918O4742
$$ -105750 -239577 17894 75355 188478 151291 -105317 157502 87658 -188918 -124176
18238a24176A69842b61268A58316O8131a12256A37982K58502b38033G9874c5719
$$ -124176 169842 -261268 158316 226447 -112256 137982 396484 -238033 79874 -35719
18227A41601a0025k5318A58358d46675C40697f5877q3499B42616A7053i1100j1854
$$ 141601 -10025 -35343 158358 -446675 340697 -65877 -149376 242616 17053 -91100 -102954
18216a02954d9381N043k12350j38015C00907F3475a57028c7200h276C9341d4365
$$ -102954 -49381 -44338 -256688 -394703 300907 63475 -157028 -37200 -8276 39341 -44365
18204A29411a28476E5683a8237B9810R5848f3861m3023K2306J8906m1194l31722
$$ 129411 -128476 55683 -18237 29810 125658 -63861 -106884 -84578 -65672 -106866 -438588
18193d38588F720P8977a5660A0358b01119f4796K3137j9079k43689P1159k0482
$$ -438588 6720 85697 -15660 10358 -201119 -64796 -41659 -60738 -304427 -233268 -253750
18182b53750A55880d4747r4092j74307K8137H3462g3216r0438B5728d52825F2659
$$ -253750 155880 -44747 -138839 -313146 -285009 83462 -73216 -163654 25728 -452825 62659
18170G2174b64162A31757K0275a45223a6367D1675i1264J0112D2455a42320f6118
$$ 72174 -264162 131757 152032 -145223 -16367 41675 -91264 -81152 42455 -142320 -66118
18158e6102j1758J5296r9686g3262l00605c7404j30421h764l4917l1426C1300
$$ -56102 -67860 -52564 -152250 -73262 -373867 -37404 -167825 -8764 -43681 -75107 31300
18146A13293j3674b7090A50253D008Q6013L6497c1277o4449C581a51241m1422
$$ 113293 99619 -27090 150253 4008 90021 126518 -31277 -95726 3581 -151241 -192663
18135a92663O4274K8146B90238l5166G1228g6591B6649N1376e8982l10451B41120
$$ -192663 -128389 -100243 290238 255072 71228 -76591 26649 78025 -58982 -369433 241120
18123a86499H6154K06979r5617r1428b26347o68405c01118B57975a64044p6715
$$ -186499 86154 293133 197516 106088 -226347 -894752 -301118 257975 -164044 -240759
18113b40759C0269K1485A9505c716A0114K70445a00142A06305a51954A773J59621
$$ -240759 30269 51754 19505 -3716 10114 280559 -100142 106305 -151954 1773 161394
18102A61394h1471b9197k29312c4830k3127b7701j09614O3531b2387k68008O5281
$$ 161394 -81471 -29197 -258509 -34830 -57957 -27701 -137315 -73784 -22387 -290395 -225114
18091b25114B49883H8469b3043F0905G835b15449D5069a14886a0068k24744M9537
$$ -225114 249883 88469 -23043 60905 7835 -215449 45069 -114886 -10068 -234812 -185275
18080a85275k72174C17394a07382j86762c2793o5507j14255i1534H9160b532j2084
$$ -185275 -457449 317394 -107382 -294144 -32793 -98300 -212555 -91534 89160 -2532 -14616
18069a4616n8657o599H9226i1078q1980I7247K953J43160F1701a9330k92669F244
$$ -14616 -73273 -79872 89226 -91078 -173058 97247 100200 243360 61701 -19330 -311999 6244
18056D6622f6615E2820K8360b49462q5294a44156J6418B5575a19981J2219f886
$$ 46622 -66615 52820 81180 -249462 -334756 -144156 -127738 25575 -119981 -107762 -6886
18044B01587a45244A34423a454G4071R831G350b84628C9837g8743l30396a18640
$$ 201587 -145244 134423 -1454 74071 83902 7350 -284628 39837 -78743 -409139 -118640
18032A9929c4204m9795J6421I995K71641a54636L2309M7162q0194o8626R6661
$$ 19929 -34204 -83999 -67578 9995 281636 -154636 -122327 -75165 -155359 -223985 -127324
18021a27324N8254J1936A43535c4170o5186j89165a493j5298A58848K7473B455
$$ -127324 -69070 -57134 143535 -34170 -99356 -288521 -1493 -16791 158848 186321 2455
18009C5850b87565A92264D9462K33564a46856B6561L5139K7169c96815h9063r2689
$$ 35850 -287565 192264 49462 283026 -146856 26561 61700 88869 -396815 -89063 -181752
17998a81752j2823m6197a15376B494d6618E9025d6512C2683a14666n6308B46085
$$ -181752 -194575 -240772 -115376 2494 -46618 59025 -46512 32683 -114666 -170974 246085
17986b52697A65804G1938J31215E4064b1286p6828J9647j29131C01805G8467K50535
$$ -252697 165804 71938 203153 54064 -21286 -98114 -78467 -207598 301805 78467 329002
17975C29002a02082F7594a54902b2092C49889i7159A14874b32647j72007F2434
$$ 329002 -102082 67594 -154902 -22092 349889 -97159 114874 -232647 -404654 62434
17964a77238B08226F7953k795a08795q9596N3235A00119a97942O5916A79505a07891
$$ -177238 208226 67953 65158 -108795 -198391 -145156 100119 -197942 -132026 179505 -107891
17952c25695p1206e3624j46372e0787k5631j47700b5862A21650d11642a3419B73649
$$ -325695 -396901 -53624 -199996 -50787 -76418 -224118 -25862 121650 -411642 -13419 273649
17940A6064h0992m907k15892C5434A1202a94862P3123q753O263D00075a19439
$$ 16064 -80992 -85899 -301791 35434 11202 -194862 -121739 -130492 -124229 400075 -119439
17928A14575d2946m67m91631A79266h4000A95345b52511a0646m1010A62072c37716
$$ 114575 -42946 -43413 -535044 179266 -84000 195345 -252511 -10646 -51656 162072 -337716
17916A25670R4739a55404A59282a48528l089A34351G963O8257b40095Q4299d4556
$$ 125670 220409 -155404 159282 -148528 -151617 134351 7963 76220 -240095 -155796 -44556
17904a10230A65130i7790C14105a94952C99b16n5664A75179A5749K52435b37108
$$ -110230 165130 -97790 314105 -194952 399 -216 -55880 175179 15749 268184 -237108
17892B43843c53202O9809c603A74417J5395r1448a06707k00382B2095g5593j03762
$$ 243843 -353202 -283393 -3603 174417 189812 98364 -106707 -307089 22095 -75593 -179355
17881a79355A8313J43022J58749a12318B16267b4172j97212A74825b80936c2126
$$ -179355 18313 161335 320084 -112318 216267 -24172 -221384 174825 -280936 -32126
17870I145J00993b8254l5016j73114A5347R6349a62940P0046C79027G7638a66879
$$ 9145 110138 -28254 -63270 -236384 15347 111696 -162940 -92894 379027 77638 -166879
17858A1791M9531b89389B00652c196E0002J57658d1474F2952b16040b9445J1801
$$ 11791 61322 -289389 200652 -3196 50002 207660 -41474 62952 -216040 -29445 -17644
17847a7644N940j85892k1064f8739A26941a74219g8268B05135a05653F0540b28015
$$ -17644 -11704 -197596 -218660 -68739 126941 -174219 -78268 205135 -105653 60540 -228015
17835B53321a16824c1219A51929k3846g7167R577C03914a15178j76419B46075
$$ 253321 -116824 -31219 151929 128083 -77167 -67590 303914 -115178 -291597 246075
17824a67359B46567b02727A77822a28065L5049B22190e8824B65445i2041B04046
$$ -167359 246567 -202727 177822 -128065 -93016 222190 -58824 265445 -92041 204046
17813D20094G0008l3560a1848j95237j41154c9820k1393k12087C17177a29391
$$ 420094 70008 36448 -11848 -207085 -348239 -39820 -61213 -273300 317177 -129391
17802b41097C05330c62552J48053B7800b4589l55700a68136J1245P7723k0877
$$ -241097 305330 -362552 -214499 27800 -24589 -380289 -168136 -156891 -79168 -100045
17792a00045A39320A4158m902e8703C8652e5150r1844C3663d3108m8804B41413
$$ -100045 139320 14158 9256 -58703 38652 -55150 -146994 33663 -43108 -91912 241413
17780a72391A14776a27327B18706b5126k1344j97487A51264b39361c6994k67759
$$ -172391 114776 -127327 218706 -25126 -46470 -243957 151264 -239361 -36994 -304753
17770c04753N989C3122a04373p8906g8731c6174A25952K0447E0127J01593f0008
$$ -304753 -298764 33122 -104373 -183279 -78731 -36174 125952 146399 50127 151720 -60008
17758g612l21792e9849K7935j21437A80007q9757L6963J33604a03542A57379D2527
$$ -7612 -329404 -59849 -31914 -153351 180007 90250 127213 260817 -103542 157379 42527
17746A94429C6852L19956a16471e6708k37279A9975q173J24863i9529K3422E1408
$$ 194429 36852 356808 -116471 -56708 -293987 19975 11802 136665 -99529 -76107 51408
17734G3134a74119f5959b1684A22012h3199F2119K49765r9366k0951a94346A76744
$$ 73134 -174119 -65959 -21684 122012 -83199 62119 311884 212518 191567 -194346 176744
17722A69927e9839j49029m752A25944K1748a01941m1759m0389A16292E3377a44416
$$ 169927 -59839 -208868 -213620 125944 147692 -101941 -143700 -184089 116292 53377 -144416
17710B48329a22879O589J1223C76546E9412d0651A03646b18960G8143Q5049J17892
$$ 248329 -122879 -116290 -105067 376546 59412 -40651 103646 -218960 78143 163192 281084
17699B81084i5708A01621J23371B4159a89275P7889A86187G0749L1954b29197
$$ 281084 -95708 101621 224992 24159 -189275 -111386 186187 70749 102703 -229197
17688b9994A02649B377M744b64645i7072C04919a05001C08360i912p2198A7232
$$ -29994 102649 2377 7121 -264645 -97072 304919 -105001 308360 -9912 -82110 17232
17676C05247c4573p6098H5077b49541C1650K00964a47759j2984A7472b11928A15862
$$ 305247 -34573 -110671 85077 -249541 31650 232614 -147759 -160743 17472 -211928 115862
17664C01957b25736A49783b89146B7423d67842e9129a2223A12645a75154J0041
$$ 301957 -225736 149783 -289146 27423 -467842 -59129 -12223 112645 -175154 -165113
17654a65113C3245a05307A78102D0018J00502a53545p3465G981K8753A5106d8312
$$ -165113 33245 -105307 178102 40018 140520 -153545 -227010 7981 36734 15106 -48312
17642b30285a08931A09686L4638J23586a17910k0829K8775j815A40713F1636b587
$$ -230285 -108931 109686 144324 267910 -117910 -138739 -109964 -111779 140713 61636 -2587
17630B31974F7390d6807k6755B02482e9640a6542A15100b28035N9501g074A38483
$$ 231974 67390 -46807 -73562 202482 -59640 -16542 115100 -228035 -168534 -7074 138483
17618a5397r1107B32851J26948b28562B69906b490k47501B4827c3044A43423B5945
$$ -15397 -106504 232851 359799 -228562 269906 -2490 -249991 24827 -33044 143423 25945
17606B62527m4666o2418R6031a06083A77951a66138A8176b57965A06288J03022
$$ 262527 217861 155443 251474 -106083 177951 -166138 18176 -257965 106288 209310
17596B09310b28018B7236i7633H4612J26253l9615d2691o9339l28369e6751l41332
$$ 209310 -228018 27236 -97633 84612 210865 171250 -42691 -112030 -440399 -56751 -398083
17585c98083a21E5714K2161K3447g6564B81220a314j81035I5392a39244H0515
$$ -398083 -121 55714 77875 101322 -76564 281220 -1314 -182349 95392 -139244 80515
17573a8786B99965D8775b37845H4906a15952B07898A3672L0877a29551o2829c6872
$$ -18786 299965 48775 -237845 84906 -115952 207898 13672 44549 -129551 -192380 -36872
17561a72712a6509B9083L9151A1704L33193A1549J92608J13307A323K68516h4610
$$ -172712 -16509 29083 68234 11704 344897 11549 204157 317464 1323 269839 -84610
17549A74859M7778a11207B09095d240j73619A60174B2316M7006L73118a9998D9668
$$ 174859 222637 -111207 209095 -4240 -177859 160174 22316 69322 442440 -19998 49668
17537A79424b01828H2075J14478o9289J91915A54858a2126k14407D2419b74856
$$ 179424 -201828 82075 196553 127264 319179 154858 -12126 -226533 42419 -274856
17526a06608o3929l6010B31739k9372K66117A44531J59913E7218P3736b2296k3597
$$ -106608 -170537 -206547 231739 202367 468484 144531 304444 57218 130954 -22296 -45893
17515d5893A39405J42392K0973h332A99100q0499J9149D7359J0796J70404K603
$$ -45893 139405 281797 302770 -8332 199100 118601 137750 47359 58155 228559 231162
17504B31162O1182R0819C7315b71245a21659A23670e1260B71830M037j8031c279
$$ 231162 292344 383163 37315 -271245 -121659 123670 -51260 271830 275867 257836 -3279
17492A51046f3510j77284d3181J0369A09437C2478c9920D6745b49148B44937k3605
$$ 151046 -63510 -240794 -43181 -32812 109437 32478 -39920 46745 -249148 244937 221332
17481B21332c99804e7187A97488M5908m5954E0307J50599p0704J6512e6295H744
$$ 221332 -399804 -57187 197488 243396 197442 50307 200906 130202 146714 -56295 8744
17469g1061A17229a71764e0971r9776b4077r8965B12602a87049F421N190a7879
$$ -71061 117229 -171764 -50971 -150747 -24077 -123042 212602 -187049 6421 11611 -17879
17457A34521J20701l2455H1506J09391H9619L20948j91293A3455P0967L91074
$$ 134521 255222 222767 81506 190897 89619 410567 219274 13455 84422 475496
17447D75496k5451A02332M46569j98782o5201F0408j2897K99266A54159a47294
$$ 475496 450045 102332 548901 350119 284918 60408 47511 346777 154159 -147294
17436I2490k1279J61244O6339j1296J16230A75898K15040A07392N4684a66547
$$ 92490 71211 232455 298794 287498 403728 175898 390938 107392 162076 -166547
17425A89121N9041I7898N4306E7647h4434I6758J09580N5696a12567A87532J14430
$$ 189121 248162 97898 152204 57647 -84434 96758 206338 262034 -112567 187532 301962
17414C01962j01551K16365A45646k6967a36323G9407K52927H3769a67509b7054
$$ 301962 200411 416776 145646 118679 -136323 79407 332334 83769 -167509 -27054
17403a9400C2740L51108j84436a6191B75671K67929I9290P7158E6823J9783L42745
$$ -19400 32740 383848 199412 -16191 275671 543600 99290 176448 56823 76606 419351
17392D19351B04478q6020l1776K21859B3008g4834A39239B8332M7073h5352C52386
$$ 419351 204478 118458 86682 308541 23008 -74834 139239 28332 75405 -85352 352386
17380D17487F2245J72379a64262D16482J94276h7291m1021M4513B15951A03541
$$ 417487 62245 234624 -164262 416482 610758 -87291 -128312 -83799 215951 103541
17369B94785a09211A695a03861B94877a51088B79228e327k1327j04714i417D0805
$$ 294785 -109211 1695 -103861 294877 -151088 279228 -5327 -26654 -131368 -9417 40805
17357B85970b7368B28203L13179k14631j62215d8527B54787K7873L47912C96J89702
$$ 285970 -27368 228203 541382 326751 164536 -48527 254787 282660 630572 396 190098
17346A90098o6840M46a37313L4745A98993N185O7805L5401A5862K35017k7723
$$ 190098 123258 123704 -137313 -102568 198993 204178 271983 307384 15862 250879 223156
17335B23156K98006F3244b81780C7161a27871A91930G0799K68528J08987k22006
$$ 223156 521162 63244 -281780 37161 -127871 191930 70799 339327 448314 226308
17325B26308J48314I6711J16925L12881A12198n327l3363P8573O6625J2119q7944
$$ 226308 374622 96711 213636 526517 112198 106871 73508 152081 218706 230825 142881
17314A42881j5042a45390D92010B33918G8462J28962A7226K70108E0902K12601
$$ 142881 127839 -145390 492010 233918 78462 207424 17226 287334 50902 263503
17304B63503A14017a3861C70266D7214R0550m7621J28902a69621e4048A74408
$$ 263503 114017 -13861 370266 47214 137764 90143 219045 -169621 -54048 174408
17293a60408E561g9844A60398a02327A69029J30488n6228A05755P0478a39045
$$ -160408 5561 -79844 160398 -102327 169029 299517 243289 105755 176233 -139045
17282A96218J10639b7817B38718d8912H6599L04706q1489j00822b5988q4956B02650
$$ 196218 306857 -27817 238718 -48912 86599 391305 309816 208994 -25988 -110944 202650
17270A0347a07246A3201L56102p2450p9307C318O4215Q2549R9776A23478a34960
$$ 10347 -107246 13201 369303 296853 217546 3318 67533 150082 249858 123478 -134960
17258C43864m2187m0216j13816L93848k06431F2927J11758K00174A25930L4142
$$ 343864 301677 261461 147645 541493 335062 62927 174685 374859 125930 160072
17248A60072E041K93533A34401J41373A7690L84913j97691J62129j3977A50971
$$ 160072 5041 298574 134401 275774 17690 402603 204912 367041 353064 150971
17237g8853B04625F8177L7752J78051P1798r4660l8363A583K11810Q5697i7086
$$ -78853 204625 68177 105929 283980 355778 261118 222755 1583 213393 299090 -97086
17225C74685H8466L42724j73590j12975K21510j45946J39645J8980A52632L9538
$$ 374685 88466 431190 257600 144625 366135 220189 359834 378814 152632 192170
17215A92170J26659a5510D47665e8739C39944O5570H0038J75898A03751J60358
$$ 192170 318829 -15510 447665 -58739 339944 405514 80038 255936 103751 264109
17205B64109j07404G4108K91800F7746J59665K65740j60509A53482B6816K95252
$$ 264109 156705 74108 365908 67746 227411 493151 332642 153482 26816 322068
17195C22068I1511O4017K30690j85935k9719J17083F5984L74674j51295e2072
$$ 322068 91511 155528 386218 200283 170564 287647 65984 440658 289363 -52072
17184D55944o3383o2823h5605A74942n5708l405L66133j82809g9930A57383K66546
$$ 455944 392561 329738 -85605 174942 119234 115829 481962 299153 -79930 157383 423929
17173D23929A93250o0891J13556E9423O5726c3130p8124B60521N02920C47426
$$ 423929 193250 132359 245915 59423 125149 -33130 -111254 260521 763441 347426
17162b07299B81677o1680r5338K62129j13768L78697A87434F1437K05428p9452
$$ -207299 281677 219997 124659 386788 273020 651717 187434 61437 266865 187413
17152A87413M67645B87013k9543J13678p2514j30340K06518A65299k654P8011
$$ 187413 655058 287013 257470 371148 298634 168294 374812 165299 162645 240656
17142B40656l9424M38328B20968M59882A86936K84431A20796N3974L99264L5808
$$ 240656 201232 639560 220968 680850 186936 471367 120796 174770 574034 609842
17132F09842A66636k0077J07000R0982r4816K90483j37763J05359k05145N5699
$$ 609842 166636 146559 253559 344541 249725 540208 402445 507804 302659 358358
17122C58358j63257K46675k20591J9188J63790j63551N7923L5021K38890j91282
$$ 358358 195101 441776 221185 240373 404163 240612 298535 333556 572446 381164
17112C81164J39967a19445C66313j76218K21145j84392P2342Q2208j1399M5406
$$ 381164 521131 -119445 366313 190095 411240 226848 299190 381398 369999 415405
17102D15405R1045A80178M36500o1163A96923k8651J63020D2889M80687K19759
$$ 415405 506450 180178 616678 555515 196923 168272 331292 42889 523576 743335
17092G43335r6858A44649L80487I2741M05410O3723k78375r710L34740A83298
$$ 743335 646477 144649 525136 92741 498151 561874 283499 273789 608529 183298
17081E04726J96300j74808B43668J36582j0358m7251J21776J51988k97130F119
$$ 504726 701026 526218 243668 380250 369892 322641 444417 596405 299275 6119
17070A87913O4009K56040j51037R6996J52203D0634L00235P316k5985J43499N4722
$$ 187913 251922 507962 356925 453921 606124 40634 340869 348185 322200 465699 520421
17059E20421j0229J05440k17834o4993j3938J49984j6677M8622j48774J54329
$$ 520421 510192 615632 397798 332805 318867 468851 452174 500796 352022 506351
17049E06351O0421K28830C36503Q1763J46156j72046K09036K6986C05178J26600
$$ 506351 566772 795602 336503 418266 564422 392376 601412 628398 305178 431778
17039D31778R4466j31158J47718j02317k08735K13953L00594r8841j13166J24474
$$ 431778 526244 395086 542804 440487 231752 445705 746299 647458 534292 658766
17029F58766j26363K05612J66680j92217B38868N34726B27198K65451A97457N2845
$$ 658766 532403 738015 904695 712478 238868 773594 227198 492649 197457 250302
17019B50302L87495j89589o8901L24030k48893K53341j85997Q6000L6770L68803
$$ 250302 637797 448208 379307 703337 454444 707785 521788 607788 644558 1013361
17009A013361D35103K67706l05778L44864J77968D49055M47097J01223k23744
$$ 1013361 435103 702809 397031 741895 919863 449055 896152 997375 773631
17000G73631B31398N28409j27691Q8342p2778Q4503j63919L8741L35750l63536
$$ 773631 231398 759807 632116 720458 647680 732183 568264 607005 942755 579219
16990E79219n7950K31199o5082J69781k02481J91638J4424K6999O3998m6400J3651
$$ 579219 521269 752468 687386 857167 654686 846324 860748 887747 951745 905345 918996
16979I18996j58740k65987O22038k34025l08131M164M88087k87926L53711m00560
$$ 918996 760256 494269 1116307 882282 574151 578315 1066402 778476 1132187 731627
16969G31627j2745J95476j73140k6105J08302K00716l49319K35169K21293M9508
$$ 731627 718882 914358 741218 715113 823415 1024131 674812 909981 1131274 1180782
16959A180782k34206j38342K14708K7677j87604J84203l13898K81791j38792l3899
$$ 1180782 946576 808234 1022942 1050619 863015 1047218 733320 1015111 876319 842420
16949H42420O4720L02832k45397k86821O23667j49989j91001M00584m4147k48398
$$ 842420 907140 1209972 964575 677754 1301421 1151432 960431 1361015 1316868 1068470
16939A068470J12117P5246j39649J261K7643J79353k0759K97675l49683j8712
$$ 1068470 1180587 1255833 1116184 1117445 1145088 1324441 1303682 1601357 1251674 1232962
16929A232962j27055J06248j50773L16036k15249j25750K92106o216J33088r8835
$$ 1232962 1105907 1212155 1061382 1377418 1162169 1036419 1328525 1322309 1455397 1356562
16919A356562J71191m40312K88333j85519o5071K11176j23643P6716L60967m27242
$$ 1356562 1527753 1087441 1375774 1190255 1125184 1336360 1212717 1289433 1650400 1223158
16909A223158K16216K450o0453k63063N45579o3387p1399K78559j61187p0362
$$ 1223158 1439374 1441824 1381371 1118308 1663887 1600500 1529101 1807660 1646473 1576111
16899A576111J14181j17408J07062j02778m4479J93816n0575J73334r1669R8296
$$ 1576111 1690292 1572884 1679946 1577168 1532689 1726505 1675930 1849264 1757595 1855891
16889A855891l87998K81246j20290J81879N0821k91536M12271k36883L96579k64397
$$ 1855891 1467893 1749139 1628849 1810728 1861549 1570013 1982284 1745401 2141980 1877583
16879A877583k5435Q1708J01939j30282L29998m74982M33071O0778J1511k21293
$$ 1877583 1852148 1933856 2035795 1905513 2235511 1760529 2193600 2254378 2265889 2044596
16869B044596L15811J5505l19722J87472p3395L62832j31879L19900M2856k58992
$$ 2044596 2360407 2375912 2056190 2243662 2170267 2533099 2401220 2721120 2763976 2504984
16859B504984j98233K86260J24895j84022M4271L81863l07080J11526Q8483J00249
$$ 2504984 2306751 2593011 2717906 2533884 2578155 2960018 2652938 2764464 2852947 2953196
16849B953196L0947K2870k8668O5838J23049M1827n7570q2359J92995L54535J13987
$$ 2953196 2984143 3007013 2978345 3044183 3167232 3209059 3151489 3069130 3262125 3616660 3730647
16838C730647r0149o20K39305k49827K40725l44438K3839N24233K80362k16246
$$ 3730647 3640498 3639878 3879183 3629356 3870081 3525643 3549482 4073715 4354077 4137831
16828D137831R0872K2938J01604J58969P1174j11822M1428M79145j95924L74354
$$ 4137831 4228703 4251641 4353245 4512214 4583388 4471566 4512994 4992139 4796215 5170569
16818E170569j69003J63340M4104L61708L3643k7515J17619K41144j20567J02335
$$ 5170569 5001566 5164906 5209010 5570718 5604361 5576846 5694465 5935609 5815042 5917377
16808E917377P8100L98181J80394K24333K33779l90710M68669l38049M19364P00062
$$ 5917377 5995477 6393658 6574052 6798385 7032164 6641454 7110123 6772074 7191438 7891500
16798G891500m2103K68682M2114J01451K05175M06456j22168M77646M11068m5919
$$ 7891500 7849397 8118079 8160193 8261644 8466819 8873275 8751107 9228753 9639821 9593902
16788I593902K65264M05935o4344N46226J3875P19321J80309L20831K73550J47801
$$ 9593902 9859166 10265101 10200757 10746983 10760858 11480179 11660488 11981319 12254869 12402670
16778A2402670Q20102J74152P88872K22556L74747M31334N58361O44858N27918
$$ 12402670 13222772 13396924 14185796 14408352 14783099 15214433 15772794 16417652 16945570
16769A6945570N05696P32237L49100O64624J093842N79555P72915Q46501O90588
$$ 16945570 17451266 18183503 18532603 19197227 20291069 20870624 21643539 22490040 23180628
16760B3180628R92203J156003Q67154J277140J282702Q72338J803607J315010
$$ 23180628 24172831 25328834 26195988 27473128 28755830 29628168 31431775 32746785
16752C2746785J362506J869177J462608J773007K355650J726898K446945K065394
$$ 32746785 34109291 35978468 37441076 39214083 41569733 43296631 45743576 47808970
16744D7808970K649443K872036L084017L238045K974140L978651M006783M143578
$$ 47808970 50458413 53330449 56414466 59652511 62626651 66605302 70612085 74755663
16736G4755663M223449M923232M672864N452787N648335O076568N997407O571724
$$ 74755663 78979112 83902344 88575208 94027995 99676330 105752898 111750305 118322029
16728A18322029O410215O916459O864901O966381O380131N801577N901790N212044
$$ 118322029 124732244 131648703 138513604 145479985 151860116 157661693 163563483 168775527
16720A68775527M381970L073622K029507J195971j87912j351347k422325l784173
$$ 168775527 173157497 176231119 178260626 179456597 179268685 177917338 175495013 171710840
16712A71710840m481358n159232n951155o508658o797637o839983o805798o991997
$$ 171710840 167229482 162070250 156119095 149610437 142812800 135972817 129167019 122175022
16704A22175022o961267o458966o401567n898995n947949n325542m779313m766089
$$ 122175022 115213755 108754789 102353222 96454227 90506278 85180736 80401423 75635334
16696G5635334m270376m288006l713818l404411l663395l186125k653211k936328
$$ 75635334 71364958 67076952 63363134 59958723 56295328 53109203 50455992 47519664
16688D7519664k151602k614546k104355k035050j660713j692302k220079j008676
$$ 47519664 45368062 42753516 40649161 38614111 36953398 35261096 33041017 32032341
16680C2032341j612669j059715j678597j207852r30195j188995q82185j398157
$$ 32032341 30419672 29359957 27681360 26473508 25543313 24354318 23472133 22073976
16672B2073976m22356q83961j027311o37558q99745n09090o97201p98970k35047
$$ 22073976 21651620 20767659 19740348 19102790 18203045 17693955 16996754 16197784 15962737
16663A5962737m14013q77812j46710n25758p95005l14972m39554m76640m14702
$$ 15962737 15548724 14670912 14524202 13998444 13203439 12888467 12448913 11972273 11557571
16654A1557571m60914J61168n69717k76451m512o74282l72507L01307m58295j021417
$$ 11557571 11096657 11257825 10688108 10411657 10407145 9732863 9360356 9661663 9203368 8181951
16644H181951O25096q20404l2181p3059j95048l52019q1610m28927M96408o79757
$$ 8181951 8807047 7986643 7954462 7881403 7686355 7334336 7252726 6823799 7320207 6640450
16634F640450l06833o7338N2781k85088J77148J2154n75119j15421k10435q0279
$$ 6640450 6333617 6266279 6319060 6033972 6211120 6223274 5648155 5532734 5322299 5242020
16624E242020J10855m10597j81497Q6792k99103J96707l51879O6753k70136q4522
$$ 5242020 5352875 4942278 4760781 4847573 4548470 4745177 4393298 4460051 4189915 4105393
16614D105393P5229j13383M8378r8653j74799l3372j9100j29198O2645N5977j76281
$$ 4105393 4180622 4067239 4115617 4016964 3842165 3808793 3789693 3660495 3723140 3779117 3602836
16603C602836n00850K04187l26327L39674L3670l51348J04253o0034l98854J0502
$$ 3602836 3101986 3306173 2979846 3319520 3353190 3001842 3106095 3046061 2647207 2657709
16593B657709L57452l00341J79260l1981r5942j39957L17947m80695R0404k24195
$$ 2657709 3015161 2714820 2894080 2862099 2766157 2626200 2944147 2463452 2553856 2329661
16583B329661K72394k4579j52847j70265j9782p9292J61377k38512L87529j43731
$$ 2329661 2602055 2577476 2424629 2254364 2234582 2155290 2316667 2078155 2465684 2321953
16573B321953J39345k48184j82078K41657l65096J88418k53552l8105k10070L56897
$$ 2321953 2461298 2213114 2031036 2272693 1907597 2096015 1842463 1804358 1594288 1951185
16563A951185L1390O5325l60784K02611p4880l15031M2597J4835o7856K13083
$$ 1951185 1982575 2047900 1687116 1889727 1814847 1499816 1542413 1557248 1489392 1702475
16553A702475J00956l28646K51107m3121k39864l0495p2507L20667l69865p5600
$$ 1702475 1803431 1474785 1725892 1682771 1442907 1412412 1339905 1660572 1290707 1215107
16543A215107J59869j25013J05572J80655j6350o05934L59293l23682N61064n19910
$$ 1215107 1374976 1249963 1355535 1536190 1519840 913906 1273199 949517 1510581 990671
16533I90671o1817K08071m1776l28473K95193K80477j3316j56457l94763N13810
$$ 990671 928854 1136925 1095149 766676 1061869 1342346 1329030 1172573 777810 1291620
16523A291620k09442j43302j83109O2445K01819l70934L74147j1449k36344J39127
$$ 1291620 1082178 938876 755767 818212 1020031 649097 1023244 1011795 775451 914578
16513I14578j52685j88004L19574K96486m6981l03259K7976j73924K28701k25768
$$ 914578 761893 573889 893463 1189949 1142968 839709 867685 693761 922462 696694
16503F96694K29695o8766R0655l20878L36645j57134K14422m00040K36871q6951
$$ 696694 926389 857623 948278 627400 964045 806911 1021333 621293 858164 771213
16493G71213p1348M3065J83304K08117l18337j52837J04342j24017R918k22001
$$ 771213 699865 742930 926234 1134351 816014 663177 767519 643502 653420 431419
16483D31419K48109j32508J54082K34367j65585j15752J5407J62776n974j24945
$$ 431419 679528 547020 701102 935469 769884 654132 669539 832315 826341 701396
16473G01396j74623O9287j02365q0668J46662J50215J29922D12904J02086P708
$$ 701396 526773 596060 493695 413027 559689 709904 839826 412904 514990 522698
16463E22698N3573K49701l51210M08755k8432k39675k04726r2947N8771K11018
$$ 522698 576271 825972 474762 883517 855085 615410 410684 317737 376508 587526
16453E87526O7608R7966j74564A84127J4775M82087o1319q997B85920J17652j30449
$$ 587526 655134 753100 578536 184127 198902 680989 619670 610673 285920 403572 273123
16442B73123J97644J12187k62814K0136K24210J9368j12131J24545B89052P7215
$$ 273123 470767 582954 320140 340276 564486 583854 471723 596268 289052 366267
16432C66267R544J74307m9217j05472L8000k7029L4824K12030j61358q6175J0479
$$ 366267 375811 550118 500901 395429 433429 406400 441224 653254 491896 405721 416200
16421D16200p9001L7383N7379j74372J3107F2687M28185l2241N3597j18108N2528
$$ 416200 337199 374582 431961 257589 270696 62687 490872 458631 512228 394120 446648
16410D46648D0417O16027E1909J71881K01709Q8549l0556n7839j47662J69314
$$ 446648 40417 656444 51909 223790 425499 514048 483492 425653 277991 447305
16400D47305n9618K80136B34945L70111k50558r7644a31370D65390A89923Q534
$$ 447305 387687 667823 234945 605056 354498 256854 -131370 465390 189923 198457
16390A98457K27992A11837K49834j35279K51992A59868L5379K23546M6556j57630
$$ 198457 426449 111837 361671 226392 478384 159868 195247 418793 465349 307719
16380C07719o8518J15845M1291j25182J83397o2958j41376Q2688q9432j19974
$$ 307719 239201 355046 396337 271155 454552 391594 250218 332906 243474 123500
16370A23500K29628E9724a7195F4769M8350R9441D2557K31848L3846m5296K08596
$$ 123500 353128 59724 -17195 64769 113119 212560 42557 274405 308251 262955 471551
16359D71551j90262r3880r3014J18147J07436j59267K50949A34405Q4751q3945
$$ 471551 281289 187409 94395 212542 319978 160711 411660 134405 219156 135211
16349A35211D9417J17343m3481J29999J6945M8862J25910g070B62275a10996A11013
$$ 135211 49417 166760 123279 253278 270223 319085 444995 -7070 262275 -110996 111013
16337A36244i1051A34655m5036a1402j9045C84948j29247K9377j6104F3817b370
$$ 136244 -91051 134655 89619 -11402 -30447 384948 255701 285078 268974 63817 -2370
16325B56913J50250E4799n715K00219a4430o0421a4245A79754l1245K01937e9825
$$ 256913 407163 54799 49084 249303 -14430 -74851 -14245 179754 148509 350446 -59825
16313F5230N3318B7031K16020A13079d4167j617D42805j89963a57390D27291A37781
$$ 65230 118548 27031 243051 113079 -44167 -45784 442805 252842 -157390 427291 137781
16301A8872K52827j16180K6047D3285a38734f4337j16157C68181j35708m4353
$$ 18872 271699 155519 181566 43285 -138734 -64337 -180494 368181 232473 188120
16291A88120P224J34670A27456O3029J37174A43547o4206I653M62994j68502B0199
$$ 188120 195344 330014 127456 190485 327659 143547 79341 9653 472647 304145 20199
16279B79887I8934i6782D28085A258K37092K3925A28981n9829P3949l9780M1086
$$ 279887 98934 -96782 428085 1258 238350 262275 128981 69152 143101 103321 144407
16268A44407n4673j4663N0647N8897p2903m1000a2312j17842C04266A24944a20254
$$ 144407 89734 75071 125718 184615 111712 70712 -12312 -130154 304266 124944 -120254
16256E3174L23420d9967q5259D7663K19061c07330A66082j2939F4921J47062d1465
$$ 53174 376594 -49967 -135226 47663 266724 -307330 166082 153143 64921 211983 -41465
16244a7390A57378a1029B84155a29291A24511J00090c71950k2600D43498g4400
$$ -17390 157378 -11029 284155 -129291 124511 224601 -371950 -394550 443498 -74400
16233B30662a4732B507J8589M910b30519B33517R551a52254c2392q7366H2344
$$ 230662 -14732 2507 21096 26006 -230519 233517 243068 -152254 -32392 -119758 82344
16221C9100K80847A11992L3513J59403A11526c7110A0709J65048D9325O1855K32137
$$ 39100 319947 111992 145505 304908 111526 -37110 10709 175757 49325 111180 343317
16210C43317A16561b9159A51504F7471K0865a82958R0612j23560k76745A88096
$$ 343317 116561 -29159 151504 67471 88336 -182958 -92346 -215906 -492651 188096
16199E7804b50833A17739L06306A15139a90972F2382g8696o1096F2134a00401
$$ 57804 -250833 117739 424045 115139 -190972 62382 -78696 -139792 62134 -100401
16188B69921i5999g108j95590E8227a49325B1201J4878b56594a01676E0787j4494
$$ 269921 -95999 -7108 -202698 58227 -149325 21201 36079 -256594 -101676 50787 36293
16177C6293K62215a41453k86175C60355i7473m5244C0226J9940f5370r0663F376
$$ 36293 298508 -141453 -427628 360355 -97473 -142717 30226 50166 -65370 -156033 6376
16165A86756j131b6251A37866b9283C25599g8186A19184C5206d5035j25903d9617
$$ 186756 185625 -26251 137866 -29283 325599 -78186 119184 35206 -45035 -170938 -49617
16153A62710a13743H735i848q9504j53363H3116b79148B14973h076C5158K0782
$$ 162710 -113743 8735 -9848 -99352 -252715 83116 -279148 214973 -8076 35158 55940
16142E5940Q7928a15010c9970L714a4840A4645a79204C9432P2610K88597A32131
$$ 55940 143868 -115010 -39970 -36256 -14840 14645 -179204 39432 112042 400639 132131
16130A18880K603d7446A42676e4865B97079A01945K37178A11595A3501J20313
$$ 118880 121483 -47446 142676 -54865 297079 101945 339123 111595 13501 133814
16120A33814C0961a89698A60693c43804J66615j0581A05097M797a32087G2078
$$ 133814 30961 -189698 160693 -343804 -177189 -187770 105097 109894 -132087 72078
16109i8681C2226c2352j47951M6015B4446L08508J5046E5667b3315A63040q236
$$ -98681 32226 -32352 -180303 -134288 24446 332954 348000 55667 -23315 163040 154804
16098A54804a96022B08329O0383a52752a9330j47609g8236B46048G6314a82479
$$ 154804 -196022 208329 268712 -152752 -19330 -166939 -78236 246048 76314 -182479
16087a858k87729a16831Q759A37831a23649A25436l6112J31315K2919h8344j93876
$$ -1858 -289587 -116831 -108072 137831 -123649 125436 89324 220639 243558 -88344 -282220
16076b82220d7780C82791c1581j6784B98004B6313a71287j83076a07022N2440
$$ -282220 -47780 382791 -31581 -48365 298004 26313 -171287 -354363 -107022 -54582
16066e4582A67535A2164L13999j8659j35978D2814J0429d8408C82484a16794M9265
$$ -54582 167535 12164 326163 307504 171526 42814 53243 -48408 382484 -116794 -67529
16055f7529A06710b16719B57466c1488i505j98359E3436N8531b51354A52417b97070
$$ -67529 106710 -216719 257466 -31488 -9505 -207864 53436 111967 -251354 152417 -297070
16043a10116H7702J92716c12650a19377C6290J6474b48A97578c8863o006q257
$$ -110116 87702 280418 -312650 -119377 36290 52764 -248 197578 -38863 -44869 -53126
16032e3126q3368B3306M4288a35737B6542K12561r6689N9468b83921B13117B5974
$$ -53126 -136494 23306 67594 -135737 26542 239103 142414 201882 -283921 213117 25974
16020b47680O244A46114a10452A07625e542B15493a06007A43442b99700L5187
$$ -247680 -241436 146114 -110452 107625 -5542 215493 -106007 143442 -299700 -264513
16010b64513J32246O3133l60383a47269l25695a24941j62771R5104O4800C32426
$$ -264513 -132267 -69134 -429517 -147269 -472964 -124941 -287712 -192608 -127808 332426
15999a16210J6404B79001g7752C16204a86350M4323j3517A26236b08083R9668
$$ -116210 -99806 279001 -77752 316204 -186350 -142027 -155544 126236 -208083 -108415
15989a08415j32153A1651h1246I4925J19813H5898M56193j02719j69172K59999
$$ -108415 -240568 11651 -81246 94925 214738 85898 542091 439372 270200 530199
15979E30199A21175K33016N5765A91015D0630k0073a28043l1941A9384J12423
$$ 530199 121175 354191 409956 191015 40630 20557 -128043 -159984 19384 131807
15969A31807G177K13233j04607L1464Q0117C5153L329b65621C4369J33166a99654
$$ 131807 7177 220410 115803 147267 227384 35153 38482 -265621 34369 167535 -199654
15957a14723L1096k45162b2459n2664o6808n7075O5703d5966n8012k33909H5763
$$ -114723 -83627 -328789 -22459 -75123 -141931 -199006 -133303 -45966 -103978 -337887 85763
15945A10661a47007A71060e0402k87961a34171A7830b44167C99473B9919N2671
$$ 110661 -147007 171060 -50402 -338363 -134171 17830 -244167 399473 29919 82590
15935H2590K6077b56423g0821A46491C2578a8449A07179m0736A3549g9661j27868
$$ 82590 108667 -256423 -70821 146491 32578 -18449 107179 66443 13549 -79661 -207529
15924b07529a6628j8866A91108F2756R3575m9254h8385m2125H9252J74647F2618
$$ -207529 -16628 -35494 191108 62756 156331 107077 -88385 -130510 89252 263899 62618
15912c45754c685k1954A94695m1548J50174c80460g1931I3557A4641d8287B19292
$$ -345754 -3685 -25639 194695 153147 303321 -380460 -71931 93557 14641 -48287 219292
15900D4704a23193D0281c84863M183b2336E0697h4850A29797L9884A8322R2990
$$ 44704 -123193 40281 -384863 -380680 -22336 50697 -84850 129797 169681 18322 111312
15889A11312a38197A38979c07379i8702F3405L4922e9056C42273p6276A0970i4879
$$ 111312 -138197 138979 -307379 -98702 63405 98327 -59056 342273 265997 10970 -94879
15877a70801j27152a43719A54129b31251j42352Q89J30710A3879b70045b109j2157
$$ -170801 -297953 -143719 154129 -231251 -373603 -372714 -242004 13879 -270045 -2109 -14266
15866a4266C08964b31194C8978J58194N5091a50372c0910l10277C6674h7164j28583
$$ -14266 308964 -231194 38978 197172 252263 -150372 -30910 -341187 36674 -87164 -215747
15855b15747A18492a58709A0575d78484b00925L1291A44397a8214r8113j99544
$$ -215747 118492 -158709 10575 -478484 -200925 -169634 144397 -18214 -116327 -315871
15845c15871K8185g2839b9611l26931B58032c72516P7821Q4836e6462q9847A5749
$$ -315871 -287686 -72839 -29611 -356542 258032 -372516 -294695 -209859 -56462 -146309 15749
15833A23525a71908f6295D0005J79137b84041C39489b01506r3468a46265k3686
$$ 123525 -171908 -66295 40005 219142 -284041 339489 -201506 -294974 -146265 -169951
15823a69951K3112H6617J79680b3467q0450b8506j76738k05601e9218A85708m7098
$$ -169951 -146839 86617 266297 -23467 -103917 -28506 -205244 -410845 -59218 185708 138610
15812A38610a54807A30194m1624k2202a09152B02924r2192A1182K9992J1579f2354
$$ 138610 -154807 130194 88570 66368 -109152 202924 110732 11182 41174 52753 -62354
15800A7523O1342g4679j12909C6968g3494A42573c7162g716B3656b55549C6743
$$ 17523 78865 -74679 -187588 36968 -73494 142573 -37162 -7716 23656 -255549 36743
15788A4123K63177I428b34806B44628D0317K04101G3499a77143K2299B68663d8904
$$ 14123 277300 9428 -234806 244628 40317 244418 73499 -177143 -154844 268663 -48904
15776b40017c4997k25315a29567c3645I487b7450I9970J56909D5332c0146a1109
$$ -240017 -34997 -260312 -129567 -33645 9487 -27450 99970 256879 45332 -30146 -11109
15764C6517J49499C4328J6015b16680D333a60478B7560b14871E4109L7055f5053
$$ 36517 186016 34328 50343 -216680 4333 -160478 27560 -214871 54109 91164 -65053
15752A68136a55367j23741M5431Q0281b0657A4403L5264k4297K58738G5664K67372
$$ 168136 -155367 -279108 -233677 -153396 -20657 14403 49667 25370 284108 75664 343036
15741C43036E8482L2514c08641B8512i0030j93367G6651l6512f3381j00872G8985
$$ 343036 58482 90996 -308641 28512 -90030 -283397 76651 40139 -63381 -164253 78985
15729F7774a08380C0401A4095L0136A4757M05716c49987J38592Q7242K9514k20103
$$ 67774 -108380 30401 14095 44231 14757 420473 -349987 -211395 -124153 -94639 -314742
15718c14742m8829B06934n9162h498k82028C213N3912e1532n9967j24564B3806
$$ -314742 -363571 206934 147772 -8498 -290526 3213 57125 -51532 -111499 -236063 23806
15706D8674L95833a25288A23254K4163a05405j7237J1167m3841q3311B11446A717
$$ 48674 444507 -125288 123254 147417 -105405 -122642 -111475 -155316 -238627 211446 1717
15694A46673J42399b5515A72773D0448a69627F7237M61l3200J16810h0319k280
$$ 146673 289072 -25515 172773 40448 -169627 67237 67698 34498 151308 -80319 -82599
15683h2599I1193a64365D1941a33092A62632d15884D23540B0b9446B41718h1375
$$ -82599 91193 -164365 41941 -133092 162632 -415884 423540 20 -29446 241718 -81375
15671d94549B50059r1761b2737D09707b1325C1665a06766c8222a3818B53767j07168
$$ -494549 250059 158298 -22737 409707 -21325 31665 -106766 -38222 -13818 253767 146599
15660A46599c8019j47514g8891j18590q4657a3354l0464P983o9987G778a31359
$$ 146599 -38019 -185533 -78891 -197481 -282138 -13354 -43818 -35835 -105822 7778 -131359
15648A89633a03524j33882K5753A09512c0033n1784A02165a80966j1682C74914
$$ 189633 -103524 -237406 -211653 109512 -30033 -81817 102165 -180966 -192648 374914
15637a17066B0036f0258k21026F9634e5693j21223b1248B87405r7528j9979C989
$$ -117066 20036 -60258 -281284 69634 -55693 -176916 -21248 287405 189877 169898 3989
15625a37257B01770H9491B8946b7274k5099A36756o2186a8961r1679e3465C9208
$$ -137257 201770 89491 28946 -27274 -52373 136756 74570 -18961 -110640 -53465 39208
15613a64544I4150b83122R2678A08802d080B02051D6146c1206j02716A53347E5130
$$ -164544 94150 -283122 -190444 108802 -4080 202051 46146 -31206 -133922 153347 55130
15601f7363k244n1008I9515a3589I8012a77179f2648j51736A4728a6146o9186
$$ -67363 -69607 -120615 99515 -13589 98012 -177179 -62648 -214384 14728 -16146 -85332
15590h5332C4733h5350j21990B56796n0753a48670A17667B474b78817r6394E0517
$$ -85332 34733 -85350 -207340 256796 206043 -148670 117667 2474 -278817 -375211 50517
15578a15902n2584d1628F0046d8678I0983a85693C8195b63936d8755a7641o711
$$ -115902 -168486 -41628 60046 -48678 90983 -185693 38195 -263936 -48755 -17641 -24352
15567b4352j20772A18396c16A39799a95792c7946A68130a54310A43817n5708b3617
$$ -24352 -145124 118396 -316 139799 -195792 -37946 168130 -154310 143817 88109 -23617
15555G6132g8069j44354a0978A4956J11181i5339M3296B04467b95532c5196A58804
$$ 76132 -78069 -222423 -10978 14956 126137 -95339 -52043 204467 -295532 -35196 158804
15543B55579G3695j6376a02478E0489J24097e6128a2938A33672a64053K6530b5179
$$ 255579 73695 57319 -102478 50489 174586 -56128 -12938 133672 -164053 -137523 -25179
15531e9818J384K405A54002G4570a97763H6293c1420j32683k05014A67773i3106
$$ -59818 -58434 -56029 154002 74570 -197763 86293 -31420 -164103 -369117 167773 -93106
15519c2338k05192A44523N7317A8819Q1856a63494B03094B104c1518p09q323C6865
$$ -32338 -237530 144523 201840 18819 100675 -163494 203094 2104 -31518 -32227 -40550 36865
15506a34005D6426J49230m9422a52633A29138D6708b6082B36772l9807a75145
$$ -134005 46426 195656 146234 -152633 129138 46708 -26082 236772 196965 -175145
15495A5388L7221g9223A9043b0088j66058l3964A33182L2023a15706a469j40198
$$ 15388 52609 -79223 19043 -20088 -186146 -220110 133182 165205 -115706 -1469 -141667
15484a41667G5208f0652j63858N348C08795J59928B15309b93184a27263B29484
$$ -141667 75208 -60652 -224510 -219162 308795 468723 215309 -293184 -127263 229484
15473A22382g0077n1072j82525J45880A5301a47413A30608a11801d5187k34514
$$ 122382 -70077 -121149 -303674 -157794 15301 -147413 130608 -111801 -45187 -279701
15463b79701B89102e9581C4440J53538a29811O1788j11676f7147j47297c2121
$$ -279701 289102 -59581 34440 187978 -129811 -68023 -179699 -67147 -214444 -32121
15452B16371Q6645A21728J40481Q5041h0225A06952D1585j7945J58498e02007
$$ 216371 303016 121728 262209 347250 -80225 106952 41585 23640 182138 -502007
15441A5435K65148i4834C86960G121d6741j66453a6638p8382k36829A27762k8103
$$ 15435 280583 -94834 386960 7121 -46741 -213194 -16638 -95020 -331849 127762 99659
15430I9659d3926j58657b8466j06940D5859a03487l2850J3388l5464A99216Q633
$$ 99659 -43926 -202583 -28466 -135406 45859 -103487 -136337 -122949 -158413 199216 207849
15419B07849k2923b26921J08676M3838q306p1497d2606j71812A9374c8098C279
$$ 207849 184926 -226921 -118245 -74407 -82713 -154210 -42606 -214418 19374 -38098 3279
15407a59426B87069b789C7045b85811M6095R0096N9064A61025b28493j22119A26410
$$ -159426 287069 -2789 37045 -285811 -239716 -149620 -90556 161025 -228493 -350612 126410
15395B67529B5990g4715A63297N8461a40587G5416a34745N9478H4631h3863g33
$$ 267529 25990 -74715 163297 221758 -140587 75416 -134745 -75267 84631 -83863 -733
15383b971G5775K62540C9506H047P216d50993A86640C2517g1444o7047N2846A16148
$$ -2971 75775 338315 39506 8047 15263 -450993 186640 32517 -71444 -138491 -85645 116148
15370a15283B49009q5267h7614A10085b40326N2381D35535n6777j83876b75098
$$ -115283 249009 163742 -87614 110085 -240326 -187945 435535 378758 194882 -275098
15359H8373O5574k0331a26258A51972d2868j269A41445e2520A34529k1926C6907
$$ 88373 153947 133616 -126258 151972 -42868 -44137 141445 -52520 134529 112603 36907
15347A70403F263J04284c55035a38463G2879k0604i6922A16916J14590r1456O8460
$$ 170403 6263 110547 -355035 -138463 72879 52275 -96922 116916 231506 140050 208510
15336B08510a68319M0907j55348B69648a47319C27492a44590e7103k00506A8599
$$ 208510 -168319 -127412 -282760 269648 -147319 327492 -144590 -57103 -257609 18599
15325g4177A16608i1953A478b11955r7506A8972J66844d6989Q792B38386o6328
$$ -74177 116608 -91953 1478 -211955 -309461 18972 185816 -46989 -38197 238386 172058
15314A72058a7908A10568L8483a49673A14770N7876o7256K01980a77136A58784
$$ 172058 -17908 110568 149051 -149673 114770 172646 105390 307370 -177136 158784
15303A45166K46848a78443f7513A44996d2795B10155N6989C9502h041k1150E1986
$$ 145166 392014 -178443 -67513 144996 -42795 210155 267144 39502 -8041 -29191 51986
15291D7201g0775A78669a1219G1528J10857D1911K88011e0436Q738C81792F760
$$ 47201 -70775 178669 -11219 71528 182385 41911 329922 -50436 -41698 381792 6760
15279A56142K83576a8073B5095a22826a5469E8775c4317B18459b5552q3370A62664
$$ 156142 439718 -18073 25095 -122826 -15469 58775 -34317 218459 -25552 -108922 162664
15267b09284i1568o7888A2526J29071D1966K91328A5578P2927R2123A1302a17979
$$ -209284 -91568 -159456 12526 141597 41966 333294 15578 88505 180628 11302 -117979
15255A37174b76165a27914A90274k2602m5265d04127B90557A15838Q89655M82035
$$ 137174 -276165 -127914 190274 167672 122407 -404127 290557 115838 1005493 1487528
15245A487528q9908j99139M30450E99933A98735g6449E48529b005j96393C35824
$$ 1487528 1397620 1198481 1628931 599933 198735 -76449 548529 -2005 -198398 335824
15234D04771e2336A75551K12524A91142C0521K39089c5816A22977b42390c1243
$$ 404771 -52336 175551 388075 191142 30521 269610 -35816 122977 -242390 -31243
15223A76196b85122A51145a33125A91095f7191C026O9662J31162E5694i9003B40715
$$ 176196 -285122 151145 -133125 191095 -67191 3026 72688 203850 55694 -99003 240715
15211H4489a38280C87492N9823A50876o7212a24691C80544b03725A51622h4938
$$ 84489 -138280 387492 447315 150876 83664 -124691 380544 -203725 151622 -84938
15200A58989K03738j50608a52881A03991P3625a47688k041P4574K6724P162B4422
$$ 158989 362727 212119 -152881 103991 177616 -147688 -149729 -75155 -48431 -41269 24422
15188b37443R7145D4829h8039H7627K3155d7618j12855A66581a12088A31228P2751
$$ -237443 -140298 44829 -88039 87627 110782 -47618 -160473 166581 -112088 131228 203979
15177B03979h3471j0798a3110d716B60254D7669a40714C97642a17976D854c3959
$$ 203979 -83471 -94269 -13110 -4716 260254 47669 -140714 397642 -117976 4854 -33959
15165B12775n0048a17685R916d1142H760a05038H3000c63764B94411d2852j08944
$$ 212775 162727 -117685 -107769 -41142 8760 -105038 83000 -363764 294411 -42852 -151796
15154a51796A47887c73k3186G6965K50401F3579N3588K62992B0443c9304k76984
$$ -151796 147887 -373 -23559 76965 327366 63579 117167 380159 20443 -39304 -316288
15143c16288a09951A21624b15962O1632N5548A07971a47197P2707j59836f9489
$$ -316288 -109951 121624 -215962 -154330 -98782 107971 -147197 -74490 -234326 -69489
15132g1753A74657H7020L77334j64342b22183A52505R7390a2631B1139K34215
$$ -71753 174657 87020 464354 300012 -222183 152505 249895 -12631 21139 255354
15122B55354A956K14149J04192j41203R5677A01089R103R4477e7233b4779C61903
$$ 255354 1956 216105 320297 179094 274771 101089 110192 204669 -57233 -24779 361903
15110C61843L6036a29488A96184G8266a37694A45995K08724B812K0867i4843H7095
$$ 361843 397879 -129488 196184 78266 -137694 145995 354719 2812 23679 -94843 87095
15098C09337F1457K04607A25135K09965A14327b4571A65250d8807C27643A8378
$$ 309337 61457 266064 125135 335100 114327 -24571 165250 -48807 327643 18378
15087B60481A20370A3887L14098R9838j80242a07496B6226J74638H152K2124J41750
$$ 260481 120370 13887 327985 427823 247581 -107496 26226 200864 8152 30276 172026
15076A72026o1693a53995g0354A83471c86280A91746D7581J70744J75402j13107
$$ 172026 110333 -153995 -70354 183471 -386280 191746 47581 218325 393727 280620
15066B80620I810f0835A75402m9866L787L65141I53R5991a99393B0181M9251a49300
$$ 280620 9810 -60835 175402 125536 129323 494464 953 96944 -199393 20181 69432 -149300
15053D5307K36466l3960n539b17748G3383l4359h9132H3220g8531D63034I4944
$$ 45307 281773 247813 242274 -217748 73383 39024 -89132 83220 -78531 463034 94944
15041A71352b36142B16276K01994i9793B40242F7408J31458J28510a92279a0657
$$ 171352 -236142 216276 418270 -99793 240242 67408 198866 327376 -192279 -10657
15030B19811l0402n2024L04580j64069E3851J50536P2154J24112m7244l3287n2820
$$ 219811 189409 137385 441965 277896 53851 204387 276541 400653 353409 320122 267302
15019B67302q7003J71056n7173q8618J00304a59872F2902b8233C84840H2773M16421
$$ 267302 180299 351355 294182 205564 305868 -159872 62902 -28233 384840 82773 499194
15008D99194b98445h1615C77214G1823J45458a41950C42262H7118k5092M8069
$$ 499194 -298445 -81615 377214 71823 217281 -141950 342262 87118 62026 110095
14998A10095c0953A54941J75729j24577c2944H58J87434a06059C21449e2250C45767
$$ 110095 -30953 154941 330670 206093 -32944 858 188292 -106059 321449 -52250 345767
14986A97887K61605A0212K30722J63211O4623N934k5459A66343J92896r4231a25930
$$ 197887 459492 10212 240934 404145 468768 474702 449243 166343 359239 265008 -125930
14974I9651R3979a35936e5529B25411R9489g4443B22276p3839J74012A46012L4864
$$ 99651 193630 -135936 -55529 225411 324900 -74443 222276 148437 322449 146012 180876
14963A80876a87463a0658H1860G649K65043a47608A17895K32858J58064E0134
$$ 180876 -187463 -10658 81860 7649 272692 -147608 117895 350753 508817 50134
14952A25568J66484A42789e5515A98525N287J90345I4915M6500L69552l0923A26016
$$ 125568 292052 142789 -55515 198525 203812 394157 94915 141415 510967 480044 126016
14940E9417c58B9058M98166H8802J08111o7972J36306j19322a15054B97063n2440
$$ 59417 -358 29058 527224 88802 196913 128941 265247 145925 -115054 297063 244623
14929B44623i9471A80192N17413k41444F8280M27319A82042K14241b58130g7392
$$ 244623 -99471 180192 697605 456161 68280 495599 182042 396283 -258130 -77392
14918A40049D4884L7860L07738C0007J43961p2581C6331K61084J76374j80709
$$ 140049 44884 82744 390482 30007 173968 101387 36331 297415 473789 293080
14908B93080e1202B74406R8071A23321J79325j47971N1144K12682j64615q7485
$$ 293080 -51202 274406 372477 123321 302646 154675 205819 418501 253886 166401
14898A66401J84634j31341L0915J53307A30421i9853C61609g1974C56419j28129
$$ 166401 351035 219694 250609 403916 130421 -99853 361609 -71974 356419 228290
14888B28290K302R7929l8390O8775A47751J7621J04117p7500O3948M35947A44408
$$ 228290 230592 328521 290131 358906 147751 165372 269489 191989 255937 691884 144408
14876D20459j82908J9181K34759j84565N4918l6784J32414j61730L792O0108A23346
$$ 420459 237551 256732 491491 306926 361844 325060 457474 295744 299536 359644 123346
14864C10560p7149a60391D15223l5278j57897Q9031J22531A38883K45800n6922
$$ 310560 233411 -160391 415223 379945 222048 311079 433610 138883 384683 327761
14854C27761O1128j47217J35145C1339L08395A25230M26296B44608L86193B53360
$$ 327761 388889 241672 376817 31339 339734 125230 551526 244608 630801 253360
14843D58089j10539N3236J69357k81926P7307j22050L53324m1643A28204J04661
$$ 458089 347550 400786 570143 288217 365524 243474 596798 555155 128204 232865
14833B32865N6564M03357B72685N7539j15387M96718l22190A38362J54381J40151
$$ 232865 289429 692786 272685 330224 214837 711555 389365 138362 292743 432894
14823D32894j65698N3647K53808k07547J72447k37383P5951J15752r638N136k1408
$$ 432894 267196 320843 574651 367104 539551 302168 378119 493871 484233 489369 467961
14812D67961B01626J31591j0722A16035J33230J87330j37263K77926j02896r0023
$$ 467961 201626 333217 322495 116035 249265 436595 299332 577258 474362 384339
14802C84339K74462k39938J52114p5881O1654q3592B23483J28063K46671j34941
$$ 384339 658801 418863 570977 495096 556750 473158 223483 351546 598217 463276
14792D63276K7919q8416j38351J55929j18055O813K27613j18620R0332p9780J39520
$$ 463276 491195 402779 264428 420357 302302 309115 536728 418108 508440 428660 568180
14781E68180B25593K79207l8349j64769O5838K79127j23564L06733C36022N1299
$$ 568180 225593 504800 466451 301682 367520 646647 523083 829816 336022 387321
14771C87321K87350p2237B98174L68210k90859L16217m5804B98637L51741p1002
$$ 387321 674671 602434 298174 666384 375525 691742 645938 298637 650378 579376
14761E79376M01441l42329r3420j47292m025M82142C69607J06095K46340k54883
$$ 579376 980817 638488 545068 397776 393751 875893 369607 475702 722042 467159
14751D67159L1451K94083j36983l5167M7951j04429P7856j86449L59405k91874
$$ 467159 498610 792693 655710 620543 668494 564065 641921 455472 814877 523003
14741E23003P1289J21980j24879N818J11185j59972n6193M12313k67500n7411
$$ 523003 594292 716272 591393 597211 708396 548424 492231 904544 637044 579633
14731E79633J35185k36028K39742k18539Q7598p2624K966K04191K75772k48893
$$ 579633 714818 478790 718532 499993 587591 514967 517933 722124 997896 749003
14721G49003K4028K26121l80923L42850k63726l74r3428J85506l30600j04005
$$ 749003 773031 999152 618229 961079 697353 696979 603551 789057 458457 354452
14711C54452L75251J14421j30058j70143J68692J99703l36223j2217K1858K36620
$$ 354452 729703 844124 714066 543923 712615 912318 576095 563878 585736 822356
14701H22356k12238J34941J25631m7029p50l50523L0183K08623O4751j10783L61852
$$ 822356 610118 745059 870690 823661 822911 472388 502571 711194 775945 665162 1027014
14690A027014o5348m25684L04865k40098O9255J39080J90021Q4914k55690j7837
$$ 1027014 961666 535982 840847 600749 670004 809084 999105 1084019 828329 810492
14680H10492l8372m7093j10967O41457m68057k3807n5365R8375J15132n2131R8318
$$ 810492 772120 725027 614060 1255517 787460 763653 708288 806663 921795 869664 967982
14669I67982J9196l8498M1445k26596L10176m23557J58407r5099j55704J98837
$$ 967982 987178 948680 990125 763529 1073705 650148 808555 713456 557752 756589
14659G56589J5459Q298K63698j33212N2758j56627R6545J71842j82097J01804
$$ 756589 772048 780346 1044044 910832 963590 806963 903508 1075350 893253 995057
14649I95057k53553p1085L92481m7635k1749k09111J45821J73334j15233j60201
$$ 995057 741504 670419 1062900 1015265 993516 784405 930226 1103560 988327 828126
14639H28126K07456l57j08466j2782j64314M31932l5382j86277P6886J97750k33292
$$ 828126 1035582 1035225 926759 913977 749663 1181595 1146213 959936 1036822 1234572 1001280
14628A001280j7831l175L56151k59810L2308K22332k70441P4112J54670j32994
$$ 1001280 983449 980274 1336425 1076615 1108923 1331255 1060814 1134926 1289596 1156602
14618A156602J98366p5812J69386M0463j02982k79549O2082J20093j04642l31939
$$ 1156602 1354968 1279156 1448542 1489005 1386023 1106474 1168556 1288649 1184007 852068
14608H52068L90676m4551j08999J27261N2554J8791K20323k10125J68001j84172
$$ 852068 1242744 1198193 1089194 1216455 1269009 1287800 1508123 1297998 1465999 1281827
14598A281827M1345K21505j2200k5752k13693m7967J01439J75378m5018K67371
$$ 1281827 1323172 1544677 1532477 1506725 1293032 1245065 1346504 1521882 1476864 1744235
14588A744235j73530j63731N7893P6754L02362p4902m219K9959j5538k82613M17802
$$ 1744235 1570705 1406974 1464867 1541621 1843983 1769081 1764862 1794821 1779283 1496670 1914472
14577A914472j78902o4177Q6848N780l44176M41133j46124N2451m35437M90636
$$ 1914472 1735570 1671393 1758241 1764021 1419845 1860978 1714854 1767305 1331868 1822504
14567A822504L99941j47548R9692K2827L2008J26766m2456m30214M34563m9800
$$ 1822504 2222445 2074897 2174589 2197416 2229424 2356190 2313734 1883520 2318083 2268283
14557B268283J44348N86594k68425O4482O14452J91429K68595J103747J934539
$$ 2268283 2412631 2999225 2730800 2795282 3409734 3601163 3869758 4973505 6908044
14548F908044L757605Q961052J4924503J1247411A9018200G573314j707487j735341
$$ 6908044 10665649 19626701 34551204 45798615 19018200 7573314 5865827 4130486
14540D130486j793555o36509k18050J97116J29498n0681q5992n7270J5903M38038
$$ 4130486 2336931 1700422 1482372 1679488 1808986 1758305 1672313 1615043 1630946 2068984
14530B068984l39123O9884k65023L23524K9224J66868j67761K91943L20547m06112
$$ 2068984 1729861 1799745 1534722 1858246 1887470 2054338 1886577 2178520 2499067 2092955
14520B092955J62572J56342m26537L73085k25148K11668m06541N49728m69690
$$ 2092955 2255527 2411869 1985332 2358417 2133269 2344937 1938396 2488124 2018434
14511B018434M35483n4450j18237J19152J24011M1200j72119o6855j7601K51597
$$ 2018434 2453917 2399467 2281230 2400382 2524393 2565593 2393474 2326619 2309018 2560615
14501B560615k31224M64392k04728l44839M45620J55809J14996m33406M33685
$$ 2560615 2329391 2793783 2589055 2244216 2689836 2845645 2960641 2527235 2960920
14492B960920K354j40740L14556n25534N71719J18249k67273j1535K60812K1743
$$ 2960920 2963274 2822534 3137090 2611556 3183275 3301524 3034251 3022716 3283528 3305271
14482C305271o2010N65038n36060j5291k57018M90835J61124l5548q7343m7209
$$ 3305271 3243261 3808299 3272239 3256948 2999930 3490765 3651889 3616341 3528998 3481789
14472C481789k4219l2249K74874j67371L40057n5959k71085K86369K17185k30405
$$ 3481789 3457570 3425321 3700195 3532824 3872881 3816922 3545837 3832206 4049391 3818986
14462C818986p5763M46169j76925p827L84608k79542r4995J79578K61890J93293
$$ 3818986 3743223 4189392 4012467 4004640 4389248 4109706 4014711 4194289 4456179 4649472
14452D649472j6148l04629K09365J00171J12922J56089q2078L0160M004K1486
$$ 4649472 4633324 4328695 4538060 4638231 4751153 4907242 4825164 4855324 4859328 4880814
14442D880814k79037N53848O2362K56506k98759J74507M9500l2141K25359l3158
$$ 4880814 4601777 5155625 5217987 5474493 5175734 5350241 5399741 5367600 5592959 5559801
14432E559801J96375K80510j72555o5128N73286m73385M83317M6035l945k09734
$$ 5559801 5756176 6036686 5864131 5799003 6372289 5898904 6382221 6428256 6424311 6214577
14422F214577N08191j35757M935N27711j77762l2807k2806M20487J72847j48374
$$ 6214577 6722768 6587011 6591946 7119657 6941895 6909088 6886282 7306769 7479616 7331242
14412G331242M60861n4723k23560M44545N3001J77679J1975J55473M1910j9851
$$ 7331242 7792103 7737380 7513820 7958365 8011366 8189045 8201020 8356493 8398403 8378552
14402H378552L90745J3959J71845J53070K95403l69144N51869J01317R0182J99339
$$ 8378552 8769297 8783256 8955101 9108171 9403574 9034430 9586299 9687616 9777798 9977137
14392I977137L32515R624K14807K40205O4444N3862N05459N8888K32155o1150
$$ 9977137 10309652 10319276 10534083 10774288 10838732 10892594 11398053 11456941 11689096 11627946
14382A1627946O97672J07245J87026L77340k17475O04097j6391J29087O96707
$$ 11627946 12325618 12432863 12619889 12997229 12779754 13383851 13367460 13496547 14193254
14373A4193254J36399K64098K98465M11014J25552O23481J84443L02550L7820
$$ 14193254 14329653 14593751 14892216 15303230 15428782 16052263 16236706 16539256 16577076
14364A6577076Q83778K14802K58177M15998O08319K88317K27222M27798O15144
$$ 16577076 17460854 17675656 17933833 18349831 18958150 19246467 19473689 19901487 20516631
14355B0516631N90080L65226N50908N16108N65711N79121M23321Q12407O52844
$$ 20516631 21106711 21471937 22022845 22538953 23104664 23683785 24107106 24919513 25572357
14346B5572357N64856M96570J208884N91528N04285R37275N74003J044652O45383
$$ 25572357 26137213 26633783 27842667 28434195 28938480 29875755 30449758 31494410 32139793
14337C2139793R54131J012706J238832J236003P24888J228296J151936J431715
$$ 32139793 33093924 34106630 35345462 36581465 37306353 38534649 39686585 41118300
14329D1118300J160665R52669J753258J477737J455612J621306J943821J967960
$$ 41118300 42278965 43231634 44984892 46462629 47918241 49539547 51483368 53451328
14321E3451328J586951K139313J989201K250761K328557K553343K216861K734219
$$ 53451328 55038279 57177592 59166793 61417554 63746111 66299454 68516315 71250534
14313G1250534L061676L188603L493985L420187L447292M307168L597501M764626
$$ 71250534 74312210 77500813 80994798 84414985 87862277 92169445 95766946 100531572
14305A00531572M517447M961255N088105N297706O387404O212016P044225P199734
$$ 100531572 105049019 110010274 115098379 120396085 126783489 132995505 140039730 147239464
14297A47239464P997452Q179337Q712232R159150R824274J0299319J0898066J1811971
$$ 147239464 155236916 163416253 172128485 181287635 191111909 201411228 212309294 224121265
14289B24121265J2326048J2929049J3880665J4255303J4703679J5212956J5839224
$$ 224121265 236447313 249376362 263257027 277512330 292216009 307428965 323268189
14282C23268189J5746449J6131001J5911686J5108763J5316106J4020273J3276847
$$ 323268189 339014638 355145639 371057325 386166088 401482194 415502467 428779314
14275D28779314J1971481J0145166N644420R37034j225742K7964J525758j838040
$$ 428779314 440750795 450895961 456540381 457477415 456251673 456279637 457805395 455967355
14267D55967355m168382p881672j0619134j3383079j4474408j5687485j6452139
$$ 455967355 451798973 443917301 433298167 419915088 405440680 389753195 373301056
14260C73301056j7006205j7105690j6724054j6410709j6099029j5327333j4687956
$$ 373301056 356294851 339189161 322465107 306054398 289955369 274628036 259940080
14253B59940080j3828978j1720827j2671593j2199212j1122546j0727626r447735
$$ 259940080 246111102 234390275 221718682 209519470 198396924 187669298 178221563
14246A78221563r757117q124613p641537p495093p302246o950013o107314n681420
$$ 178221563 168464446 160339833 152698296 145203203 137900957 130950944 124843630 119162210
14238A19162210n486173n056635n079998m475537m681537m066138l437650l384775
$$ 119162210 113676037 108619402 103539404 99063867 94382330 90316192 86878542 83493767
14230H3493767l220176l242976l490110k836793k738137k644727k682246k072858
$$ 83493767 80273591 77030615 73540505 70703712 67965575 65320848 62638602 60565744
14222F0565744k389778j720658j924280j826481j948081j579130j669461j664004
$$ 60565744 58175966 56455308 54531028 52704547 50756466 49177336 47507875 45843871
14214D5843871j365845n17578j846428j361182j475366j244409n40540r03982
$$ 45843871 44478026 43960448 42114020 40752838 39277472 38033063 37492523 36588541
14206C6588541q16229j403719j055024q73957q46621n71766n66281j118745j039848
$$ 36588541 35772312 34368593 33313569 32439612 31592991 31021225 30454944 29336199 28296351
14197B8296351j101582n23445p19189m22695n19495q61750o49881m49170n51493
$$ 28296351 27194769 26671324 25952135 25529440 25009945 24148195 23498314 23049144 22497651
14188B2497651o06841j62891r86622k90515m51166m06698l72014l42648o71446
$$ 22497651 21890810 21727919 20741297 20450782 19999616 19592918 19220904 18878256 18206810
14179A8206810k25804p35387L767k42826m34546m10882l10372n44386K27972p47677
$$ 18206810 17981006 17245619 17249386 17006560 16572014 16161132 15850760 15306374 15534346 14786669
14169A4786669J03584m09457j81844o36414j08885k72426n0343R5566p15507k16144
$$ 14786669 14890253 14480796 14298952 13662538 13553653 13281227 13230884 13326450 12610943 12394799
14159A2394799J8623o42371K84948n58298j25767m9060j93089k98439n7128r3557
$$ 12394799 12413422 11771051 12055999 11497701 11371934 11322874 11129785 10831346 10774218 10680661
14149A0680661m10984k25045j0369q6115M7847l95524j84720J01463n54504j98980
$$ 10680661 10269677 10044632 10034263 9948148 9995995 9600471 9415751 9517214 8962710 8763730
14139H763730J42760m68217M9165q0721l5299k27479l4831J9973K43786o42449
$$ 8763730 8906490 8438273 8487438 8406717 8371418 8143939 8109108 8129081 8372867 7730418
14129G730418j75376j33435J08503L3774j66369k5797m65664L7263L2306l91055
$$ 7730418 7555042 7421607 7530110 7563884 7397515 7371718 6906054 6943317 6975623 6584568
14119F584568L29999o07543R2866o006k68086L22230k25181j46480P0155p28447
$$ 6584568 6914567 6307024 6399890 6393884 6125798 6448028 6222847 6076367 6146522 5418075
14109E418075K79133J93916J40628n97877K96611k43933k33984L37930j16024
$$ 5418075 5697208 5891124 6031752 5433875 5730486 5486553 5252569 5590499 5474475
14100E474475O814n0696l46243p8351j86160J12866k93822L7423n7800k8205L11774
$$ 5474475 5481289 5430593 5084350 5005999 4819839 4932705 4638883 4676306 4618506 4590301 4902075
14089D902075j13055k83799M1458k02225j71434M21410n50803L69093l27199l2162
$$ 4902075 4789020 4505221 4546679 4344454 4173020 4594430 4043627 4412720 4085521 4053359
14079D053359N598K51165k46969K9505m17883O4305J40328K9906N7341o5726j49814
$$ 4053359 4058957 4310122 4063153 4092658 3674775 3739080 3879408 3909314 3966655 3900929 3751115
14068C751115L4228j89191j01560p0162k98287K29257N06836M4800k89207L03507
$$ 3751115 3785343 3596152 3494592 3424430 3126143 3355400 3862236 3907036 3617829 3921336
14058C921336l77392l3748k11004j04394J79466j99026o5886L62733p32942L47434
$$ 3921336 3543944 3510196 3299192 3194798 3374264 3175238 3109352 3472085 2739143 3086577
14048C086577o4875p6877J63111k38569O8193J64580k20847K2705J9451l70363
$$ 3086577 3021702 2944825 3107936 2869367 2937560 3102140 2881293 2903998 2923449 2553086
14038B553086K32296R209q7146j26898n7592J36133j3581J67433k8459k259P730
$$ 2553086 2785382 2794591 2707445 2580547 2522955 2659088 2645507 2812940 2784481 2782222 2789952
14027B789952j87804m10252N37000k44608L60546l28660j96926K95K12977j72674
$$ 2789952 2602148 2191896 2728896 2484288 2844834 2516174 2319248 2319543 2532520 2359846
14017B359846K34137o07875N05032j48572j80208j03829L97719k60106j74502
$$ 2359846 2593983 1986108 2491140 2342568 2162360 2058531 2456250 2196144 2021642
14008B021642k28565J26307J30459j3947P1260o4446l17340K40313k55826M018
$$ 2021642 1793077 1919384 2049843 2035896 2107156 2042710 1725370 1965683 1709857 1713875
13998A713875J00961J53865J40246j76918J0521j41260J64574k04915Q98894K35911
$$ 1713875 1814836 1968701 2108947 1932029 1942550 1801290 1965864 1760949 2659843 2895754
13988B895754L295416P750885J4715020J8595304k1982955A0823006m391897j814543
$$ 2895754 6191170 13942055 28657075 47252379 25269424 10823006 6431109 4616566
13980D616566o95098o48351j5291n04030j27975j39332N9465r7510n48079J74151
$$ 4616566 3921468 3273117 3257826 2753796 2625821 2486489 2545954 2448444 1900365 2074516
13970B074516o3367J89361J38413p6821m08110r1517K55871j49463J47592k59698
$$ 2074516 2011149 2200510 2338923 2262102 1853992 1762475 2018346 1868883 2016475 1756777
13960A756777P6790L13894k13149n66355J37494K62111N1585l79981M31682l4250
$$ 1756777 1833567 2147461 1934312 1367957 1505451 1767562 1819147 1439166 1870848 1836598
13950A836598k05430l1242J4499K69647m33830L39768l81879K83756k001j31612
$$ 1836598 1631168 1599926 1614425 1884072 1450242 1790010 1408131 1691887 1689886 1558274
13940A558274J83713j33912Q6059l09477J01461Q4601p0986j02079Q2727J30030
$$ 1558274 1741987 1608075 1694134 1384657 1486118 1570719 1499733 1397654 1480381 1610411
13930A610411k71411K81424l54778J14814J72584j74191K1423j35365J40698j80402
$$ 1610411 1339000 1620424 1265646 1380460 1553044 1378853 1400276 1264911 1405609 1225207
13920A225207J73456J27992j88219J34671p4346J35841m75245M31065m03777J55751
$$ 1225207 1398663 1526655 1338436 1473107 1398761 1534602 1059357 1490422 1086645 1242396
13910A242396J27934J051Q8556o1926P4391k12898l7481R9396k01657L11747p8466
$$ 1242396 1370330 1371381 1459937 1398011 1472402 1259504 1222023 1321419 1119762 1431509 1353043
13899A353043k14906l46379J42270K89447m29193M55704J61586m04685k7986J25855
$$ 1353043 1138137 791758 934028 1223475 794282 1249986 1411572 1006887 978901 1104756
13889A104756l43789N44513m4544j58228R2523l71641N55508l62404K31148n30646
$$ 1104756 760967 1305480 1260936 1102708 1195231 823590 1379098 1016694 1247842 717196
13879G17196K58782R0891k78436N43750l3220l57460j3654J07427l32462K23837
$$ 717196 975978 1066869 788433 1332183 1298963 941503 927849 1035276 702814 926651
13869I26651J16768m1693J49892l77384o2500K98090M2466j87981J19803P8277
$$ 926651 1043419 1001726 1151618 774234 711734 1009824 1052290 864309 984112 1062389
13859A062389q5101k46678Q2042L66617k70238P1322l56628K78503k7509r4262
$$ 1062389 977288 730610 812652 1179269 909031 980353 623725 902228 874719 780457
13849G80457L79238N9467l27191L02706n8604m18868P2151J4151K26244l65670
$$ 780457 1159695 1219162 891971 1194677 1136073 717205 789356 803507 1029751 664081
13839F64081L09129j98992J75618k96032J77209l5050k3654J65284k07942j56532
$$ 664081 973210 774218 949836 653804 831013 795963 772309 937593 729651 573119
13829E73119J61590J68867l59026Q617P3663Q7355M7037k9227R7849R1708k2289
$$ 573119 734709 903576 544550 553167 626830 714185 761222 731995 829844 921552 899263
13818H99263p8308C66618M75034k86498K08929j37676L01924j02602J44446D62711
$$ 899263 820955 366618 841652 555154 764083 626407 928331 825729 970175 462711
13807E89265J8697j26245M73036l18516J20659j50134o8190J91043N6024l33747
$$ 589265 607962 481717 954753 636237 756896 606762 538572 729615 785639 451892
13797D51892K25480j48445n2285K16842k89753J39965B70484L77191k61120L97883
$$ 451892 677372 528927 476642 693484 403731 543696 270484 647675 386555 784438
13787G84438k18464R2311Q9162j04194Q5659j91403k5337K19274L99118m03815
$$ 784438 565974 658285 747447 643253 728912 537509 512172 731446 1130564 726749
13777G26749m0802k54986J92758j50991K1872N23051D86964M8580j05k44476K14231
$$ 726749 685947 430961 623719 472728 494600 1017651 486964 535544 535439 290963 505194
13766E05194J09171R8077j30678k51596M81592j40905j55572j26314K30531j5026
$$ 505194 614365 712442 581764 330168 811760 670855 515283 388969 619500 604474
13756F04474J16159B28295L48749M3903r2529K85450l75997j9612j04633L15995
$$ 604474 720633 228295 577044 620947 528418 813868 437871 418259 313626 629621
13746F29621j06446p3658C9475L39459K31423j33991B36657L37477A41578L34361
$$ 629621 523175 449517 39475 378934 610357 476366 236657 574134 141578 475939
13736D75939M6749J66673j95654D4168L02554j35080M58798J23215C96379K36021
$$ 475939 522688 689361 493707 44168 346722 211642 670440 793655 396379 632400
13726F32400j90529Q9018k57228K44942J75041H6539P37160k93705J60246k83425
$$ 632400 441871 530889 273661 518603 693644 86539 823699 529994 690240 406815
13716D06815j04350L32244j45729r7828j7722J26818k16928p6466K28866B583
$$ 406815 302465 634709 488980 391152 373430 500248 283320 206854 435720 2583
13705C90608L95997C78024K96891C31649P4734M91752l63952k03043R0961K09618
$$ 390608 786605 378024 674915 331649 406383 898135 534183 331140 422101 631719
13695F31719B72432b4419F05664A36262o4361N65730j0556j60631m3049j38904
$$ 631719 272432 -24419 605664 136262 71901 637631 627075 466444 423395 284491
13685B84491K75890j89949M4536P8673j98899J78948l0535n1961N9799L8895J41218
$$ 284491 560381 370432 414968 493641 294742 473690 443155 391194 450993 489888 631106
13674F31106j36305j03329K49115o9493B10517K58678j74792l5315O6821A27821
$$ 631106 494801 391472 640587 571094 210517 469195 294403 259088 325909 127821
13663F42285g0190A31828N60213F9385K41236K94801P4756k84230A95945L24695
$$ 642285 -70190 131828 692041 69385 310621 605422 680178 395948 195945 520640
13653E20640I0326c861C57400K90528b37B42454A16524L3047J88064L67542j32424
$$ 520640 90326 -3861 357400 647928 -237 242454 116524 149571 337635 705177 572753
13642E72753j27967o8151J90962B80765J97537k11608K48236B25225J33662J63559
$$ 572753 444786 376635 567597 280765 478302 266694 514930 225225 358887 522446
13632E22446o7153M1413K05590B48717J10993j24668J11087A04131N25610j48531
$$ 522446 455293 496706 702296 248717 359710 235042 346129 104131 629741 481210
13622D81210B07770M02277d9680E22602k15609L27566k52520Q9963A83621K76866
$$ 481210 207770 610047 -49680 522602 306993 634559 382039 472002 183621 460487
13612D60487B10716A04588J31546q0768J8696O8314J4183a6087A87760N6709J76988
$$ 460487 210716 104588 236134 155366 174062 242376 256559 -16087 187760 244469 421457
13601D21457A79638M52348l3734j35143r4729j1696E8387J00196G3518L06631
$$ 421457 179638 631986 598252 463109 368380 356684 58387 158583 73518 380149
13591C80149j11476N1672J27416j95171J46145K3491C9889k18A5351L7176K48773
$$ 380149 268673 320345 447761 252590 398735 422226 39889 39671 15351 52527 301300
13580C01300L0883P6563N0154n1577A85813C4043O09166H0844O5745P4433j09381
$$ 301300 332183 408746 458900 407323 185813 34043 643209 80844 146589 221022 111641
13569A11641h1956B84879J24642j11995a22398C02083K87828j36788l9996A01425
$$ 111641 -81956 284879 409521 297526 -122398 302083 589911 453123 413127 101425
13558D11142j55181A17147K03164J2666j06041l8229J22379K10108A10788M1382
$$ 411142 255961 117147 320311 332977 226936 188707 311086 521194 110788 152170
13548A52170h9025A9838K85712b4336B22563R3872j01870I9858L47853K0681A81748
$$ 152170 -89025 19838 305550 -24336 222563 316435 214565 99858 447711 468392 181748
13536C10680q027j21809A9656M18697o5875j15077N3219j19964J30015A898J90196
$$ 310680 302653 180844 19656 438353 372478 257401 310620 190656 320671 1898 192094
13525A92094p3250M04647G9814L00382j04627J14604j69366a5411C74286l573
$$ 192094 118844 523491 79814 380196 275569 390173 220807 -15411 374286 370713
13515C70713a83617B61738q0833N11163B58825J83995j77442M689j1146G5553
$$ 370713 -183617 261738 180905 692068 258825 442820 265378 270067 258921 75553
13504C72118j69038L96996I7839L13482B03198E2803K29865g7252E29081k41501
$$ 372118 203080 600076 97839 411321 203198 52803 282668 -77252 529081 287580
13494B87580a2708B06066I9277L8584M88431k44676H2774c6644B61730k4241K6949
$$ 287580 -12708 206066 99277 137861 626292 381616 82774 -36644 261730 237489 264438
13483B64438B1114b27968D84625c4805D76507A93027n7588K10403N6669K2656
$$ 264438 21114 -227968 484625 -34805 476507 193027 135439 345842 402511 425167
13473D25167A62169E3149P1760H799L2439L63324A76668J11599h7572H0436J37316
$$ 425167 162169 53149 124909 8799 41238 404562 176668 288267 -87572 80436 217752
13462B17752a75680B87106g5980J1989B01879H8333K16881K07770F8697K85754
$$ 217752 -175680 287106 -75980 -63991 201879 88333 305214 512984 68697 354451
13452C54451K6215g3517k9595C31170o3564o1015R7259e2882B74561j24543a65963
$$ 354451 380666 -73517 -103112 331170 267606 206591 303850 -52882 274561 150018 -165963
13440A62499H0971J28185q365E871a20256e1543D17408A84177m3014J46643K555
$$ 162499 80971 209156 200791 5871 -120256 -51543 417408 184177 141163 287806 290361
13429B90361r0384P6027O4305q1739g9912F9299k8089L20234e4728D4409c0165
$$ 290361 199977 276004 340309 258570 -79912 69299 41210 361444 -54728 44409 -30165
13417C94851j11893e641B11615d70B80930O5786L8409B562Q3846N8789j4622F1711
$$ 394851 282958 -5641 211615 -470 280930 346716 385125 2562 86408 145197 130575 61711
13404a9392C55118J15072k29209L763n1624n6083o934Q2567J97364A96656J70526
$$ -19392 355118 470190 240981 244744 193120 137037 130103 212670 410034 196656 367182
13393C67182A69277Q0248o0125g2642C15219k5125h9142A51566J14543j17279
$$ 367182 169277 249525 189400 -72642 315219 290094 -89142 151566 266109 148830
13383A48830K73757J3159a4357E01975j58899G3344B462N75870E361J47749B3838
$$ 148830 422587 435746 -14357 501975 343076 73344 2462 578332 5361 153110 23838
13371h6457D4976m277L69127D3112L25441A2933d0313G9793a46720B86737A34503
$$ -86457 44976 40699 409826 43112 368553 12933 -40313 79793 -146720 286737 134503
13359a10248A35939A7182J07214C7272J44781d9905C1626Q0439M5294M161p4951
$$ -110248 135939 17182 124396 37272 182053 -49905 31626 112065 157359 161520 86569
13348H6569L32820k00548o5274M3837J9622K5543j16368L03521b721B14857r7141
$$ 86569 419389 218841 153567 197404 217026 242569 126201 429722 -2721 214857 117716
13337A17716R1955L52544k21190j12776C8L34660A14103Q6435k2995R7304p3065
$$ 117716 209671 562215 341025 228249 38 334698 114103 200538 177543 274847 201782
13326B01782J05490E031L79819j38451l9649R6859j20953c707B19732J45319A64726
$$ 201782 307272 5031 384850 246399 206750 303609 182656 -3707 219732 365051 164726
13314A88220P1520a8815B09178H7941A144K23913Q6443H6536p331L23927j91796
$$ 188220 259740 -18815 209178 87941 1144 225057 311500 86536 79205 403132 211336
13303B11336J9989h1462o2936C5226K93646B5433K8999K6231O7737j854a2561
$$ 211336 231325 -81462 -144398 35226 328872 25433 54432 80663 148400 146546 -12561
13291C055L10871K75972C8874g9736k9160d997B78358A11645b9808B65626a1524
$$ 3055 313926 589898 38874 -79736 -108896 -4997 278358 111645 -29808 265626 -11524
13279A20742l7880m0755K29983e4272E5825K55015p9198e4013A84741G1810J84158
$$ 120742 82862 42107 272090 -54272 55825 310840 231642 -54013 184741 71810 255968
13268B55968q4938C9115M20873a636A93663J06623j41562h2955a9820A31331J62936
$$ 255968 171030 39115 459988 -1636 193663 300286 158724 -82955 -19820 131331 294267
13257B94267G7271i3382B8631l075M12256a81049C57613J61081A75183C0037a81262
$$ 294267 77271 -93382 28631 25556 437812 -181049 357613 518694 175183 30037 -181262
13245D5012L8276e3487D53729k22841g5680J2483E8168L83403e1408A01256l4326
$$ 45012 83288 -53487 453729 230888 -75680 -63197 58168 441571 -51408 101256 66930
13234F6930c0821B43066o9544N0426N578a09198d9617J639G4789J38514k1578
$$ 66930 -30821 243066 173522 223948 229526 -109198 -49617 -47978 74789 213303 191725
13223A91725c58548F0866j3826a9202C81599F0299Q5496A5159J97719K7698a56245
$$ 191725 -358548 60866 47040 -19202 381599 60299 145795 15159 212878 240576 -156245
13211A81416H8899M7417J53406a90973A04428K4512I438J24929R5012b20279B88268
$$ 181416 88899 136316 289722 -190973 104428 128940 9438 134367 229379 -220279 288268
13199I5819a96755B25065a57834O3541b4907b006C51592B5436L4073K14687p7835
$$ 95819 -196755 225065 -157834 -94293 -24907 -2006 351592 25436 59509 274196 196361
13188A96361E8189c2957m3137H4108Q769f4363j44739C19562m0354a54397D9317
$$ 196361 58189 -32957 -76094 84108 92877 -64363 -209102 319562 279208 -154397 49317
13176A33517e2326j59402a953B22091d6625j22128I4465O4963k4809J18398a67855
$$ 133517 -52326 -211728 -1953 222091 -46625 -168753 94465 159428 134619 253017 -167855
13164B01721k8626m8195g8256B09912A9583K25799e7815j32238B95816d278A61688
$$ 201721 173095 124900 -78256 209912 19583 245382 -57815 -190053 295816 -4278 161688
13152B10669B9742K39717a31752H9729f0016j49759C62774d9364C3906J63535
$$ 210669 29742 269459 -131752 89729 -60016 -209775 362774 -49364 33906 197441
13142A97441E8894M2104K10756B5077h5774a1689I1754L1285A2939a51054B50296
$$ 197441 58894 100998 311754 25077 -85774 -11689 91754 123039 12939 -151054 250296
13130a07677A26966Q2611D5008K44209j06919C0295K51584i1723A6219K23263
$$ -107677 126966 209577 45008 289217 182298 30295 281879 -91723 16219 239482
13120B39482e7662j06720k2744C23194c0763l8791c166C57106d6904A45730a52804
$$ 239482 -57662 -164382 -187126 323194 -30763 -69554 -3166 357106 -46904 145730 -152804
13108b3990D3831J61585d2097j53942A50597e1197F9357a10760e5370C72787B1019
$$ -23990 43831 205416 -42097 -196039 150597 -51197 69357 -110760 -55370 372787 21019
13096E6575b36782b7492A03013O9913f3507A39112n6245K45766j45975m0193B5069
$$ 56575 -236782 -27492 103013 172926 -63507 139112 82867 328633 182658 142465 25069
13084A51758F7297K15422O9796e2046M016r8050B05505e3301l8507A87704L17557
$$ 151758 67297 282719 352515 -52046 -48030 -146080 205505 -53301 -91808 187704 505261
13073E05261A29334m8824J59807O6163A20273a29127b4164B06807b05712B95385
$$ 505261 129334 80510 240317 306480 120273 -129127 -24164 206807 -205712 295385
13062b04120C10552E6281J51178h3149j19985A83517a58973a3669k09469A39030
$$ -204120 310552 56281 207459 -83149 -203134 183517 -158973 -13669 -223138 139030
13051A51572J1874c4712C3723a38988C8736L78780E2375J402A1388L70637G0758
$$ 151572 163446 -34712 33723 -138988 38736 417516 52375 53777 11388 382025 70758
13039I4716K31021a39420A50189C7590a26518I8383b1227B93699A34460N593n2900
$$ 94716 325737 -139420 150189 37590 -126518 98383 -21227 293699 134460 140053 87153
13028H7153L7558d6418A76273K57680j93754R0524A06505e8734o4590B55674a23898
$$ 87153 124711 -46418 176273 433953 240199 330723 106505 -58734 -123324 255674 -123898
13016E7001L3427L62582A93789q5553b852A37087K94218a67501O6157G4272B9589
$$ 57001 90428 453010 193789 108236 -2852 137087 431305 -167501 -101344 74272 29589
13004c756q6902l5529A31656o939m0421J33074b05089B29784o6690a70340A07562
$$ -3756 -90658 -126187 131656 124717 84296 217370 -205089 229784 163094 -170340 107562
12992C62084F9281l887a09168A65106k7483p511B3045P8268a14651E4115i4C74800
$$ 362084 69281 65394 -109168 165106 137623 130112 23045 101313 -114651 54115 -94 374800
12979c3100l551A33141n1312M3499a85354A90581d4391F3384a90503J0496A5216
$$ -33100 -36651 133141 81829 125328 -185354 190581 -44391 63384 -190503 -180007 15216
12967A98594l0300A7925L11067a08223A59547k385f319C64908j21699A0923b09362
$$ 198594 168294 17925 328992 -108223 159547 157162 -6319 364908 243209 10923 -209362
12955H2691a22688n4307N6424F1621L22143g1686A10596k7018b71366C76441g294
$$ 82691 -122688 -176995 -120571 61621 383764 -71686 110596 83578 -271366 376441 -7294
12943e39990b04448A1700J32030k3857J21323g9022j3472C1987N9604a08136B32332
$$ -539990 -204448 11700 143730 119873 241196 -79022 -92494 31987 91591 -108136 232332
12931A98844m1762J70060a57651C0062g8038B95679b29521I6900k5016m220J34046
$$ 198844 157082 327142 -157651 30062 -78038 295679 -229521 96900 71884 67664 201710
12920B01710d0259o3640I1017J65257c5499F462g8763A9142L11399G7718C3622
$$ 201710 -40259 -103899 91017 256274 -35499 6462 -78763 19142 330541 77718 33622
12908D3232J632c74097A7244d10511J73556A10773J6570m0149O9403K1648b56206
$$ 43232 44864 -374097 17244 -410511 -236955 110773 127343 87194 156597 178245 -256206
12896a84419L0936A41371J06504g8357K620f813o0096j27108n0516A53094C6225
$$ -184419 -153483 141371 247875 -78357 -75737 -6813 -66909 -194017 -244533 153094 36225
12884i0686M1168j44840F6170O8559A0698J00506b92319A91482i6675r0381L3644
$$ -90686 -49518 -194358 66170 134729 10698 111204 -292319 191482 -96675 -187056 -153412
12873a53412c2303j6059D3673J2450J1980e3431m2935B91820F9578b1750M916
$$ -153412 -32303 -48362 43673 56123 68103 -53431 -96366 291820 69578 -21750 -16834
12862a6834d729B7216h7984C795K1921J89168F3420i0206p4096k16472A24660
$$ -16834 -4729 27216 -87984 3795 25716 214884 63420 -90206 -164302 -380774 124660
12850A54348d1256m9061L5447H4897a70387G94M84228a46119A18998h149H8171
$$ 154348 -41256 -90317 -54870 84897 -170387 794 485022 -146119 118998 -8149 88171
12838i4338A95175J91696A04237J13849A02774c7897p915A08224b87148A81204
$$ -94338 195175 386871 104237 218086 102774 -37897 -45812 108224 -287148 181204
12827A98060l5194a09654G937J60410f2787C7759a47275g690j00747b13H3279
$$ 198060 162866 -109654 7937 168347 -62787 37759 -147275 -7690 -108437 -213 83279
12815b21276B50757b8587j54686A7132N2227a76020A48454j7840B8376a76448
$$ -221276 250757 -28587 -183273 17132 69359 -176020 148454 130614 28376 -176448
12804A50897d5069B23204A01675a22500j50065D00062a59951b6636j6684c919
$$ 150897 -45069 223204 101675 -122500 -272565 400062 -159951 -26636 -43320 -3919
12793e5836C9098P9J82078r6509d2279k68400N2374J27145l3751p2738d4587J1657
$$ -55836 39098 39177 221255 124746 -42279 -310679 -258305 -131160 -164911 -237649 -44587 -32930
12781c2930j33589j41078C022a15432e3888H3164d3537A77568J11765i2976K7576
$$ -32930 -166519 -307597 3022 -115432 -53888 83164 -43537 177568 289333 -92976 -65400
12770f5400A21605L39784A57954a0741j37296G3588k5087a79263N6409k04087
$$ -65400 121605 461389 157954 -10741 -148037 73588 48501 -179263 -122854 -326941
12760c26941a8221G2974K6164a08466A19622N4495i142k0987A40660e4040k20188
$$ -326941 -18221 72974 99138 -108466 119622 174117 -9142 -30129 140660 -54040 -274228
12749b74228A75223C8471f12692a4108A8742J44789P8072J77743a46332b1546
$$ -274228 175223 38471 -612692 -14108 18742 163531 241603 419346 -146332 -21546
12738H1775K51480n2618c4144C31113F5539J68671n7374a4246A72008a19786B05955
$$ 81775 333255 280637 -34144 331113 65539 234210 176836 -14246 172008 -119786 205955
12726D8992b25095j42170C9833K05064C4471K2639R8819a87842E5408N6330f6964
$$ 48992 -225095 -367265 39833 244897 34471 57110 155929 -187842 55408 111738 -66964
12714b3773r335B88630C4582a32734A14467J29280A19435J02832C7885L55330
$$ -23773 -33108 288630 34582 -132734 114467 243747 119435 222267 37885 393215
12704C93215A95443k0348N0254o1202B6386O4950M3949P519D4763a23957A24030
$$ 393215 195443 175095 225349 164147 26386 91336 135285 142804 44763 -123957 124030
12692A1377R277e2772j40578b7196A02852b81507H0385h3956A04256D3138L14488
$$ 11377 20654 -52772 -193350 -27196 102852 -281507 80385 -83956 104256 43138 357626
12681C57626e7250F5904e6740B04362j1410E8333L76986I049N03433A83683C429
$$ 357626 -57250 65904 -56740 204362 192952 58333 435319 9049 512482 183683 3429
12669A73300d9166B04906C2096i6986E5111J81821h3895C0424J91399a73115q4295
$$ 173300 -49166 204906 32096 -96986 55111 236932 -83895 30424 221823 -173115 -257410
12658b57410D1703M4009K28821j30372K3116n4172J30652A23730a16087D69676
$$ -257410 41703 85712 314533 184161 207277 153105 283757 123730 -116087 469676
12647i9346l507l5284k0382A70463a99630A60884a40191c2205r7113d0923B96354
$$ -99346 -102853 -138137 -158519 170463 -199630 160884 -140191 -32205 -129318 -40923 296354
12635H7622a99959B50058e2255B03166F1130P2883E9181J41856J28639j28981
$$ 87622 -199959 250058 -52255 203166 61130 134013 59181 201037 329676 200695
12625B00695o8914K6936a202j35132C03063l2143A32338B6332a8022k34732R0747
$$ 200695 131781 158717 -1202 -136334 303063 270920 132338 26332 -18022 -252754 -162007
12614a62007m7220I4415h5341k09440G4465R1665j2D1325b6301A30840J1310a7209
$$ -162007 -209227 94415 -85341 -294781 74465 166130 166118 41325 -26301 130840 142150 -17209
12601B03107a67166c8383q1116A04849K10111G6639J51912a45620k667G8924Q4163
$$ 203107 -167166 -38383 -119499 104849 314960 76639 228551 -145620 -148287 78924 163087
12590A63087b19371A36653e4338C56209A37054a9414p091A33916c48476J65415
$$ 163087 -219371 136653 -54338 356209 137054 -19414 -26505 133916 -348476 -183061
12580a83061A09532B452L8862c7609F4639K22161A7591c6403A13927K6794a55837
$$ -183061 109532 2452 41314 -37609 64639 286800 17591 -36403 113927 140721 -155837
12568a63391E886a21987A64416l4819l4269a2794A08956a25683q0145B4691a09292
$$ -163391 5886 -121987 164416 129597 95328 -12794 108956 -125683 -205828 24691 -109292
12556a89677A73193J30549A39607H008N4606f6617q0405F8123k2104c32241A12359
$$ -189677 173193 303742 139607 8008 62614 -66617 -147022 68123 46019 -332241 112359
12544A30674l5743g5398B4500a71699j52565B51063E2137K29165a36888K5430
$$ 130674 94931 -75398 24500 -171699 -324264 251063 52137 281302 -136888 -111458
12534a11458b4599A11814a34908q40q10e4666j52009D5402K74218A41995a7596
$$ -111458 -24599 111814 -134908 -135748 -136558 -54666 -206675 45402 319620 141995 -17596
12522e4001A53466a24305A03274a99826j8731A30842a98980F6006Q8436e9720
$$ -54001 153466 -124305 103274 -199826 -218557 130842 -198980 66006 154442 -59720
12511B91226f2620F9308K37028A6856a46641p6437H1958M6485D7328e4828D9088
$$ 291226 -62620 69308 306336 16856 -146641 -223078 81958 128443 47328 -54828 49088
12499A94376c1813A1078J47925K14145i0661r1312I7240A4736b71256G3998R471
$$ 194376 -31813 11078 159003 373148 -90661 -181973 97240 14736 -271256 73998 83469
12488H3469J48288A12264a75767C05703e2132A85545J07178b2450I170L86195
$$ 83469 231757 112264 -175767 305703 -52132 185545 292723 -22450 9170 395365
12478C95365n4198A24264D9031K96120g8633r3650O4274E7762a24158B58525a91910
$$ 395365 341167 124264 49031 345151 -78633 -172283 -108009 57762 -124158 258525 -191910
12466A9508c69741C5242c16036A62993E6067K6770N8395g2198K6260k22589G5387
$$ 19508 -369741 35242 -316036 162993 56067 82837 141232 -72198 -45938 -268527 75387
12454A08835b16109A60583P4579A17466d1215f439k3906k7137k9468o3185j9767
$$ 108835 -216109 160583 235162 117466 -41215 -6439 -30345 -57482 -86950 -150135 -169902
12443a69902A7411e946r7440D35385b14763C08050a20455L2785j91763J18071
$$ -169902 17411 -5946 -103386 435385 -214763 308050 -120455 -87670 -279433 -161362
12433a61362k0275D0215j2861b63702B33068D2657K21837r7752k737b53324j64601
$$ -161362 -181637 40215 27354 -263702 233068 42657 264494 166742 164005 -253324 -417925
12422d17925a40386A27867K09030a1591j30295C46708I2559N179e7214p9130A202
$$ -417925 -140386 127867 336897 -11591 -141886 346708 92559 97738 -57214 -136344 1202
12410B40345q1004O6479J79086H3502f8682B08103m4887n4205a85910B8052K26324
$$ 240345 159341 225820 404906 83502 -68682 208103 163216 109011 -185910 28052 254376
12399B54376b6888C40500g4853j27533B37776D608i4809K6445A86647b51841D8693
$$ 254376 -26888 340500 -74853 -202386 237776 4608 -94809 -68364 186647 -251841 48693
12387B51059a8504B7666J64694q2465D2432b55650A32155c51142B4478b20537
$$ 251059 -18504 27666 192360 109895 42432 -255650 132155 -351142 24478 -220537
12376a15040b9915m2309C07726j02444D267b33744B9467O5446A9117K8201N4357
$$ -115040 -29915 -72224 307726 205282 4267 -233744 29467 94913 19117 47318 101675
12365A01675c2593A3087i3278R429B01586B4984L8236g0149k20831J30726B4014
$$ 101675 -32593 13087 -93278 -83849 201586 24984 63220 -70149 -290980 -160254 24014
12353a10098B5228L6143c74647a67192h0241q1665E2955a41694A264Q4320b3516
$$ -110098 25228 61371 -374647 -167192 -80241 -161906 52955 -141694 1264 85584 -23516
12341B86543h7123F6255J3826C6465e7992B12686B2579A0114i8379a7372k37356
$$ 286543 -87123 66255 80081 36465 -57992 212686 22579 10114 -98379 -17372 -254728
12330b54728J04163j77177q386D39943b32780A15943b54074F5947c45774f3342
$$ -254728 -150565 -327742 -336128 439943 -232780 115943 -254074 65947 -345774 -63342
12319a4143r9382I8538J92663D0658K83796A08321a95540A26189J26466J01114
$$ -14143 -113525 98538 291201 40658 324454 108321 -195540 126189 252655 353769
12309C53769H3557a42501j14305b2854D52874a94193j19377a13687C02640r4229
$$ 353769 83557 -142501 -256806 -22854 452874 -194193 -313570 -113687 302640 208411
12299B08411h8510J6562B29597a93425B67381D756d5271p8457M6678B92083a22687
$$ 208411 -88510 -71948 229597 -193425 267381 4756 -45271 -123728 -77050 292083 -122687
12287D8747k0495O9883a03332A39475C9272J02013J20879J9272m1180I7767O8044
$$ 48747 28252 98135 -103332 139475 39272 141285 262164 281436 240256 97767 165811
12276A65811b31369B04703M64528A77993J23394d0317G352j018J00612K85249
$$ 165811 -231369 204703 669231 177993 301387 -40317 7352 6334 106946 392195
12266C92195b6699B12462r1749M8416R4906h9903A02524K0933n0178C3903K53764
$$ 392195 -26699 212462 120713 169129 264035 -89903 102524 123457 73279 33903 287667
12255B87667q2233c9660A85066n616G9863m438L19930e8382A87066n0059a41422
$$ 287667 205434 -39660 185066 179450 79863 75425 395355 -58382 187066 137007 -141422
12243A21923E237J65925b08267A6561L1025K71421j13030n8216M9412J04251j45676
$$ 121923 5237 171162 -208267 16561 47586 319007 205977 147761 197173 301424 155748
12232A55748J5875m1916j8900a9189A88775J01889A23761N9373J68803l7365n7877
$$ 155748 171623 129707 110807 -19189 188775 290664 123761 183134 351937 314572 256695
12221B56695c1984C0049M8553K05182G9759K1628g0072E1644a6287A98102C9898
$$ 256695 -31984 30049 78602 283784 79759 101387 -70072 51644 -16287 198102 39898
12209a02414A9866J6218p924J41216G1366J61789k9231L69730j52217j95119k8172
$$ -102414 19866 36084 28160 169376 71366 233155 203924 573654 421437 226318 198146
12198A98146f1363F3804m176N17356B77694A13593B8956a1625C23459A50713l7576
$$ 198146 -61363 63804 59628 576984 277694 113593 28956 -11625 323459 150713 113137
12187A13137g7031B55066j24090J20328p1622J7222p140i4722C14640f4995A13032
$$ 113137 -77031 255066 130976 251304 179682 196904 189764 -94722 314640 -64995 113032
12175A03677L53385k11243b706A35860J9109b10722B49800b13595A41727n5652
$$ 103677 457062 245819 -2706 135860 154969 -210722 249800 -213595 141727 86075
12165H6075l0091e2202a0118A70104C4132N074N3308E6J08923M4184l8527a92837
$$ 86075 55984 -52202 -10118 170104 34132 39206 92514 56 108979 153163 114636 -192837
12152B14156G1620k7129K47534A14409J14020b1127E963M9119b6680A5315J24768
$$ 214156 71620 44491 292025 114409 228429 -21127 5963 55082 -26680 15315 140083
12141A40083k1849c1608n9450k01530D03133A21846a06113A35838E7661J94978
$$ 140083 118234 -31608 -91058 -292588 403133 121846 -106113 135838 57661 252639
12131B52639c72658d213k04595m0961D3771d1913E3944c3589A21235R3949j01610
$$ 252639 -372658 -4213 -208808 -249769 43771 -41913 53944 -33589 121235 215184 113574
12120A13574k0582J4847a87185A17995l8728K25900g5171r6812B85274p8776j00532
$$ 113574 92992 107839 -187185 117995 79267 305167 -75171 -171983 285274 206498 105966
12109A05966c61835B1722h8608H422f9128a1678r1425O279B62772f9234A52355
$$ 105966 -361835 21722 -88608 8422 -69128 -11678 -103103 -96824 262772 -69234 152355
12097a10816A96594e7259H7466l89G301a44994k62638B2482Q4048b54965k7051
$$ -110816 196594 -57259 87466 87077 7301 -144994 -407632 22482 106530 -254965 -282016
12086b82016J35351e9149a3934B7590K40047j23597a12587A44a18476A88866d0460
$$ -282016 -146665 -59149 -13934 27590 267637 144040 -112587 144 -118476 188866 -40460
12074C94900a19513G4988g9184G6136J49962m6114L47075J308870J2763D37900
$$ 394900 -119513 74988 -79184 76136 226098 179984 527059 1835929 1848692 437900
12063C24869k9797F3650b7189B22701p0941a91265A09038b90028A62482E9135
$$ 324869 295072 63650 -27189 222701 151760 -191265 109038 -290028 162482 59135
12052a82448h8440b6150k0945A64399a13718H1277J44034e5489j69441A92054
$$ -182448 -88440 -26150 -47095 164399 -113718 81277 225311 -55489 -224930 192054
12041f0621L960J4403j42756G4030M0788b86505k4949b6405A32017b2485I709
$$ -60621 -56661 -42258 -185014 74030 114818 -286505 -311454 -26405 132017 -22485 9709
12029H392a78169M9713q4870g7047l29123d3081A48992E790K01481d48982G4455
$$ 8392 -178169 -128456 -213326 -77047 -406170 -43081 148992 5790 207271 -448982 74455
12017b46353G5136a85485A94908q8746R5302K4996M543C3025J18756b4440A21754
$$ -246353 75136 -185485 194908 106162 201464 226460 231003 33025 151781 -24440 121754
12005h3114q2930d3114k58930F7399l2386J31811E5081a06759K4643A69099c05663
$$ -83114 -166044 -43114 -302044 67399 35013 166824 55081 -106759 -82116 169099 -305663
11993c0974A6011d4563m54232B61274L0330E5483K38551j8609I2319K9217i5211
$$ -30974 16011 -44563 -498795 261274 291604 55483 294034 275425 92319 121536 -95211
11981B10093c39344A51869c6146A82768C0377a21700p0099c9933A47797q941B6753
$$ 210093 -339344 151869 -36146 182768 30377 -121700 -191799 -39933 147797 138856 26753
11969A21362J55842J29374e8056r8054H9654J02555e8428j55109e2127B81861
$$ 121362 277204 406578 -58056 -156110 89654 192209 -58428 -213537 -52127 281861
11958i4030k9311m0376k61377G6742b47594D24476B173e5074B11534a78255g9714
$$ -94030 -123341 -163717 -425094 76742 -247594 424476 2173 -55074 211534 -178255 -79714
11946a44222N1037M5454k04458e8594K6442A7590a28262A29496A8283b3760C9575
$$ -144222 -93185 -47731 -252189 -58594 -32152 17590 -128262 129496 18283 -23760 39575
11934b40117A9799J99912j7334k9157c19750C2538J37649f3228L419p1551A31773
$$ -240117 19799 219711 202377 173220 -319750 32538 170187 -63228 -59809 -131360 131773
11922A05143c34844A81023b54007i9813d9347D28546g5375C4116K94221d7609
$$ 105143 -334844 181023 -254007 -99813 -49347 428546 -75375 34116 328337 -47609
11911C55644C3036l111f8098A38161b54760A44295m0872C4027K96418I4408J42679
$$ 355644 33036 29925 -68098 138161 -254760 144295 103423 34027 330445 94408 237087
11900B37087b63677I468J19010d17002e4723k03041J27766N5877c3695k01480
$$ 237087 -263677 9468 128478 -417002 -54723 -257764 -129998 -74121 -33695 -235175
11890b35175J8936f6330p739l5861F2469J46616g3915k09489q5806A46818a21339
$$ -235175 -216239 -66330 -74069 -109930 62469 209085 -73915 -283404 -369210 146818 -121339
11878i6118k59310J3032F9322O5289c0883e11k02663i1477D1008A924J15718k7000
$$ -96118 -355428 -342396 69322 134611 -30883 -511 -203174 -91477 41008 1924 117642 90642
11866I0642c26183A16090f467m2050E2887b08232A07200b42722d7744E4739a09313
$$ 90642 -326183 116090 -6467 -48517 52887 -208232 107200 -242722 -47744 54739 -109313
11854C6248c04983J37289A94736G4413b40554E3909R4618F6785D058J15347M2217
$$ 36248 -304983 -167694 194736 74413 -240554 53909 148527 66785 4058 119405 161622
11843A61622m5498a49578K6513L4592j71285g8847c3115o8624l574C1771Q2662
$$ 161622 116124 -149578 -123065 -88473 -259758 -78847 -33115 -101739 -105313 31771 114433
11832A14433Q1080a27165D0379f5764p3465G3266C0542D780b65258i5405n2632
$$ 114433 195513 -127165 40379 -65764 -139229 73266 30542 4780 -265258 -95405 -148037
11821a48037j35650a28913j25575a13870G053J42313a79346p508A2029K0496A1787
$$ -148037 -283687 -128913 -254488 -113870 7053 149366 -179346 -186854 12029 32525 11787
11809A16146h5904K0233B04686c0158j53400J0126j40549A58067k2976J4247a81181
$$ 116146 -85904 -65671 204686 -30158 -183558 -173432 -313981 158067 135091 149338 -181181
11797A45989L1824a01567A05595J01178F4536a4201B29569d2599@B2589N0799
$$ 145989 177813 -101567 105595 206773 64536 -14201 229569 -42599 0 22589 73388
11786G3388i0134K9706A93014i750l7447B15606n2829E2800b00747A5001K04310
$$ 73388 -90134 -60428 193014 -9750 -47197 215606 162777 52800 -200747 15001 219311
11775B19311n7245f8646o3774j39935L5014D0612g0619m33870E4560J79281b56245
$$ 219311 162066 -68646 -132420 -272355 -237341 40612 -70619 -504489 54560 233841 -256245
11763C870J15676a37422A17280b3061C81857g8072a7026C03379b66966A71315
$$ 3870 119546 -137422 117280 -23061 381857 -78072 -17026 303379 -266966 171315
11752B0657P1604L5427J76446A46251J54009h0834A29465b36915I0233b55152
$$ 20657 92261 127688 304134 146251 300260 -80834 129465 -236915 90233 -255152
11741I3552b3814k9465H3843a15799C52298C7114L7052K86033j0414A0579N3454
$$ 93552 -23814 -53279 83843 -115799 352298 37114 74166 360199 349785 10579 64033
11730F4033c18561h4713A74300F4606a60854B20645R6970c06406j84545a7500
$$ 64033 -318561 -84713 174300 64606 -160854 220645 317615 -306406 -490951 -17500
11719a5233E9238J9171J36253M7776d85228B17059b92431D99911A43604R6895
$$ -15233 59238 78409 214662 262438 -485228 217059 -292431 499911 143604 240499
11709B40499J3431j22982n7706b11053C49112f3977B8278L46288b15552A41915
$$ 240499 253930 130948 73242 -211053 349112 -63977 28278 374566 -215552 141915
11698D5310J67004D85J42354F4169A6411K5657K89078a18925B1290e4869A46327
$$ 45310 212314 485 142839 64169 16411 42068 331146 -118925 21290 -54869 146327
11686h1599A59624E9333b5875A39185J135b38314A24208l0386a31255A19981c5466
$$ -81599 159624 59333 -25875 139185 140320 -238314 124208 93822 -131255 119981 -35466
11674A64757l8141a43169B56778a62395j6702e3752o0755B38465b22315i5198
$$ 164757 126616 -143169 256778 -162395 -179097 -53752 -114507 238465 -222315 -95198
11663C04463A18203D4521J87891A08348N2296L5074B7820N1a03985A22018b20784
$$ 304463 118203 44521 232412 108348 160644 195718 27820 27871 -103985 122018 -220784
11651E1804b03182I5908a66792A03570O9223K98197I5827a52161A9166Q1167Q1759
$$ 51804 -203182 95908 -166792 103570 172793 470990 95827 -152161 19166 100333 182092
11640A82092c47845J21933D690J10812H15J062K38597d1187B79642A12414J2496
$$ 182092 -347845 -225912 4690 115502 815 1877 240474 -41187 279642 112414 124910
11629A24910j3193B0497L10805o4136a53499B17946f8946A23863b23354I3712
$$ 124910 111717 20497 331302 267166 -153499 217946 -68946 123863 -223354 93712
11618a77941D23931j31791b19280B18491f3927b4246j07044B43335M3627j31014
$$ -177941 423931 292140 -219280 218491 -63927 -24246 -131290 243335 286962 155948
11608A55948d0656j03513q2043c7975B7979Q6124a16400B5966J54012j1597m4228
$$ 155948 -40656 -144169 -226212 -37975 27979 114103 -116400 25966 179978 168381 124153
11597A24153K00163A42532P7904j3117C2402b8604A36674c15278J43719q8336
$$ 124153 324316 142532 220436 207319 32402 -28604 136674 -315278 -171559 -259895
11587b59895e1145B95926B652K66198c6831I8249L35742I6815K21689j9783a64996
$$ -259895 -51145 295926 2652 268850 -36831 98249 433991 96815 318504 298721 -164996
11575E9920O7954i0847A48051a1614F7941a6597j81298O6937A94461f445A19827
$$ 59920 127874 -90847 148051 -11614 67941 -16597 -197895 -130958 194461 -6445 119827
11563a770C25840j15615a20929k65446h5961A20312C4505K63185P8739a05807
$$ -1770 325840 210225 -120929 -386375 -85961 120312 34505 297690 376429 -105807
11552b3951B1290Q1770Q3778d0258C30984D9713L14729e6326a215C53426E9556
$$ -23951 21290 103060 186838 -40258 330984 49713 364442 -56326 -1215 353426 59556
11540C11561q9747r2176K67653A09824k5503a09942D42070q1521F4203J30345
$$ 311561 221814 129638 397291 109824 84321 -109942 442070 360549 64203 194548
11530A94548b02356H4373l0955J31168a65981A51309A6609a18578j47558J03112
$$ 194548 -202356 84373 53418 184586 -165981 151309 16609 -118578 -266136 -163024
11520a63024C64100a07951j6872A24886O845j5730b48050C24166b02707n2646
$$ -163024 364100 -107951 -124823 124886 131731 116001 -248050 324166 -202707 -255353
11510b55353A20531M2959D8165L49915A31686J51333r3340f3025B06721A8132
$$ -255353 120531 163490 48165 398080 131686 283019 189679 -63025 206721 18132
11499A09287Q3579J91938a84873n8279C03457I3502b18272E2850L70439E8461
$$ 109287 192866 384804 -184873 -243152 303457 93502 -218272 52850 423289 58461
11488B39402N2023K6734f298q6949H8699K81429J18158A80512K27298j77437K72333
$$ 239402 291425 318159 -6298 -93247 88699 370128 488286 180512 407810 230373 502706
11477E02706A49240k5638J25241j19691D966P14237B59678E619K18909r8559D6778
$$ 502706 149240 123602 248843 129152 4966 719203 259678 5619 224528 125969 46778
11465H990J57558C7060O6429K85631j57863q3723K25907A86442D1133i6323B02974
$$ 8990 166548 37060 103489 389120 231257 147534 373441 186442 41133 -96323 202974
11453e0132A71456n0381a07439C58879n6433J1282h2818l0907C5518a63740f120
$$ -50132 171456 121075 -107439 358879 302446 313728 -82818 -113725 35518 -163740 -6120
11441B00964M4957P2382B3858c7013L834A21958C1504k04f3967H3965b1217j73523
$$ 200964 245921 318303 23858 -37013 -33179 121958 31504 31300 -63967 83965 -21217 -194740
11429a94740P0891B1305J83259i7178G6294N5642J80549j35857f6223F618b10797
$$ -194740 -123849 21305 204564 -97178 76294 131936 312485 176628 -66223 6618 -210797
11417A12665i838j78105e6025J9223F3249O4674a05480M9505F9407J34529g6585
$$ 112665 -9838 -187943 -56025 -36802 63249 127923 -105480 -55975 69407 203936 -76585
11405B41094I1783d4062D9506Q1039J41942N4199a13455B18960H0320Q4524f5895
$$ 241094 91783 -44062 49506 130545 272487 326686 -113455 218960 80320 164844 -65895
11393G4605O4071E2444a33381j00505a02099A47242l9373a85839Q0518C0226b08993
$$ 74605 138676 52444 -133381 -233886 -102099 147242 107869 -185839 -105321 30226 -208993
11381D2349K09535f6918c2085B52237P550A12733b22633R1914B6111P792P1516
$$ 42349 251884 -66918 -32085 252237 259787 112733 -222633 -130719 26111 33903 105419
11370A05419N1774p4895c11738c4100l09892M39a38061A47393a16805C50989f862
$$ 105419 157193 82298 -311738 -34100 -343992 -343553 -138061 147393 -116805 350989 -6862
11358h2995g871A1238M49678A92853g3082F1327K11801a01548B8332c01225a22914
$$ -82995 -7871 11238 460916 192853 -73082 61327 273128 -101548 28332 -301225 -122914
11346b3222E8763h8176o6497C27044j22537e8911b0453j76103D2768d3260j10159
$$ -23222 58763 -88176 -154673 327044 204507 -58911 -20453 -196556 42768 -43260 -153419
11335a53419C0380f2770A88970b14213A78748D9802K1787J18931K82044a01935
$$ -153419 30380 -62770 188970 -214213 178748 49802 71589 190520 472564 -101935
11324c751A58804a50623L6339B9774b13696A20060J71585a26207k78913A6879
$$ -3751 158804 -150623 -114284 29774 -213696 120060 291645 -126207 -405120 16879
11313B12714L8340b7822q1033D2220N9330a78045J0184r913A27348D12a93880
$$ 212714 251054 -27822 -108855 42220 101550 -178045 -167861 -177774 127348 412 -193880
11301a32058B49820A19973b8063H1868J83022b10386G6772J01584C2033b0960
$$ -132058 249820 119973 -28063 81868 264890 -210386 76772 178356 32033 -20960
11290B4007b55208c9669C10637A21865a03528e798a208B62784p2562c9308m41141
$$ 24007 -255208 -39669 310637 121865 -103528 -5798 -1208 262784 190222 -39308 -480449
11279d80449d00l19471h1517A06149l9707h5909E2188Q5715O3571b95643M7192
$$ -480449 -400 -319871 -81517 106149 66442 -85909 52188 137903 201474 -295643 -248451
11268b48451B2760a32525O3504K5427A71076A4425j067a1109r6426A44053b76255
$$ -248451 22760 -132525 -69021 -43594 171076 14425 13358 -11109 -107535 144053 -276255
11256c6483A27732O1813P1807H833a77061D66483j63617a87240e3617H785M0800
$$ -36483 127732 189545 261352 8833 -177061 466483 302866 -187240 -53617 8785 49585
11245D9585e1404A14950a6044k8841B19304g74q7461c0358n3465L3567k32736
$$ 49585 -51404 114950 -16044 -44885 219304 -774 -88235 -30358 -83823 -50256 -282992
11234b82992e8489I0645a64910B07931c49646A68823n8167A9623d49157C8410
$$ -282992 -58489 90645 -164910 207931 -349646 168823 110656 19623 -449157 38410
11223A9420h4412j76131R3157E8524J18269f0909A41777k2570k0343C7405a21989
$$ 19420 -84412 -260543 -167386 58524 176793 -60909 141777 119207 98864 37405 -121989
11211A25790d91528a21238R798a1860k31616I8574g3905A0318b5615k2261A05114
$$ 125790 -491528 -121238 -111440 -11860 -243476 98574 -73905 10318 -25615 -47876 105114
11199a45689E8178a50061A18417b27576Q3267k10589J73052E4832a90942H3053
$$ -145689 58178 -150061 118417 -227576 -144309 -354898 -181846 54832 -190942 83053
11188i5980l15195g9663j45734j42823J69899F7281a09063G1827R936b67635C62697
$$ -95980 -411175 -79663 -225397 -368220 -198321 67281 -109063 71827 81763 -267635 362697
11176d6775F081c00343H3007c3530j03126B01722A6894O5994e0854K153r7402
$$ -46775 6081 -300343 83007 -33530 -136656 201722 16894 82888 -50854 -48701 -146103
11165a46103C90799b6589o9723C9734N6784D7733J35205i2338A37149d937o3285
$$ -146103 390799 -26589 -96312 39734 96518 47733 182938 -92338 137149 -4937 -68222
11154f8222n2592A77580b51219j0396A52592a17711A66335a05010j52812e155
$$ -68222 -120814 177580 -251219 -261615 152592 -117711 166335 -105010 -257822 -5155
11143D3223i8438j00960P8746N152K0303I2157Q920h4926j0644p8654j52957D3263
$$ 43223 -98438 -199398 -120652 -115500 -95197 92157 101077 -84926 -95570 -174224 -327181 43263
11130g5216k9054r1447C10777I1881P3822a8267l8376F8599a25945C44686e2140
$$ -75216 -104270 -195717 310777 91881 165703 -18267 -56643 68599 -125945 344686 -52140
11118F2568J23500a0283j29418C2124J19064J12019e4634B773J41429a89786A50019
$$ 62568 186068 -10283 -139701 32124 151188 263207 -54634 2773 144202 -189786 150019
11106A79834D1633K98064D6136A2723K14074l4219R2219b6245j77716A96396o0384
$$ 179834 41633 339697 46136 12723 226797 192578 284797 -26245 -203961 196396 136012
11095A36012O604M59168B53270J69615j28436j14982K16102c51441h4906B96930
$$ 136012 142616 601784 253270 422885 294449 179467 395569 -351441 -84906 296930
11084C05923A465K97454l561D5824J4326M0925J17200I5830J30310J64841M964
$$ 305923 1465 298919 295358 45824 60150 101075 218275 95830 226140 390981 395945
11073C95945H7045J86438N4890Q7563n0268J07009d7629C07091p5188j4146M17996
$$ 395945 87045 273483 328373 415936 365668 472677 -47629 307091 231903 217757 635753
11062F35753l15433K96190R4512C19625L84569k98156O6409L02169L8232q7286
$$ 635753 320320 616510 711022 319625 704194 406038 472447 774616 812848 725562
11052G25562k5357k10467K28443M1333C73482J55880L03193R8410j89274K37366
$$ 725562 700205 489738 718181 759514 373482 529362 832555 930965 741691 979057
11042I79057j95427o5792o9376L87L72859l22484J12311j25574J05116K5547C51998
$$ 979057 783630 717838 648462 648849 1021708 699224 811535 685961 791077 816624 351998
11030G12823l00630L47304j18875n736J24061C62837K53755J37340j33569K05444
$$ 712823 412193 759497 640622 634886 758947 362837 616592 753932 620363 825807
11020H25807k4204j71682r8076R1339Q6115l37532L29812j10308m7817Q782P6678
$$ 825807 801603 629921 531845 623184 709299 371767 701579 591271 543454 552236 628914
11009F28914j84756J65341j84329M39528k86545J22703J66720l22056K60558r4873
$$ 628914 444158 609499 425170 864698 578153 700856 867576 545520 806078 711205
10999G11205k31739K01089l315j39616N8104J14314L17920j53387l43767J17565
$$ 711205 479466 680555 677240 537624 595728 710042 1027962 874575 530808 648373
10989F48373J89823l30730K83698l2321K52671j0696J64305L7917k65261J83930
$$ 648373 838196 507466 791164 758843 1011514 1000818 1165123 1203040 937779 1121709
10979A121709j74283M02268M51633J26548P8371K29803k95715N34029q6833N59978
$$ 1121709 947426 1349694 1801327 1927875 2006246 2236049 1940334 2474363 2387530 2947508
10969B947508l56820M40036n59645j40449k49420p5360n3352J8527k01485L82811
$$ 2947508 2590688 3030724 2471079 2330630 2081210 2005850 1952498 1971025 1769540 2152351
10959B152351l75517Q3061j4680L06258j8382k08518j99431J228m70517l04623
$$ 2152351 1776834 1859895 1845215 2151473 2133091 1924573 1725142 1726370 1255853 951230
10949I51230L38568n22051k18310J77269C27463L01659k03901l0523n3666p3594
$$ 951230 1289798 767747 549437 726706 327463 629122 425221 394698 341032 267438
10939B67438j26556J02494J2726l1581B0184c9031J2931A12376O5559J0924B0175
$$ 267438 140882 243376 256102 224521 20184 -39031 -26100 112376 177935 188859 20175
10927C55665a27451N2512A35295Q8326f1600C10019a01751J4546G5667c4806p2754
$$ 355665 -127451 -74939 135295 223621 -61600 310019 -101751 -87205 75667 -34806 -107560
10916a07560G5243N548J2858c825C3346O5116i4542d1007B35526c38895a22124
$$ -107560 75243 80791 93649 -3825 33346 98462 -94542 -41007 235526 -338895 -122124
10904F5166a67345r466b0354A48873h2865C2967P2301J3848d0882A38352A6532
$$ 65166 -167345 -176811 -20354 148873 -82865 32967 105268 119116 -40882 138352 16532
10892a3059l59770C47016a64881B8932J9324b4987B9117e2064m8316J2341I350
$$ -13059 -372829 347016 -164881 28932 48256 -24987 29117 -52064 -100380 -88039 9350
10880A59849A9057a72359g4505m4685B29376b46467K5656D1184K257f2819C06685
$$ 159849 19057 -172359 -74505 -119190 229376 -246467 -220811 41184 43441 -62819 306685
10868a51182b5824j39772A73284D6738a20207F9876J42087p6597j6339A1170J93018
$$ -151182 -25824 -165596 173284 46738 -120207 69876 211963 135366 119027 11170 204188
10857B04188A5425b59739j0432A20375b61479R18C6435e1363j66017d1847D63696
$$ 204188 15425 -259739 -270171 120375 -261479 -260561 36435 -51363 -217380 -41847 463696
10845A69804p4896a16039d8630E2567J4030c41176R8641h9750j6093D92456a10123
$$ 169804 94908 -116039 -48630 52567 66597 -341176 -242535 -89750 -105843 492456 -110123
10833b44888e6663C52474j46238Q4087a97876c3496A36172k3867a20421A0290
$$ -244888 -56663 352474 206236 290323 -197876 -33496 136172 112305 -120421 10290
10822F2436a61904a0233A36876n4854i6823B08474o2411a07033B18173E2999j9102
$$ 62436 -161904 -10233 136876 82022 -96823 208474 146063 -107033 218173 52999 33897
10811C3897a74540g4408H0032J18239M3918M3396b68660e0322A03642a02451n7529
$$ 33897 -174540 -74408 80032 198271 242189 285585 -268660 -50322 103642 -102451 -159980
10800a59980a5991C1218a61160A07682i2172D3188m83G039M3406a33159A20570
$$ -159980 -15991 31218 -161160 107682 -92172 43188 42705 7039 50445 -133159 120570
10788E6044a6964A889J28838M79626a5465l15340A89099l3905h869k17745j43026
$$ 56044 -16964 1889 130727 610353 -15465 -330805 189099 155194 -8869 -226614 -369640
10777c69640E3244A237b32518e0961A37038c54251m9723a35580B0490d4679j29453
$$ -369640 53244 1237 -232518 -50961 137038 -354251 -403974 -135580 20490 -44679 -174132
10766a74132e0274j04565J7007k5598A42839a48073g2450k55533J10291l19255
$$ -174132 -50274 -154839 -137832 -163430 142839 -148073 -72450 -327983 -217692 -536947
10756e36947a04975J4619C51317i9671D25644A48600a15313K4757A15326J2715
$$ -536947 -104975 -90356 351317 -99671 425644 148600 -115313 -90556 115326 128041
10746A28041p620c221B78112n3842A5914b62751J19090j14863d2641l8597l4735
$$ 128041 120421 -3221 278112 224270 15914 -262751 -143661 -258524 -42641 -81238 -115973
10735a15973a6435q2183o248j71481C79709D0151f137A18369b60443a11406k01690
$$ -115973 -16435 -98618 -104866 -276347 379709 40151 -6137 118369 -260443 -111406 -313096
10724c13096A04014j0243A2494L36880b87694A19115d7017I294b04616O4662j22919
$$ -313096 104014 93771 12494 349374 -287694 119115 -47017 9294 -204616 -139954 -262873
10713b62873f2744q3772A81144i0034l94315A42281b74056J15461P8664k80088
$$ -262873 -62744 -146516 181144 -90034 -484349 142281 -274056 -158595 -79931 -360019
10703c60019d7190a9306k21708g255j80671p5440o8541B49955A0997J73022a55803
$$ -360019 -47190 -19306 -241014 -7255 -187926 -263366 -331907 249955 10997 184019 -155803
10691F5785b29265A29681c3556B9761a27136H9201b69707a25760B7796J78531
$$ 65785 -229265 129681 -33556 29761 -127136 89201 -269707 -125760 27796 206327
10681B06327C9387b83635J36089L3106B11643d8891j82784m0860B2109J37793
$$ 206327 39387 -283635 -147546 -114440 211643 -48891 -231675 -272535 22109 159902
10671A59902h8392c9344p3436A08033L1254J48137B8442P8646a46504N0993b8207
$$ 159902 -88392 -39344 -112780 108033 139287 287424 28442 107088 -146504 -95511 -28207
10659b83764D3300a02342k09839C37492M5040A2728b5552k00762A25731a86505
$$ -283764 43300 -102342 -312181 337492 382532 12728 -25552 -226314 125731 -186505
10648a06254A23863C6962b06770A34320c5164B75575H9376h2794j73778a17206
$$ -106254 123863 36962 -206770 134320 -35164 275575 89376 -82794 -256572 -117206
10637E8570a32421K8497B79928c29888a22978M6029j18911K2314q9120A41625
$$ 58570 -132421 -103924 279928 -329888 -122978 -76949 -195860 -173546 -262666 141625
10626a50328B34924m2033n051a50952d1088l5687J4024B9032b7554l9989o5195
$$ -150328 234924 192891 187840 -150952 -41088 -76775 -62751 29032 -27554 -67543 -132738
10615a32738A68969g851p5965r1426C3698a2458j27902L8407j14623b7904p2421
$$ -132738 168969 -7851 -83816 -175242 33698 -12458 -140360 -101953 -216576 -27904 -100325
10604a00325k1960A71925G2453a29035B52516j09815b34508j0823N2069A663a48429
$$ -100325 -122285 171925 72453 -129035 252516 142701 -234508 -245331 -193262 1663 -148429
10592I4736A0341a46274D4340a7170k05538A3214f8847a6428A01297e4191o5366
$$ 94736 10341 -146274 44340 -17170 -222708 13214 -68847 -16428 101297 -54191 -119557
10581a19557C32992h326l2164C872a10884M0787A64432g8945j36804H0087b58491
$$ -119557 332992 -8326 -40490 3872 -110884 -70097 164432 -78945 -215749 80087 -258491
10569A2862J92694o3212a25866i703k4606j37426G7584N9998a86962h2087r9096
$$ 12862 205556 142344 -125866 -9703 -34309 -171735 77584 137582 -186962 -82087 -181183
10558a81183A7980m635J50034J4780N1452b96484J13629M6147B51291A12732a55604
$$ -181183 17980 13345 163379 178159 229611 -296484 -182855 -136708 251291 112732 -155604
10546g3096o5656E3718a78430b225A89999b59794A27853B9695a23805A3335Q1056
$$ -73096 -138752 53718 -178430 -2225 189999 -259794 127853 29695 -123805 13335 94391
10535I4391B7393a66656c7060A61997c5064j41628e8018A303i3447A44430a10019
$$ 94391 27393 -166656 -37060 161997 -35064 -176692 -58018 1303 -93447 144430 -110019
10523b7969q1538A1961a80909c3133A19295e06501B26910i4982C61876g4985I060
$$ -27969 -109507 11961 -180909 -33133 119295 -506501 226910 -94982 361876 -74985 9060
10511B9709O0005f4496k7546m9629H2941a25777B24915b3928B18591J06716j9954
$$ 29709 89714 -64496 -92042 -141671 82941 -125777 224915 -23928 218591 325307 305353
10500C05353c42618B71540a87152C5386h4177L1096k0882l88742C96555h6808
$$ 305353 -342618 271540 -187152 35386 -84177 -53081 -73963 -462705 396555 -86808
10489e20925b25175A6058f6556a6824k7637C4544J12226Q9127K73740A33377K19361
$$ -520925 -225175 16058 -66556 -16824 -44461 34544 146770 235897 509637 133377 352738
10478C52738k6270K03679k33213l5579J30246a37723D0828J54883D8170a02443
$$ 352738 326468 530147 296934 261355 391601 -137723 40828 195711 48170 -102443
10467B0935J68034q4830N6281J7428b26395i4916j8924A17971j1285J80315b67637
$$ 20935 188969 104139 160420 177848 -226395 -94916 -113840 117971 106686 287001 -267637
10455A10228b95683J27501d52l7030A990a07338A96274B5173O8600c23548A25716
$$ 110228 -295683 -168182 -452 -37482 1990 -107338 196274 25173 93773 -323548 125716
10443h7061E1359a76774f7416E1635b46691F15304b10995M8890g3653j69123m2257
$$ -87061 51359 -176774 -67416 51635 -246691 615304 -210995 -162105 -73653 -242776 -285033
10432b85033B3110c577j25586A18849E8924J8999b53635H8821A4319M4269K09980
$$ -285033 23110 -3577 -129163 118849 58924 77923 -253635 88821 14319 58588 268568
10421B68568b68907I8394L6714b73473B96524A35028J54211I472h1225E4694g2762
$$ 268568 -268907 98394 135108 -273473 296524 135028 289239 9472 -81225 54694 -72762
10409F8792b64016I9477a43604c1082C1128L74841A52421c1018o2776l7258j09612
$$ 68792 -264016 99477 -143604 -31082 31128 405969 152421 -31018 -93794 -131052 -240664
10398b40664A52885a21196A16065J63369j33977c3913k1435H1754R3890K13267
$$ -240664 152885 -121196 116065 279434 145457 -33913 -55348 81754 175644 388911
10388C88911d2609C29159B6271Q3659J08441d8739B45071A08443b24464C85123
$$ 388911 -42609 329159 26271 109930 218371 -48739 245071 108443 -224464 385123
10377g0312I4391O48J17416r5063J68212M8719O7337J18061B06929q7824K32038
$$ -70312 94391 95039 212455 117392 285604 334323 401660 519721 206929 119105 351143
10366C51143R7195D3677A8875M32391j54136O8281a57397P3923B48126e584C36734
$$ 351143 448338 43677 18875 451266 297130 365411 -157397 -83474 248126 -5584 336734
10354E4440J19034M32529B76993A35705M42562j99893N069m4375H5916L13637
$$ 54440 173474 606003 276993 135705 578267 378374 383443 339068 85916 399553
10344C99553K43803j95650k14781M0930L26593E4913b50036C51953o0350R9160
$$ 399553 643356 447706 232925 273855 600448 54913 -250036 351953 291603 390763
10334C90763m1499r930d6266K2826F00727G34K71237A6688J1217r995a35406B22378
$$ 390763 349264 339334 -46266 -23440 600727 734 271971 16688 27905 17910 -135406 222378
10321E20396B44857K6865k192c4385F5104P0390c7133H6888a85123A43344h1654
$$ 520396 244857 271722 269530 -34385 65104 135494 -37133 86888 -185123 143344 -81654
10309B09944a27373d4239A27213f1253p6700d4114a5019A04621A2843f4186K6786
$$ 209944 -127373 -44239 127213 -61253 -137953 -44114 -15019 104621 12843 -64186 -37400
10298c7400C5290b10299j41279k5549e2723o0608c8530k45071A74750B9234a10606
$$ -37400 35290 -210299 -351578 -377127 -52723 -113331 -38530 -283601 174750 29234 -110606
10286c11816A05493k628b55595K6394I975b48202D6043a25022B832R5792M9997
$$ -311816 105493 102865 -255595 -229201 9975 -248202 46043 -125022 2832 98624 148621
10275A48621n6280e2083j56060J3531e5897m3247j57298D1618b4173j9074k01575
$$ 148621 92341 -52083 -208143 -194612 -55897 -99144 -256442 41618 -24173 -43247 -244822
10264b44822c8054A15952A1800L10171j571L66672k94973J30444j26645j48653
$$ -244822 -38054 115952 11800 321971 320400 687072 392099 522543 395898 247245
10254B47245a00254B80481a15308B90069b38943j0610b0127k1078G0006B2755
$$ 247245 -100254 280481 -115308 290069 -238943 -249553 -20127 -41205 70006 22755
10243h3801E4889d85535C65777C2456d45675c0843j35239M2466H6178G057K7259
$$ -83801 54889 -485535 365777 32456 -445675 -30843 -166082 -123616 86178 7057 34316
10232C4316a57618m1813R2285B8355b23048C6444J30360J2182a90735d5967B50712
$$ 34316 -157618 -199431 -107146 28355 -223048 36444 166804 178986 -190735 -45967 250712
10220g6869B70445c76676J65974j28610A03001e033A34503l9737a43652A18160
$$ -76869 270445 -376676 -210702 -339312 103001 -5033 134503 94766 -143652 118160
10209b19216A5039J31075b89559A8935K13382a87254h6319o3533j82149i6103
$$ -219216 15039 146114 -289559 18935 232317 -187254 -86319 -149852 -332001 -96103
10198a64822r4567G4443b41116C6272a95522A54676b21789F5545a29460M1857
$$ -164822 -259389 74443 -241116 36272 -195522 154676 -221789 65545 -129460 -87603
10188h7603a350j56801e4362C36629a22985A87782a14682B4218c8645A74625a68637
$$ -87603 -1350 -158151 -54362 336629 -122985 187782 -114682 24218 -38645 174625 -168637
10176b56972N7492a0566A94508d5280C92863H6911B3905c87592C9688c89874e1100
$$ -256972 -199480 -10566 194508 -45280 392863 86911 23905 -387592 39688 -389874 -51100
10164A17633a41445n3062R176k4619j0070e983C24337a90198p97a5273k18462
$$ 117633 -141445 -194507 -185331 -209950 -220020 -5983 324337 -190198 -190995 -15273 -233735
10153b33735O3176c2117j95549q3844B06081b08020D1221L5464a33921l4567H0836
$$ -233735 -170559 -32117 -227666 -311510 206081 -208020 41221 76685 -133921 -168488 80836
10141a0879o6016D1222b6870l58385C0649b4551j71548G911J68550a22913j74504
$$ -10879 -76895 41222 -26870 -385255 30649 -24551 -196099 7911 176461 -122913 -297417
10130b97417J41780L4240k95565a27558L3902k15296E7271c61225B27269a17363
$$ -297417 -155637 -121397 -416962 -127558 -93656 -308952 57271 -361225 227269 -117363
10119a21102a2344B8627N0115K90615m7271p9379D7532h7274m4677B3220b50631
$$ -121102 -12344 28627 78742 369357 322086 242707 47532 -87274 -131951 23220 -250631
10107b87566D245g1759A00418D5754c25764A76395a08916k17104A65360J08386
$$ -287566 4245 -71759 100418 45754 -325764 176395 -108916 -326020 165360 273746
10097B73746e1789j80669n5629F2711b06139e5148j99470F7986B1570i9715p2225
$$ 273746 -51789 -232458 -288087 62711 -206139 -55148 -254618 67986 21570 -99715 -171940
10086a71940b5499j38043A30348N999K1052b87890c2519A17181l1202c3334A82770
$$ -171940 -25499 -163542 130348 136347 157399 -287890 -32519 117181 85979 -33334 182770
10074b27722K9648f3154B89614G1645d79930K03623j4844D8507E039K05633r8583
$$ -227722 -198074 -63154 289614 71645 -479930 -276307 -291151 48507 5039 210672 112089
10063A12089Q7151H943c08895C05862A6899g2646C4414a93356d5117D3494b2166
$$ 112089 199240 8943 -308895 305862 16899 -72646 34414 -193356 -45117 43494 -22166
10051d0174E3503L12167a96332A72934B6642h6058B29279a3311B7563P4686c3670
$$ -40174 53503 365670 -196332 172934 26642 -86058 229279 -13311 27563 102249 -33670
10039c61498g6776m6867L0978j06102H8350a31531F5790a24455H3202g3961J4834
$$ -361498 -76776 -123643 -92665 -198767 88350 -131531 65790 -124455 83202 -73961 -59127
10028e9127k00847a19787J5931j25915i7719k45048a42863l16095b4090h393l54541
$$ -59127 -259974 -119787 -103856 -229771 -97719 -342767 -142863 -458958 -24090 -8393 -362934
10017c62934A309K13859a51122b5903B7225b14767O2744H945J15662b23273P869
$$ -362934 1309 215168 -151122 -25903 27225 -214767 -152023 8945 124607 -223273 -215404
10006b15404h2637A13992b33761C3447k744M1790J75597a61823B14570b07784
$$ -215404 -82637 113992 -233761 33447 30703 72493 248090 -161823 214570 -207784
9995f61661f7341B85643C0044b18158D81155a30469O4499r0329M9877c6160m1215
$$ -661661 -67341 285643 30044 -218158 481155 -130469 -65970 -156299 -106422 -36160 -77375
9984g7375l59888D7529e14484a81964I6306L919a17297B5579c32891a09866f437
$$ -77375 -437263 47529 -514484 -181964 96306 100225 -117297 25579 -332891 -109866 -6437
9972b03020E89743k00657j93284G4709d4206j29037j89313a34802b9091D27608
$$ -203020 589743 389086 195802 74709 -44206 -173243 -362556 -134802 -29091 427608
9961a86924R440p5952g6834K2951g143j09378k27721N9565c2192j8909l82459
$$ -186924 -177484 -253436 -76834 -53883 -7143 -116521 -344242 -284677 -32192 -51101 -433560
9950d33560q8535A7798i7774j16404A38479a86941k18465a70679M9161D07528
$$ -433560 -522095 17798 -97774 -214178 138479 -186941 -405406 -170679 -121518 407528
9939a98669B07031B3770a26575j4281d3495m1287j4631j01588E6850b15860B2965
$$ -198669 207031 23770 -126575 -140856 -43495 -84782 -99413 -201001 56850 -215860 22965
9927a26190I8308b27271d3296j84966D8990b01820F9809b27726R6315A83193H9276
$$ -126190 98308 -227271 -43296 -228262 48990 -201820 69809 -227726 -131411 183193 89276
9915B29432d00548G2774F901M2187f6681A64312h4814L0191A14448a52676b6491
$$ 229432 -400548 72774 6901 49088 -66681 164312 -84814 -54623 114448 -152676 -26491
9903A94714k9315a40160A48088a64093A07752a84994A32138b30113F5886b38420
$$ 194714 165399 -140160 148088 -164093 107752 -184994 132138 -230113 65886 -238420
9892A87412c97889e9100b9107A89197a24474A39404c9653k41473k0939H255f2641
$$ 187412 -397889 -59100 -29107 189197 -124474 139404 -39653 -281126 -302065 8255 -62641
9880B5315J78540a99198P1127k26607I9946J41942F2725e8082e298j27163C3534
$$ 25315 203855 -199198 -128071 -354678 99946 241888 62725 -58082 -5298 -132461 33534
9868b16339i3261j36003A98921a94517m7079D5179b35494A20726D393a60584k46183
$$ -216339 -93261 -229264 198921 -194517 -241596 45179 -235494 120726 4393 -160584 -406767
9857d06767D5283a5987A49547K3499a71127B62150a50127l79783A00632l9534
$$ -406767 45283 -15987 149547 173046 -171127 262150 -150127 -529910 100632 61098
9847F1098J58707e8494A98217g5986n4106B9541a88935j7977O7197o6593A31496
$$ 61098 219805 -58494 198217 -75986 -130092 29541 -188935 -206912 -139715 -206308 131496
9835d509B7499j3547J10764c46712g5811l19360a26347C6187b13710D22070a99100
$$ -4509 27499 13952 124716 -346712 -75811 -395171 -126347 36187 -213710 422070 -199100
9823a45615E8810k8162b3854j80078p8945A05934a76278J9674f1432k30676a7022
$$ -145615 58810 30648 -23854 -203932 -282877 105934 -176278 -156604 -61432 -292108 -17022
9811a9216j20566a4603l0219m0006k02874N3111A5930g9357B09307b19710N2509
$$ -19216 -139782 -14603 -44822 -84828 -287702 -234591 15930 -79357 209307 -219710 -167201
9800a67201a5858A25572a44114L0950B00870d5367k26842j81015J20542c0342
$$ -167201 -15858 125572 -144114 -113164 200870 -45367 -272209 -453224 -332682 -30342
9789F6356B981b65901A67101a75069F7086c90081A49513a16693j03643A76860
$$ 66356 2981 -265901 167101 -175069 67086 -390081 149513 -116693 -220336 176860
9778b52086J10185B6258J23549a93262f9867K5614l05874J56778A59207n7502
$$ -252086 -141901 26258 149807 -193262 -69867 -44253 -350127 -193349 159207 101705
9768A01705j468a9093F1582K53273A05419K34586a71294A21545a33963j50388
$$ 101705 100237 -19093 61582 314855 105419 340005 -171294 121545 -133963 -284351
9758b84351a06263C8759J59099A8698e9780C3489K14188B866a44826l653a5858
$$ -284351 -106263 38759 197858 18698 -59780 33489 247677 2866 -144826 -148479 -15858
9746G0882a83359B33977i2869I1963c86115A1332f3586H9430a66658M5620c8490
$$ 70882 -183359 233977 -92869 91963 -386115 11332 -63586 89430 -166658 -121038 -38490
9734b51053A94570c52880M6683A56972c18066B7838K67291f244n5592k35843O6275
$$ -251053 194570 -352880 -306197 156972 -318066 27838 295129 -6244 -61836 -297679 -231404
9723b31404A49228F1906c7086D0564a46420j49443r0139J64826b3909D0139a17029
$$ -231404 149228 61906 -37086 40564 -146420 -295863 -386002 -221176 -23909 40139 -117029
9711a74009H4536a58958M4771N6592G0859A3843N7715N8717F0204B0727J24257
$$ -174009 84536 -158958 -114187 -57595 70859 13843 71558 130275 60204 20727 144984
9700A44984a54008P0365C0470f5850g206A7711d8097G3010i6959k76604Q9940
$$ 144984 -154008 -83643 30470 -65850 -7206 17711 -48097 73010 -96959 -373563 -283623
9689b83623d0024m2136a7414p7985j05128c9404k72915F217P0228R7525b333k12428
$$ -283623 -40024 -82160 -17414 -95399 -200527 -39404 -312319 6217 76445 173970 -2333 -214761
9677b14761A83770p4278b43353f9122A50989b42908B0806b4574A34066a9208m09094
$$ -214761 183770 109492 -243353 -69122 150989 -242908 20806 -24574 134066 -19208 -428302
9666d28302A04140b01597H6782a50940A44891a7348I2699h1613o4293j25801j35617
$$ -428302 104140 -201597 86782 -150940 144891 -17348 92699 -81613 -145906 -271707 -407324
9655d07324c9307q9627O1325r2965L30E5355K9129e52307I3439f3054j94179q364
$$ -407324 -39307 -128934 -67609 -160574 -160244 55355 84484 -552307 93439 -63054 -257233 -265597
9643b65597A77146d05146A41143E2373J11532l8109a79540B46974b81285a17711
$$ -265597 177146 -405146 141143 52373 163905 125796 -179540 246974 -281285 -117711
9632D33414i026n8261B20921h9839A80692b96909A48337N6474B5451i8176a2079
$$ 433414 -9026 -67287 220921 -89839 180692 -296909 148337 204811 25451 -98176 -12079
9620b20653A6460c1194B7940Q8745P1129a49516j47802E6149i1408j04344J7022
$$ -220653 16460 -31194 27940 116685 187814 -149516 -297318 56149 -91408 -195752 -178730
9609a78730N2081H6691F545a11168l08758a54468L2873J0844M466j04305F7394
$$ -178730 -126649 86691 6545 -111168 -419926 -154468 -121595 -110751 -106285 -210590 67394
9597D2252a90346O5039d7715B04561J8013b49177n4384A46621C351a60707l2897
$$ 42252 -190346 -125307 -47715 204561 222574 -249177 -303561 146621 3351 -160707 -193604
9586a93604p270O330g6534C55153A2770J10234A8381a06939m8560p8233J3311
$$ -193604 -200874 -194544 -76534 355153 12770 123004 18381 -106939 -155499 -233732 -220421
9575b20421A70515b06061k85025H0879I646J805L1171L7778b8786E1007a07061
$$ -220421 170515 -206061 -491086 80879 9646 11451 42622 80400 -28786 51007 -107061
9563a35715J0630e5240A40566K00227j47571d07272J04486L9095D4977a91457
$$ -135715 -125085 -55240 140566 340793 193222 -407272 -302786 -263691 44977 -191457
9552H7729m308l3668K3597N2463A7313l647a19392j3395j66885A85594J44295
$$ 87729 83421 49753 73350 125813 17313 13666 -119392 -132787 -299672 185594 329889
9541C29889a44892j35454b5641N080j16992A60970i5563F6609a28402A34789a0375
$$ 329889 -144892 -280346 -25641 -20561 -137553 160970 -95563 66609 -128402 134789 -10375
9529a71524B03446a92131A26495l608b66472C6375c51032A86108A6447a63027
$$ -171524 203446 -192131 126495 122887 -266472 36375 -351032 186108 16447 -163027
9518a6008m2390j71353A2741g3406E5659A9142O6828j4636a16957j7680A62876
$$ -16008 -58398 -229751 12741 -73406 55659 19142 85970 71334 -116957 -134637 162876
9506H7962f4594m8809M3684r6835L6326k6862k19114g7807j53000A65438F3394
$$ 87962 -64594 -113403 -69719 -166554 -130228 -157090 -376204 -77807 -230807 165438 63394
9494c22883E9223A6289K68493a52400E9535d3548j09201G7204a58253B618a9678
$$ -322883 59223 16289 284782 -152400 59535 -43548 -152749 77204 -158253 2618 -19678
9482b87026E9567a61468c2917J5021l90507C6008A4396h2623j63037A06164C1738
$$ -287026 59567 -161468 -32917 -17896 -408403 36008 14396 -82623 -245660 106164 31738
9470c0780k50059a3331l44060b8445k85727A96699d87788K24663a05023A74239
$$ -30780 -280839 -13331 -357391 -28445 -314172 196699 -487788 -263125 -105023 174239
9459E0784a54176C84590A39245c47380m8453H2772N2606j4892E106L4465J47949
$$ 50784 -154176 384590 139245 -347380 -395833 82772 135378 120486 5106 39571 187520
9448A87520a04491P076B0588Q4328b72371E262J35980g7725I0067c0703D4867
$$ 187520 -104491 -97415 20588 104916 -272371 5262 141242 -77725 90067 -30703 44867
9436c65628H8992a98320e9012j8458j98519b3450j64391f5615j09747J0146j43819
$$ -365628 88992 -198320 -59012 -77470 -275989 -23450 -187841 -65615 -175362 -165216 -309035
9425c09035i0185p8817I1226c07714B11713c220J582j48780M1432G826k214a26027
$$ -309035 -90185 -169002 91226 -307714 211713 -3220 -1638 -150418 -108986 7826 5612 -126027
9412b69075J15804L4052A73222J1963b57836a5328j00603A16783a70836I425i0690
$$ -269075 -153271 -119219 173222 185185 -257836 -15328 -115931 116783 -170836 9425 -90690
9400d11463Q3812a47350A35809a17746k09603A2937b8228j89255A82197p4560
$$ -411463 -327651 -147350 135809 -117746 -327349 12937 -28228 -217483 182197 107637
9390A07637d03535J15378J01920B01216A7341L1711Q120A6443a25940G3117d6226
$$ 107637 -403535 -288157 -186237 201216 17341 49052 57172 16443 -125940 73117 -46226
9378a7849N244k54700N2905c7915j9591j84637e4534F5112h600j77614m3266h744
$$ -17849 -12605 -267305 -214400 -37915 -57506 -242143 -54534 65112 -8600 -186214 -229480 -8744
9365a34463r0068b7538I3219a50814b6741n1151G05L4925a73984Q6415k59638
$$ -134463 -224531 -27538 93219 -150814 -26741 -77892 705 35630 -173984 -87569 -347207
9354c47207a40671M2248j10045A07721c4898A87232f5079A62663b86996a4152
$$ -347207 -140671 -98423 -208468 107721 -34898 187232 -65079 162663 -286996 -14152
9343B50683a28348j37339E5278b32480b4039A22644b98175b3870j41002K1778
$$ 250683 -128348 -265687 55278 -232480 -24039 122644 -298175 -23870 -164872 -143094
9333a43094A14985B7063J17996h418j42734e0485A84167a01035j18046A67168
$$ -143094 114985 27063 145059 -8418 -151152 -50485 184167 -101035 -219081 167168
9322a43978o3325Q6289K2961M2266A17171Q9722b11216K2928C2119b07729M9907
$$ -143978 -207303 -121014 -98053 -55787 117171 206893 -211216 -188288 32119 -207729 -157822
9311a57822f8682B39508a76735f6467F8051G464a89100B7655J06795O0793A0928
$$ -157822 -68682 239508 -176735 -66467 68051 7464 -189100 27655 134450 195243 10928
9299b3830m64383B55779J13862j30334a98351h9801j95984A62587b8432G3751
$$ -23830 -488213 255779 369641 239307 -198351 -89801 -285785 162587 -28432 73751
9288a17270A16094e8537a0329A78090d26886a39333d3068G3224c7302j4669C1958
$$ -117270 116094 -58537 -10329 178090 -426886 -139333 -43068 73224 -37302 -51971 31958
9276A1648a19595G6821b2285j80848Q7348G261K60249A32458d26032J65196C548
$$ 11648 -119595 76821 -22285 -203133 -115785 7261 267510 132458 -426032 -260836 3548
9264c3455A25757a32550C0100b5422j66726j17914J44636O9836A47621J7821B444
$$ -33455 125757 -132550 30100 -25422 -192148 -310062 -165426 -95590 147621 165442 2444
9252b25902I9717B4194a64595c0302j66512b1493B1109a62448k9627e5191O503
$$ -225902 99717 24194 -164595 -30302 -196814 -21493 21109 -162448 -192075 -55191 -48688
9241d8688l712j06119B07606l1808b36903J14934l6511C8759h5476O464A42773
$$ -48688 -52400 -158519 207606 175798 -236903 -121969 -158480 38759 -85476 -79012 142773
9229a65412c7237B7002a32915n1356j25299f1404A61302A1474J04441C9037j3918
$$ -165412 -37237 27002 -132915 -184271 -309570 -61404 161302 11474 115915 39037 25119
9218B5119g4456O356k70870A36299l1401b983A33262b48354A22376l3887b71499
$$ 25119 -74456 -68100 -338970 136299 104898 -2983 133262 -248354 122376 88489 -271499
9206D9346c85276g2401l1445a2108j11320e1214B07550a24049M0359p7035E7320
$$ 49346 -385276 -72401 -103846 -12108 -123428 -51214 207550 -124049 -83690 -160725 57320
9194C1480L931c77387O8316e7377K2389j21264B1432d6987j88401E2649a86567
$$ 31480 35411 -377387 -309071 -57377 -34988 -156252 21432 -46987 -235388 52649 -186567
9182B72824e2408G5750B5666d7650j58899n5508j18560a00911j22294A82063d67
$$ 272824 -52408 75750 25666 -47650 -206549 -262057 -380617 -100911 -223205 182063 -467
9170b40088i8698P607C1348J31513a37522O8497A70758h1608A38276J11485g3977
$$ -240088 -98698 -91091 31348 162861 -137522 -69025 170758 -81608 138276 249761 -73977
9158C27449c816A25391a39151L6080j72961A27667a48320n4491I4417j7044g0835
$$ 327449 -3816 125391 -139151 -103071 -276032 127667 -148320 -202811 94417 77373 -70835
9146f0346F4231b29291j73877e9367j34725b0334I7861c01458B72247I6429m6534
$$ -60346 64231 -229291 -403168 -59367 -194092 -20334 97861 -301458 272247 96429 49895
9135D9895a66955A9383J5880M853i256A04396C995b17266h1802j23713b5648k01399
$$ 49895 -166955 19383 35263 40116 -9256 104396 3995 -217266 -81802 -205515 -25648 -227047
9123b27047B1818b63131a09062m0649j20985A95148d17601a99291f2760A15157
$$ -227047 21818 -263131 -109062 -149711 -270696 195148 -417601 -199291 -62760 115157
9112c55621N6814A77982F0861c6450j55275b4736I90J53707B0309a26469N2074
$$ -355621 -298807 177982 60861 -36450 -191725 -24736 990 154697 20309 -126469 -74395
9101g4395F9985L46782e2267D1712L023O803h1179D5061h6404a0036k0256k3799
$$ -74395 69985 416767 -52267 41712 44735 51538 -81179 45061 -86404 -10036 -30292 -54091
9089e4091k25748j35735G616a30376n7475M8550B4803N3559e5822D1184a07324
$$ -54091 -279839 -415574 7616 -130376 -187851 -139301 24803 78362 -55822 41184 -107324
9077A5492b74741b406j36788e3522j79841C3573K8906J9305b74554a03297E8114
$$ 15492 -274741 -2406 -139194 -53522 -233363 33573 62479 81784 -274554 -103297 58114
9065a43743B55892m5846H1483J4851a62915A18663h9637M640B8546c85987a14438
$$ -143743 255892 210046 81483 96334 -162915 118663 -89637 -84997 28546 -385987 -114438
9053a05588p8003B2740a93052H1875l5264b6097n12051B26879b21706d5630A56209
$$ -105588 -183591 22740 -193052 81875 46611 -26097 -538148 226879 -221706 -45630 156209
9041a95606C1458P6189a94278f3915q0704K9514j04214p7600A39387J04499q5138
$$ -195606 31458 107647 -194278 -63915 -144619 -115105 -219319 -296919 139387 243886 158748
9030A58748c28058e6048j3910O638E0409a33964R889C35906a80437e1955J9763
$$ 158748 -328058 -56048 -69958 -63320 50409 -133964 -124075 335906 -180437 -51955 -32192
9019c2192A10886a48988d7540B41700c9999K952j93116g9456l9124A40531E8245
$$ -32192 110886 -148988 -47540 241700 -39999 -37047 -230163 -79456 -118580 140531 58245
9007a41549F7147a49384d9628B39828a17737A25193O52a28158q8949a01121d3730
$$ -141549 67147 -149384 -49628 239828 -117737 125193 125845 -128158 -217107 -101121 -43730
8995a2995p2112A0740K61718c6959H5795a38544E0774a51043j56563A55542f4397
$$ -12995 -85107 10740 272458 -36959 85795 -138544 50774 -151043 -307606 155542 -64397
8983i434l6794B71637d900l9461j29871I6593J13391a10062C55959b67633A6299
$$ -9434 -46228 271637 -4900 -44361 -174232 96593 209984 -110062 355959 -267633 16299
8971A30667L3345E6785a79197m5696B5433b95466c8467A10801i5596C5383J434
$$ 130667 164012 56785 -179197 -224893 25433 -295466 -38467 110801 -95596 35383 36817
8960C6817N0345d56454F7982h3447j37765L8783A89104i7777E6505a91584a5692
$$ 36817 87162 -456454 67982 -83447 -221212 -182429 189104 -97777 56505 -191584 -15692
8948a55358A16261L6424k7000a4398G4293e89937a68453A10413a16413j26833
$$ -155358 116261 152685 125685 -14398 74293 -589937 -168453 110413 -116413 -243246
8938b43246b834j98197D11601H0293d3693k82882b0163p0059l47B65369a2988
$$ -243246 -2834 -201031 411601 80293 -43693 -326575 -20163 -90222 -90569 265369 -12988
8926b65516A4971K14761M1562Q74299J975784M014260A634506C20918l9959J15104
$$ -265516 14971 229732 271294 1145593 3121377 7135637 1634506 320918 280959 396063
8916C96063c7124A25122b00550C5649d74756A37650c119G6671M82795e5638K0673
$$ 396063 -37124 125122 -200550 35649 -474756 137650 -3119 76671 559466 -55638 -34965
8905c4965k5023j76643A59424a00180B70076c54809a61270F8161f1649n4353K8867
$$ -34965 -59988 -236631 159424 -100180 270076 -354809 -161270 68161 -61649 -116002 -87135
8894h7135m3651o4391L2336n9881N0903O5948K8407j8956n4403A9416J5420a37370
$$ -87135 -130786 -195177 -162841 -222722 -171819 -105871 -77464 -96420 -150823 19416 34836 -137370
8881a25032r863A37832f2979k47165e2184H0891B9050b22733B61284P9393b2575
$$ -125032 -134895 137832 -62979 -310144 -52184 80891 29050 -222733 261284 340677 -22575
8869g0085j54414B6572a65896q6341j88977A18551a93192A14436c17649J02108
$$ -70085 -224499 26572 -165896 -252237 -441214 118551 -193192 114436 -317649 -215541
8859b15541A88884b0454l24228a49393k138G6099a08596B13318b03025J5704g0050
$$ -215541 188884 -20454 -344682 -149393 -151531 76099 -108596 213318 -203025 -187321 -70050
$$ [...]
##END NTUPLES=NMR SPECTRUM
##END=
