##TITLE=AC1675_BRAAN14383_8571173_fninPGIxMx
##JCAMPDX= 6.0         $$ Bruker NMR JCAMP-DX V2.0
##DATA TYPE= NMR SPECTRUM
##DATA CLASS= NTUPLES
##ORIGIN= BRUKER
##OWNER= Administrator
$$ 1.72 TOPSPIN		Version 2.1
$$ 2014-04-11 15:23:12.874 -0700  Administrator@X
$$ Compression mode = diff/dup
##.OBSERVE FREQUENCY= 400.02188249412
##.OBSERVE NUCLEUS= ^1H
##.ACQUISITION MODE= SIMULTANEOUS (DQD)
##.ACQUISITION SCHEME= undefined
##.AVERAGES= 64
##.DIGITISER RES= 22
##SPECTROMETER/DATA SYSTEM= spect
##.PULSE SEQUENCE= noesygpps1d.comp
##.SOLVENT NAME= COFFEE_meoh
##.SHIFT REFERENCE= INTERNAL, COFFEE_meoh, 1, 14.96113
##AUDIT TRAIL= $$ (NUMBER, WHEN, WHO, WHERE, PROCESS, VERSION, WHAT)
$$ ##TITLE= Audit trail, TOPSPIN		Version 2.1
$$ ##JCAMPDX= 5.01
$$ ##ORIGIN= Bruker BioSpin GmbH
$$ ##OWNER= Administrator
$$ $$ E:\/data/COFFEE/nmr/AC1675_BRAAN14383_8571173_fninPGIxMx/12/pdata/1/auditp.txt
$$ ##AUDIT TRAIL=  $$ (NUMBER, WHEN, WHO, WHERE, PROCESS, VERSION, WHAT)
(   1,<2014-04-11 15:23:08.439 -0700>,<Administrator>,<X>,<go>,<TOPSPIN 2.1>,
      <created by zg
	started at 2014-04-11 15:11:35.459 -0700,
	POWCHK enabled, PULCHK disabled,
       configuration hash MD5:
       C8 4E 4E 5D D3 5C D8 9E 9F 52 82 E0 59 8A DE 15
       data hash MD5: 64K
       8D 1D 9F 01 F5 5A 25 2B 25 F5 DF 29 6F 2F C3 BF>)
(   2,<2014-04-11 15:23:11.154 -0700>,<Administrator>,<X>,<proc1d>,<TOPSPIN 2.1>,
      <Start of raw data processing
       efp LB = 0.3 FT_mod = 6 PKNL = 1 PHC0 = 0 PHC1 = 0 SI = 128K 
       data hash MD5: 128K
       36 B6 EC DC 14 2E 79 2F 26 38 EB CD E0 C8 F3 28>)
(   3,<2014-04-11 15:23:11.973 -0700>,<Administrator>,<X>,<proc1d>,<TOPSPIN 2.1>,
      <pk PHC0 = -84.19922 PHC1 = 0 
       data hash MD5: 128K
       7A 06 E4 12 96 25 C2 77 05 DC 76 05 26 F3 05 64>)
(   4,<2014-04-11 15:23:12.355 -0700>,<Administrator>,<X>,<proc1d>,<TOPSPIN 2.1>,
      <abs ABSG = 1 
       data hash MD5: 128K
       83 9F B5 C4 D6 EC 8B 5E 83 2E CB 6D 0E 1E 6B 39>)
(   5,<2014-04-11 15:23:12.451 -0700>,<Administrator>,<X>,<proc1d>,<TOPSPIN 2.1>,
      <abs ABSG = 2 
       data hash MD5: 128K
       F6 E6 BB 85 2B 64 8C D4 8A 51 99 01 D1 C3 2D 43>)
(   6,<2014-04-11 15:23:12.546 -0700>,<Administrator>,<X>,<proc1d>,<TOPSPIN 2.1>,
      <abs ABSG = 3 
       data hash MD5: 128K
       69 8A BE B5 F7 10 12 03 08 3E 82 27 23 7C 66 9D>)
(   7,<2014-04-11 15:23:12.628 -0700>,<Administrator>,<X>,<proc1d>,<TOPSPIN 2.1>,
      <abs ABSG = 4 
       data hash MD5: 128K
       A4 5D 80 A6 2B 07 A2 22 D1 44 C8 4A 44 DB A4 5C>)
(   8,<2014-04-11 15:23:12.710 -0700>,<Administrator>,<X>,<proc1d>,<TOPSPIN 2.1>,
      <abs ABSG = 5 
       data hash MD5: 128K
       08 C0 9E FB 7C 57 52 F8 87 AE D6 CF 1D 9D 6D 52>)
$$ ##END=
$$ 
$$ $$ hash MD5
$$ $$ DB 44 3A CF EB 91 ED 6B 61 27 2A 49 04 55 27 F6
##$RELAX= 
##$RELAX= 
##$RELAX= 
##$RELAX= 
##$RELAX= 
##$RELAX= 
##$RELAX= 
##$RELAX= 
$$ Bruker specific parameters
$$ --------------------------
##$DU= <E:\>
##$EXPNO= 12
$$ [...]
##$TP07= 0
##$TPNAME0= <>
##$TPNAME1= <>
##$TPNAME2= <>
##$TPNAME3= <>
##$TPNAME4= <>
##$TPNAME5= <>
##$TPNAME6= <>
##$TPNAME7= <>
##$TPOAL= (0..7)
0.5 0.5 0.5 0.5 0.5 0.5 0.5 0.5
##$TPOFFS= (0..7)
0 0 0 0 0 0 0 0
##$TUNHIN= 0
##$TUNHOUT= 0
##$TUNXOUT= 0
##$USERA1= <user>
##$USERA2= <user>
##$USERA3= <user>
##$USERA4= <user>
##$USERA5= <user>
##$V9= 5
##$VALIST= <valist>
##$VCLIST= <CCCCCCCCCCCCCCC>
##$VD= 0
##$VDLIST= <DDDDDDDDDDDDDDD>
##$VPLIST= <PPPPPPPPPPPPPPP>
##$VTLIST= <TTTTTTTTTTTTTTT>
##$WBST= 1024
##$WBSW= 4
##$XGAIN= (0..3)
0 0 0 0
##$XL= 0
##$YL= 0
##$YMAX_a= 6062827
##$YMIN_a= -12826378
##$ZGOPTNS= <>
##$ZL1= 120
##$ZL2= 120
##$ZL3= 120
##$ZL4= 120
##$ABSF1= 14.96113
##$ABSF2= -5.597052
##$ABSG= 5
##$ABSL= 3
##$ALPHA= 0
##$AQORDER= 0
##$ASSFAC= 0
##$ASSFACI= 0
##$ASSFACX= 0
##$ASSWID= 0
##$AUNMP= <proc_prof1d_extract.lims>
##$AXLEFT= 0
##$AXNAME= <>
##$AXNUC= <1H>
##$AXRIGHT= 0
##$AXTYPE= 0
##$AXUNIT= <>
##$AZFE= 0.1
##$AZFW= 0.1
##$BCFW= 0
##$BC_mod= 0
##$BYTORDP= 0
##$COROFFS= 0
##$CY= 15
##$DATMOD= 1
##$DC= 0
##$DFILT= <>
##$DTYPP= 0
##$F1P= 0
##$F2P= 0
##$FCOR= 0.5
##$FTSIZE= 131072
##$FT_mod= 6
##$GAMMA= 0
##$GB= 0
##$INTBC= 1
##$INTSCL= 1
##$ISEN= 128
##$LB= 0.3
##$LEV0= 0
##$LPBIN= 0
##$MAXI= 10000
##$MC2= 0
##$MEAN= 0
##$ME_mod= 0
##$MI= 0
##$NCOEF= 0
##$NC_proc= -2
##$NLEV= 6
##$NOISF1= 0
##$NOISF2= 0
##$NSP= 0
##$NTH_PI= 0
##$NZP= 0
##$OFFSET= 14.96113
##$PC= 1
##$PHC0= -84.19922
##$PHC1= 0
##$PH_mod= 1
##$PKNL= yes
##$PPARMOD= 0
##$PPDIAG= 0
##$PPIPTYP= 0
##$PPMPNUM= 2147483647
##$PPRESOL= 1
##$PSCAL= 4
##$PSIGN= 0
##$PYNMP= <proc.py>
##$REVERSE= no
##$SF= 400.020009583305
##$SI= 131072
##$SIGF1= 0
##$SIGF2= 0
##$SINO= 400
##$SIOLD= 131072
##$SPECTYP= <>
##$SREGLST= <1H.CDCl3>
##$SSB= 0
##$STSI= 131072
##$STSR= 0
##$SW_p= 8223.68421052631
##$SYMM= 0
##$S_DEV= 0
##$TDeff= 65536
##$TDoff= 0
##$TI= <>
##$TILT= no
##$TM1= 0
##$TM2= 0
##$TOPLEV= 0
##$USERP1= <user>
##$USERP2= <user>
##$USERP3= <user>
##$USERP4= <user>
##$USERP5= <user>
##$WDW= 1
##$XDIM= 131072
##$YMAX_p= 379106319
##$YMIN_p= -67863
##$CURPLOT= <Network HP LaserJet P1505>
##$CURPRIN= <$Network HP LaserJet P1505>
##$DFORMAT= <normdp>
##$LAYOUT= <+/1D_H.xwp>
##$LFORMAT= <normlp>
##$PFORMAT= <normpl>
##$SURQMSG= 1
$$ End of Bruker specific parameters
$$ ---------------------------------
##NTUPLES= NMR SPECTRUM
##VAR_NAME=  FREQUENCY,     SPECTRUM/REAL,   SPECTRUM/IMAG
##SYMBOL=    X,             R,               I
##VAR_TYPE=  INDEPENDENT,   DEPENDENT,       DEPENDENT
##VAR_FORM=  AFFN,          ASDF,            ASDF
##VAR_DIM=   131072,        131072,          131072
##UNITS=     HZ,            ARBITRARY UNITS, ARBITRARY UNITS
##FACTOR=    0.0627417313425164, 1,          1
##FIRST=     8223.62146879497, -3609,        -63732
##LAST=      0,             -940,            -64625
##MIN=       0,             -67863,          0
##MAX=       8223.62146879497, 379106319,    0
$$ Real data points
##PAGE= N=1
##DATA TABLE= (X++(R..R)), XYDATA
$$ [...]
63851A497913J0274M603j333p348j2945j7825k2246k6558l0706l4451l7816m0907
$$ 1497913 1508187 1512790 1511457 1504109 1491164 1473339 1451093 1424535 1393829 1359378 1321562 1280655
63839A280655m3568m5590m7077m8272m9118m9365m8854m7543m5419m2782m0269
$$ 1280655 1237087 1191497 1144420 1096148 1047030 997665 948811 901268 855849 813067 772798
63828G72798l8228l6273l3927l1392k9149k7064k4593k1794j9358j7610j6191
$$ 772798 734570 698297 664370 632978 603829 576765 552172 530378 511020 493410 477219
63817D77219j4820j3636j2562j1117r286p961p818q187p775o327m891m368m496
$$ 477219 462399 448763 436201 425084 415798 407837 400019 391832 384057 377730 372839 368471 363975
63804C63975m514m335m426m801m830m228l675l942m739n035m471l794l711l961
$$ 363975 359461 355126 350700 345899 341069 336841 333166 329224 324485 319450 314979 311185 307474 303513
63790C03513l922l639l631l923l865l013j681n36R2K97K30j53q75j633j903j543
$$ 303513 299591 295952 292321 288398 284533 281520 279839 279303 279395 279692 279922 279769 278894 277261 275358 273815
63774B73815j060r67j062p62j30Q9m36j138j378j187q42l66J43K26k88q16p91
$$ 273815 272755 271788 270726 269964 269834 269923 269487 268349 266971 265784 264942 264576 264719 264945 264657 263841 263050
63757B63050m54l29l61j44K77N63P20Q98Q95N06J25L07Q86J259J331J521J964
$$ 263050 262596 262267 261906 261762 262039 262602 263322 264220 265115 265621 265746 266053 266939 268198 269529 271050 273014
63740B73014K357K512K439K058J476J294J833K358J957J059J062K409M008M777
$$ 273014 275371 277883 280322 282380 283856 285150 286983 289341 291298 292357 293419 295828 299836 304613
63726C04613M821M807M930M941M648M071L513L433L849M011L315K311J974K155
$$ 304613 309434 314241 319171 324112 328760 332831 336344 339777 343626 347637 350952 353263 355237 357392
63712C57392J844R51M71O80M62q52k246k434j629r94r63j102j037p32q3Q96J808
$$ 357392 359236 360187 360658 361338 361800 360948 358702 356268 354639 353645 352682 351580 350543 349811 349728 350624 352432
63695C52432K310K582K857K839K220J373R67J093J383J665J886J685O80q29k035
$$ 352432 354742 357324 360181 363020 365240 366613 367580 368673 370056 371721 373607 375292 375972 375143 373108
63680C73108k465k210j483n09K56L84L7j84J6L72O37R19J321J551J240M56k96
$$ 373108 370643 368433 366950 366441 366697 367081 367118 366934 366950 367322 367959 368878 370199 371750 372990 373446 373150
63663C73150o04n40m69n73p85j166k010l357m660n311n334n093m558l457k072
$$ 373150 372546 372006 371537 370964 370179 369013 367003 363646 358986 353675 348341 343248 338690 335233 333161
63648C33161j197j166j513j816k147k433k058o69J083K213K483K396K435K749
$$ 333161 331964 330798 329285 327469 325322 322889 320831 320162 321245 323458 325941 328337 330772 333521
63634C33521L331M023M504M643M737N085N516N742N853O172O759P477Q341R416
$$ 333521 336852 340875 345379 350022 354759 359844 365360 371102 376955 383127 389886 397363 405704 415120
63620D15120J0497J1320J2027J3052J4482J5857J6681J6991J7361J8344J9861
$$ 415120 425617 436937 448964 462016 476498 492355 509036 526027 543388 561732 581593
63609E81593K1212K1862K2125K2759K3871K4731K4748K4112K3070K1095J7330
$$ 581593 602805 624667 646792 669551 693422 718153 742901 767013 790083 811178 828508
63598H28508J1744N421k67m513p241q809r596r805r616r465r853j0871j2184j3575
$$ 828508 840252 845673 845406 840893 833652 824843 815247 805442 795826 786361 776508 765637 753453 739878
63584G39878j5139j6834j8260j9127j9553j9669j9270j8118j6299j4051j1516
$$ 739878 724739 707905 689645 670518 650965 631296 612026 593908 577609 563558 552042
63573E52042q972o910n511m321k756p76J196K804L929M606M997N253N294N017
$$ 552042 543070 536160 530649 526328 523572 522796 523992 526796 530725 535331 540328 545581 550875 555892
63559E55892M809N417P018Q903J0359J1449J2599J3949J5598J7911K0935K3919
$$ 555892 560701 566118 573136 582039 592398 603847 616446 630395 645993 663904 684839 708758
63547G08758K5968K7066K7844K8772L0106L2234L4985L6585L4320K6844J5552
$$ 708758 734726 761792 789636 818408 848514 880748 915733 952318 986638 1013482 1029034
63536A029034L414p058j4657j8973j9965j8244j5300j2893j1904j1933j2260j3030
$$ 1029034 1032448 1025390 1010733 991760 971795 953551 938251 925358 913454 901521 889261 876231
63524H76231j5032j8384k2058k5017k7236k9174l0754l1380l0804k9284k7138
$$ 876231 861199 842815 820757 795740 768504 739330 708576 677196 646392 617108 589970
63513E89970k4588k1978j9606j7394j5104j2889j1183j0033r031p939o979o410
$$ 589970 565382 543404 523798 506404 491300 478411 467228 457195 448164 440225 433246 426836
63501D26836o111n799n364m833m183l391k613k122k042k218k383k377k163j749
$$ 426836 420725 414926 409562 404729 400546 397155 394542 392420 390378 388160 385777 383400 381237 379488
63487C79488j279j080j278j281k31J745L318L520L041L133L756L876L295K880
$$ 379488 378209 377129 375851 374570 374339 376084 379402 382922 385963 389096 392852 396728 400023 402903
63473D02903K889K483J295J79l04q60k090l220l295k758k670l013k997k517k120
$$ 402903 405792 408275 409570 409749 409445 408585 406495 403275 399980 397222 394552 391539 388542 386025 383905
63458C83905j843j192j32R59K096L454M501M455L562K916L028L531M226N390O900
$$ 383905 382062 380870 380738 381697 383793 387247 391748 396203 399765 402681 405709 409240 413466 418856 425756
63443D25756Q187R286J0932J3168J4849J5082J4516J4564J5847J7907K0081K2214
$$ 425756 433943 443229 454161 467329 482178 497260 511776 526340 542187 560094 580175 602389
63431F02389K4679K7922L1676L4415L3980K9255K1369J3147P237M447L663L440
$$ 602389 627068 654990 686666 721081 755061 784316 805685 818832 826069 830516 834179 837619
63419H37619L658N298Q624J2430J5524J8162K1142K4045K5459K4642K1966J7913
$$ 837619 841277 846575 855199 867629 883153 901315 922457 946502 971961 996603 1018569 1036482
63407A036482J2699O924J479l313p599j1064j3060j3727j4028j4416j4517j4380
$$ 1036482 1049181 1056105 1057584 1054271 1046672 1035608 1022548 1008821 994793 980377 965860 951480
63395I51480j4966j6981k0077k3638k7370l0656l2343l1958l0442k8948k7461
$$ 951480 936514 919533 899456 875818 848448 817792 785449 753491 723049 694101 666640
63384F66640k5290k2360j9319j6709j4643j2910j0990q321m972j791M96J879K636
$$ 666640 641350 618990 599671 582962 568319 555409 544419 536098 531126 529335 529831 531710 534346
63371E34346K991L554N314Q492J1948J4365J5595J6321J6934J7459J8131J9261
$$ 534346 537337 540891 546205 554697 566645 581010 596605 612926 629860 647319 665450 684711
63359F84711K0731K2200K3573K4815K5755K6572K7938K9956L1401L0811K8053
$$ 684711 705442 727642 751215 776030 801785 828357 856295 886251 917652 948463 976516
63348I76516K4017J9132J3168O427P2m939q508j0848j2011j2233j2155j2371j3021
$$ 976516 1000533 1019665 1032833 1039260 1039332 1034393 1025885 1015037 1003026 990793 978638 966267 953246
63335I53246j4021j5383j7175j9385k1806k3906k5038k5128k4866k4780k4381
$$ 953246 939225 923842 906667 887282 865476 841570 816532 791404 766538 741758 717377
63324G17377k2806k0124j7246j4712j2347j0032p878n508k348Q38J633j852q763
$$ 717377 694571 674447 657201 642489 630142 620110 612232 606724 604376 605214 606847 604995 596232
63311E96232j6050k1006k2834k2230k0303j7958j5620j3320j1134r386q188p051
$$ 596232 580182 559176 536342 514112 493809 475851 460231 446911 435777 426391 418203 411152
63299D11152n473l780k786k628k561k072j566j631k075k280k200k392l103l817
$$ 411152 405679 401899 399113 396485 393924 391852 390286 388655 386580 384300 382100 379708 376605 372788
63285C72788l820k951j644n57k38q10j738k130j537l94M70O81N00L29K65J36k12
$$ 372788 368968 366017 364373 363816 363578 362768 361030 358900 357363 356969 357439 358120 358620 358949 359214 359350 359138
63268C59138o74q47l25Q96K324L411L934L879L325K622K447L148M183M651M389
$$ 359138 358464 357617 357292 358188 360512 363923 367857 371736 375061 377683 380130 383278 387461 392112 396501
63253C96501M065M184M515M702M901N526O635P913Q998R564R399Q745Q349Q824
$$ 396501 400566 404750 409265 413967 418868 424394 431029 438942 447940 457504 466903 475648 483997 492821
63239D92821J0095J1720J3582J5796J8049J9564J9963J9809K0142K1506K3597
$$ 492821 502916 514636 528218 544014 562063 581627 601590 621399 641541 663047 686644
63228F86644K5619K6908K7301K7096K6646K6069K5375K4796K4699K5070K5353
$$ 686644 712263 739171 766472 793568 820214 846283 871658 896454 921153 946223 971576
63217I71576K5018K4185K3431K2995K2415K1088J8984J6594J4266J1773Q563M337
$$ 971576 996594 1020779 1044210 1067205 1089620 1110708 1129692 1146286 1160552 1172325 1180888 1185225
63205A185225o78o001j1333j6661k1844k6235k9009l0038l0113l0004k9519k7871
$$ 1185225 1184547 1178546 1167213 1150552 1128708 1102473 1073464 1043426 1013313 983309 953790 925919
63193I25919k4869k1199j7520j3851j0032o268k842L54L606O944J0317J3902J7781
$$ 925919 901050 879851 862331 848480 838448 832180 829338 829692 833298 840242 850559 864461 882242
63180H82242K1459K4186K5713K6361K6511K6396K6309K6460K6545K5907K4269
$$ 882242 903701 927887 953600 979961 1006472 1032868 1059177 1085637 1112182 1138089 1162358
63169A162358K2073J9930J8017J6142J4140J1992R582O552K491k642q382j4181
$$ 1162358 1184431 1204361 1222378 1238520 1252660 1264652 1274234 1280786 1283277 1280635 1272253 1258072
63157A258072j9928k5714l1135l5374l8195m0286m2108m2959m1840l9014l5897
$$ 1258072 1238144 1212430 1181295 1145921 1107726 1067440 1025332 982373 940533 901519 865622
63146H65622l3498l1617k9623k7239k4484k1393j8121j4943j2008r384p325o071
$$ 865622 832124 800507 770884 743645 719161 697768 679647 664704 652696 643312 635987 629916
63134F29916n376m727l962l234k467j500p62q94j525j286N00K839M283M586M524
$$ 629916 624540 619813 615851 612617 610150 608650 607888 606994 605469 604183 604683 607522 611805 616391 620915
63119F20915M583M576M349M173M311M613M664M217L354K379J479O51K9N4Q72J739
$$ 620915 625498 630074 634423 638596 642907 647520 652184 656401 659755 662134 663613 664264 664293 664347 665219 666958
63103F66958J584K63j304k239k439k109j391o78n59j017j266q36j71K96R02J955
$$ 666958 668542 668805 667501 665262 662823 660714 659323 658645 658086 657069 655803 654967 654796 655092 655994 657949
63087F57949K792K639J825J292J118O32j57k88P99K529M031N071N820O345O728
$$ 657949 660741 663380 665205 666497 667615 668247 668090 667802 668601 671130 675161 680232 686052 692397 699125
63072F99125P190P737Q078Q217Q731J0067J1858J3358J4383J5380J6757J8524
$$ 699125 706315 714052 722130 730347 739078 749145 761003 774361 788744 804124 820881 839405
63060H39405K0642K3218K6231K9358L2333L5275L8332M1217M3519M5514M8189
$$ 839405 860047 883265 909496 938854 971187 1006462 1044794 1086011 1129530 1175044 1223233
63049A223233N2099N6524O0133O2332O3547O4340O4825O5014O5142O5263O4906
$$ 1223233 1275332 1331856 1391989 1454321 1517868 1582208 1647033 1712047 1777189 1842452 1907358
63038A907358O3555O1308N8826N6673N4948N3366N1494M8971M5786M2216L8364
$$ 1907358 1970913 2032221 2091047 2147720 2202668 2256034 2307528 2356499 2402285 2444501 2482865
63027B482865L3780K7750J9925J0521n1j1535k3670l5791m6846n6076o3579o9935
$$ 2482865 2516645 2544395 2564320 2574841 2574790 2563255 2539585 2503794 2456948 2400872 2337293 2267358
63015B267358p5099p8062p7877p4750o9731o3502n5997m7176l7674k8517k0398
$$ 2267358 2192259 2114197 2036320 1961570 1891839 1828337 1772340 1725164 1687490 1658973 1638575
63004A638575j3214o122J701R986J7382K3022K7687L2686L7828M1694M3839M5481
$$ 1638575 1625361 1619239 1620940 1630926 1648308 1671330 1699017 1731703 1769531 1811225 1855064 1900545
62992A900545M7560M9293M9460M8142M6317M4330M1859L8906L5885L2847K9369
$$ 1900545 1948105 1997398 2046858 2095000 2141317 2185647 2227506 2266412 2302297 2335144 2364513
62981B364513K5087J9673J2600L653o381j6302k5807l5581m6004n6373o5553p2863
$$ 2364513 2389600 2409273 2421873 2425526 2419145 2402843 2377036 2341455 2295451 2239078 2173525 2100662
62969B100662p8178q1598q3287q3466q2308p9914p6394p1954o6936o1794n6856
$$ 2100662 2022484 1940886 1857599 1774133 1691825 1611911 1535517 1463563 1396627 1334833 1277977
62958A277977n2088m7425m3332m0499l8713l6685l3496k9835k7131k5819k5102
$$ 1277977 1225889 1178464 1135132 1094633 1055920 1019235 985739 955904 928773 902954 877852
62947H77852k4233k3222k2199k0890j9048j6948j5166j3991j3231j2480j1489
$$ 877852 853619 830397 808198 787308 768260 751312 736146 722155 708924 696444 684955
62936F84955j0376r388q463p266n786m585m102m001l590k722j875j432j320j319
$$ 684955 674579 665191 656728 649462 643676 639091 634989 630988 627398 624676 622801 621369 620049 618730
62922F18730j367j545k008k877l975m743m704l958l067k502k389k572k734k635
$$ 618730 617363 615818 613810 610933 606958 602215 597511 593553 590486 587984 585595 583023 580289 577654
62908E77654k407k426k767l036k944k668k467k303k126k054j940j325k75K89k31
$$ 577654 575247 572821 570054 567018 564074 561406 558939 556636 554510 552456 550516 549191 548916 549205 548974
62893E48974j082j081k59K56j79j105j843k251k401k187j520n38N17J338J612
$$ 548974 547892 546811 546552 546808 546629 545524 543681 541430 539029 536842 535322 534784 535301 536639 538251
62878E38251J348J023R83Q81K52n76p65j39N28M20n22j690k332k055j221o68o83
$$ 538251 539599 540622 541605 542486 542738 542162 541397 541258 541786 542206 541684 539994 537662 535607 534386 533718 533035
62861E33035o40o0M36M6q67j278j054q67p81j65R50J672J738J878K326K219J125
$$ 533035 532395 532335 532771 532817 531950 530672 529618 528751 527970 527805 528755 530427 532165 534043 536369 538588 539713
62844E39713K2j65k1o36j902k831l088l040k751k018j248j137j405q91P67K400
$$ 539713 539735 539570 539549 538913 537011 534180 531092 528052 525301 523283 522035 520898 519493 518602 519369 521769
62828E21769K719J867R95P83R39J011J046J327J827K294K727L416M437N346N585
$$ 521769 524488 526355 527350 528133 529072 530083 531129 532456 534283 536577 539304 542720 547157 552503 558088
62813E58088N107M388L919L915M397N226N960O064N397M444L937M337N598P180
$$ 558088 563195 567583 571502 575417 579814 585040 591000 597064 602461 606905 610842 615179 620777 627957
62799F27957Q349Q768Q868R434J0774J2485J4035J5231J6173J7176J8880K1916
$$ 627957 636306 645074 653942 663376 674150 686635 700670 715901 732074 749250 768130 790046
62787G90046K6128L0424L3855L6758M0409M5527N1396N6682O0892O4786O9349
$$ 790046 816174 846598 880453 917211 957620 1003147 1054543 1111225 1172117 1236903 1306252
62776A306252P4562P9441Q3128Q5610Q7318Q8364Q8438Q7216Q4483P9951P3285
$$ 1306252 1380814 1460255 1543383 1628993 1716311 1804675 1893113 1980329 2064812 2144763 2218048
62765B218048O4315N3058L9600K4261P823q666k4491l9457n3543o6403p7295q5459
$$ 2218048 2282363 2335421 2375021 2399282 2407105 2398439 2373948 2334491 2280948 2214545 2137250 2051791
62753B051791r0660r3399r4491r4389r3033r0319q6430q1635p6138p0261o4467
$$ 2051791 1961131 1867732 1773241 1678852 1585819 1495500 1409070 1327435 1251297 1181036 1116569
62742A116569n9032n3936m9206m4945m0934l6739l2443k8667k5585k2548j9094
$$ 1116569 1057537 1003601 954395 909450 868516 831777 799334 770667 745082 722534 703440
62731G03440j5645j2713j0129p770o235n878n748m675k936j691j056j01J383K554
$$ 703440 687795 675082 664953 657183 650948 645070 639322 634647 631711 630020 628964 628863 630246 632800
62717F32800L182M304O677R645J2129J3964J5711J7825K0507K3715K6965K9708
$$ 632800 635982 640286 646963 656608 668737 682701 698412 716237 736744 760459 787424 817132
62705H17132L2249L5609M0088M4741M8744N2613N7350O2899O8212P2520P5914
$$ 817132 849381 884990 925078 969819 1018563 1071176 1128526 1191425 1259637 1332157 1408071
62694A408071P8804Q1375Q3550Q5148Q5994Q5953Q4716Q1607P5882O7366N6551
$$ 1408071 1486875 1568250 1651800 1736948 1822942 1908895 1993611 2075218 2151100 2218466 2275017
62683B275017M4054L0204J5183q74j7722l4688n0487o4035p5297q4864r2656r7803
$$ 2275017 2319071 2349275 2364458 2363584 2345862 2311174 2260687 2196652 2121355 2036491 1943835 1846032
62671A846032r9798r9123r6533r2518q7600q2415p7084p1159o4588n8175n2743
$$ 1846032 1746234 1647111 1550578 1458060 1370460 1288045 1210961 1139802 1075214 1017039 964296
62660I64296m8297m4352m0589l6892l3211k9667k6459k3424k0178j6802j3931
$$ 964296 915999 871647 831058 794166 760955 731288 704829 681405 661227 644425 630494
62649F30494j2034j1089j0966j1448j1826j1297r989q846q234p446n908m060k643
$$ 630494 618460 607371 596405 584957 573131 561834 551845 542999 534765 527319 521411 517351 514708
62636E14708j849j538j580j581j066k96j27p04j168j074j088j681k170j812r83
$$ 514708 512859 511321 509741 508160 507094 506798 506671 505967 504799 503725 502637 500956 498786 496974 495991
62621D95991l98oM62O52L00R9Q76K325L551M352N109N846O294O514O679O687O726
$$ 495991 495593 495587 496049 496701 497001 497100 497976 500301 503852 508204 513313 519159 525453 531967 538646 545333 552059
62604E52059P530R304J1121J2411J4185J7442K1108K3244K3909K5125K7975L1399
$$ 552059 559589 568893 580014 592425 606610 624052 645160 668404 692313 717438 745413 776812
62592G76812L4150L6346L8541M0573M2118M3370M4342M4291M2478L9002L4350
$$ 776812 810962 847308 885849 926422 968540 1011910 1056252 1100543 1143021 1182023 1216373
62581A216373K8614K1713J3984O101j442q608j5696k3012l0264l6418m0586m2927
$$ 1216373 1244987 1266700 1280684 1286785 1285343 1276735 1261039 1238027 1207763 1171345 1130759 1087832
62569A087832m4205m4617m3816m1973l9952l8191l6297l3927l1382k8895k6144
$$ 1087832 1043627 999010 955194 913221 873269 835078 798781 764854 733472 704577 678433
62558F78433k2908j9640j6882j4553j2356j0409q969p865o767n784n289n245n117
$$ 678433 655525 635885 619003 604450 592094 581685 572716 564851 558084 552300 547011 541766 536649
62545E36649m446l226j809o43q1j41l92k61M79J542K400K698K430J847J309J199
$$ 536649 532203 528977 527168 526525 526444 526303 525911 525650 526129 527671 530071 532769 535199 537046 538355 539554
62529E39554J811L104M607N939P375R537J2352J4848J6300J7222J8732K1280K4483
$$ 539554 541365 544469 549076 555015 562390 571927 584279 599127 615427 632649 651381 672661 697144
62516F97144K7992L1787L5667L9120M1928M4411M6880M9250N1334N3121N4482
$$ 697144 725136 756923 792590 831710 873638 918049 964929 1014179 1065513 1118634 1173116
62505A173116N4931N4077N2132M9600M6463M2076L5967K8584K0923J3555O462
$$ 1173116 1228047 1282124 1334256 1383856 1430319 1472395 1508362 1536946 1557869 1571424 1577886
62494A577886j37n278q127q966q675p348m196R56O801J1583J4584J6297J7720
$$ 1577886 1577749 1572471 1564344 1555378 1546703 1539355 1535159 1536115 1542916 1554499 1569083 1585380 1603100
62481A603100J9804K2998K6610K8692K7057K0569R787l034j4621k2567k7487l2730
$$ 1603100 1622904 1645902 1672512 1701204 1728261 1748830 1758617 1755583 1740962 1718395 1690908 1658178
62469A658178m1193n2487o3629p1871p6263p7187p5630p2842o9722o6248o1966
$$ 1658178 1616985 1564498 1500869 1428998 1352735 1275548 1199918 1127076 1057354 991106 929140
62458I29140n6936n1679m6325m0553l4337k8213k2703j8004j4152j1051q340n783
$$ 929140 872204 820525 774200 733647 699310 671097 648394 630390 616238 605187 596847 591064
62446E91064l661k380j697q17P01K537M048M831M985N036N454O032O066N317M268
$$ 591064 587403 585023 583326 582509 583210 585747 589795 594626 599611 604647 610101 616133 622199 627516 631784
62431F31784L122J285j584m679o946q301r203r612r388r107r410r857r616q997
$$ 631784 634906 636191 634607 629928 622982 614681 605478 595866 586478 577371 567961 558104 548488 539491
62417E39491r023r626r594q361o667n316m366l820l858m125l818k844j946j386
$$ 539491 530468 520842 511248 502887 496220 490904 486538 482718 478860 474735 470917 468073 466127 464741
62403D64741n47P35J585J375O87L74M43N10P08J458K840M623O371P312O756N157
$$ 464741 464194 464929 466514 467889 468576 468950 469393 469903 470611 472069 474909 479532 485903 493215 499971 505128
62387E05128L991M107M867N343N520N730N712N210M872N557O989Q016Q092P788
$$ 505128 509119 513226 518093 523436 528956 534686 540398 545608 550480 556037 563026 571042 579134 586922
62373E86922P847Q391R073R541R634R494R544J0176J1477J3367J5802J8672K1651
$$ 586922 594769 603160 612233 621774 631408 640902 650446 660622 672099 685466 701268 719940 741591
62360G41591K4369K6723K8889L1192L3956L7213M0517M3296M5423M7051M7953
$$ 741591 765960 792683 821572 852764 886720 923933 964450 1007746 1053169 1100220 1148173
62349A148173M7425M4976M0750L5087K8220K0547J2815N710m29n471r453j2908
$$ 1148173 1195598 1240574 1281324 1316411 1344631 1365178 1377993 1383703 1383274 1377803 1368350 1355442
62337A355442j6644k0876k4953k8171l0529l2352l3644l4172l3997l3422l2553
$$ 1355442 1338798 1317922 1292969 1264798 1234269 1201917 1168273 1134101 1100104 1066682 1034129
62326A034129l1188k9221k6980k5163k4284k4158k4074k3679k3362k3480k3552
$$ 1034129 1002941 973720 946740 921577 897293 873135 849061 825382 802020 778540 754988
62315G54988k2903k1827k1234k1128k0354j8197j5394j3125j1601j0205q566o881
$$ 754988 732085 710258 689024 667896 647542 629345 613951 600826 589225 579020 570454 563573
62303E63573n416m199l144k171j173q9J044K088K833L153L228L444L792L762L185
$$ 563573 558157 553958 550814 548643 547470 547381 548425 550513 553346 556499 559727 563171 566963 570725 573910
62288E73910K706K852L036K374J238R21J739K538K359J609J177J257J537J868
$$ 573910 576616 579468 582504 584878 586116 587037 588776 591314 593673 595282 596459 597716 599253 601121
62274F01121K213K448K627L133M177N638P438R595J1761J3451J4877J6783J9257
$$ 601121 603334 605782 608409 611542 615719 621357 628795 638390 650151 663602 678479 695262 714519
62261G14519K1530K3301K5434K8769L2947L6996M0434M3267M5504M7322M9114
$$ 714519 736049 759350 784784 813553 846500 883496 923930 967197 1012701 1060023 1109137
62250A109137N0765N1233M9438M5271L9333L2140K4029J5415O635k094j0399j7833
$$ 1109137 1159902 1211135 1260573 1305844 1345177 1377317 1401346 1416761 1423396 1421302 1410903 1393070
62238A393070k4490l0927l7162m2404m6169m8919n1147n2493n2395n1006m8806
$$ 1393070 1368580 1337653 1300491 1258087 1211918 1162999 1111852 1059359 1006964 955958 907152
62227I07152m5839m1987l7591l3205k9079k5356k2277j9703j7014j4021j1472
$$ 907152 861313 819326 781735 748530 719451 694095 671818 652115 635101 621080 609608
62216F09608j0027r273q350p057n623l976k059m72Q3j61k79K17J143K315L769
$$ 609608 599581 590308 581958 574901 569278 565302 563243 562771 562854 562693 562414 562631 563774 566089 569858
62201E69858N326O560P304P846Q624R865J1341J2372J2464J2057J2192J3181J4226
$$ 569858 575184 581744 589048 596894 605518 615383 626724 639096 651560 663617 675809 688990 703216
62188G03216J4588J4459J4240J3740J2703J1471J0469R574Q553P574O620N125
$$ 703216 717804 732263 746503 760243 772946 784417 794886 804460 813013 820587 827207 832332
62176H32332K950J125P47J579K590L447M574O129P919J0095J3000J6459J9974
$$ 832332 835282 836407 837154 838733 841323 844770 849344 855473 863392 873487 886487 902946 922920
62163I22920K3471K7058L0319L2534L3559L3687L2818L0378K6075K0218J3447
$$ 922920 946391 973449 1003768 1036302 1069861 1103548 1136366 1166744 1192819 1213037 1226484
62152A226484O618O42m180q370j2376j5882j8562k0907k3499k5968k7569k8313
$$ 1226484 1233102 1233744 1229564 1221194 1208818 1192936 1174374 1153467 1129968 1104000 1076431 1048118
62140A048118k8617k8188k6465k3871k1461j9387j6797j3350r738o703m455l191
$$ 1048118 1019501 991313 964848 940977 919516 900129 883332 869982 860244 853541 849086 845895
62128H45895l110l662l712k874j889j405j071k43J094K504L749M834N750O460
$$ 845895 842785 839123 835411 832537 830648 829243 828172 827929 829023 831527 835276 840110 845860 852320
62114H52320O969P240P265P209P265P350P280P069O731N865L846N27l361o463
$$ 852320 859289 866529 873794 881003 888268 895618 902898 909967 916698 922563 926409 926936 923575 917112
62100I17112p477o021k993K43L029N288O304M998J863o84r34J62P62Q65J698L218
$$ 917112 909635 903614 900621 900864 903893 909181 915485 920483 922346 921662 920728 920890 921652 922517 924215 927433
62084I27433M187M470N384P455R510J0494J0874J1666J3090J4822J6635J8292
$$ 927433 931620 936090 941474 948929 958439 968933 979807 991473 1004563 1019385 1036020 1054312
62072A054312J9515K0457K1489K2331K2152K0847J9374J8528J8100J7600J7097
$$ 1054312 1073827 1094284 1115773 1138104 1160256 1181103 1200477 1219005 1237105 1254705 1271802
62061A271802J6904J7016J7229J7307J6812J5259J2671R516O006J978k476o793
$$ 1271802 1288706 1305722 1322951 1340258 1357070 1372329 1385000 1394516 1400522 1402500 1400024 1393231
62049A393231j0431j3172j5117j6932j9836k4450k9722l3851l6210l7550l8485
$$ 1393231 1382800 1369628 1354511 1337579 1317743 1293293 1263571 1229720 1193510 1155960 1117475
62038A117475l8928l9003l9203l9306l8236l5562l2220k9345k7161k5336k3532
$$ 1117475 1078547 1039544 1000341 961035 922799 887237 855017 825672 798511 773175 749643
62027G49643k1293j8238j4846j2233j0792r880r082q788r062r079q301p329o837
$$ 749643 728350 710112 695266 683033 672241 662361 653279 644491 635429 626350 618049 610720 603883
62014F03883o534n918n279n150n334n264m811m104l035j622l66L53Q00J266J543
$$ 603883 597349 591431 586152 581002 575668 570404 565593 561489 558454 556832 556466 556819 557619 558885 560428
61999E60428J598K067L286M340M080K708J438P85Q9j232k834m102n018o011p265
$$ 560428 562026 564093 567379 571719 575799 578507 579945 580730 580819 579587 576753 572651 567633 561622 554357
61984E54357q481r258r514r469r260q750p938p238o939o664n875m835m324m385
$$ 554357 545876 536618 527104 517635 508375 499625 491687 484449 477510 470846 464971 460136 455812 451427
61970D51427m184l306k380k095k260k352k297k170j719p98P8K40k21m73J62J507
$$ 451427 447243 443937 441557 439462 437202 434850 432553 430383 428664 427866 427944 428184 427963 427490 427652 429159
61954D29159K650K759K060J863L107N096O388O818P550R102J0520J1072J1476
$$ 429159 431809 434568 436628 438491 441598 446694 453082 459900 467450 476552 487072 498144 509620
61941E09620J2641J4066J4684J4578J4731J5389J5797J5528J5098J5036J5072
$$ 509620 522261 536327 551011 565589 580320 595709 611506 627034 642132 657168 672240
61930F72240J4513J3081J1128R281P900O819N573L915J972l4j912l399m318m909
$$ 672240 686753 699834 710962 720243 728143 734962 740535 744450 746422 746388 744476 741077 736759 731850
61916G31850n512n899n495m315l027j853j13K688N960Q609J0083J0472J0187R834
$$ 731850 726338 720439 714944 710629 707602 705749 705636 708324 714284 722893 732976 743448 753635 763469
61902G63469R893J0065R397P468M892K340k10k776m702n504n820o674q017q832
$$ 763469 773362 783427 792824 800292 805184 807524 807314 804538 799836 794332 788512 781838 773821 764989
61888G64989q520p546o712o356o315o268o023n681n518n758o562q090j0136j1801
$$ 764989 756469 748923 742211 735855 729540 723272 717249 711568 706050 700292 693730 685640 675504 663703
61874F63703j2204j1549j0846j0400r471p669n787m660m026l188k154j341o50
$$ 663703 651499 639950 629104 618704 609233 601564 595777 591117 587091 583903 581749 580408 579758
61861E79758L96J930L761N857Q182J0368J2090J3489J4887J6330J7750J9137K0252
$$ 579758 580154 582084 585845 591702 599884 610252 622342 635831 650718 667048 684798 703935 724187
61848G24187K0669K0479K0313K0352J9994J8979J7976J7404J6405J3927J0181
$$ 724187 744856 765335 785648 806000 825994 844973 862949 880353 896758 910685 920866
61837I20866O222K551r15l954o016o994p174o708n723m610l569k101K98L213N704
$$ 920866 927088 929639 928724 924770 918754 911760 904586 897878 892155 887545 883976 881875 882173 885386 891090
61822H91090P244P792P417O492N703N037L249o62n816j0324j3448j5925j8330
$$ 891090 898334 906126 913543 920035 925738 930775 934024 933362 927546 917222 903774 887849 869519
61809H69519k0220k1032k0823j9950j8636j7043j5269j3266j1176r522q647q183
$$ 869519 849299 828267 807444 787494 768858 751815 736546 723280 712104 702582 693935 685752
61797F85752p639p097o779o375n538m611m046l475k364j188r28j569k177k276
$$ 685752 678113 671016 664237 657862 652324 647713 643667 640192 637828 636640 635712 634143 631966 629690
61783F29690k180j974j364o37o58j603k566k708k077j161m22l01r04j486j088
$$ 629690 627510 625536 624172 623535 622877 621274 618708 616000 613923 612762 612340 612039 611135 609649 608561
61768F08561J34J018J028R03J429K375L084L459L845M433N108N593N534M875M187
$$ 608561 608695 609713 610741 611644 613073 615448 618532 621991 625836 630269 635377 640970 646504 651379 655566
61753F55566M103M349L908K248j63k577m597o051o991p905r176j0164r696p761
$$ 655566 659669 664018 667926 670174 670011 667434 662837 656786 649795 641890 632714 622550 612854 605093
61739F05093n839n101n099m782m067l578l393k927j863n14O95J536J837J576J187
$$ 605093 599254 594153 589054 584272 580205 576627 573234 570307 568444 567930 568625 570161 571998 573574 574761
61724E74761J321K111K877K812J880R19P18J154J368R14L01K17M67K45o63j512
$$ 574761 576082 578193 581070 583882 585762 586681 587399 588553 589921 590835 591136 591353 591820 592065 591402 589890
61708E89890j571j027o75r52j544j897j841j658j636j734j814j965k290k549k422
$$ 589890 588319 587292 586617 585665 584121 582224 580383 578725 577089 575355 573541 571576 569286 566737 564315
61693E64315k132k269k882l333l209k833k589k373k023j744j702j735j829k256
$$ 564315 562183 559914 557032 553699 550490 547657 545068 542695 540672 538928 537226 535491 533662 531406
61679E31406k858k947k438k214k782l345l100k542k493k610k073j160q05j014
$$ 531406 528548 525601 523163 520949 518167 514822 511722 509180 506687 504077 502004 500844 500039 499025
61665D99025j065r24j145j562j423p37j95J27O75J177Q37q9m08J89P76Q29Q44
$$ 499025 497960 497036 495891 494329 492906 492169 491974 492101 492776 493953 494790 494701 494293 494482 495258 496087 496931
61648D96931R79O15k85p27k75K70L83P13J692K421J994R44L65L77L77J50j24m44
$$ 496931 497910 498525 498240 497513 497238 497508 497891 498604 500296 502717 504711 505655 506020 506397 506774 506924 506800 506356
61630E06356q18j008j066j509k425l101l086k938l257l665l555l110k833k630
$$ 506356 505538 504530 503464 501955 499530 496429 493343 490405 487148 483483 479928 476818 473985 471355
61616D71355k254k055k444l022l072k671k477k769l332m048m862n458n602n586
$$ 471355 469101 467046 464602 461580 458508 455837 453360 450591 447259 443211 438349 432891 427289 421703
61602D21703n733n770n240m272l402k881k693k886l320l485l139k771k825k912
$$ 421703 415970 410200 404960 400688 397286 394405 391712 388826 385506 382021 378882 376111 373286 370374
61588C70374k497j910j856k231k330k016j793j749j410p67m85q51j218r27k25
$$ 370374 367877 365967 364111 361880 359550 357534 355741 353992 352582 351815 351330 350479 349261 348334 348109
61573C48109J38j22o32q77o74k14J34J99J58K79N21N89L92J76J88M08O53Q16R40
$$ 348109 348247 348125 347493 346616 345942 345728 345862 346061 346219 346498 347019 347608 348000 348176 348364 348772 349425 350241 351181
61554C51181J144J506J953K231K046J281K06n25k81Q62J991K217J585Q71N65N39
$$ 351181 352325 353831 355784 358015 360061 361342 361548 361023 360742 361604 363595 365812 367397 368268 368833 369372
61538C69372O36R75J540J954J993J894J839J532O38o11j560j778j355p73o00j075
$$ 369372 370008 370983 372523 374477 376470 378364 380203 381735 382373 381762 380202 378424 377069 376296 375696 374621
61522C74621j876k497k788k868k657j972j056m13n4M15Q33M96o08j415j195n81
$$ 374621 372745 370248 367460 364592 361935 359963 358907 358494 358440 358855 359688 360184 359576 358161 356966 356385
61506C56385n13q27p19j74R8j15k20J62P15J093J451K000K493K509K025J462J182
$$ 356385 355872 355045 354326 354152 354250 354135 353915 354077 354792 355885 357336 359336 361829 364338 366363 367825 369007
61489C69007J108Q22R8p00r00k65O46J003M95m29r96p34J92J152J640J695J639
$$ 369007 370115 370937 371035 370335 369435 369170 369816 370819 371314 370885 369889 369155 369347 370499 372139 373834 375473
61472C75473J616J536J374J121O60k3n40n38k54k09m12m49l24m97j009j268r26
$$ 375473 377089 378625 379999 381120 381780 381757 381217 380679 380425 380216 379804 379355 379031 378534 377525 376257 375331
61455C75331l46M7L39P65J281J741K008J742P09n51j022m64K97O14Q56J565K526
$$ 375331 374985 375032 375371 376136 377417 379158 381166 382908 383617 383066 382044 381580 381877 382491 383347 384912 387438
61438C87438L143L245K988K463J893J652J699J546J149J196J916K364J627K38
$$ 387438 390581 393826 396814 399277 401170 402822 404521 406067 407216 408412 410328 412692 414319 414557
61424D14557m27J26J193J937K122J897J518J231J040O94K25J06N21R65R33N97
$$ 414557 414130 414256 415449 417386 419508 421405 422923 424154 425194 425888 426113 426219 426740 427705 428638 429235
61408D29235K50l55j443k405k447j789j408j706k112k069j727j509j460j305q53
$$ 429235 429485 429130 427687 425282 422835 421046 419638 417932 415820 413751 412024 410515 409055 407750 406897
61393D06897l17j38l68l09P85K529L585L287K468K237K593K788K492J935J354
$$ 406897 406580 406442 406074 405765 406550 409079 412664 415951 418419 420656 423249 426037 428529 430464 431818
61378D31818J061J615L110M642N174M741M095L509K764K034J791J905J679R32
$$ 431818 432879 434494 437604 442246 447420 452161 456256 459765 462529 464563 466354 468259 469938 470870
61364D70870K60J31L60O24Q83J125J259J425J986K935L775M130M223M463M818
$$ 470870 471130 471261 471621 472245 473128 474253 475512 476937 478923 481858 485633 489763 493986 498449 503267
61349E03267M865M501M397N465P662R567R588P655N173L328K099J070L85L51P06
$$ 503267 508132 512633 517030 522495 530157 539724 549312 556967 562140 565468 567567 568637 569022 569373 570079
61334E70079R42Q93N23l46j574k483k686k666k898k965k249r71J95J130K027K649
$$ 570079 571021 571914 572437 572091 570517 568034 565348 562682 559784 556819 554570 553599 553794 554924 556951 559600
61318E59600K781L005M017N365N973N855O250P934J0310J2348J3561J3888J3419
$$ 559600 562381 565386 569403 574768 580741 586596 592846 600780 611090 623438 636999 650887 664306
61305F64306J2670J2462J3125J4171J4908J4972J4172J2272R235N398J289k590
$$ 664306 676976 689438 702563 716734 731642 746614 760786 773058 782293 787691 788980 786390
61293G86390n820q169r670j0495j0851j1067j1414j1654j1198r941q516p400o395
$$ 786390 780570 772401 762731 752236 741385 730318 718904 707250 696052 686111 677595 670195 663800
61280F63800n279m381l886l285k153q28L17J592L087L917L480K797L237M420M800
$$ 663800 658521 654140 650254 646969 644816 643988 644305 645897 648984 652901 656381 659178 662415 666835 671635
61265F71635M097L557L844M200M005L684L675L750L929M871O594P815P323N393
$$ 671635 675732 679289 683133 687333 691338 695022 698697 702447 706376 711247 717841 725656 732979 738372
61251G38372L207J459J04j119k421l840n020n494n449n600o073o067n070l707
$$ 738372 741579 743038 743142 742023 739602 735762 730742 725248 719799 714199 708126 702059 696989 693282
61237F93282k844k379j604l10J058K132K858L176L055K910L501N160P316R000
$$ 693282 690438 688059 686455 686145 687203 689335 692193 695369 698424 701334 704835 709995 717311 726311
61223G26311R755R899R869R635R031Q452Q611R459R967R334P997O974O667O725
$$ 726311 736066 745965 755834 765469 774500 782952 791563 801022 810989 820323 828320 835294 841961 848686
61209H48686O773O671O331N838N534N600N772N878O253P170Q269R169J0173J1723
$$ 848686 855459 862130 868461 874299 879833 885433 891205 897083 903336 910506 918775 927944 938117 949840
61195I49840J3457J4653J5259J5802J6468J6949J6963J6275J4445J1318P532L933
$$ 949840 963297 977950 993209 1009011 1025479 1042428 1059391 1075666 1090111 1101429 1108961 1112894
61183A112894P24k242m801o746q303r585j0182j0093j0375j1868j3822j4974j5414
$$ 1112894 1113618 1111376 1106575 1099829 1091526 1081941 1071759 1061666 1051291 1039423 1025601 1010627 995213
61170I95213j6080j6993j7481j7755j8580j9574j9499j8328j7415j7395j7493
$$ 995213 979133 962140 944659 926904 908324 888750 869251 850923 833508 816113 798620
61159G98620j7106j6508j5664j3935j1455r401q228p042n228l419k133q36Q80
$$ 798620 781514 765006 749342 735407 723952 714551 706323 699281 694053 690634 688501 687665 688545
61146F88545K358K978L109L099K318J74k647m863n940o139n843n324m643l314
$$ 688545 690903 693881 696990 700089 702407 702581 699934 695071 689131 682992 677149 671825 667182 663868
61132F63868p40K679N597P247Q200R345J0950J3017J5615J8415K0711K2321K3671
$$ 663868 663128 665807 671404 678651 686851 696196 707146 720163 735778 754193 774904 797225 820896
61119H20896K4801K5292K5449K6396K8480L0604L1605L1357L0159K8134K5742
$$ 820896 845697 870989 896438 922834 951314 981918 1013523 1044880 1075039 1103173 1128915
61108A128915K3765K2272K0514J8273J6098J3922J0821O721K842k99l897q845
$$ 1128915 1152680 1174952 1195466 1213739 1229837 1243759 1254580 1261301 1264143 1263844 1259947 1251102
61096A251102j4132j8352k1560k4467k6965k8750l0391l2428l4131l4418l3350
$$ 1251102 1236970 1218618 1197058 1172591 1145626 1116876 1086485 1054057 1019926 985508 952158
61085I52158l1706k9748k7448k5173k3200k1216j9242j8085j7885j7139j4490
$$ 952158 920452 890704 863256 838083 814883 793667 774425 756340 738455 721316 706826
61074G06826j0701p596n728m363l142k342j909j449j002p93m98L05J373K230K947
$$ 706826 696125 688529 682801 678438 675296 672954 671045 669596 668594 667801 667303 667608 668981 671211 674158
61059F74158L759M482N016N774O856P620P861Q498J0187J2164J3532J4731J6570
$$ 674158 677917 682399 687415 693189 700045 707665 715526 724024 734211 746375 759907 774638 791208
61046G91208J8697K0282K1437K2708K3893K4659K5494K6763K7609K7208K6315
$$ 791208 809905 830187 851624 874332 898225 922884 948378 975141 1002750 1029958 1056273
61035A056273K6200K6732K6972K6888K6990K7016K6535K6221K6922K8108K8803
$$ 1056273 1082473 1109205 1136177 1163065 1190055 1217071 1243606 1269827 1296749 1324857 1353660
61024A353660K9359L0659L2350L3710L5556L9287M4461M9326N3362N7426O1766
$$ 1353660 1383019 1413678 1446028 1479738 1515294 1554581 1599042 1648368 1701730 1759156 1820922
61013A820922O5991P0825P7954Q8376J02562J21671J46547J75955K07985K42789
$$ 1820922 1886913 1957738 2035692 2124068 2226630 2348301 2494848 2670803 2878788 3121577
61003C121577K82086L27118L79593M43147N20280O08820P05205Q09553R21534
$$ 3121577 3403663 3730781 4110374 4553521 5073801 5682621 6387826 7197379 8118913
60994H118913J031938J126515J201973J273388J365084J501249J701724J959756
$$ 8118913 9150851 10277366 11479339 12752727 14117811 15619060 17320784 19280540
60986A9280540K197578K256221J978374J342836N19567k28289p08659q76723p82980
$$ 19280540 21478118 23734339 25712713 27055549 27575116 27346827 26638168 25761445 24978465
60977B4978465n01705j37789J34442J15824k83448r53388j646655k140752k350672
$$ 24978465 24476760 24338971 24473413 24589237 24305789 23352401 21705746 19564994 17214322
60968A7214322k317727k131148j870688j592861j332856j105574r11803p49032
$$ 17214322 14896595 12765447 10894759 9301898 7969042 6863468 5951665 5202633
60960E202633o15692n07868m18913l44400k84052k37765k02746j75543j54152
$$ 5202633 4586941 4079073 3660160 3315760 3031708 2793943 2591197 2415654 2261502
60951B261502j37165j22967j10709j00423r1490q2630p3688o5825n9473n3705
$$ 2261502 2124337 2001370 1890661 1790238 1698748 1616118 1542430 1476605 1417132 1363427
60941A363427m8047m3369m0454l9035l8664l9166l9753l9048l6660l3612l0654
$$ 1363427 1315380 1272011 1231557 1192522 1153858 1114692 1074939 1035891 999231 965619 934965
60930I34965k7401k3687k0535j8819j7941j6680j4743j2689j0976r827r508r903
$$ 934965 907564 883877 863342 844523 826582 809902 795159 782470 771494 761667 752159 742256
60918G42256j0174r520q111o777n926n263m449l590l028k883k893k667k065j325
$$ 742256 732082 722562 714451 707674 701748 696485 692036 688446 685418 682535 679642 676975 674910 673585
60904F73585q00o87j023j680k232k197j582q56k00O77J662J941J181L54M82J186
$$ 673585 672785 672098 671075 669395 667163 664966 663384 662528 662328 663005 664667 666608 667789 668143 668625 669811
60888F69811J586K093L883O667Q586Q691Q156Q341Q846Q462P234O466P014Q446
$$ 669811 671397 673490 677373 684040 692626 701317 709473 717814 726660 735122 742356 748822 755836 764282
60874G64282R796J0490J0587J0524J0691J1072J1434J1860J2718J3925J4851J5199
$$ 764282 774078 784568 795155 805679 816370 827442 838876 850736 863454 877379 892230 907429
60862I07429J5480J6198J7092J7657J7924J8096J7866J6930J5895J5756J6403
$$ 907429 922909 939107 956199 973856 991780 1009876 1027742 1044672 1060567 1076323 1092726
60851A092726J6510J5095J2498R575O598L496N67j666l184m427n645o734p789
$$ 1092726 1109236 1124331 1136829 1146404 1153002 1156498 1157065 1155399 1152215 1147788 1142143 1135409 1127620
60838A127620r404j2190j6100k0297k3530k4800k4049k2366k1253k1370k2007
$$ 1127620 1118216 1106026 1089926 1069629 1046099 1021299 997250 974884 953631 932261 910254
60827I10254k1941k0691j8807j7047j5668j4576j3811j3518j3483j3111j2108
$$ 910254 888313 867622 848815 831768 816100 801524 787713 774195 760712 747601 735493
60816G35493j0901j0185j0048r938r422q650p950p344o813o574o651o422n297
$$ 735493 724592 714407 704359 694421 684999 676349 668399 661055 654242 647668 641017 634595 629298
60803F29298l739k875l017l289l027k707k996l566l615l098k585k232j809j605
$$ 629298 625559 622684 619667 616378 613351 610644 607648 604082 600467 597369 594784 592552 590743 589138
60789E89138k321l865n072m996l875k623j900j954k778l945m714m793m732n158
$$ 589138 586817 582952 577880 572884 569009 566386 564486 562532 559754 555809 551095 546302 541570 536412
60775E36412n906o242n830n096m721m996n543n612m828l698l071l072k964k284
$$ 536412 530506 524264 518434 513338 508617 503621 498078 492466 487638 483940 480869 477797 474833 472549
60761D72549j508j213j084m13P26J446J191L17n17r94j023n29L67J242J709J762
$$ 472549 471041 469828 468744 468331 469057 470503 471694 472011 471494 470500 469477 468948 469315 470557 472266 474028
60745D74028J624J458J407J631K029K085J317r7j406k090k396k877l634m206m122
$$ 474028 475652 477110 478517 480148 482177 484262 485579 485482 484076 481986 479590 476713 473079 468873 464751
60730D64751l386k405j694j592k101k847l339l361l061k735k602k739l005l071
$$ 464751 461365 458960 457266 455674 453573 450726 447387 444026 440965 438230 435628 432889 429884 426813
60716D26813k695k019j395j033j068j727k906l761l433k293j647k004k406j962
$$ 426813 424118 422099 420704 419671 418603 416876 413970 410209 406776 404483 402836 400832 398426 396464
60702C96464j111o86n12K0N96L76n16j068q72n00l41j23K39L94M22R66K013K520
$$ 396464 395353 394667 394155 394175 394771 395147 394631 393563 392691 392191 391850 391727 391966 392360 392782 393748 395761 398281
60684C98281J823O83L11R36J940K875L688M294M588M666M649M440M034L767L939
$$ 398281 400104 400787 401098 402034 403974 406849 410537 414831 419419 424085 428734 433174 437208 440975 444914
60669D44914M394M713M606L983L015K233K075K161J637M97j62L30J142J075J53
$$ 444914 449308 454021 458627 462610 465625 467858 469933 472094 473731 474228 474066 474396 475538 476613 476766
60654D76766o67q86o66k5J103K064J814L01j201j516p87j1J54k38r26j821k923
$$ 476766 476099 475213 474547 474522 475625 477689 479503 479804 478603 477087 476300 476289 476443 476205 475279 473458 470535
60637D70535m070m908n157m935m672m533m160l266k297k071k674l189k658j166
$$ 470535 466465 461557 456400 451465 446793 442260 438100 434834 432537 430466 427792 424603 421945 420779
60623D20779K99Q70N48jk42k36l48o06o86m93m19p15q65j43J292K321K098R73
$$ 420779 421078 421948 422496 422495 422253 422017 421669 421063 420377 419884 419465 418750 417885 417742 419034 421355 423453 424426
60605D24426j11p51j168j374r96q5N60L81p1J12Q33J189R04P67J350K165K572
$$ 424426 424315 423564 422396 421022 420026 419941 420501 420882 420811 420923 421756 422945 423849 424616 425966 428131 430703
60588D30703K777L204L472K943J911J279J207J001L90OL72J225K078K842L545
$$ 430703 433480 436684 440156 443099 445010 446289 447496 448497 448887 448893 449265 450490 452568 455410 458955
60573D58955M004M203M480N018N534N763N868O170O786P750R024J0235J0835J0793
$$ 458955 462959 467162 471642 476660 482194 487957 493825 499995 506781 514531 523555 533790 544625 555418
60559E55418J0622J0535J0017Q605O642M853L453K030J00k394m901o434o268m665
$$ 555418 566040 576575 586592 595197 601839 606692 610145 612175 612275 609881 604980 598546 592278 587613
60545E87613k610p77Q86K526M052N521P245R091J0375J0853J1317J2662J4780
$$ 587613 585003 584226 585112 587638 591690 597211 604456 613547 623922 634775 646092 658754 673534
60532F73534J6853J8286J8863J8340J6528J3616R965N777J283l011o600r287j0955
$$ 673534 690387 708673 727536 745876 762404 776020 785985 791762 793045 790034 783434 774147 763192
60519G63192j1388j0740r729q906q011o632n148m341m203l794k408l72J516K971
$$ 763192 751804 741064 731335 722429 714418 707786 702638 698297 694094 690300 687892 687520 689036 692007
60505F92007M346N979P681R082J0387J2417J5678J9584K3082K5895K8610L1656
$$ 692007 696353 702332 710013 719095 729482 741899 757577 777161 800243 826138 854748 886404
60493H86404L4842L7968M1128M4087M6122M6809M6359M4749M1254L5458K8199
$$ 886404 921246 959214 1000342 1044429 1090551 1137360 1183719 1228468 1269722 1305180 1333379
60482A333379K0802J3680O270j934j0840k0061k9172l7737m5354n1597n5883n7703
$$ 1333379 1354181 1367861 1374131 1372197 1361357 1341296 1312124 1274387 1229033 1177436 1121553 1063850
60470A063850n7231n5255n2304m8423m3914l9578l5772l1949k7692k3543k0202
$$ 1063850 1006619 951364 899060 850637 806723 767145 731373 699424 671732 648189 627987
60459F27987j7511j4974j2704j1059r894q941q472q588q354o842m711l602l920
$$ 627987 610476 595502 582798 571739 561845 552904 544432 535844 527490 520648 515937 512335 508415
60446E08415m357l873k968k583k663k524k070j877k249k779k817k122r13L72J290
$$ 508415 504058 500185 497217 494634 491971 489447 487377 485500 483251 480472 477655 475533 474620 474992 476282
60431D76282J460P74l19j025j091j151j768k368j904n35M05L13J81J016K373L176
$$ 476282 477742 478516 478197 477172 476081 474930 473162 470794 468890 468355 468760 469073 469254 470270 472643 475819
60415D75819L212K928K438J653R66P89P73L24l38n24j88J30K42L61M23K13R0O78
$$ 475819 479031 481959 484397 486050 487016 487805 488578 488902 488564 488040 487852 487982 488224 488585 489008 489221 489311 489989
60397D89989J902K967L307K934K080J191J006J863L016L429L083K769K807K853
$$ 489989 491891 494858 498165 501099 503179 504370 505376 507239 510255 513684 516767 519536 522343 525196
60383E25196K792K908L148L142K926K903K991K702K004J363R10M16N2K75Q62J040
$$ 525196 527988 530896 534044 537186 540112 543015 546006 548708 550712 552075 552985 553401 553453 553728 554590 555630
60367E55630O37K32L9l34q65r19l86j6j19N0R90J996K200J853J774K094K386K631
$$ 555630 556267 556499 556538 556204 555339 554420 554034 554018 553899 553949 554939 556935 559135 560988 562762 564856 567242 569873
60349E69873L202M025M534M461M226M344M782N036M735M099L667L553L165J886
$$ 569873 573075 577100 581634 586095 590321 594665 599447 604483 609218 613317 616984 620537 623702 625588
60335F25588j25k154l781n082o191p070p670p874p393o218m985m387m225l752
$$ 625588 625463 623309 619528 614446 608255 601185 593515 585641 578248 572030 567045 562658 558433 554681
60321E54681k836k113j942j918j557p95K61J422K170K077J665K088L644N375O485
$$ 554681 551845 549732 547790 545872 544315 543520 543781 545203 547373 549450 551115 553203 556847 562222 568707
60306E68707P453R118J1280J2881J3328J3078J3053J3910J5719J7873J9252J8841
$$ 568707 576160 585278 596558 609439 622767 635845 648898 662808 678527 696400 715652 734493
60294G34493J6393J2561Q298M009p45o444j2488j7322j9886k0490j9924j8350
$$ 734493 750886 763447 771745 775754 775009 768565 756077 738755 718869 698379 678455 660105
60282F60105j5805j3141j1369j0323r116p817p458q190q695p939o537n671n492
$$ 660105 644300 631159 619790 609467 600351 592534 585076 576886 568191 560252 553715 548044 542552
60269E42552n343m947m526m100l415k509j754j361j154q71m75k21m62j204j904
$$ 542552 537209 532262 527736 523636 520221 517712 515958 514597 513443 512572 512097 511876 511414 510210 508306
60254E08306j910j201l74N1M7j69l65k64K87J017J397J256R06P00P30Q93R47O09
$$ 508306 506396 505195 504821 504872 504919 504750 504385 504121 504408 505425 506822 508078 508984 509684 510414 511307 512254 512863
60236E12863l4l51J72J222K037K327K406K642L292M590O285P355P018N953N603
$$ 512863 512829 512478 512650 513872 515909 518236 520642 523284 526576 531166 537451 544806 551824 557777 563380
60221E63380O343P091O908O108N609N885O789P752Q085P647P329Q110R658J0553
$$ 563380 569723 576814 583722 589830 595439 601324 608113 615865 623950 631597 638926 647036 656694 667247
60207F67247J0052Q871Q083Q007Q293Q412P797O255M428L245K790K347J509N56
$$ 667247 677299 686170 694253 702260 710553 718965 726762 733017 737445 740690 743480 745827 747336 747892
60193G47892k81j062j649j861k136l118m500n339n567o016o808o995o195n323
$$ 747892 747611 746549 744900 743039 740903 737785 733285 727946 722379 716363 709555 702560 696365 691042
60179F91042n108n099m729m305m147l803k993k378k552l035l075k755k501k177
$$ 691042 685934 680835 676106 671801 667654 663851 660858 658480 655928 652893 649818 647063 644562 642385
60165F42385j539r88j057j533j769j522r79l74N6J89L59R34J430J004P7J96J728
$$ 642385 640846 639858 638801 637268 635499 633977 632998 632624 632680 632869 633228 634162 635592 636596 636673 636869 638597
60148F38597L024K842K305L170N117O340O136N384M806M352M209N026O718Q127
$$ 638597 641621 644463 646768 649938 655055 661395 667531 672915 677721 682073 686282 691308 698026 706153
60134G06153Q320P576O790O474O510O516O205N572M805L944K820J479L44k12k10
$$ 706153 714473 722049 728839 735313 741823 748339 754544 760116 764921 768865 771685 773164 773508 773296 773086
60119G73086J80Q31J448J649J428J097O84l1q39j233j345j900k967l630l385k905
$$ 773086 773266 774097 775545 777194 778622 779719 780403 780372 779533 778300 776955 775055 772088 768458 765073 762168
60103G62168k939l367l846m468n098m944l637j937o89J92R60J153M20n84j032
$$ 762168 759229 755862 752016 747548 742450 737506 733869 731932 731243 731435 732395 733548 733968 733384 732352
60088G32352j026r85o11M67J642J978J449O90l3p51j223j359j695k610l626m282
$$ 732352 731326 730341 729730 730197 731839 733817 735266 735956 735923 735172 733949 732590 730895 728285 724659 720377
60072G20377n036o362p672q213q400r036r731r428q168p025o496o157n815n733
$$ 720377 715341 708979 701307 693094 684694 675658 665927 656499 648331 641306 634810 628653 622838 617105
60058F17105n736n191m002k744j767r43k23K31M67O34O46O01J165K804M932O528
$$ 617105 611369 606178 602176 599432 597665 596722 596499 596730 597197 597831 598477 599078 600243 603047 607979 614507
60042F14507P275P474P277O861O722O987O819N468L422J580o9j959l721m746n477
$$ 614507 621782 629256 636533 643394 650116 657103 663922 669390 672812 674392 674323 672364 668643 663897 658420
60027F58420o789q433r412r603r714r822r388q594q273q434q187p225o155n260
$$ 658420 651631 643198 633786 624183 614469 604647 595259 586665 578392 569958 561771 554546 548391 543131
60013E43131m143k777j754j357j303j419j603j236J47J688K035J284Q57J301J644
$$ 543131 538988 536211 534457 533100 531797 530378 528775 527539 527686 529374 531409 532693 533550 534851 536495
59998E36495J229P71J123K103L070L682L764L366L193M005N330N825N177M551
$$ 536495 537724 538495 539618 541721 544791 548473 552237 555603 558796 562801 568131 573956 579133 583684
59984E83684M823N477N639N155M191K768J168q4j023k182l475m107l887l527l334
$$ 583684 588507 593984 599623 604778 608969 611737 612905 612821 611798 609616 606141 602034 598147 594620 591286
59969E91286k718j476m14m2L02J282K468L136L390L712M095M324M514M761M783
$$ 591286 588568 587092 586678 586636 586938 588220 590688 593824 597214 600926 605021 609345 613859 618620 623403
59954F23403M464M186M084L529J912m09k387l195k736j719j304k045l113l245
$$ 623403 627867 632053 636137 639666 641578 641169 638782 635587 632851 631132 629828 627783 624670 621425
59940F21425k532k299l172m302m818m880m810m285l136k004j434j054l29N52J221
$$ 621425 618893 616594 613422 609120 604302 599422 594612 590327 587191 585187 583753 582699 582370 582922 584143
59925E84143J888K805L671M135M452M952N475N814O160O578O717O591O943Q125
$$ 584143 586031 588836 592507 596642 601094 606046 611521 617335 623495 630073 636790 643381 650324 658449
59911F58449R326R643R280Q879Q291P012N380M205L453K293M44j412k699l632
$$ 658449 667775 677418 686698 695577 703868 710880 716260 720465 723918 726211 726655 725243 722544 718912
59897G18912m612n587o240o470o324n692m363k418m11J005J737K334L260M156
$$ 718912 714300 708713 702473 696003 689679 683987 679624 677206 676795 677800 679537 681871 685131 689287
59883F89287M228L293K155J832K749M511O163O759O159N240M893M925M368K768
$$ 689287 693515 696808 698963 700795 703544 708055 714218 720977 727136 732376 737269 742194 746562 749330
59869G49330O44j234k472l063l358l954m992n702n304m224l674m121m927n455
$$ 749330 749974 748740 746268 743205 739847 735893 730901 725199 719895 715671 711997 707876 702949 697494
59855F97494n619n388m621l579k832k471k125j657j103o7J835M004N377N918O493
$$ 697494 691875 686487 681866 678287 675455 672984 670859 669202 668099 668032 669867 673871 679248 685166 691659
59840F91659P322P830Q068Q788R774R588P546M697K228J59j661k520j753J43K054
$$ 691659 698981 706811 714879 723667 733441 743029 750575 755272 757500 757659 755998 753478 751725 751868 753922
59825G53922L098K545o6m047p702r950j1035j1317j0636r317q359p885o783m717
$$ 753922 757020 759565 759499 755452 747750 737800 726765 715448 704812 695495 687136 679251 672468 667751
59811F67751l111k948l122k257r52o51j302j771j749j695j486q10m14j402l440
$$ 667751 664640 661692 658570 656313 655361 654710 653408 651637 649888 648193 646707 645897 645483 644081 640641
59796F40641n105n820o188o608o772o519o086n503m712m099m038m113l661k892
$$ 640641 635536 629716 623528 616920 610148 603629 597543 592040 587328 583229 579191 575078 571417 568525
59782E68525k486k365j927j305j326k197l148l408k805j539o9R34J313J846L158
$$ 568525 566039 563674 561747 560442 559116 556919 553771 550363 547558 546019 545950 546884 548197 550043 553201
59767E53201M548M805L900K974K821L356M338N578O504O609O361O775P992R126
$$ 553201 557749 562554 566454 569428 572249 575605 579943 585521 592025 598634 604995 611770 619762 628888
59753F28888R474R155Q506P746P187P047O993O543N835N251M592L472K347K014
$$ 628888 638362 647517 656023 663769 670956 678003 684996 691539 697374 702625 707217 710689 713036 715050
59739G15050K224J886Q05K9K48Q87J142R97P41M25K42O81J652K135J390N4n81
$$ 715050 717274 719160 719965 719994 720242 721129 722271 723268 724009 724434 724676 725357 727009 729144 730534 730588 730007
59722G30007n9Q89J297P90k85j180j267n10N51J383J908K340K783L133L275L286
$$ 730007 729948 730837 732134 732924 732639 731459 730192 729682 730233 731616 733524 735864 738647 741780 745055 748341
59706G48341L450L969M707N363N855O283O495O145N323M629M368M183L811L643
$$ 748341 751791 755760 760467 765830 771685 777968 784463 790608 795931 800560 804928 809111 812922 816565
59692H16565M030M538M495L827K784J351l20j426j437j200k032l795m897m490
$$ 816565 820595 825133 829628 833455 836239 837590 837270 835844 834407 833207 831175 827380 822483 817993
59678H17993l596l722m995o267o582o077n613n847o583p022o634n671m659l724
$$ 817993 814397 810675 805680 799413 792831 786754 781141 775294 768711 761689 755055 749384 744725 741001
59664G41001k753j917j489j288q34rR57K060L448M783N332M895M122L665L364
$$ 741001 738248 736331 734842 733554 732720 732711 733668 735728 739176 743959 749291 754186 758308 761973 765337
59649G65337K667J491L04n32j200k142l572n341p211q999j0446j1208j1197j0745
$$ 765337 768004 769495 769799 769267 768067 765925 762353 757012 749801 740802 730356 719148 707951 697206
59635F97206j0154r279p852o058m339k842j561q70j199k320l590m789o007o845
$$ 697206 687052 677773 669921 663863 659524 656682 655121 654251 653052 650732 647142 642353 636346 629501
59621F29501o768o240o310o906o759n412m008l508l402k982k654k910l050k193
$$ 629501 622733 616493 610183 603277 596518 591106 587098 583590 580188 577206 574552 571642 568592 566399
59607E66399p76J32N17J189K343L348L701L275K044L29j027j478j392j247r00
$$ 566399 565623 565755 566272 567461 569804 573152 576853 580128 582172 582501 581474 579996 578604 577357 576457
59592E76457l61l53j168j784j335o41r21j755j843j340j643l007l995l522k116
$$ 576457 576096 575743 574575 572791 571456 570815 569894 568139 566296 564956 563313 560306 556311 552789 550673
59577E50673r09n57j245k677l827l708k645j868j854j955j661j168o34P3P07O29
$$ 550673 549764 549207 547962 545285 541458 537750 535105 533237 531383 529428 527767 526599 525965 526038 526745 527374
59561E27374j56q01o71J6P32J173J200Q91P11J065J748K344K953L879M859N372
$$ 527374 527218 526417 525746 525762 526494 527667 528867 529758 530469 531534 533282 535626 538579 542458 547317 552689
59545E52689N465N564N793O152O975Q332R480R836R995J0809J2053J3265J5004
$$ 552689 558154 563718 569511 575663 582638 590970 600450 610286 620281 631090 643143 656408 671412
59532F71412J7548J8846J5953Q802Q06m648o730o179l766o52J474J880J530J484
$$ 671412 688960 707806 723759 732561 733367 728719 721989 715810 712044 711392 712866 714746 716276 717760
59518G17760J471O98q24k581m468o615q830j0766j2212j2881j2527j1556j0877
$$ 717760 719231 719929 719105 716524 712056 705441 696611 685845 673633 660752 648225 636669 625792
59505F25792j0787j0565r459p577n568l992l091k637j990q44K02M76L49P01J495
$$ 625792 615005 604440 594981 587404 581836 577844 574753 572116 570126 569282 569484 569960 570309 571010 572505
59490E72505J985K130K634L559M142M124M011L907L342K453K047K225K198J800
$$ 572505 574490 576620 579254 582813 586955 591079 595090 598997 602339 604792 606839 609064 611262 613062
59476F13062J840K540L019K816K643K936L028K433J849J952K324K331K089J834
$$ 613062 614902 617442 620461 623277 625920 628856 631884 634317 636166 638118 640442 642773 644862 646696
59462F46696J394J044J803L901N922O536O314O755Q184R596J0160R863R081Q201
$$ 646696 648090 649134 650937 654838 660760 667296 673610 680365 688549 698145 708305 718168 727249 735450
59448G35450P442O544N031L127J725J000j42k601n741q272r767j0639j1133j1137
$$ 735450 742892 749436 754467 757594 759319 760319 760177 757576 751835 743563 733796 723157 712024 700887
59434G00887j0599r482p716n655m119l448k953j795L5J989L749N290O640P991
$$ 700887 690288 680806 673090 667435 663316 659868 656915 655120 655155 657144 660893 666183 672823 680814
59420F80814R664J1648J3619J5442J7096J8075J7722J6278J4748J3668J3063J3501
$$ 680814 690478 702126 715745 731187 748283 766358 784080 800358 815106 828774 841837 855338
59408H55338J5499J7320J5272P524l393j3066j9118k1701k1439j8727j4454r547
$$ 855338 870837 888157 903429 910953 907560 894494 875376 853675 832236 813509 799055 789508
59396G89508l970K352P587Q386K972o799j6708k3109k4844k3088j9786j6078j2045
$$ 789508 785538 787890 795477 803863 806835 800036 783328 760219 735375 712287 692501 676423 664378
59383F64378p798m169k009j217r32l92O27J932L126L955M623N394N930N668M925
$$ 664378 656580 652411 650402 649185 648253 647861 648488 650420 653546 657501 662124 667518 673448 679116 684041
59368F84041M748N442O092N990N727O242P503Q801R729J0367J0920J1731J3123
$$ 684041 688789 694231 700323 706313 712040 718282 725785 734586 744315 754682 765602 777333 790456
59355G90456J4767J5845J6206J6700J7925J9366K0301K0836K1386K1756K1476
$$ 790456 805223 821068 837274 853974 871899 891265 911566 932402 953788 975544 997020
59344I97020K0573J9355J7897J6171J4275J2136R498O447L342n0m384r386j3618
$$ 997020 1017593 1036948 1054845 1071016 1085291 1097427 1106925 1113372 1116714 1116664 1112280 1102894 1089276
59331A089276j6210j7861j9455k0631k0643j9814j9079j8679j8131j7175j6007
$$ 1089276 1073066 1055205 1035750 1015119 994476 974662 955583 936904 918773 901598 885591
59320H85591j4918j4154j3667j2721j0579p854o179n956n677m203k511k011k301
$$ 885591 870673 856519 842852 830131 819552 811698 805519 799563 793886 789683 787172 785161 782860
59307G82860j953p56L26R23J524K328L006L520M075M470M449M476N184O257O833
$$ 782860 780907 780151 780477 781400 782924 785252 788258 791778 795853 800323 804772 809248 814432 820689 827522
59292H27522O829O985P704Q716R883J1329J2600J2287Q934K358n706j2311j5246
$$ 827522 834351 841336 849040 857756 867639 878968 891568 903855 912789 915147 909441 897130 881884
59279H81884j4668j2500j0107p322l800j27L035N858Q573J0570J1252J1069J0807
$$ 881884 867216 854716 844609 837287 833487 833360 836395 842253 850826 861396 872648 883717 894524
59266H94524J0424R448P895O001L653Q89j704l828o070q830j1438j3204j4475
$$ 894524 904948 914396 922291 928292 931945 932834 931130 927302 921232 912402 900964 887760 873285
59253H73285j5642j5956j4648j2548j1261j1086j0949j0026q313n980l330j181
$$ 873285 857643 841687 827039 814491 803230 792144 781195 771169 762856 756876 753546 752365
59241G52365k03QL46R86J529J940K441K868K964K933K868K241Q05o25j298j822
$$ 752365 752162 752170 752516 753502 755031 756971 759412 762280 765244 768177 771045 773286 774091 773466 772168 770346
59225G70346l214n205o701p422p879q156p892p213o510n626m253k798j802r12
$$ 770346 767132 761927 755226 747804 739925 731769 723877 716664 710154 704528 700275 697477 695675 694763
59211F94763M54J905K714L131L820M433M188L465L390M034M477M489M651M906
$$ 694763 695217 697122 699836 702967 706787 711220 715408 718873 722263 726297 730774 735263 739914 744820
59197G44820M502L526L066L517L976L662K950K623K887L371L435K507Q10m34k21
$$ 744820 749322 752848 755914 759431 763407 767069 770019 772642 775529 778900 782335 784842 785652 785218 784997
59182G84997J000J998K265K011J287K17m09m2N31L07p4R04L195N157N900O198
$$ 784997 785997 787995 790260 792271 793558 793775 793366 793324 793855 794162 794088 794992 798187 803344 809244 815442
59166H15442O844P577Q017Q378Q784Q904Q585P995O913M874K193j13j666l158
$$ 815442 822286 829863 837880 846258 855042 863946 872531 880526 887439 892313 894506 894393 892727 889569
59152H89569n268p878j0406j2148j2422j1243r757r140r173q841q066p721q056
$$ 889569 884301 876423 866017 853869 841447 830204 820447 811307 802134 793293 785227 777506 769450
59139G69450q296p852o918n887n076m944n564n990n214l603k327j579o04P55J892
$$ 769450 761154 753302 746384 740497 735421 730477 724913 718923 713709 710106 707779 706200 705596 706351 708243
59124G08243K785M089N779P063P809Q754J0078J1077J1526J2159J3326J4324J4470
$$ 708243 711028 715117 720896 727959 735768 744522 754600 765677 777203 789362 802688 817012 831482
59111H31482J3928J3100J2066J0947R943Q787O913M357J811k57j798k683k805
$$ 831482 845410 858510 870576 881523 891466 900253 907166 911523 913334 913077 911279 908596 905791
59098I05791k699l169m421o138q048r608r787q320o655o327o806o442n055m022
$$ 905791 903092 899923 895502 889364 881316 871708 861921 853601 846946 840619 833813 827371 822316 818294
59084H18294m036m521n152o224p454q046q102q383q693q140p094o944p734p885
$$ 818294 814258 809737 804585 798361 790907 782861 774759 766376 757683 749543 742449 735505 727771 719886
59070G19886o759n660n631n995n826n329m978m670m482m974n976o302n390m112
$$ 719886 713127 707467 701836 695841 690015 684686 679708 675038 670556 665582 659606 653304 647914 643802
59056F43802l407l167k979k897k875k594k237k375k759k397j166k2O24J374K261
$$ 643802 640395 637228 634249 631352 628477 625883 623646 621271 618512 616115 614949 614927 615551 616925 619186
59041F19186K292J196K13L87J281K032K522K861K873K728L079M059N121O199P803
$$ 619186 621478 622674 622887 623274 624555 626587 629109 631970 634843 637571 640650 644709 649830 656029 663832
59026F63832R703J0952J1513J2428J3888J4716J4314J3594J3234J2528J0794Q448
$$ 663832 673535 684487 696000 708428 722316 737032 751346 764940 778174 790702 801496 809944
59014H09944N863K610j165l983m719m103l549l494l598l598l184j978k45J217
$$ 809944 815807 818417 817252 813269 808550 804447 800898 797404 793806 790208 787024 785046 784801 786018
59000G86018K348L849N609O457N974N166M755M218L203K424K363K374J913J339
$$ 786018 788366 792215 797824 804281 810255 815421 820176 824394 827597 830021 832384 834758 836671 838010
58986H38010Q38j16j521k451k550k523k480j434Q53L175M896O870R428J1326J1898
$$ 838010 838848 838732 837211 834760 832210 829687 827207 825773 826626 829801 834697 841567 850995 862321 874219
58971H74219J2424J3928J5337J5414J4953J5237J5749J5223J3829J2567J1416
$$ 874219 886643 900571 915908 931322 946275 961512 977261 992484 1006313 1018880 1030296
58960A030296R851Q226P051N620K994l39l309o090r570j3560j6949j9184k0363
$$ 1030296 1040147 1048373 1055424 1061044 1064038 1063699 1060390 1054300 1044730 1031170 1014221 995037 974674
58947I74674k0436j9559j8650j8325j7771j5907j3153j0861r398p976o051l833
$$ 974674 954238 934679 916029 897704 879933 864026 850873 840012 830614 822638 816587 812754
58935H12754j662J99J324J444Q19o7r03j392j439j651k802m507n476n327m966
$$ 812754 811092 811291 812615 814059 814878 814811 813908 812516 811077 809426 806624 802117 796641 791314 786348
58920G86348m840m290l095k173j979j757j206j205j972k094o61J195K155K728
$$ 786348 781508 777218 774123 771950 769971 768214 767008 765803 763831 761737 761076 762271 764426 767154
58906G67154M042N966P807R677J1832J3736J5025J6308J7900J9060J9535K0378
$$ 767154 771196 777162 784969 794646 806478 820214 835239 851547 869447 888507 908042 928420
58894I28420K1978K2920K2257K1320K1573K2250K2041K1691K2727K4606K5299
$$ 928420 950398 973318 995575 1016895 1038468 1060718 1082759 1104450 1127177 1151783 1177082
58883A177082K4005K1402J7871J3345Q395L818m52m749q682j1964j5282j9036
$$ 1177082 1201087 1222489 1240360 1253705 1262100 1265918 1265466 1260717 1252035 1240071 1224789 1205753
58871A205753k2185k3726k4213k4459k3921k2008j9705j8093j6476j3850j1141
$$ 1205753 1183568 1159842 1135629 1111170 1087249 1065241 1045536 1027443 1010967 997117 985976
58860I85976r943r952r718r066q845q994q887q796r192r338q507p756q450r868
$$ 985976 976033 966081 956363 947297 938452 929458 920571 911775 902583 893245 884738 876982 868532 858664
58846H58664j0371j0160j0647j1718j1966j1264j0831j0976j0794j0005r156q296
$$ 858664 848293 838133 827486 815768 803802 792538 781707 770731 759937 749932 740776 732480
58834G32480p143o215o049n819m499k773j893j412j04J561K211K243L186M765
$$ 732480 725337 719122 713073 707254 702755 699982 698089 696677 696573 698134 700345 702588 705774 710539
58820G10539N174M223L692M358N013M746M144L717L124K286J615Q82n38k210k973
$$ 710539 715713 719936 723628 727986 732999 737745 741889 745606 748730 751016 752631 753513 752975 750765 747792
58805G47792k743k397k125j586j452k808n079o437o324n769n382m879m456m640
$$ 747792 745049 742652 740527 738941 737489 734681 729602 723165 716841 711072 705690 700811 696355 691715
58791F91715m784l761k084j277j082L42L231N514N875N423N532N916N782N339
$$ 691715 686931 683170 681086 679809 678727 679069 682300 687814 693689 699112 704644 710560 716342 721681
58777G21681N187N350N526N458M757L197J208q03l276o508r353j0407j0028r631
$$ 721681 726868 732218 737744 743202 747959 751156 752364 751561 748285 741777 732424 722017 711989 702358
58763G02358r443q676p468o739o359n406m014l037k146k67K179L556L556L369
$$ 702358 692915 684239 676771 670032 663673 658267 654253 651216 649070 648803 650982 654538 658094 661463
58749F61463L440L121K603L066M671O436Q111J0169J1925J2016J0933J0752J1916
$$ 661463 664903 668024 670627 673693 678364 684800 692911 703080 715005 727021 737954 748706 760622
58736G60622J2577J1614J0091R082Q269P454P385Q169Q558P674N938L744Q34k468
$$ 760622 773199 784813 794904 803986 812255 819709 827094 835263 843821 851495 857433 861177 862011 859543
58722H59543n016o403p247p642o916n301m105l758l338k419j761j786j963k137
$$ 859543 854527 848124 840877 833235 826319 821018 816913 813155 809817 807398 805637 803851 801888 799751
58708G99751k884m261n628o924q569j0099j0620j0579j1290j2722j3665j3999
$$ 799751 796867 792606 786978 780054 771485 761386 750766 740187 728897 716175 702510 688511
58696F88511j4690j5535j5224j3856j2984j2845j1854r437p058n794n040m307
$$ 688511 673821 658286 643062 629206 616222 603377 591523 582086 575028 569234 564194 559887
58684E59887m151m568m496l727l388l862m062l388k528j744k78J906L602M205
$$ 559887 555736 551168 546672 542945 539557 535695 531633 528245 525717 523973 523695 525601 529203 533408
58670E33408M360M517M595N229P230R605J0471J0179J1056J3503J4950J3440R856
$$ 533408 537768 542285 546880 552109 559339 568944 579415 589594 600650 614153 629103 642543 652399
58657F52399N789J628k272m903o282p764r720j0792j0299r359q845q230p218o475
$$ 652399 658188 659816 657544 652641 646359 638595 628875 618083 607784 598425 589580 581350 574132 567657
58643E67657o023m991l485k647k383j391J08L26q19j197K0J137J192J440K432
$$ 567657 561634 556643 553158 550511 548128 546737 546845 547171 546352 545155 545175 546312 547504 548944 551376
58628E51376K550J007m14k75L67L59N36J718K929L309L679M646N251N036N302
$$ 551376 553926 554933 554519 554244 554611 554970 555506 557224 560153 563462 567141 571787 577038 582074 587376
58613E87376O793Q193Q365Q080Q063P561O172M939M174K575m2j507n44J036J122
$$ 587376 594169 602362 610727 618807 626870 634431 640603 645542 649716 652291 652249 650742 650198 651234 652356
58598F52356J72m24p01j082r38P7J041J592K806N003O825P725R033J1219J2722
$$ 652356 652528 652104 651403 650321 649383 649460 650501 652093 654899 659902 666727 674452 683485 694704 707426
58583G07426J2893J3416J5077J5969J4785J3158J2558J1649R121O544N774N946
$$ 707426 720319 733735 748812 764781 779566 792724 805282 816931 826052 832596 838370 844316
58571H44316N669N970Q249J1360J3501J5284J8177K1573K4079K6170K8940L1547
$$ 844316 849985 855955 864204 875564 889065 904349 922526 944099 968178 994348 1023288 1054835
58559A054835L2392L1720L0770K9382K6506K2022J6345R487K097l996p843j0463
$$ 1054835 1087227 1118947 1149717 1179099 1205605 1227627 1243972 1253459 1255556 1251560 1243717 1233254
58547A233254j2679j3778j3650j3908j5263j6129j5691j5978j8745k2704k5915
$$ 1233254 1220575 1206797 1193147 1179239 1163976 1147847 1132156 1116178 1097433 1074729 1048814
58536A048814k8588l1254l2571l1498k9410k7632k5074k0803j6613j4326j2681
$$ 1048814 1020226 988972 956401 924903 895493 867861 842787 821984 805371 791045 778364
58525G78364r755o438m623l845k601j250q00n03N98J348M43r27j006m49p46j381
$$ 778364 768609 762171 757548 753703 751102 749852 749052 748549 749147 750495 750938 750011 749005 748556 747810 746429
58509G46429j189r31j885l332l907l958m250m033k652j297r35m93P61J294J68
$$ 746429 745240 744309 742424 739092 735185 731227 726977 722944 720292 718995 718060 717567 718328 719622 719790
58494G19790o31O69K557L080L305N005P312Q741J0199J2823J5117J5537J5608
$$ 719790 719159 719828 722385 725465 728770 733775 741087 749828 760027 772850 787967 803504 819112
58481H19112J7216J9056J9230J9007K0398K2133K1758J9659J7408J4144Q483J997
$$ 819112 836328 855384 874614 893621 914019 936152 957910 977569 994977 1009121 1017604 1019601
58469A019601k939o948j1608j5638j6957j6617j6682j6130j2910q220m740k271
$$ 1019601 1016662 1009714 998106 982468 965511 948894 932212 916082 903172 894952 890212 887941
58457H87941Q25L758M972N795Q214J0783J1038J0033J0057R732O159L04m626q540
$$ 887941 888766 892524 897496 903291 911505 922288 933326 943359 953416 963148 969307 969611 964985 956445
58443I56445j3258j7471j8176j6162j4839j4358j1983p705m419k807q66J661K924
$$ 956445 943187 925716 907540 891378 876539 862181 850198 842493 838074 835267 834401 836062 838986
58430H38986K925L493M586M691M508O053Q644R845R779J0395J1150R680O102K513
$$ 838986 841911 845404 849990 854681 859189 865242 873886 883731 893510 903905 915055 924735 930837 933350
58416I33350r86n532r715j0968r978r541r899r432q753r578j0632r406o950o208
$$ 933350 932364 926832 917117 906149 896171 886630 876731 867299 858546 848968 838336 828930 821980 815772
58402H15772o757n968m185l678l651j594J409K108R26J038K482K675J893K617
$$ 815772 809015 803047 798862 795184 791533 789939 791348 793456 794382 795420 797902 800577 802470 805087
58388H05087M127L516J445J185K485K239P24J180L472M218L076L045M550N118
$$ 805087 809214 812730 814175 815360 817845 820084 820808 821988 825460 829678 832754 835799 840349 845467
58374H45467M792O025Q295Q661P534Q031R936J0239R308J0220J2405J2450J0871
$$ 845467 850259 856284 864579 873240 880774 888805 898741 908980 918288 928508 940913 953363 964234
58361I64234J1361J3524J3331J0754R814J0811R765O072L405K347m75m981o733
$$ 964234 975595 989119 1002450 1013204 1023018 1033829 1043594 1049666 1053071 1055418 1054943 1049962 1043229
58348A043229m725k931k862j538J825M094M576O235R337J0644J0059J1178J4235
$$ 1043229 1038504 1035573 1032711 1031173 1032998 1037092 1041668 1047903 1057240 1067884 1077943 1089121 1103356
58335A103356J5565J4981J6265J9298J9437J6051J3918J4593J4154J1223R290
$$ 1103356 1118921 1133902 1150167 1169465 1188902 1204953 1218871 1233464 1247618 1258841 1268131
58324A268131R201P256K903N27J418J618j27n4K847M559L747M084O685P928O944
$$ 1268131 1277332 1284588 1287491 1288018 1289436 1291054 1290927 1290873 1293720 1298279 1302026 1306110 1312795 1320723 1327667
58309A327667P486J0354J1726J0878J1538J3916J3777J1013J0506J2847J3267
$$ 1327667 1335153 1345507 1357233 1368111 1379649 1393565 1407342 1418355 1428861 1441708 1454975
58298A454975J1369J2295J6457J8172J6571J7457K1817K3327K0192J8561K0790
$$ 1454975 1466344 1478639 1495096 1513268 1529839 1547296 1569113 1592440 1612632 1631193 1651983
58287A651983K1373J8258J7120K0279K2369K1279K2421K7685L1196L0586L1488
$$ 1651983 1673356 1691614 1708734 1729013 1751382 1772661 1795082 1822767 1853963 1884549 1916037
58276A916037L6261L9633M0049M3737N2559N9598O1743O4657P0263P1885O7229
$$ 1916037 1952298 1991931 2031980 2075717 2128276 2187874 2249617 2314274 2384537 2456422 2523651
58265B523651O3497O3932O2272N6308N3375N6047N6239N0315M6135M8089M9389
$$ 2523651 2587148 2651080 2713352 2769660 2823035 2879082 2935321 2985636 3031771 3079860 3129249
58254C129249M6561M6959N4027N9939O0936O4924P5389Q3336Q4093Q6243R4817
$$ 3129249 3175810 3222769 3276796 3336735 3397671 3462595 3537984 3621320 3705413 3791656 3886473
58243C886473J01901J03469J08533J21376J32017J35031J40178J53282J64874
$$ 3886473 3988374 4091843 4200376 4321752 4453769 4588800 4728978 4882260 5047134
58234E047134J69372J76630J92331K06594K14626K28174K53017K76499K91568
$$ 5047134 5216506 5393136 5585467 5792061 6006687 6234861 6487878 6764377 7055945
58225G055945L10830L41782L71635L92919M19692M60932N03423N39552N85291
$$ 7055945 7366775 7708557 8080192 8473111 8892803 9353735 9857158 10396710 10982001
58216A0982001O50747P20892P86704Q65896R70415J085273J204113J352338J549368
$$ 10982001 11632748 12353640 13140344 14006240 14976655 16061928 17266041 18618379 20167747
58207B0167747J785040K062195K421953K893190L458448M105061M864645N764168
$$ 20167747 21952787 24014982 26436935 29330125 32788573 36893634 41758279 47522447
58199D7522447O788626P932262R226251J0669033J2197960J3774631J5393257
$$ 47522447 54311073 62243335 71469586 82138619 94336579 108111210 123504467
58192A23504467J6925855J8092534J8745282J9118911J9688631K0888109K3036111
$$ 123504467 140430322 158522856 177268138 196387049 216075680 236963789 259999900
58185B59999900K6119264K9038483K9153367K3499425J1295880m724421j9853589
$$ 259999900 286119164 315157647 344311014 367810439 379106319 374381898 354528309
58178C54528309l0423869l5455627l5989447l3602017k9632828k5087646k0587140
$$ 354528309 324104440 288648813 252659366 219057349 189424521 164336875 143749735
58171A43749735j6369227j2595258r649959p966906p570441p945626q395697q463553
$$ 143749735 127380508 114785250 105135291 97168385 89597944 81652318 73256621 64793068
58163F4793068q052913p299171o399333n502196m675796l941138l313620k799706
$$ 64793068 56740155 49440984 43041651 37539455 32863659 28922521 25608901 22809195
58155B2809195k379873k027464j735199j502277j311269j141943r94245q75140
$$ 22809195 20429322 18401858 16666659 15164382 13853113 12711170 11716925 10841785
58147A0841785p76333o85958o08071n49608n01596m53309m11266l84367l63599
$$ 10841785 10065452 9379494 8771423 8221815 7720219 7266910 6855644 6471277 6107678
58138F107678l36092l06516k85160k67129k42691k16752j98980j84871j65115
$$ 6107678 5771586 5465070 5179910 4912781 4670090 4453338 4254358 4069487 3904372
58129C904372j44366j33222j30107j27359j26470j31397j35381j30178j20570
$$ 3904372 3760006 3626784 3496677 3369318 3242848 3111451 2976070 2845892 2725322
58120B725322j15029j10166r8922q5895p9563p6671o9025n8881n3567n1122m5128
$$ 2725322 2610293 2500127 2401205 2315310 2235747 2159076 2090051 2031170 1977603 1926481 1881353
58109A881353l7779l5094l4812l1679k9070l3064m0459m4544m7343n4664o4265
$$ 1881353 1843574 1808480 1773668 1741989 1712919 1679855 1639396 1594852 1547509 1492845 1428580
58098A428580p0078p2543p3841o8952n3124l2943j8630j0295k593K666L73o298
$$ 1428580 1358502 1285959 1212118 1143166 1090042 1057099 1038469 1028174 1025581 1028247 1028620 1022322
58086A022322r941j0740j3428j6508j5368j2440j3470j6903j7104j4893j5016
$$ 1022322 1012381 1001641 988213 971705 956337 943897 930427 913524 896420 881527 866511
58075H66511j6507j5306j3244j4777j7890j7683j5792j6953j9485j8616j6041
$$ 866511 850004 834698 821454 806677 788787 771104 755312 738359 718874 700258 684217
58064F84217j6618j8596j6711j2224j0335j0240p308k839k064m379m905l960n706
$$ 684217 667599 649003 632292 620068 609733 599493 592185 589346 587282 582903 577998 574038 568332
58051E68332r073r230o811o707q684q044m836l840n721o414m983m407m870l626
$$ 568332 559259 550029 543218 536511 527827 519783 514947 511107 505386 498972 493989 489582 484712 481086
58037D81086j249j022k559k631j526k086l621l400k781n040q594r286p986q774
$$ 481086 479837 478815 476256 473625 472099 470013 466392 462992 460211 455171 446577 437291 429305 420531
58023D20531j0991j0494p611o382o742m972j285L33m95l99R06N74r99p43N74n94
$$ 420531 409540 399046 391435 385053 378311 373339 372054 372387 371892 371493 372399 372973 371974 371231 371805 371211
58007C71211l353l260l16R57m75j072R4rj939k607j383j088k130j680O00J808
$$ 371211 367858 364598 364282 365239 364764 363692 363786 363777 361838 359231 357848 356760 354630 352950 353550 355358
57991C55358J297J327J902P44j366j131J135J728J84l17O09j00k625l528k171
$$ 355358 356655 357982 359884 360628 359262 358131 359266 360994 361178 360861 361470 361370 358745 355217 353046
57976C53046j808l274l557j823r77j915j926k78J34j669k820j828q03r34n48R06
$$ 353046 351238 347964 344407 342584 341607 339692 337766 337488 337622 335953 333133 331305 330502 329568 329020 329926
57960C29926J529R62J272K750L192K267K112K913K444P24L55J576J836R15J430
$$ 329926 331455 332417 333689 336439 339631 341898 344010 346923 349367 350091 350446 352022 353858 354773 356203
57945C56203L510M274L474M265P149Q671P593O983Q423R374Q347P586Q423Q750
$$ 356203 359713 363987 367461 371726 378875 387546 395139 402122 410545 419919 428266 435852 444275 453025
57931D53025P404O488P006O532L566R3k390n342r479j2586j3297j3397j4284j4637
$$ 453025 460429 466917 473923 480455 484021 484114 481724 476382 466903 454317 441020 427623 413339 398702
57917C98702j3524j2349j1922j0965r164q194q256p284m923l550l857l433j186
$$ 398702 385178 372829 360907 349942 340778 332584 324328 317044 312121 308571 304714 301281 300095
57904C00095P50J167J683K848K609N09p15K27J044M77P54L118N056M702M098N206
$$ 300095 300845 302012 303695 306543 309152 309661 308946 309173 310217 310694 311448 314566 319622 324324 328422 333628
57888C33628O380N718M549M536M375K422j78j677k518l522l878l237l244m829
$$ 333628 340008 345726 350275 354811 359186 361608 361430 359753 357235 353713 349835 346598 343354 338525
57874C38525o451o913p259q035p765n977m739n117n231l836k575k558k031O7J589
$$ 338525 332074 325161 317902 309867 302102 296125 291386 286269 281038 277202 274627 272069 270038 270105 271694
57859B71694Q72j86N08J795J938J896L003M063L716L142L620L839K451Q85P73
$$ 271694 272566 272380 272888 274683 276621 278517 281520 285583 289299 292441 296061 299900 302351 303236 304009
57844C04009R64j16j434j579j631k856l720k369j86L13n61p72j07K90N42J463
$$ 304009 304973 304857 303423 301844 300213 297357 293637 291268 291082 291395 290834 290062 289955 290245 290787 292250
57828B92250K509K793K970L866M553L909K750K419K631K657K922L588L343J681
$$ 292250 294759 297552 300522 304388 308941 312850 315600 318019 320650 323307 326229 329817 333160 334841
57814C34841M67J130K155J593J28o38j020j903k385j422k95q82k826m641o194
$$ 334841 335308 336438 338593 340186 340314 339676 338656 336753 334368 332946 332651 331769 328943 324302 318108
57799C18108p782q416p398o179o257o685n950m754m466m376l084j265m56k29Q42
$$ 318108 310326 301910 294512 288333 282076 275391 269441 264687 260221 255845 252761 251496 251040 250811 251653
57784B51653K479L383L666M337N251N695O047O923P667P592P392P547O885M763
$$ 251653 254132 257515 261181 265518 270769 276464 282511 289434 297101 304693 312085 319632 326517 331280
57770C31280K983L158L817K671L01j143j645k872m969o533p100p243o804n402
$$ 331280 334263 337421 341238 343909 344210 343067 341422 338550 333581 327048 319948 312705 305901 300499
57756C00499m016l897m576m849m873n211m964l125r04l37j301k073k045j806j360
$$ 300499 296483 292586 288010 283161 278288 273077 268113 264988 264084 263747 262446 260373 258328 256522 255162
57741B55162m60J12l45r07n43j47r71k142k066j146p77o58L14J404J048j96l99
$$ 255162 254702 254814 254469 253562 253019 252872 251901 249759 247693 246547 245770 245112 245426 246830 247878 247682 247283
57724B47283N36R82M83Q9M7l89j031q66k6L76J33j28m87j294j791j105j17l16
$$ 247283 247819 248801 249284 249373 249420 249031 248000 247134 247108 247484 247617 247489 247002 245708 243917 242812 242695 242379
57706B42379j406k044k230k849l440k780j196q4M53J246J879J258L0L9J481K757
$$ 242379 240973 238929 236699 233850 230410 227630 226434 226350 226803 228049 229928 231186 231216 231255 232736 235493
57690B35493K970K590J919R70N60J440K668K960L202N316R106J2688J5813K0049
$$ 235493 238463 241053 242972 243942 244502 245942 248610 251570 254772 260088 269194 281882 297695 317744
57676C17744K5652L0913L5039L9226M4233M8943N2099N3816N5013N6994O1706
$$ 317744 343396 374309 409348 448574 492807 541750 593849 647665 702678 759672 821378
57665H21378P0295Q0325Q5462P8570N5402J7065k8862p0466r7820j08637j07293
$$ 821378 891673 971998 1057460 1136030 1191432 1208497 1179635 1109169 1011349 902712 795419
57654G95419r9167q7454p4238o1427m9884l9509l0662k4096j9501j5690j2334
$$ 795419 696252 608798 534560 473133 423249 383740 353078 328982 309481 293791 281457
57643B81457r985q517p098n637m740m383m042l741l636l106j806q99j375k052
$$ 281457 271472 262955 255857 250220 245480 241097 237055 233314 229678 226572 224766 223867 222492 220440
57629B20440j278J35N0j471k411k175k117k751l041k670k588k992l058k874l398
$$ 220440 219162 219297 219347 217876 215465 213290 211173 208422 205381 202711 200123 197131 194073 191199 187801
57614A87801m227l801k157j142j453j751j293j176k100k974k726j806j060n86
$$ 187801 183574 179773 177616 176474 175021 173270 171977 170801 168701 165727 163001 161195 160135 159549
57600A59549l48n30p79m28K25J15r54k208l278m203m357l191j836j934l074l390
$$ 159549 159201 158671 157892 157464 157689 157804 156850 154642 151364 147161 142804 139613 137777 135843 132769 129379
57584A29379k633k329k926l131k433j897k016j998j692k057l175l879l825l946
$$ 129379 126746 124417 121491 118360 115927 114030 112014 110016 108324 106267 103092 99213 95388 91442
57570I1442m362m004k833k247k647k738j947j425j866k384k351k360k580k102
$$ 91442 87080 83076 80243 77996 75349 72611 70664 69239 67373 64989 62638 60278 57698 55596
57556E5596o95N47J090J598K179J943R34N14J079J465J268J642K986L974L782
$$ 55596 54901 55448 56538 58136 60315 62258 63192 63706 64785 66250 67518 69160 72146 76120 79902
57541G9902L166K570J318m24j174o76n92j567k004j001p9m24p53J84J235R69K29
$$ 79902 83068 85638 86956 86532 85358 84682 84090 82523 80519 79518 79439 79015 78262 78446 79681 80650 80879
57524H0879M15R53O32M8M25J235J131L82L15R80J313J113J208J850K421K476K126
$$ 80879 81294 82247 82879 82927 83352 84587 85718 86100 86415 87395 88708 89821 91029 92879 95300 97776 99902
57507I9902J637J369J608J913J384J07o96n02l30j022j915k051j541r40l74o8
$$ 99902 101539 102908 104516 106429 107813 107920 107224 106722 106392 105370 103455 101404 99863 98923 98549 98481
57491I8481n53j588k081j811j880k735l236k534j469j070j171j467k410l855m374
$$ 98481 97928 96340 94259 92448 90568 87833 84597 82063 80594 79524 78353 76886 74476 70621 66247
57476F6247l237j752j370j713j817j967k796l659l464k335j134j72M96L67p65
$$ 66247 63010 61258 59888 58175 56358 54391 51595 47936 44472 42137 41003 40831 41327 41694 40929
57461D0929k065k640k498j940r60K0Q7p21j129n58j6k87o87n61m46p82j016j006
$$ 40929 38864 36224 33726 31786 30826 30846 30933 30212 29083 28525 28509 28222 27535 26974 26528 25746 24730 23724
57443B3724j607k687k412pK493K899J703O54O8n99j005p04m57q81r94J05J227
$$ 23724 22117 19430 17018 17011 19504 22403 24106 24760 24828 24229 23224 22520 22063 21182 20188 20293 21520
57426B1520P70o92j459j316j208j175o75j91n28j165j112p13q50j129p23k23o27
$$ 21520 22290 21598 20139 18823 17615 16440 15765 15574 15046 13881 12769 12056 11206 10077 9354 9131 8504
57409H504j208n09J051J728J259R74J312J227K26q52j305j273r27l15K4l95r00
$$ 8504 7296 6787 7838 9566 10825 11799 13111 14338 14564 13712 12407 11134 10207 9892 9916 9521 8621
57392H621l90R79K118K754L481M281M422L764K957K383K004K077K821L548L272
$$ 8621 8231 9210 11328 14082 17563 21844 26266 30030 32987 35370 37374 39451 42272 45820 49092
57377D9092K036P17k68j041j450j196n48l0J84j12j414l477m857m613l665l321
$$ 49092 51128 51845 51577 50536 49086 47890 47342 47312 47496 47384 45970 42493 37636 33023 29358 26037
57361B6037l291k532j201k78J8m6q09k408l518k750q14L59K63p8k49p50j417j360
$$ 26037 22746 20214 19013 18735 18753 18707 17898 15490 11972 9222 8408 8767 9030 8952 8703 7953 6536 5176
57343E176o14k58p29j347F45i26j325p09j44k21o38o21j80O2L6Q2K1n07j084j060
$$ 5176 4562 4304 3575 2228 645 -926 -2251 -2960 -3104 -3325 -3963 -4584 -4764 -4702 -4666 -4584 -4563 -5070 -6154 -7214
57323g214p05p22r81r15o65p23q76o60l72m28m13L3J62o47j444j094k94l74q80
$$ -7214 -7919 -8641 -9622 -10537 -11202 -11925 -12801 -13461 -13833 -14261 -14674 -14641 -14479 -15126 -16570 -17664 -17958 -18332 -19212
57304a9212l74Q45J063j7q27m48L38P27Q85J005Q86O97R26J401J534J420J536
$$ -19212 -19586 -18741 -17678 -17695 -18522 -18970 -18632 -17905 -17020 -16015 -15129 -14432 -13506 -12105 -10571 -9151 -7615
57287g615J662J209L80l29j217k634l716l493k622k430k780k703k519l262m400
$$ -7615 -5953 -4744 -4364 -4693 -5910 -8544 -12260 -15753 -18375 -20805 -23585 -26288 -28807 -32069 -36469
57272c6469m359l065j884j248n01P0n45j780j813m94L18k25r06q01o20r28j090
$$ -36469 -40828 -43893 -45777 -47025 -47526 -47456 -48001 -49781 -51594 -52088 -51770 -51995 -52901 -53702 -54322 -55250 -56340
57255e6340p59n84p71n82P9K04n19j073p68j20L63P08N22p93k471k828j661m70
$$ -56340 -57099 -57683 -58454 -59036 -58957 -58753 -59272 -60345 -61113 -61233 -60870 -60162 -59640 -60433 -62904 -65732 -67393 -67863
57237f7863J06J054K673L664L367L024L812N266O614Q049R670i887F95J0011R464
$$ -67863 -67757 -66703 -64030 -60366 -56999 -53975 -50163 -44897 -38283 -30234 -20564 -9887 695 10706 20170
57222B0170Q690P826P745Q562R235R336R722J0844J1993J2973J4825J7915K0905
$$ 20170 28860 36686 44431 52993 62228 71564 81286 92130 104123 117096 131921 149836 170741
57209A70741K2659K3816K5435K7474K9537L1779L4075L5524L5857L6151L7263
$$ 170741 193400 217216 242651 270125 299662 331441 365516 401040 436897 473048 510311
57198E10311L8770M0240M2327M5617M9527N3161N6166N8035N7909N6013N4092
$$ 510311 549081 589321 631648 677265 726792 779953 836119 894154 952063 1008076 1062168
57187A062168N3607N4513N6374N9192O2267O3705O2297N8844N4733N0285M5377
$$ 1062168 1115775 1170288 1226662 1285854 1348121 1411826 1474123 1532967 1587700 1637985 1683362
57176A683362M0564L6628L3898L2711L3470L5658L7864L9350M0363M0460L8213
$$ 1683362 1723926 1760554 1794452 1827163 1860633 1896291 1934155 1973505 2013868 2054328 2092541
57165B092541L3380K7888K3767K1464K0932K2683K6739L2015L7816M4454N1478
$$ 2092541 2125921 2153809 2177576 2199040 2219972 2242655 2269394 2301409 2339225 2383679 2435157
57154B435157N6988N9914O1313O2101O1187N7494N2275M7633M3874M0202L6972
$$ 2435157 2492145 2552059 2613372 2675473 2736660 2794154 2846429 2894062 2937936 2978138 3015110
57143C015110L5428L5841L7594M0598M5260N1530N9126O7889P6723Q2970Q4247
$$ 3015110 3050538 3086379 3123973 3164571 3209831 3261361 3320487 3388376 3465099 3548069 3632316
57132C632316Q0601P3984O6301N8884N2922M9058M6961M6015M5825M5502M3746
$$ 3632316 3712917 3786901 3853202 3912086 3965008 4014066 4061027 4107042 4152867 4198369 4242115
57121D242115M0574L7785L6772L7044L7927M0295M5108N1431N7429O2507O7161
$$ 4242115 4282689 4320474 4357246 4394290 4432217 4472512 4517620 4569051 4626480 4688987 4756148
57110D756148P1821P7325Q5528R7820J13914J33621J59006J93389K39117K98039
$$ 4756148 4827969 4905294 4990822 5088642 5202556 5336177 5495183 5688572 5927689 6225728
57100F225728L72897M65640N74105O91923Q11536R26145J029931J119046J192989
$$ 6225728 6598625 7064265 7638370 8330293 9141829 10067974 11097905 12216951 13409940
57091A3409940J253253J300357J333140J348669J336494J269910J111127Q42757
$$ 13409940 14663193 15963550 17296690 18645359 19981853 21251763 22362890 23205647
57083B3205647N08440K19573J00940K04347M61856P24976Q59090Q13534O18736
$$ 23205647 23714087 23933660 24034600 24238947 24700803 25425779 26284869 27098403 27717139
57074B7717139L34322N372l44617o98485j033330j321342j538635j673551j728476
$$ 27717139 28051461 28056833 27712216 27013731 25980401 24659059 23120424 21446873 19718397
57065A9718397j714856j647179j540747j411466j273745j137738j009409q92337
$$ 19718397 18003541 16356362 14815615 13404149 12130404 10992666 9983257 9090920
57057I090920p88012o95449o12763n39427m75833m21425l74739l34751l00731
$$ 9090920 8302908 7607459 6994696 6455269 5979436 5558011 5183272 4848521 4547790
57048D547790k71326k45380k23065k04733j89207j74721j61029j48916j38214
$$ 4547790 4276464 4031084 3808019 3603286 3414079 3239358 3078329 2929413 2791199
57039B791199j27916j17798j08205r8741q8837p9224p1099o4104n6877m9202m1915
$$ 2791199 2663283 2545485 2437280 2338539 2249702 2170478 2099379 2035275 1978398 1929196 1887281
57028A887281l4999k7631j9891j2562n503J787Q201J1798J2707J3079J4019J5156
$$ 1887281 1852282 1824651 1804760 1792198 1786695 1788482 1796683 1808481 1821188 1834267 1848286 1863442
57016A863442J7951K6084L9588M9790M3629J4914k8904p1632j00028j11233j10343
$$ 1863442 1881393 1907477 1947065 1996855 2040484 2055398 2026494 1954862 1854834 1743601 1633258
57005A633258j03124r2419p9924o7937n7936m9328m1263l4456k9833k6683k3867
$$ 1633258 1530134 1437715 1357791 1289854 1231918 1182590 1141327 1106871 1077038 1050355 1026488
56994A026488k1863k1743k2898k3649k3581k3564k3771k3456k2377k0915j8987
$$ 1026488 1004625 982882 959984 936335 912754 889190 865419 841963 819586 798671 779684
56983G79684j6313j3390j0916q798p116p330j0538j5070j7768j7498j5621j3313
$$ 779684 763371 749981 739065 730267 723151 715821 705283 690213 672445 654947 639326 626013
56971F26013j0429o973l711r71J558L679M829N361O204P253P612P351P469Q250
$$ 626013 615584 608611 604900 603929 605487 609166 613995 619356 625560 632813 640425 647776 655245 663495
56957F63495R231J0628J2940J5004J4278R420J362q044j6866k2873k4608k3078
$$ 663495 672726 683354 696294 711298 725576 734996 736358 728314 711448 688575 663967 640889
56945F40889k0704j8383j5228j1199p814n753l761p90K439M795O296P500Q587
$$ 640889 620185 601802 586574 575375 567561 561808 558047 557257 559696 564491 570787 578287 586874
56932E86874R779J1642J4353J7313J9521J9364J4533L975r849k2261l0342l4384
$$ 586874 596653 608295 622648 639961 659482 678846 693379 697354 687505 665244 634902 600518
56920F00518l5569l4221l0852k6986k3801k1172j8756j6810j5365j3763j1662
$$ 600518 564949 530728 499876 472890 449089 427917 409161 392351 376986 363223 351561
56909C51561r483p431n178k859j247n77k86o8MM68K145M522N999O131O165P023
$$ 351561 342078 334647 329469 326610 325363 324786 324500 324432 324436 324904 327049 331571 337570 343701 349866 356889
56893C56889Q225R234J0347J1623J2348J2320J2401J3264J4759J6781J9210K0515
$$ 356889 365114 374348 384695 396318 408666 420986 433387 446651 461410 478191 497401 517916
56881E17916J8125J1316K488n206j0400j3102j3270j1068p520l762n7L800P770
$$ 517916 536041 547357 549845 544639 534239 521137 507867 496799 489279 485517 485460 489260 497030
56868D97030J1751J5848J9934K3488K6113K7700K8220K8238K9358L3068L8865
$$ 497030 508781 524629 544563 568051 594164 621864 650084 678322 707680 740748 779613
56857G79613M4257M6176M1649K8403P307j5860l3582m2407m4221m1989l6592k8299
$$ 779613 823870 870046 911695 940098 947405 931545 897963 855556 811335 769346 732754 704455
56845G04455j8642r225k65Q429J6379K3320K9763L5712M0115M2610M4567M7673
$$ 704455 685813 676588 676323 684752 701131 724451 754214 789926 830041 872651 917218 964891
56833I64891N2675N9842O8444P4336P0095N0172J6218k3345n8475q2122r1932
$$ 964891 1017566 1077408 1145852 1220188 1290283 1340455 1356673 1333328 1274853 1192731 1100799
56822A100799q9840q0186o7173n3503m0690k9383j9136r083N97Q903J5706K1919
$$ 1100799 1010959 930773 863600 810097 769407 740024 720888 711805 712402 721305 737011 758930
56810G58930K7616L1552L3383L5005L8693M4472M9400M8485L6774J2961j7848
$$ 758930 786546 818098 851481 886486 925179 969651 1019051 1067536 1104310 1117271 1099423
56799A099423m6447o5727p4160p3846o7487n7948m8181l9615l1591k3393j5691
$$ 1099423 1052976 987249 913089 839243 771756 713808 665627 626012 594421 571028 555337
56788E55337r203l487J922O571J0163J3276J6082J7964J9267K1572K4828K5671
$$ 555337 546134 542647 544569 551140 561303 574579 590661 608625 627892 649464 674292 699963
56776F99963K0287Q050q421k5373l9000m6350m7163m4133m0059l5614l0641k5997
$$ 699963 720250 728300 719879 694506 655506 609156 561993 517860 477801 442187 411546 385549
56764C85549k2582j9781j6638j3624j1745j0701r409p758o489n869n515n068m286
$$ 385549 362967 343186 326548 312924 301179 290478 281069 273311 266822 260953 255438 250370 246084
56751B46084l086k099k202k937k696j118P5l89j509j773j307r75o76n7L45J1m29
$$ 246084 242998 240899 238697 235760 233064 231946 232021 231632 230123 228350 227043 226068 225392 225335 225680 225691 225262
56734B25262l10j43n12q09m06Q3j0pQ91J999K223J832J763J943J752J394J506
$$ 225262 224952 224809 224297 223488 223082 223165 223155 223148 224039 226038 228261 230093 231856 233799 235551 236945 238451
56717B38451J987K281K262J923J050j9k59N66J333J269J016J213J378J163J177
$$ 238451 240438 242719 244981 246904 247954 247935 247676 248242 249575 250844 251860 253073 254451 255614 256791
56702B56791J556J268K7p85l78o5r79k042j861r92n80l02M09O83k31j111o10K85
$$ 256791 258347 259615 259642 258857 258479 258414 257435 255393 253532 252540 251960 251658 252067 252750 252519 251408 250798 251083
56684B51083j66j613k445k405k222j700l95P90P97L97P78J254N91k60N74K629
$$ 251083 250917 249304 246859 244454 242232 240532 240137 240927 241724 242121 242899 244153 244744 244484 245058 247687
56668B47687L612K825J707J201Q75N48O26Q79P19N61J137J820J526P92J028K026
$$ 247687 251299 254124 255831 257032 257907 258455 259081 259960 260679 261240 262377 264197 265723 266515 267543 269569
56652B69569K327J797J738K506L076K972K782K732K414J928J643J043m46j786
$$ 269569 271896 273693 275431 277937 281013 283985 286767 289499 291913 293841 295484 296527 296081 294295
56638B94295j347M95J651J193J20o76j329j750j332k84K43k48j121j836k498l098
$$ 294295 292948 293443 295094 296287 296407 295731 294402 292652 291320 291036 291279 291031 289910 288074 285576 282478
56622B82478l381l480l653l605l072k634k838l010k243j028n66r19j201j162j137
$$ 282478 279097 275617 271964 268359 265287 262653 259815 256805 254562 253534 252968 252049 250848 249686 248549
56607B48549r68l42K33J45j58%J91k71r19r10m74j89K66J130J432M90n17l20K86
$$ 248549 247581 247239 247472 247617 247459 247459 247650 247379 246460 245550 245076 244887 245153 246283 247715 248205 247688 247368 247654
56588B47654K0m10L69J674J875J269J241J438O33k62Q93L674N194M277K790K447
$$ 247654 247674 247264 247633 249307 251182 252451 253692 255130 255763 255501 256394 260068 265262 269539 272329 274776
56572B74776K820L036L168L312L179L096L741M687M870M530M943O259P425Q197
$$ 274776 277596 280632 283800 287112 290291 293387 297128 301815 306685 311215 316158 322417 329842 338039
56558C38039R432J1350J3118J4057J3700J1243O696K034p34k048l460m721m571
$$ 338039 347471 358821 371939 385996 399696 410939 417635 419669 418935 416887 413427 408706 404135
56545D04135l577l472m100l868k869k695l353l279k445k563l948m991n018m975
$$ 404135 400558 397086 392986 389118 386249 383554 380201 376922 374477 371914 367966 362975 357957 352982
56531C52982n023m224k971k942m181m846m337m002m304l996k736j895k013j993
$$ 352982 347959 343735 340764 337822 333641 328795 324458 320456 316152 312156 309420 307525 305512 303519
56517C03519j471j449j948j616l94o3j275k509k711k592k557j848n89k44j082
$$ 303519 302048 300599 298651 297035 296641 296578 295303 292794 290083 287491 284934 283086 282497 282253 281171
56502B81171j532r54o99j580k570k892l114l290k369l97R14P86L83L96j4j043
$$ 281171 279639 278685 277986 276406 273836 270944 267830 264540 262171 261774 262688 263474 263857 264253 264239 263196
56486B63196j362m83K81J76J71Q29J229J004J191K022K094R03NM73J191R04J01
$$ 263196 261834 261351 261632 261808 261979 262808 264037 265041 266232 268254 270348 271251 271256 271729 272920 273824 273925
56469B73925k49j03L45J087J407L95j139j298p1N25l41j261j223q74n25M90J796
$$ 273925 273676 273573 273918 275005 276412 276807 275668 274370 274299 274824 274483 273222 271999 271125 270600 271090 272886
56452B72886J927R62O70J353J245j98j298j207j116j430q45O85J145l5p28K35
$$ 272886 274813 275775 276445 277798 279043 278845 277547 276340 275224 273794 272949 273634 274779 274744 274016 274251
56436B74251J150P16K70R22J350L47r92j461j681k185j990p84l3l38j89J049J602
$$ 274251 275401 276117 276387 277309 278659 279006 278014 276553 274872 272687 270697 269913 269880 269542 269353 270402 272004
56419B72004M23p73m98J71J16M37K048L477L241K186J566R44r3m36M28J004L26
$$ 272004 272427 271654 271156 271327 271443 271880 273928 277405 280646 282832 284398 285342 285249 284813 285241 286245 286571
56402B86571l23J34O98O06R38K087K252M57j421j634j111j080p72M40J200O85
$$ 286571 286248 286382 287080 287686 288624 290711 292963 293420 291999 290365 289254 288174 287402 287842 289042 289727
56386B89727M47J514K206J105k90j82O53Q96J123J888J943O82o0Q96J754R24j43
$$ 289727 290174 291688 293894 294999 294709 294527 295180 296076 297199 299087 301030 301712 301652 302548 304302 305226 305083
56369C05083K16Q39L03j08J100K584K551J908K198K652K120J653K284K589J318
$$ 305083 305299 306138 306441 306333 307433 310017 312568 314476 316674 319326 321446 323099 325383 327972 329290
56354C29290J70R43K228J997J198J570K129J116m94p70j60k1K76J632K621J763
$$ 329290 329460 330403 332631 334628 335826 337396 339525 340641 340147 339377 339217 339196 339472 341104 343725 345488
56338C45488M78P19J564J285P09J365K355K325K455M069N443M508K671K378K905
$$ 345488 345966 346685 348249 349534 350243 351608 353963 356288 358743 362812 368255 372763 375434 377812 380717
56323C80717K270J291J780K579J513k95k09J169J056p31j945j885j617j206j03
$$ 380717 382987 384278 386058 388637 390150 389855 389646 390815 391871 391140 389195 387310 385693 384487 384384
56308C84384P41L78K60J903L741L523K277K346L236L159K978M574O730O844N508
$$ 384384 385125 385503 385763 387666 391407 394930 397207 399553 402789 405948 408926 413500 420230 427074 432582
56293D32582N319O206N992M685M202M595M459M260N561P605Q331Q027Q573R915
$$ 432582 437901 444107 450099 454784 458986 463581 468040 472300 477861 485466 493797 501824 510397 520312
56279E20312J0724J1438J3206J4946J5010J4495J5377J6759J6636J5973J7087
$$ 520312 531036 542474 555680 570626 585636 600131 615508 632267 648903 664876 681963
56268F81963J9421K0999K2558K6041L0329L2880L4480L7909M3000M7403N1332
$$ 681963 701384 722383 744941 770982 801311 834191 868671 906580 949580 996983 1048315
56257A048315N7056O4504P1729P8879Q7491R6707J04596J12193J21746J31945
$$ 1048315 1105371 1169875 1241604 1320483 1407974 1504681 1609277 1721470 1843216 1975161
56247A975161J39519J44703J50297J56088J59083J58690J56753J52838J44299
$$ 1975161 2114680 2259383 2409680 2565768 2724851 2883541 3040294 3193132 3337431
56238C337431J30996J15350R7898P7014N2787K7045J45k8084n5085p7712r6708
$$ 3337431 3468427 3583777 3681675 3758689 3811476 3838521 3838666 3810582 3755497 3677785 3581077
56227C581077j14565j30165j40419j46009j50172j52766j51195j46413j42169
$$ 3581077 3466512 3336347 3195928 3049919 2899747 2746981 2595786 2449373 2307204
56218B307204j38581j32371j23320j14766j07621r9629r0759q3627p8193p1633
$$ 2307204 2168623 2036252 1912932 1798166 1690545 1590916 1500157 1416530 1338337 1266704
56208A266704o3932n8057n4205m9444m3550l9529l7632l4603k9697k5967k4519
$$ 1266704 1202772 1144715 1090510 1041066 997516 957987 920355 885752 856055 830088 805569
56197H05569k2845j9888j7581j6344j4160j1063r548r762r230p871q105r506q739
$$ 805569 782724 762836 745255 728911 714751 703688 694140 684378 675148 667277 659172 649666 640927
56184F40927n559l430l450l061j515j136k246k274p84j87o90J17K122K617J740
$$ 640927 635368 631938 628488 625427 623912 622776 620530 618256 617472 617285 616595 616712 618834 621451 623191
56169F23191K387M293M198K282K237M441N461M976O393R738J0873R078Q533J0757
$$ 623191 625578 629871 634069 636351 638588 643029 648490 653466 659859 669597 680470 689548 698081 708838
56155G08838J2445J2374J3591J6916J9138J9713K2307K7661L1809L3568L6858
$$ 708838 721283 733657 747248 764164 783302 803015 825322 852983 884792 918360 955218
56144I55218M3230M9195N3468N9620O8656P5998P9297Q2535Q8944R6222J01919
$$ 955218 998448 1047643 1101111 1160731 1229387 1305385 1384682 1467217 1556161 1652383 1754302
56133A754302J07077J10939J08538R7523Q1980O6348N1184L7654K9740K8248K8043
$$ 1754302 1861379 1972318 2080856 2178379 2260359 2326707 2377891 2415545 2445285 2473533 2501576
56122B501576K4476J7564P739o175k2158l4520m1270m6263n1932n6432o0131o7600
$$ 2501576 2526052 2543616 2551355 2545180 2523022 2488502 2447232 2400969 2349037 2292605 2232474 2164874
56110B164874p9952r2037j00170j05883j09334j06606r6969q5616p5777o5083
$$ 2164874 2084922 1992885 1892715 1786832 1677498 1570892 1473923 1388307 1312530 1247447
56100A247447n2814m3153l7670l2182k4758j9320j7625j5470j0736p332p176o209
$$ 1247447 1194633 1151480 1113810 1081628 1056870 1037550 1019925 1004455 993719 986387 979211 973002
56088I73002k506k08j043l21M038O860N099L534N866Q336P614P006R253J0998
$$ 973002 970496 970288 969245 968924 972962 979822 984921 988455 994321 1002657 1010271 1017277 1026530 1037528
56074A037528R936R674J2206J3477J1617J1353J4940J7213J5209J3862J6389J7908
$$ 1037528 1047464 1057138 1069344 1082821 1094438 1105791 1120731 1137944 1153153 1167015 1183404 1201312
56062A201312J4808J1551J1770J1541Q042N938Q371J0485Q703P480J0041J1625
$$ 1201312 1216120 1227671 1239441 1250982 1259024 1264962 1273333 1283818 1292521 1300001 1310042 1321667
56050A321667R000P257R973J2113J0200R712J4605J9314J9263J9419K4058K8017
$$ 1321667 1330667 1337924 1347897 1360010 1370210 1379922 1394527 1413841 1433104 1452523 1476581 1504598
56038A504598K6774K5356K8493L1824L1789L4032M2884N2442N7036O0231O4668
$$ 1504598 1531372 1556728 1585221 1617045 1648834 1682866 1725750 1778192 1835228 1895459 1960127
56027A960127O4166N5341M5894M1643L6920K7555K0898K2349K4627K1788K1147
$$ 1960127 2024293 2079634 2125528 2167171 2204091 2231646 2252544 2274893 2299520 2321308 2342455
56016B342455K9407L9828M5399N1640O3627P3801P6093P8562Q8093R6351R5358
$$ 2342455 2371862 2411690 2457089 2508729 2572356 2646157 2722250 2800812 2888905 2985256 3080614
56005C080614R2931R7672J03052J02021J02564J12331J22630J24754J27042J38395
$$ 3080614 3173545 3271217 3374269 3476290 3578854 3691185 3813815 3938569 4065611 4204006
55995D204006J50528J54820J60458J76691J93810K01820K10760K31508K54142
$$ 4204006 4354534 4509354 4669812 4846503 5040313 5242133 5452893 5684401 5938543
55986E938543K67397K81314L07473L35701L54752L76369M13293M53985M86117
$$ 5938543 6205940 6487254 6794727 7130428 7485180 7861549 8274842 8728827 9214944
55977I214944N23495N81065O45977P03963P70483Q63186R69208J075115J202737
$$ 9214944 9738439 10319504 10965481 11669444 12439927 13303113 14272321 15347436 16550173
55968A6550173J377914J593029J841645K158582K579282L091385L675945M361908
$$ 16550173 17928087 19521116 21362761 23521343 26100625 29192010 32867955 37229863
55960C7229863N186370O139390P205651Q414511R781648J1252369J2772500J4335409
$$ 37229863 42416233 48555623 55761274 64175785 73957433 85209802 97982302 112317711
55952A12317711J5851591J7065511J7782261J8157502J8632751J9652055K1560817
$$ 112317711 128169302 145234813 163017074 181174576 199807327 219459382 241020199
55945B41020199K4470223K7597240K8635514K4553483J3915047j385919j6992765
$$ 241020199 265490422 293087662 321723176 346276659 360191706 358805787 341813022
55938C41813022k8858657l5302283l6903162l5182886l1617199k7344702k3112392
$$ 341813022 312954365 277652082 240748920 205566034 173948835 146604133 123491741
55931A23491741j9267609j5905131j3061947j0748182q887652p362316o109143
$$ 123491741 104224132 88319001 75257054 64508872 55621220 48258904 42149761
55924D2149761n107392m306034l638103l081859k642273k292157j988011j723467
$$ 42149761 37042369 32736335 29098232 26016373 23374100 21081943 19093932 17370465
55916A7370465j513820j345446j188963j045485r33987q47189p61887o79316o15790
$$ 17370465 15856645 14511199 13322236 12276751 11342764 10495575 9733688 9054372 8438582
55907H438582n65662n10521m53776m11497l79581l42563l04644k80727k66158
$$ 8438582 7872920 7362399 6908623 6497126 6117545 5774982 5470338 5189611 4923453
55898D923453k45152k20384k05782j98236j83819j64591j53158j47688j36958
$$ 4923453 4678301 4457917 4252135 4053899 3870080 3705489 3552331 3404643 3267685
55889C267685j23531j18219j17905j11530j01708r8645r8873r1408p9038p2742
$$ 3267685 3144154 3025935 2908030 2796500 2694792 2596147 2497274 2405866 2326828 2254086
55879B254086p0702o3126n2290m7861m7463m1266l1075k6218k5257k0324j5015
$$ 2254086 2183384 2120258 2067968 2020107 1972644 1931378 1900303 1874085 1848828 1828504 1813489
55868A813489j9560l1882m1041m5903n3358o1890o4043o2153o5015p1592p3581
$$ 1813489 1793929 1762047 1721006 1675103 1621745 1559855 1495812 1433659 1368644 1297052 1223471
55857A223471p0905o9090o4638m9252k6489q733N30O973J0684O472k853q403r637
$$ 1223471 1152566 1083476 1018838 969586 943097 934364 934894 941867 952551 959023 956170 947767 938130
55844I38130j3211j8875k0098j7473j7931k1329k0983j6853j5458j7231j6286
$$ 938130 924919 906044 885946 868473 850542 829213 808230 791377 775919 758688 742402
55833G42402j2373j1081j2478j1258p779p621j0532j0793q182p851r924r752p760
$$ 742402 730029 718948 706470 695212 687433 679812 669280 658487 650305 642454 632530 622778 615018
55820F15018q519j0904r691o010n650p888o762k624j587l904l738l74J008j67
$$ 615018 606499 595595 585904 579894 574244 566356 559594 556970 555383 551479 547741 547367 548375 548208
55806E48208R32M522N529L435L063N102N358L704M352O893O480L182J773K081
$$ 548208 549140 553662 559191 562626 565689 570791 576149 579853 584205 591098 597578 600760 602533 604614
55792F04614q77o803r818q963r396j2315j3125j0800r648j0323q199k477J790
$$ 604614 603737 596934 587116 578153 568757 556442 543317 532517 522869 512546 504347 501870 503660
55779E03660K431K629L201R48l644n350k920r70j526j342P43J625Q61K009N085
$$ 503660 506091 508720 511921 512869 509225 503875 500955 499985 498459 497117 497860 499485 500346 502355 507440
55764E07440N184P13m133o891r784j3427j4819j3594j3419j5194j5381j2810j0636
$$ 507440 512624 513337 509204 502313 492529 479102 464283 450689 437270 422076 406695 393885 383249
55751C83249r969q258n389m671o264o359m372m115o285o924m982m287o028o400
$$ 383249 373280 365022 359633 354962 348698 342339 337967 333852 327567 320643 315661 311374 305346 298946
55737B98946l934k139k478j706J197K258k94k575j866q18j751k632j868j531k796
$$ 298946 295012 292873 290395 288689 289886 292144 291850 289275 287409 286591 284840 282208 280340 278809 276013
55722B76013l282j845r82j931k305r45j01o10o3K082K856J362O94K042K438O97
$$ 276013 272731 270886 269904 267973 265668 264723 264622 264012 263949 266031 268887 270249 270943 272985 275423 276120
55706B76120M5K084L603K330O40N62R9k350m595m796m573n189m974l219k288l141
$$ 276120 276165 278249 281852 284182 284822 285384 285483 283133 278538 273742 269169 263980 259006 255787 253499 250358
55690B50358l091o57J560J471P74J217J695J446K015L708M213K941K512L902M605
$$ 250358 247267 246610 248170 249641 250415 251632 253327 254773 256788 260496 264709 267650 270162 274064 278669
55675B78669L597L351M614M255J000j622j089R2o96j822j327p76j744k500j578
$$ 278669 282266 285617 290231 294486 295486 293864 292775 292867 292171 290349 289022 288246 286502 284002 282424
55660B82424q66j715j884K56K193J447k59m46o9q30j567q86m50k125m490n367
$$ 282424 281558 279843 277959 278215 280408 281855 281596 281150 281081 280251 278684 277798 277348 275223 270733 265366
55644B65366n381o029o735o497o053n969n083l098j968k601l074k239j776k630
$$ 265366 259985 253956 247221 240724 234671 228702 223619 220521 218553 215952 212878 210639 208863 206233
55630B06233k805j178l5j038k141j264J35N2o46o90j169k883l946k966j769k125
$$ 206233 203428 202250 202215 201177 199036 197772 197907 197959 197313 196623 195454 192571 188625 185659 183890 181765
55614A81765k589j549m33r04j628r19J4n07j399j044l36p43j470j250p26p27m45
$$ 181765 179176 177627 177194 176290 174662 173743 173757 173250 171851 170807 170471 169728 168258 167008 166282 165555 165110
55597A65110M54N35m97n22J100J702j44j631l06J710J451l2j97M04j38j080n19
$$ 165110 165564 166099 165602 165080 166180 167882 167738 166107 165801 167511 168962 168930 168733 169137 168999 167919 167400
55580A67400J030J912K415L443L993L022K022K754M205M538M235M572M980M595
$$ 167400 168430 170342 172757 176200 180193 183215 185237 187991 192196 196734 200969 205541 210521 215116
55566B15116M401N168N409L969K404K131J629o45l089l741l803n162o705o464
$$ 215116 219517 224685 230094 234063 236467 238598 240227 239582 236493 232752 228949 223787 217082 210618
55552B10618n308n113n338m659l967m296l919j129K005K401Q39L82J443K107K007
$$ 210618 205310 200197 194859 190200 186233 181937 178018 176889 178894 181295 182134 182516 183959 186066 188073
55537A88073K209K305J165l40m83L22N96O60J456J832J70k452l799m020m660n323
$$ 188073 190282 192587 193752 193412 192929 193251 193847 194507 195963 197795 197965 195513 191714 187694 183034 177711
55521A77711m527k803j860j619r53l38q87j845j907j810k748l580k608r21o91
$$ 177711 173184 170381 168521 166902 165949 165611 164724 162879 160972 159162 156414 152834 150226 149305 148614
55506A48614j429j172k30l68j258j166l47m02j014n94M81N46r5J81R67M02j303
$$ 148614 147185 146013 145783 145415 144157 142991 142644 142242 141228 140634 141115 141661 141566 141747 142714 143116 141813
55489A41813k122j644j219j080l22N77K51p80o85N37J241J130J298J648J109J68
$$ 141813 139691 138047 136828 135748 135426 136003 136254 135474 134789 135326 136567 137697 138995 140643 141752 141920
55473A41920L31J260J195R6l33K81N56m7n91o70p68p90l21k7p26j543j113O7N51
$$ 141920 142251 143511 144706 144802 144469 144750 145306 145259 144668 143998 143230 142440 142119 142092 141366 139823 138710 138777 139328
55454A39328M07M79L00p98j584o88N75J26j137p25J113J874J065N52Q84O74k92
$$ 139328 139735 140214 140514 139716 138132 137444 138019 138145 137008 136283 137396 139270 140335 140887 141771 142445 142153
55437A42153o01j17j77o75L2J915K869K009P38J44k39o59n75j84k87n82j81L23
$$ 142153 141552 141435 141258 140583 140615 142530 145399 147408 148146 148290 148051 147392 146817 146633 146346 145764 145583 145906
55419A45906l71j682j816p68r2M7P61J659J118n55j200k87M92L77M13Q50M81q56
$$ 145906 145535 143853 142037 141269 141177 141224 141985 143644 144762 144207 143007 142720 143212 143589 144002 144852 145333 144477
55401A44477j714j581j542j937j727o84J08L24P16J161O75l85m98M31J009Q73
$$ 144477 142763 141182 139640 137703 135976 135292 135400 135724 136440 137601 138276 137891 137393 137824 138833 139706
55385A39706R24J019P8j397j656p02k69n80o4J451K175J486P85O67J15q28o12
$$ 139706 140630 141649 141727 140330 138674 137972 137703 137123 137059 138510 140685 142171 142956 143623 143738 142910 142298
55368A42298Q05J337J06j264j583j641j900j443k32K17m45o33J90M60m53q28L51
$$ 142298 143103 144440 144546 143282 141699 140058 138158 136715 136483 136700 136255 135622 135812 136272 135819 134991 135342
55351A35342J535J322N95L73o3j259k004j402n71n97o33K48J108P48k65q29j092
$$ 135342 136877 138199 138794 139167 139104 137845 135841 134439 133868 133271 132638 132886 133994 134742 134477 133648 132556
55334A32556j588j848j333n73j59K33Q52J086O56L03N01P13O30P24R69N65l93
$$ 132556 130968 129120 127787 127214 127055 127288 128140 129226 129882 130185 130686 131399 132029 132753 133722 134287 133894
55317A33894o82NM64J50M6N74O53j53n32L34J229R02m8n92r58j609j971j478o97
$$ 133894 133212 133217 133681 133831 133877 134451 135104 134951 134419 134753 135982 136884 136836 136244 135286 133677 131706 130228 129531
55298A29531k68J21P36J049Q30P01Q59N68l10p88m31nK04R66K267K701J719P02
$$ 129531 129263 129384 130120 131169 131999 132700 133559 134127 133817 133029 132598 132593 132797 133763 136030 138731 140450 141152
55280A41152P64J170J047Q30Q54K61j298k486k229j338q73l67Q41J906J708O71
$$ 141152 141916 143086 144133 144963 145817 146078 144780 142294 140065 138727 137854 137487 138328 140234 141942 142613
55264A42613j2p2J01M00O63L54m30o50O6O54K42o31j173j457j585j140k55J15
$$ 142613 142601 142529 142630 143030 143693 144047 143617 142967 143033 143687 143929 143298 142125 140668 139083 137943 137688 137803
55246A37803j59JQ40J012j22j184r51k19j83m97l39j1q5j75J06J78k85m48K14
$$ 137803 137644 137645 138485 139497 139375 138191 137240 137021 136838 136341 136002 135991 135906 135731 135837 136015 135730 135282 135496
55227A35496P64L61l77p58j271k149k157n00J357J496J83r18j194j136q13O1J009
$$ 135496 136260 136621 136244 135486 134215 132066 129909 129409 130766 132262 132445 131527 130333 129197 128384 128445 129454
55210A29454J227Q01M58N14Q28J215J235M06q11j248p60n24r66r53J09J023P61
$$ 129454 130681 131482 131940 132454 133282 134497 135732 136138 135327 134079 133319 132795 131829 130876 130985 132008 132769
55193A32769J57L07O98L93j82j41K50K56j5k37p32j494j467j39J242J401R03R60
$$ 132769 132926 133233 133931 134324 134142 134001 134251 134507 134492 134255 133523 132029 130562 130423 131665 133066 133969 134929
55175A34929J422J398R73Q06Q56P28N99O96O80M79P26J370J171l18j637j494o52
$$ 134929 136351 137749 138722 139528 140384 141112 141711 142407 143087 143566 144292 145662 146833 146515 144878 143384 142732
55158A42732l08l4J074K363K552J660N16o65j739j756l82Q76N53o09r89o27n69
$$ 142732 142424 142390 143464 145827 148379 150039 150555 149890 148151 146395 146013 146889 147442 146833 145844 145217 144648
55141A44648o34J66J553K230J866J186N56q6l30J81P50N61L1j1J35k70q91j003
$$ 144648 144014 144180 145733 147963 149829 151015 151571 151485 151155 151336 152086 152647 152678 152667 152802 152532 151641 150638
55123A50638r82j602k399k312j460q19o22m67n02j056j561j285o05k95r1O17J312
$$ 150638 149656 148054 145655 143343 141883 141064 140442 139975 139473 138417 136856 135571 134966 134671 134580 135197 136509
55106A36509J068K61O9N80Q13M27J12M79J510K751L337K492P49k44Q6M28j03l95
$$ 136509 137577 137838 137907 138487 139300 139727 139839 140318 141828 144579 147916 150408 151157 150913 150999 151427 151324 150929
55088A50929N49J608J415Q40J422K556K503J371P28Q51O22j62n30k39n0j75j64
$$ 150929 151478 153086 154501 155341 156763 159319 161822 163193 163921 164772 165394 165232 164702 164463 164413 164238 164074
55071A64074q8l08m23L5L77j52p62l12N52L68o85j249j117j076r97k21O22L77
$$ 164074 163986 163678 163255 163290 163667 163515 162753 162441 162993 163361 162676 161427 160310 159234 158237 158016 158638 159015
55053A59015m39m09J92n5r43r11K4K28n93r40l46r4o44q36l29l73j298j521j66
$$ 159015 158576 158167 158359 158304 157361 156450 156474 156702 156109 155169 154823 154729 154085 153249 152920 152547 151249 149728 149562
55034A49562J378J640J043N78J68m53p12k69P4l98j124j190n58K80R64J099L73
$$ 149562 150940 152580 153623 154201 154369 153916 153204 152935 153009 152611 151487 150297 149739 150019 150983 152082 152455
55017A52455o88j043o02k94m75l72M27J190J205P54M29L55N09Q36R02L38l15j48
$$ 152455 151767 150724 150122 149828 149353 148981 149408 150598 151803 152557 152986 153341 153850 154686 155588 155926 155611 155463
54999A55463O39J000P18O01R04R58N44K59L15K71J80N91J182Q64l66j115o15L27
$$ 155463 156102 157102 157820 158421 159325 160283 160827 161086 161401 161672 161852 162443 163625 164489 164123 163008 162393 162720
54981A62720Q00Q85P65J89o00p10QN36K50k18k16J9J94N55J052J003K26n29p28
$$ 162720 163520 164405 165170 165359 164759 164049 164057 164593 164843 164625 164409 164428 164622 165177 166229 167232 167458 166929 166201
54962A66201o77n38P2R98J243M12m90m35L25R26J042P72K11l70n80m94n40o65
$$ 166201 165524 164986 165058 166056 167299 167711 167221 166786 167111 168037 169079 169851 170062 169692 169112 168618 168078 167413
54944A67413l91J65L52J88M34J280K000K164K195K434K711K993L484L921L818
$$ 167413 167022 167187 167539 167727 168161 169441 171441 173605 175800 178234 180945 183938 187422 191343 195161
54929A95161L529L884M767N298N468O109P170P616P368P595Q600R075Q066O122
$$ 195161 198690 202574 207341 212639 218107 224216 231386 239002 246370 253965 262565 271640 279706 285828
54915B85828L829Q38k763n694p181q126r540j0940j1270j0343q549o188l959k936
$$ 285828 289657 290495 287732 282038 274857 266731 257191 246251 234981 224638 216089 209901 205942 203006
54901B03006l178l410k887k409k623k642j515J08R95J156J399J878K255K616L138
$$ 203006 199828 196418 193531 191122 188499 185857 184342 184450 185445 186601 188000 189878 192133 194749 197887
54886A97887L433L234L157L863M935N519N572N662O070O750P664Q484Q459P258
$$ 197887 201320 204554 207711 211574 216509 222028 227600 233262 239332 246082 253746 262230 270689 277947
54872B77947N377L263O61k655o128q945j0648j0934r762q051p241p569p798p130
$$ 277947 283324 286587 287248 284593 278465 269520 258872 247938 238176 230125 222884 215315 207517 200387
54858B00387o194n506m386k488j011j063j818j806j209j311k244k841k543j988
$$ 200387 194193 188687 184301 181813 180802 179739 177921 176115 174906 173595 171351 168510 165967 163979
54844A63979j696j356o10L12R20R12L01n18r85r86r14r03n57J58M88o7q88j069
$$ 163979 162283 160927 160317 160629 161549 162461 162762 162244 161259 160273 159359 158456 157899 158057 158545 158478 157590 156521
54826A56521o06j17Q8P1j06k29Q3P21R43M41j08j32q7m86p65m7J369K256K000
$$ 156521 155915 155798 155886 155957 155851 155622 155705 156426 157369 157810 157702 157570 157483 156997 156232 156185 157554 159810 161810
54807A61810J165O31P72J355J812J699J124N05o2p53j329j319r26q60j032n51
$$ 161810 162975 163606 164378 165733 167545 169244 170368 170873 170811 170058 168729 167410 166484 165624 164592 164041
54791A64041O31J271P12QL06J153J491J412J736K457K872K853K862K960K828K604
$$ 164041 164672 165943 166655 166663 166969 168122 169613 171025 172761 175218 178090 180943 183805 186765 189593 192197
54775A92197K875L857N126O133O613O719O964P629Q173P923P370P685Q576Q055
$$ 192197 195072 198929 204055 210188 216801 223520 230484 238113 246286 254209 261579 269264 277840 285895
54761B85895N137J490p90j964l713o326q442r291r474r558r216q126o638n246
$$ 285895 291032 292522 291732 289768 286055 279729 271287 261996 252522 242964 233748 225622 218984 213738
54747B13738m028k929k081j660j676j913j888j238k90K53L98R94K291L220K854
$$ 213738 209710 206781 204700 203040 201364 199451 197563 196325 196035 196288 196686 197680 199971 203191 206045
54732B06045J933J967L251M705N437N561N523N418N174M934N007N477N875N339
$$ 206045 207978 209945 213196 217901 223338 228899 234422 239840 245014 249948 254955 260432 266307 271646
54718B71646L506J105q31k287m061o270q052q820q879q527p652o555n985n866
$$ 271646 275152 276257 275426 273139 269078 262808 254756 245936 237057 228530 220878 214323 208338 202472
54704B02472n218l897l094l421l725k857j338k93J90N28N32L2l20j68l18j291
$$ 202472 197254 193357 190263 186842 183117 180260 178922 178629 178819 179347 179879 179911 179591 179423 179105 177814
54688A77814j956j096N08J054J68j093k010k507k329j422p31j072j608r59N30
$$ 177814 175858 174762 175270 176324 176492 175399 173389 170882 168553 167131 166400 165328 163720 162761 163291
54673A63291J286R82P91J189J262M78l92o23n34o15o49k83K96O34M74j90j008
$$ 163291 164577 165559 166350 167539 168801 169279 168887 168264 167730 167115 166466 166183 166479 167113 167587 167397 166389
54656A66389j322q50j66O7L4K65O20O14L87M03M90J49m01m94j07K24L41M05J89
$$ 166389 165067 164217 164051 164118 164152 164417 165037 165651 166038 166441 166931 167080 166679 166185 166078 166302 166643 167048 167237
54637A67237n64j310j245n70j87k98k95R5N03O96P86P61O33P64J278J412M87q86
$$ 167237 166673 165363 164118 163548 163361 163063 162768 162863 163366 164062 164848 165609 166242 167006 168284 169696 170183 169297
54619A69297j576j497j369j271p16R2M24K96L41N64M38J19K62P48Q05L94J76K16
$$ 169297 167721 166224 164855 163584 162868 162960 163384 163680 164021 164585 165023 165142 165404 166152 166957 167351 167527 167743
54601A67743J7l01k19o8n74j185o02R10J524N73m73l77K25L19J40K57L41m1l88
$$ 167743 167760 167459 167240 167172 166598 165413 164811 165721 167245 167818 167345 166968 167193 167512 167652 167909 168250 168209 167821
54582A67821j32L30L47P5LR9J84M81J007J067K23q24j091o80n18r79j479j320
$$ 167821 167689 168019 168366 168441 168444 168543 168727 169208 170215 171282 171505 170681 169590 168910 168392 167413 165934 164614
54564A64614m69N06R60P96N26O57J033J208J172J210J187Q04M00O17J218J242
$$ 164614 164145 164651 165611 166407 166933 167590 168623 169831 171003 172213 173400 174204 174604 175221 176439 177681
54548A77681M88j80k55k68n86o19J09R38R53L28K1N13J432K166K335J942J379
$$ 177681 178169 177989 177734 177466 176880 176261 176370 177308 178261 178589 178610 179123 180555 182721 185056 186998 188377
54531A88377J055Q78M50j48l94k97n51j334j722r32M29J102P97L52L92N80L06
$$ 188377 189432 190310 190760 190612 190218 189921 189370 188036 186314 185382 185811 186913 187710 188062 188454 189034 189340
54514A89340m09j009j200j235j383j467j241r84j160j559j430p20l21o84j032
$$ 189340 188931 187922 186722 185487 184104 182637 181396 180412 179252 177693 176263 175543 175222 174538 173506
54499A73506o47p9j34l13L44J430J614P96L08P74J173N64n13j001q08n52m98m01
$$ 173506 172859 172780 172646 172333 172677 174107 175721 176517 176825 177599 178772 179336 178823 177822 177014 176462 175964 175563
54481A75563n1N02J031J198Q67L80K24L92M79L46J97J25J38M86J318K137K227
$$ 175563 175512 176014 177045 178243 179110 179490 179714 180106 180585 180931 181128 181253 181391 181877 183195 185332 187559
54464A87559J540N86l14j051j241o05M02J133J629K086J941O50r57j500j085j081
$$ 187559 189099 189685 189371 188320 187079 186474 186876 188009 189638 191724 193665 194315 193358 191858 190773 189692
54448A89692j839k186j469n82m04n94n01j79J14M66Q21Q79Q02J044J257N86o35
$$ 189692 187853 185667 184198 183616 183212 182618 182117 181938 182052 182518 183339 184218 185020 186064 187321 187907 187272
54431A87272r07J19Q45J10r65p33N00J141O65P5K50R93J544J321L05q01j010j23
$$ 187272 186365 186484 187329 187439 186474 185741 186241 187382 188047 188122 188372 189365 190909 192230 192535 191734 190724 190601
54413A90601R58J219N49m13r07m72O55J458J141K91J86Q91J163M73j44K06R12
$$ 190601 191559 192778 193327 192914 192007 191535 192190 193648 194789 195080 195266 196157 197320 197793 197649 197855 198767
54396A98767R54M07k3r4J08O82J491J865J391M95k61q17j168j099p84q01j093
$$ 198767 199721 200128 200105 200011 200119 200801 202292 204157 205548 206043 205782 204965 203797 202698 201914 201113 200020
54379B00020q32J13O77K61k61K4O13N72N1k43k74l62l28JJ12l65p80m05L62P49
$$ 200020 199188 199301 199978 200239 199978 200002 200615 201187 201238 200995 200721 200359 200031 200032 200144 199779 198999 198594 198956 199705
54359A99705Q99J347J798J635J157J123J415J320R17R51J507J837J555J075Q70
$$ 199705 200604 201951 203749 205384 206541 207664 209079 210399 211316 212267 213774 215611 217166 218241 219111
54344B19111J029J540K249K675K480K076K135K600K755K231J306M11k93q99j664
$$ 219111 220140 221680 223929 226604 229084 231160 233295 235895 238650 240881 242187 242598 242305 241406 239742
54329B39742k704l567l579k826k234k256k223j524o43l86p19j060j191j158q76
$$ 239742 237038 233471 229892 227066 224832 222576 220353 218829 218186 217800 217081 216021 214830 213672 212796
54314B12796n16o37j228j412q36m72j105j856j530n99m72j213j565j008l49k17
$$ 212796 212280 211643 210415 209003 208167 207695 206590 204734 203204 202605 202133 200920 199355 198347 197998 197781
54298A97781k51k8K72L86L57K13L8K71J210K239K297J170l15j316j513r25R3P76
$$ 197781 197530 197502 197774 198160 198517 198730 198768 199039 200249 202488 204785 205955 205640 204324 202811 201886 201979 202755
54280B02755P05M57P72J313J205N03J21L16L58j51o34n24q9J42J03K7mk4rO2K50
$$ 202755 203460 203917 204689 206002 207207 207710 207831 208147 208505 208354 207720 207196 207107 207249 207352 207379 207375 207351 207342 207404 207654
54259B07654P05J375J830J671J056M63J36N2J33J65j28o29q69q20j057j691j962
$$ 207654 208359 209734 211564 213235 214291 214754 214890 214942 215075 215240 215112 214483 213614 212794 211737 210046 208084
54242B08084j505j161j637k168j612k79N75O07M53L12k03r11j094o82k90l0N28
$$ 208084 206579 205418 203781 201613 200001 199722 200297 200904 201357 201669 201466 200555 199461 198779 198489 198459 198987
54225A98987J225J311P52L95O11Q12N72K55K21L06L56M10K02o76j844k259j640
$$ 198987 200212 201523 202275 202670 203281 204093 204665 204920 205141 205447 205803 206213 206415 205739 203895 201636 199996
54208A99996q69p26r82j114j050q97n60m9L90P41J229J702J665J109O00L94J90
$$ 199996 199127 198401 197419 196305 195255 194358 193798 193749 194139 194880 196109 197811 199476 200585 201185 201579 201769
54191B01769m2J61Q09J172Q04K35J11L35M55M09L06mo13j126j033l50L83O20J86
$$ 201769 201727 201888 202697 203869 204673 204908 205019 205354 205809 206218 206524 206520 205907 204781 203748 203398 203781 204401 204587
54172B04587n80j025p63j42J74Pl36p37j309j836j786j079l08j4r1j20J31N79
$$ 204587 204007 202982 202219 202077 202251 202258 201922 201185 199876 198040 196254 195175 194867 194853 194762 194642 194773 195352
54154A95352Q60M62o82j804j909q60N04J278J190N65O9K40Q64J078N32N2M07R97
$$ 195352 196212 196674 195992 194188 192279 191419 191923 193201 194391 194956 195025 195265 196129 197207 197739 197791 198198 199195
54136A99195P69nj08O44J160R24O67Q77R24L46j81Q4P56R80O45K24k3o9K05P67
$$ 199195 199964 199959 199851 200495 201655 202579 203246 204123 205047 205393 205212 205296 206052 207032 207677 207901 207878 207809 208014 208781
54116B08781J208J223R52N53q4q89j342j092m13L18J101J935K422K242J645J098
$$ 208781 209989 211212 212164 212717 212633 211744 210402 209310 208897 209215 210316 212251 214673 216915 218560 219658
54100B19658P06L21o8l48m80n02n16p37j187j395q28K26Q07M54k34l72K78J277
$$ 219658 220364 220685 220617 220269 219789 219287 218771 218034 216847 215452 214624 214850 215657 216111 215877 215505 215783 217060
54082B17060J921J681P56J89P78J890K108J148K74M92J299J693J618J644J867
$$ 217060 218981 220662 221418 221607 222385 224275 226383 227531 227805 228297 229596 231289 232907 234551 236418
54067B36418J898J633J355J251J303J502J856K250K594K980L546M231M779M840
$$ 236418 238316 239949 241304 242555 243858 245360 247216 249466 252060 255040 258586 262817 267596 272436
54053B72436M268L560L700N052O694P495P554P676P664O331L399J78k052l278
$$ 272436 276704 280264 283964 289016 295710 303205 310759 318435 326099 332430 335829 336007 333955 330677
54039C30677l842l497k110m84N59J341K668M464N793O061N522M816M506M866N630
$$ 330677 326835 323338 321228 320744 321303 322644 325312 329776 335569 341630 347152 351968 356474 361340 366970
54024C66970O155O084N610M979M187L368K803K346J477K99l26j33q0j007k406
$$ 366970 373125 379209 384819 389798 393985 397353 400156 402502 403979 404278 403952 403819 403739 402732 400326
54009D00326l337l869m580n280n364n153n674p077q265q305p386o249n326m702
$$ 400326 396989 393120 388540 383260 377896 372743 367069 359992 351727 343422 336036 329787 324461 319759
53995C19759m327l986l463k910k736k997l270l240l059k967k885k608k185j873
$$ 319759 315432 311446 307983 305073 302337 299340 296070 292830 289771 286804 283919 281311 279126 277253
53981B77253j766j668j374r59o33l88n1K15j14j121j944j701o91q7l32o23j42
$$ 277253 275487 273819 272445 271486 270853 270465 270414 270629 270515 269394 267450 265749 265058 264971 264639 264016 263874
53964B63874Q36J439J347J029J160J993L033L340K518J436J325K219L005L147
$$ 263874 264710 266149 267496 268525 269685 271678 274711 278051 280569 282005 283330 285549 288554 291701
53950B91701L381M238M983M792M240M560N876P175P799Q003Q024P546O335M792
$$ 291701 295082 299320 304303 309095 313335 317895 323771 330946 338745 346748 354772 362318 368653 373445
53936C73445L509K625J922J307R38Q99R45P21K46kL64J159J964K768L816M961
$$ 373445 376954 379579 381501 382808 383746 384645 385590 386311 386557 386555 386919 388078 390042 392810 396626 401587
53920D01587N688N891O039O543P367Q285Q993R009Q183P376P745R181J0266J0150
$$ 401587 407275 413166 419205 425748 433115 441400 450393 459402 467585 474961 482706 491887 502153 512303
53906E12303R522R289R231Q743Q053P729P477O514M834L251K268J668J222J124
$$ 512303 521825 531114 540345 549088 557141 564870 572347 578861 583695 586946 589214 590882 592104 593228
53892E93228J646K772M190N312N359L723J77n190j1867j8486k3163k4819k4036
$$ 593228 594874 597646 601836 607148 612507 616230 616407 611217 599350 580864 557701 532882 508846
53879E08846k2180k0051j7721j5259j3002j1222r949r076q348p507o620n985n593
$$ 508846 486666 466615 448894 433635 420633 409411 399462 390386 382038 374531 367911 361926 356333
53866C56333n032m191l526l365l460l543l784m252m472l985k993j983j231j013
$$ 356333 351301 347110 343584 340219 336759 333216 329432 325180 320708 316723 313730 311747 310516 309503
53852C09503j664k886l622l325k798l058l886m279l931l285k550j615p67n26p11
$$ 309503 307839 304953 301331 298006 295208 292150 288264 283985 280054 276769 274219 272604 271837 271311 270600
53837B70600n75KK42l33j110j156m05L15K92k59n16j14L30L1q36j274p69K03J052
$$ 270600 270025 270027 270269 269936 268826 267670 267265 267580 267872 267613 267097 266983 267313 267344 266508 265234 264465 264668 265720
53818B65720J711K188K257J998J941K188K147J620J328J800K507K861L228M053
$$ 265720 267431 269619 271876 273874 275815 278003 280150 281770 283098 284898 287405 290266 293494 297547
53804B97547M806M845M661N083N719N577M864M842N868O884O992O490O087N933
$$ 297547 302353 307198 311859 316942 322661 328238 333102 337944 343812 350696 357688 364178 370265 376198
53790C76198N781N444M860M159L653L374K806J590K27n55q36j209j782k218k538
$$ 376198 381979 387423 392283 396442 400095 403469 406275 407865 408092 407537 406701 405492 403710 401492 398954
53775C98954k991l434l646m010m965o068o575o722p228p779p292n787m669m834
$$ 398954 395963 392529 388883 384873 379908 373840 367265 360543 353315 345536 338244 332457 327788 322954
53761C22954n595n840n286m211k982k183k359l142l456k890k079j483q06J9L02
$$ 322954 317359 311519 306233 302022 299040 296857 294498 291356 287900 285010 282931 281448 280642 280661 280963
53746B80963k91j058j306j299j449j410r08o64j433k523k445r83M29N73j15l89
$$ 280963 280672 279614 278308 277009 275560 274150 273242 272578 271145 268622 266177 265194 265623 266196 266081 265692
53730B65692J59Q09Q50M46J95L00M78O02P98R07M77l81o58L45J954K888K827K446
$$ 265692 265851 266660 267510 267956 268151 268451 268929 269531 270329 271236 271713 271332 270674 271019 272973 275861 278688 281134
53712B81134K176J792J289J139J506J889J868J614J456J438J521J763K106K385
$$ 281134 283310 285102 286391 287530 289036 290925 292793 294407 295863 297301 298822 300585 302691 305076
53698C05076K681L227L920M374M428M163L504K440J496J281J528J397P96N09Q44
$$ 305076 307757 310984 314904 319278 323706 327869 331373 333813 335309 336590 338118 339515 340311 340820 341664
53683C41664J045M38o01j304j462j291q93l69L4K44M60O47M62l3j86K75O91L42
$$ 341664 342709 343147 342546 341242 339780 338489 337596 337227 337261 337505 337965 338612 339074 339041 338855 339130 339821 340163
53665C40163n25j084j004p04p29j186j715j818j398j016j290k024k382j981j278
$$ 340163 339638 338554 337550 336846 336117 334931 333216 331398 330000 328984 327694 325670 323288 321307 320029
53650C20029p93n30l07o0L74J161J933J974J262O36O62R34R16P41P54R04J082
$$ 320029 319236 318706 318399 318339 318713 319874 321807 323781 325043 325679 326341 327275 328191 328932 329686 330590 331672
53633C31672J449J887J789J021M99J034K137K748K711K671K835K831K636K725
$$ 331672 333121 335008 336797 337818 338317 339351 341488 344236 346947 349618 352453 355284 357920 360645
53619C60645L160L354K991K517K451K717K953L118L426L862M096L859L348L120
$$ 360645 363805 367159 370150 372667 375118 377835 380788 383906 387332 391194 395290 399149 402497 405617
53605D05617L523M215M420L803K870K320K223K086J622J133J084J523J902J560
$$ 405617 409140 413355 417775 421578 424448 426768 428991 431077 432699 433832 434916 436439 438341 439901
53591D39901M12p82j087m13M11O93P11J180K074K546J972P64j46l44j69k3J43
$$ 439901 440313 439531 438444 438031 438442 439135 439846 441026 443100 445646 447618 448382 448236 447892 447723 447700 447843
53574D47843M92Q07P65N03L78K60l43j324j920j915k201l432m783m910l739k384
$$ 447843 448335 449142 449907 450410 450788 451048 450705 449381 447461 445546 443345 439913 435130 430220 426481 424097
53558D24097j522q56j15M17N41N08M58K58Q6M15J167J579J279Q46Q81J210J376
$$ 424097 422575 421719 421604 422021 422562 423070 423528 423786 423872 424287 425454 427033 428312 429158 430039 431249 432625
53541D32625J406J632K150K884L812M834N660O080O074N625M927M711N662P331
$$ 432625 434031 435663 437813 440697 444509 449343 455003 461083 467157 472782 477709 482420 488082 495413
53527D95413Q434Q558Q780J0024J1646J2383J2180J2113J2785J3659J4064J4141
$$ 495413 503847 512405 521185 531209 542855 555238 567418 579531 592316 605975 620039 634180
53515F34180J4527J5511J6794J7929J8798J9639K0610K1488K1955K2047K2130
$$ 634180 648707 664218 681012 698941 717739 737378 757988 779476 801431 823478 845608
53504H45608K2480K3084K3746K4146K3926K3103K2226K1743K1447K0930K0307
$$ 845608 868088 891172 914918 939064 962990 986093 1008319 1030062 1051509 1072439 1092746
53493A092746J9893J9476J8618J7548J6950J6987J7274J7681J8362J9030J9131
$$ 1092746 1112639 1132115 1150733 1168281 1185231 1202218 1219492 1237173 1255535 1274565 1293696
53482A293696J8709J8226J7611J6493J5290J4929J5348J5476J4864J4052J3133
$$ 1293696 1312405 1330631 1348242 1364735 1380025 1394954 1410302 1425778 1440642 1454694 1467827
53471A467827J1337Q525N729L607J662m36k145l439n432q578j1566j3173j4012
$$ 1467827 1479164 1487689 1493418 1497025 1498687 1498251 1496106 1492667 1487235 1478657 1467091 1453918 1439906
53458A439906j5163j6209j6102j5080j4289j4141j4438j5386j7065j8457j8485
$$ 1439906 1424743 1408534 1392432 1377352 1363063 1348922 1334484 1319098 1302033 1283576 1265091
53447A265091j7628j7180j7321j7255j6879j6789j6877j6344j5065j3682j2412
$$ 1265091 1247463 1230283 1212962 1195707 1178828 1162039 1145162 1128818 1113753 1100071 1087659
53436A087659j0899r155p483n688l554j854j533j966j553k3J336J913K636M236
$$ 1087659 1076760 1067605 1060122 1054434 1050880 1049026 1047493 1045527 1043974 1043951 1045287 1047200 1049836 1054072
53422A054072O059P327Q285R415J0526J1395J2493J4315J6592J8762K0649K2231
$$ 1054072 1060131 1067458 1075743 1085158 1095684 1107079 1119572 1133887 1150479 1169241 1189890 1212121
53410A212121K3369K4199K5234K6720K8337K9843L1432L3200L4809L6007L6990
$$ 1212121 1235490 1259689 1284923 1311643 1339980 1369823 1401255 1434455 1469264 1505271 1542261
53399A542261L8010L9156M0579M2384M4241M5815M7521M9934N2359N3181N2083
$$ 1542261 1580271 1619427 1660006 1702390 1746631 1792446 1839967 1889901 1942260 1995441 2047524
53388B047524N0756N0744N1547N1766N1210N0703N0326M9116M6583M3400M0455
$$ 2047524 2098280 2149024 2200571 2252337 2303547 2354250 2404576 2453692 2500275 2543675 2584130
53377B584130L7855L5163L2118K8798K5295K1547J7397J2810P941L091j469n695
$$ 2584130 2621985 2657148 2689266 2718064 2743359 2764906 2782303 2795113 2803054 2806145 2804676 2798981
53365B798981r876j4474j9661k4927k9549l3568l7860m2839m7451n0098n0313
$$ 2798981 2789105 2774631 2754970 2730043 2700494 2666926 2629066 2586227 2538776 2488678 2438365
53354B438365m9024m7413m6165m5599m5650m5642m4786m3088m1293l9897l8860
$$ 2438365 2389341 2341928 2295763 2250164 2204514 2158872 2114086 2070998 2029705 1989808 1950948
53343A950948l8170l7960l7987l7752l7288l7020l6754l5684l3665l1546k9841
$$ 1950948 1912778 1874818 1836831 1799079 1761791 1724771 1688017 1652333 1618668 1587122 1557281
53332A557281k7966k5420k2806k0957j9657j8106j6251j4830j4307j4470j4995
$$ 1557281 1529315 1503895 1481089 1460132 1440475 1422369 1406118 1391288 1376981 1362511 1347516
53321A347516j5694j6306j6480j6140j5502j4732j3770j2440j0673q662o928n916
$$ 1347516 1331822 1315516 1299036 1282896 1267394 1252662 1238892 1226452 1215779 1207117 1200189 1194273
53309A194273n453m890l884k629j224O31L013N276O697P329P797Q560R724J1273
$$ 1194273 1188820 1183930 1180046 1177417 1176193 1176824 1179837 1185113 1191810 1199139 1206936 1215496 1225220 1236493
53295A236493J3044J4671J6004J7417J9280K1277K2684K3299K3653K4289K5105
$$ 1236493 1249537 1264208 1280212 1297629 1316909 1338186 1360870 1384169 1407822 1432111 1457216
53284A457216K5450K4715K2866K0581J8704J7475J6331J4661J2493J0276Q162
$$ 1457216 1482666 1507381 1530247 1550828 1569532 1587007 1603338 1617999 1630492 1640768 1648930
53273A648930N867L119j4l223o138q464j0184j1659j3307j5262j7352j9379k1235
$$ 1648930 1654797 1657916 1657902 1654679 1648541 1640077 1629893 1618234 1604927 1589665 1572313 1552934 1531699
53260A531699k2810k3952k4629k4953k5083k5102k5047k4996k5062k5247k5323
$$ 1531699 1508889 1484937 1460308 1435355 1410272 1385170 1360123 1335127 1310065 1284818 1259495
53249A259495k5016k4409k3973k4032k4357k4514k4411k4207k3809k2989k1971
$$ 1259495 1234479 1210070 1186097 1162065 1137708 1113194 1088783 1064576 1040767 1017778 995807
53238I95807k1403k1524k1778k1520k0770j9989j9319j8451j7151j5582j4033
$$ 995807 974404 952880 931102 909582 888812 868823 849504 831053 813902 798320 784287
53227G84287j2514j0832r048p754p643q753j0317j1494j2111j2458j2667j2679
$$ 784287 771773 760941 751893 744139 736496 727743 717426 705932 693821 681363 668696 656017
53215F56017j2694j3135j4051j4932j5263j5012j4459j3818j3064j2042j0671
$$ 656017 643323 630188 616137 601205 585942 570930 556471 542653 529589 517547 506876
53204E06876r224q263q035q091p787p077o424o070n892n883o190o644o820o709
$$ 506876 497652 489389 481354 473263 465476 458399 451975 445905 440013 434130 427940 421296 414476 407767
53190D07767o793p247p601p418o844o181n471m715m138l779l278k435j595j099
$$ 407767 400974 393727 386126 378708 371864 365683 360212 355497 351359 347580 344302 341867 340272 339173
53176C39173p49l04j50p51j708k052j540r35q47r69p89n25o93j084r61l37k33
$$ 339173 338424 338120 337970 337219 335511 333459 331919 330984 330137 329168 328379 327854 327161 326077 325116 324779 324546
53159C24546j232k358k163o55O38N96l99j393k045k359k072j153l82m76r96r48
$$ 324546 323314 320956 318793 318138 318776 319372 318973 317580 315535 313176 311104 309951 309569 309093 308097 307149
53143C07149k70J53j00n58q11r57r29l29O65J117N50l44o71m51j94J3M08R25J259
$$ 307149 306879 307032 306932 306374 305563 304606 303677 303348 304013 305130 305680 305336 304665 304214 304020 304033 304441 305366 306625
53124C06625J315J109N47k56p39n03M6K36J40M49J333K006J714P45J10K69N93
$$ 306625 307940 309049 309596 309340 308601 308098 308144 308380 308520 308969 310302 312308 314022 314767 314877 315146 315739
53107C15739K28p74j512j405q73o13p25r04j155j664k144k022j265m68l8R5Mm23
$$ 315739 315967 315193 313681 312276 311403 310790 310065 309161 308006 306342 304198 302176 300911 300443 300405 300500 300504 300081
53089C00081j005j221q06m6O54J039Q44j4r59j123l81N30J005J089R05L06n60
$$ 300081 299076 297855 297049 297003 297657 298696 299540 299526 298567 297444 297063 297593 298598 299687 300592 300898 300338
53072C00338j064q04l3Q78J813K497K480J782J011M76r3p39j029r45j086j550
$$ 300338 299274 298470 298437 299315 301128 303625 306105 307887 308898 309374 309281 308542 307513 306568 305482 303932
53056C03932j532o59K45M84N97J184J548P47o77j349j009n46l54J7O16P56P6r49
$$ 303932 302400 301741 301986 302470 303067 304251 305799 306546 305869 304520 303511 302965 302611 302628 303244 304000 304076 303127
53038C03127j755k115j832q93MN1m54m03M32R55L58p39j227q28MQ69J503J586
$$ 303127 301372 299257 297425 296532 296536 296587 296133 295730 296162 297117 297475 296736 295509 294681 294685 295554 297057 298643
53020B98643J055L93J14K26M42P08J082J377J282P67J53k27k99l02n26q62p36
$$ 298643 299698 300091 300205 300431 300873 301581 302663 304040 305322 306089 306242 306015 305716 305414 304888 304026 303290
53003C03290K05J363J684Q92j57n23j18O05J285J659J442P59L98R71K001K423
$$ 303290 303495 304858 306542 307434 307277 306754 306636 307241 308526 310185 311627 312386 312784 313755 315756 318179
52987C18179K013J619J828K104J699R70R70J917K796K726K050J651J680J592J199
$$ 318179 320192 321811 323639 325743 327442 328412 329382 331299 334095 336821 338871 340522 342202 343794 344993
52972C44993R27J006J007N24j41l64k6L44J96m28r36q00j96J20k10n39l4J050
$$ 344993 345920 346926 347933 348457 348316 347952 347926 348270 348466 348038 347102 346302 346106 346226 346016 345477 345443 346493
52954C46493J503O96o10j266j053o37n86q72j153j204j055r20q99q08m85j55j63
$$ 346493 347996 348692 348082 346816 345763 345126 344540 343668 342515 341311 340256 339336 338437 337629 337144 336989 336826
52937C36826m32o66r72j626k224j976r83l76p32j224r63k99k9q1N5J37m78j577
$$ 336826 336394 335728 334756 333130 330906 328930 327947 327571 326839 325615 324652 324353 324324 324243 324298 324435 323957 322380
52919C22380k228k063j576j148o91k88l63r76j585j711j371p47N3P79J079Q96
$$ 322380 320152 318089 316513 315365 314674 314386 314023 313047 311462 309751 308380 307633 307686 308465 309544 310440
52903C10440M73l3n25o59q8Q48J273Q10N9k01P1L80M63N21P38Q79N52j64o54m31
$$ 310440 310913 310880 310355 309696 309608 310456 311729 312539 312598 312397 312468 312848 313311 313832 314570 315449 316001 315837 315183 314752
52883C14752J77M38J93NK52O25P11N71L93J36q7K10J207K240K465J841J013N84
$$ 314752 314929 315367 315560 315565 315817 316442 317153 317724 318117 318253 318166 318376 319583 321823 324288 326129 327142 327726
52865C27726Q11J598K406K630K436K627L255L170J683j88j079j228j902l352m640
$$ 327726 328537 330135 332541 335171 337607 340234 343489 346659 348342 348154 347075 345847 343945 340593 335953
52850C35953n199n307n144m596l968l776l809l447k884k884l300l127k163j309
$$ 335953 330754 325447 320303 315707 311739 307963 304154 300707 297823 294939 291639 288512 286349 285040
52836B85040j005o75j84l28j273j800j074k2J27k40J01J246K144K234J940J668
$$ 285040 284035 283360 283176 282848 281575 279775 278701 278679 278806 278566 278667 279913 282057 284291 286231 287899
52820B87899J317Q15M01J66n5k70k32J74P58J306J706J843J610J106O50N44Q29
$$ 287899 289216 290031 290432 290598 290543 290273 290041 290215 290973 292279 293985 295828 297438 298544 299194 299738 300567
52803C00567J211J254P81j5q83j791k643l017k619j778j051n56k47n13j605k689
$$ 300567 301778 303032 303813 303798 302915 301124 298481 295464 292845 291067 290016 289460 289213 288700 287095 284406
52787B84406k515j174j17j52m39j3P40Q82M57K91P26J383J857K014J791J303R11
$$ 284406 281891 280717 280600 280448 280009 279996 280736 281618 282075 282366 283092 284475 286332 288346 290137 291440 292351
52770B92351P42M65n6k68K96J162J386P43j55p39r66j034j111j263j292p97J82
$$ 292351 293093 293558 293502 293234 293530 294692 296078 296821 296666 295927 294961 293927 292816 291553 290261 289464 289646
52753B89646Q91O68j36n01M2J003J682J826J544J049O21N34Q15J205J387J226
$$ 289646 290537 291205 291069 290568 290610 291613 293295 295121 296665 297714 298335 298869 299684 300889 302276 303502
52737C03502Q25M20J60j6j39O8Q60J870K302J938J480J586K004K007J445Q16N02
$$ 303502 304327 304747 304907 304891 304752 304820 305680 307550 309852 311790 313270 314856 316860 318867 320312 321128 321630
52720C21630L71P1n70j423k095k179j608p39JL97L86Rm25m86j40J60N6l54q36
$$ 321630 322001 322072 321502 320079 317984 315805 314197 313458 313459 313856 314242 314251 313826 313340 313200 313360 313416 313062 312226
52701C12226j345j760j716j042j08N58P68O23K89K4J02M43O87P82J054J464J418
$$ 312226 310881 309121 307405 306363 306255 306813 307581 308204 308493 308517 308619 309062 309749 310531 311585 313049 314467
52684C14467P27K29P69J974K612J996M98j043j921j788q65J46P04Q72Q72N66j65
$$ 314467 315194 315423 316192 318166 320778 322774 323272 322229 320308 318520 317655 317801 318505 319377 320249 320815 320650
52667C20650r34j293j316j258r15n4Q20R46M81L45Q50J310J157O44J92k16n59
$$ 320650 319716 318423 317107 315849 314934 314880 315700 316646 317127 317472 318322 319632 320789 321433 321625 321409 320850
52650C20850k61J120L010M145L784K292O11n45r76q68n94n57r73j616j955j693
$$ 320850 320589 321709 324719 328864 332648 334940 335551 335006 334030 333162 332568 332011 331038 329422 327467 325774
52634C25774j197j070j320j283n80K93O77O84R40J613K160K067J365M12m37r01
$$ 325774 324577 323507 322187 320904 320324 320617 321294 321978 322918 324531 326691 328758 330123 330535 330098 329197
52618C29197q73n86m73o68r12r70r39j012j177j252j146q98n30N5Q36J468J486
$$ 329197 328324 327738 327265 326597 325685 324715 323776 322764 321587 320335 319189 318291 317761 317816 318652 320120 321606
52601C21606R18N13J000K092K669K061Q18j6r0J47K13N4j80m10n63m70NP79J499
$$ 321606 322524 323037 324037 326129 328798 330859 331677 331661 331571 331718 331931 331985 331805 331395 330832 330362 330367 331146 332645
52582C32645J807J722J647J816J876J352M04k70l47j91j71k34k80m61q17j140
$$ 332645 334452 336174 337821 339637 341513 342865 343269 342999 342652 342461 342290 342056 341776 341315 340498 339358
52566C39358j382j722j948j417r1J046J098L54l42p50j061j094n70M7p1q92j468
$$ 339358 337976 336254 334306 332889 332798 333844 334942 335296 334954 334204 333143 332049 331479 331526 331455 330563 329095
52549C29095j237p12o32j042j430j400r81m63p8K32O52R99P67m7n78o8J040J600
$$ 329095 327858 327146 326514 325472 324042 322642 321661 321198 321120 321352 322004 323003 323770 323723 323145 323077 324117 325717
52531C25717J147J54q56j690k032j459j97Q52J155J147J447J971K260K271K410
$$ 325717 326864 327018 326162 324472 322440 320981 320784 321636 322791 323938 325385 327356 329616 331887 334297
52516C34297K864L316L366L030K700K625K586K217J623J310J401J301N01o88j643
$$ 334297 337161 340477 343843 346873 349573 352198 354784 357001 358624 359934 361335 362636 363137 362449 360806
52501C60806k331l125l942m239l950l702l889m026l386j930l36P55J271J504J588
$$ 360806 358475 355350 351408 347169 343219 339517 335628 331602 328216 326286 325950 326705 327976 329480 331068
52486C31068J311N88j17j72L47O81M80K95N91Q75M98j28M9J254K658L516L789
$$ 331068 332379 332967 332850 332678 333025 333706 334186 334481 335072 335947 336445 336317 336366 337620 340278 343794 347583
52469C47583L583K925K222K151K699L031K714K439K934L640L223J194j499l622
$$ 347583 351166 354091 356313 358464 361163 364194 366908 369347 372281 375921 379144 380338 378839 375217
52455C75217m817n443n660n204m147l305l377l900l684k363q87k80m78q26j104
$$ 375217 370400 364957 359297 354093 349946 346641 343264 339364 335680 333317 332430 332150 331672 330846 329742
52440C29742j361j295n83L77P94M91Rk10j81n3J2k14p11j020q45n56n47m69J43
$$ 329742 328381 327086 326503 326880 327674 328165 328174 327964 327783 327730 327742 327528 326817 325797 324952 324396 323849 323380 323523
52421C23523Q75R54M96L04N88Q81J138J796K761L429L791M404N071M849L709L001
$$ 323523 324398 325352 325848 326152 326740 327621 328759 330555 333316 336745 340536 344940 350011 354860 358569 361570
52405C61570L630M873N661O010O469P002P269P281O947N573K723r10m165o555
$$ 361570 365200 370073 375734 381744 388213 395215 402484 409765 416712 422285 425008 424098 419933 413378
52391D13378q039q325p248n585m494m268m202l644k562j240M4J022J610K056K626
$$ 413378 405339 397014 389766 384181 379687 375419 371217 367573 365011 363771 363815 364837 366447 368503 371129
52376C71129L188L361L024K522K426L068M091M619M263L732L799L906K802N82
$$ 371129 374317 377678 380702 383224 385650 388718 392809 397428 401691 405423 409222 413128 415930 416512
52362D16512j136j400j128j404j805j372l82O6k96p55p04k6J202K493K889K037
$$ 416512 415376 413976 412848 411444 409639 408267 407885 407951 407655 406900 406196 406170 407372 409865 412754 414791
52346D14791R60Q77J611K120K150K249K511K544K574L282M522N351N550N941O944
$$ 414791 415751 416628 418239 420359 422509 424758 427269 429813 432387 435669 440191 445542 451092 457033 463977
52331D63977P875Q140Q203Q816R983J1205J2164J2748J2926J2961J3302J3897
$$ 463977 471852 479992 488195 497011 506994 518199 530363 543111 556037 568998 582300 596197
52319E96197J4151J3714J2962J2394J2123J2162J2697J3744J5016J6460J8385
$$ 596197 610348 624062 637024 649418 661541 673703 686400 700144 715160 731620 750005
52308G50005K0767K2878K4026K4279K4092K3611K2860K2243K2283K2869K3205
$$ 750005 770772 793650 817676 841955 866047 889658 912518 934761 957044 979913 1003118
52297A003118K2615K1189J9521J7932J6094J3542J0525P933O243M908L245J518
$$ 1003118 1025733 1046922 1066443 1084375 1100469 1114011 1124536 1132469 1138712 1143620 1146865 1148383
52285A148383M60N1m62j373k220k728l150l496l310k611k243k704l336l237k466
$$ 1148383 1148843 1148894 1148432 1147059 1144839 1142111 1138961 1135465 1132155 1129544 1127301 1124597 1121261 1118024 1115558
52270A115558j733j321r10j01J369L532N793P122P231P162Q070R805J1374J2419
$$ 1115558 1113825 1112504 1111594 1111493 1112862 1116394 1122187 1129309 1136540 1143702 1151772 1161577 1172951 1185370
52256A185370J3427J4666J5793J6565J7159J7698J8008J7922J7337J6030J3948
$$ 1185370 1198797 1213463 1229256 1245821 1262980 1280678 1298686 1316608 1333945 1349975 1363923
52245A363923J1671R950Q821P664O194M728L517K466J565R14J88j153k973m460
$$ 1363923 1375594 1385544 1394365 1402029 1408223 1412951 1416468 1418934 1420499 1421413 1421601 1420448 1417475 1413015
52231A413015n291o057p168q145q453q328q184p968p703p950q899r611r159q042
$$ 1413015 1407724 1401667 1394499 1386354 1377901 1369573 1361389 1353421 1345718 1337768 1328869 1319258 1310099 1302057
52217A302057p396p194o450n027l877l328k487q47O32R54O87J237K944M783N742
$$ 1302057 1294661 1287467 1281017 1275990 1272113 1268785 1266298 1265451 1266083 1267037 1267724 1268961 1271905 1276688 1282430
52202A282430N798N564N586O046O780P481P972Q249Q247P920P604P823Q459Q583
$$ 1282430 1288228 1293792 1299378 1305424 1312204 1319685 1327657 1335906 1344153 1352073 1359677 1367500 1375959 1384542
52188A384542P561N888M520L685K869J693J56j754m061o383q089q909r095r001
$$ 1384542 1392103 1397991 1402511 1406196 1409065 1410758 1410914 1409160 1405099 1398716 1390627 1381718 1372623 1363622
52174A363622q827q727q728q641q268p660o847n598l870k222j245q21m40m8J39
$$ 1363622 1354795 1346068 1337340 1328699 1320431 1312771 1305924 1300326 1296456 1294234 1292989 1292168 1291728 1291680 1291819
52159A291819M19J330K563K998K085M64j002k104k874l029k401j408o26k32j51
$$ 1291819 1292238 1293568 1296131 1299129 1301214 1301678 1300676 1298572 1295698 1292669 1290268 1288860 1288234 1288002 1287851
52144A287851l40n28j71Q84J972K310J877J264R02P90P55O15L09J77R09K897N765
$$ 1287851 1287511 1286983 1286812 1287696 1289668 1291978 1293855 1295119 1296021 1296811 1297566 1298181 1298490 1298667 1299576 1302473 1308238
52127A308238Q754J1314J3180J4226J4618J4909J5582J6613J7638J8374J8699
$$ 1308238 1316992 1328306 1341486 1355712 1370330 1385239 1400821 1417434 1435072 1453446 1472145
52116A472145J8603J8271J7979J7767J7461J7172J7273J7711J7857J7427J7051
$$ 1472145 1490748 1509019 1526998 1544765 1562226 1579398 1596671 1614382 1632239 1649666 1666717
52105A666717J7440J8417J9348K0116K1058K2047K2453K1927K0734J9223J7447
$$ 1666717 1684157 1702574 1721922 1742038 1763096 1785143 1807596 1829523 1850257 1869480 1886927
52094A886927J5307J2680R304M926k81n585r956j2533j3158j2691j2402j2714
$$ 1886927 1902234 1914914 1924218 1929144 1928863 1923278 1913322 1900789 1887631 1874940 1862538 1849824
52082A849824j2873j2233j1385j1388j2201j2722j2293j1384j0570r663q214o365
$$ 1849824 1836951 1824718 1813333 1801945 1789744 1777022 1764729 1753345 1742775 1733112 1724898 1718533
52070A718533m631l106j390P04K703L988M654N597P538J0084J2130J3140J3558
$$ 1718533 1713902 1710796 1709406 1710110 1712813 1716801 1721455 1727052 1734590 1744674 1756804 1769944 1783502
$$ [...]
##END NTUPLES=NMR SPECTRUM
##END=
