##TITLE=AC1676_PERAH14384_8571085_ryBY1QWMox
##JCAMPDX= 6.0         $$ Bruker NMR JCAMP-DX V2.0
##DATA TYPE= NMR SPECTRUM
##DATA CLASS= NTUPLES
##ORIGIN= BRUKER
##OWNER= Administrator
$$ 1.72 TOPSPIN		Version 2.1
$$ 2014-04-11 15:42:29.999 -0700  Administrator@X
$$ Compression mode = diff/dup
##.OBSERVE FREQUENCY= 400.02188249412
##.OBSERVE NUCLEUS= ^1H
##.ACQUISITION MODE= SIMULTANEOUS (DQD)
##.ACQUISITION SCHEME= undefined
##.AVERAGES= 8
##.DIGITISER RES= 22
##SPECTROMETER/DATA SYSTEM= spect
##.PULSE SEQUENCE= zg30
##.SOLVENT NAME= COFFEE_meoh
##.SHIFT REFERENCE= INTERNAL, COFFEE_meoh, 1, 14.98509
##AUDIT TRAIL= $$ (NUMBER, WHEN, WHO, WHERE, PROCESS, VERSION, WHAT)
$$ ##TITLE= Audit trail, TOPSPIN		Version 2.1
$$ ##JCAMPDX= 5.01
$$ ##ORIGIN= Bruker BioSpin GmbH
$$ ##OWNER= Administrator
$$ $$ E:\/data/COFFEE/nmr/AC1676_PERAH14384_8571085_ryBY1QWMox/10/pdata/1/auditp.txt
$$ ##AUDIT TRAIL=  $$ (NUMBER, WHEN, WHO, WHERE, PROCESS, VERSION, WHAT)
(   1,<2014-04-11 15:42:23.124 -0700>,<Administrator>,<X>,<go>,<TOPSPIN 2.1>,
      <created by zg
	started at 2014-04-11 15:41:17.514 -0700,
	POWCHK enabled, PULCHK disabled,
       configuration hash MD5:
       C8 4E 4E 5D D3 5C D8 9E 9F 52 82 E0 59 8A DE 15
       data hash MD5: 64K
       B9 60 8E 5C 2B BF 91 90 76 CA 72 C8 71 2D B5 84>)
(   2,<2014-04-11 15:42:26.139 -0700>,<Administrator>,<X>,<proc1d>,<TOPSPIN 2.1>,
      <Start of raw data processing
       efp LB = 0 FT_mod = 6 PKNL = 1 PHC0 = 0 PHC1 = 0 SI = 32K 
       data hash MD5: 32K
       F3 80 2C 85 91 69 FF B8 76 80 B4 98 2B CC 6D C7>)
(   3,<2014-04-11 15:42:26.452 -0700>,<Administrator>,<X>,<proc1d>,<TOPSPIN 2.1>,
      <pk PHC0 = 95.79529 PHC1 = 0 
       data hash MD5: 32K
       1A 95 ED BD 00 AF 06 09 04 BC 20 5F E3 DE 0D 68>)
(   4,<2014-04-11 15:42:26.545 -0700>,<Administrator>,<X>,<proc1d>,<TOPSPIN 2.1>,
      <abs ABSG = 1 
       data hash MD5: 32K
       E1 9E 79 2A AA 4F 28 90 12 AD F5 BA 3A 25 F1 FB>)
(   5,<2014-04-11 15:42:26.639 -0700>,<Administrator>,<X>,<proc1d>,<TOPSPIN 2.1>,
      <abs ABSG = 2 
       data hash MD5: 32K
       E9 60 29 DC 0D 36 79 29 84 75 08 9F EF E9 55 8A>)
(   6,<2014-04-11 15:42:26.733 -0700>,<Administrator>,<X>,<proc1d>,<TOPSPIN 2.1>,
      <abs ABSG = 3 
       data hash MD5: 32K
       6C EC F1 1C 8D 25 95 9B F0 C0 A5 7D CC D2 E3 59>)
(   7,<2014-04-11 15:42:26.811 -0700>,<Administrator>,<X>,<proc1d>,<TOPSPIN 2.1>,
      <abs ABSG = 4 
       data hash MD5: 32K
       37 18 99 70 16 13 CC 9A 32 B7 2C C2 52 3B 65 DF>)
(   8,<2014-04-11 15:42:26.874 -0700>,<Administrator>,<X>,<proc1d>,<TOPSPIN 2.1>,
      <abs ABSG = 5 
       data hash MD5: 32K
       74 8E 09 E9 94 67 CF CC 95 A5 F9 78 B5 83 D8 62>)
$$ ##END=
$$ 
$$ $$ hash MD5
$$ $$ BD E9 91 D3 BE ED E5 18 18 3F 3E 9E 89 66 78 CC
##$RELAX= 
##$RELAX= 
##$RELAX= 
##$RELAX= 
##$RELAX= 
##$RELAX= 
##$RELAX= 
$$ Bruker specific parameters
$$ --------------------------
##$DU= <E:\>
##$EXPNO= 10
##$NAME= <AC1676_PERAH14384_8571085_ryBY1QWMox>
$$ [...]
##$TP= (0..7)
150 150 150 150 150 150 150 150
##$TP07= 0
##$TPNAME0= <>
##$TPNAME1= <>
##$TPNAME2= <>
##$TPNAME3= <>
##$TPNAME4= <>
##$TPNAME5= <>
##$TPNAME6= <>
##$TPNAME7= <>
##$TPOAL= (0..7)
0.5 0.5 0.5 0.5 0.5 0.5 0.5 0.5
##$TPOFFS= (0..7)
0 0 0 0 0 0 0 0
##$TUNHIN= 0
##$TUNHOUT= 0
##$TUNXOUT= 0
##$USERA1= <user>
##$USERA2= <user>
##$USERA3= <user>
##$USERA4= <user>
##$USERA5= <user>
##$V9= 5
##$VALIST= <valist>
##$VCLIST= <CCCCCCCCCCCCCCC>
##$VD= 0
##$VDLIST= <DDDDDDDDDDDDDDD>
##$VPLIST= <PPPPPPPPPPPPPPP>
##$VTLIST= <TTTTTTTTTTTTTTT>
##$WBST= 1024
##$WBSW= 4
##$XGAIN= (0..3)
0 0 0 0
##$XL= 0
##$YL= 0
##$YMAX_a= 638982
##$YMIN_a= -542154
##$ZGOPTNS= <>
##$ZL1= 120
##$ZL2= 120
##$ZL3= 120
##$ZL4= 120
##$ABSF1= 14.98509
##$ABSF2= -5.573092
##$ABSG= 5
##$ABSL= 3
##$ALPHA= 0
##$AQORDER= 0
##$ASSFAC= 0
##$ASSFACI= 0
##$ASSFACX= 0
##$ASSWID= 0
##$AUNMP= <proc_prof1d_extract_pilot.lims>
##$AXLEFT= 0
##$AXNAME= <>
##$AXNUC= <1H>
##$AXRIGHT= 0
##$AXTYPE= 0
##$AXUNIT= <>
##$AZFE= 0.1
##$AZFW= 0.1
##$BCFW= 0
##$BC_mod= 0
##$BYTORDP= 0
##$COROFFS= 0
##$CY= 15
##$DATMOD= 1
##$DC= 0
##$DFILT= <>
##$DTYPP= 0
##$F1P= 0
##$F2P= 0
##$FCOR= 0.5
##$FTSIZE= 32768
##$FT_mod= 6
##$GAMMA= 0
##$GB= 0
##$INTBC= 1
##$INTSCL= 1
##$ISEN= 128
##$LB= 0
##$LEV0= 0
##$LPBIN= 0
##$MAXI= 10000
##$MC2= 0
##$MEAN= 0
##$ME_mod= 0
##$MI= 0
##$NCOEF= 0
##$NC_proc= -8
##$NLEV= 6
##$NOISF1= 0
##$NOISF2= 0
##$NSP= 0
##$NTH_PI= 0
##$NZP= 0
##$OFFSET= 14.98509
##$PC= 1
##$PHC0= 95.79529
##$PHC1= 0
##$PH_mod= 1
##$PKNL= yes
##$PPARMOD= 0
##$PPDIAG= 0
##$PPIPTYP= 0
##$PPMPNUM= 2147483647
##$PPRESOL= 1
##$PSCAL= 4
##$PSIGN= 0
##$PYNMP= <proc.py>
##$REVERSE= no
##$SF= 400.02
##$SI= 32768
##$SIGF1= 0
##$SIGF2= 0
##$SINO= 400
##$SIOLD= 32768
##$SPECTYP= <>
##$SREGLST= <1H.CDCl3>
##$SSB= 0
##$STSI= 32768
##$STSR= 0
##$SW_p= 8223.68421052631
##$SYMM= 0
##$S_DEV= 0
##$TDeff= 65536
##$TDoff= 0
##$TI= <>
##$TILT= no
##$TM1= 0
##$TM2= 0
##$TOPLEV= 0
##$USERP1= <user>
##$USERP2= <user>
##$USERP3= <user>
##$USERP4= <user>
##$USERP5= <user>
##$WDW= 1
##$XDIM= 32768
##$YMAX_p= 462938777
##$YMIN_p= -652687
##$CURPLOT= <Network HP LaserJet P1505>
##$CURPRIN= <$Network HP LaserJet P1505>
##$DFORMAT= <normdp>
##$LAYOUT= <+/1D_H.xwp>
##$LFORMAT= <normlp>
##$PFORMAT= <normpl>
##$SURQMSG= 1
$$ End of Bruker specific parameters
$$ ---------------------------------
##NTUPLES= NMR SPECTRUM
##VAR_NAME=  FREQUENCY,     SPECTRUM/REAL,   SPECTRUM/IMAG
##SYMBOL=    X,             R,               I
##VAR_TYPE=  INDEPENDENT,   DEPENDENT,       DEPENDENT
##VAR_FORM=  AFFN,          ASDF,            ASDF
##VAR_DIM=   32768,         32768,           32768
##UNITS=     HZ,            ARBITRARY UNITS, ARBITRARY UNITS
##FACTOR=    0.250966925370066, 1,           1
##FIRST=     8223.43324360094, 63875,        -18149
##LAST=      0,             77031,           -86019
##MIN=       0,             -652687,         0
##MAX=       8223.43324360094, 462938777,    0
$$ Real data points
##PAGE= N=1
##DATA TABLE= (X++(R..R)), XYDATA
$$ [...]
23850 -301962 -185420 -367921 4718 381149 -143103 20564 -122431 -171814 -22233 99509 -49060
23838 -14849 31148 177554 57395 -115418 187389 -132230 -447548 101634 78419 185682
23828 185682 -109024 221339 -34551 14646 -130354 44641 -43932 106408 191646 -264371
23817 199063 220915 -226398 88695 127406 -137116 143467 -177850 -114946 46895 -37077 190910
23805 -207737 -20240 190974 117962 -66121 -64558 71611 -19461 -169413 -97965 -174065 13291
23793 -17155 -152026 -158619 -355484 129799 338031 201204 192648 46116 345423 46229 -338644
23781 111505 374487 100459 11727 -16710 -122212 215514 114583 -222845 11532 -103436
23770 43402 20910 -183398 -42430 14561 209002 46080 -272227 133957 -141080 -10806 122976
23758 110629 65296 91747 -230466 20570 204913 82860 -131903 119814 -110069 -111741 -158490
23747 -158490 -152427 -56745 8478 133810 29992 170688 -190798 -209223 329758 5889 -264047
23735 -9903 -128078 -64374 59497 215771 -78613 30349 -182167 -147906 -124307 13587 94231
23724 94231 393249 115578 -41674 57330 -85821 -173705 -207029 -44081 75155 -25961 -54874
23713 -54874 -254565 92678 -117469 65358 13653 32002 -148834 38356 -95372 101428 -227306
23701 58830 -23374 221675 -145091 -138334 75593 -40342 -42988 67013 -41783 -151914 116697
23689 227054 -289706 -54318 -141143 -11337 140407 -160098 -85361 -30163 -26687 -94810 -5857
23677 -70838 -353383 -170927 300217 16773 -71439 -26161 209637 -105037 299449 -111861
23666 -122804 -42709 -71427 85606 299417 -124095 -183154 72196 -213010 -182257 -228456 26848
23654 -37864 298486 -328127 -60656 -123470 115888 94019 -242472 -116072 -60799 -29005 -42368
23643 -42368 50306 -124009 -16137 171341 -164429 58892 210503 -183019 -70206 -391703
23633 -391703 168727 -162033 73899 69607 35656 283075 8567 188226 -275677 -195402 -143750
23622 -143750 237007 381195 121582 25689 -66295 -174497 -23522 -164637 273367 176658
23612 176658 80704 85614 -480172 -10386 67372 -200225 -170509 -27580 147492 226539 171082
23601 171082 -14184 45805 -440285 203821 14683 275000 -2414 105691 197594 94560 -184245
23589 471478 312672 -100220 -24218 10847 72773 245266 99173 236747 233995 -116142 170611
23577 -101950 159696 -56228 -104709 220700 -93243 -20916 -191743 96145 26392 -244718 -81118
23565 -36451 -217397 -20307 -189605 257688 -58879 -160306 395109 -283860 -303536 122782
23554 -157607 -68890 -66045 63513 -207298 61459 -234973 -189473 -27720 126767 60204 -18771
23542 199749 -193991 -104504 -120085 -33254 76429 290278 -286025 246304 -54788 -85435 -123322
23531 -123322 16273 -63950 -11919 -136706 84864 -166722 -150683 -273167 -11716 399087 86299
23519 37919 38597 -157829 -73179 5964 146489 -161160 -100489 186071 -111441 182845 -445053
23507 -153245 -97840 -88501 -249062 -17067 122 -164401 169486 -164417 -365173 129850 -74014
23495 -129755 107140 -177663 -172127 195156 18590 33306 -179696 -221890 -146030 -31156 504453
23483 -77715 155171 27600 64731 230433 -122724 -192053 -80260 -272583 84197 -31248 -191912
23472 -191912 305175 116812 -117887 -15389 -148421 -222148 236335 -252957 -42590 321562
23461 98381 -29331 -114896 -71394 24685 73098 -367587 -98631 95653 -72614 250101 -317608
23449 -110545 -34084 -259710 -322878 -88875 -25937 47764 11883 82761 -173600 -51053 -123980
23438 -123980 -84734 -195785 -181044 240143 154577 80661 -9874 209851 -262750 -157585 -155132
23427 -155132 76186 325096 -175422 25688 287994 136223 -44715 16217 -87676 94330 -59110
23415 -202342 -120138 -280338 -550573 99959 -285607 86815 -156438 108824 -59809 -23639
23404 124068 185572 68037 -369327 -260372 320782 -180977 -132833 -287859 -24503 361847
23393 -299006 -30208 397530 -75747 -297190 -11900 23158 76999 -106585 -123998 -342839 -190315
23382 -190315 22402 8796 42903 34920 -11666 -57826 -31445 40878 75724 16605 -383227 -41803
23369 -339793 -316266 542974 109829 -272883 83395 -21507 122176 16781 -207767 179983
23358 256602 -35638 358120 29355 69930 173060 -56268 -25134 -260675 50820 1140 27755
23347 27755 -167844 77152 -268837 226999 -73144 -190507 -142224 -161051 219146 27522 212825
23336 212825 -197491 75213 -357328 -214093 -170542 -249832 127235 -21431 -63726 -157615 -96803
23325 -96803 36273 56592 -174062 219486 -340871 -118767 -103771 19345 174943 -86549 49644
23313 -103439 -29197 -67365 115517 -140119 105513 -63140 -2218 358243 -167639 -68833 -50166
23302 -50166 64788 57917 -89201 109652 -25337 4132 136046 -63501 -11350 -133318 142699
23290 -132858 -214547 64343 253084 -131425 -173338 -285603 -207762 -17766 127370 -183651
23279 101945 -233931 -100402 222844 -222715 -161056 -155448 -114104 -124228 -31110 -115765 -58374
23268 -58374 -194758 244693 29276 199366 28636 -87899 -32580 -75506 -214902 -53002 124847
23256 -43663 61058 -113267 65457 -170188 4742 163305 -197227 -87638 -92760 3395 -235627
23244 -246399 43136 21342 6504 -28277 99371 -13768 -52805 -192460 -197693 5021 -37984 122785
23231 54574 -20152 74398 -92839 -286368 270108 37679 -104305 -8390 -39438 -6017 -37728
23220 -37728 -283816 100883 120162 138826 62788 70004 -223650 168037 -237501 67841 -341623
23208 21173 -411662 3104 -245571 -173265 -14774 -55687 -251837 -100251 252295 -159195 -311036
23197 -311036 -273031 -150899 -64024 150605 330736 -183505 -331146 247933 -86576 126268
23186 233117 -13713 -314310 -311721 -13595 -104015 -116861 293044 -36575 -15989 -165374 16055
23174 22023 -231953 101118 -30233 323899 -194545 120142 299003 -55245 -122165 9530 11403
23163 11403 248410 -83597 -105037 -142523 -68320 -53678 -11197 -2543 31159 -115570 -317642
23152 -317642 91429 117688 -222214 -138199 -43487 -146628 82567 263032 43846 163955 -80040
23140 -102860 72858 90579 23984 110427 -47891 -3748 -87220 13434 229543 152004 -220609
23128 -35609 205401 141063 -58779 -246828 -175792 10199 103790 35870 -144877 50814 -21063
23116 90435 -222388 -21119 -182329 -378776 -3843 -246651 123630 -329023 -137475 290596
23105 -49241 -1270 -106513 102759 -302280 93463 -168371 167277 -503729 -93359 -38616 252141
23093 36839 126445 9083 66381 79329 4776 -61971 -51428 -278528 -29982 -154743 115876
23081 -9961 -240396 -43765 -121268 162975 -43659 81643 124813 131743 -96561 222495 414191
23070 414191 -147151 149951 49509 387321 172016 150352 -96213 38179 -45901 -119579 33159
23058 103501 87315 224152 27072 47331 168941 261662 -31569 -173937 -125243 -228842 -104416
23046 -110637 70359 -119379 -303641 -62151 -259398 -58598 -119061 153118 -108799 20901
23035 13313 97749 108062 -55282 -238322 156395 -141561 8293 -78582 327151 -216625 -708
23023 240579 29420 -96680 -167830 265788 30065 -8369 -196799 179650 22342 -126235 -200403
23012 -200403 -9428 -255288 7757 202405 244998 -422377 -44971 -117550 -21117 -417026 107721
23000 -67385 55120 -3204 136092 -1342 -98562 -85323 38519 -123207 74816 -24816 -109996 -46522
22987 71614 58008 -79417 -336952 -9622 166469 116439 259215 -18566 -282446 120985 172481
22976 172481 -43153 186730 -43266 -315401 88371 312906 137344 79889 -43183 179423
22965 135293 -93947 -89327 207825 195319 -7619 -81949 -61080 53843 317776 -162492 -98866
22954 -98866 -371390 -130178 -82620 -276635 81862 -138269 -279944 200593 -260297 68409
22943 -190478 -104581 -304241 -118180 90509 -427556 116103 -216336 99326 -265009 35501
22932 36850 266482 104810 50394 42993 113735 -82136 225834 -105132 -20845 40013 400328
22921 400328 40826 -151028 64398 155398 19851 -43928 82483 134688 271061 -291469 -152024
22910 -152024 85220 -108927 113857 131973 -103609 52205 123929 -84640 -388546 89735 -146020
22898 -96042 -17941 179771 30262 -298323 -76503 -565412 -338529 -169449 178872 -9206 204792
22886 141588 49286 -144347 -238571 126077 68615 -98546 295287 -43844 137586 -239648
22875 -401210 -95575 190695 -182319 -517393 -406615 -78502 -214086 38690 -100941 297631
22864 -166616 66211 43697 57991 -12922 157071 -110536 14167 47859 -262795 -53935 -137843
22853 -137843 -134531 -421629 -192319 211346 243863 50757 -41911 -155233 18133 -34518 -5326
22841 152278 18354 220467 -242511 -217986 -31597 -61664 -495695 -102475 -64983 110544
22830 164414 -11161 51187 40425 117442 -282563 -216844 -57779 249673 -137681 -39765 322719
22818 196985 -48259 229159 321263 24571 -52448 -198133 29467 87640 172015 125112 -27322
22806 -45403 -222359 -220665 -130187 74277 -93376 -316188 -109994 64246 -71239 26246 69161
22795 69161 153713 34880 -188072 -136334 -72225 -93923 200450 -30948 -325298 491870 -178957
22783 -378347 -139447 84542 -19452 -23991 -147722 150801 -235545 -77272 -82456 -168362 -194659
22772 -194659 415464 8915 -82254 103857 -108023 50770 -227785 -72453 -124301 198594 223659
22761 223659 -44325 -360466 69000 -136604 -93053 -125741 -172411 -115466 70909 238703 166349
22750 166349 -190434 44779 35096 -183018 76900 -106495 -122714 -13900 25881 -98603 218304
22738 -320844 -302466 216627 186098 -277421 -64398 -126318 -99188 -86342 151048 -223486 202489
22726 147208 239357 -51820 -124316 -165792 -241761 -139789 -6248 218024 -115514 -123816 212809
22714 -40381 -120785 -508393 24857 278410 50458 -208477 141811 -128890 176390 -274581
22703 -221926 -26257 -61091 -229878 -126941 -94458 69451 -73210 -14747 114757 174102 -134247
22691 -169759 -354637 260047 -83953 250355 -135280 417534 -265620 -165770 344647 92603
22680 338880 -111049 -213834 128798 234724 44518 -110709 198025 187708 -382744 -141894
22669 133742 -34853 87352 -36084 -12946 -91248 -449166 383345 211610 -201658 -30491 89330
22657 119798 317514 -80199 -51367 176221 -72140 -21887 187051 150576 50650 -198615 -183962
22646 -183962 248337 190388 -183456 95685 168955 -110269 -218238 -76383 -81266 -107487 485082
22634 -163132 188489 128569 -329576 122492 226075 85248 77969 75040 200885 181920 58626
22622 -65379 -87659 -77932 -348543 -134232 -84416 -9001 -252411 26846 41330 -255341 -121095
22610 -95853 178730 -185663 -179336 51431 2157 -127037 106852 -182781 -20820 -39773 -14426
22598 -55881 123820 -149474 75314 66789 -139733 30937 -447411 -229414 -55902 -270221 -27269
22586 171637 -68154 98170 -88984 -361421 42127 134762 -81037 142145 -306378 99327 -141047
22574 134141 33668 -23366 99458 -36945 -123505 3294 -26242 -142842 -158597 276011 190651
22563 190651 -138754 -334385 -350364 1934 38775 -268330 -238673 11297 -50859 174632 31718
22551 -34424 85301 334190 -6083 -182936 11490 -102994 110317 125948 222963 56211 -321954
22539 286699 54697 -22492 -111947 116227 -87343 93010 -104408 -66257 30778 -151800 84636
22527 -122895 -361612 57917 49934 -90413 -70884 -223955 -45928 -217989 4170 -101518 -289428
22516 -289428 159402 -360155 75456 47067 -100968 -86227 27812 -160453 -145249 93591 90922
22505 90922 119849 137466 -108346 -55424 -4347 96308 -211211 138659 -26257 113333 -72528
22493 313884 -22549 302453 63515 -292168 -422045 27225 61112 -208989 -94477 -226971
22483 -226971 -30811 75125 -36445 412499 277616 89133 339780 218575 -367955 -22398
22472 -62551 217527 278371 70201 -235424 -136312 91693 72680 -371082 -149644 -109873 -278627
22461 -278627 134518 99765 157476 6759 22225 -2085 -99041 211873 -29546 80668 26154
22449 61406 177947 -219692 -298872 76206 -283205 148027 44079 -91097 -67235 204743 74977
22437 -54850 23466 -49117 -184722 -37896 -260788 67926 2408 153883 -99423 -394598 -173600
22425 135379 -161772 -50337 -343717 65245 233145 -277648 13783 -249144 -238860 -218600
22415 -218600 36075 -410654 -49853 -38669 14291 -81747 -133013 -87354 -87419 233174 119190
22404 119190 -134787 -105483 -144646 89888 72074 -206670 164235 -74783 -99654 80687 -316059
22392 -95577 -368746 -76376 -114247 -71041 -19019 -106093 96110 183107 125226 -199010 -251699
22381 -251699 79535 -9268 -106089 -136454 207320 160640 -126469 -115351 43444 4619 30449
22370 30449 90448 -311669 186805 187708 -108161 -247055 -13440 -33768 -240126 -17431 13118
22358 -264266 111125 144812 -152342 -245326 -71360 17117 -139858 -16885 -182436 3722 -119923
22346 291375 25524 23150 50321 -56363 -145733 -161505 -278226 -52511 -155162 -76067 20481
22334 196522 -24642 42186 -128150 -448054 -47076 10291 280026 102891 -96673 574467
22323 60509 -161265 -90747 175644 -259826 -353115 156698 -493281 69337 -79370 -433285
22313 -433285 -233167 -354305 34380 -76138 -632596 -106262 -14980 -106352 -49118 -27124 -215473
22302 -215473 -229727 -12239 -140480 124185 122704 224419 91521 -358353 105824 -164777
22291 -207432 280407 14386 237981 262942 46801 312210 -70802 -208624 20425 -102595
22280 113080 17330 20112 -176389 40909 206707 52717 312240 116573 -292401 356297
22269 83846 -49664 -299759 8580 -56820 -106683 -23822 -2905 -44824 -200243 -228255 -138375 106148
22256 -136204 -69244 56735 -260514 -34352 163063 -18864 -286164 175306 -92385 -282964
22246 -282964 155314 101118 -20554 -250106 -154508 63115 1739 -210586 160650 199444 193829
22235 193829 156265 -120085 229836 -323581 91406 -153417 117624 -227685 163856 138906
22225 138906 -641 -108111 -81662 -50240 -88056 310192 -174721 -92672 39808 -49871 104512
22213 -119384 -60177 92785 17691 -188846 28445 315312 -71640 25590 -20211 -249233 4850
22201 -164756 -58877 -14918 147297 -120067 -67895 -57351 -126956 -184426 -144280 96414 389573
22190 389573 -169527 15758 -43024 -208947 -228725 -76736 -147800 32146 60356 -237730 -166611
22179 -166611 -16388 -360104 62644 -302403 -4194 149994 -38051 -322547 -405431 -445488 -9676
22167 35543 -229348 -58450 -12519 -53151 119537 -119595 -248023 148706 237966 -112800
22156 -81568 -386728 231558 -100022 -154693 218128 -96646 45955 142338 -181689 -266229 -345871
22145 -345871 -4430 -96239 -88717 -181446 -53759 139872 11998 -68189 -171683 81745 -35002
22133 -311868 33555 -277471 -54450 -329273 -144612 -27627 -10816 -33018 150951 61547 46906
22122 46906 -259403 102759 246852 69721 90605 67854 90906 -3730 -402119 -159286 13295
22110 -87397 90037 13426 -88559 -418959 -235160 236828 9587 235000 -142730 181114 -99304
22098 62144 -247830 90291 -330150 -181106 -137853 85817 -56596 -284212 -128379 -81281 -122100
22087 -122100 97199 -129531 180568 -111647 -312465 -167719 -234868 -264974 -75836 -155933
22077 -155933 -3444 -270596 -131896 -295256 -13399 -134095 -25444 58206 -189779 -342844
22067 -342844 -225708 171751 -66680 -76902 -46687 -9031 -298517 -37749 80086 296286 43614
22055 -247082 131664 209061 64409 39312 110943 -187587 46262 128012 1724 49918 -186848
22043 -94918 -164492 54221 -380777 166112 163042 -62793 97540 37508 -148302 137567 -221726
22031 268972 100121 -274623 -180698 -224871 328668 112118 56774 -88001 19665 -128302
22020 53815 -359460 -86477 -33887 100499 147597 -194049 -206883 46504 -273289 46613 -156128
22008 99233 -38878 289584 -152944 101262 -214627 -301684 10852 -30378 -238045 -49200 80361
21996 -268624 -178823 -352821 -132630 -77291 -183746 -181269 -131548 192092 49381 -99188 -167453
21985 -167453 459061 -223475 76462 -308009 -257766 93065 -36890 -17911 304327 82917 273131
21974 273131 -152290 -71557 30516 -117009 74969 -11494 73058 285631 -83764 17821 -324108
21962 -21090 -551683 -40889 7311 -35651 -55231 -79726 47394 56203 228133 -29577 82311 -246232
21949 -74581 108664 -142190 149011 44325 -386533 42072 -111267 -141959 121083 -145728
21938 9712 -29221 28523 131654 4076 129118 -231229 -128626 3073 -319595 -216760 -339536
21927 -339536 52962 142679 -22597 -53061 40764 -279138 -215766 118638 115327 -81931 67214
21915 -312715 -234286 -230552 -139063 -64167 209736 -227678 -208106 -134927 169622 -159053 -46711
21903 188671 314395 -105356 217060 91660 122905 -90291 162132 247968 -35589 -110493 -232679
21892 -232679 140929 -28520 147316 65798 21084 -137069 43599 185015 -91943 -142404 162355
21880 -10614 -81085 11071 -92571 103278 101784 -419867 -287797 202008 -146220 68592 161537
21869 161537 -202162 193936 -281965 -18330 -240043 -103163 -129275 272596 120982 -134009
21858 -296601 -40737 194785 184742 4322 254454 -369808 282962 -27291 138442 -180198
21847 229280 -500880 25422 234843 151735 14719 -55103 -91108 24025 -208603 -67255 197452
21835 32059 56166 -150442 26152 158757 97317 -146027 178293 72091 -103361 -23979 51392
21823 -113793 31258 -349776 -143694 -23060 -162022 210981 -211851 -238239 -233879 401837
21812 -521427 69712 70069 -83357 -312644 -140019 -333665 -142915 -46921 -16455 -201590 -3911
21800 153127 -272903 -135233 100629 34521 -65148 -129413 114016 -189978 217007 -311807
21789 -23099 -15709 59454 -227330 4887 -339966 -23939 158234 -62141 92470 268501 449376
21778 449376 -408000 -51954 94350 -62635 246031 276140 -172974 -11553 -408 -142890 -517360
21767 -517360 -17635 46870 -122234 192093 142979 -10467 -290735 75790 -47511 -125620 -74977
21756 -74977 356810 104234 -170183 163927 23377 17588 95633 -82605 -121248 -81522 -119264
21745 -119264 -128620 1550 -194784 -242416 -101769 -225401 -6681 58649 -161074 138233 33963
21733 65270 54654 -55186 47827 266461 247528 -69396 173768 -250713 -193277 99840 282883
21722 282883 -11476 206573 -156694 -83635 -78509 60022 90252 -62333 69234 -416019 -384021
21711 -384021 -75426 -151850 -164280 -234469 155433 -365242 79092 -24157 301215 53881 173160
21700 173160 178068 -123803 141734 207412 -487571 -148404 -184677 23327 165225 19516 -179133
21688 91550 -153867 205226 105319 -95712 -125587 -104625 -61172 -239420 -176265 328430 54342
21676 180612 -372 -3404 -102559 164962 -189728 -102444 -77801 -72405 -178983 -56837 174888
21664 -438774 20222 -49676 111294 26799 -506483 128344 211638 -116987 -164147 280507
21653 -91415 97315 92314 -158626 -235908 -105932 -211090 166644 -132909 248751 153372 -261461
21641 -150813 249303 52789 -38130 -227542 -268008 -282212 -176355 -181848 -114624 -200978 -84418
21629 40639 49330 -175379 -8975 83639 -153837 -150474 -66566 -160243 210788 -90258 -31317 112381
21616 89911 -47614 -13087 44711 247176 -127547 126825 -121671 -49088 -201363 129613
21605 -149548 27992 222455 -22777 -55626 -156419 -151394 -251329 289507 -15707 -25727 168868
21593 153575 8326 126917 115029 -264767 -262746 98540 -106396 224005 69084 -10550 40158
21581 -128354 36288 -15411 -10770 15733 121323 -26181 246297 -55103 -16310 256431 -118293
21569 -95532 -207833 -233470 -25817 -218275 -195824 197794 -256283 29538 -75584 -9333 -409862
21558 -409862 -51749 -127096 -64940 -141592 14549 23068 71737 -289558 -120446 311757 -9778
21546 30086 -294388 -29166 -2730 -121878 89920 -57125 -155430 -487125 -214976 -281114 -106298
21534 -175512 -32692 -271801 97417 28411 269599 67914 -210971 125532 -197592 218149
21523 27405 -263649 -74990 205890 -12573 -175442 158438 335154 -458678 -235637 -214057
21513 -214057 -240025 51241 -178934 -457010 -132310 105095 -39205 -158530 -11218 -126964
21503 -126964 -57052 -158510 178168 39136 -145128 -163762 152145 168047 202081 -182990
21492 -126445 60469 -100363 66086 -121383 -197707 34941 -292628 -168452 -210399 170174
21481 -42561 -188951 147698 -203700 243277 241445 -14793 -107753 16330 68307 187912 -289474
21469 -297066 203145 -304236 -143641 183446 -16909 -160748 -269602 138249 160036 -244883
21458 158539 -172740 -252411 328968 -203328 -20507 135599 -133604 24104 152000 171140
21448 171140 84683 13123 143294 -215051 -67246 -12337 -36940 33057 121686 73651 348333
21437 348333 433162 180632 427836 289135 283639 282303 80681 88792 110278 -318844 -61300
21425 138421 -271318 111934 -39267 78190 -8803 -275489 -270596 -50867 -127002 -160487 -12088
21413 -157122 -42931 -3887 -19442 -96547 -249447 -102100 -111643 -289689 221213 133507 -227699
21401 -128670 101846 -72144 -28027 -113 -50829 -484767 -349299 -198941 303420 -152041 -167146
21390 -167146 131232 111400 63567 -302012 -35344 196437 -103730 76363 45054 -120372
21379 166426 -112033 -60959 68916 -48544 -204629 -83509 51945 -53451 -144639 -375337 -325940
21368 -325940 84317 263838 -108073 152450 -272114 -296424 30701 27658 -62933 481996 -171027
21356 155380 -45667 -49616 -225699 219915 96341 -108253 -293472 -231021 -137241 -72978 138365
21344 -61621 -52680 -238881 -37052 242984 -17210 -52030 56472 -157974 58692 -74142 3304
21332 29623 76095 113728 17173 -265710 -87274 -126821 -139639 -161597 290704 200059 108217
21321 108217 -191651 -109903 201224 -312107 -113460 -89896 11827 150377 -63427 49142
21310 -120803 54928 119499 -283279 51194 -100910 384998 25539 244814 -450909 -132088
21299 23248 87975 -275186 -120618 1606 -129102 12355 -71646 296860 -407865 118913 -212481
21287 97349 -107361 -277748 134405 -227295 247946 -307711 31575 -186341 -92811 -279549
21277 -279549 114647 67930 -247245 -41377 -28435 -120035 173902 13240 43268 -348628 59540
21265 -111881 -43816 -65170 -191817 -182166 222708 63712 -229372 -294984 -73588 -323831 -222423
21254 -222423 18228 -175108 -106697 -353504 269002 108559 -31903 -109089 -72158 -93225 -198183
21243 -198183 -278049 -263644 -244391 -54184 29347 -11209 -119099 -70894 -4147 150190 -106658
21231 392231 93210 -110380 -44430 -107427 -19004 96190 184605 -96303 -166696 120107 -239315
21219 -8920 -1268 -304553 -85889 -187624 274834 -43222 2784 40165 166082 354596 -37146
21207 378048 -16812 35425 -280042 -252494 66374 -130421 -194576 83582 -139599 40585 -157457
21195 -329053 102995 9077 114735 -10681 -58844 47577 96161 -92059 446924 -190462 139345
21183 78243 93389 -740 -125541 -78638 -94832 -160074 -138668 109947 -308454 -86911 109890
21171 -148702 -126961 -39257 340846 151185 -373159 45697 11797 -93141 46152 207666 82839
21159 77008 -123276 -115860 -11969 131534 -144914 -23863 -178534 -69228 269088 -260361 -90840
21147 -50489 -26137 182163 82112 -195978 -404125 -195048 -53886 -17651 -480370 60859 -375200
21135 -256678 -134151 -158288 -369658 -131473 -313122 -99440 112724 -151782 -190838 105274
21124 -80600 -27940 -242065 -50910 18612 -153390 133400 -262866 90883 105289 218795 127137
21113 127137 -307094 54567 -69182 175908 437442 -330416 -257769 57372 59796 -407259 -70518
21101 146729 -9108 33833 108998 12097 10248 247442 116635 45500 -78794 150423 449626
21090 449626 -221634 -289817 10212 -238105 -295248 150087 -39707 -173806 -316041 -81837
21079 -70818 -417501 -118576 125448 -173932 33408 -72717 363996 -350325 -56643 240286
21068 -99569 -24006 -133900 -73269 278847 -180716 70500 152476 -9269 5242 -216220 -472037
21057 -472037 17071 211840 29892 70754 81882 -224557 143657 -358682 -294113 20893 -14192
21045 -323727 -293632 -12155 -71276 466717 -15623 -83129 -75667 77024 -39147 -41178 122197
21033 44433 237918 -210760 171218 -111355 25604 44039 -294129 40866 -11021 -21361 -269073
21022 -269073 -77072 -338676 -184873 142267 40519 -11069 68711 -113166 -19289 222725
21011 31481 147034 -60395 146016 172969 -139977 298009 -53338 517 172510 45712 -197061
20999 -29866 109102 -77939 262571 -167406 63694 156661 -91632 -2574 -64082 96912 208411
20988 208411 52597 -62918 -83129 133344 -426079 -226879 -79325 7744 -15908 29548 105086
20977 105086 -21815 -47614 -134092 -131470 65242 -146202 -295361 28671 -169815 -60520 106690
20965 -131038 -162269 331752 -215095 -115678 -201658 -121648 -154235 -117431 159272 175147 -299323
20953 -9435 -166622 -4397 -226911 -75783 99186 -65595 -55075 158259 -363915 -92981 110761
20941 -210231 99999 -129984 71878 -115510 36721 203693 -48365 -316060 12321 65918 158297
20930 158297 -275135 -173987 -125043 -188361 79866 -304690 -149579 121625 -169881 8069
20919 -31285 -303686 -50124 -78552 -460432 -93493 -17432 -8177 12415 293711 -187716 -189124
20908 -189124 -176860 -163372 -313431 306412 -132786 75126 -51581 -155762 -382466 14983
20897 -361348 -80102 -128485 34726 -3980 136445 -246533 185733 9863 71960 149050 -338830
20885 -339121 45541 112946 -125124 -89246 -252456 -144725 -6342 -198011 53134 261599 98079
20873 1601 144222 323938 -158600 -92153 225694 -121096 20623 -145748 -97409 93348 99316
20862 99316 66118 -226255 237694 -317166 99270 -130501 -131826 -200575 -182660 72400 117527
20851 117527 -89525 -47980 -54317 136558 -168532 311826 -254284 65039 -108486 -241882
20841 -241882 -273951 19149 320901 -382976 103094 14180 -48423 107782 -107900 -176318
20831 -176318 105311 -96857 197086 -24505 -65529 -82381 -307990 227820 147438 -148460
20820 -80870 -55673 -208347 9399 -175745 5711 -181657 75370 -91646 85597 2919 -229478
20808 -315338 -20052 -69572 -73770 39015 151773 53280 -87173 121539 1354 6505 -137701
20796 77156 -25628 200154 -258591 -28255 -31842 -387498 -1367 93313 -49108 196659 -87309
20784 163188 317428 298970 68033 222575 -108790 9841 -23544 -333761 -250082 -254110 -20921
20772 -92617 282526 -166606 29542 -109938 36343 45827 -180475 -169578 91275 -219217 9686
20760 -78584 173951 -85101 -198949 -247896 -61256 -22622 -161342 -373652 167277 -204969
20749 -250465 -232127 -335062 -413569 -345641 -47102 106472 91909 92597 17630 -112250 -161748
20738 -161748 498 -90097 -226309 218743 24485 -154217 3972 -97879 -89751 11922 -88481 -24530
20725 -55055 127629 -118335 19787 -95147 -72629 -348574 191347 -148171 -272311 -328336
20715 -328336 -175171 -311701 -100857 -465020 223016 -421353 -280979 176308 -163148 -351020
20705 -351020 -18015 -150050 -273005 -144620 29035 259843 -270123 63373 -69897 35771
20694 203474 -71163 -41075 -270515 -104024 34401 58278 209124 -281757 -123355 305439
20683 51323 -13818 278345 -343901 -130795 -65026 -314906 -166196 -12922 -178300 -89767
20673 -89767 338028 48194 112301 176552 27181 -232736 -79468 -224264 -268384 -181454 -174061
20662 -174061 -420384 117747 -263244 -192173 -112327 -354181 -89317 -166356 -187064 -138453 -17137
20650 -81189 -350196 -121824 -9109 215621 -262174 74269 150921 -254984 -198407 123502 21091
20638 107593 -23350 -16149 -212858 -106849 162031 184250 214560 89938 111306 6111 171331
20627 171331 194124 57165 -278824 181179 120484 -336357 346966 -114374 -418122 199833
20616 -28199 -93821 -131468 -252439 -152718 182430 119239 212019 -241610 274567 -78862 -222708
20605 -222708 -63218 151322 150018 161401 172424 160916 -107161 -42385 -79166 -107329 172294
20593 -43817 99728 169677 -93626 -136700 -58232 389364 178263 6299 53603 -55255 250445
20581 2824 212220 337474 -1829 -1860 -89497 -125453 -14194 -155172 381894 -108294 -79112 59963
20568 -90016 -215732 -20753 -156504 129409 183931 245468 64279 34452 44368 168162 -57687
20556 -162678 -176481 339289 -423 -68660 30428 -115509 86829 -89096 -125994 -107114 140064
20544 -70794 -231758 -398837 26746 136928 4995 -117251 177922 -124103 -173534 -235209 -166285
20533 -166285 -103652 -499775 -199835 -278887 38985 172728 -31807 198739 41742 -93241 -83432
20522 -83432 223123 -197655 -494004 -263224 -146954 19412 -201055 133020 -120900 182891
20511 186205 -323091 -176283 -217430 146826 -171882 77708 -61194 -117611 6214 14173 -131955
20499 -63173 -59677 -57362 -43243 -124780 -104323 -17059 18585 -220729 -29342 -24215 -172653 -273095
20487 -273095 -269915 -255820 -293118 -123522 -19801 -73570 -111293 125599 35046 -148917 -103858
20476 -103858 -307245 132597 -248742 26026 101970 -262336 329719 -146761 91383 -20243
20465 -217810 246588 -38336 -38730 -313155 108127 -4353 -5207 64859 -84940 67571 18390 1649
20452 -263989 55126 -130430 -122908 77519 28183 -49183 -241539 33628 17815 -237807 -213385
20441 -213385 -71282 -390990 -130954 109058 -72418 -183899 147249 -24153 -39009 -231367
20431 -231367 -56256 -295575 -94718 151688 -315832 -121221 -172030 -43043 -213238 -41830
20420 114653 -19351 -18257 -433175 -27926 12206 -65744 52942 48162 -189879 175362 28788
20408 19561 -366516 -280046 -76254 -153977 -32768 96737 -190953 -74870 185079 -98909 -78705
20397 -78705 -255396 -306424 -171021 48377 60595 82318 -63697 179752 -179442 -69076 -9882
20385 -295827 171252 -107570 -59298 189210 -65782 -172001 264509 25132 -65731 57915
20374 -2509 -95484 125437 276681 61255 222959 -71660 -82076 -224773 -62023 37298 -30734
20362 2218 67423 19532 34014 251017 67635 -455759 64490 -38568 -421461 -16574 -36771
20351 -36771 -257332 -375111 218394 29232 -91928 -144210 152490 270161 -133620 -226431
20341 -226431 -101604 108078 132944 138147 139415 31570 -47821 21673 -43797 -59533 -288264
20330 -288264 -106264 -17532 8452 -58548 -49235 186965 109816 54674 14446 -84518 1692 -94127
20317 -1644 -68734 156760 -47137 -170358 173554 -127891 -7525 -237598 -25261 -304661 67713
20305 205539 207970 -9266 230709 223862 83063 -48389 -210621 -7104 110864 -231061 92487
20293 108314 -8674 -74717 98208 -5670 42148 -152818 -47232 166981 -11142 60882 -172393
20281 166309 -32071 -108333 56202 166719 -187358 -273876 -310138 229593 -209808 58082 -188865
20269 74553 90998 -8515 121017 -197724 -65435 -39562 -139052 62387 -55074 -101807 -295446
20258 -295446 -89566 -116915 149722 -56233 -269467 -113395 -61569 8380 -231428 -254096 -167093
20247 -167093 -88847 -132591 -226005 -149551 -74963 -152437 163768 -62890 -251947 68119 -148599
20235 138511 -194931 -33533 -53226 -311424 -54665 451684 -51725 -147932 164006 -150951
20224 37647 -264311 -240301 -97641 -36364 -97279 -60558 245816 -292254 -273475 -118345 181710
20212 -357197 7027 -264681 -45266 -213123 -202331 -225481 -80602 -109482 -83376 -371832 71265
20200 156381 -32609 166502 -46152 -21223 -103579 -67131 -120685 23934 126156 -151644 -226233
20189 -226233 20268 202351 -236425 77367 -215176 -5091 -29029 -81673 140629 -39635 -407385
20178 -407385 -150448 -12734 -228102 129391 -238628 264965 -30755 -76865 -140693 -24419
20167 306636 -139319 7650 -81332 -304811 -144601 -403796 -156883 60374 6367 -184007 -55490
20155 122769 110470 34361 173353 -38209 -168710 -47011 297757 84302 -105016 187500
20144 118833 297318 145 288928 148129 -138109 -179045 207393 -156305 -107574 -22328 -60272
20133 -60272 -304422 221548 -29570 168310 -416133 -79674 221385 -258277 -21011 -462045
20123 -462045 225837 119102 -110418 -169838 -183741 -40150 -41572 1885 212613 126 -15851
20111 191888 -342069 -41037 -284946 -35362 88116 96413 -77076 -306987 -384863 -378264 -27896
20099 -320540 -193033 221325 91568 51579 -136353 143558 -91128 -262524 -142219 -212627
20089 -212627 -231590 -138522 -126872 173842 -277316 -255695 -39399 -215161 154941 -200562
20078 -297720 161324 -135775 114254 -75241 -54562 -67371 -351779 -298175 88114 155589 -33553
20066 -311876 -203385 39032 -69158 -143933 -401741 64001 49993 -281930 -31731 15728 -44114
20054 -108123 -81058 22527 -25882 94741 -227428 208317 -24793 -31377 137858 76286 345
20042 -140793 244737 -110281 32233 263965 -222011 -148256 -199699 24379 219130 -89762
20031 -66581 -100766 144070 -241701 -90633 -99590 -116090 -48420 -106050 -104744 -329325 -84292
20019 -26413 -162379 -7306 -162477 -49199 -13708 141553 -26551 37562 20462 -367437 -268517
20008 -268517 -6852 -10929 13236 169859 -143800 89684 270685 -170822 -240206 223397 -86642
19996 -36084 -63947 4216 -402403 325742 23133 224830 -14567 219953 72628 -165359 -178470
19985 -178470 71480 149520 -93607 -277414 -196650 -136547 69951 28419 -36460 99123 67637
19974 67637 -173070 168638 -51886 -228553 -27514 -68755 -28927 14092 146344 -317148 -39718
19962 -55669 12837 -52500 327019 15546 43632 47618 -480904 -128587 -4127 52690 -252860
19950 -41482 -321366 18159 -239858 -38850 -305024 -176836 -172397 -49735 -334047 53217 189795
19939 189795 -428109 -131932 19846 -191135 -206039 57167 107529 -135534 -32392 -190443
19929 -190443 215871 -142462 28038 137333 -228838 239103 -155552 -102081 -266357 -248941
19919 -248941 -198652 -60843 -29618 -155500 23668 -75280 38074 -181273 -102161 -229170 125693
19907 73911 237921 -99667 -334406 253012 -258371 369710 -36776 60823 -332583 249674
19896 52650 -126703 85627 -187521 -58924 -191679 39357 107824 -1777 223021 -311971 -167289
19885 -167289 223914 -187855 -217506 -99926 -39310 -67561 -51821 -379908 -158091 -377108
19875 -377108 -209417 -101297 -295042 -40803 -41218 183204 -178872 129772 219053 -69491 -24452
19863 26474 -495657 -246707 500816 61661 -220915 212801 -29776 -103107 -187737 78638 -160552
19851 -24572 -222000 -102377 87629 -81901 -152680 181695 248926 -208801 -21111 -153481 158623
19839 5464 -106779 35624 -84862 119515 194927 75626 -104403 139220 80043 -131073 -93624
19828 -93624 -239365 -97468 83439 56886 -59178 -47979 203278 257711 -35791 -78936 -263855
19817 -263855 -217107 -77950 22188 -80814 -13017 51310 -344185 62873 -7610 5996 -136768
19805 -321801 -103658 -382353 -127390 -66990 -114835 40232 -29443 101697 31948 -37450 -200851
19794 -200851 -1369 -13519 -215389 -153899 -143740 47067 58621 -262552 -30119 -86574 -458434
19783 -458434 -65048 -5013 296095 -32231 -12184 105084 -235528 -440918 -328255 -374177 -383791
19772 -383791 149549 -152423 51428 -64057 -88252 -30534 -197272 209932 107992 96941
19762 96941 -223433 -84952 169605 57087 -68638 41943 55446 -225783 59796 -120955 141668
19750 -91165 228862 102090 87789 -192310 -107925 64640 -16771 114910 -80522 -247808 200178
19738 -213508 -85946 -159938 260604 -159185 176325 29752 -16058 -6574 -141195 87135 -162290
19726 -192890 157863 80181 -7939 -225626 -421781 163915 97277 169465 -25384 -83454 -103040
19715 -103040 -140251 -310727 59616 -6442 -45263 -24102 -130295 -78502 -1789 148653 181957
19704 181957 64488 -74386 -140267 194218 6492 -113308 -211525 19175 207157 -119119 39704
19692 -99453 116302 -95675 116064 414603 23861 -329785 -4817 -214932 215232 -368946
19681 -25213 -154869 13144 -177123 -195818 251221 -11 -224480 -310715 -46208 3929 -503174
19669 -79784 -249540 150510 -213818 -138409 -186633 126820 -381513 -180970 -60328 -5078 -303264
19658 -303264 -287667 -64422 60137 13477 907 112505 -47299 73932 9872 -143241 184052
19646 30065 -47616 -131247 -256205 236636 61807 222759 -77957 -152343 -25072 -249424 -281295
19635 -281295 -191877 104782 -14496 -182651 -99177 -302140 72318 -58999 -419371 -29732 -30860
19624 -30860 -35277 265260 -148780 245384 141071 151647 -132329 -221800 180663 327835
19614 327835 -56079 -263326 -128931 -366773 63867 -254903 -62693 -368035 -21238 43678
19603 187717 -527227 -102884 -219616 42306 -75987 -44790 -706 -115312 -156614 70204 41439
19592 41439 -32259 37202 -10649 -395896 -59797 -150849 -149207 197796 -5047 19171 169732
19581 169732 144759 127474 22786 -13066 -76952 14539 -63917 -91103 -432796 -30055 154653
19569 236555 -246661 -231697 -88638 -130734 73284 72166 -437472 -122568 152395 108352 177223
19558 177223 340378 -367257 -187739 -43349 -58656 118872 -250467 -198787 8458 -255650
19547 -21859 -143788 -98437 -279696 144914 -99458 -36464 -210623 -305855 51377 304881 -90045
19535 23868 -60040 -16654 67349 -64020 42903 141236 -247149 -37218 21051 -109304 102923
19523 -216456 14609 -52601 -34591 -189150 -134116 -12600 -32963 -128069 149479 -125191 -251867
19512 -251867 92711 -89549 -419257 -110032 69391 -300671 -152895 -215143 -15155 -352676
19502 -352676 -5794 13836 2936 -52345 -95203 4557 44310 -193470 154796 29226 -237126
19490 48946 117828 -88614 -175742 -228322 -103287 -59667 -226337 93561 -108573 -83995 -165875
19479 -165875 234523 247011 -74181 -195229 -197645 7172 -70789 -283801 -73700 -212007 -323648
19468 -323648 113249 -188003 354856 -49161 -81342 -19477 176135 -116934 -187512 -102993
19458 -102993 52635 178646 -97202 28950 -29825 -125294 -119194 -207872 -1974 -204307 -50845
19446 112439 -102901 -202968 -68338 235158 -19649 -31517 -35284 57465 -170374 -19805 -224812
19435 -224812 -48071 91057 231327 262149 164538 -173973 -124967 168109 343091 99491 -21995
19423 188418 251691 -44177 -231663 101546 -87324 40218 -213158 283851 -330540 296861
19412 -96175 -3025 -78661 -97447 -273480 46151 -140908 14254 -119604 -105820 56884 -95877
19400 -37343 -496293 76398 166564 -170230 -179461 -29552 284717 -130540 -189177 -297744 -283808
19389 -283808 -44600 -304969 129595 -373951 94729 -246051 5897 -242682 131544 -271206
19378 -37210 12573 -79103 19491 59922 107092 -219708 -201950 110144 -378754 -216789 -42762
19366 -183106 -118602 -97876 96315 229780 -66855 -11362 -150394 -346576 195513 158910 11174
19354 65081 -110115 -33709 92210 -116830 -221747 -93043 -1909 100438 -132769 82188 326523
19343 326523 57335 -221040 139512 -162770 -346824 -9118 -35579 -12570 341949 -97898 222147
19331 -77665 47761 -231115 -104299 -353252 57116 -72831 -10807 -70974 -77952 -10734 -283742
19320 -283742 -119336 -558590 179278 -182688 126163 326200 140767 -43803 -237436 -225721
19310 -225721 158170 -27651 -120497 -254072 -274287 -377877 -37460 -71357 -277281 194183
19299 -152279 93973 -241498 -107017 -53487 129298 -125457 150863 76014 5683 -211724
19288 72272 -224875 -51893 -242497 65932 -145785 -321332 123294 -149185 146819 -55385
19277 -118988 35843 -11077 -52153 -191594 -42401 288951 76482 -242091 601463 -178166
19266 -239296 -255337 -273809 33461 142926 -51523 -104784 -103000 -262348 269607 -38470 -315306
19255 -315306 20357 -150253 -291595 -81785 -147673 -209019 85335 -91905 -10993 -28254 -94587
19244 -94587 134862 -37783 156813 -255857 -262372 112058 -174089 -136781 -76056 -214540 -284963
19233 -284963 162078 144736 -8019 -26825 217934 7927 -43826 -88031 -285799 -63016 -295624
19222 -295624 -44048 -4104 -40553 -54664 -56899 -24259 29701 -258553 -94572 147575 153707 -112085
19209 -91132 200914 222954 -200995 37397 89711 93664 -315456 -54098 -66474 192004 -262881
19197 -168391 -103549 86678 7554 -52202 -115757 -206755 -73523 -419231 -100048 -527187 408650
19185 -143761 191496 -230094 -148493 81425 123218 153702 -169565 225728 189441 -33886 -212466
19174 -212466 -127557 -247583 119986 -325966 -246630 44958 -14562 55513 -22337 -388905 -113115
19162 329054 56430 -232246 -33260 -309228 107520 45481 -132429 -364833 297945 -114897
19151 66038 -178626 122434 128155 103896 226965 -62003 -95362 -295473 -177084 -168752 -207147
19140 -207147 -59904 120004 14950 335623 -394698 183733 -95426 -53391 140996 49449
19129 -109348 -336492 -164633 -105248 -322062 -15281 304119 37213 80175 -170502 -98264
19119 -98264 -66855 -463290 -523414 -410886 -183449 172683 -119774 -99340 222670 35260
19108 168965 -58905 -112942 -51826 115855 -180510 -344519 -36047 100624 122132 127782 -131198
19096 73541 132910 -357909 5115 -35238 54303 250 206137 -569041 190859 -111150 -25966
19084 6401 230590 -44160 -165898 -110528 -465425 245791 92535 -108499 -121532 -31197 -55000
19073 -55000 -168765 -297724 200018 -81116 17682 -17277 -141096 -44854 126599 -116925
19062 -164002 -7900 17309 -171930 -207339 -172878 -100633 11286 -105353 -71454 -253987 -119680
19050 -53365 -56802 -28865 -24917 129901 -92404 -160448 235056 -448881 -193465 -8830 -5813 209474
19037 271104 -8195 -77898 444225 37450 47411 94011 -4151 14874 -203574 -151403 -42813 -209725
19025 -209725 40418 312582 -129000 -85854 159413 285629 -182398 138649 -27031 159636
19014 -183463 -7895 -144565 -47548 -60813 54149 -186720 -310719 -153115 158477 24032 11688
19002 454 330493 59596 297402 -255182 -25389 59708 -421779 -55240 86116 -193477 153934
18990 -79581 -86195 -12122 33076 312806 128932 -68935 -125544 250873 -100161 -41058 -97025
18979 -97025 5571 277501 94381 -68730 -281523 -122352 39584 72063 -159849 -34329 38168
18967 -141374 45816 225875 -354733 -24541 121137 -88826 -86851 -36528 24721 -83734 -288670
18956 -288670 175000 209730 -151886 -42110 -200321 23830 -372240 -66114 101142 -190874
18945 -165876 -70552 -97325 -4998 -112124 325374 77103 -21902 -70346 -27064 -268725 -30371
18933 -214182 -145272 8527 -181115 61659 -77120 -88483 110874 -253088 363547 -90375 15931
18921 -159932 360632 34041 -87730 -9275 116350 -49442 77543 -258856 20094 106104 -249552
18909 -96707 145001 63086 -188349 307540 -218424 -19268 42272 171892 -255485 -426718
18899 -426718 -403244 243945 -81088 124827 167569 -222642 -419222 166778 -119280 74157
18888 35235 -73569 -240607 -96714 -200584 -151870 -193261 -2047 -39620 -41076 -83369 -233129
18877 -233129 -346160 -8670 -54134 122868 223091 -44495 -92546 49684 -199797 -270915 206817
18865 -124096 -332627 -182698 -158874 -290850 188328 22789 -455131 57556 -977 -297348 34568
18853 -3531 -73852 -85505 151796 79560 114051 439001 335709 -82758 96617 108296 104155
18842 104155 -36751 6684 20722 -32501 -155479 -118431 198533 1857 -241253 214637 -303252
18830 -67351 -536940 19302 -178029 -83323 96052 -127302 211754 -177576 -74124 -48311 -51905
18819 -51905 310742 190 -118069 -44781 -168826 2922 202718 177714 -7413 -3952 277399 196710
18807 196710 162275 5342 -136332 -47880 -414925 -28824 -19728 78222 -47194 -220754 294896
18795 -167012 -20205 -306441 67270 -207494 139565 -79409 -96324 39465 -93963 -303775 140527
18783 -72691 -104854 -190605 -33683 -119309 -48759 -361070 152682 184088 160132 -268807 -26002
18771 -24712 49018 83986 21024 -3265 -42732 -280533 -38231 -70348 135261 91263 241828
18760 241828 -86651 28881 -203645 45446 -76151 -177851 -135044 -99113 297003 -403487 19150
18748 -78549 -30759 -19597 -73133 45268 -9916 -57374 92295 -76298 -316345 -60763 -4542 282392
18735 -109788 61897 -245953 27371 233603 3657 148382 -120080 -165774 -187720 11546 397220
18724 397220 120584 25488 359348 151084 -37308 -118883 -137284 -188779 -217500 -25560 16593
18712 -206413 -143115 -392727 -258081 -134481 -147973 -115143 -225849 175717 -122563 315306
18701 -111470 1606 297960 -75166 316698 -258485 69534 -90307 105723 -312467 -50945 -280973
18690 -280973 -19877 -159909 53933 -71814 12423 126843 83082 -388858 -321368 -83706 41083
18678 230419 -363284 129864 -299217 60218 -108805 -169236 161436 -199220 -363410 -98888
18667 -273990 -230593 24757 -137274 -91621 434153 199324 249832 -300959 155642 -60571
18656 -261642 -101731 -122273 235113 66300 -351024 46185 -14420 -295140 -70563 -216076
18646 -216076 -103033 172097 317654 -149851 -338973 201184 85707 -136268 45188 -190036
18635 -11901 -166034 -66966 -56483 -18905 -119986 62452 246971 15094 114931 -54544 -8640
18623 -71887 -219750 -372162 -242814 -35127 -135168 -9176 -232486 101049 103761 105541 92773
18612 92773 25792 -5891 -164967 -202945 71080 62673 -200782 -20053 425439 -13736 -107421
18601 -107421 -124068 -119758 -149367 29549 173423 -155964 -267841 -122099 -163514 188864 -256793
18589 -210252 -122333 -126181 102516 170050 6546 -166721 10732 -208945 -43816 -420566 -98082
18577 35855 -174700 -35799 49725 -93327 -35333 -160649 -48333 20950 109909 -25316 -142681
18566 -142681 21573 61824 184760 -42281 -134031 109280 -305705 -36711 -55928 -128885 -73141
18555 -73141 -9461 57069 45393 -60797 -118245 -165636 -168492 70313 -134243 -368506 18754 -246127
18542 -115521 -92729 27637 150641 -7256 22820 89733 343833 -130029 212755 -276657 94758
18530 299640 -394038 -50072 -115076 -51676 -65069 -195379 128186 15917 -181797 -101690 -242259
18519 -242259 101453 275880 384258 -69113 -106247 104985 425740 -211404 -20751 -142380
18509 -142380 -343402 83153 -68235 50420 230539 -291107 103307 109990 -90916 -270227 -31101
18497 282270 112434 -177045 -212269 25088 62332 124679 -82451 -186926 16906 -1153 374430
18485 -299887 -54943 -218628 101592 -25974 -120061 -61404 313873 196135 -12118 25543 -88943
18473 -193191 -104970 294990 24214 -20876 249996 68694 194171 -66251 109875 -293927
18462 83863 -348 -121760 -64522 486160 6946 -171048 -52508 93228 -301262 152514 -134285
18450 -246341 -75334 -301823 -270487 -5891 -61714 6171 -70928 80760 -159164 226185 -14313
18438 -341282 -142760 -139624 75582 119873 230913 -53919 179105 -134893 -223680 -351114 83554
18426 -21163 -4498 -154216 166475 -55083 -77210 669 -265629 322142 -143248 -88465 -157427
18415 -157427 81905 -241193 -15434 -259163 -143804 -108439 77258 23600 -391243 -39249 137144
18403 1225 -11580 -214823 -347059 -314754 55419 -355831 85625 -392168 -341382 110044 51993
18391 -115603 -95103 84921 -90489 -204500 72986 -109434 42515 -357796 148244 -19565 75054
18379 265803 -22216 247755 -133487 -131739 -205935 41842 76263 99029 109650 218346 636470
18368 636470 -122718 -12671 114589 189903 126298 125428 153585 72538 -149646 8053 -214329
18356 162667 -110020 -189503 -56755 46315 -57725 -220357 196332 108441 77555 -30952 -114696
18345 -114696 -107853 567598 173314 -318665 -271383 -431935 -68320 84400 -38213 210430 115154
18334 115154 54409 157079 438148 -125475 46579 -101634 30088 -38760 92620 -99119 -23983
18322 73574 192127 -233895 -10957 160927 -84927 -150739 177630 53437 -145096 -195793 -58763
18310 -108483 -173020 91125 -142342 -161078 165945 -237906 -67842 -109728 17023 187148 -116404
18298 69930 -227907 -25470 159063 -148149 60049 -87163 52159 -53730 198546 -117856 -299964
18287 -299964 107251 -190704 276830 -79144 -15042 -264434 66080 121910 -399218 -47416
18276 -93442 37875 209128 188636 -88415 -30132 -175185 87724 -379001 48889 -260951 38903
18264 22764 -78162 31422 -54649 -135891 253379 -421903 58039 -64852 137367 -126815 144857
18252 -75075 -173967 182115 -108395 -19771 158010 -373741 11809 -190300 -294025 -73851
18241 -210097 293264 -51344 21095 23490 -60498 89309 -357362 -113599 170527 296215 52466
18229 15610 -101380 146350 -63239 -296498 115277 -107582 34746 -32279 -285533 -180032
18219 -180032 133755 -319063 -45793 65700 113320 104197 -246669 -164697 -241924 100711 46143
18207 -69962 -194757 -24186 -117843 -16486 154678 231382 36050 -226630 -537402 -318245 108038
18195 -52312 -17965 -202091 -15528 -177525 243607 30541 -421965 -177617 395225 -74613
18184 -192352 -241726 -236240 88565 112777 139968 21891 295083 -80890 -68546 31240 108303
18173 108303 138548 -32193 -174676 -401905 -205494 -247756 -56672 -119102 -96814 -125774 -314840
18162 -314840 59498 190232 -94444 -204286 -174636 -242635 111029 -491426 -274422 349048
18151 -203087 -1704 79987 63819 -196347 68841 -138292 -115827 -184266 -209842 -173641 -122321
18140 -122321 -33959 -91559 271659 44316 268887 -178324 53263 17518 -356750 -202242
18130 -202242 -85376 -60304 -119011 60556 -103998 139288 -73943 -559554 -413869 154978
18119 96369 19013 99785 150470 -179626 56410 312116 118009 -99973 -261495 155232 -43381
18107 144306 155864 -507 17616 -190367 62448 96242 183754 -168224 14193 142036 -36540
18095 -314137 86461 9558 -34468 164875 134527 -261421 -72155 273428 -120206 -63302 98104
18083 75444 -187507 -20916 131646 -158536 14191 -49695 38334 14580 -56840 -223118 -251901
18072 -251901 349488 89927 124125 -339726 101160 -54880 -348576 -7360 32499 16981 -82771
18060 -72592 -240976 -39580 -172304 84599 -232803 -152166 241754 -155435 15552 27243 -43080
18048 153517 -21275 84852 -92927 58779 -100056 -41395 -90805 33927 324927 119445 -141567
18036 -129128 -83204 -192992 -117406 223987 -14774 -121932 261329 -79998 25063 77174 -142259
18024 -25797 117469 -27014 24429 33632 -115446 17242 -179511 -25533 -93539 33968 -162868
18012 40717 -319537 -94121 79651 -11514 173123 -25748 -9745 -175607 -151745 -66232 -57249
18001 -57249 -310967 106910 -196595 -156451 22016 -132270 -231835 326872 29478 -63272 1091
17989 -179731 41547 -32109 -63152 5631 -370801 -240314 97392 80030 157691 -155984 -131632
17978 -131632 -136007 178949 99546 238847 79040 -10813 267589 -67445 91224 59272 -191306
17966 -146956 -94465 248654 202999 -91190 -23204 -257091 102407 -101112 -73620 -49247 48979
17954 151351 215879 641 -311260 17667 -16660 -18467 -73272 357231 -111817 -175580 -102151
17943 -102151 -83483 73147 -10197 -68433 31082 -62334 -481155 238521 185656 30344 271363
17932 271363 354965 -265145 81000 66149 87128 19340 127385 133197 -133066 121200 -53259
17920 -152479 -105238 431195 -60333 218997 84779 -117395 50536 116787 -118247 8292 33627
17909 33627 112760 123821 -169253 -24126 -48582 113574 -231571 94369 91810 284123 -101895
17897 243399 218329 -77754 -35669 121301 -157634 139406 -366644 169718 -109946 84714
17886 -139464 -300170 -113181 -143495 -65576 76101 -25865 -48922 -202747 202864 -280351
17875 -288281 163987 267792 -185669 -136812 -281500 -55419 -66754 -167980 29472 -122597
17864 -25940 113870 -420695 -29765 -205096 91186 -235841 256701 133906 -109273 58593
17853 -77228 35948 154049 -6047 -2482 68376 129298 119369 -163432 284149 -82258 146906
17841 -276668 -282868 181952 -218600 88026 -83098 -74863 93506 -113036 -142696 -95675 69743
17829 -83786 97109 -38058 -277874 129312 93572 154406 -35365 141544 68983 -163932 71445
17817 -20000 74444 86577 15501 -34179 -96387 -58847 205351 199958 -228509 -185388 -455353
17806 -455353 -297870 258756 190771 -264223 69459 85650 197265 -237422 -60135 31459
17795 217596 -133356 -67011 -273179 402179 54948 180447 -141717 -35054 71888 -169915
17784 -329035 -101549 -88518 -117436 -330041 209502 141428 -144661 -73196 -59487 -323458
17774 -323458 247434 4905 232174 73824 19582 134666 81630 13954 -206579 138525 -146727
17762 391316 -58394 101622 4124 -96581 242608 -171905 89795 -210159 167332 -79905 -197027
17751 -197027 -13692 28624 128860 -54569 35077 180275 -11245 -18226 229037 -13215 -34316
17740 -34316 -303191 -128930 6488 42828 -304588 197471 77096 -34848 -103292 188757 89734
17728 93464 112749 21172 96484 66663 -41599 -6930 -269110 139203 -63516 -229701 -290101
17717 -290101 30774 125534 34163 170482 -1714 -114551 321653 -227414 -95767 212929 92331
17705 -238581 23893 157067 170089 -224696 361669 -11630 78324 -162562 69251 -110391
17694 -257465 -49644 51259 73318 -108639 -186943 -361922 45648 -16288 -133261 131998 -53437
17682 168055 -224342 33270 309514 38714 -197194 -133812 167653 44701 162946 -162576
17671 304606 -91949 97968 -155091 -50685 -173876 -46831 15743 -89134 -72551 182281 106162
17660 106162 -270712 235638 -70147 268824 -3535 185038 -55474 79708 207582 -231743
17649 298216 -75335 12136 351060 -88607 324 114382 16608 252044 89213 8757 94412
17638 94412 159459 474815 -242459 37550 107169 -38309 -134263 40101 -190150 -2542 31102
17626 27124 333013 -145890 61562 -195588 90107 47510 116798 -184442 53528 371566 109031
17614 49027 126633 272766 367752 -169866 27504 -166090 248780 -47662 75135 -11458 200828
17602 333019 12264 23680 -172357 44519 26021 99101 27332 -217724 210141 -87901 29824
17590 81191 -322816 -145570 16976 -348482 -375288 403484 221680 86670 -88173 -103267 -183239
17579 -183239 -53998 306915 -87023 263113 -51320 212211 126436 -148684 -151532 -147944 215380
17567 314454 -86416 14028 -127891 -207926 76171 -16100 178279 -2908 217840 -89463 401705
17555 -94132 275771 3895 351743 88969 -67173 -100349 -135399 234528 370832 403576 -5565
17543 20112 64724 -88175 33970 181242 -23050 235374 191017 119761 270878 -145405 -190580
17532 -190580 -99461 164676 -30622 30624 -26660 71753 -211638 260917 315482 378843 -6897
17520 181042 33540 -68560 344284 277501 -50009 280859 149559 189753 92228 141338 -44991
17508 282232 148431 -214802 404878 181307 173914 94108 313815 204354 62072 104793
17498 104793 86286 175423 -65278 380103 -92381 224837 296471 -18066 -47480 283700 198302
17487 198302 45790 -133362 319720 44482 -13149 87789 -131097 314090 261358 138406
17477 138406 217597 132067 -15544 64353 156101 -4886 -196283 257409 68488 335939 -177729
17465 -3687 78092 60790 61314 -239145 322270 -194409 112478 -81810 207027 190107 212253
17454 212253 105250 561187 136081 -89051 282847 35247 327889 21978 130071 140174
17444 140174 166750 -3689 -21210 107715 298221 230699 266845 418953 268448 564852 67776
17432 321715 287487 334737 98816 445400 46816 452039 106671 294733 240929 297380 53401
17420 281668 221026 227086 88945 131777 390059 107432 221769 142369 -228226 175958 -12397
17408 427669 484309 29447 190881 502920 27062 366205 162458 -249922 -72907 296777
17397 82843 149710 -52213 -43001 87689 149400 31435 217681 379802 157457 544259 133410
17385 332185 -55056 213628 -10959 191496 110635 490237 -201833 175956 -2485 218458
17374 267249 366110 262985 -32181 421827 134184 14942 212287 206534 48245 267236 280749
17363 280749 501899 81223 92628 -34006 24284 140617 -217583 228823 -171418 176532
17352 274676 121007 -87844 -183080 174827 331469 124148 39875 245113 -102689 202460
17341 -94900 194641 -114918 161425 76503 590080 -26834 148604 222646 516 192771 75166
17329 371860 326478 520183 202367 138190 -40644 -80375 207761 489049 148755 168430
17319 168430 129355 258491 409923 104916 288363 255505 -172276 -271948 -238092 322289
17308 179470 35603 173753 191786 538560 64930 426083 169821 456640 -65683 388717
17297 74547 160483 192077 -266190 -26662 -279208 5372 -69393 149630 423737 82713 154064
17286 154064 297523 238118 -203753 33666 -144836 361144 63183 134920 297772 372515
17276 372515 110359 235294 242572 15717 272755 134679 166935 468635 430332 115135
17265 500899 232630 -84439 67626 -139073 409556 554465 331367 162165 40487 374768
17255 374768 -75941 222452 5198 90423 168314 -58188 -38019 -77726 -61128 89453 183350
17244 183350 216347 302980 283400 -53190 120741 459427 46648 169640 -150936 69137 293378
17233 293378 257701 275622 217353 4636 23046 100250 292212 242297 384521 311866 475715
17222 475715 539585 361739 118925 206229 143501 419940 164618 250241 52985 441470
17212 441470 36624 42818 269035 129777 211742 420834 235278 382786 168360 558212
17202 558212 216155 294403 189338 423297 334610 118333 -134896 450275 374369 316770
17192 316770 260755 301205 504882 299717 299903 279413 -37811 500277 13467 129955 182437
17181 182437 422388 371453 342269 212853 129863 161346 441186 257705 353331 44377 549156
17170 549156 230030 348862 259085 122554 88294 157585 431829 224599 469356 652656
17160 652656 447397 449710 233564 211659 174179 13310 469410 197635 456865 133609
17149 258989 36981 178361 68005 64425 390915 282202 383037 449351 586411 378613
17139 378613 319130 542474 670155 456565 452219 453999 316819 507112 456706 390043 566435
17128 566435 229352 718167 650803 292481 249033 105669 475781 271674 433251 362632
17118 362632 230084 107147 149985 163952 376912 488122 257205 244288 665386 264742
17107 563178 262356 431139 612200 366249 482679 631827 592083 360198 112181 269244
17097 269244 454632 550947 513998 432794 555103 608037 273513 623224 526158 491229 631896
17086 631896 546073 218934 564687 566442 199867 327495 148550 418965 263026 687423
17076 687423 589308 152095 323714 475450 523413 963330 443868 267283 441598 88990
17065 462380 438832 458502 414159 370113 716791 546089 296806 246964 583206 560788 444210
17054 444210 580036 538039 401399 829785 649533 150059 637512 326478 516211 486370
17044 486370 559809 510511 753087 767136 575578 163814 870478 405149 510511 721817
17034 721817 773946 284148 577275 628859 672750 276099 659708 589731 257213 555946
17024 555946 554118 811920 377399 251419 452072 814199 927812 246359 323068 989151
17014 989151 717452 726050 302786 626298 820791 739058 825801 715649 612914 657524
17004 657524 872714 689116 952204 878019 1074056 938171 742042 520928 879918 779388
16994 779388 738579 884021 578871 998831 1084233 579436 801040 767924 975726 985224
16984 985224 928974 652580 890685 825259 822608 989959 1138435 898549 650702 1049736
16974 1049736 852268 813575 448698 510473 917237 1061753 1082307 596180 1040584 1106786
16964 1106786 1098754 1156790 1130785 904694 941366 816135 1323517 1197091 854738 940474
16954 940474 976471 923845 1150262 871378 892043 1134298 1080982 1066580 1186149 1293460
16944 1293460 1281941 1008528 1212447 896551 1381096 943256 1091719 886454 1298734 1450017
16934 1450017 1234862 1573196 1250224 1250037 1465208 1154868 1656257 1357224 1673197 1366806
16924 1366806 1463540 1467979 1408526 1204565 1313557 1205803 1435793 1228385 1269660 1543055
16914 1543055 1444678 1489066 1452879 1570592 1696053 1425904 1631102 1400734 1638631 1726117
16904 1726117 1642254 1957789 1912789 2101747 1820591 1932450 1817548 1700522 1714257 1528131
16894 1528131 1620186 1726174 1810256 1993074 1857692 1901224 1909870 2049322 2251364 1872893
16884 1872893 2062065 2218865 2097028 2248146 2176884 2117673 2305334 2297768 2374480 2153694
16874 2153694 2334824 2432372 2441620 2417748 2635202 2293903 2327301 2445164 2589199 2532950
16864 2532950 2671045 2651452 2663577 2843285 2748725 3042747 3042095 2699426 3154032 3139185 3072743
16853 3072743 2874555 3229014 3000918 3150344 3045251 3296565 3118306 3598398 3358477
16844 3358477 3277817 3491721 3713941 3510072 4035599 3489241 3869133 3923147 3934564 4137399
16834 4137399 4164456 4416518 4262481 4557976 4238826 4560435 4366300 4467165 4430929 4683943
16824 4683943 4865704 4959272 4871519 5027494 5028420 5636161 5138610 5352698 5709983 5618255
16814 5618255 5662853 6065357 5995298 6187475 6340306 6281947 6523723 6711664 6815822 7066188
16804 7066188 7322210 7343909 7300607 7680561 7622081 7929138 7991508 8396718 8156226 8512950
16794 8512950 9043766 8973047 9151415 9351267 9819528 10011917 9916789 10539557 10845314 11021444
16784 11021444 11078319 11801354 11850203 12311993 12685638 12912162 13436408 13408630 13920177 14628773
16774 14628773 15048326 15413642 16083007 16763052 16592508 17537078 17947796 18951507 19441217
16765 19441217 20113377 20746375 21670647 22483319 23271089 23974660 25161476 26340225 27034117
16756 27034117 28505497 29436754 30685375 32142432 33731571 34845240 36472425 38474146
16748 38474146 40023428 41983892 44303014 46504542 49191259 51641353 54273330 57117178
16740 57117178 60446248 63629214 67688989 71095581 75668326 79937969 84559337 89513399
16732 89513399 94742159 100832228 106849407 113511897 120110977 127215352 134314575 141837544
16724 141837544 149235330 156318527 164054367 171084417 177466675 183352245 187987623 191631321
16716 191631321 194792207 195743312 195598057 194020350 191586462 187320158 182426440 176444890
16708 176444890 169984597 162359417 155259559 147514023 139836891 131971249 124429753 117374757
16700 117374757 110251610 103608317 97490343 91562293 86135099 80960033 75668007 71696369
16692 71696369 67595380 63394516 59805466 56736984 53498694 50484255 47851034 44963503
16684 44963503 42975259 40735689 38445118 37080823 35058112 33488813 32038802 30636301
16676 30636301 28945464 27810917 26539015 25426279 24471614 23553802 22603666 21582257
16668 21582257 20532792 20081005 18950376 18321432 17688861 17254173 16432703 16037900 15139437
16659 15139437 14994723 14068957 13563875 13335832 12671594 12709217 12242125 11565278 11227069
16650 11227069 10974828 10404095 10295681 10393557 9778725 9437657 9209915 8787074 8501712
16641 8501712 8104811 8109040 7958885 7747629 7421088 7602499 7361030 7116704 6799912 6596960
16631 6596960 6555970 6652913 6258899 5870631 5901850 5764112 5658298 5573516 5380640 4789229
16621 4789229 4697885 5018151 4772711 4972289 4644019 4355578 4627258 4521045 4607080 4066481
16611 4066481 3988179 4249591 4215914 3836416 3805320 3569986 3696516 3614994 3715287 3268761
16601 3268761 3206856 3377613 3275310 3092875 3055720 3032325 3167791 2762178 2583005 2727362
16591 2727362 2938062 2714177 2672599 2585074 2376429 2248680 2691045 2721359 2523365 2568657
16581 2568657 2473365 2472641 2523655 2541241 2056823 2054814 2225254 2402085 2150521 2073207 1905803
16570 1905803 1906017 2054761 1943234 1847734 1995569 1665929 1827084 1955990 1837091 1773169
16560 1773169 1792171 1829237 1727087 1461514 1571536 1786707 1696738 1744934 1541163 1234149
16550 1234149 1594816 1504998 1252620 1421446 1788587 1325760 1549768 1136448 1669848 1181153
16540 1181153 1197734 1171123 1001242 1434536 1069530 1415977 1097983 1281974 1219797 1035506
16530 1035506 1171331 1204180 1164480 1292464 1082823 1021981 1186758 1162800 1120915 1053857
16520 1053857 1046619 912039 1006720 946030 1029497 1046977 794164 876942 979832 951663 1107718
16509 1107718 901236 892857 704064 966627 905349 591663 960172 878868 998339 978236
16499 978236 615563 512100 908593 703837 1224997 639994 836492 554727 843436 890968
16489 890968 860171 1010969 854940 869368 865554 745462 555402 675966 400280 593351
16479 593351 671512 785759 399207 316906 611573 282162 430528 846755 558615 291528
16469 291528 469873 438471 389036 441512 183074 644548 607762 762851 463758 481667
16459 481667 582236 471388 171749 456657 100192 451628 622616 228220 394416 587258
16449 587258 720489 512916 415145 555498 241587 559545 202359 85975 472383 515323
16439 515323 228691 408188 384551 671972 486331 125047 350271 84117 263930 521083
16429 521083 428468 414160 446233 296661 475133 446394 461728 591937 442133 299645
16419 299645 402732 231142 377266 580298 501492 331188 -59212 511716 266989 224517
16409 224517 219212 83449 404939 122421 328483 10966 374208 -38888 384016 269719
16399 269719 -242237 303912 241731 267687 89077 397683 225775 389929 311154 248974
16389 248974 371038 143058 304249 277506 118062 -83181 -112789 148516 -37980 513269
16378 226569 461 491446 256246 299642 415188 197781 179728 353096 211392 74467 373808
16367 373808 368964 336995 170009 -19967 126233 310672 -151510 475447 69229 212632
16357 212632 169148 89895 91622 122305 -6403 -291331 275149 270573 80306 -28222 153077
16345 237507 427784 -71079 264984 -208962 407084 89935 281318 -236325 -161786 -34609
16334 224891 169572 296066 201526 147528 -152022 21548 -101102 220389 307830 160232
16324 160232 -28210 -155139 -90434 90042 298181 144256 -28545 5760 182046 11688 -68264
16312 229019 59731 455656 25429 131944 174365 -40496 -14386 51904 -76597 22894 232167
16301 232167 -24139 200344 -94046 -379849 48604 113600 218967 -25648 188900 -110695
16290 363491 166033 53963 11054 76260 311334 252282 -133429 287335 238196 194407 265165
16279 265165 -59207 -13271 259229 55467 -58018 258728 111822 30780 150670 31001 54630
16268 54630 326392 5415 34683 -14376 23948 148597 156346 482707 -188274 165628 74900
16256 101603 63685 -107847 125612 127406 -206496 8003 -70096 348787 -78370 -92580 351620
16244 -49433 -191964 244008 4688 130319 -98359 -55434 386669 331735 101860 45283 -93428
16232 -265670 141849 -41671 385406 251586 -63276 100499 -151136 265456 -17013 -106443
16222 -106443 180688 227107 176172 -159435 135437 144491 181663 -37865 35266 -26902 178474
16210 330939 -166814 73550 58799 75450 -10229 149934 -53195 264295 21986 -147914 -48309
16198 7082 -71482 -83746 -69891 85696 -386526 -16441 -35389 -323072 -41302 375444 -75726
16186 31140 147813 -103455 212630 -174598 241233 -205728 122432 -299796 -96067 -214430
16176 -214430 186305 110645 149804 171507 -52030 -114006 46968 2028 201047 34780 -58319
16164 146964 -261033 111030 -182777 240247 -69399 91603 -98641 -150045 139701 125750
16154 125750 242692 179740 155152 -279481 221235 -47029 117154 150999 -115635 -17435
16143 96009 -397606 404927 171336 50418 -11654 184022 88997 -79898 111003 -242888
16132 264213 190456 34416 5649 -25489 -28931 362066 89304 185045 -257336 -136962 -65129
16120 18534 -11048 -222243 -216801 78506 99485 -181727 -13754 104220 235271 -12586 -190352
16109 -190352 -118539 151166 -128971 -407 -71976 130655 82605 286560 234128 188361 92951
16097 94299 47174 -30367 349552 -188154 -54879 -18255 -245202 -99661 -135786 75856 31602
16085 -114230 -429997 -109152 255554 205405 -276770 -135141 23379 -24295 -112880 -69322
16075 -69322 -201688 -187724 -188186 19640 -39373 -170587 -27471 11508 -306680 -167681 414289
16063 45819 109436 -52187 -258438 101062 -117596 134490 -276874 -16131 -6779 -145677 -4761
16051 454319 -78250 -201708 121672 123037 -31476 -279772 24419 175910 22293 388921 46560
16039 -36765 -54597 12163 315910 -153849 -136076 -430876 -160997 -109130 -261819 217288
16028 -47044 -37898 -130979 115673 -431400 -121294 -177239 -79639 -299188 -41237 -154707 17365
16016 -51454 96420 153866 607 -261061 -351986 -166635 30963 -29332 129636 6302 -25294 59127
16003 105424 -31780 -265861 -332824 -43937 -6138 194578 97864 -101366 -179069 240835 -38430
15991 -141557 202369 -50827 11109 -218304 -186770 294203 -9305 213268 284240 489498 488921
15980 488921 540416 320722 215895 280996 -242938 122174 171393 -20713 215374 -22253
15969 -161445 142422 274891 -6148 191482 366704 -10651 226195 -168812 -62468 -222335
15959 -222335 607941 292021 -70610 -94681 -200476 -35680 27489 183105 -36762 15770 66543
15948 66543 -57125 -257621 145356 32660 -153742 61407 106947 15305 -334857 -103834 -199694
15937 -199694 -51675 -202525 -72932 -516970 46082 125915 -148486 -107618 -377180 -137612
15926 -328131 132933 -121908 -154631 -130015 -33831 25985 40613 -48812 5674 -384037 143420
15914 -5085 -11052 -2296 -216705 11329 -335722 -75759 -165282 -270585 -6928 16067 6038 -239446
15901 -226001 4264 -109671 -102045 -129633 109309 63272 -25428 -386274 77070 308274 -30897
15889 -1314 -150547 64492 7638 -119941 94612 208227 79449 9425 340007 30733 112162
15878 112162 99248 -172185 59296 -67808 -344547 186058 184426 14313 204116 -156304 17479
15866 -119348 -107259 -121016 -446210 9377 -167831 -121449 98476 -122330 -38537 -2900 -183418
15855 -183418 -75111 -194748 -7665 62812 -334153 279045 402616 310597 117138 -21631 -79355
15844 -79355 -39469 -350034 -36597 -110222 59968 -79591 -111557 -65978 53486 313719 -165869
15832 -273987 -260715 -117725 -66748 -29884 -128639 -158084 184874 -72502 -85414 -32220 -338240
15821 -338240 -177854 161111 -320631 -103886 -30135 -185233 -217624 -130183 -178967 243293
15810 331101 7594 13778 -111681 203210 4575 -117203 64269 -246468 193683 -327153 15840
15798 90267 -19450 -55344 65428 -90339 -85279 -210148 101927 98997 10129 -123056 -97280
15787 -97280 349977 62092 182981 50151 -176141 79315 75895 30967 229381 -152432 28610
15775 -121825 -89494 143805 121828 -100304 -241799 -80548 -277406 -107234 199870 -233789
15764 12500 271902 -223607 81198 -144272 76928 8005 -81190 -39541 -51548 106182 -146666
15752 391969 147145 159224 -78959 -52102 33825 133719 21714 -322852 23726 31336 -84992
15740 -14164 82823 -59316 -127123 -115230 186098 -191595 -217927 -145959 61739 135807 -246723
15728 131347 -67815 34878 89038 261620 71594 -5759 -139009 -56261 -290334 -19594 -50892
15717 -50892 -21615 -15188 388594 -49165 263261 -111223 -84729 28010 -111108 127966 -27729
15705 -244547 -160273 147841 -38284 107564 -330124 61331 -11450 27984 -48720 -210432 -54331
15693 37651 28713 204097 -81304 228256 7970 387425 108131 -30847 8012 179555 126575
15682 126575 -262891 60195 19930 114925 3864 157646 -112592 191440 126766 43431 -103517
15670 -63634 255687 -22585 -54599 216298 -224652 42708 -284380 -61306 -98962 -163452 -313346
15659 -313346 89332 4635 -20083 241029 48836 95377 90504 46380 -106242 -11311 227846
15647 42086 -66665 -44345 48769 137189 -4799 -142817 150696 53132 -157828 -141567 -291752
15636 -291752 159091 -33657 -144280 -344882 -156592 144806 79269 84098 -171561 -101960
15626 -101960 51839 355587 -284866 -60490 133248 89766 264991 293351 26462 26859 121741
15615 121741 -530303 -28434 -241155 -43923 -410859 -125529 -233963 -10260 -29255 -35069 21297
15603 50184 -144918 11574 68178 -62029 84046 -179777 321440 -134334 -89450 173648 22920
15591 367612 -98538 81648 -153196 196133 168844 50727 -6262 79528 -234801 213848 276910
15580 276910 254578 -173968 -305257 -150867 11259 -288905 -254532 116897 107233 90633 29632
15568 -68323 296247 -57764 184346 177774 -298891 64943 209381 -48560 -10633 47180 -6312
15556 -357084 -258734 -426743 99240 -4725 67820 122991 -32796 100126 -308325 -9989 194263
15544 39906 213773 94525 108923 91545 99118 84260 150754 175351 43687 162006 12572
15532 21636 -83422 292755 35724 12615 181020 121907 -21259 15219 -156601 -271218 168931
15520 -21131 14823 -322450 269763 -11655 -54463 -119598 106631 152734 -35556 -255606 154247
15508 -297438 -299742 -30078 -106021 121427 -129818 -39045 -57095 -111718 -20503 82017 -340977
15496 -78697 4684 103540 -118734 -18036 -304731 -96565 9425 35407 -198408 43141 2601 -175206
15483 65632 -197288 72839 4142 14765 -37604 292113 -200376 60683 237167 95768 139498
15472 139498 464368 123265 203110 75757 84333 347809 18308 -370729 -81315 -125830 271668
15460 -268020 286260 -103365 218016 -138534 -42751 565620 69057 -184564 143887 237192
15450 237192 153840 134672 63840 -21281 -31511 -54401 331598 83549 148018 207008 27853
15438 169887 -21560 -152415 -113265 342917 -103773 -28714 57646 76803 136733 -224873 -351511
15427 -351511 -58809 -403353 -92291 -2358 4443 32517 -93065 98795 76897 -165353 105834
15415 -11070 162317 81051 28895 -51447 -11333 -32405 31230 -144174 171749 -239297 -110538
15403 79491 -133207 -23695 245208 -67043 -168028 196408 30963 101863 201268 74272 -355120
15391 117591 46850 97434 60994 -22913 75973 24119 119991 202134 -265554 -16351 -33824
15380 -33824 -251145 134080 176475 -373300 -46484 -40194 -21754 112579 -30043 73634 18811
15368 67428 -122518 100656 178087 75801 100278 -131089 -358832 -83087 -165563 -83694 159679
15356 -169167 -15723 21606 -104963 269185 15982 -52937 -49093 318511 -188251 32847 -182341
15344 -346026 166991 -153679 3945 -81031 -235767 163366 49767 54319 85768 -61084 -233738
15333 -233738 -143106 -188043 -2751 -36640 -248017 63140 -189998 -26026 -45444 -179132 -50688
15321 -378083 -129486 -95230 328 -5387 -153627 102432 71295 77471 162444 273228 214212
15310 214212 72407 -229355 132097 59190 -228260 141059 -142465 327450 -252557 70960
15299 -90450 -1062 -47737 -3423 291086 222894 16823 -58991 22598 18210 -96842 130712 -15016
15286 311263 21950 82409 218618 -128774 98928 193347 -52981 164889 57372 354760 308938
15275 308938 109809 237249 188309 47802 240491 55930 102747 226128 101199 96441 47303
15263 21603 184650 -33924 -32107 242586 37555 128904 220472 217575 172987 457175 187380
15251 94777 116112 197848 338438 221812 735398 1460279 1291358 1569125 1306742 572053
15240 73893 420125 126398 -134259 210946 150453 18183 223084 -131432 154732 215315
15230 215315 -31451 78869 250601 204229 299608 289952 -33019 272055 -39851 -124198 151844
15218 245546 303608 136500 140717 -47840 36392 75767 -134800 51726 -198646 144279 -175148
15206 133608 96889 73651 380197 219308 -84385 103965 -51300 192463 282001 -17537 159461
15194 97911 4822 160586 -67284 -31733 -237531 73334 54038 -12834 247555 -245256 -90208
15182 -150385 37168 328564 63768 -51093 151521 97185 186677 405116 -29607 415302 251097
15171 251097 2956 -46754 147930 97637 -173902 -11478 -89865 -186892 3603 107276 142785
15160 142785 169439 68430 189541 15905 455826 24786 -129056 555415 435470 234448
15150 234448 238435 148809 -32285 404628 64955 381660 -275263 178754 -226075 -89744 267718
15138 8696 -56964 -36274 -298377 -213674 90711 -169367 245359 108344 -86999 110048 -162291
15126 436414 36306 -170318 125015 191586 27841 143693 216973 233592 -156086 178102
15115 -91629 127013 162191 227283 204906 -5142 -873 382688 209665 195985 43429 260060
15104 260060 177855 -52326 57833 127404 -236248 189538 76031 39791 374301 -111698 414982
15092 315337 10222 263466 142396 271017 120564 -157245 268263 163143 249269 -292685
15081 -66323 44612 128622 -208270 81215 -23503 -125769 250658 -252153 259130 -224364
15070 216154 95161 106796 29677 401596 119210 217737 245626 147840 213654 -196412 67582
15058 563078 270008 247628 228316 -46034 146524 509129 185539 138571 149065 -100343
15047 69966 291409 66643 322579 130032 148589 66472 -204611 157199 102226 -128546
15036 409398 155076 207898 290311 549766 278183 19648 -39956 28983 109925 516126 7414
15024 -2191 145686 413405 487853 58807 236150 498909 6419 387038 139468 339460 297498
15013 297498 -62785 -82448 515452 3346 61913 283353 316877 402237 203418 -33083 -106710
15002 -106710 309070 -1082 117688 269199 94542 655 211968 507388 39384 118536 156768
14991 156768 18511 216070 298998 147389 249365 506860 463285 234020 302233 457918
14981 457918 347775 282986 154595 38927 90035 470216 304629 518773 500878 7622 82214
14970 82214 44082 -78149 -148093 43002 326137 521415 183961 245159 280903 262883 334703
14959 334703 142419 376651 136839 365677 -74100 239514 50372 41876 184335 289339
14949 289339 233211 310119 353086 291814 288119 127151 -131828 39855 83966 -15445 468850
14937 496227 297636 -41736 452830 350199 487057 507087 278983 500664 273597 48242
14926 -14631 276454 -27900 361301 -27960 620543 303069 445691 12514 456346 596402
14916 596402 391703 352269 209122 434490 251009 303207 236848 163307 128064 362419
14906 362419 433038 169309 207948 353198 280208 370332 439705 607297 16710 208394 580788
14895 580788 -115315 201053 -215206 315833 296110 167627 468795 60409 368162 476308
14885 476308 136820 362802 212086 165283 385239 313492 242114 536376 497015 -110715
14874 155239 514477 338592 577904 310958 278133 408447 278701 180758 617364 604773
14864 604773 413925 243011 259569 151421 532690 511535 315689 368175 733828 729727
14854 729727 527555 358942 576056 716719 534601 254736 269621 379455 485967 511375
14844 511375 456957 303316 318634 329720 380339 360160 442940 540522 392180 662602 435865
14833 435865 497256 416922 474496 119066 543330 353959 629010 417890 505633 144716
14822 335960 342449 710616 485676 395315 461337 175194 517901 720061 367540 305383
14812 305383 295107 540121 723355 440170 740559 493146 227145 690185 460697 500214
14802 500214 794077 552277 611828 499122 530285 534490 728727 467677 548722 651995
14792 651995 217067 711208 341945 533321 759346 339489 551666 535176 680375 487321
14782 487321 238290 344097 617240 330065 564261 501533 516351 336044 723821 276902
14771 661644 457920 439610 488479 310018 445606 443085 494264 854063 936622 747880 779819
14760 779819 686455 728647 439751 615816 568778 640213 641329 276290 619575 591471 325299
14749 325299 819432 858546 905600 542916 550910 426802 777056 598701 742161 537415
14739 537415 770329 657659 481358 844955 483231 743688 794144 690068 736304 843780
14729 843780 664219 864621 539096 684879 840636 700319 764920 849614 498871 665379
14719 665379 1061940 610489 869936 1024552 1019397 1005392 953419 909669 822455 745559 864820
14708 864820 830332 927874 845836 758618 948305 827693 705190 735304 738895 919239 978253
14697 978253 934558 1104637 1167291 669382 806927 898276 936399 1168381 908767 980915
14687 980915 1270628 845146 813188 917683 768111 1016205 848669 1201426 914215 760455
14677 760455 598576 1007166 753968 859177 1026813 932123 863852 842309 1065480 987859
14667 987859 1369420 908471 1016650 850848 1072679 956788 849700 1257613 906755 1191206
14657 1191206 1371634 1021150 860079 924176 1044731 1438641 1023493 1248168 1026862 1344051
14647 1344051 1188004 1017867 978022 1241345 1068965 1014357 1284984 1508026 1128530 1292626
14637 1292626 1541163 1349249 1291746 1329059 1097218 1197014 1328610 1247135 1261645 1496082
14627 1496082 1003762 1288374 1377697 1378298 1699811 1356466 1169227 1265494 1265964 1272969 1220887
14616 1220887 1332334 1331679 1364671 1804130 1250986 1420076 1535561 1510374 1521096 1611572 1679369
14605 1679369 1146236 1455147 1484072 1750518 1579554 1516563 1681376 1676761 1748183 1503526
14595 1503526 1590803 1628729 1507271 1649379 1603276 1965019 1709323 1915675 1714545 1780441
14585 1780441 1924625 1886061 1911689 1965198 1727745 1620826 1797638 1866013 2225145 1794698
14575 1794698 1782501 2190808 2414581 1861436 1991007 2168120 1968913 2095187 2194150 1983795
14565 1983795 2388305 2730292 2422684 2259882 2422727 2632228 2753419 2907556 2779017
14556 2779017 3052242 3074050 3230512 3498057 4001872 4492456 4897928 6558045 10973781
14547 10973781 22433097 40196724 43422213 20647805 10040413 6977706 3802997
14540 3802997 2848652 2041483 2034221 1959909 1726735 1825501 1825944 1888416 1986026 1987527 2254268
14529 2254268 2006528 2565334 2464965 2244020 2189063 1984255 2242657 2410180 2398010 2187467
14519 2187467 2494062 2770654 2702060 2227768 2469345 2701355 2435473 2677539 2961689 2692461
14509 2692461 2975279 2838650 2767075 2617019 2809227 2753253 3009766 3182000 3002818 2985650
14499 2985650 3138324 2893512 3080867 3332363 3301133 3635849 3392313 3358059 3262048 2962280
14489 2962280 3326721 3500811 3287146 3643197 3557472 3555884 3659341 3786848 3656439 3787013
14479 3787013 3929340 3649339 3976852 4137624 4070209 3878733 4286204 4053942 4475254 4263443
14469 4263443 4427798 4490270 4051558 4320681 4396714 4465627 4817525 4892596 4601166 4410757
14459 4410757 4926993 4790002 4792126 4900922 5146254 4751941 4801701 5171869 5116753 5247698
14449 5247698 5304769 5008970 5356636 5862173 5343442 5652460 5881570 5991270 5692539 5858140
14439 5858140 6089205 5889170 5690246 6100294 6380452 6157626 6529025 6639047 6619023 6403837
14429 6403837 6506569 6879650 6916098 6894017 7074242 7185916 7607599 7237898 7477441 7518514
14419 7518514 7576187 8162558 7926356 8285057 8398427 8206919 8527890 8302498 8785650 8824250
14409 8824250 9258975 8973230 9252853 9058576 9129628 9560952 9947128 9926037 10242631 9950529
14399 9950529 10435721 10290914 10579624 10783414 11239737 11284897 11290147 11349202 11645555 12224088
14389 12224088 12222388 12374433 12776213 13078106 13252994 13240660 13735768 13723854 14047405 14423966
14379 14423966 14926995 15060696 15382462 15199804 15796474 15778604 16604851 16943987 16845800 17424658
14369 17424658 17790362 17821904 18332986 18777561 19211753 19623192 19929759 20361465 20604238
14360 20604238 21457574 21751227 22134407 22815613 23367545 23917156 24508446 25311892 25485595
14351 25485595 25759608 26616417 27498594 28139806 28922235 29788503 30365352 31237436 31968382
14342 31968382 32961691 33843280 34856913 35370310 36564566 37354371 38724841 39758486 41078550
14333 41078550 42281515 43460162 44810160 46208552 47772790 48759779 50623365 52409823
14325 52409823 53766356 55428361 57464674 59343093 61455620 63797513 66021511 68735509
14317 68735509 71345152 73887644 76518434 79442420 82577846 85931730 89242866 92828114
14309 92828114 96942775 101036898 105112575 109992264 114747801 119972949 125566262 131367405
14301 131367405 137364664 143957472 150826769 158098831 165725725 174453074 182974537 192010478
14293 192010478 201947686 212438927 223246227 234461406 246865241 259563292 272580583
14286 272580583 286424604 300432237 315010226 329857546 344959914 360410831 375002457
14279 375002457 390314340 404608561 418563938 431114216 442567397 452464404 459499886
14272 459499886 462938777 461087447 458480746 457852772 455696413 453586594 448161343 440633282
14264 440633282 430634868 418167926 404827008 390336913 374695516 358988915 343088069
14257 343088069 327317499 311684190 296311124 281606052 268182096 255016664 242036676
14250 242036676 229589117 218135126 207244075 196441947 186693675 177886224 169687462
14243 169687462 161588472 153664804 146310632 139579602 133353235 127677686 121715781 116613781
14235 116613781 111332209 106506193 101974619 98107074 94600321 90721340 86961630 83478780
14227 83478780 80006438 77150284 74299451 71984399 68371658 66646561 64434014 62227104
14219 62227104 60209380 57828641 56080909 54002277 52234567 51028522 49857138 47928744
14211 47928744 46117833 44917312 43304468 42556449 41855998 40508881 39166945 38337985
14203 38337985 36648893 35859289 35022094 34552380 33565258 32438053 31493748 30275280 29828133
14194 29828133 29190733 29007312 27372701 27008529 26530517 25848486 24989833 24627511 24242732
14185 24242732 23443341 22917318 22596220 21919928 21499001 20944072 20795155 20373520 19840046
14176 19840046 19207353 18960277 18472565 18357892 18116197 17805929 17331213 16910125 16608039
14167 16608039 15976215 15753284 15328238 15206154 14927418 15206525 14615243 14041694 13816294
14158 13816294 13794238 13671483 13352031 13034142 12778259 12821043 12388430 12286974 12013060 11725968
14148 11725968 11604816 11442790 11006417 11078824 11012322 10765395 10579512 10714811 10179372 10018858
14138 10018858 9927431 9888469 9434997 9526203 9062425 9468960 9389653 9070001 8860026 8735232
14128 8735232 8819592 8646362 8415266 8619935 8169261 8119921 8004013 8224268 7770252 7436646
14118 7436646 7609623 7412069 7212196 7424400 7081744 7048718 6870479 6833429 7072337 6878801
14108 6878801 6595151 6451095 6596867 6427346 5970006 6103461 6050952 6318964 5958054 5923518
14098 5923518 5798286 5924864 5478753 5793686 5780009 5408916 5392275 5695213 5607134 5490813
14088 5490813 5260941 4894090 5030388 4975000 5038463 4983077 4939540 4880442 5083156 4786154
14078 4786154 4715855 4692612 4457448 4497250 4704579 4188865 4576307 4232044 4266450 4306089
14068 4306089 4487227 4008897 4035977 3810604 3889760 4081230 4104895 3994476 4066286 4154535
14058 4154535 4259743 4158294 3752314 3922307 3791323 3526081 3621283 3731708 3575758 3739696
14048 3739696 3436683 3121311 3553284 3598607 3232450 2923112 3314565 3402411 3362336 2932628
14038 2932628 3321433 3075577 3105415 3224865 2763096 2785968 3331156 2936746 3057400 2964123
14028 2964123 2969275 2971141 2672814 2996846 2731034 2692492 2562209 2560592 2849795 2684341 2438997
14017 2438997 2460287 2548087 2303589 2564860 2305732 2304558 2509203 2356410 2225927 2156387
14007 2156387 2046362 2480154 2297514 1894403 2342200 1666544 2194840 2223832 2275440 2134727
13997 2134727 2315824 1976273 2065903 2100799 2167796 1977099 2357334 2039609 2779170 5111485
13987 5111485 14571532 33386220 46290393 27197402 13978990 8555863 6024502 4428328
13979 4428328 4123565 3559403 3081203 2806324 2855844 2962444 2948358 2767519 2676298 2531403
13969 2531403 2481132 2443426 2630882 2321466 2460745 2159660 2165067 2276967 2151875 2182777
13959 2182777 1796980 1800801 1784897 1723324 1905741 1714480 2186209 1944684 1991717 1942895
13949 1942895 2057754 2238962 1663032 1984516 1792410 1735647 1857597 1448408 1774319 2038639
13939 2038639 1570575 1552255 1744801 1748451 1740011 1548028 1350722 1736613 1830695 1656376
13929 1656376 1733034 1687961 1586081 1753407 1779967 1589405 1872906 1733058 1619720 1425766
13919 1425766 1203250 1761800 1499150 1631674 1154847 1523046 1396634 1615079 1321090
13910 1321090 1222962 1449702 1506388 1187009 1413133 1014346 1355203 1325998 1350730 1353238
13900 1353238 1168238 1561599 1409092 1223102 1255335 1364511 1384536 1351959 1155815 1589799
13890 1589799 1314970 1239251 1178953 1352958 1427054 999714 1528788 1352155 1171945 1373475
13880 1373475 1113447 1255532 1288994 1195043 1241175 915277 950307 1245173 1306132 1255278
13870 1255278 980343 945990 881694 1188263 1225551 1060138 895600 1109646 1175762 1084297
13860 1084297 778543 1101802 1020524 1107748 1068006 1052695 827177 753214 1053023 1367882
13850 1367882 919885 951658 1002041 1024789 928807 1003180 856708 942716 743188 986585
13840 986585 1275938 943343 905298 1040130 930788 779562 844615 643610 1079144 1020536
13830 1020536 903860 738585 1196704 740917 788587 983859 1332640 759331 455722 939127
13820 939127 917338 1049546 1073459 922027 837924 673905 794710 720707 767191 857706 1004648
13809 1004648 889659 728823 772585 826483 909983 745403 818450 678834 830643 567176
13799 567176 394816 828586 525845 882569 624053 679943 623521 744756 840531 592223
13789 592223 852865 845487 640641 994700 781331 793946 641546 801573 747949 718724
13779 718724 617163 560279 456489 618725 919001 869081 315317 673670 770423 680059
13769 680059 740110 688657 430262 705349 657093 640548 1030396 736338 572376 810371
13759 810371 882206 902796 857277 1029547 640687 612468 783375 410378 590813 596755 783741
13748 783741 276066 409706 526850 100875 820351 713197 578656 427773 739380 626332
13738 626332 557350 595437 406319 829143 316058 483366 316843 642607 401793 165959
13727 750742 620090 771186 686695 326449 854981 186376 801738 863217 606175 838252
13717 838252 599651 393407 507129 447788 363519 540076 610068 502704 425031 779106
13707 779106 686419 648800 689459 511709 323172 276186 625818 517914 509035 542331 551705
13696 551705 530606 868991 250818 673773 445726 642812 269667 201900 606389 328908
13686 328908 868070 333090 497008 796728 514630 667259 349958 186935 260608 549517
13676 549517 523383 525112 427495 565802 310924 394169 321586 798688 324177 276252 385393
13665 385393 449544 758031 654421 440105 532642 427737 686695 419252 503024 261233
13655 261233 764522 268451 482948 524755 -38604 89814 554335 254770 350155 472907
13645 472907 283416 286243 451466 589837 784612 292372 110108 521679 390749 432890
13635 432890 485274 236246 554206 576323 276807 320246 289502 381234 221845 656574
13625 656574 312477 293942 55719 388028 439085 283522 248550 419208 260148 305923
13615 305923 360167 470952 477501 531515 519453 411272 387423 554710 408897 490471 329711
13604 329711 264075 405070 152739 353429 173291 102467 311135 197332 514501 336642
13594 336642 177059 461499 -138706 279549 209732 450495 262430 441230 284676 331445
13584 331445 234148 155736 178086 142120 411226 463879 117076 152800 476261 630356 347556
13573 347556 609865 205428 408609 237756 490966 306551 147516 604444 159466 392115
13563 392115 338268 139353 485337 311908 232045 248242 152715 487437 559780 237857
13552 596136 -191231 -144666 412508 524324 235250 486238 206259 314094 221710 624045
13542 624045 70048 305146 325722 313502 159061 590244 394345 363131 181678 269745
13532 269745 436149 -11824 212448 256123 480467 310054 580467 388389 -53609 216953
13521 433599 345673 135213 376174 370400 339597 411598 451915 131159 118939 210309 421951
13510 421951 202511 569302 282203 97516 118195 328526 461849 124411 236240 206075
13500 206075 -12993 -44598 -174887 204415 483980 518068 145525 130113 223706 220519 415725
13489 415725 21997 484874 31862 238256 403464 274908 233272 185495 277863 333021 228644
13478 228644 254174 188245 316074 126359 280969 443289 18690 432715 -56478 293531
13467 90674 188497 358132 223969 116964 437442 80218 -54084 403473 242633 156695
13457 156695 381008 4749 287616 249220 453032 -58818 280999 280937 245246 210358 187636
13446 187636 534030 283568 210788 296221 203270 250858 185557 114426 272296 31083 30512
13435 30512 193479 595005 399535 428845 60070 349553 146085 -39686 147030 395562
13425 395562 52283 171192 222556 41166 66787 -19113 333592 101820 394645 501249
13415 501249 199510 206504 96510 401675 185228 387192 147884 47806 221350 556575
13405 556575 42626 236906 323757 156825 30638 213944 252904 262254 236693 181634 125927
13394 125927 204710 225525 718168 172246 -105373 -103735 223670 474382 279404 372067
13384 372067 244821 510240 -85228 -37309 258874 231618 177220 124700 246382 -13925 55922
13372 -26127 219966 96859 354607 269978 127556 194211 40427 341121 227016 -111297
13361 18314 153045 225552 381917 349661 232377 303207 171221 154331 -31154 304191 189783
13350 189783 48650 71292 264563 360301 217668 87526 140695 -85865 493560 91712 368264
13339 368264 233934 93229 370079 389099 -51762 502814 170446 98136 339339 149797
13328 2731 878 88231 49261 128997 103961 366353 -8023 -178611 77011 477956 75140 223261
13316 223261 -3891 414831 501552 168680 69829 143207 -141554 27866 133816 -15130 26970
13304 15102 -77196 -205479 353482 138055 -26436 99992 -152605 385320 57687 254762
13294 254762 27192 165465 -44032 318360 217568 132814 364665 159841 355761 187306
13284 187306 29140 52381 -65596 -74447 500717 90065 209695 2791 14059 59701 -82 -112388
13272 -112388 168840 277717 172862 58675 3979 201419 181726 96336 287861 69160 294988
13261 294988 326714 271287 16323 206519 122130 -96487 -57353 139043 -36513 290039 248819
13250 248819 276804 -58101 161269 165908 206547 -31232 359650 135802 -58869 331111 131586
13238 -46989 120446 225553 95651 -12365 147495 27677 273946 85312 143457 103427 98322
13227 98322 -102149 93977 -31037 381948 86522 -208592 17139 272179 142703 -8462 262831
13215 -53031 115930 168302 62428 504357 213019 210637 76738 128581 137830 242081 -223886
13203 -24897 99308 -5191 -38481 205378 300344 142174 9707 -171118 93753 178737 175344 -40696
13190 259233 94383 116046 -200118 57888 90985 92073 17576 -204673 -1225 410578 -8340
13178 -52205 236052 -125665 8766 -36505 112809 203643 231220 93411 120675 76061 205456
13167 205456 150200 -51110 66097 178589 290513 -13615 -349550 -72864 -98749 -40972 445738
13155 153902 69849 199663 -46423 -105105 97977 -170236 214712 272136 300003 2688 99409
13144 99409 84946 256830 5976 -54482 151446 188853 -101674 -189800 124239 -156053 -108527
13133 -108527 226129 206084 53658 -8027 -1094 -236978 -50622 -246908 -191008 181264 -84415
13121 92520 469240 -49181 19976 5523 -33658 275608 -67102 -171484 298990 -201140 42890
13109 -200030 227041 214300 129048 195565 159459 -142248 -81471 -17633 130902 199262 146758
13098 146758 111543 284685 -103726 -234047 205681 272043 -94667 86473 266759 180207
13088 180207 437251 -153701 157582 -170480 418131 -42643 27155 36189 188269 100677
13078 100677 -85973 346931 251552 345963 -116417 8526 67453 146088 262509 28702 -123526
13066 115251 227318 -42408 62117 369141 86245 78183 397160 57805 51266 -139691 283419
13054 150598 123757 309943 -125492 139275 57547 81959 81911 195242 -52272 -21798 117985
13042 -24467 409355 341434 264300 -234860 47223 -110995 308369 -180731 138440 2836 -15645
13030 17863 -48098 430229 195265 328881 62178 -142991 113350 82730 -184445 273900
13019 -184444 103539 -73153 194699 18040 126253 -179482 84693 -102512 82281 128108
13009 128108 287426 1121 63841 198118 -135544 355492 125568 168110 295564 289972 27716
12997 269236 -92549 -97693 170717 70900 152025 302383 50006 -110425 133285 103448 -171295
12985 -245003 253055 108697 181374 -117554 -40310 151022 -27459 173904 -42652 111300
12974 -92347 -104509 37960 135619 -267305 -55483 -364389 179970 -165628 -60539 45453 97752
12963 97752 -223909 228886 -260059 229262 -184318 174021 239103 -13237 -63629 209921
12952 -158164 50005 308884 57602 237610 -47173 40446 -226787 -146502 -40335 7621 -337850
12940 313060 -182886 416425 -236774 79133 -18454 242659 34398 -66266 108712 -96448
12929 121613 9990 86278 -25746 396879 117158 109175 -53619 139122 142130 15264 146025
12918 146025 94092 -308577 -98049 233154 -25704 189453 -50932 75155 77104 -33246 30405
12906 246942 -255692 201072 48900 -47719 -5094 61009 -78458 -157204 170609 192688 -231235
12894 -258844 -166587 284378 7423 -22265 -54663 -212685 -172770 208445 286764 -49485 -203738
12883 -203738 -15065 -80667 78972 7823 -130321 115501 3146 -121756 -243386 -307790 106750
12871 -104056 -87779 351468 -17595 129491 158207 280739 25603 112358 95634 -143577 95978
12859 -11645 129889 130485 73243 -88151 146401 139837 -137209 237382 5631 23807 197713
12848 197713 52908 -46832 170396 -143559 87808 90278 -224375 199454 94543 -296871 -113035
12836 382041 -121124 -148890 -265152 -43804 -117458 165484 -139706 62053 438966 -31898
12825 224251 -50267 9622 185240 58013 176048 387086 202237 173192 105312 148202 -98937
12813 17475 222945 238025 -30960 -4343 446033 259080 -78262 -284477 -174899 -116252 254030
12801 108507 374463 38778 95012 341785 -125561 223687 -10900 50932 -88943 -311474
12791 -311474 95867 -39131 -114253 23463 311830 -59300 -82825 178911 -118894 280125 197375
12780 197375 -7366 -155015 -155641 112727 243291 -52983 263900 -72304 50188 27053 -704 -42375
12768 -42375 -120166 -117576 -55064 -292024 -56617 222150 -28850 274695 97438 34695 59057
12757 59057 150992 -214081 -155150 -101220 303791 178423 -108450 -202960 -245601 -152958 140094
12745 -108197 285470 22879 -365508 -18693 357952 -16315 150924 113155 280151 221014
12735 221014 70197 314886 78187 119428 -40635 151716 -93261 427378 636132 21085 -74299
12723 232232 -131572 -59868 319848 82822 -144619 -133092 -10137 -388407 97126 127404 288627
12712 288627 301410 -14932 213216 49309 -55806 39604 180064 218522 282763 289522 -173362
12700 -33974 60839 211636 -259606 122950 -81694 151725 -161672 -131989 367014 55781
12689 22644 -254623 324176 63844 172939 157877 268246 341383 269908 -17180 204023 -42869
12677 75668 34890 45714 183498 283924 209420 183361 -33115 56018 -126188 -138567 213875
12665 161096 87530 -489451 347604 52923 113539 93273 223469 251363 -98352 217865 151071
12654 151071 -252331 310671 -256499 61983 294941 206730 128331 95548 162441 224329 90532
12642 285762 -41886 -116692 96241 67069 146270 65721 217021 151714 -220409 317105 200980
12631 200980 34581 523686 91249 276152 371970 -148477 60183 -40602 -152156 68310 63882
12620 63882 80608 -31854 -83180 -226152 39933 302745 -141421 -165981 512048 442467 -65744
12608 172210 321160 176681 104409 161566 72277 -134850 -95799 101993 -40725 -310837
12598 -310837 231404 417919 -227246 8224 51742 275237 -112462 -28014 -220501 -268960
12588 -268960 8262 -101393 -167145 19674 141157 35971 -95404 332387 -200969 -81992 74113
12576 195924 -192139 285565 299233 314384 294385 -27675 116368 -352790 143999 59506
12565 282318 363333 -15068 157469 127772 241624 99061 95813 76382 117880 -22555 -96030
12554 -96030 -270283 -139670 90486 -333508 -228171 50848 -269240 -123469 -30383 -201527
12544 -201527 -78486 -159829 346140 -205041 113395 120554 -5740 14699 -18914 -121395 152763
12532 248761 119186 -139576 182526 -42781 136729 -523695 124656 230461 -197395 171594
12521 58152 -207072 -114562 -331270 185388 -142305 -202340 136646 72753 -85028 -387519
12511 -387519 -46059 76212 92340 -188224 210573 -288148 190260 -54654 393537 220931
12501 220931 -23005 -247768 117346 200204 -282863 -207307 13135 -105179 -27643 98761 -314892
12489 -149978 -193763 -216764 -51110 -208789 378498 87994 -81265 -346016 16620 -65788 -388368
12478 -388368 -220682 82724 -96165 93264 -172989 -56107 -82642 -28716 216540 37840 -259041
12466 -315863 -147268 75606 -2393 296959 181180 86181 188540 -32555 -286646 458610
12455 -82841 -85517 171971 -30337 -36880 37228 221803 9660 -20968 239994 49913 61119 -89677
12442 416482 6286 23679 -325189 341343 87009 -117818 27394 51427 -224136 -219515 -114847
12431 -114847 80889 -4405 79846 91401 -53326 236216 10536 146247 -223834 53234 -97121
12419 163267 84003 -275091 -24716 -267896 126823 20051 -131143 -76062 -65531 51585 -128729
12407 -201581 -167348 -148785 23314 468240 21697 -151390 190424 216262 -16761 -34041 184962
12395 132833 -238185 -393769 116061 38486 7156 -192118 149475 -139700 117770 -51677
12384 237508 50597 171645 221004 2309 123020 -75680 93751 267288 -65568 12547 209837
12373 209837 299199 -26666 253166 -232060 -183090 97106 42029 81278 -61114 118145 164610
12362 164610 351421 63521 5613 50106 -240970 -330558 162167 -92423 -96433 248827 -396954
12350 -55971 74052 27418 -40985 133937 110604 214043 -36636 45015 -197534 158261 -40393
12338 -171544 191346 -19574 35341 -118011 -41479 -33045 242182 61597 -38598 -20791 -251849
12327 -251849 211631 48492 -340299 216924 -178299 182134 -251098 114661 -102937 349853
12316 -125997 215500 82908 -242055 -144497 36466 144002 224371 -30494 52043 37679 -103929
12304 22762 124104 150262 -198923 101774 -151718 -40183 105222 247934 72725 -267488
12293 -49845 42005 110020 252688 248509 120127 -25933 -30449 26754 165393 -185643 68991
12281 -50720 105917 -52389 -68439 106385 227919 195179 37057 97261 276359 -65285 76567
12269 150534 -82348 -158233 110833 256173 195513 -43424 182131 55421 70068 156902 24980
12257 584068 -116283 246998 -37648 221062 249675 90494 217348 12480 154188 -89304
12246 168707 153722 -270709 342802 -61712 -72566 -131252 -24819 -32843 135791 -88086 -23918
12234 133737 -279095 45663 -1178 284862 300540 128471 68213 -193102 -19216 203620 129914
12223 129914 171410 168104 276251 80678 238811 -5635 180277 402504 -39893 -39853 -34074 318151
12210 -145035 27161 -117047 117383 130413 44955 -140025 276513 301739 287747 57389 117262
12199 117262 -110857 254940 156634 -27353 73731 302804 221701 87955 -205406 202522
12188 56117 -92621 92587 -50826 -90043 70510 -1344 -63528 167327 6632 323709 20059 296885
12176 296885 -352301 -174257 -179864 -62022 147862 172253 227394 409945 -44386 257701 323213
12165 323213 256646 310676 -109348 208900 196089 215280 -61411 -128829 31668 -4707 183879
12153 197803 172444 -349 -262682 -118495 18284 128730 254961 201655 347704 -110511 -59497
12142 -59497 -106836 -171071 100769 69660 -198554 -360472 -212646 -227130 -49070 333238 -92991
12130 25059 32309 -228721 152184 205890 -173554 176978 331828 23190 -11489 -422087 -234130
12119 -234130 -204225 89659 40243 499239 -96175 210350 286704 293570 43922 30899 -101312
12107 -85460 120574 -238144 -49393 -114862 30020 9739 63139 163635 -182982 43651 -185056
12095 276771 324634 49245 97948 -76072 -146808 -217612 -239623 -35063 104372 263249 -213338
12083 101637 144951 4136 99181 523407 1123944 2002297 1486081 652074 576163 186369
12072 206832 79310 -116934 217044 90669 -85703 23683 -223969 56940 48301 66266 -198569
12060 77192 -239599 19995 144983 -153264 209215 -54776 -213467 -139172 223951 -32563
12049 122308 -170829 -203171 -225474 17724 152419 -58742 -7726 -159581 -160192 270935 174142
12038 174142 72560 -120032 33423 -30466 -72358 -153507 74736 -126017 -321554 189677 245573
12027 245573 38604 116810 -89881 137457 -187552 316379 81445 173426 -186529 146162
12016 -120684 -67259 -360880 23325 270550 280018 -57588 -339149 -228700 -364814 315179
12005 357071 297399 -37974 196208 148046 -1049 -293124 -22043 -252629 -55091 -349185 -67053
11993 -127286 25464 -104289 291159 -174455 -84548 63844 31257 121503 -204522 -55624 -144700
11982 -144700 143575 53054 98307 85595 -152010 159144 -70378 -341257 82660 -50202 -355167
11971 -355167 91705 -130291 -94687 77478 148497 126845 38288 223997 -186582 -59604 -242649
11960 -242649 -166943 170225 227506 -239742 110319 -187843 -120021 -164865 23861 4485 -161739
11948 102098 -25245 127308 -252503 -128924 -215871 -172280 -11881 319538 -148502 -163510
11938 -163510 -119467 3165 30408 158391 42044 34088 -168174 -8736 384844 -192271 -112313
11927 -112313 -29356 -37449 82160 -179206 302180 -251596 -344705 -84146 -250351 -79690 -75304
11916 -75304 -181539 81795 159234 309750 155 -38928 -130318 -111647 -73496 -289563 70598
11904 -28440 -325854 -139016 362783 -111598 323326 -17394 -59734 225484 -264065 -186293
11894 -186293 23216 2259 -154818 -142283 -71412 221334 -15980 -86947 95384 219429 -180547
11882 108740 231692 214977 281046 125 413026 8155 92741 -56513 91789 -180618 -79968
11870 201453 -105533 -139212 82185 229011 -40366 22585 -260468 -74603 137516 -141409
11859 315584 -198580 -234278 16873 204944 -94856 -138392 -29015 -204604 218420 215902 278805
11848 278805 -58225 -108085 -318289 27139 49194 -28730 95399 -222845 -205379 67493 -195017
11836 -67610 148925 6138 -158091 -214109 -34658 -74364 -88622 147401 -40844 -81067 -97623
11825 -97623 27267 -69594 420900 -128461 -170930 -140169 122831 -82093 -198512 -36845 185764
11813 -228806 -271117 -5508 285880 -39715 -175640 -216514 35193 1155 -189675 -15523 -102750
11802 -102750 158523 -228307 -12412 84742 57918 73163 -86304 201990 -108162 34863 332533
11791 332533 -37266 176702 -143814 -24683 100949 -81898 225097 108455 171544 -158596
11780 -49527 -117496 -2262 57584 -132253 49763 219692 123675 148484 -295711 58857 117734
11769 117734 49597 -225643 33460 329483 -536553 -26141 164624 -202992 255595 -94761
11758 -81928 110315 -227230 130436 -49164 60003 145097 -201810 50796 23696 -250037 -74140
11746 -194400 216937 -147740 -63084 -200953 82082 249028 -29873 -26981 66974 -61779 -81950
11735 -81950 25730 -21369 144355 -405826 54278 -225441 111291 155365 -27123 89487 79805
11724 79805 -85254 339536 157824 183082 -89715 -137375 39147 -26276 36677 267483 100308
11712 -103956 49399 259814 195361 159331 7699 156541 -174137 21490 19316 -216192 65225
11700 -216862 25705 204011 -131023 117997 42728 -31941 -65201 314683 17061 54373 157788
11689 157788 -141226 17454 202238 116127 -13965 26412 -180566 104045 121489 -318182
11678 -169880 304219 156961 250121 -58424 101929 -231837 136050 -51759 379342 82681
11667 121009 -38429 118040 294866 148391 -249009 -38588 -10257 -78072 183417 77977
11656 -149890 10341 41536 183068 -336999 322123 105077 -56547 307625 107010 -115066
11645 -139598 196742 -54918 42117 -143937 -92814 76601 -102941 135006 -87734 60658 -219654
11633 -82456 140990 107295 -253492 -21660 -82546 -67065 -330497 -1131 -9314 -88162 -78055
11622 -78055 -220094 -131517 -165337 54465 12355 -324688 -81961 95367 29705 217652 73177
11610 82366 -38493 133414 -17552 -150301 123731 50089 34694 -39732 8569 -139586 644
11598 106016 -188372 172154 48304 -144056 34683 377889 134951 242789 160861 -142476
11587 149420 116322 147152 120291 346393 -18647 113752 -85301 -121156 349185 -161073 126832
11575 80005 46862 238235 51289 95912 58135 -29704 143420 381280 136504 102211 -125529
11563 166965 17495 51213 25035 87243 17398 -137194 331988 125843 -156817 265358
11552 94205 -238497 -51179 -101069 281960 -151868 373220 -10135 -67229 29574 203318 -42249
11540 240409 27313 229975 207507 28411 176847 -88536 43754 26896 281767 -49643 -101753
11529 -101753 -241761 -136381 -116513 -8576 -98792 299934 -192057 90057 -13439 241781 159707
11518 159707 -182121 196042 71830 434886 23355 120550 -51292 -3894 315977 313315 -64401
11506 74402 467943 103068 9180 253333 -78864 259659 -89452 93656 -21257 -75669 -10887
11494 123761 58921 5686 -72286 232870 129520 -133038 210808 202639 96049 -17150 -109277
11483 -109277 23902 91942 70808 -26582 228791 154669 287663 410962 161121 153441 302775
11472 302775 107241 202439 267469 446059 195698 43494 201539 181364 -85410 92819 -101380
11460 319064 -131781 -131123 237984 131878 347850 97580 -120479 272404 238765 268561 74324
11448 138701 46090 -263240 318712 -18622 -266095 -57932 -194831 83276 398027 -117120
11437 -51444 403597 177022 -214243 97569 -182972 136662 -6534 145611 176798 -176919
11426 148345 50531 56179 -33594 -71533 148534 -191087 -154041 -192176 278275 -91 91691 -78371
11413 -11646 211091 -43173 -80362 346969 -210085 92452 100192 -32284 213031 242166 349590
11402 349590 -120012 -46018 31925 306624 4908 33530 -241140 196695 14645 -191866 179223
11390 118859 -217645 64147 252986 47123 -27663 281361 -114367 16903 28594 14890 95343
11379 95343 61166 -119085 -240422 25700 -191441 48146 -130584 29550 -316280 57710 193123
11368 193123 -49076 -314137 -176098 -185508 11857 -89953 -216416 -373321 6908 207341 153150
11357 153150 -168835 -229956 -157846 26993 153581 -84171 -136318 39650 -168616 23842 -128376
11345 -257005 -81783 -29604 147872 -75637 136469 257447 63598 -228318 -67056 -16151 58539
11333 -22718 -173179 -132307 457718 176002 44917 -42303 19022 -178219 -64791 80968 304912
11322 304912 20707 -79210 -82620 267905 114763 -35390 -217672 387721 206116 -102594
11311 -388650 -106354 122231 36409 98798 -36407 8362 236623 -200171 -380562 -235187
11301 -235187 -221069 -13483 -288891 -204044 253734 422497 125651 39778 -33800 272083
11290 169012 -91770 117309 -157705 -77211 -197443 -1727 -157222 -100670 -148712 6176 -36067
11278 11641 22725 115816 59038 -176823 251898 78188 53707 -83608 -256169 -85393 49047
11266 -8449 -92111 -204985 187539 42213 -227990 -73378 -206116 805 -262999 -179535 -243324
11255 -243324 -60652 -17436 -33823 -142923 -305856 43924 -250569 -45228 41287 -203686 -182644
11244 -182644 69715 -77060 -41789 376200 7237 -333747 -43898 -181747 -99234 -26028 194943
11232 143901 67717 -323959 165644 106761 -102152 -374179 32360 -161153 39589 13755
11221 -94198 -117546 100761 -23376 -23575 391551 -82438 71584 -113466 -246802 226885 -133520
11209 56306 -19573 -135138 -203934 111371 -236295 -97 -177934 -305768 -28040 226469 75047
11197 63880 250019 79679 -91396 -213912 15069 -19184 129191 187986 -54358 355504 -306583
11185 208914 162828 -227349 128177 -154792 -169103 125733 174711 222012 297844 179548
11175 179548 17950 257311 -172269 -267922 -147899 110425 -16365 176827 -138271 -28351
11164 -257018 175720 431264 220880 -139089 -233966 239961 10029 -205552 -305082 -18937
11153 -13445 -60415 5791 9494 -39106 -6004 -158966 -45486 40137 236961 -4704 306145 220213
11141 220213 246521 186694 90432 32691 141867 90561 527437 245200 19568 63469 87799
11130 87799 70201 105038 -42056 39898 190628 344623 85031 38684 81201 -275207 -113822
11118 -8794 69357 171884 -93618 343705 75745 200545 -281456 -26166 -134641 203623 244540
11107 244540 32600 12732 221842 150054 25577 200912 -113214 68797 234754 129039
11097 129039 205397 176741 315107 125131 -81755 201165 81448 -44435 177184 -21382 389900
11085 185082 135681 444203 382637 208689 421199 -226876 255720 510569 310216 225914
11075 225914 63348 451187 14985 215111 335824 297630 357445 120959 -110262 309026
11064 383862 354249 268862 415693 395440 591549 490718 369369 978860 504818 621971
11054 621971 689777 473733 500847 408954 716217 401287 802381 627060 299455 519378
11044 519378 399799 603649 365465 616298 601419 630376 766854 585794 634563 625454
11034 625454 448423 708392 663160 414065 751175 601483 522431 738766 464960 779388
11024 779388 867794 685009 724301 618694 564865 489306 656413 585844 503616 825558 386547
11012 514672 573507 775926 727703 323516 632700 555281 533596 604027 81259 745639 444888
11001 444888 802450 733069 659539 813131 626535 739884 647480 549812 479225 667734
10991 667734 823792 772719 634458 1057237 574543 688829 525344 802360 635174 860091
10981 860091 1326714 1002299 1014219 1050078 1465662 1796497 1489352 1857031 2373994 2388563
10971 2388563 2569205 2380655 2462775 1933304 2440672 2066990 1726365 1483651 1487133 1670309
10961 1670309 1186524 1511614 1757656 1648775 1211051 1404664 1926872 1561735 1770793
10952 1770793 1288486 1193519 1185931 1285994 1006309 663286 658145 484591 243854 351623
10942 351623 150705 87670 366928 326168 -248073 -271217 52479 63623 -68594 129865 231771
10931 231771 201958 297279 84460 156318 123034 276761 91712 107473 173375 194502 45959
10919 -41255 50498 99284 -47121 85112 42519 -56876 4010 -283693 -160629 346469 123101
10907 -108634 466952 -318492 -164521 23496 -15783 -244979 400530 -95821 -198132 -274948
10897 -274948 -255316 -164583 -84047 32374 -95391 -126658 -157531 -226292 -34236 -208983 84206
10885 -262592 -95049 -56162 -196841 133584 -93536 110375 344921 -82497 -107725 198677
10874 -54831 144701 -10291 17273 -116264 47552 149182 310612 -50446 -139951 -40182 316202
10862 -329 66513 69318 22265 -175028 128527 -217876 181018 126288 116763 -183696 -2370 -35373
10850 -35373 -122992 162742 122341 161225 136176 71401 -281491 -192631 193447 170951 32425
10838 -153092 32851 30207 -395088 -133969 34794 -271366 -282574 -62698 -155603 -408483 43013
10826 52719 -287862 -52949 -5976 -172300 61158 -131025 -298558 194870 -53951 89286 -197628
10814 214077 356942 -46513 -11091 122320 -114694 -160141 -265261 -249148 -159820 -114856 -8227
10802 219282 128997 -126258 -160663 11403 247815 -157589 179821 68962 144364 -66126 -394734
10791 -394734 -337699 -84185 9615 -95502 -90066 22032 -44100 59745 102056 101911 -205088 233268
10778 -58512 268561 -190868 -284452 32013 183143 2036 -46608 169585 209921 -92675 -292741
10767 -292741 260586 303631 199135 48791 -41880 -4921 143796 62102 212386 201261 -77484
10755 -25745 -227328 -26623 144112 -56076 56637 195326 48911 -317260 176894 -102936
10744 -102150 -343392 -216873 -111956 91272 111315 -203777 -447116 -5634 -53665 65580 17817
10732 -151488 -45964 60019 -85093 -30295 -203393 85107 -311084 62202 -40678 93103 -7674
10720 -143627 13332 -54174 152118 -198196 -208048 233175 -175838 -209803 52804 -424695 122803
10708 -103734 -183858 90744 -216134 75306 62435 -29678 -62423 26377 -245498 259550 6230
10696 263917 7718 -184956 -66851 -93046 -203972 -235861 -18943 -35714 142903 99892 -91933
10684 -177142 -93250 -22667 922 150586 -134253 29048 -151616 -95775 1715 42226 -3378 -256172
10672 -256172 72865 3169 -263439 227656 13539 42582 64932 25016 86796 160306 230997
10661 230997 -107028 106045 319196 -17259 -93691 -91530 -16072 167452 -145442 117842
10650 143860 -144083 -32398 -556026 -109026 -52332 69830 5425 89765 -10075 350150 -152678
10638 345393 110238 80564 -109024 -388782 -193941 -139741 -121624 -79979 326556 308558
10628 308558 -239783 -4480 81980 -269576 -139490 -186591 185495 68327 62418 165845 -57979
10616 -137843 -204796 -75928 104399 151390 -429710 -12066 -206013 -172009 22678 140289 -294099
10604 -396853 -149887 183321 -216300 -355917 -105217 -19002 127282 -79863 -285322 16563
10593 -105222 -352441 83202 104287 -172073 -420076 -111837 -55311 407563 39709 -307493
10582 -282681 347994 -325349 206329 155655 151954 151644 145633 -250 154775 -53600 -225382 -57319
10569 115939 15257 -112287 51876 85174 -47829 -26579 57500 -83143 -220965 -160240 279477
10557 156848 -301201 -34127 -108393 7488 -60590 -290919 -36172 437484 -235256 350108 306986
10546 306986 -91740 -29518 -367348 286981 51392 -130999 -49690 -148764 -211936 -18204 192841
10534 -116285 -24893 -36140 43661 86437 -251803 64831 -229433 -351668 -105790 -220564
10524 -220564 -84626 -137295 -261474 -100364 118692 -32047 155927 53163 -193989 -76008
10513 -118348 156947 70445 -262966 -294054 -29285 -51708 161525 -72703 45114 -193389 -102020
10502 -102020 -120536 -25215 -27224 -364044 -119545 42868 92463 275697 -376148 131326 -121217
10490 -140084 23519 947 259276 -135100 -11744 65611 137053 47756 212802 138270 425004
10479 425004 436948 254135 338888 283908 264529 214404 47842 288952 -181628 -184947 1369
10467 164755 -164712 472472 -64923 87304 33961 152778 326335 209706 -173069 -46244
10456 -86650 66617 163620 177548 188306 301326 327808 -190376 -154481 -152958 130819 -114031
10444 112704 -171441 -68028 -33133 -58096 215351 202835 -35085 -238911 231429 -225281
10433 -243167 -151139 -109198 202844 -164420 -233901 -202581 210230 -130305 -36564 70603 -48894
10421 234934 -251710 -60042 59995 -83510 -44057 -211021 -149193 -120481 -134827 200258 -151451
10409 197442 -23248 -10979 35300 23080 61484 -32245 -214111 7373 187415 -21159 -307050
10398 -307050 -175647 -59291 -2256 -22193 -31546 80042 67142 214111 -43068 -340946 55148
10386 265238 224116 166001 406751 184375 78716 -149950 53560 -7152 527405 47466 297480
10375 297480 -158370 303781 293043 -279170 141367 267767 198234 395455 567550 545799
10365 545799 525596 536033 -18048 402626 406976 175256 559265 377291 373693 34298 260810
10354 260810 139382 314438 173009 517452 308000 317518 320531 315893 312473 481542 198801
10342 389881 174966 115692 215769 131989 551638 375570 -128843 191377 95255 99402
10332 99402 -233584 257117 116545 -329663 237221 -93361 -34619 168235 128536 -289760
10321 111770 17136 306467 132734 -215573 136330 -186263 -60453 269442 -20254 250968
10310 -117135 33693 48880 95929 251054 64472 163611 -148824 -3939 125450 54052 206268
10299 206268 -170956 -11903 45727 158711 16136 -191380 -148634 89705 222532 73270 226830
10288 226830 -351925 -1068 -153682 -138214 348630 -145265 -110853 -334972 41367 -235179
10277 -125542 213938 366215 50040 91928 153791 -102629 -67278 -192765 -40208 -60471 -68071
10266 -68071 -121392 -95737 109935 -234857 -161952 29236 117232 523034 19111 548425 -5536
10254 225834 389711 256944 226929 92205 237962 -309072 -50145 4882 178920 -279372
10243 -203526 327865 99137 -106435 -136637 99829 -103441 290042 -241470 -167001 302167
10232 110415 132575 -135210 207266 84180 95881 -307255 -178999 -81727 160120 -267450
10221 112403 -54315 -68900 -131774 51376 -19341 189727 4229 -404478 -82060 -224072 -22069
10209 42181 -306138 14444 -129042 72127 -42810 23715 -68997 25792 52864 -197326 232509
10197 -130609 64312 57844 144869 -107896 -39715 -172516 -436224 -141961 -388079 57248 183426
10186 183426 195158 -258984 23104 379597 -358351 100956 115764 -226567 -326405 12664
10175 311268 -149756 -130781 -111277 -80921 136115 -133070 160871 -165332 278872 -32572
10164 42309 53726 -17468 110960 102078 208350 -274933 83676 99608 -44179 -188021 1455
10152 23900 119601 -489681 -55761 -299776 -281254 -87506 -210222 264551 8891 43345 -180449
10140 101602 -81168 158187 330418 -10893 85152 -131486 272609 -167520 -325995 -218659
10130 -218659 239099 53019 67709 -59908 -119106 -160420 26251 -126534 -176367 60644 -9507
10118 -20078 -125688 74234 -136146 134994 166967 -269248 13408 -343088 -84632 91134 156072
10107 156072 29376 -116457 290385 -155831 -276545 -311968 218465 -107800 -35848 -96279
10097 -96279 -174098 139022 -55098 69299 92600 -188169 -79506 114453 37195 -149897 20653
10085 -30085 -142727 86339 28289 92473 -111794 -350609 317073 -122952 -258900 -68220
10074 -128289 -245838 -480321 -15788 10106 -172213 -113831 -423111 -99565 -156243 -240818 345735
10062 138595 -192686 5602 -301939 72471 -914 -5100 -248834 -1875 16137 -73261 -226036 -115647
10050 -115647 77325 -211875 -35121 53885 316371 29704 117961 -240898 -267843 175948 44837
10038 -72188 -83334 239826 -104064 -250302 40439 86006 -355384 -180477 -246603 166816
10027 -10103 -256396 -173612 -250632 21705 41807 -234780 -75371 -138791 -193422 119575 -141517
10015 63873 -19887 -497447 -82071 -63064 -77200 -320968 -207965 159199 76519 -37196 83265
10003 -10433 -133105 11031 22877 -15524 111929 281836 -88560 -222607 -201855 167540 -116180
9991 54530 -268882 -214446 -334642 -59496 106631 -75937 53234 221803 -59315 35576 -139071
9979 -1520 -60120 244720 400812 -172682 -125899 -43594 -258122 97542 296654 -28588 -302846
9968 -302846 34176 35635 142339 -33547 -48329 -256175 -132273 77253 -187248 -184956 -408619
9957 -408619 -48247 -94773 -75893 -335957 -214994 -167768 -31161 54152 -109131 -109384 -147746
9946 -147746 -118284 -55895 -187948 -37232 -115104 -35307 -179310 -84486 239772 -237369 -388791
9935 -388791 -402127 8135 -25966 -114122 -241188 5389 -313431 -55201 -42624 -114180 181355
9923 35318 -59019 -223737 27878 52351 -70526 -97084 -223586 -297122 -347 -246038 128420
9911 -330449 -111964 170583 27798 8617 -47417 134368 -239391 -63827 -217660 123911 -115208
9899 218142 141315 70470 -6056 -324687 6044 -1055 -6607 -158524 26837 -211318 -155556 -299193
9887 -299193 24430 -33352 56688 -96208 -61602 44711 -80383 -279445 -136572 -184427 100614
9875 -109623 -607809 -77175 -12325 -9830 -94485 -128580 142549 -74401 229259 -127191 23109
9863 -109446 -73946 -54562 -179800 87176 -36173 -327002 48340 231864 439196 142469 96209
9852 96209 143675 -214033 -378286 -72802 220868 -69090 -118978 -316480 134365 -11224 -217670
9841 -217670 146199 -33920 -36711 -26552 -108424 -124805 -200436 130792 -500436 38898 118416
9830 118416 -26657 -23941 -142677 13013 -89780 -265030 -214648 -140395 -216349 -221931 -32360 127917
9817 56663 -61858 19785 84720 46447 57415 -253045 121413 -83120 -377851 64052 -236948
9805 222363 -77165 -128245 125395 17802 -271128 -17775 122647 -238867 -118670 126970
9794 90195 270330 -78943 169496 462891 146593 45807 77821 57107 -156860 -100909 157572
9782 -51684 -120852 -248438 -50877 139280 -47798 -124727 80427 -271987 -61489 143601 -18158
9770 -129710 -123163 -108307 -79097 -279032 94778 -156767 62479 26346 159317 -118878 316272
9758 -296676 57195 -324108 -13569 6807 -159794 53297 -377268 -389378 -38642 208421 -318303
9746 -79756 -99245 38146 -441041 26599 -234411 -276815 -23913 139356 -292056 38584 -509927
9734 -169505 303519 -171076 291594 -301411 -38494 -10707 -388779 -148871 -57243 -16433
9723 6102 -270310 106418 -131815 -348983 102831 -51920 36236 8548 -98867 151223 164764
9712 164764 -194726 -106304 -99461 159007 79166 -132192 129267 120870 142125 -208162 -77047
9700 -392106 -2731 34603 142532 13206 -364648 -154156 -57148 44180 -82248 -378925 -128904
9688 201222 -467656 -163104 -270892 -200501 198696 -188352 99086 207973 144649 -431770
9677 -413394 61738 -230386 163812 -85870 198332 -20430 -398483 -45257 137773 -124937
9666 -41866 -340835 -137093 -153788 -103210 -2250 -113832 36231 -127707 -142184 258064 -405046
9654 32149 -14270 147217 -251573 -77310 -89549 205498 -22295 198314 -207877 -196788 -60899
9642 38838 173390 -62582 62816 -37998 128659 10766 -131551 -51407 202351 38486 299775
9631 299775 -220721 -277260 74536 -400849 1735 184176 -45318 11617 166617 -177593 283262
9619 -146648 25213 -101206 -289164 -98252 -84934 -164952 132288 -247678 49112 -105327 -207220
9608 -207220 125142 -46920 69388 -258141 5276 -175491 310844 -160374 88785 -42749 -299179
9597 -299179 5101 -235869 40152 -129401 10763 -151890 108262 -225195 -111443 -15220 -70531
9586 -70531 -344234 -10511 -90878 -348261 -347624 218365 100454 -138533 -287697 57162 -135824
9574 24745 261518 33043 197492 49635 -220728 -108580 183119 1544 -217615 -42200 -186989
9563 -186989 -121829 -190565 -200518 262371 -463155 -283748 -5842 19312 152518 -126028 -264708
9552 -264708 -232285 -208503 -144527 224157 -62592 105517 61894 -99116 -98595 -366775 135384
9540 -6009 -260321 -42410 -361870 -326908 -493527 23438 87234 -136463 1794 67092 -313469
9528 -130041 115529 199126 10586 -34520 -388764 134181 101847 -72543 -209696 212742 1461
9516 -15252 -301753 21307 -534994 55159 -232123 93771 -108063 20160 107688 -164436 142059
9504 170419 -176412 -219310 118676 -11486 -3399 -153581 -18463 39392 -244509 -176019 -249668
9493 -249668 -98214 93349 102179 195814 138803 87865 137296 -45760 -140612 -51176 164812 52910
9480 231034 -84286 293435 160300 -81007 -33305 -74055 118859 -297092 -255620 -413545 -87070
9468 -214111 -195175 -116816 96506 -304916 165350 -145917 -120428 -92714 191583 -95026 -131997
9457 -131997 -146359 -41036 -310751 76863 -40495 -236273 -414225 -154643 24239 350713 -307344
9445 10203 88412 49288 -161059 -194343 -20201 -26963 -50208 -157566 59617 -272178 -337338
9434 -337338 141546 -248812 91298 4083 495095 -208921 45267 168487 -193999 -139175 161716
9422 -117368 185595 109512 -161128 -22283 -244191 214506 -233725 -206022 -10741 125995
9411 134144 -79871 -173395 -260028 -93467 190365 194163 -347715 -96301 -90422 101439 -174339
9399 -28609 90964 -73039 44497 -21659 -205492 -29752 146388 -182967 29753 -244124 117271
9387 -182925 -82096 422709 -61589 -376611 128385 149886 -114865 263938 -1604 -14133 -223379
9376 -223379 -112911 -66817 58778 92131 82227 -374601 135260 17924 -153748 5525 7912
9365 7912 50898 10642 8834 111057 139459 -136313 -138536 -47820 -147244 54341 19346 -27089
9352 159974 -289357 81391 -181351 111759 39739 -65733 -41638 21431 3013 -29460 -72059
9341 -72059 185538 -395850 -97779 33095 18288 208398 36425 -227953 2740 -204157 262259
9329 103993 151802 44433 318654 -127127 115187 178251 -317240 147216 -43864 -102384 -63433
9318 -63433 -394547 -293335 -85884 -404316 26592 -233244 102218 117607 -56442 -62510 257256
9306 -104770 35191 78470 -261174 150041 -207442 151108 -344850 71122 -172798 102804
9295 151422 -161863 158037 97712 -241163 43741 -196129 -168454 80239 -227803 -94334 -85001
9284 -85001 -84831 -101939 43700 -151500 71398 56398 -39075 -55553 -324910 -45115 -456404 -288089
9272 -288089 -131366 -477982 -141179 -445453 -40684 -124520 -102870 -126115 -21955 -115982 -255825
9261 -255825 -11364 -30834 21521 -22630 66493 -164154 -40262 33569 178087 -80666 41200
9249 172375 -240033 128214 50353 -51723 19893 -127967 -178468 -341795 -36834 195344 222056
9238 222056 -254199 -165820 -75311 -113485 -504885 -70372 65056 -79746 -39105 -212942 249101
9226 -187241 -271558 -143502 -122667 -89565 -190098 -176598 82878 -60734 -272232 -130953 -110493
9215 -110493 328290 106112 -231610 436065 -48995 -258845 36457 35437 -133672 25782 -126800
9203 -135390 -187641 -21853 -85349 -13769 -96149 18749 19608 98440 -327750 132227 82017 131558
9191 131558 -342294 30600 346103 -42263 -283 -58925 126758 -234818 -185248 33489 -226327
9179 41766 -213729 182247 176 -413530 -418315 111420 29792 35446 104312 -95750 227060 -132228
9166 -652687 -223726 258090 122450 -276296 -45695 -135403 23547 124541 -210140 352236
9155 138712 -183675 98459 -105088 -111777 32715 35306 -37651 -316007 142408 -242704 83165
9143 -18315 -172826 -407341 -38962 304961 -93987 -23119 88807 60094 13865 423054 232533
9132 232533 -96713 -75911 -317230 -195078 -254623 -207592 -119188 -86676 -474936 -314008 -31082
9120 -31951 259293 -158574 -175870 -92623 73327 -49606 -317742 -3704 -34193 79662 -96909
9108 10212 -356377 114698 -174090 6085 -112253 -274626 122766 48476 -398396 232140
9097 11362 -130169 60142 -117240 -245961 83457 -101071 414324 300512 980 -104239 -175208
9086 -175208 -24174 119664 -487217 -187417 -245153 -72142 142271 20795 66393 -430629 121776
9074 -62021 30178 -10264 -58301 -52125 169071 -62321 17901 19457 -238074 -127497 264852
9062 145113 -142119 152604 -7945 72774 -102744 14708 30882 142486 81750 326594 -76716
9050 -146379 -105429 -231044 -191851 -291796 25833 -34642 97222 -114941 -148423 148534 33957
9038 168487 238056 111297 -361644 -59663 164170 -170732 18840 21942 339238 -144992 -18783
9026 48836 -185490 -169200 239550 -275513 -276815 13416 -157374 -5289 -93225 112123 -335571
9014 -321682 -93641 -182831 343227 -161108 -58943 -307959 -372496 -199251 1538 -73964 -522590
9003 -522590 -48296 57836 -39362 15582 -164672 -144833 -315596 273114 -201952 -255962 -273636
8992 -273636 -92182 -200257 207408 -93604 33765 -59036 -104599 98145 -14782 -58365 -24484
8980 -172085 -111230 -195373 163902 -79307 181900 -128948 14447 -75925 -137772 -279536 -144019
8969 -144019 124465 -20794 18794 4222 -212939 163074 -110706 -193804 -324622 55100 52310
8958 52310 230892 -21009 316801 91359 155791 -214285 -75852 -44212 -266411 264370 -10890
8946 -177909 -69961 178727 149498 -39494 21134 -39273 83177 200468 -210463 -346373 114799
8934 132183 -91806 -125839 59169 -337004 -10868 88069 -60276 -131004 -30730 285453 268883
8923 268883 796678 2576201 5450760 2173891 949786 412843 278197 -40772 -216687
8914 -216687 247428 30153 -117393 202044 171125 74129 248500 -60755 -121542 -52046 -4350
8902 177878 71352 -318557 -135762 98417 255876 -119835 -238047 -516085 126184 -205739
8891 -310860 -116267 57009 -219770 -357653 -159875 143222 -97722 -272275 -62713 -134481
8881 -134481 -15773 45029 100423 88088 -42407 -333519 20828 -163194 -224424 -275301 -334522
8870 -334522 -71152 -195186 -187888 -66265 180037 179043 -50147 184611 -147366 -216598 -326399
8859 -326399 238628 -154468 77548 -341685 -161 59493 -90191 -117491 23751 126857 -481638
8847 -41974 -152758 411782 -278954 41959 10971 -194018 146071 401931 19918 108137 167397
8836 167397 -396709 -54470 302790 -24736 142904 -403931 -163701 -27633 276000 -14994
8825 -370376 -310726 39137 63991 -108549 -71792 -327222 -327161 -92601 -112359 -35685 -202919 -239811
8813 -239811 -88576 -110736 78718 -59905 -43810 -47945 71024 -225631 250127 -41922 -40989 -293451
8801 -293451 -81690 -54020 334477 -213602 49951 134987 -320860 -119330 -268950 -217004 -73769
8789 -142785 -52246 101686 74128 -32948 70942 42294 -348627 244518 195591 -101493 -105366
8778 -105366 -444907 108151 279891 3088 135959 -227514 -153603 356255 -106532 -76859
8768 -76859 -135242 74756 -26338 -29690 -189815 22355 170263 86696 -31295 -187196 -162213
8757 -162213 -24314 174046 -247359 -90426 -80053 139431 -186429 -98700 -68142 -294305 136346
8745 -2165 16361 -508016 250139 152742 47756 -53341 -83564 29498 -280655 -381919 -243342
8734 -243342 -258418 123099 118217 -7570 -29999 -200943 -9354 39129 164225 147440 -70170 16785
8721 -74009 47812 -240009 83075 36755 -3056 -113744 7990 276137 51179 -136404 -103883
8710 -103883 -404118 -245875 -153382 37411 -8285 -109709 71997 -179055 84194 85140 -22353
8698 158718 -20026 71320 129433 -32096 -180574 214106 -9181 293690 270272 -150577 -96609
8687 -96609 -113526 17192 96916 73920 -30296 -576387 43073 -31872 -65356 -11247 -65204 -57214
8675 -57214 -30862 185571 156333 286329 -254806 -53252 -177771 299464 66048 -85179 -89914
8664 -89914 -121079 -225828 -321968 -229631 7591 29487 -323337 -78695 -100934 -23889 35138 119810
8652 119810 78361 -31400 -100105 -210649 -4703 344614 74122 3700 -175429 33016 54247
8641 54247 -226313 -132085 -35002 42631 21296 -114569 -324185 -111889 -103329 -214231 -45155
8629 -68756 143327 104486 48253 -339967 -89888 133693 -93120 -26992 108206 171617 -196069
8617 19968 183956 -347923 54179 223737 -32303 -387210 -410380 -316481 -187879 -255685 -88612
8605 -237664 -65162 119537 164443 9432 12975 -312333 -18061 -221303 -390444 -282048 35572
8593 -89361 -283443 -272365 -244514 23555 898 -110044 -7483 -59833 -42549 -292678 280411 152093
8581 152093 -118412 127527 -165460 -135965 110458 -241183 135360 -62077 17366 -265847
8570 -271944 219804 -49912 177584 150528 -93236 -64007 6228 -265035 -108656 -33052 -11743
8558 216423 51842 -83429 59433 -159339 101805 -89417 43439 95394 -169397 -1317 301497
8546 311064 171660 63251 -149808 -94819 -35697 -209857 -271894 -83164 135877 -74684 168467
8534 -708 264347 456700 -116943 31126 334853 21788 -101805 -153916 -244320 84704 173283
8523 173283 5729 -264141 -162250 -17416 -370085 516474 -399133 -138898 -228194 -43792 205474
8511 361647 -118489 -67095 5917 -322165 -289927 -172966 -288130 -78644 -184469 303976 436867
8500 436867 -326564 -59257 218230 -307370 54894 -48386 -150948 101112 -7670 -463340 188234
8488 -246423 -4437 154375 50488 126692 -56292 32272 20592 -155391 88793 -148274 -141074
8477 -141074 -64148 -208721 -258983 -283929 -201948 85952 8034 -136963 279045 -104630 -213618
8466 -213618 40781 -151420 -353254 -311464 514218 -208998 -112691 82257 -366013 -319783 7523
8454 -227813 -179117 55510 -252539 -286688 -219074 44554 206760 -78369 89977 -192705 -154971
8443 -154971 239111 -269408 -61428 112168 99258 52368 20575 -23705 318584 -87240 217746
8431 -424339 94646 -17640 73155 -327332 62180 -365210 -147596 -4246 -1548 271212 -303884
8419 124159 166132 -211271 89597 -198412 44661 210843 142688 -124300 -400505 126658
8408 -50473 -145574 4004 -51354 -68025 222069 -79583 204424 237901 -94833 -284185 -42262
8396 159099 -62436 -262565 -246048 -3160 -307268 147188 304015 -164778 1392 -88133 -166604
8385 -166604 -276814 -232694 -207268 -14230 -27364 79719 -397264 146971 157745 -160252 -165814
8374 -165814 -280486 310954 177323 -131444 180741 173984 -179873 61379 -83844 -195741
8364 -195741 -144891 -198746 -181767 34569 -204489 -64521 -252906 -132690 -305059 -417607 146555
8352 -365965 199800 259395 -51166 110096 329285 46198 -58667 83761 -14469 -270728 -179678
8341 -179678 -287697 -39878 -81714 13764 -33253 89849 -203384 -387354 -146893 149104 -56077
8329 38545 -102875 -180752 458463 -69476 -122872 -605280 173616 -304310 -322321 -198081 92994
8317 135219 -133981 -185908 59886 -310775 -287605 -59241 -1393 -396550 46945 223460 83678
8305 65535 -154946 -38172 -87338 -131005 126064 -86077 -29805 -3749 226531 31403 -76648
8293 -127044 203720 -310554 376443 95858 16631 -21088 100647 -211592 -352863 -16413
8282 54561 -5891 -235706 14470 -72151 -28637 -32309 -142652 -123449 -141042 114903 108899 3846
8269 -227823 -357551 3504 -162144 -44308 -210205 -165710 -82310 -48934 -397703 -200754 111975
8257 -82330 -124455 -123521 -324966 -257377 90735 119485 94126 -40726 -45729 -39550 -20277 -353819
8245 -353819 132110 -137005 258648 -161861 -244648 -124366 -95916 -237636 282067 -335445
8234 -82919 -196358 -63457 48766 154431 68047 -267719 128805 45199 471227 433612 -35452
8222 -217304 -96851 155880 157436 -36897 -217533 131636 -308639 -223135 91493 207707 -214290
8210 73012 -63114 33337 -172919 365897 -28690 -92612 120055 -130437 52475 -78997 -190162
8199 -190162 -28948 237604 -164729 75095 16286 80314 -45967 -139235 -81899 -6938 92097
8187 123177 -95429 -197977 -517349 -193918 56850 -64073 -294932 -156434 2920 122193 -82041
8175 -22797 -123845 94428 -45685 -73458 294972 -63270 249831 -135688 190080 -138351 -167307
8164 -167307 -71489 94628 -126316 -377960 -150144 -349565 164319 5430 -38844 -119629 7533
8152 -74911 -96585 -106122 -153375 -108103 93652 -237027 68422 177170 144718 -44929 126313
8140 502340 -96398 -305201 105666 -29654 -168067 -379075 337286 -28716 -45261 -184742
8130 -184742 -12810 9222 174150 -80435 -56789 -79824 67307 -72525 -94841 -56864 -168480
8119 -168480 286368 79867 168391 -152232 10279 -121069 28115 -267684 -177734 154081 46114
8107 -161849 23736 -88401 129413 -39380 149080 -110890 -80929 -168536 -277599 121625 36162
8095 155434 -157087 -102585 -1330 -76086 202763 270216 77133 -49653 -36924 299801 31255
8083 -69083 31612 -246981 -44220 -70471 -27927 -46074 -75528 -431634 -295173 -147527 -331606
8072 -331606 30680 15316 -326661 70279 56794 139532 -39966 -40 -17078 -234814 -39720 -238647
8060 -238647 -39235 -193468 -281638 -82450 -105383 -134137 198964 -14817 38358 -178024 -252115
8049 -252115 -551397 -2552 -143884 -314905 -100407 -94095 96975 82489 -190184 32549 -197369
8037 47236 -292431 193178 66782 -63594 -150925 129118 82403 200832 82474 -45926 66677
8025 216863 34228 179171 -52746 -196372 -305607 23302 -181594 171835 161898 289869 113428
8013 84622 170752 -63206 -60097 -87645 -349551 109797 -9823 -191790 73499 125433 -36894 240428
8000 -36132 -13710 88444 62510 129490 167092 116673 -130764 -338429 -38827 -229022 291664
7988 -261417 -259125 -73287 -284325 -241264 58071 -232109 189260 -236744 -38212 -182063 -270703
7977 -270703 -66403 -45718 103946 -90823 -113840 228823 -151280 -206550 -291972 48631 -14372
7965 -126481 17589 -209112 216157 4529 -117537 47410 72543 -56795 88797 -45441 -254053
7954 -254053 89353 -71260 270376 -123656 23256 -179027 -108364 -3977 -107597 -174515 238032
7942 -65388 40472 -228168 119115 62830 -274988 -74466 6479 100548 -292161 284400 -100980
7930 83145 49504 -131459 -194275 -116885 84174 -56343 198882 -257 -95028 86601 154159 -17676
7917 56086 214008 -77848 103912 -90465 -98876 -42802 152517 -204024 -238559 -52927 -179597
7906 -179597 67613 -64174 112861 -180448 -96571 -208072 -225124 271507 -161220 -3730 -230776
7895 -230776 159855 47830 -261309 -3181 -147448 -147024 -27825 317949 33342 126676 10632
7883 -279981 -146849 -158063 -181690 -208668 154760 125289 -264335 26299 469108 -266110 7643
7871 262250 116466 13517 -190401 66911 -52124 -103205 176338 234421 -218701 -36637 -11501
7859 -227413 -212894 -35837 -129087 85753 234092 84506 -150704 133097 -418285 27659 100357
7848 100357 -205844 264790 43190 40200 83600 -6585 -126025 -194175 -131497 -209183 -43949
7836 -419534 125736 352011 49116 -85553 -66471 4675 9975 131666 55991 -44249 -195523
7825 -195523 -223668 181786 118992 211519 88186 -147050 182598 109767 -72155 -223188 -171963
7814 -171963 -86057 -208667 -206562 -5922 -265772 134400 225978 -30684 -7096 -168870 -88387
7803 -88387 100006 30331 100913 -244627 -213692 -355066 123030 72311 29055 163911 -285912
7791 -8606 -149814 11018 -211546 274160 -68795 -95831 -19816 -351735 -99838 382204 -299830
7779 352731 -131808 151530 -538487 99334 106705 95979 104153 -283824 103906 145771 340168
7768 340168 -135392 -147684 142902 -7603 -124440 -32733 144849 222929 267313 -184959 -195153
7757 -195153 -511163 25144 311985 -243886 70248 402143 174991 162038 46231 -140770
7746 -45353 -133102 229221 -24357 -184830 -118479 -187652 83981 -29367 -104186 202774 -347006
7734 -437903 -87897 -155878 -89983 338802 -152230 114817 309652 33998 -72888 -304090 129078
7722 -82310 7758 -322065 133138 72596 -154610 90159 170563 -58902 -347046 121799 -280755
7710 47938 132918 79799 -112246 164399 -30996 -102057 -59134 312332 -80912 -283372 -41058
7698 -358913 17364 -71202 199753 -303081 -212194 -186349 -44028 218028 -131208 -81432 203369
7686 -152586 -78023 -77802 -105674 -98359 -235606 48149 -208219 229082 -85435 75495 23981 90867
7674 90867 -71282 370587 208249 94897 -301363 -403464 56061 99201 -83627 -189906 -100036
7663 -100036 72775 113721 -195319 180099 -3351 -69241 -178480 46891 -308630 22379 -166350
7651 -17179 -77494 -59945 96005 -39550 157225 9401 92881 -272891 46650 -261153 189880
7639 -29449 -23543 -1999 78299 69757 -93768 -428171 -76673 214260 -35779 535389 -154094 -60699
7626 47137 -183944 -162345 -38653 -205910 -1414 127211 -95064 47378 -96589 -72918 -84497
7615 -84497 23849 -418967 -227391 225009 36987 -618842 -156689 -113211 -115772 28662 -30643
7603 -263976 -296442 -68631 -298088 -23205 27713 -334458 300540 -162648 -235854 -33474 -131978
7592 -131978 -407226 -48484 -195099 -13696 -105704 117711 159792 -208903 -29529 223020 -12677
7580 -103600 29318 -371189 -330362 -154019 -64952 -36982 147616 2729 68961 -123028 260321
7568 -118814 28795 -73266 -218525 169235 -2340 -177080 200607 -79324 330077 -152973 -33269
7556 84763 205293 176926 -1558 47362 -236844 -74406 -227453 316990 140303 -233542 56272
7544 -133789 -31368 -17693 -238754 235079 -126224 -298414 -6954 -119309 -62395 -344822 -862
7532 -94711 -54685 98250 329590 62820 -22687 -23501 91726 142269 251005 -86998 100413 -176087
7519 -158350 291217 -104826 75431 -185259 -441087 155468 226032 47626 40984 220073 57307
7507 166186 -145780 -124214 -352808 -46743 -144143 80902 -55948 103841 30854 -22512 -14024
7496 -14024 6362 -206296 243551 -115677 395127 253891 -575680 -97518 -200024 -317136
7486 -317136 20752 -66600 79999 -93605 36534 -301937 -380426 -94061 -65018 -348218 -17196
7474 -247694 -321547 -19566 -86188 134316 -184233 -372143 -137620 69713 118586 -48258 237273
7462 11858 -32228 -83205 95976 248892 -125724 -45317 -187799 171462 -110703 195788 -230319
7450 -84213 -49372 45185 -146072 -4001 70948 -99765 -183092 123478 -270741 257891 90021
7438 -22664 -301130 -187807 29197 -429507 -49245 -91233 -11082 -46948 -233350 -48476 -113646
7427 -113646 106562 -201569 -204166 -387226 130049 87506 70099 -217048 -55804 -144074 -28628
7415 -76653 260365 -359819 101633 -106938 27354 115735 56357 -53770 -278668 207738 104542
7404 104542 120366 -74873 -17807 -401641 -50521 274894 -22111 175615 -211393 -159914 162418
7392 188104 -158729 -129184 -449386 16575 -216717 -60891 322562 78545 -149133 -49302 -232728
7381 -232728 78748 -48382 -75054 -147267 -142318 47930 140499 21136 317032 -31447 -176616
7370 -176616 -60074 129706 31001 243904 254913 149020 -67115 99457 -39584 34709 -142551
7358 -54213 85950 -75946 -30639 136252 -14653 128319 -56562 -183887 -144260 340854 -28548
7346 92216 114159 52130 -144232 87486 14335 -66541 220180 -440051 -62045 -245797 51988
7334 -448808 -11158 29973 184969 267053 23752 66959 49703 -35850 -207655 -166372 1033
7322 187675 -111161 -245874 209361 -79840 205932 16350 -272482 204570 -148784 184467
7311 14034 112174 -115567 -3478 -122069 370580 6435 40495 338127 -26722 -19999 -218582
7300 -218582 -49448 80092 -52438 -19934 -135798 -174627 151635 -211797 34090 -189678 69592
7288 85435 -190751 -15757 -134914 238510 13137 -24502 -156618 32999 -96323 -295357 -419456
7277 -419456 -77294 -94752 -471587 -1918 9952 -31120 346066 -167899 -372418 -361150 -234989
7266 -234989 -52623 28533 -328837 -285511 -91847 -168559 175708 23332 -145514 -57401 122376
7254 145693 306518 -59632 -28314 -322806 -10917 -92005 10094 71745 -169495 182131 194291
7243 194291 -138633 57281 303106 2073 -187627 5635 -115768 28357 199883 128771 -137923
7231 484 -23222 -180630 -83855 -59688 -430688 75501 234144 -149439 -65009 -186205 265521
7219 -180356 -12786 4302 -362629 -151598 141230 -487061 140546 87453 462 -10755 -320848
7208 -320848 240022 449 -58439 102087 -94896 -328413 -50288 -48617 -224054 -153601 61018
7196 -24260 19796 -25606 -143603 -151273 -250843 -79013 -179165 -114021 -147559 -205788 114790
7184 -41486 -430328 -362104 -80956 -132018 -69893 -127676 113606 96722 -138621 51804 -103467
7172 94098 -48214 -168853 268018 -149660 149833 29192 106229 -244590 -184803 -45142 99621
7160 -74466 111129 134434 143023 -51632 -390524 126537 -90533 -102429 -108076 -22693 -113102 -175343
7148 -175343 -46359 -169483 2433 -27030 -87750 58494 -142376 -283923 157005 -785 -219302
7137 -219302 -20853 15382 77888 -80293 77819 42992 85115 98960 -245209 98567 22693
7125 70022 52104 -133407 3717 -144537 105688 -35750 106059 79803 18795 -123696 -112612
7114 -112612 -15771 -2775 -26182 -512784 -125516 -75218 -39749 184511 28378 -33635 264996
7102 193762 -193198 -109623 -93557 -166003 -166632 -116384 112257 -197072 23142 -295843 38484
7090 195016 245690 317017 58676 -99807 -80388 -144549 46936 -269959 372432 -74784 337476
7078 392737 15971 10777 -97822 -83810 -115105 80823 56212 -171488 -7565 -88281 36089 316337
7066 316337 -72268 -153942 63376 353016 48261 -9067 -41502 46043 -298814 43161 -93756
7054 12931 -46174 130470 28709 -108640 162813 198443 -44969 -86558 16673 -133542 -460205
7043 -460205 -26644 -239201 241037 -234216 -405421 163328 -188884 -195617 -194226 65609 -21948
7031 464837 153835 37686 10818 -109758 -88135 -13867 231253 91940 -154613 139239 -74523
7019 8830 -10672 -139008 -38248 38522 -187236 74564 -263583 -79413 -244938 -1252 127589
7007 -124585 60654 -317999 64175 -238500 -195548 244641 -46549 360312 -3249 91720 -2826
6995 -244394 -5258 294780 -130973 63382 -198403 -350957 -14588 -206655 46409 60837 -11944
6983 -233751 -23705 220980 -271220 128958 50841 253333 60028 -145341 45977 -299775
6972 -31270 -146439 -227381 214381 73723 -29740 -41582 13169 -102049 29618 177242 167700
6961 167700 74588 -47808 -93918 -154091 133975 225042 31504 356231 28269 -329913 69882
6949 -263804 -312399 -45143 -114722 -162799 395171 174468 -39140 -105853 70966 -76878 35030
6937 -246652 -64307 126890 -17916 -212762 -615 34718 105735 -213109 -128547 94433 -178180
6925 79813 -88925 -174134 -135873 29423 -128303 -110138 -219638 271584 269323 290137 -57319
6913 108272 -194697 157318 172178 -307433 -110511 -3447 -66984 278233 -126041 20515 -72685
6901 93770 149995 36785 275490 332410 -212919 224527 -120422 108381 -12173 -178991 252935
6889 -122642 301415 70303 -6453 9375 -113619 9778 -58773 -211515 -13634 273769 41137
6877 -102124 -269259 -37638 -181172 -377041 -156562 -47273 -27633 -96656 68879 120997 130460
6866 130460 -90339 -220089 115474 6918 122321 26422 45315 -493695 -120586 32691 -254400
6854 -73433 -157053 -186064 -113221 73671 172574 -187428 -143485 -107145 19740 152167 -4726 -3545
6842 -3545 -396536 -31158 -91621 130378 -272077 -24495 285216 -28142 -442649 -40352 -242799
6831 -242799 -105259 132019 90405 14861 384777 -116765 -208629 -62476 200488 -34792 -204717
6820 -204717 226234 208983 56432 65648 15282 -212145 -265084 60794 383509 213341 -137348
6808 201699 -190224 -163587 -260629 216125 -39559 36264 232935 -122360 -153423 -70431 151770
6796 70748 -235184 137183 -138840 -191372 -24600 -174116 -166702 -49148 -195493 -219085 27615
6784 50901 -93565 -380160 34072 -208560 71043 -138527 -142629 -158820 -114683 265423 -81943
6772 -293194 319746 101676 128216 -139996 -112497 30832 -145864 -64091 -296029 436919
6761 324367 121246 -50831 -223419 -111232 68116 -185651 296160 -138961 174957 231766
6751 231766 -2161 40965 125490 56344 259711 -292304 95364 -187278 160285 47413 208636
6740 208636 -22290 -98941 141082 396933 121817 21530 96296 -118626 -218397 -117085 -115485
6729 -115485 193411 -182922 -159133 -40758 4165 330979 -47771 77856 373400 158049 -229307
6717 -302107 228683 -281285 -316401 160929 103713 184996 -58776 274424 -320009 -129428
6706 -131726 -196163 -53830 -173727 2616 38574 -88433 289882 252997 -118950 63081 -16826
6694 14343 -2872 308951 -103723 -18900 46642 -66124 107760 -83107 -61304 128089 -296424
6682 -85678 -229063 -123913 -17457 -71765 118100 27029 -73693 79513 -66471 -206889 -64282
6670 80853 124796 -139191 -124837 215073 -103389 56840 95179 185569 44908 -111330 -162966
6659 -162966 214765 -290928 -56990 180132 -36451 -82754 140600 -54689 134371 -205794
6648 -46622 391706 -127756 154624 -203753 71036 42149 275530 25352 -165490 -2711 -44428
6637 -44428 -185001 -189390 -101365 451 -628 -6467 198951 176153 310416 -31786 134332 92965
6625 92965 -155447 -331498 -169720 27286 238901 16220 -188935 -130251 -295389 -17636 -254705
6614 -254705 192416 -22004 -239098 -280961 139205 -238808 -85241 -114137 -66919 167798 -218607
6602 46858 39583 -201472 -36910 -12612 96692 168939 36388 186014 -147425 30300 187200
6591 187200 -255140 -173859 47202 -165942 -139979 -39593 219350 -163761 -310226 -405777 -30010
6579 -73086 -20171 125239 -60314 -37303 13673 64403 157765 -13792 -43107 -13433 -227720
6568 -227720 -148007 -90492 -241438 -54650 61313 304320 -5752 -84363 169510 121892 131293
6557 131293 -33610 252179 333894 -55040 -212163 -162538 -158016 -48920 -27376 289492 111772
6545 -292757 -260787 82697 132446 -74757 -116299 -22279 250118 -36390 -106306 18863 200720
6534 200720 60480 -188530 218081 -86044 207883 -65586 73886 -155531 -50440 332707 103169
6522 143538 91263 -44770 -119900 -107092 -87195 -58345 -454004 58791 -389062 210912 -146641
6510 -229567 -117765 -84629 153971 -149682 -23012 160863 463182 161712 257906 -111306
6499 -207534 30604 -111648 -56481 -314603 -340455 160354 82222 220797 205459 106944 41202
6487 59601 44019 -90867 -92759 -162165 -71319 -231112 23769 42791 139548 147180 74335 -130571
6474 -34845 353297 -77397 -418672 -62035 23700 82274 -57341 -194042 164599 169334 -329072
6462 -18205 -17737 -94638 58493 25333 3228 -95097 -75107 -83720 -66859 70445 -104188 105006
6449 219368 -44316 252873 96039 -234203 -340067 -188917 93877 220681 -326373 -121096
6438 161496 -146555 148327 -158742 -130266 -3746 169264 10110 -321168 -211954 6614 29814
6427 29814 166678 332191 -121286 -59287 157759 -63188 -76522 174050 -192445 51203 -183876
6415 163211 263966 -15313 -61081 -176269 -3357 2004 104137 -42230 158955 -207970 86832
6403 -288499 -94156 4899 -53124 53841 53268 86876 37475 -135631 -107249 -69905 -4744 -421106
6391 -421106 108238 -173792 -57508 44194 -174633 214817 -194234 -393120 -133702 -8555
6380 -9923 -100010 -45482 -216636 -119807 163464 -6187 -93315 -79963 350413 -45137 240805
6368 43955 -40193 190121 47477 217504 -98925 -222754 15369 102894 -140415 -199963 -83729
6356 -153134 -5605 -144971 -191956 -216369 -25202 -259397 242720 -9402 -63520 82684 -256886
6344 80231 -243755 336510 34308 -54367 -85120 -33564 4467 -185310 56770 -103516 41501
6332 177300 90016 -70258 97249 -340451 -146783 -83246 -16166 -137965 -280787 25379 284726
6321 284726 51240 -346200 63399 -45849 -52227 -134581 -147390 127174 78252 25862 155361
6310 155361 -4082 148164 295585 -115305 212739 -70977 234893 2352 -19464 184536 -206171
6298 15216 36387 118919 -211133 106438 1408 105397 -353925 -248819 -28814 10096 -149894
6286 525877 98266 -329176 -217119 17712 95565 -51423 63808 -221466 -299096 -24809 -240749
6275 -240749 108044 298615 112765 -15135 -76238 157934 114715 516691 17339 95527 -226148
6263 -155093 46574 51261 -436446 220049 -25350 -456980 -201814 -151418 -317646 -243032 39315
6251 -292381 -17225 -75022 108783 -14687 -225333 -9856 -200973 -135003 55060 272518 -183522
6239 -280769 57653 -223529 -114856 58118 -5892 65120 134554 -47202 30062 -52009 216072
6227 62228 55388 -163311 -111156 11560 -20080 114463 155977 170223 -139274 85797 310994
6216 310994 -127624 -98051 -355065 -12859 237387 82450 -47180 -72675 -63924 153364 96749
6205 96749 -256873 -96384 91200 -473856 -41326 -276291 183707 -64529 -40397 88404 -199415
6193 -76580 107107 -13359 -297443 -13269 84940 -142947 19243 3023 -6861 -290248 -336538
6182 -336538 98575 284081 -119074 152118 -243090 211789 -204292 188891 59726 -92887
6171 16701 -268542 -123266 -209983 356000 57188 198993 28581 -64159 124680 83453 -200723
6159 -5631 -89017 -40622 192998 12235 -7079 269764 -97505 38952 184227 -144185 -229464
6148 -229464 74536 -186382 -374124 163903 371105 -26909 9241 -97188 155876 -291501 131196
6136 36387 -36238 -18161 -424889 47353 64324 212275 47743 -237426 -5701 -304035 125857
6124 128411 43382 -85546 -70601 109532 -17557 17158 -120136 186340 7725 -231939 -316651
6113 -316651 27 167349 -117181 359361 68123 -371810 -215752 204909 18586 -293044 -230031
6102 -230031 347806 -330281 28279 -27323 -261674 7579 -80094 -211477 -209944 221056 12396
6090 -139257 277316 137775 -176373 9173 -90096 25145 -108593 -30231 -168548 48963 -128682
6078 -99594 -171996 70953 -62577 18917 -17029 168097 89886 19454 173481 -330717 -1548
6066 157136 -404562 127043 -150112 73562 -64316 -206566 195212 267779 -57166 -158896
6056 -158896 -280458 -78923 68153 94421 -64031 204518 -121752 -67879 212771 147915 -204362
6044 50642 149951 -142942 -171077 -158946 -305511 -104558 -32488 -76754 181290 -43292 16873
6032 93113 -260611 -4849 -99084 -120798 81568 61018 42740 112844 209326 -153579 -100123 175264
6019 -172560 -140638 276819 -46444 -12251 339906 -168858 234660 -72190 148823 -129659
6008 15353 11659 -387896 61987 55834 77962 133563 -202503 -48077 257446 107037 -880 56737
5995 261462 289419 45857 401589 72529 -23534 107089 185795 58709 104408 -89257 8933
5983 -91908 297909 168190 289541 -212 -185164 148029 209972 -38505 61541 -287800 20218
5971 -104957 -273889 139663 51105 122776 -127903 200027 -185502 36008 -259231 -122396
5960 -161871 160788 -75036 27900 -187990 -76470 80937 284440 -428481 -139724 -70146 -6629
5948 -84114 45518 212646 236748 -80041 -54545 -92774 66555 12872 279368 308468 175336
5937 175336 139199 133408 277199 -62261 -375970 -31162 12747 -225823 -213732 82292 150837
5926 150837 -70812 191283 52392 -50736 160825 -208732 -95364 12128 -351592 -122008 64911
5914 73488 -82124 -171141 -3004 -32241 -175174 147778 -434229 42610 -15392 -72935 -55044
5903 -55044 376501 16640 -87373 -222523 92700 -77252 7635 95216 61474 28753 460377
5892 460377 -149871 -197971 -285836 -166851 62327 -212217 92983 29270 -116881 -102226 71620
5880 -304973 -222266 -362477 -116237 285247 -18118 123946 -255578 83793 -5299 41828 -4126
5868 51595 43342 -100672 166422 -11719 -17484 237003 172753 -169698 143441 -46597 112448
5856 348215 25494 -30499 -219981 -310520 -475375 -44741 32580 71414 259471 -75125 66865
5844 -170850 -526362 107297 28161 -57611 -196314 38509 9396 -65280 44519 23121 236501
5833 236501 -181 147095 -123585 216042 -81875 3910 -155767 -254871 94849 -97873 151272
5821 206770 -23306 -365844 -338242 -46290 271831 66337 102375 2667 -536201 95330 -397901
5809 -156230 -132997 -104291 -152746 14330 109266 -275222 20911 -106093 213574 24216 8948
5797 -137392 150682 -246873 409237 -14394 -160386 -199453 -267241 -86322 -35245 160414 -102160
5785 -292324 -9482 101205 83234 33086 255793 33847 113259 -34582 132765 289216 -36362
5773 4071 -226170 -97109 119037 -29229 361719 17815 -189365 57575 298997 -70376 -147210
5762 -147210 -169846 129683 62116 174648 -19178 -172216 2412 -14708 -48710 117360 -189068
5750 -13535 -225716 147830 -397372 -36808 177123 -134407 104416 -67995 -132265 -109886 23129
5738 -107035 152831 -84038 295860 -76771 452716 -262599 -274267 123899 110784 -151615
5727 26274 76135 -20927 -77163 134510 -146733 -107543 274704 19698 227199 -219384 -53888
5715 -456458 -72284 269591 -63916 4664 70952 -8011 -31530 65902 -234355 86000 60265 262428
5703 262428 -54987 151530 -43071 134443 128252 69622 88515 445366 39052 -70527 29985
5691 292 -268608 20580 -19827 61805 -191806 391495 -253299 -11555 -28323 -47188 56699
5679 233318 110035 -114596 450311 195765 76752 -433510 -333781 -324 198117 -333730 289526
5667 137575 186842 -114141 63622 -12002 -33324 12520 -78188 -82337 17040 -44090 197193
5655 -76174 -445277 -10611 -28779 130086 -69279 -3162 -201337 -17654 7278 -377242 47537
5643 111846 244156 -167152 -80400 -426495 30681 -22663 94510 -136572 -28846 196524 -5252
5631 79861 -334353 -260965 -42171 107688 -123905 -103244 -103545 -81107 -393020 67533 129096
5620 129096 -206326 24598 372798 43016 -21802 373414 175448 346055 -29911 -180906
5610 -180906 92929 135351 -106097 60458 -75001 11708 55783 30997 -229047 -182462 95301
5598 91866 238559 53044 142744 285448 46629 109880 -217704 -64328 -98577 58052 200275
5587 200275 -155783 -261037 -3466 -129310 -85495 367090 73081 -51650 -101826 -194580 -317900
5576 -317900 -212118 312729 195364 17962 97010 -262479 -190794 -29256 -324526 -23637 108604
5564 313790 -1088 66303 183259 -58867 -201155 -132675 -209422 -383115 53585 -278965 37876
5552 95976 13541 174244 82912 -384 -160805 22045 -9574 126788 145058 14417 -143832 -100449
5540 -100449 -60251 233173 -376374 231077 49941 -140235 46464 209546 423156 208241
5529 159772 -204380 281494 81531 -149072 -288296 -83761 276973 60943 -78572 32077 -170793
5517 -454 228973 170355 -22569 43764 -18554 143053 -95917 -229267 -86136 272194 69659
5505 -155755 -307641 155628 402441 607414 -265170 -261441 -107805 82427 25441 -109770
5494 32263 -54039 -153389 -37350 -178880 30847 -105986 138377 389827 84438 -72125 -123295
5483 -123295 335127 -82736 -57330 -95648 50900 -23475 110723 -177633 111361 -18478 192735
5471 -57725 -3354 277739 77899 308195 -445054 6251 18885 -13391 -178101 20461 3782 150580
5459 150580 135235 -126347 205641 -9666 -132320 -38274 -173346 28294 -117584 142683 -201917
5447 -83136 -53621 -299099 -82301 -134465 71782 -273333 -287861 -159022 -582 -171227 -99251
5436 -99251 191704 -6476 93286 125786 -320878 -413861 -90923 -31074 -177856 -284789 -198207
5425 -198207 -174761 -77274 -88852 -157462 -67443 138295 299798 -35217 34553 24342 -91690
5413 281457 -261411 -183178 44325 29322 -2630 386404 492602 122920 191952 -164192 15309
5401 -152764 -79743 -40969 114959 68801 161951 -42658 176069 -56644 -91573 69574 33120
5389 -287230 143371 123564 24366 125534 -124184 110702 46917 -248695 19449 -178264
5378 43961 -100669 57018 216995 -150677 73545 -91450 114243 -187663 142206 -267154
5367 72967 83533 -85019 -263736 172834 89904 -197410 -264224 -109619 -82764 -40018 -116952
5356 -116952 -83525 -273346 -117307 128747 -14081 -203156 210796 -348535 122091 -366964
5345 99874 160732 -239149 -265420 -125614 -191841 24277 -53184 -75543 -127849 -3037 -56265 362503
5332 31024 -163320 184408 80122 -89855 -197867 -116859 237466 -360101 294983 -150676
5321 20946 -29854 -82272 39612 -4260 93732 186150 -56774 -110413 -76262 48330 286493 119676
5308 67713 -53702 397299 74800 374547 -38871 -276601 116537 -59056 -84242 23859 -144054
5296 -186957 203454 -267169 -4723 -366351 -104860 150124 -67951 -137223 -179175 -34028 -168526
5285 -168526 192198 78714 32714 -72362 -169234 -39912 -40354 98037 -11650 58005 -206759 -113843
5273 -113843 263882 120339 148463 -293452 264989 -255157 -111149 298918 194412 187682
5263 187682 19344 120202 -185820 86065 17672 32571 220739 254189 -106612 -366320 236677
5251 64896 -107157 107324 -361876 27201 221042 111589 295483 -135509 -99159 -124161
5241 -124161 175227 -118895 -64393 -95583 89825 -327210 -20535 48292 222524 -73998 -306521
5230 -306521 336819 -237501 -193338 -164062 235569 309696 434894 134944 -50188 121527
5219 -175545 25750 -24798 74783 140676 115932 -129999 52448 195765 33980 231766 -59857
5207 -192705 17358 40718 22565 -44180 -102975 140261 167733 -124626 283508 433333 -184288
5195 -164086 -228943 -52615 50149 16638 22158 -76516 -106465 353793 -69967 1779 47200 -84997
5182 -108260 137582 -180262 153011 -69429 -71413 -186657 -354945 35784 67086 83126 178945
5171 178945 101085 -105611 158548 -134467 -112864 -127214 398534 -24542 116745 30165 186744
5160 186744 161629 101323 28839 29954 46507 -141885 117625 -281018 -110297 -14677 -145185
5149 -145185 25708 169039 -22501 -79834 33392 -129688 109629 88519 46154 185655 67565
5137 -262295 37672 207844 126020 -324745 27025 37973 257158 -15706 207840 -305868 -94181
5125 -301099 -142466 13954 -111475 -18534 296577 112590 -414736 -3167 -39562 257578 177563
5114 177563 -175239 -149024 135598 -142783 147460 -16118 29575 -85452 188064 107997 -15144
5102 301873 219191 182942 -32473 -62677 -100582 -17582 91836 44918 -91048 -185940 -91325 82518
5089 -7444 445493 15999 205973 109350 282782 -229530 1195 -191268 -36321 -36329 220335 -245702
5076 49986 118877 225951 -172574 -169632 -384948 -91267 -21038 -114987 18968 -115898 -239971
5065 -239971 47529 -63969 -7765 -121572 67231 -274980 -188330 38811 145938 -287516 -326799
5054 -326799 283440 276587 104085 52539 17834 -183618 109063 -32807 -140805 433562 -56566
5042 -52285 -508977 195722 50387 -222820 -281511 47744 -204554 278611 -110964 -145862 180760
5030 -314759 -144300 37871 283057 220997 -52286 121299 261425 -257858 -26145 50688 151581
5019 151581 -75400 -170476 22286 -85557 89086 43518 -56552 -190677 -160634 -170417 -88078 -20045
5006 62827 129550 -412591 -219152 -115370 -204857 -425414 201091 14618 212818 41366 -123627
4994 -220809 244794 -74237 -9988 13634 238410 117759 -60579 -260518 38685 296900 -136875
4982 111672 11969 137786 103486 107109 -253107 -241657 85089 -14681 57827 48967 125635 -320636
4969 -127033 -77862 -298338 157539 13857 -289245 149496 274758 -287065 171368 37880
4958 -98572 -60730 181737 -129071 -28690 199863 106724 -54790 -97017 570521 154648 -22216
4946 317762 -68661 158544 -41447 27275 -218434 229994 76014 -134918 -86080 39208 -72009
4934 62579 -42040 52814 -228194 -39198 -76966 45270 -111542 132379 58055 41164 -237165
4922 147368 111763 -84613 -85489 81952 3232 348188 240458 438217 101689 39362 72607
4911 72607 -61176 -165721 -43546 -29949 146271 142125 185703 8390 21435 78268 -88086 -30755
4898 -216011 254751 66574 -42435 237879 133167 322751 -92278 105952 -62802 -122434 -56858
4886 209304 5339 97224 74090 -38066 241509 80199 81242 -118027 -28865 -13622 379990
4874 -30872 -157032 -141127 -250562 203406 -3880 145113 65226 16839 233908 -232830 150606
4862 -128319 -2126 -183866 92336 332846 -114909 -55984 -104623 -109213 -304423 37729 -151027
4850 159785 -12200 -369727 -38840 392484 265411 58845 154324 326463 -53492 -215188 -96076
4838 77304 -6869 -319025 -64091 160236 213965 232478 -142344 -58151 212757 90180 165903
4827 165903 106152 -174041 150897 92602 -172949 238275 -38194 201793 -145256 401096
4816 97719 -175520 57855 -22913 185497 -129312 -86436 -284477 78882 122521 47987 -172534
4804 -65737 33311 18911 139194 101020 -184265 -57681 -71340 -222765 322227 -31224 413706
4792 -73170 59614 30467 -55433 134707 -354915 118869 -98116 179167 -84712 -58029 170269
4780 -116463 -19748 171655 -24899 -211296 -385405 -280334 -105191 -204956 -233245 231872
4769 -229857 44241 -127543 -25835 -65080 -291747 -252204 -79699 200570 -321097 -184793 275827
4757 -168353 -71239 -89552 -113730 -70709 -76564 44825 26939 -187911 -16661 59061 194344
4746 194344 24563 -212306 -292568 76022 6839 179385 200725 -15192 148887 -4814 -220080
4735 -220080 121722 19558 138846 -39929 172893 189548 -252761 215525 101345 -84736
4724 312181 106193 -244430 138306 131497 18655 178438 5693 124595 -78670 75692 -25798
4712 41300 197655 -38666 218539 -102872 133808 87450 -33575 -49052 -12023 118721 -111823
4700 340723 -138304 51864 -51367 -152974 -67230 112996 197931 160903 -196072 -175594 -388391
4689 -388391 -334427 211083 52856 -82791 217283 69555 -80024 -278384 21653 54967 85835
4678 85835 -158057 -90653 -108622 143064 20539 74223 49844 192535 -79803 -233301 -22411
4666 -81072 87999 211554 -60134 -245721 28498 58931 222780 -41091 -192594 31360 63245
4655 63245 11257 220594 232832 -49666 -97233 -2435 -66389 86315 -33833 107408 -74424 184453
4642 126039 156967 -172554 -147663 334414 -61566 174886 -114204 -70334 124007 -232318
4631 96020 -246938 164438 263881 -264988 -245736 211741 -142703 -322569 -183264 -167434
4621 -167434 219493 12841 10695 -91584 177085 -50405 -93577 67456 -34866 -255505 87400
4609 -1115 -88989 -97913 20043 104628 62816 182611 -39749 -107951 85403 38690 54092 -142432
4596 -51644 -207289 -516385 -98401 -198357 30669 -42741 36696 74058 -73339 110300 265924
4585 265924 -364341 267757 -18417 -306597 370500 282599 507077 197895 -48453 10417
4574 -145804 55879 277391 -339596 -356177 -26889 23837 -150253 41362 -105860 -6824 -27418
4563 -27418 -42303 -154234 226071 56679 184697 -5099 72835 132925 287614 2535 -18164
4551 -168004 -164090 70612 -100821 -173734 107762 55165 179281 43861 152807 -95701 401087
4539 89452 -211578 95366 -100600 -145665 230310 554457 -20783 194046 155519 130761 115536
4528 115536 -25087 164991 -195214 139473 -55977 201877 134378 82708 -311758 -480969
4518 -480969 469881 -65116 -168013 385173 25826 -6516 242755 21695 140303 71769 162857
4507 162857 89456 -123429 55952 -76219 131882 128816 -215869 -154312 -19592 -106886 -405406
$$ [...]
##END NTUPLES=NMR SPECTRUM
##END=
