##TITLE=AC1676_PERAH14384_8571085_ryBY1QWMox
##JCAMPDX= 6.0         $$ Bruker NMR JCAMP-DX V2.0
##DATA TYPE= NMR SPECTRUM
##DATA CLASS= NTUPLES
##ORIGIN= BRUKER
##OWNER= Administrator
$$ 1.72 TOPSPIN		Version 2.1
$$ 2014-04-11 15:55:29.879 -0700  Administrator@X
$$ Compression mode = diff/dup
##.OBSERVE FREQUENCY= 400.02188249412
##.OBSERVE NUCLEUS= ^1H
##.ACQUISITION MODE= SIMULTANEOUS (DQD)
##.ACQUISITION SCHEME= undefined
##.AVERAGES= 64
##.DIGITISER RES= 22
##SPECTROMETER/DATA SYSTEM= spect
##.PULSE SEQUENCE= noesygpps1d.comp
##.SOLVENT NAME= COFFEE_meoh
##.SHIFT REFERENCE= INTERNAL, COFFEE_meoh, 1, 14.96117
##AUDIT TRAIL= $$ (NUMBER, WHEN, WHO, WHERE, PROCESS, VERSION, WHAT)
$$ ##TITLE= Audit trail, TOPSPIN		Version 2.1
$$ ##JCAMPDX= 5.01
$$ ##ORIGIN= Bruker BioSpin GmbH
$$ ##OWNER= Administrator
$$ $$ E:\/data/COFFEE/nmr/AC1676_PERAH14384_8571085_ryBY1QWMox/12/pdata/1/auditp.txt
$$ ##AUDIT TRAIL=  $$ (NUMBER, WHEN, WHO, WHERE, PROCESS, VERSION, WHAT)
(   1,<2014-04-11 15:55:24.379 -0700>,<Administrator>,<X>,<go>,<TOPSPIN 2.1>,
      <created by zg
	started at 2014-04-11 15:43:54.374 -0700,
	POWCHK enabled, PULCHK disabled,
       configuration hash MD5:
       C8 4E 4E 5D D3 5C D8 9E 9F 52 82 E0 59 8A DE 15
       data hash MD5: 64K
       D8 6C E7 9C A1 55 9C F8 DB 87 71 44 9B AC 4E 8F>)
(   2,<2014-04-11 15:55:27.661 -0700>,<Administrator>,<X>,<proc1d>,<TOPSPIN 2.1>,
      <Start of raw data processing
       efp LB = 0.3 FT_mod = 6 PKNL = 1 PHC0 = 0 PHC1 = 0 SI = 128K 
       data hash MD5: 128K
       74 71 C4 D7 9D 6E F1 42 8C B2 DA E1 E4 85 E1 5F>)
(   3,<2014-04-11 15:55:28.661 -0700>,<Administrator>,<X>,<proc1d>,<TOPSPIN 2.1>,
      <pk PHC0 = -82.35352 PHC1 = 0 
       data hash MD5: 128K
       0A 5A B4 52 46 DF 04 B6 24 45 DD 9F 8A 20 BF 85>)
(   4,<2014-04-11 15:55:29.161 -0700>,<Administrator>,<X>,<proc1d>,<TOPSPIN 2.1>,
      <abs ABSG = 1 
       data hash MD5: 128K
       5A DF D7 A5 1F 53 26 B3 7F CB DE BB 7E 57 66 BE>)
(   5,<2014-04-11 15:55:29.317 -0700>,<Administrator>,<X>,<proc1d>,<TOPSPIN 2.1>,
      <abs ABSG = 2 
       data hash MD5: 128K
       2E 6A CC 77 02 E2 49 F6 25 0E 16 75 E3 9B 3A CB>)
(   6,<2014-04-11 15:55:29.426 -0700>,<Administrator>,<X>,<proc1d>,<TOPSPIN 2.1>,
      <abs ABSG = 3 
       data hash MD5: 128K
       DA E9 97 1C FC 92 A4 F2 4E E0 02 D8 26 45 2F 29>)
(   7,<2014-04-11 15:55:29.582 -0700>,<Administrator>,<X>,<proc1d>,<TOPSPIN 2.1>,
      <abs ABSG = 4 
       data hash MD5: 128K
       54 2E 6E C9 F7 BF 2E A7 57 03 2E 40 35 FC 02 5A>)
(   8,<2014-04-11 15:55:29.676 -0700>,<Administrator>,<X>,<proc1d>,<TOPSPIN 2.1>,
      <abs ABSG = 5 
       data hash MD5: 128K
       79 71 1E 75 61 DD 03 CB C7 92 25 A4 B0 39 B9 24>)
$$ ##END=
$$ 
$$ $$ hash MD5
$$ $$ C6 A5 D9 56 AF 2E 0C EB C6 D1 E0 27 EA 03 92 FD
##$RELAX= 
##$RELAX= 
##$RELAX= 
##$RELAX= 
##$RELAX= 
##$RELAX= 
##$RELAX= 
##$RELAX= 
$$ Bruker specific parameters
$$ --------------------------
##$DU= <E:\>
##$EXPNO= 12
$$ [...]
150 150 150 150 150 150 150 150
##$TP07= 0
##$TPNAME0= <>
##$TPNAME1= <>
##$TPNAME2= <>
##$TPNAME3= <>
##$TPNAME4= <>
##$TPNAME5= <>
##$TPNAME6= <>
##$TPNAME7= <>
##$TPOAL= (0..7)
0.5 0.5 0.5 0.5 0.5 0.5 0.5 0.5
##$TPOFFS= (0..7)
0 0 0 0 0 0 0 0
##$TUNHIN= 0
##$TUNHOUT= 0
##$TUNXOUT= 0
##$USERA1= <user>
##$USERA2= <user>
##$USERA3= <user>
##$USERA4= <user>
##$USERA5= <user>
##$V9= 5
##$VALIST= <valist>
##$VCLIST= <CCCCCCCCCCCCCCC>
##$VD= 0
##$VDLIST= <DDDDDDDDDDDDDDD>
##$VPLIST= <PPPPPPPPPPPPPPP>
##$VTLIST= <TTTTTTTTTTTTTTT>
##$WBST= 1024
##$WBSW= 4
##$XGAIN= (0..3)
0 0 0 0
##$XL= 0
##$YL= 0
##$YMAX_a= 6027123
##$YMIN_a= -13365665
##$ZGOPTNS= <>
##$ZL1= 120
##$ZL2= 120
##$ZL3= 120
##$ZL4= 120
##$ABSF1= 14.96117
##$ABSF2= -5.597012
##$ABSG= 5
##$ABSL= 3
##$ALPHA= 0
##$AQORDER= 0
##$ASSFAC= 0
##$ASSFACI= 0
##$ASSFACX= 0
##$ASSWID= 0
##$AUNMP= <proc_prof1d_extract.lims>
##$AXLEFT= 0
##$AXNAME= <>
##$AXNUC= <1H>
##$AXRIGHT= 0
##$AXTYPE= 0
##$AXUNIT= <>
##$AZFE= 0.1
##$AZFW= 0.1
##$BCFW= 0
##$BC_mod= 0
##$BYTORDP= 0
##$COROFFS= 0
##$CY= 15
##$DATMOD= 1
##$DC= 0
##$DFILT= <>
##$DTYPP= 0
##$F1P= 0
##$F2P= 0
##$FCOR= 0.5
##$FTSIZE= 131072
##$FT_mod= 6
##$GAMMA= 0
##$GB= 0
##$INTBC= 1
##$INTSCL= 1
##$ISEN= 128
##$LB= 0.3
##$LEV0= 0
##$LPBIN= 0
##$MAXI= 10000
##$MC2= 0
##$MEAN= 0
##$ME_mod= 0
##$MI= 0
##$NCOEF= 0
##$NC_proc= -2
##$NLEV= 6
##$NOISF1= 0
##$NOISF2= 0
##$NSP= 0
##$NTH_PI= 0
##$NZP= 0
##$OFFSET= 14.96117
##$PC= 1
##$PHC0= -82.35352
##$PHC1= 0
##$PH_mod= 1
##$PKNL= yes
##$PPARMOD= 0
##$PPDIAG= 0
##$PPIPTYP= 0
##$PPMPNUM= 2147483647
##$PPRESOL= 1
##$PSCAL= 4
##$PSIGN= 0
##$PYNMP= <proc.py>
##$REVERSE= no
##$SF= 400.0200095686
##$SI= 131072
##$SIGF1= 0
##$SIGF2= 0
##$SINO= 400
##$SIOLD= 131072
##$SPECTYP= <>
##$SREGLST= <1H.CDCl3>
##$SSB= 0
##$STSI= 131072
##$STSR= 0
##$SW_p= 8223.68421052631
##$SYMM= 0
##$S_DEV= 0
##$TDeff= 65536
##$TDoff= 0
##$TI= <>
##$TILT= no
##$TM1= 0
##$TM2= 0
##$TOPLEV= 0
##$USERP1= <user>
##$USERP2= <user>
##$USERP3= <user>
##$USERP4= <user>
##$USERP5= <user>
##$WDW= 1
##$XDIM= 131072
##$YMAX_p= 420752572
##$YMIN_p= -11096
##$CURPLOT= <Network HP LaserJet P1505>
##$CURPRIN= <$Network HP LaserJet P1505>
##$DFORMAT= <normdp>
##$LAYOUT= <+/1D_H.xwp>
##$LFORMAT= <normlp>
##$PFORMAT= <normpl>
##$SURQMSG= 1
$$ End of Bruker specific parameters
$$ ---------------------------------
##NTUPLES= NMR SPECTRUM
##VAR_NAME=  FREQUENCY,     SPECTRUM/REAL,   SPECTRUM/IMAG
##SYMBOL=    X,             R,               I
##VAR_TYPE=  INDEPENDENT,   DEPENDENT,       DEPENDENT
##VAR_FORM=  AFFN,          ASDF,            ASDF
##VAR_DIM=   131072,        131072,          131072
##UNITS=     HZ,            ARBITRARY UNITS, ARBITRARY UNITS
##FACTOR=    0.0627417313425164, 1,          1
##FIRST=     8223.62146879497, 1604,         -59437
##LAST=      0,             4255,            -59338
##MIN=       0,             -11096,          0
##MAX=       8223.62146879497, 420752572,    0
$$ Real data points
##PAGE= N=1
##DATA TABLE= (X++(R..R)), XYDATA
$$ [...]
67760 97703 97886 97587 97568 98127 98680 98601 98231 98558 99897 101369 101949 101627 101232 101321 101644 101623 100947 99766 98638
67741 98638 98261 98857 99832 100358 100245 99841 99144 97674 95339 92791 90527 88222 85532 83116 82108 82703
67725 82703 83872 84570 84649 84507 84274 83728 82798 81856 81397 81467 81474 80794 79626 78973 79512 80676 81262 80828 80069
67706 80069 79781 79931 79905 79237 77830 75804 73595 72059 71946 73067 74277 74464 73510 72256 71691 72226 73523
67689 73523 74810 75525 75890 76779 78750 81300 83355 84448 85012 85542 86042 86491 87244 88485 89716 90424 90949
67672 90949 92033 93649 95034 95893 96758 97933 98825 98835 98389 98512 99605 101144 102406 103064 103137 102812 102403
67655 102403 102232 102329 102278 101416 99340 96384 93564 91805 91208 91255 91663 92597 93930 94810 94392 92788 90970
67638 90970 89814 89499 89699 90002 90126 89981 89709 89627 90066 91143 92649 94215 95702 97358 99405 101600 103435
67621 103435 104748 105901 107388 109500 112267 115381 118155 119958 120843 121556 122894 125148 127955 130297 130917
67606 130917 129359 126617 124182 122446 120563 117863 114648 111479 108534 105951 104032 102664 101209 99414
67592 99414 97807 96698 95470 93536 91399 90033 89591 89419 89075 88611 88119 87564 86938 86165 85140 84187 83954
67575 83954 84353 84230 82815 81006 80279 80739 81216 81005 80437 79844 79133 78524 78674 79691 80838 81582 82249 83282
67557 83282 84526 85639 86698 87976 89448 90779 91524 91283 90071 88605 87720 87369 86714 85316 83649 82242
67541 82242 80973 79603 78427 77857 77711 77414 76761 76105 75918 76420 77476 78649 79471 79830 79921 79768 79071 77762
67523 77762 76469 76060 76710 77566 77471 76114 74432 73673 74020 74446 74079 73221 72643 72436 72296 72524 73690 75343
67505 75343 76096 75293 73746 72559 72007 71988 72685 74083 75500 76346 76951 77922 79040 79533 79302 79175 79856 81142
67487 81142 82233 82546 82172 81758 81859 82256 82043 80594 78246 75885 74161 73311 73364 74095 74972 75577 75929 76142
67469 76142 76071 75721 75700 76640 78244 79469 79704 79302 78909 78727 78614 78520 78583 78980 79801 80884 81751 81995 81824
67450 81824 81935 82681 83584 83900 83496 82963 82933 83517 84407 85313 86191 87101 88004 88789 89411 89958 90561 91254 91846
67431 91846 91939 91238 90007 89027 88800 88866 88256 86641 84615 82775 81113 79625 78944 79664 81252 82390 82470
67414 82470 82174 82335 82808 82877 82395 82010 82304 83169 84058 84559 84603 84290 83715 82930 82040 81283 80882 80725 80312 79306
67394 79306 78077 77415 77589 78053 78253 78363 78874 79686 80150 79948 79444 79048 78739 78414 78272 78491 78838 78974 78979
67375 78979 79266 80074 81260 82437 83110 82903 81984 81114 80957 81434 82011 82454 82936 83540 84072 84383 84523 84527 84367
67356 84367 84132 84080 84473 85474 87012 88552 89254 88765 87714 87028 86885 86793 86522 86348 86402 86404 86189 85998 86062 86363
67336 86363 86959 88092 89747 91535 93192 94786 96206 96978 96970 96891 97607 99124 100538 100898 99970 98350 97035
67319 97035 96648 96886 96886 96232 95303 94635 94335 94327 94638 95067 94985 93970 92475 91421 91324 92203 94124 97220 101098
67300 101098 104704 107086 108100 108286 108222 108190 108361 108995 110267 111883 113133 113480 113001 112088 110903 109390 107710
67283 107710 106265 105294 104736 104496 104516 104541 104166 103219 101877 100536 99859 100721 103404 106815 109220 109990 110078 110596
67265 110596 111654 112904 114408 116288 118055 118994 118978 118358 117365 116161 115169 114706 114485 113998 113225 112463 111705
67248 111705 110760 109834 109348 109267 109214 109250 109890 111231 112612 113316 113280 112984 112998 113657 114819 115849 116133 115689 115033
67229 115033 114533 114247 114309 114950 116059 117161 117980 118683 119387 119816 119625 118861 117947 117437 117846 119352 121447 123129
67211 123129 123727 123484 123238 123668 124887 126515 127947 128711 128778 128528 128366 128466 128911 129862 131390 133197 134666
67194 134666 135300 135087 134484 134025 133912 133971 133985 133982 134117 134362 134476 134303 133957 133679 133612 133801 134345 135361 136725 137981
67174 137981 138728 139076 139482 140059 140393 140279 140279 141095 142613 144139 145450 146922 148580 149815 150345 150767 151662
67157 151662 152751 153512 154114 155001 155902 156118 155710 155610 156422 157775 159062 160259 161642 163111 164192 164588
67141 164588 164501 164496 165182 166861 169251 171536 172882 173054 172601 172373 172843 173933 175447 177386 179569 181276 181825
67124 181825 181525 181512 182487 184118 185799 187343 188567 188862 187847 186142 184925 184929 186174 188259 190370 191475
67108 191475 191292 190899 191702 193917 196660 199242 201643 203860 205694 207281 209032 210873 212250 213113 214147
67093 214147 215791 217643 219223 220690 222369 224045 225252 225927 226379 226891 227721 229177 231259 233409 234970
67078 234970 235833 236413 237191 238516 240627 243474 246575 249329 251451 252948 253829 254161 254369 255144 256854 259184
67062 259184 261511 263604 265793 268414 271246 273729 275700 277585 279745 281935 283655 284825 285816 286985
67048 286985 288468 290245 292078 293559 294639 295999 298438 301877 305386 308216 310422 312473 314673 317110
67034 317110 319813 322814 326288 330598 335831 341279 345801 348900 351089 353114 355209 357289 359476 362094
67020 362094 365318 369038 372928 376593 379856 382993 386456 390305 394166 397828 401559 405714 410298 415055
67006 415055 419702 423931 427514 430671 434093 438316 443169 448030 452574 457127 462317 468409 474989 481290
66992 481290 486906 492101 497372 502870 508430 513914 519225 524141 528596 533069 538319 544673 551834 559343
66978 559343 566872 574180 581125 587739 594047 600022 606152 613673 623477 634790 645696 655077 663406 671556
66964 671556 679745 687965 696649 706246 716609 727341 738383 749822 761404 772699 783595 794363
66952 794363 805502 817636 831149 845691 860437 875058 889969 905405 920922 936239 951897
66941 951897 968506 985833 1003352 1021265 1040212 1060211 1080685 1101369 1122504 1144138 1165982
66930 1165982 1188029 1210725 1234406 1259055 1284677 1311338 1338678 1365929 1392785 1419924 1448355
66919 1448355 1478400 1509533 1541048 1572730 1604929 1638203 1672897 1709037 1746573 1785576 1826070
66908 1826070 1867725 1909913 1952141 1994453 2037418 2081715 2127618 2174855 2223035 2272120 2322251
66897 2322251 2373223 2424536 2476120 2528577 2582427 2637394 2692762 2748189 2803784 2859489 2914790
66886 2914790 2969145 3022474 3075192 3127780 3180271 3232056 3282328 3330773 3377647 3423130 3466809
66875 3466809 3507951 3546068 3581044 3612989 3642180 3668973 3693466 3715334 3734034 3748995 3759579
66864 3759579 3765271 3766184 3763055 3756421 3746042 3731459 3712847 3690871 3665912 3637919 3607001 3573691
66852 3573691 3538495 3501413 3462081 3420228 3375899 3329304 3280562 3229758 3177287 3123882 3069972
66841 3069972 3015174 2958909 2901493 2844058 2787297 2730938 2674686 2618936 2564029 2509434 2454403
66830 2454403 2399101 2344428 2290983 2238790 2187785 2137918 2088964 2040887 1994232 1949485 1906166
66819 1906166 1863298 1820705 1779065 1738663 1699030 1660039 1622412 1586547 1551505 1515979 1479916
66808 1479916 1444544 1410917 1379073 1348543 1319004 1290147 1261454 1232561 1203794 1175982 1149682
66797 1149682 1124839 1101175 1078567 1056794 1035258 1013403 991407 970023 949721 930345 911672
66786 911672 893830 876941 860733 844821 829101 813667 798582 783954 769906 756270 742632
66775 742632 728902 715487 702599 689927 677312 665278 654267 643772 632905 621594 610597
66764 610597 600457 591029 581924 572808 563394 553735 544476 536235 528777 521339 513665 506032 498351 490082
66750 490082 481253 472802 465515 459179 453089 446896 440661 434505 428620 423286 418481 413681 408286 402151
66736 402151 395579 389067 383168 378276 374307 370711 366919 362662 357956 353062 348445 344375 340533 336353
66722 336353 331790 327371 323433 319750 316007 312159 308219 304133 300050 296257 292627 288661 284353 280528
66708 280528 277851 275882 273587 270550 267250 264353 262158 260596 259331 257854 255836 253462 251173 249083
66694 249083 246808 243880 240219 236226 232535 229646 227618 226076 224475 222389 219691 216678 213958 211950
66680 211950 210406 208613 206126 203088 199895 196848 194206 192213 190843 189771 188731 187698 186626 185295
66666 185295 183599 181736 179941 178252 176731 175640 175132 174953 174686 174165 173468 172670 171825 170988 170066 168763
66650 168763 166933 164881 163119 161915 161264 161129 161466 162017 162290 161775 160206 157775 155230 153527 153077 153360
66634 153360 153427 152800 151731 150713 149914 149090 147851 146035 143940 142192 141296 141232 141504 141495 140817 139463 137788
66617 137788 136248 135028 133915 132615 131136 129774 128792 128223 127979 128008 128265 128586 128642 128074 126714 124769 122807
66600 122807 121512 121286 121952 122870 123406 123352 122887 122293 121822 121657 121705 121518 120846 120221 120484 121534 122113 121230 119317
66581 119317 117534 116310 115201 113932 112806 112076 111558 111059 110745 110929 111739 112941 113856 113625 112067 110141
66565 110141 109033 108896 109067 109353 110198 111462 111991 110941 108869 106964 105702 104780 104051 103830 104379 105442
66549 105442 106279 106050 104429 102047 100040 98969 98475 98090 97896 98079 98368 98437 98488 98839 99200 98939 98019 97106
66531 97106 96701 96547 96067 95121 94215 94043 94818 95993 96694 96474 95544 94333 93058 91777 90547 89383 88327
66514 88327 87639 87587 87977 88284 88376 88659 89270 89684 89517 89250 89612 90573 91482 91980 92204 92226 91857 90987 89722 88178
66494 88178 86489 85009 84179 84142 84666 85352 85770 85637 85106 84665 84529 84411 84188 84370 85409 86866 87891 88345
66476 88345 88757 89220 89058 87802 86013 84781 84749 85770 87239 88486 89036 88716 87595 85919 84128 82699
66460 82699 81757 81025 80395 80300 81123 82435 83311 83335 82897 82549 82568 83113 84257 85640 86515 86446 85814 85488 86047
66441 86047 87274 88229 87962 86456 84836 84260 84715 85205 85090 84734 84825 85566 86726 88033 89247 90071 90283
66424 90283 89830 88819 87546 86483 85889 85478 84820 84077 83845 84214 84499 84142 83414 82901 82632 82127 81125 79942
66406 79942 79185 79271 80090 80977 81192 80532 79355 78042 76754 75713 75187 74956 74256 72673 70802 69650 69642 70575
66388 70575 72156 74040 75587 76314 76610 77388 78862 80204 80661 80567 80836 81723 82557 82651 82125 81740 82099 83141
66370 83141 84325 85151 85472 85348 84782 83741 82458 81496 81354 81988 82805 83174 82963 82619 82735 83481 84419 84922
66352 84922 84785 84327 83839 83109 81769 80045 78791 78582 79033 79293 79056 78713 78605 78578 78403 78259 78456 78894
66334 78894 79120 78870 78361 78077 78391 79295 80338 80866 80516 79472 78251 77369 77213 77906 79049 79836 79865 79720
66316 79720 80357 81944 83642 84542 84397 83407 81794 79934 78502 78063 78584 79587 80642 81420 81473 80478 78766
66299 78766 77263 76641 76741 76984 77175 77607 78489 79607 80589 81245 81528 81413 81111 81187 82082 83463 84340 83997
66281 83997 82639 81024 79709 78808 78260 77963 77721 77312 76764 76397 76523 77159 78066 78983 79791 80493 81139 81757
66263 81757 82302 82598 82370 81477 80201 79126 78590 78350 78014 77634 77547 77723 77716 77344 76906 76575 76057 75223 74621
66244 74621 74854 75721 76514 76976 77439 78064 78523 78556 78371 78346 78637 79183 79799 80182 80152 80028 80436 81584 82979
66225 82979 84008 84525 84667 84375 83432 81918 80396 79586 79853 80888 81898 82247 81961 81439 80807 79952 79230
66208 79230 79534 81218 83297 84316 83958 83289 83402 84341 85526 86688 87901 88983 89434 89093 88450 88126 88202
66191 88202 88248 87867 87063 86124 85323 84710 84122 83396 82595 82006 81897 82390 83522 85142 86699 87518 87549 87555 88157
66172 88157 88972 89164 88616 87949 87427 86688 85644 84838 84471 83811 82204 80172 78848 78648 79121 79824 80566 80991
66154 80991 80789 80423 80889 82473 84292 85398 85840 86325 87179 88075 88563 88513 88115 87737 87719 88111 88562 88608 88083
66135 88083 87176 86151 85149 84321 84052 84782 86457 88322 89534 89983 90211 90564 90863 91004 91292 91820 92048
66118 92048 91566 90954 91161 92216 93247 93764 94217 95113 96218 96959 97187 97129 96893 96361 95526 94710 94419 94967
66100 94967 96171 97482 98549 99484 100404 101026 101108 101033 101363 101940 102088 101714 101541 102068 102926 103507 103703 103720 103725 103965
66080 103965 104765 105992 107004 107441 107611 107717 107334 106240 105192 105083 105646 105901 105685 105813 106625 107327 107129
66063 107129 106318 105699 105477 105265 104869 104477 104170 103746 103093 102391 101860 101579 101571 101825 102152 102313 102453 103121 104639
66044 104639 106595 108259 109395 110322 111268 112101 112759 113451 114189 114552 114359 114259 115107 116808 118276 118617 117970
66027 117970 117160 116873 117304 118268 119395 120401 121296 122267 123363 124531 125897 127661 129662 131415 132782 134225
66011 134225 136134 138187 139749 140733 141732 143371 145870 149186 153148 157334 161190 164553 167889 171681 175696
65996 175696 179206 181986 184652 187741 190794 192769 193240 192696 191691 190245 188170 185478 182178 178101 173288
65981 173288 168263 163633 159658 156436 154055 152220 150165 147456 144567 142199 140394 138843 137653 137100
65967 137100 136868 136338 135509 134923 134735 134599 134435 134533 134869 135079 135185 135567 136132 136371 136417 137157 138919 140860 142198
65948 142198 143373 145411 148626 152410 155929 158640 160554 162320 164654 167469 170077 172328 174796 177536
65934 177536 179616 180503 181058 182390 184459 186704 189412 193311 198077 202418 205717 208702 212315 216672 221321
65919 221321 225911 230325 234521 238512 242320 245932 249404 252768 255691 257510 258043 258051 258407 258982 258874 257607
65903 257607 255590 253469 251521 249735 248029 246327 244600 242736 240235 236379 231084 225293 220039 215367
65889 215367 210669 205728 200809 195921 190808 185655 181058 177202 173746 170628 168240 166503 164435 161209
65875 161209 157329 154258 152974 153078 153212 152207 150015 147703 146468 146591 147390 148103 148520 148782 148898 148662
65859 148662 147923 146819 145764 145235 145479 146418 147822 149477 151188 152820 154355 155664 156294 155898 155005 154805
65843 154805 155850 157460 158763 159795 161008 162299 163350 164576 166751 169715 172336 173901 174814 175838
65829 175838 177450 180180 184771 191350 198877 205965 212083 217652 223170 228565 233300 236825 238908 239612
65815 239612 239010 237030 233743 229637 225322 221000 216481 211680 206789 202020 197444 193162 189400 186397
65801 186397 184211 182488 180430 177468 174206 172155 172067 173047 173857 174523 175746 177280 178207 178749 180419 183979
65785 183979 188392 192299 195589 198928 202703 207250 213280 221024 229297 236445 242063 247027 251860 255829
65771 255829 257783 257346 255034 251536 247092 241502 234756 227612 221322 216650 213426 211212 210039 210190 211656
65756 211656 214324 218506 224723 232928 242317 252014 261691 271546 281977 293262 305210 316962 327304
65743 327304 335411 341299 345501 348301 349291 347632 342740 334681 324011 311451 297834 284035 270574
65730 270574 257306 243906 230671 218519 208154 199562 192413 186494 181557 177172 173059 169286 165816
65717 165816 162194 158085 153913 150532 148304 146905 146002 145635 145724 145605 144543 142702 141258 141307 142786 144654
65701 144654 146027 146822 147308 147528 147444 147299 147443 147980 148955 150653 153207 156024 158212 159617 160996 163111
65685 163111 166120 169896 174344 179253 184345 189772 196160 203860 212529 221677 231301 241712 253103 265510
65671 265510 278890 292995 307475 322236 337308 352161 365672 377120 386774 395166 402231 407610
65659 407610 411382 413947 415502 416196 416541 417127 418033 419016 420086 421444 423010 424541 426009 427257 427372 425123
65643 425123 420099 412843 403720 392240 377827 360819 342399 323804 305811 288690 272359 256705
65631 256705 241976 228754 217439 207915 199802 192797 186628 180935 175494 170484 166262 162860 159907
65618 159907 157046 154279 151802 149668 147764 146143 145136 145019 145626 146383 146678 146095 144508 142318 140585
65603 140585 140466 142136 144475 146106 146687 146969 147733 149030 150429 151674 152870 154190 155617 156990 158266
65588 158266 159715 161843 165066 169460 174820 180926 187720 195283 203734 213188 223784 235689 248950
65575 248950 263236 277791 291854 305169 317930 330136 341133 349890 355688 358539 359055 357939 355394
65562 355394 350867 343471 332853 319702 305372 290975 276902 263105 249709 237235 226225 216768
65550 216768 208531 201245 194951 189680 185149 181002 177280 174354 172453 171434 171053 171245 172093 173650 175750
65535 175750 177977 179962 181877 184373 187737 191243 193675 194401 193603 191634 188655 184901 180836 176890 173334
65520 173334 170381 167973 165532 162409 158698 155183 152433 150447 149174 148723 148862 148997 148972 149253 149962 150418
65504 150418 150209 150093 151069 152967 154728 155920 157148 159026 161456 164071 166804 169764 172913 176160 179569
65489 179569 183303 187483 192116 197070 202065 206759 210770 213628 214948 214886 214223 213731 213539 213269 212589 211312
65473 211312 209156 205851 201562 196922 192502 188403 184414 180424 176575 173014 169619 166116 162615 159854
65459 159854 158576 158620 158922 158537 157409 156083 155020 154393 154236 154510 155139 156104 157304 158310 158635 158438 158545
65442 158545 159549 161237 163154 165291 167801 170413 172630 174365 176020 178081 180903 184545 188435 191480
65428 191480 193000 193343 193148 192259 190002 186440 182682 179790 177845 176229 174471 172593 170936 169842 169387
65413 169387 169300 169204 168956 168692 168597 168708 168896 169029 169267 170158 172176 175090 178102 180733 183267 186154 189371
65396 189371 192659 195998 199480 202889 205788 207842 208804 208427 206705 204061 201036 197942 194947 192214 189737
65381 189737 187395 185352 184086 183788 184165 185026 186524 188480 190164 191238 192365 194226 196512 198548 200401
65366 200401 202505 204664 206419 208165 210915 214980 219802 225056 231078 238155 246220 255347 265780 277258
65352 277258 288938 300134 310510 319465 325996 329482 330084 328353 324958 320817 316707 312475 307213 300454
65338 300454 292746 284934 277410 270229 263340 256440 249086 241239 233401 226162 219965 215229 212036 209632
65324 209632 206900 203517 200069 196919 193710 190259 187193 185214 184221 183605 183031 182505 182084 181851 181908 182042
65308 182042 181730 180766 179652 179140 179625 181129 183508 186415 189330 191841 193801 195291 196794 199223 203204
65293 203204 208180 212720 215824 217511 218193 218172 217840 217602 217234 216035 213933 211890 210776 210418 210142 209680
65277 209680 209062 208142 206828 205433 204228 202910 201022 198734 196733 195403 194440 193247 191492 189363 187344
65262 187344 185696 184259 182974 182306 182628 183396 183646 183255 182884 182640 181737 179735 177194 174720 172281 169922
65246 169922 168131 166874 165231 162862 161019 161075 162662 164253 165123 165718 166506 167521 168855 170548 172018
65231 172018 172498 172032 171341 170788 170282 170017 170409 171228 171644 171318 170710 170113 169141 167509 165775 164861 165117 166145
65213 166145 167313 168265 169042 169802 170470 170866 171232 172183 173781 175147 175471 175059 174763 174768 174646 174351 174298 174518 174550
65194 174550 174250 174061 174421 175500 177434 180046 182405 183551 183853 184773 186948 189393 190945 191733 192602 193820
65178 193820 195059 196204 197426 198674 199694 200431 200918 200978 200560 200344 201429 204260 208059 211504 213945 216015
65162 216015 219036 223674 229157 234048 237857 241530 246279 252398 259565 267807 277505 288624 300664 313548
65148 313548 328054 345089 364796 386640 410184 435603 463587 494929 529876 567361 604759
65137 604759 638911 667965 692447 714439 735704 756551 776206 793709 808169 818462 823181 821232
65125 821232 812555 798342 780582 761229 741463 721337 699870 675534 647074 614373 578698 542002
65113 542002 505947 471558 439455 410040 383437 359623 338672 320615 305066 291356 279112
65102 279112 268317 258852 250455 243231 237573 233292 229441 225440 221807 219223 217367 215398 213282 211837
65088 211837 211553 212096 212983 214067 215152 215668 215092 213442 211235 209048 207162 205479 203818 202384 201677 201757
65072 201757 201997 201978 202235 203536 205676 207695 209174 210536 212031 213240 213803 213964 214078 214162 214307 214981 216420
65055 216420 218078 219138 219439 219510 219835 220396 220881 221107 221163 221176 220965 220115 218602 217092 216182 215457 213888 211222
65037 211222 208312 205871 203560 200748 197609 194847 192656 190618 188506 186571 185001 183604 182212 181038
65023 181038 180369 180094 179819 179402 179215 179768 181144 182879 184420 185577 186524 187556 188986 191036 193559 196022
65007 196022 198171 200577 204083 208691 213468 217603 221085 224182 226774 228481 229094 228655 227491 226365 226101
64992 226101 226658 227063 226755 226552 227726 230440 233760 236920 239794 242204 243675 244085 243853 243195 241763 239362
64976 239362 236450 233487 230292 226553 222573 218909 215495 211768 207643 203789 200841 198814 197400 196410
64962 196410 195710 195023 194029 192552 190591 188444 186786 186232 186632 187149 187213 187077 187173 187356 187230 186882 186770 186977
64944 186977 187158 187208 187487 188300 189519 190818 191963 192790 193275 193675 194339 195313 196378 197421 198362 198788 198202
64927 198202 196732 195082 193682 192419 191363 191051 191684 192654 193447 194521 196647 199715 202824 205386 207527
64912 207527 209547 211536 213543 215694 218139 221228 225575 231495 238472 245658 252875 260714 269682 279666
64898 279666 290115 300231 308990 315557 319986 323120 325629 327429 328166 327916 327134 326107 324676 322476
64884 322476 319315 315324 310749 305619 299802 293425 287022 281133 276008 271838 268873 267005 265563 264007
64870 264007 262537 261585 260969 260110 258859 257468 255925 254014 251973 250242 248424 245253 239983 233358 226918
64855 226918 221769 218160 215723 213744 211584 209210 207209 206092 205811 205951 206052 205701 204802 203889 203748 204505
64839 204505 205388 205569 204893 203755 202783 202774 204343 207204 210195 212404 213992 215657 217672 219829 222029 224517
64823 224517 227679 231891 237339 243782 250742 258161 266547 276258 286971 298218 310078 322831 336132
64810 336132 348981 360453 370047 377367 381831 382841 380083 373664 364158 352541 339976 327598 316350
64797 316350 306725 298530 291088 283804 276485 269196 262156 255860 250941 247643 245642 244471 243866 243638 243652
64782 243652 244221 246057 249433 253705 258119 262838 268620 275619 283157 290813 299192 309257 321122 333849
64768 333849 346335 358083 369030 379015 387735 395183 401706 407489 412308 416005 418856 421087 422351
64755 422351 422183 420780 418740 416103 412270 406915 400365 392942 384550 375119 364932 354265 343222 332154
64741 332154 321753 312499 304474 297868 293043 289795 287227 284781 282757 281355 279947 278015 276182 275393
64727 275393 275454 275358 274903 275014 276420 278817 281530 284324 287259 290297 293343 296364 299189 301407 302588 302487
64711 302487 301042 298400 294910 290832 286134 280796 275206 269908 264976 259987 254663 249313 244612 241095
64697 241095 238817 237355 236221 235354 235006 235074 234989 234656 235082 237472 241826 246989 252010 256999 262693 269773
64681 269773 278654 289364 301378 313909 326555 339448 352732 366255 379771 392890 404522 412756
64669 412756 415830 413332 406320 396271 384113 370324 355803 342184 330902 322026 314448 307322 300957
64656 300957 296136 293125 291758 292011 293856 296790 300141 303798 308103 313203 319108 326376 335990 348273
64642 348273 362413 377319 392653 408847 426425 445354 464673 482587 497323 508186 515647 520417
64630 520417 522715 522484 519874 515291 509176 501875 493495 483941 473336 462395 451957 442148 432519 423091
64616 423091 414643 407690 401766 396132 390754 385980 381606 376867 371231 364667 357250 349115 340834 333163
64602 333163 326125 318813 310488 301599 293302 286187 279985 274519 270347 268082 267423 267342 267254 267587 269117 272024
64586 272024 275824 279951 284214 288834 294204 300451 306986 312669 316670 319086 320546 321383 321507 320876 319650
64571 319650 317891 315529 312699 309697 306414 302154 296342 289312 282219 276187 271577 267907 264417 260769
64557 260769 257261 254314 251874 249594 247526 246239 246088 246660 247210 247392 247280 246859 245962 244799 244167 244822
64541 244822 246759 249321 251867 254107 255768 256371 255613 253835 251846 250322 249479 249150 248850 247911 246065 243973
64525 243973 242834 243259 244867 247080 249806 253051 256323 258994 261101 263346 266414 270606 275958 282219
64511 282219 288783 295159 301652 309206 318448 329115 340483 352059 363687 375188 386146 396033 404454
64498 404454 411185 415931 418064 416846 412055 404292 394571 383758 372475 361294 350727 341140 332862
64485 332862 326164 320939 316669 312994 310079 308114 306687 305088 303082 300942 298785 296315 293233 289558
64471 289558 285555 281712 278733 277129 276741 276959 277419 278225 279517 281187 283055 285061 287226 289629 292292
64456 292292 294850 296526 296853 296277 295700 295470 295240 294686 293913 293253 293179 294295 296789 299876 302415 304238 306330
64439 306330 309611 314166 319822 326737 334958 343970 353345 363599 375997 391568 410541 432570 457268
64426 457268 484706 515596 550884 591200 636964 688995 748569 816681 893656 979635 1074823
64415 1074823 1178472 1287461 1396215 1498507 1590003 1669754 1739348 1800304 1851942 1891620
64405 1891620 1916449 1924338 1914023 1885604 1841634 1786716 1724972 1657756 1583804 1501155 1408846
64394 1408846 1307871 1201581 1095000 992999 898834 814282 740373 677229 623581 577435
64384 577435 537507 503678 476059 454022 436217 421201 408002 396352 386402 378106 370919 364190
64372 364190 357620 351178 344803 338485 332412 326727 321327 316229 311910 308853 306857 305217 303595 302339
64358 302339 301912 302346 303420 305175 308087 312710 319063 326395 333751 340839 348129 355963 363839 370684 375507
64343 375507 377624 376782 373572 369418 365548 361999 358015 353256 348211 343577 339727 336746 334488 332637
64329 332637 331142 330582 331652 334307 337891 342037 346749 351519 355117 356670 356441 355044 352414 348131 342537
64314 342537 336859 332157 328548 325509 322484 319059 314856 309645 303606 297356 291600 286682 282460 278707
64300 278707 275596 273596 272752 272329 271458 270071 268898 268598 269274 270908 273744 277908 282959 288326 294046
64285 294046 300630 308190 316208 324218 332271 340551 349049 357899 367586 378297 389346 399745 409170
64272 409170 417835 425578 431672 435616 437533 437659 435997 432747 428722 424973 422153 420381 419519 419318 419458
64257 419458 419530 418924 416815 412551 406111 397888 388057 376555 363794 350958 339307 329432 321242 314317
64243 314317 308118 302305 297149 293309 290973 289559 288460 287641 287177 286808 286457 286716 288117 290159 291819
64228 291819 292899 294152 296006 297846 298838 298962 298971 299590 300976 302634 303650 303242 301327 298499 295333 291923
64212 291923 288202 284509 281589 280018 279687 279894 279995 280042 280756 282724 285675 288650 290954 292805 295086 298619
64196 298619 303763 310518 318799 328534 339648 352084 365912 381298 398232 416287 434730 452776
64184 452776 469562 483874 494220 499385 498943 493290 483384 470460 455677 439771 423122 406309
64172 406309 390414 376502 364707 354040 343281 332176 321735 313292 307276 303072 299984 297919
64160 297919 296899 296382 295659 294712 294105 294117 294659 296015 298826 303055 307643 311641 315072 318221 320695 321892
64144 321892 322051 322090 322510 323032 323244 323074 322620 321927 320981 319663 317806 315584 313715 312911 313245 314355 316101
64127 316101 318641 321995 326018 330715 336176 342162 348199 354149 360415 367553 375941 385705 396606 408032
64113 408032 419536 431382 444069 457191 469174 478460 484754 488934 491964 494179 495529 496284 497323
64100 497323 499691 503903 509713 516506 523676 530574 536429 540642 543069 543802 542818 540103 535991 531109 525919
64085 525919 520505 514728 508540 502165 496010 490242 484476 478198 471585 465442 460098 454829 448762 441960
64071 441960 435147 428740 422744 417314 412750 408959 405534 402346 399508 396836 394009 391353 389841 390010
64057 390010 391313 392795 394059 395375 397191 399805 403350 407862 413374 419975 427670 436323 445962 456981
64043 456981 469615 483305 497003 510181 523176 536482 550067 563415 575807 586476 594875 601043
64031 601043 605470 608467 609920 609697 608047 605525 602792 600514 599021 597907 596237 593267 588767 582629
64017 582629 574569 564375 552215 538652 524611 511284 499553 489286 479601 470049 461217 453966
64005 453966 448464 444277 441067 438809 437471 436894 436964 437656 438885 440458 442234 444301 447042 450955 456219
63990 456219 462448 469061 475896 483204 491090 499343 507868 516845 526194 535301 543668 551578 559713 568251
63976 568251 576791 585142 593746 603147 613384 624182 635575 648000 661859 677321 694696 714569
63964 714569 737228 762122 788410 816104 846213 879671 916661 957370 1002957 1055199 1115404
63953 1115404 1184212 1262347 1350973 1451257 1564190 1691063 1833787 1994443 2174635 2375285
63943 2375285 2596678 2838428 3099453 3378028 3671797 3977696 4291976 4610243 4927406
63934 4927406 5237699 5534947 5812665 6063901 6281486 6459155 6592565 6679099 6717058 6705566
63924 6705566 6645127 6537542 6385187 6190996 5959412 5696842 5410728 5108264 4795927 4479633
63914 4479633 4164809 3856293 3558319 3274509 3007767 2760248 2533325 2327449 2142159
63905 2142159 1976608 1830096 1701803 1590082 1492507 1406802 1331540 1265889 1208978 1159567
63895 1159567 1116111 1077055 1041247 1008072 977081 947661 919253 891626 864584 837718 810927
63884 810927 784900 760480 737742 716343 696596 679368 664912 652642 642194 633943 628236 624864
63872 624864 623596 624572 627861 633235 640623 650151 661518 674081 687880 703742 721878 741169 760389
63859 760389 779405 798468 817052 834227 849664 863444 875303 884987 893022 900230 906583 911320
63847 911320 913947 914325 911884 905759 895885 883191 868464 851705 832869 812488 791054 768212 743193
63834 743193 715945 687485 659160 631863 605946 581652 559284 538904 520065 502156 485048
63823 485048 469097 454466 440788 427712 415435 404390 394644 385978 378358 371953 366777 362667 359541
63810 359541 357348 355765 354224 352316 350050 347739 345772 344407 343548 342757 341580 339807 337359 334108 329997
63795 329997 325233 320213 315315 310776 306589 302511 298398 294554 291401 288743 285843 282476 279425 277534
63781 277534 276666 276061 275365 274814 274561 274452 274391 274428 274463 274293 274024 274053 274571 275371 276263 277302 278474 279420 279746
63762 279746 279521 279228 279194 279208 278841 278085 277401 277055 276716 276022 275324 275360 276325 277718 279087 280328 281229 281436 281179
63743 281179 281395 282783 285216 288368 292253 296642 300602 303319 304967 306150 306932 307204 307684 309553 313042
63728 313042 317108 320643 323445 325945 328545 331420 334542 337736 340929 344371 348298 352385 355893 358316
63714 358316 359624 359971 359514 358441 356821 354493 351491 348491 346429 345666 345843 346486 347375 348416 349566 350911
63698 350911 352464 353934 355075 356216 358041 360824 364181 367543 370510 372853 374576 375980 377290 378271
63684 378271 378586 378411 378254 378255 378171 378009 378085 378411 378588 378417 378113 377813 377383 376906 376782 377056 377085 376238 374659 373066
63664 373066 372038 371656 371538 371019 369597 367462 365375 363791 362333 360321 357580 354485 351405 348393 345348
63649 345348 342273 339389 337074 335582 334773 334234 333766 333616 334124 335289 336819 338584 340863 344087 348333
63634 348333 353158 358052 362969 368130 373322 377884 381682 385678 390998 397682 404971 412646 421374 431662
63620 431662 443164 455341 468270 482401 497923 514757 532939 552622 573853 596633 621063
63609 621063 647131 674378 702041 729558 756756 783448 808814 831177 848517 859468 863997 863127
63597 863127 858113 850082 840276 830112 820600 811850 803368 794647 785193 774107 760197 742914 723085
63584 723085 702355 681805 661349 640681 620481 602258 586995 574429 563769 554712 547440 542051
63572 542051 538485 536905 537645 540687 545401 550869 556379 561687 566965 572467 578167 583891 589846 596799
63558 596799 605489 616073 628316 642111 657557 674786 693971 715328 738795 763892 790199 817776
63546 817776 846914 877716 910106 943671 976783 1006077 1027575 1038706 1039257 1030880 1016280 998575
63534 998575 980442 963328 947665 933704 921612 910741 899419 885848 869075 849128 826522
63523 826522 801729 774849 745868 715492 685553 658067 633827 612271 592598 574469 557639
63512 557639 541670 526397 512297 500077 490069 482102 475658 470027 464651 459502 454905 450965 447461
63499 447461 444349 441976 440607 439992 439548 438805 437626 436273 435313 435215 435891 436739 437124 436741 435660 434286 433123
63482 433123 432350 431787 431536 432268 434373 437043 438874 439352 439175 439135 439311 439432 439409 439189 438562 437343 435487 432987
63464 432987 430023 427197 425134 423764 422451 420919 419563 418785 418594 419036 420465 423095 426684 430913 435732
63449 435732 441136 447003 453399 460673 468945 477714 486275 494454 502840 512321 523325 535371 547616
63436 547616 560077 574006 590759 610726 633806 660255 689831 720228 747660 769574 786262
63425 786262 799698 811629 823106 834936 847785 862105 878360 897125 918826 943564 971068
63414 971068 1000324 1029359 1056043 1079028 1097283 1109098 1112912 1109332 1101117 1090667 1078473 1064419
63402 1064419 1049342 1034445 1020038 1005724 991098 975425 957298 935534 910112 881730 851109
63391 851109 819374 788364 759587 733222 708800 686322 665986 647471 630476 615524 603289
63380 603289 593514 585579 579826 577225 577891 580929 585770 592731 602100 613466 626123 639609 653725
63367 653725 668493 684127 700720 718142 736606 756907 779466 803468 827778 852491 878721
63356 878721 906957 936488 966434 996323 1025334 1051756 1073672 1089845 1099779 1103435 1101202 1093873
63344 1093873 1082503 1068441 1053332 1038487 1024181 1009854 994995 979429 962818 944403 923408
63333 923408 899462 872754 844233 815561 788375 763496 741044 721085 703692 688585 675301
63322 675301 663709 653948 646121 640597 638161 638769 640125 638562 631867 620634 606757 591527 575689
63309 575689 560332 546635 534984 525110 516974 510887 506789 504006 501922 500539 500150 500685 501581 502185
63295 502185 502073 500902 498192 493539 487115 479700 472101 464692 457623 451146 445471 440502 435989 431806
63281 431806 427869 424049 420461 417494 415160 412768 409816 406946 405286 404894 404641 403715 402505 401726 401411
63266 401411 401243 401357 402192 403814 405895 408270 411062 414281 417659 420943 424120 427248 430306 433319 436586
63251 436586 440588 445591 451395 457618 464186 471395 479474 488274 497485 506967 516763 527016 538129 550784
63237 550784 565555 582549 601601 622581 645296 669284 694053 719423 745411 771925 798870
63226 798870 826368 854418 882427 909545 935576 961169 987031 1013212 1039258 1064708 1089256
63215 1089256 1112681 1134930 1156242 1176945 1197022 1215817 1232188 1244964 1253241 1256255 1253235 1243729
63203 1243729 1228042 1207019 1181336 1151369 1117945 1082726 1047513 1013385 980827 950420 922972
63192 922972 899025 878493 860784 845193 831369 819570 810367 804092 800764 800426 803073 808174 814900
63179 814900 823043 833092 845072 857944 870596 882846 894961 906804 918179 929494 941234 953114
63167 953114 964444 974948 984390 991777 996007 997215 996410 993678 987682 977274 962867 945902 927544
63154 927544 908217 887875 866423 844105 821685 800048 779646 760620 743221 727628 713481
63143 713481 700287 688304 678396 670933 665400 661242 658478 657224 657091 657415 657877 658703 660356 663039 666390
63128 666390 669856 673500 678087 684009 690576 696941 703314 710484 718402 726057 732657 738129 742530 745810
63114 745810 748199 749992 750964 750785 750056 749931 750562 750830 749873 747952 745602 743006 740668 739576 739887 740264
63098 740264 739337 737231 734922 732737 730397 728041 726214 725014 724109 723507 723558 724160 724713 724995 725468 726462 727630
63081 727630 728569 729681 731900 735580 740113 744814 749887 756074 763513 771547 779824 788910 799293 810347
63067 810347 821040 831444 842780 856128 871899 890478 912353 937276 964074 991795 1020635
63056 1020635 1051503 1085227 1122408 1163452 1208364 1256878 1308983 1364809 1423869 1485018 1547503
63045 1547503 1611427 1676829 1742910 1808617 1873459 1937268 1999625 2060139 2118930 2176309 2232193
63034 2232193 2286318 2338757 2389660 2438556 2484328 2525793 2561933 2591569 2613129 2624953 2625799 2615078
63022 2615078 2592519 2557659 2510050 2450397 2381162 2305398 2225024 2140935 2054686 1969095 1886858
63011 1886858 1809334 1737116 1671057 1612099 1560655 1516796 1480667 1452152 1430476 1414652 1404142
63000 1404142 1398662 1397704 1400694 1407369 1417482 1430298 1444863 1460722 1478066 1497219 1518126 1540152
62988 1540152 1562231 1583471 1603778 1623637 1643093 1661206 1676694 1688714 1696854 1700737 1699947 1694065
62976 1694065 1682587 1665071 1641565 1612624 1578871 1540969 1500023 1457376 1413747 1369186 1324195
62965 1324195 1280277 1238874 1200238 1163774 1129111 1096369 1065720 1037144 1010367 984767 959666
62954 959666 935005 911369 889156 868136 848046 828994 810971 793546 776514 760324 745434
62943 745434 731808 719444 708755 699835 691938 684335 677156 670740 664755 658818 653518 649843 647798
62930 647798 646429 645070 643796 642720 641666 640582 639544 638225 635919 632304 627861 623486 619938 617463
62916 617463 615599 613421 610377 606773 603183 599648 595887 592037 588605 585815 583434 581229 579210 577480
62902 577480 576149 575290 574742 574102 573112 571795 570078 567761 565115 563013 561981 561595 561282 561227 561879 562976
62886 562976 563782 563939 563493 562415 560811 559342 558633 558464 558216 557851 557683 557394 556242 554312 552695 552150 552219
62869 552219 551872 550585 548640 546808 545833 545837 546166 546068 545401 544395 543050 541389 540075 539991 541214 542981 544693
62852 544693 546395 548234 550114 551960 553693 554815 554643 553233 551580 550584 550186 549733 548836 547554 546044
62837 546044 544410 542848 541662 540968 540459 539645 538537 537935 538687 540633 542753 544454 546200 548633 551662
62822 551662 554819 557954 561075 563980 566667 569685 573431 577459 581173 584869 589309 594453 599470 603992
62808 603992 608603 614024 620339 627162 634074 640875 647762 655237 663555 672416 681538 691196 701778 713141
62794 713141 724957 737444 751270 767064 785559 807801 834511 865515 900396 939376 982858
62783 982858 1030593 1082203 1138208 1199525 1266142 1337277 1412756 1493172 1578579 1667941 1759988
62772 1759988 1853815 1948467 2042573 2134360 2221376 2300359 2368296 2423641 2465737 2493280 2504362
62761 2504362 2498055 2474922 2436002 2382456 2316341 2240505 2157202 2067732 1973708 1877685 1782025
62750 1782025 1687995 1596347 1508005 1423817 1344453 1270829 1203686 1142398 1085255 1031464 982018
62739 982018 938003 898982 863707 831560 802518 776388 752884 731966 713449 696808 681856
62728 681856 668990 658240 648818 640305 633463 628977 626020 623118 619980 617509 616302 616192 617049 619055
62714 619055 622172 626237 631735 639642 650266 662819 676403 690960 707006 724910 744767 766765
62702 766765 791335 818905 849609 883216 919322 957520 997365 1038355 1080301 1123699 1169350
62691 1169350 1217420 1267017 1316671 1364869 1410126 1451073 1486720 1516245 1538270 1550841 1552661
62680 1552661 1544162 1526974 1502409 1470817 1432308 1387687 1338493 1286242 1231875 1176117 1120279
62669 1120279 1066331 1015847 969080 925397 884520 846993 813530 784283 758636 735359 713119
62658 713119 691348 670587 651660 634711 619483 606135 594926 585234 575801 566065 556582 548078
62646 548078 540876 535216 531129 527770 523868 519309 515429 513290 512481 512097 512050 512599 513285 513212 512156 510677
62630 510677 509294 507999 506425 504153 501064 497676 494881 493161 492284 491885 491990 492898 495012 498729 503926
62615 503926 509556 514500 518883 523714 529188 534492 539562 545731 553873 563045 571986 581105 591900 605036
62601 605036 620088 636716 655057 675313 697935 723956 754132 787897 824015 862175 903133
62590 903133 947303 993915 1041521 1088652 1134036 1176868 1216944 1253973 1286717 1313260 1332091
62579 1332091 1342556 1344418 1337549 1322126 1298749 1268354 1232302 1192394 1150361 1107332 1063974 1020960
62567 1020960 978979 938448 899525 862321 827021 794052 764173 737978 715184 694950 677057
62556 677057 662049 649899 639368 629255 619515 610533 602065 593779 586168 579892 574692 569946 565825
62543 565825 562775 560248 557266 554202 552680 553445 555364 556866 557413 557196 556290 554763 553108 552058 552205
62528 552205 553940 557336 561938 567122 572890 579866 588376 598024 608455 620110 633868 650217 669079
62515 669079 690241 713586 738920 765842 794012 823616 855400 889985 927106 965805 1005357
62504 1005357 1045532 1085716 1124363 1159832 1191511 1219683 1244663 1266710 1286574 1305453 1324368
62493 1324368 1344032 1365290 1389234 1416829 1448716 1485288 1526478 1571424 1618824 1667872 1718765
62482 1718765 1772111 1827452 1881816 1929590 1964686 1983893 1988578 1982984 1970567 1951333 1921774 1877323
62470 1877323 1815936 1740319 1656545 1570132 1483612 1397652 1313210 1231732 1154216 1081410 1014593
62459 1014593 955076 903101 858137 819980 788560 762925 741545 723696 709498 698616 690006
62448 690006 683164 678612 676737 677011 678716 681658 685712 690463 695817 702377 710542 719572 728112 735451
62434 735451 741801 747462 752113 754982 755483 753570 749573 743782 736360 727541 717608 706613 694515 681745
62420 681745 669174 657277 645795 634495 623687 613582 603824 594299 585760 578825 572911 567105 561593
62407 561593 557194 553843 550761 547903 545944 544881 543942 543036 542981 543981 545173 546197 548047 551586 556180
62392 556180 560608 564614 568746 573225 577779 582239 586614 590931 595565 601426 609182 618392 627847 636695
62378 636695 644978 653287 662200 671893 682061 692309 702715 713814 726038 739533 754539 771413
62366 771413 790108 810124 831271 854066 879153 906720 936806 969771 1006022 1045479 1087602
62355 1087602 1131817 1177721 1225000 1273231 1321544 1368334 1411479 1448915 1478953 1500331 1512645
62344 1512645 1516898 1515140 1509178 1499664 1486399 1469193 1448351 1424691 1399217 1372628 1345162 1317053
62332 1317053 1288937 1261418 1234573 1208467 1183982 1162244 1143091 1124820 1105736 1085419 1064290
62321 1064290 1042589 1020220 997129 973386 949081 924359 899381 874156 848761 823772 800103
62310 800103 778330 758550 740872 725552 712557 701517 692210 684579 678203 672402 667109 663054 660692
62297 660692 659444 658343 657080 656114 656080 657347 659809 662881 665986 669135 672715 676713 680633 684285 688061
62282 688061 692246 696636 701101 705965 711467 717347 723360 729773 736918 744564 752197 759745 767800 777253
62268 777253 788819 802639 818224 835019 853096 873047 895304 920028 947655 978995 1014609
62257 1014609 1054468 1098242 1145419 1195153 1246562 1299251 1352900 1406212 1456844 1502434 1541069
62246 1541069 1570969 1590892 1601254 1603849 1599903 1589137 1571127 1546521 1516141 1479799 1437068 1388830
62234 1388830 1337230 1284472 1232356 1182495 1135970 1092823 1052603 1015313 981362 950879 923770
62223 923770 900204 880361 863726 849301 836484 825203 815219 805987 797373 790030 784725 781511 779724
62210 779724 778577 777648 776836 776101 775543 775833 778197 783372 790563 798055 805026 812262 820742 830106 839055
62195 839055 846948 854374 862182 870334 877908 884145 889470 895347 902946 912070 921696 931309 941211 951630
62181 951630 962278 972862 983277 993088 1001515 1008356 1014336 1020266 1026475 1033435 1042206 1053655 1067754
62168 1067754 1084129 1102835 1124029 1147420 1172711 1200273 1230710 1263852 1298531 1333014 1365190
62157 1365190 1392692 1413527 1426718 1432252 1430824 1423851 1413139 1399808 1383666 1363990 1340657 1314186
62145 1314186 1285155 1254147 1222086 1190048 1158769 1128660 1100197 1074046 1050866 1031047 1014411
62134 1014411 1000132 987378 976052 966396 957810 948869 938826 928363 918425 909007 899647 890398 881703
62121 881703 873846 867228 862615 860332 859627 859520 859948 861400 863838 866762 870078 874158 879142 884705 890260
62106 890260 894792 896845 895444 891058 885213 879329 874289 870661 868608 867684 867288 867126 866846 865565 862419
62091 862419 857469 851624 845881 841047 837760 836181 835891 836556 838356 841340 844928 848763 853589 860481 869557
62076 869557 880227 892434 906717 923171 941105 959738 978606 997438 1016258 1035574 1055909
62065 1055909 1077310 1099743 1123587 1149085 1175630 1202177 1227956 1251974 1272287 1286840 1294947
62054 1294947 1297174 1294061 1285940 1273722 1258568 1240583 1218847 1192982 1163858 1132566 1099587 1065165
62042 1065165 1029669 993273 956029 918669 882664 849137 818169 789409 762809 738464 716232
62031 716232 695904 677485 661057 646524 633602 621896 611074 601135 592253 584125 575915 567291
62019 567291 559042 551987 545733 539394 533189 528247 524917 522367 520001 518182 517227 516621 515766 514846 514427
62004 514427 514684 515431 516591 518330 520904 524412 528463 532229 535250 537975 541022 544140 546576 548223 549516
61989 549516 550274 549585 546978 542868 537744 531770 525354 519160 513274 507233 501264 496524 493541 491250 488333
61974 488333 484993 482618 482013 482636 483405 483695 483532 483157 482555 481435 479784 478233 477534 477700 478041 477998 477518
61957 477518 476738 475830 475162 475007 475028 474591 473674 472964 473053 474098 476234 479625 483948 488558 493359 498972 505859
61940 505859 513843 522551 531732 541063 550304 559677 569411 578892 587136 594210 601194 608435 614879 619602
61926 619602 623008 625858 628014 628972 628918 628327 626965 624237 620310 616160 612645 610067 608520 608171 609263
61911 609263 612214 617387 624433 632159 639601 647009 655260 664438 673531 681528 688285 694112 698798 701404
61897 701404 701098 698104 693659 689017 684691 680681 676898 672987 668233 662434 656677 652455 649991 648158
61883 648158 645993 643451 640590 636917 631918 625524 617774 608770 599272 590584 583367 577214 571739 567376
61869 567376 564635 563333 563145 564219 566582 569529 572385 575473 579618 584981 591036 597441 604329 611977
61855 611977 620729 631055 643162 656674 671105 686391 702563 719181 735576 751502 767109 782470
61843 782470 797434 811740 824818 835700 843527 848128 849908 849376 847011 843322 838733 833590 828483
61830 828483 824274 821555 820390 820754 822829 826635 831800 837997 845133 852759 859769 865201 868930 871090
61816 871090 871211 868545 863018 855298 846087 835877 825272 815004 805530 796941 789199 782191 775597 768884
61802 768884 761445 752721 742532 731408 720291 709722 699602 689890 681031 673429 666975 661468 657076
61789 657076 653880 651329 648658 645678 642807 640506 638973 638097 637365 636139 634372 632807 632129 632208 632500 632834
61773 632834 633414 634296 635312 636292 637114 637843 639109 641857 646295 651432 656162 660416 664775 669362 673814
61758 673814 678100 682588 687325 691853 695793 699074 701500 702564 701893 699614 696121 691649 686127 679444
61744 679444 671916 664411 657687 651570 645187 638157 631171 625183 620554 617212 615091 613856 612747 611354
61730 611354 610306 610502 611827 613174 613734 613696 613696 614056 614672 615306 615840 616367 617088 618034 619008 619798 620253 620070 618853
61711 618853 616534 613453 609860 605766 601439 597571 594626 592342 590214 588061 585781 582962 579210 574639
61697 574639 569737 564965 560692 557065 553647 549639 544882 540247 536605 533812 531177 528505 526115 524121
61683 524121 522275 520300 517998 515225 512144 509234 506686 504193 501610 499329 497538 495682 493303 490942
61669 490942 489477 488878 488404 487824 487718 488662 490746 493791 497441 501047 504020 506371 508574 511002 513748
61654 513748 516770 519895 522859 525568 527960 529473 529310 527621 525694 524382 523107 521223 519570 519504 520887
61639 520887 522298 523039 523701 524798 526031 527066 528012 528866 529392 529777 530507 531342 531237 529577 526662 522679
61623 522679 517128 509872 502074 495416 490739 487885 486335 485405 484118 481669 478094 474190 470627 467342
61609 467342 463804 459727 455393 451270 447480 443916 440814 438730 437676 436692 434761 431940 429128 426904
61595 426904 425041 423013 420495 417460 414240 411452 409448 407902 406280 404599 403286 402410 401533 400288 398730
61580 398730 397114 395700 394691 394021 393299 392283 391299 390834 390888 391078 391192 391264 391252 391097 390970 391083 391391 391802
61562 391802 392436 393349 394314 395290 396732 398921 401375 403465 405282 407224 409118 410470 411350 412197 412952 413189
61546 413189 413029 413117 413688 414310 414604 414587 414382 414181 414408 415300 416421 417282 418272 420269 423376 426746 429539 431355
61528 431355 431976 431594 431179 431617 432412 432141 430282 427704 425263 422946 420578 418393 416546 414962 413946 414094
61512 414094 415219 416285 416756 417143 417781 418088 417675 417259 417609 418299 418468 418271 418631 419824 421291 422795 424881
61495 424881 428001 431799 435553 438921 441989 444824 447336 449549 451753 454165 456531 458349 459599 460947
61481 460947 463026 465768 468695 471574 474410 477096 479452 481356 482419 481869 479352 475618 471836 468483
61467 468483 465496 463158 461896 461308 460315 458388 455936 453404 450791 448212 446161 445003 444738 445366 446844
61452 446844 448618 449961 450914 452199 454037 455841 457221 458525 460063 461607 463023 464718 466972 469408
61438 469408 471606 473756 476284 479125 481755 483638 484492 484469 484205 484369 485042 485882 486812 488036 489472 490820
61422 490820 492191 493961 495972 497615 498854 500357 502405 504417 505812 506695 507360 507813 508048 508224 508282 507976
61406 507976 507454 507277 507666 508389 509376 510639 511512 511025 509398 508166 508324 509188 509662 509777 510305 511488 512922
61389 512922 514253 515386 516350 517362 518633 519840 520268 519809 519297 519555 520640 522255 524218 526212 527778
61374 527778 528932 530198 531729 533096 534186 535493 537056 538013 537752 536751 535731 534704 533474 532370 531804
61359 531804 531732 532136 533400 535658 538439 541574 545755 551564 558560 565975 573603 581376 588821 595682 602399
61344 602399 609100 614809 618486 620297 621039 621009 620436 620333 621617 623613 624579 623718 621855 620224 619350 619018
61328 619018 618624 617600 616050 614831 614620 615279 616615 619096 623092 627903 632490 636805 641574 647159 653558
61313 653558 661135 670283 680514 690945 701636 713484 726834 741116 755975 771727 788465 805468
61301 805468 821793 836787 849679 859227 864204 864118 859467 851524 841706 830763 818664 805573 792575
61288 792575 780854 770389 760142 749441 738613 728335 719060 711101 704647 699518 695393 692352 690743
61275 690743 690505 691075 692042 693484 695606 698436 701922 705970 710284 714455 718288 721899 725548 729565 734304
61260 734304 739965 746526 754013 762585 772102 781797 790580 797461 801556 802165 799315 794024 787636 781014
61246 781014 774527 768456 763066 758517 755007 752752 751600 751061 750965 751720 753665 756584 760170 764400 769089
61231 769089 773633 777737 781996 787324 794216 802885 813404 825079 836342 846163 855215 864906 875543
61218 875543 886153 895812 904374 912117 919427 926837 934750 943054 951323 959211 966341 972204 976655 980294
61204 980294 983889 987769 992148 997621 1004726 1013348 1023129 1034213 1047142 1062268 1079647 1099125 1120117
61191 1120117 1141690 1163145 1183990 1202971 1217930 1227270 1231075 1230365 1226076 1219409 1212115 1205256 1198232
61178 1198232 1189962 1180477 1170358 1159300 1146469 1131921 1116481 1100503 1083838 1066794 1050009 1033483
61166 1033483 1016752 999886 983422 967504 952033 937483 924605 913440 903550 895135 889021 885667
61154 885667 884952 886702 890586 895808 901840 909212 918676 929864 941663 953426 964690 974183 980518
61141 980518 983749 985006 984848 983352 981690 981970 985177 990572 997465 1006400 1018256 1033228 1051016 1071080
61127 1071080 1092518 1114700 1138209 1164239 1192928 1223262 1254655 1287488 1321922 1357331 1393196
61116 1393196 1429485 1465897 1501780 1537033 1571978 1606066 1637861 1666736 1693515 1718945 1742532
61105 1742532 1763342 1780978 1795181 1805360 1811076 1812338 1808990 1800485 1786655 1768042 1745243 1718600
61093 1718600 1688755 1656751 1623297 1588658 1553379 1518334 1483940 1450174 1417453 1386567 1357564
61082 1357564 1329767 1303084 1278343 1255960 1235301 1215741 1197427 1180637 1165182 1150781 1137285
61071 1137285 1124313 1111509 1099308 1088593 1079503 1071460 1064314 1058328 1053105 1047879 1042965 1039484 1037425
61058 1037425 1035571 1033710 1033241 1034950 1037859 1041204 1045979 1053305 1062549 1072395 1082796 1094585 1107898
61045 1107898 1122261 1137709 1154719 1173255 1192616 1212006 1230849 1248952 1266659 1284294 1301386
61034 1301386 1317189 1332043 1347147 1362832 1378307 1393327 1408682 1424578 1440094 1455024 1470809
61023 1470809 1488804 1508921 1530877 1555430 1583366 1614502 1648640 1686283 1727485 1771371 1817960
61012 1817960 1869370 1928339 1997000 2077981 2174898 2290319 2424893 2580069 2760245 2970965
61002 2970965 3217162 3505322 3845426 4248038 4720728 5269463 5901462 6624127 7444201
60993 7444201 8372765 9429442 10637260 12016340 13587859 15371549 17344796 19376326
60985 19376326 21210255 22559685 23261510 23364697 23079758 22651748 22273974 22076353 22121031
60976 22121031 22354919 22572433 22476771 21831939 20588775 18885690 16945587 14969635 13093374
60967 13093374 11392463 9898861 8613392 7519330 6595055 5818962 5168975 4623956 4166859
60958 4166859 3784515 3464526 3194337 2963257 2763641 2589745 2436531 2299723 2176135
60949 2176135 2063663 1961278 1868759 1785812 1711459 1644464 1583885 1528744 1477511 1428497 1380658
60938 1380658 1333765 1288036 1243795 1201247 1160357 1121189 1084373 1050779 1020664 993561 969084
60927 969084 947246 927872 910348 894299 879939 867369 856010 845144 834677 824988 816256 808274
60915 808274 800789 793819 787748 783106 780005 777798 775602 773141 770712 768350 765525 761796 757385 752903
60901 752903 748730 744667 739986 733863 726116 717484 708903 700617 692333 683986 675842 668030 660566 653763
60887 653763 648031 643301 639181 635642 632950 630961 629130 627206 625290 623193 620463 617148 613822 610694
60873 610694 607352 603640 600105 597299 595197 593633 592761 592783 593670 595445 598253 601873 605588 608851 611654
60858 611654 614018 615603 616198 616272 616606 617573 618968 620290 621033 621025 620654 620475 620446 619907 618461 616547 614918 613881
60840 613881 613170 612124 609733 604996 597725 588876 579786 571177 563062 555357 548287 542260 537517 533839
60826 533839 530570 527143 523684 520824 518788 516926 514379 511026 507521 504549 502296 500607 499370 498570
60812 498570 498026 497281 495931 494053 492175 490770 489971 489705 489845 490085 490009 489541 489014 488574 487854 486582 485203
60795 485203 484422 484335 484526 484837 485461 486314 486948 487231 487612 488410 489253 489473 488839 487654 486310 485010 483848 482858
60777 482858 481897 480647 479004 477426 476610 476588 476498 475653 474604 474495 475449 476356 476408 476102 476384 477520 479210 481146
60759 481146 482938 484139 484920 486140 488089 489758 490100 489448 488838 488463 487747 486566 485332 484114 482776 481867
60743 481867 482234 483636 484763 484852 484340 483695 482567 480591 478227 476179 474451 472480 469946 467073 464332
60728 464332 462079 460306 458685 457056 455857 455772 456924 458721 460451 461736 462474 462691 462471 461824 460753 459634
60712 459634 459144 459451 459842 459657 459255 459460 460366 461323 461813 461680 460715 458803 456367 453986 451721 449460 447616
60695 447616 446652 446134 445237 444087 443648 444244 445187 446015 447114 448838 450881 452884 454965 457319 459910 462779
60679 462779 466083 469636 472995 476114 479280 482344 484750 486473 488146 490046 491694 492636 492869 492218 490160
60664 490160 486741 483036 480201 478438 477179 475834 474225 472741 472197 473009 474464 475391 475578 475800 476476 477189
60648 477189 477718 478571 480111 481975 483754 485488 487076 487941 487704 486556 484591 481547 477649 473917 471150
60633 471150 469198 467693 466754 466420 466181 465719 465490 465901 466561 467044 467771 469228 470785 471265 470461 469250 468341
60616 468341 467756 467532 468101 469639 471552 472961 473451 473190 472570 471958 471679 471904 472404 472598 472115 471307 470792 470456
60598 470456 469505 467863 466871 467872 470553 473474 475878 478061 480235 482166 484029 486515 489799 493226 496314
60583 496314 499271 502275 505020 507245 509047 510473 511514 512624 514387 516589 518560 520631 524125 529556
60569 529556 535931 542327 549095 556860 565393 574298 583956 594884 606773 618853 630577 641278 649915
60556 649915 655949 659907 662296 662547 659884 654753 648575 642418 636691 631809 628416 627005 627722 630335 634152
60541 634152 638481 643468 649966 658233 667554 677621 689426 704069 721356 740374 760820 782859
60529 782859 806094 829436 851635 871261 886605 896451 900743 900083 895021 886302 875098 862292 848135
60516 848135 833273 819300 807319 796654 786132 776163 768262 762858 758937 755915 754579 755936 760124
60503 760124 766917 776519 789407 805848 825903 849615 877011 908146 943175 982170 1024916 1071053
60491 1071053 1120215 1171781 1224632 1277291 1328017 1374762 1415628 1449779 1477378 1498323 1511580
60480 1511580 1516082 1511574 1497989 1474674 1440994 1397338 1344999 1285663 1221640 1156022 1091680 1030383
60468 1030383 973364 921963 876835 837051 801111 768617 740167 715897 695023 676517 659467
60457 659467 643104 627352 613050 600823 590095 580097 571278 564594 559738 555385 551039 547326 544442
60444 544442 541615 538366 535151 532394 529860 527417 525489 524293 523323 522051 520576 519194 517842 516290
60430 516290 514509 512593 510659 508905 507461 506192 505055 504521 505104 506553 508112 509578 511504 514289 517539
60415 517539 520396 522131 522572 522394 522770 524199 525927 527079 527984 529576 531818 533731 534882 535805 536887
60400 536887 537875 538695 539831 541582 543716 546094 548856 551803 554366 556429 558393 560228 561359 561843 562726
60385 562726 564704 567197 569330 571044 572612 573794 574366 574976 576519 578814 580713 581539 581793 582380 583641
60370 583641 585253 586702 587679 588317 589167 590823 593409 596477 599433 602021 604415 606912 609618 612427 615222
60355 615222 618009 620882 623967 627330 630822 634184 637573 641780 647360 653525 658534 661424 662753 663407
60341 663407 663412 662457 660855 659110 656940 653654 649390 645198 641834 639085 636328 633271 630094 627216 624903
60326 624903 622838 620283 616946 613435 610534 608394 606868 606174 606579 607795 609349 611325 614093 617559 621398
60311 621398 625808 631335 638149 646190 655747 667040 679321 691252 702224 712603 722801 732926
60299 732926 743286 754219 765128 774416 780754 783987 784602 782830 778493 771408 761838 750746 739461
60286 739461 728803 718769 709317 700928 693834 687269 680303 673055 666201 659681 652899 645930 639431 633447
60272 633447 627434 621405 615956 611092 606129 600949 596290 592557 589334 586356 584047 582769 582380 582810 584240
60257 584240 586393 588467 590012 591194 592063 592469 592836 593974 595756 597005 597102 596774 596817 597046 597022 596863 596629
60240 596629 595751 593957 592157 591658 592836 595103 597679 599871 601164 601721 602476 604325 607513 612061 618107
60225 618107 625335 632672 639211 645170 651458 658666 666856 675943 685777 696159 707148 719135 732278
60212 732278 746162 760213 774117 787634 800427 812280 823144 832864 841366 849184 857150 865308
60200 865308 872715 878529 882695 885397 886692 887005 887072 886747 884553 879154 870841 861021 850712 840119 829147
60185 829147 817601 805243 792355 780101 769742 761542 754775 748605 742605 736685 730997 725824 721359
60172 721359 717640 714801 712981 711884 710832 709479 708057 706713 705104 702960 700628 698668 697217 696066
60158 696066 695075 694262 693722 693636 694103 695011 696456 699145 703626 709073 713729 716859 719516 723001 727399 732159
60142 732159 737254 742988 749239 755766 762895 771083 779998 788749 796978 805183 814035 823742 834007 844193
60128 844193 853580 861729 868601 874326 879082 883326 887739 892718 898128 903678 909217 914596 919615 924204
60114 924204 928263 931289 932718 932692 931850 930203 926903 921523 914895 908189 901573 894240 885476 875397 864917
60099 864917 855232 847060 840219 834160 828797 824342 820533 816818 813303 810632 808772 806838 804384 801947
60085 801947 800032 798475 797209 796619 796546 795924 794093 791659 789312 786596 782684 777577 771603 764403 755493
60070 755493 745466 735649 726770 718739 711486 705199 699853 695154 690900 686942 683012 679078 675709 673621
60056 673621 673011 673600 675004 676756 678432 680184 682779 686775 692050 698364 705759 713999 722351 730493 739017
60041 739017 748450 758311 767764 776515 784371 790497 794023 795024 794142 791629 787524 782394 777014 771383
60027 771383 764748 756506 746581 735134 722469 709054 695191 680902 666501 652924 641001 630784
60015 630784 621965 614532 608457 603265 598515 594320 590856 587800 584870 582500 581273 580988 580887 580563 580209
60000 580209 580296 581413 583916 587292 590424 592984 595901 599934 604566 609014 613510 618596 623889 628663 633113
59985 633113 637837 642451 645877 647802 648697 648496 646366 641925 635804 628940 622021 615552 609685 603993 598134
59970 598134 592699 588704 586338 584925 584043 583945 584875 586686 589235 592585 596776 601848 607922 614724 621176
59955 621176 626040 628951 630430 631106 631401 631689 632200 632886 633798 635204 636915 638006 637838 636945 636206 635586 634448
59938 634448 632729 631015 629731 629025 629116 630080 631552 633387 636202 640503 645696 650760 655424 659801 663396
59923 663396 665551 666460 666621 665664 662986 659378 656646 655540 655229 654903 654759 655264 656545 658792 662319 666869
59907 666869 671569 675792 679447 682419 684500 685879 686881 687211 686306 684486 682865 682032 681706 681802 682944 685654
59891 685654 689800 695025 701027 707247 712995 718130 723056 727934 732512 736774 741212 746375 752596 759968
59877 759968 768037 775754 782461 788610 794712 799894 802585 802551 801164 799614 797861 795407 792109 788065 783606
59862 783606 779534 776530 774249 771830 769317 767588 766913 766631 766327 766194 766102 765494 764515 764099 764589 765380 766354
59845 766354 768516 772556 777759 783049 788341 794255 801187 809274 818509 828217 836885 843203 847062 849371
59831 849371 851375 854330 859072 865396 872234 878584 883677 886180 884250 877041 865668 852267 838555
59818 838555 825534 813844 803774 795210 787946 781840 776601 771916 767896 764902 762794 760930 759034
59805 759034 757535 756943 757337 758487 759797 760132 758455 754884 750543 746361 742552 739075 735688 731619 726238
59790 726238 720188 714762 710010 704647 698191 691942 687218 683671 680153 676390 672925 670108 667948 666513
59776 666513 665733 665166 664558 664319 665037 666817 669434 672709 676453 680467 684877 689984 695588 701001 705970
59761 705970 711072 717022 724199 732966 743577 755391 766982 777531 787556 797874 808509 818988
59749 818988 828971 838125 846028 852738 858804 864230 868078 869690 869749 869428 868957 867699 865332 862356 859566
59734 859566 857427 855771 853847 850918 847072 843205 840150 838118 836969 836482 836318 836318 836919 838582 840744 842173
59718 842173 842625 843268 845091 847724 850280 852522 854589 856334 857756 859606 862792 867384 872721 878219 883649
59703 883649 888914 893979 898910 903761 908576 913525 918653 923492 927451 930641 933764 937099 940215 942704
59689 942704 944454 945076 943949 941223 938083 935579 933723 931950 929835 927027 923161 918259 912770 906929
59675 906929 900506 893278 885230 876316 866718 857383 849488 843297 838313 834503 832316 831407 830583 829431 828898
59660 828898 829818 831885 834606 838232 843081 848757 854603 860220 865127 868839 871667 874587 877759 880051
59646 880051 880337 878362 874030 867144 858356 849104 839878 829758 818399 807187 797508 789116 781282 774371
59632 774371 769024 764743 760602 756521 752621 748083 741997 734718 727103 719003 709862 700373 692201 686190
59618 686190 681914 678718 676204 673965 671859 670309 669487 668593 666892 665103 664678 665934 667934 670012 672425
59603 672425 675479 678906 682163 684688 686006 686230 686308 687127 688498 689557 689907 689887 690036 690839 692527 694476
59587 694476 695219 693814 690904 687852 685255 682938 680897 679324 678048 676746 675515 674544 673495 671834 669521
59572 669521 666891 664246 662025 660733 660112 659058 657165 655608 655560 656445 656862 656668 656780 657284 657205 656148 654856
59555 654856 653930 653104 652185 651778 652520 654206 656110 657870 659782 662400 666034 670522 675571 681298 688166
59540 688166 696318 705397 715240 726362 739605 755675 774815 795881 815441 829036 834402 833083
59528 833083 828496 823229 818625 815626 814552 814583 814662 814677 814918 814843 813391 810272 806039 801066 795156 787979
59512 787979 779264 768944 757758 747272 738557 731104 723650 715768 708058 701224 695574 691070 687309
59499 687309 683841 680870 679131 678770 679122 679958 681923 685130 688467 691107 693688 697006 700646 703968 707410
59484 707410 711502 715522 718569 721177 724431 728108 731226 733909 737242 741570 746290 750947 755347 759007
59470 759007 761813 764737 768569 772407 774813 775995 777296 778949 780058 780681 782175 785341 789694 794780
59456 794780 800835 807885 815432 823288 831665 840217 847982 854393 859478 863093 864890 864977 863679 860799 856057
59441 856057 850063 843766 837170 829702 821701 814379 808460 803946 801088 800341 801302 802893 804708 807239 810808
59426 810808 815297 820959 828595 838825 851829 867545 885423 904441 924088 944752 966340 987438
59414 987438 1006989 1025864 1045469 1065809 1086456 1107992 1129904 1147795 1155749 1151987 1140171 1125053
59402 1125053 1109219 1094280 1082351 1075005 1072614 1075650 1084562 1096887 1106199 1105906 1093875 1072848 1047516
59389 1047516 1022073 999239 979825 963090 948149 934916 923606 914077 906091 899718 895123 892285
59377 892285 890927 890341 889534 888216 887275 887471 888196 888595 889386 892071 896592 901327 905434 909688 914922 921125
59361 921125 928295 936736 946248 956318 967299 980092 994560 1009667 1025312 1042406 1060914 1079432
59349 1079432 1097152 1114725 1132661 1150345 1167149 1183081 1197796 1210311 1220282 1228186 1233736 1235448
59337 1235448 1232356 1224935 1213875 1199340 1181903 1162789 1142503 1120531 1096974 1073153 1050080 1027678
59325 1027678 1006072 986146 968143 951227 935195 921110 909324 898344 886792 875214 864856
59314 864856 855748 847136 838787 830783 822840 814908 807715 801917 797289 793348 789966 786836 783332 779612
59300 779612 776963 776403 777724 780422 784524 789924 795956 802460 810482 821235 834971 851076 868190
59287 868190 883817 895026 900324 900231 895977 888910 881306 875969 874139 875020 877980 883840 893222 905131
59273 905131 918211 932167 946975 961870 976184 990138 1003818 1016333 1026913 1035813 1043235 1048356
59261 1048356 1050389 1049736 1047230 1043110 1037491 1030886 1023482 1014883 1005381 996498 989426 983853 978963 974634
59247 974634 970926 967532 964523 962649 962182 962460 963148 964654 966601 967332 965948 963620 961846 960514 958652
59232 958652 955839 951856 946067 938340 929620 920614 910842 899850 888225 876536 864447 851886 839879
59219 839879 829164 819167 809437 800890 794437 789503 785129 781421 778739 776566 774493 773298 773779 775376
59205 775376 777091 778856 780955 783171 785586 789004 793415 797241 799386 800837 802893 805078 806265 806668
59191 806668 807078 807236 806660 806152 806695 807645 807734 807186 807207 807909 808363 808266 808110 808079 808079 808401 809228 810057 810637 811698
59171 811698 813593 815166 815316 814834 815299 816959 819084 821553 824535 827284 828767 828908 827893 825007 819602
59156 819602 812479 804758 796117 785724 774256 763306 753232 743188 732899 722931 713591 704958 697599
59143 697599 691897 687052 681986 676821 672262 668104 663614 658826 654262 650031 646378 644351 644541 645892
59129 645892 647083 648349 650683 654119 658230 663331 669612 675982 681550 687431 695339 705127 715487 726297
59115 726297 738322 751271 764124 776847 789759 801718 811078 818224 825173 832736 839853 845565 849829
59102 849829 852514 853320 852694 851323 848881 844699 839338 833976 828676 822902 817234 812821 809496 806211 803012
59087 803012 800778 799327 797615 795498 793488 791083 787211 782046 776526 770432 762946 754780 747600 741572
59073 741572 735631 729980 725929 723216 719981 715758 712178 710198 708760 706839 704732 702609 699772 696211
59059 696211 693194 691413 689987 688055 686009 684419 683079 681745 680649 679703 678367 676792 676024 676593 677829
59044 677829 678875 679425 679355 678676 678033 678207 679054 679805 680289 680857 681426 681799 682671 685017 688745 693221 698746
59027 698746 706050 714744 723810 733311 743951 755284 766090 776254 786436 796028 803317 807637 809645
59014 809645 809631 807432 803901 800431 796957 792340 786768 781809 778151 775344 773828 774872 778207 782073 786099
58999 786099 791900 800047 808582 815510 820960 825959 830794 835533 840658 846126 850949 854437 856873 858632
58985 858632 859753 860627 861869 863380 864832 867026 871244 877314 883999 891281 900393 911488 923251 935092
58971 935092 947832 961828 976270 990687 1005311 1019615 1032416 1043819 1055123 1066418 1076186 1083650
58959 1083650 1089501 1093827 1095359 1093394 1088461 1080587 1068991 1054103 1037800 1020947 1002787 983433
58947 983433 964705 947610 931205 914996 900279 887903 876821 866271 857502 851812 848452 845907
58935 845907 843853 842573 841760 841153 841214 842147 843296 844223 845108 845525 844368 841695 839067 837301 835531 833219
58919 833219 831319 830505 829995 829223 829048 830166 831846 833339 835148 837891 841321 845442 851160 858805 867386
58904 867386 876294 886411 898610 912511 927596 944152 962201 980815 999392 1018318 1037655 1056540
58892 1056540 1074587 1092541 1110914 1129471 1148646 1169804 1193211 1217150 1239651 1259640 1276041
58881 1276041 1287700 1294903 1299187 1300965 1299131 1293568 1285977 1277448 1267291 1255063 1241594 1227167 1210993
58868 1210993 1193625 1177604 1164412 1152856 1141652 1131336 1122230 1112814 1101867 1090305 1079229 1067981
58856 1067981 1055723 1043183 1031253 1019544 1007823 997082 987663 978095 967281 956101 945318 933799
58844 933799 920479 906341 892746 879491 866157 853633 842569 832005 821292 811712 804424 798447
58832 798447 792458 787011 783135 780324 777756 776111 776320 777876 780024 783212 787734 792455 796595 801182
58818 801182 807039 812928 817487 821404 825789 829946 832786 834899 837177 838702 838122 835899 833251 830017
58804 830017 825487 820231 815207 810075 804135 797897 792196 786874 781756 777558 774360 770653 765491 760131
58790 760131 756021 752822 749941 748240 748416 749509 750918 754056 759931 766831 772536 777185 781793 785719
58776 785719 788008 789680 792177 794765 795751 794941 792724 788179 780456 770847 761236 751758 742027 733184 726421
58761 726421 720909 715483 710933 708328 706625 704371 702298 701754 702010 701680 701298 701814 702090 700826 699656 701281
58745 701281 705613 710673 716191 723330 731760 740102 748515 757904 767146 774022 778486 782504 787192 792561
58731 792561 799223 807665 816508 824100 831186 839455 848233 855347 860578 865586 870982 876159 881476 887937
58717 887937 895125 901817 908128 914774 920984 925579 929172 932730 934854 933241 928094 921355 913344 902966
58703 902966 890417 876741 861335 842889 822314 801892 782040 761799 741963 724657 710145
58692 710145 697016 685231 676037 669030 662257 655207 649008 643664 637711 630638 623356 616401 609872 604658
58678 604658 601478 599246 596724 594933 595456 597343 598549 599561 602608 608006 614360 621768 631625 643676
58664 643676 656366 669633 684287 699058 711308 720208 726129 727581 722305 711268 698203 685247
58652 685247 672111 659144 647726 637670 627636 618215 611388 606960 602756 598386 595525 594476 593756
58639 593756 593198 594139 596358 598121 599478 602194 606065 608567 608661 607933 607563 607035 606191 605732 605403 604348 603302
58622 603302 603805 605469 606814 608329 611622 616108 619938 623788 630110 638830 647408 654937 662490 669592
58608 669592 674285 676809 679371 682153 683363 683305 684377 686736 687978 687457 686938 686681 685023 682320 681110
58593 681110 681741 681996 681707 683519 688321 694178 700615 709647 721515 733791 745816 759643 775201 788997
58579 788997 799372 808894 819677 830340 839546 848801 859607 871232 883295 897433 914633 933963
58567 933963 955434 981035 1011473 1044858 1079895 1117310 1157047 1197145 1236198 1273557 1306334
58556 1306334 1330073 1343543 1349341 1348955 1341324 1327345 1311449 1296982 1283858 1272204 1264101 1259855
58544 1259855 1256349 1250980 1243697 1233721 1218261 1196386 1170457 1141971 1109696 1073637 1037070 1002797
58532 1002797 970909 941706 916936 896462 877639 859699 844898 833848 823923 813988 806328 801957
58520 801957 798405 794263 791526 791066 790079 786581 782425 779425 776493 772972 770749 770545 770054 768067 766529
58505 766529 766317 765283 762755 761515 762771 763669 762528 761947 763708 765230 764416 763674 765642 769053 772282
58490 772282 777005 784750 793666 802296 812871 827364 843858 860236 877942 898747 921351 944438
58478 944438 969407 996657 1022716 1044386 1062236 1076848 1085423 1085587 1079013 1068031 1052360 1032518
58466 1032518 1012569 995844 981467 968378 958989 955345 955499 957299 962158 971696 984399 998903 1016586
58453 1016586 1037398 1057298 1073351 1087107 1099311 1105817 1102940 1092610 1078123 1059181 1035527 1011048
58441 1011048 989389 969297 948871 930524 917124 907135 898296 892280 890987 891962 892251 893226 897054
58428 897054 902239 907277 914666 926364 939211 949761 959574 970535 979055 980609 976398 970047 961260
58415 961260 948338 933535 920224 907706 894082 881078 870868 861467 850445 839865 832438 826355
58403 826355 819102 812691 809727 808042 804736 801811 802130 803629 803295 803145 806333 810979 813772 815996 820065
58388 820065 823925 825041 826111 830468 835605 837638 838354 841285 844678 845265 845344 849110 855389 860795 866617
58373 866617 875716 886221 895348 905797 921128 938441 952982 966467 983339 1002411 1019972 1037595
58361 1037595 1058825 1081317 1100201 1116108 1131994 1145358 1151860 1153535 1155172 1155597 1150902 1143271 1138088
58348 1138088 1135132 1131044 1127622 1129042 1133646 1137079 1140823 1149098 1160317 1170330 1181049 1196800 1215207
58335 1215207 1230929 1245458 1263757 1284131 1301162 1315799 1332581 1349480 1360640 1366787 1372887 1377921
58323 1377921 1377298 1373095 1371442 1371819 1369327 1365431 1365861 1369844 1372035 1373279 1378819 1387730 1394746 1400703 1410504
58308 1410504 1422775 1432375 1441050 1454591 1471525 1485716 1497867 1513163 1529995 1542754 1553377 1568179
58296 1568179 1585831 1600712 1615388 1636874 1663126 1686438 1707700 1733656 1762632 1787355 1809822
58285 1809822 1838651 1873348 1905919 1936450 1972096 2012105 2049226 2084745 2126634 2173901 2218199
58274 2218199 2259345 2303013 2344782 2373933 2392602 2414038 2442419 2471600 2502705 2544270 2594850
58263 2594850 2644063 2691379 2745516 2805138 2859258 2907243 2958972 3014677 3064554 3109073 3159269
58252 3159269 3216051 3270028 3322786 3386714 3462482 3538662 3614984 3703253 3803715 3904052 4003702
58241 4003702 4115177 4239227 4363515 4488169 4627032 4781073 4936960 5094604 5268772
58232 5268772 5460580 5655908 5855177 6075057 6317353 6567152 6825498 7111411 7427386
58223 7427386 7756832 8100443 8479827 8900168 9346571 9822866 10354806 10948862 11589342
58214 11589342 12282986 13062682 13940326 14903494 15967178 17179114 18566137 20130924 21913592
58205 21913592 24000141 26461378 29349720 32770403 36885403 41830560 47703288 54644578
58197 54644578 62839990 72411975 83402943 95889269 110014059 125906002 143720423
58190 143720423 163794514 186590988 212456056 241628433 274337747 310046900 345782711
58183 345782711 375447422 391941913 391031768 373623010 344607773 309846635 273995379
58176 273995379 240052208 209703023 183658117 161954597 144230037 129781910 117554779
58169 117554779 106426295 95699755 85285856 75420737 66329823 58147958 50954243
58162 50954243 44740770 39399334 34806104 30881968 27548091 24691363 22215775 20077848
58154 20077848 18239982 16637198 15218289 13973300 12891576 11933092 11065387 10289005
58146 10289005 9602396 8977936 8394601 7859749 7377719 6929467 6502837 6111545 5764822
58137 5764822 5447449 5147635 4876143 4640120 4424983 4219411 4032582 3869966 3716523
58128 3716523 3560252 3409530 3271962 3138450 3003077 2877006 2767757 2664996 2560822
58119 2560822 2464287 2382262 2305236 2225512 2150833 2086878 2024385 1956680 1892563 1838963 1787494
58108 1787494 1730626 1675059 1626770 1578391 1523474 1468381 1418559 1367579 1310903 1256039 1208015
58097 1208015 1158993 1103423 1049987 1007775 973853 944651 925852 919960 917083 909153 901373 899457
58085 899457 897890 891182 884556 882757 879823 870455 860429 855397 850260 839790 829102 823361 817513
58072 817513 806360 794774 787825 780619 767923 754289 744686 734562 719287 704319 695788 689598
58060 689598 679937 670323 666103 663769 657612 649691 643828 636872 625211 612995 604925 597657 586953
58047 586953 576483 571007 567713 562744 559290 560597 561792 557443 550743 546645 542456 533965 524540 519174
58033 519174 515374 508695 501654 498402 495953 489322 480457 473772 467766 459131 450308 444976 440703 433810
58019 433810 426839 423639 421793 417509 413165 412392 412448 409230 405322 405284 407346 407379 406828 409030 411840 411610
58003 411610 410625 413047 417197 419134 420159 423524 427473 428760 429386 432692 436486 437167 436892 439402 442433
57988 442433 441711 438933 438232 438069 434281 428168 424007 421302 416932 412338 411111 411771 410182 407045 406032
57973 406032 406684 406045 405190 407195 410538 411324 410258 410850 412510 412004 410002 409722 410553 409355 406627 405343
57957 405343 405160 403612 401400 400657 399731 395617 389903 386434 384805 382031 378853 378322 379752 380116 380065 382643
57941 382643 387433 391779 396395 403904 413157 420854 427589 436527 447295 456928 465666 475937 486514
57928 486514 493395 495799 496021 494281 489065 481537 474311 466735 456533 444920 434867 425614 414433
57915 414433 402585 393822 387973 381714 374891 370325 367990 365102 361657 360313 360980 360850 359667 359804 361234
57900 361234 361351 359625 357716 355332 350769 345204 341706 340344 338905 337858 339824 344610 349554 354289
57886 354289 360441 367168 371854 374804 378501 382792 385528 387313 390599 394708 396779 397149 398705 401338
57872 401338 402293 401729 402674 405586 408140 410370 414814 421379 427180 431714 437231 443743 448635 451561 454948
57857 454948 459316 462805 465489 469361 473910 476598 477854 480556 484343 485601 483610 481497 480418 477934
57843 477934 473095 468175 464241 459785 454763 451351 449572 446684 442065 438317 436527 434802 432521 431611
57829 431611 432559 433433 433919 436075 440084 443526 445853 449231 453943 457352 458555 459730 461650 462224 460813
57814 460813 459647 459538 458340 455125 451774 449016 445015 439338 434251 430484 425641 418358 410158 401780
57800 401780 391787 380375 370532 363537 357123 349931 343920 340493 337942 334831 332429 331795 331681 331257 331738
57785 331738 333554 335028 335546 336938 340213 344020 347799 353140 360531 368017 374580 381569 389239 395277
57771 395277 398420 400309 402130 402691 401421 399893 398659 395856 390665 384910 379609 373345 365787 359299
57757 359299 355105 351273 346596 343080 342336 342718 342461 342612 344451 346874 348780 351390 355768 360517 364214
57742 364214 367757 372207 376625 380131 383727 388072 391703 393428 394321 395562 396530 396736 397290 398696 399449
57727 399449 398546 397151 396233 394874 392469 390211 388861 387323 384856 382304 379928 376683 372905 370856 371138
57712 371138 371481 370531 369734 369910 369288 366963 365040 365027 365126 363473 361259 360180 359503 358167 357244 357795 358646
57695 358646 358730 359368 361841 364920 367062 368814 370835 371884 371049 369725 369151 368303 366514 365787 367991 372003
57679 372003 376130 381233 388960 398962 410498 424843 443537 466001 491363 520925 556430 597507
57667 597507 643217 694463 752297 814532 875302 926284 957465 960147 932664 882201 819266 751680
57655 751680 684576 622542 568464 522059 482130 448842 421997 399375 379147 362016 348894
57644 348894 338575 329809 323245 318968 314584 308471 302640 299511 298024 295805 293159 291760 291253 290335
57630 290335 289616 290284 291236 290520 288495 286886 285838 284450 283010 282188 281206 279158 276790 274828 272139 267919
57614 267919 263960 262180 261550 260122 258324 257504 256858 254834 252200 250742 250205 249312 248529 248965 249802 249711 249537
57597 249537 250683 252007 251345 249070 247169 245762 243466 240385 237917 236324 235097 234795 235984 237307 237181
57582 237181 236324 236069 235509 233160 230143 228601 228022 226328 223628 221667 220331 218009 214875 212622 211305
57567 211305 209511 207282 205917 205216 203829 202055 201427 201763 201488 200642 200795 202104 203148 203565 204247 205100
57551 205100 205185 204931 205758 207700 209752 212212 216172 220971 224663 226715 227901 228045 226527 224640 224611 226361
57535 226361 227771 228002 228049 228178 227441 225718 223897 222150 220263 219289 220391 222366 222819 221547 220264 219435
57519 219435 218141 216831 217209 219247 221020 221731 222461 223835 225370 227222 230109 233312 235118 235427 235729
57504 235729 236550 237159 237669 239015 240813 241549 240931 239927 238705 236828 235153 234977 235531 234844 232952 231627
57488 231627 231160 230100 228120 226322 224690 222091 218953 217160 217003 216939 216556 217000 218169 218378 217301 216524
57472 216524 216603 216257 215081 214486 215220 216395 217587 219539 222164 224223 225569 227493 230308 232844 234780
57457 234780 237102 239873 241905 243175 245147 248176 250954 253027 255394 258099 259725 259986 260418 261832 263414
57442 263414 264953 267442 270698 272880 273399 274020 276097 278827 281181 283559 286539 289785 292964 296028 298238
57427 298238 298762 298570 299623 301900 303438 303564 303669 304403 304690 304147 303943 304556 305158 305885 308136 311798 314776
57410 314776 316312 318303 322275 327397 332548 337941 343518 347944 350493 352056 353312 353909 354211 355693 358684
57395 358684 361838 364620 368089 372494 376483 379650 383449 388536 393567 397680 401790 406410 410674 414628
57381 414628 419927 426892 433366 437919 441845 446477 450906 454017 456550 459387 461803 463125 464250 465957
57367 465957 467478 468247 469204 471030 472918 474488 476926 480758 484394 486425 487603 489203 491292 493929 498004
57352 498004 503379 508199 511651 515533 521515 528789 535985 543366 551243 558155 562695 565730 568979 572818
57338 572818 577041 582250 588765 595556 601792 608086 614878 621227 626700 632704 640251 648010 654312 659645
57324 659645 665409 671662 677846 684465 692281 700881 709473 718046 726592 734517 742032 750632 760927 771466
57310 771466 780938 789910 799189 808226 816651 825645 836168 847308 857932 868491 879775 891450 903170
57297 903170 915556 928633 941028 952187 963605 976368 989275 1000999 1012259 1024127 1036061
57286 1036061 1047558 1059946 1074477 1090196 1105741 1121732 1139367 1158077 1176639 1195407 1215487
57275 1215487 1236874 1259142 1282659 1307409 1331945 1355252 1378316 1402218 1426208 1449422 1472862
57264 1472862 1497679 1523000 1547471 1571559 1596263 1620914 1644337 1666952 1689729 1712297 1734068
57253 1734068 1755992 1779182 1802964 1826243 1849544 1873756 1898151 1921728 1945353 1970578 1997415
57242 1997415 2025227 2054523 2085871 2118199 2150216 2182407 2215697 2249409 2282527 2315656 2349650
57231 2349650 2383632 2416623 2449892 2485318 2522458 2559498 2596062 2632864 2669584 2705534 2741621
57220 2741621 2779363 2818616 2858324 2898715 2940774 2984339 3028785 3074798 3123397 3173914 3224765
57209 3224765 3275484 3326213 3376170 3424473 3471544 3517846 3562217 3603263 3641287 3677080 3710110
57198 3710110 3739939 3768114 3796485 3824818 3852230 3879772 3909290 3940783 3973156 4006553 4041630
57187 4041630 4077510 4112868 4148273 4185359 4224437 4264886 4306828 4350336 4394127 4437206 4480732
57176 4480732 4526129 4572485 4617951 4662392 4706266 4748159 4785993 4819612 4849750 4875477 4895287
57165 4895287 4909821 4921175 4930443 4938163 4945904 4954674 4962693 4967292 4968232 4966961 4963789 4958366 4951889 4946149
57151 4946149 4941226 4936435 4932565 4930844 4930977 4932755 4938475 4951150 4971504 4999248 5035993 5084000 5142789
57138 5142789 5209318 5280328 5352416 5421654 5486014 5546765 5604863 5657699 5702202 5739220 5771729
57127 5771729 5800724 5826415 5851669 5880387 5913652 5950935 5993668 6044063 6101789 6165301 6235070
57116 6235070 6312092 6395033 6482833 6578846 6688959 6817324 6967677 7146888 7363120 7622310
57106 7622310 7930686 8299207 8741974 9272985 9909495 10677067 11607380 12733310 14089760
57097 14089760 15715017 17644737 19905927 22519955 25505805 28873167 32615067 36711366
57089 36711366 41131593 45825675 50719789 55733503 60794242 65819570 70689769 75255589
57081 75255589 79372179 82910988 85749351 87786848 88989541 89393524 89039444 87911454
57073 87911454 85956086 83151415 79543505 75231564 70348604 65060047 59555593 54022332
57065 54022332 48621652 43483710 38705750 34346129 30425617 26940009 23870405 21185210
57057 21185210 18844065 16807245 15040019 13508773 12179430 11022249 10014009 9133899
57049 9133899 8361231 7678510 7072907 6533188 6048368 5610282 5214175 4855634 4529470
57040 4529470 4231850 3960494 3712191 3482875 3270442 3074774 2894749 2727982 2573815
57031 2573815 2433880 2309277 2199413 2103685 2021968 1953298 1896198 1850447 1816702 1794661 1783466
57020 1783466 1783685 1797183 1825281 1867552 1919734 1970007 1999462 1991116 1940059 1854045 1745812 1627163
57008 1627163 1508040 1395915 1294275 1203520 1123518 1053807 992392 937087 887698 844700 806529
56997 806529 770729 737199 707654 682380 660121 640618 624539 611132 598729 587535 579502 575451
56985 575451 574668 577223 584253 595645 609217 622014 630708 631479 622045 603910 580946 556112 531142
56972 531142 508239 489382 474320 461572 451158 444304 441056 440490 442850 449159 459068 471344 486053
56959 486053 504087 525186 548769 575889 607103 638240 661117 669269 661429 639985 608748 572517
56947 572517 536068 502240 471913 445750 424481 407869 395269 387101 384092 385409 389409 396058
56935 396058 406802 422335 442303 467016 497570 534063 574583 615021 648475 666419 663450 641168
56923 641168 606001 563988 519170 475262 435471 400540 369373 341665 318124 298649 282436
56912 282436 269488 259919 252302 244862 237812 232355 228058 223570 219305 216845 216170 216057 216849 220124 225719
56897 225719 231679 237163 243110 250184 258408 268599 281755 297190 313688 332217 355063 382609
56885 382609 413381 446533 480964 512066 532917 539687 533642 517889 495200 469337 445056 425185
56873 425185 409715 398486 392563 392360 396873 405777 420240 440827 466478 496445 531522 572717
56861 572717 620323 674921 737556 807701 881192 949604 1001116 1024231 1014283 976983 923975 865139
56849 865139 806259 751837 705995 670465 644917 629771 626166 633325 648980 672717 706122 749560
56837 749560 801883 863587 937155 1023887 1123362 1235436 1357383 1476562 1569967 1615491 1604209
56826 1604209 1542431 1445425 1330744 1213654 1103958 1005753 920441 849145 792302 749158 718934
56815 718934 701333 695418 699636 713575 738127 773552 819078 874875 942491 1022153 1109920 1196517
56803 1196517 1267397 1305847 1300780 1253658 1176604 1083746 985837 891139 806070 733052 670884
56792 670884 618946 578741 550545 531659 519516 513946 514976 521081 531363 547229 570305 600626
56780 600626 637846 681364 727090 766037 788397 788548 766070 724542 670715 612481 555363 501545
56768 501545 452387 409651 373587 342443 315188 292497 274012 257302 241115 227246 217330 210008
56756 210008 203039 196259 190535 185611 180859 176581 172847 168538 163148 158095 154755 152605 150663 149201
56742 149201 148665 148408 147894 147693 148072 148076 147192 146377 146268 146028 145154 144658 145245 146055 146570 148034 151465 155758
56724 155758 159245 161755 163939 165930 167922 170702 174427 178118 181171 183944 186196 186775 185672 184555
56710 184555 184381 184365 184132 184763 186719 188912 190905 193846 198000 201541 203067 203265 202945 201694 199710 198573
56694 198573 198781 198824 198029 197872 198960 199406 197960 196223 195715 195255 193433 191328 190422 189909 188499 187009 186760
56677 186760 187144 187056 187117 188257 189608 189934 189642 189466 188772 187106 185737 185677 185842 185135 184528 185008 185298 183894
56659 183894 181759 180730 180724 180656 180622 181091 181478 181524 182506 185047 187412 188042 188021 188882 189828 189561 189057 189886 191309
56640 191309 191674 191360 191723 192274 191427 189139 186640 184542 183126 183196 184607 185352 184062 182005 180711 179481
56624 179481 177394 175803 176180 177208 176744 175182 174213 173749 172840 172198 172957 174196 174536 174950 177044 179685
56608 179685 180323 178819 177089 175755 173966 171878 170592 170157 170004 170705 172985 175762 177443 178352 179744
56593 179744 181381 182295 182774 183326 182918 180720 178331 177756 178459 178927 179760 182304 185552 187430 188196 189569
56577 189569 191473 192621 193424 195254 197586 198850 199402 200778 202768 204217 205943 209798 215432 220971 226354
56562 226354 233046 241124 249719 259790 273208 289251 304847 317965 328066 333796 333483 327917 319860
56549 319860 310985 301694 293280 287230 282741 277780 272351 268025 264771 261213 257577 255366 254376 252945
56535 252945 250936 249597 248744 246959 244285 241901 239497 235953 232188 230296 230074 229499 228355 228287 229488
56520 229488 230520 231290 232937 234769 234580 232242 229934 228613 227188 225291 223850 222691 220502 217451 215113
56505 215113 213743 212314 211135 211461 212593 212402 210773 209542 209033 207818 205943 205176 205803 206297 206416 207563
56489 207563 209802 211528 212335 213231 213919 213053 211363 211190 212580 213076 211804 210564 210427 210487 210507 211590 213548
56472 213548 214684 214802 215471 216847 217342 216902 217434 219350 220815 221068 221416 222287 222424 221665 221425 221774 221130
56455 221130 219539 219125 220500 221817 222130 222572 223448 223351 222115 221617 222675 224009 225027 226670 228712 229336
56439 229336 228311 227650 228199 228450 227595 226849 226890 226765 226142 225885 225834 224886 223676 224141 225945 226589 225559 225031
56421 225031 225875 226393 225744 225171 225078 224412 223688 225042 228356 230860 231510 232191 233767 234712 234716 235778 238442 240677
56403 240677 241707 243177 245250 245562 243614 242248 243063 244182 244359 245388 248393 251391 252782 253820 255496
56388 255496 256327 255387 254371 254588 255002 255115 256477 259390 261390 261058 260187 260257 260038 258755 258294 259965 262130
56371 262130 263203 264054 265489 266393 266369 267092 269031 269976 268864 267874 268687 269892 270247 271175 273693 276046 276786
56354 276786 277250 278690 279932 280143 280943 283489 286296 288127 290135 293109 295549 296527 297445 299019 299673 298905
56338 298905 298955 301112 303705 305773 309166 314807 320512 324885 329799 336539 343138 348084 353041 359238 364826
56323 364826 368592 372572 377960 382032 382320 380489 379004 377336 374646 372739 372978 373353 371975 370530 371134
56308 371134 372811 374191 376637 381495 387232 392343 398080 405381 412336 417757 423942 432665 441716 448673
56294 448673 454751 461622 467914 472474 477685 485761 494852 502520 510028 519503 529949 539746 550062 562093
56280 562093 573956 584054 594522 607645 621846 634963 648472 664752 683135 702330 723624
56269 723624 748003 773330 798204 825389 857579 893052 929456 968553 1013159 1062767 1116392
56258 1116392 1176369 1245074 1321317 1404290 1497507 1604221 1722479 1849512 1987465 2139659
56248 2139659 2304515 2478460 2661600 2855012 3055339 3257586 3460517 3663679 3861593
56239 3861593 4046542 4214946 4365656 4494259 4594520 4663638 4701093 4704620 4672604 4608471
56229 4608471 4517670 4402349 4263760 4107373 3940292 3765718 3584921 3402199 3222532 3046580
56219 3046580 2873306 2705372 2546733 2397191 2254615 2120277 1996661 1882300 1774227
56210 1774227 1673295 1581738 1497841 1418547 1344955 1279589 1220599 1164362 1111541 1064829 1023014
56199 1023014 983113 946033 914232 886040 858261 832022 810064 790687 770658 751690 737466
56188 737466 726497 714560 702101 692533 685199 676870 668374 662908 659384 654179 647934 644025 641966
56175 641966 638935 636050 636408 638667 639429 640166 644803 652218 658206 663099 670278 678878 685388 690938 699554
56160 699554 710664 720685 730428 743402 758406 771615 784573 802175 824090 846100 868649 895853
56148 895853 927242 958888 991870 1031367 1078135 1129115 1185668 1252697 1330237 1414365 1506035
56137 1506035 1610639 1729215 1858193 1996776 2145469 2297458 2440474 2567709 2679268
56128 2679268 2773968 2849244 2909182 2963225 3015593 3063362 3104156 3136920 3155730 3152791 3128734
56117 3128734 3091824 3046964 2993639 2933514 2869932 2799468 2713482 2608944 2489591 2357453 2213192
56106 2213192 2064483 1923505 1795153 1676814 1569304 1477659 1401163 1333534 1273772 1226412
56096 1226412 1190484 1159032 1130356 1108922 1094291 1080257 1066080 1057437 1054810 1051978 1047358 1045806
56084 1045806 1047787 1048095 1046814 1050087 1058358 1065264 1069740 1077528 1089049 1097835 1102987 1111211 1124379 1137009
56070 1137009 1148085 1163070 1182078 1198456 1211340 1227088 1246152 1261355 1271444 1283196 1297776
56059 1297776 1308528 1314763 1323955 1337518 1348515 1356329 1369166 1388785 1407392 1423028 1443080 1468956
56047 1468956 1492604 1512223 1535973 1565868 1593670 1617261 1645135 1679876 1713272 1742767 1776485
56036 1776485 1816825 1855557 1890161 1927800 1967734 1997761 2014529 2029964 2051407 2073295 2094410
56025 2094410 2124019 2163501 2200991 2232085 2267126 2310609 2353190 2392011 2438468 2496883 2555931
56014 2555931 2610362 2670594 2741431 2812533 2879855 2954898 3042500 3131384 3217021 3311166 3418160
56003 3418160 3525397 3628463 3741291 3869656 3999908 4126409 4263908 4419533 4579597
55994 4579597 4738123 4910427 5103579 5302352 5500220 5714346 5953319 6201289 6451794
55985 6451794 6724952 7032305 7358229 7696009 8067107 8483575 8928405 9395927 9913086
55976 9913086 10496610 11130059 11809564 12569309 13433729 14390510 15441919 16634903 18007989
55967 18007989 19561817 21320699 23370291 25797206 28654183 32030760 36092739 41000589
55959 41000589 46857842 53791695 61998751 71639529 82769263 95443813 109802318 125985129
55951 125985129 144118771 164497597 187631608 213996897 243940303 277874586 315814566
55944 315814566 355621035 391505626 415336224 420752572 406736155 377547972 339654394
55937 339654394 298748015 258705439 221840406 189270188 161202472 137355694 117318969
55930 117318969 100621408 86709150 75059187 65290174 57102409 50191420 44295486
55923 44295486 39257481 34964638 31276970 28068276 25279708 22873195 20775771 18917453
55915 18917453 17278326 15849624 14586977 13444694 12418560 11513385 10702271 9955761
55907 9955761 9278312 8678935 8135742 7624046 7150979 6729253 6343631 5975110 5632680
55898 5632680 5330150 5055072 4790023 4542388 4324774 4126950 3934237 3753761 3596412
55889 3596412 3451778 3306040 3166711 3045611 2934821 2822779 2717203 2629169 2550580 2469711
55879 2469711 2393506 2332670 2279607 2222628 2167879 2125936 2089683 2045782 1995723 1946192 1891132
55868 1891132 1822859 1749479 1682531 1618180 1548280 1478788 1419441 1365918 1309728 1255304 1209963
55857 1209963 1166990 1116188 1062276 1016474 978771 944331 917997 905760 900071 889713 876808
55846 876808 869140 863650 852821 839798 831923 826138 815383 802763 795173 789482 778960 766924 760286
55833 760286 755950 747073 736561 730905 726772 717143 704947 697358 692124 682593 670932 663392 657522
55820 657522 646954 634143 625835 620402 611870 602062 596780 594250 589210 584204 585130 589664 591607 592652
55806 592652 598468 607137 612839 617132 625237 634817 639716 641355 645213 649302 647190 639467 631412 622321
55792 622321 607897 590406 575843 563516 548703 532956 521698 514174 505902 498455 496722 498831
55780 498831 498692 496144 494987 493613 487671 479689 476013 476232 475388 474452 478676 487504 496044 504610 516620
55765 516620 528505 531934 525404 514317 500779 482856 462902 446738 434670 422235 409457 400619
55753 400619 395447 389393 382255 377897 375736 371062 363599 357415 352653 345595 336669 330161 326120 320660
55739 320660 314149 310968 311183 310427 308125 307936 309885 309856 307252 305659 305614 304008 300783 298915 297709 293491
55723 293491 287055 282974 281323 277533 270850 265597 263465 261739 259765 260117 262621 264032 264270 266386 270067
55708 270067 271955 272616 276113 282164 285889 286061 286473 288208 287696 283751 279664 276725 272154 265047 258241
55693 258241 252816 246649 239786 235402 234119 232992 231283 231663 234682 237632 239829 243508 248671 252699
55679 252699 255804 261075 268287 273472 275517 277403 280072 280932 279445 278276 277775 275207 270597 267541 267019
55664 267019 266167 264418 264876 268184 270923 271800 273709 277906 281677 283631 285897 289213 291052 290470 289717
55649 289717 289293 286511 280652 274502 269087 261957 252469 243727 237423 231634 225479 221017 218695 215804
55635 215804 211434 208234 207376 206423 204007 202003 201262 199794 196998 195140 194904 194019 191934 191095 191911 191307
55619 191307 188195 185564 185163 184839 183206 182131 182351 181360 178090 175201 174375 173663 171794 170640 170992 170290
55603 170290 167151 163985 162585 161202 158522 156465 156351 156158 154247 152164 151271 150212 148140 146815 147130
55588 147130 147139 145892 145563 147374 149046 148767 148207 149120 150393 150950 152205 155113 157866 158950 159552 160919
55572 160919 162377 163833 166920 171736 175811 178192 181123 185778 190001 192269 194138 196555 197492 195737
55558 195737 193381 192060 190182 186429 182553 180150 177966 175007 173005 173214 173872 173386 172926 173463 173418 171765
55542 171765 170254 170112 169692 167867 166477 166852 167176 165950 164852 165454 166240 165641 164862 164941 164159 161291 158367
55525 158367 157252 156464 154344 152333 151926 151316 148406 144565 142157 140748 138879 137207 136727 136134 133987
55510 133987 131496 130332 129824 128953 128775 130159 131425 130963 129969 129939 129915 128856 128199 129159 130006 129079 128069
55493 128069 129147 131134 131734 131396 131693 131889 130485 128479 127886 128561 129380 130849 133629 136099 136349 135140
55477 135140 134313 133838 132982 132542 133279 133871 133144 132491 133413 134546 133888 132145 131049 130216 128600 127204 127268
55460 127268 127414 125650 122806 121060 120538 120162 120328 121803 123354 123413 122816 123200 124019 123810 122965 122563 121999
55443 121999 120531 119660 121029 123367 124384 124378 125117 126541 127427 128070 129357 130397 129966 129133 129634 130763 130712
55426 130712 129775 129413 129274 128036 126185 125077 124265 122555 120741 120499 121497 122278 123028 124690 126341 126317 125154
55409 125154 124650 124759 124058 122556 121480 121017 120644 120836 122065 123137 122900 122553 123786 125840 126952 127409
55393 127409 128393 129069 127841 125533 124335 124435 124563 124944 126734 129219 130553 130696 130921 131153 130556 129978 130861
55376 130861 132407 132673 131909 131917 132707 132713 131870 131528 131657 130940 129391 128253 127627 126759 126166 126860 127951 127703 126484
55357 126484 125959 125924 124854 123168 122935 124413 125713 125948 126065 126532 126729 126692 127132 127683 127258 125967 124718
55340 124718 123452 121830 120921 121848 123533 124238 124459 125657 127104 127017 126043 126318 127581 127619 126341 126012 127301
55323 127301 128389 128295 127995 127812 126690 124714 123580 123927 124555 124789 125284 126152 126572 126543 126848 127208 126654 125643
55305 125643 125416 125445 124097 121846 121044 122313 123820 124406 124829 125616 126264 126915 128313 129671 129070 126458 123975
55288 123975 122957 122846 123158 124114 125069 124831 123853 123777 124588 124731 124143 124452 125830 126476 125796 125384 126147 127072
55270 127072 127611 128728 130668 132053 132205 132164 132531 132403 131294 130151 129652 129413 129410 130247 131479 131715 130984 130921
55252 130921 132027 132797 132187 130934 129842 128721 127628 127234 127382 127093 126398 126288 126637 126218 125031 124438 124717
55235 124717 124701 124173 124266 125105 125401 124930 125017 126028 126746 126822 127346 128322 128069 126089 124186 123724 123942 123850 123648
55216 123648 123350 122198 120482 119972 121504 123838 125590 126540 126602 125601 124571 125066 126646 127284 126768 127112
55200 127112 128927 130125 129295 127812 127298 127342 127055 126662 126295 125276 123812 123368 124204 124649 123898 123315 123791
55183 123791 124140 123564 123463 125112 127457 128850 129301 129588 129758 129909 130859 132699 134126 134303 133864 133295 132162
55166 132162 130808 130735 132201 133450 133474 133466 134282 134659 133506 131987 131731 132686 134197 136400 139087 140908 141153
55149 141153 140787 140486 139465 137428 135714 135094 134410 132918 131943 132573 133617 133679 133429 133988 134797 134926 134876 135257
55131 135257 135243 134182 133231 133546 134321 134435 134508 135381 136033 135114 133345 132423 132607 133200 134242 135867 137035 136849
55113 136849 136237 136525 137282 137308 136868 137161 138283 139332 139900 140092 139771 139088 138929 139681 140489 140802 141495 143227
55095 143227 144991 145667 145805 146456 147422 148092 148800 149913 150735 150780 150970 152155 153641 154577 155457 156780 157619
55078 157619 157188 156466 156590 156896 156323 155389 154930 154172 152089 149530 148045 147579 147245 147266 148112 148792 148164 147107
55060 147107 147176 147926 147732 146615 146015 146296 146641 147026 148138 149526 149914 149322 149043 149476 149594 148641 146904 144860
55042 144860 142813 141275 140513 139982 139184 138655 139059 139936 140425 140497 140357 139569 138106 137258 137964 139127 139151 138283
55024 138283 137751 137463 136409 134745 133574 133160 133056 133502 134958 136749 137906 138854 140520 142252 142578 141680
55008 141680 141174 141595 141976 141906 142213 143391 144902 146286 147661 148998 150036 150931 151967 152784 152905 152732 152978
54991 152978 153488 153700 153787 154196 154552 154222 153530 153178 152989 152410 151717 151485 151458 151160 150985 151397 151784 151503 151339
54972 151339 152372 154064 155057 155268 155610 156213 156557 156858 157663 158541 158744 158655 158987 159187 158305 156911 156363 156680
54954 156680 156943 157296 158576 160362 161370 161533 161776 161988 161227 159799 159088 159321 159433 159192 159515 160558 161354
54937 161354 161589 161981 162696 163135 163486 164855 167592 171039 175056 180158 186008 191446 196279 201467 207307
54922 207307 213047 218511 224439 230784 236196 239588 240896 240032 236627 231181 225062 218980 212690 206354
54908 206354 200783 196039 191299 186485 182651 180345 178838 177347 175775 173931 171359 168410 166342 165915
54894 165915 166814 168613 171175 173941 176049 177506 179221 181685 184614 187953 192079 196905 201881 207014
54880 207014 212835 219300 225778 232071 238264 243664 247134 248448 248130 246075 241724 235516 228706 221736
54866 221736 214252 206726 200434 195603 191067 186087 181182 176912 173224 170227 168288 167051 165628 163950
54852 163950 162718 162007 161223 160411 160058 159586 157799 155028 153102 152759 152749 151996 150912 149933 148427 146017 143640
54835 143640 142342 142061 142366 143352 145047 146841 148183 149172 150021 150658 151118 151554 151711 151244 150582 150491 150802 150700
54817 150700 150233 150345 151330 152569 153829 155480 157295 158372 158475 158197 157761 157042 156771 158101 160714 162928
54801 162928 164046 165096 166880 168786 169939 170145 169347 167608 165971 165784 166783 167327 166847 166465 166813 167060
54785 167060 166689 166511 167118 167941 168660 170031 172468 175231 177895 181193 185531 189997 193767 197306 201371
54770 201371 206001 211176 217229 223878 230073 235495 240872 246129 249630 250131 248223 245046 240915 236029
54756 236029 231139 226443 221009 214281 207197 200971 195795 191479 188207 185917 184037 182512 181915 181953 181279
54741 181279 179509 177978 177692 178018 178335 179419 181946 185056 187673 190077 192951 196097 199274 203146 208073
54726 208073 213093 217428 221934 227653 233889 239094 242837 245481 246645 245473 242075 237477 232471 227331
54712 227331 222154 216697 210486 203781 197765 193121 189305 185851 183272 181874 180837 179528 178646 178909 179619
54697 179619 179687 179171 178560 177494 175483 173158 171459 170185 168596 166889 165873 165635 165606 165528 165375 164847 163878
54680 163878 163131 163109 163302 163014 162379 161732 160714 159001 157285 156555 156900 157844 159207 160859 162238 162986 163397
54663 163397 163570 162968 161614 160779 161509 163251 164818 165828 166282 165775 164318 163114 163258 164308 165174 165663
54647 165663 166134 166444 166395 166459 166926 167075 166335 165401 165043 164726 163709 162668 162675 163315 163364 162822 162680 163081 163242 162992
54627 162992 162912 163136 163307 163585 164490 165824 166876 167534 168177 168689 168630 168179 167928 167925 167800 167507 167062 166042 164327
54608 164327 162874 162618 163010 162768 161742 160894 160754 161014 161492 162334 163307 163828 163711 163230 162677 162415 162877 163824
54590 163824 164209 163562 162867 163193 164222 165072 165766 166686 167362 167140 166474 166155 165838 164740 163338 162828 163160 163135
54572 163135 162374 161805 162149 163125 164185 165025 165436 165585 166262 167928 169790 170729 170753 170584 170390 170079 170248 171433
54554 171433 172849 173280 172955 173120 174015 174759 175108 175812 177196 178744 180135 181478 182502 182754 182575 182668 182801
54537 182801 182194 181124 180708 181045 180984 179960 178747 178138 178048 178223 178716 179346 179647 179621 179708 179921 179854 179453 178861
54518 178861 177692 175664 173805 173741 175673 178272 180567 182666 184567 185779 186464 187560 189191 190145 189501
54503 189501 187761 185834 183872 181762 180003 179404 180293 182301 184538 185985 186359 186541 187507 188935 189699 189522
54487 189522 189144 188916 188429 187691 187451 188020 188799 189382 190209 191658 193305 194631 195823 197415 199498 201671
54471 201671 203515 205027 206747 209271 212355 214910 216320 217207 218341 219483 220154 220776 221885 222859 222823 222298
54455 222298 222458 223078 222857 221667 220809 221021 221804 222900 224698 226832 227990 227728 227120 227083 227432 228048 229538
54438 229538 231918 233986 234904 235314 236066 236826 236911 236647 236900 237856 239116 240597 242532 244809 246928 248512
54422 248512 249588 250478 251425 252136 251932 250780 249792 249976 250800 250874 249758 248048 246050 243746 241970 242016 243763
54405 243763 245601 246633 247634 249346 251175 252327 253076 254076 255365 256788 258571 260775 262892 264618
54391 264618 266329 268304 270156 271562 272748 273768 274121 273702 273413 274178 275858 277679 279228 280613 282178
54376 282178 284449 287787 291765 295381 298154 300475 302853 305583 309207 314216 319933 324676 327538 329175
54362 329175 330468 331364 331551 331271 330738 329553 327487 325184 323350 321793 319889 317527 314942 312111 308965
54347 308965 305757 302636 299145 294724 289541 284464 280313 277349 275232 273340 271387 269737 268817 268428 268109
54332 268109 267969 268344 268735 268013 265841 263102 260748 258966 257641 256832 256443 256031 255196 253758 251654 249212
54316 249212 247376 246901 247454 248244 249203 250611 251951 252425 252387 252838 253548 253237 251771 250595 250561 250870 250674 250309
54298 250309 250233 250079 249535 249024 248822 248537 248128 248335 249435 250643 251348 251860 252342 252172 251093 249891 249178 248542
54280 248542 247597 246771 246299 245565 244310 243390 243432 243737 243425 242675 241930 240907 239369 237963 237225 236636 235637 234759
54262 234759 234745 235333 235895 236443 237071 237247 236741 236484 237344 238664 239080 238299 237134 236344 236289 237098 238264 238658
54244 238658 237793 236508 235658 234915 233656 232147 230893 229650 228197 227243 227414 228016 227985 227454 227183 227145 226968
54227 226968 227192 228595 230609 231773 231684 231256 231202 231383 231612 232020 232506 232661 232273 231272 229394 226623 223780
54210 223780 221885 221041 220538 219850 218974 218068 217345 216999 216762 215967 214523 213242 212657 212275 211688 211605 212790 214613
54192 214613 215732 215809 215556 215501 215628 215914 216279 216364 216105 216214 217334 219126 220838 222223 223220 223507 223247 223507
54174 223507 224836 226121 225991 224727 223575 222751 221516 219815 218403 217499 216610 215652 215087 214982 214935 214803 214583
54157 214583 213816 212100 209977 208328 207145 205946 204993 204899 205269 205053 204228 203910 204723 206142 207471 208470 209018
54140 209018 209215 209778 211285 213031 213724 213406 213534 214948 216798 217756 217463 216444 215377 214742 214661 214895 215406
54123 215406 216678 218981 221672 223994 226270 229431 233651 238363 243383 248947 254807 260385 265701 271121
54109 271121 276212 279901 281691 281731 279803 275481 269359 262944 257089 251613 246559 242643 240051 237934 235599
54094 235599 233315 231507 230000 228560 227423 226791 226351 225749 225100 224732 224811 225313 226012 226441 226335 226093 226319
54077 226319 226977 227538 227869 228387 229442 231041 233019 234906 235987 236189 236581 238156 240427 242099 242792 243059
54061 243059 242966 241908 239840 237557 235680 234375 234110 235532 238355 241383 243851 245855 247435 248331 248893
54046 248893 250096 252285 254848 257411 260449 264313 268610 272982 277699 282981 288399 293379 297788 301759
54032 301759 305491 309391 313857 318790 323869 329166 334791 340065 343976 346497 348518 350448 351839 352523
54018 352523 353042 353675 353998 353715 353138 352578 351991 351374 350612 348896 345265 339966 334345 329249 324455 319752
54002 319752 315392 311273 306926 302692 299720 298270 297161 295425 293436 291815 290356 288758 287406 286572
53988 286572 285696 284246 282601 281347 280463 279864 279941 280792 281587 281560 281098 281158 282099 283670 285629 287762 289834
53971 289834 292069 295148 299267 303880 308789 314666 321795 329032 334719 337972 338400 335512 329467 321881
53957 321881 314740 308778 303645 299163 295389 291921 288384 285525 284675 285943 287925 289466 290910 293271
53943 293271 296869 301266 306039 310984 315735 319676 322429 324248 325805 327570 329466 331129 332403 333441
53929 333441 334465 335579 336825 338302 340279 343210 347387 352446 357582 362466 367563 373219 378953 384261
53915 384261 389633 396020 403589 411814 420450 429493 438335 446078 452733 459063 465114 469861 472564 473567
53901 473567 473517 472666 471232 469544 467458 464450 460612 456789 453422 450052 446242 442105 437554 431995 425259
53886 425259 418037 410843 403328 395197 387039 379623 373023 367008 361668 357074 352852 348639 344458 340297
53872 340297 335924 331527 327828 325052 322422 319221 315686 312378 309361 306549 304197 302376 300548 298271
53858 298271 295818 293545 291277 288875 286766 285194 283517 280992 277843 274926 272704 271157 270271 270009 270127
53843 270127 270516 271316 272344 272933 272831 272630 272792 272864 272287 271373 270795 270652 270704 270992 271509 271759 271479 271327 272036
53824 272036 273219 273862 273703 273323 273063 272689 272075 271554 271502 272029 273054 274407 275979 277978 280736 284016 287026
53807 287026 289413 291766 294758 298373 302397 307057 312565 318594 324810 331390 338347 344887 350216 354595
53793 354595 358886 363437 368058 372647 377085 380925 383889 386326 388401 389302 388169 385513 382768 380627
53779 380627 378694 376594 374378 371782 368052 362836 356612 350049 343504 337335 332068 327956 324695 321806
53765 321806 319090 316617 314492 312627 310682 308286 305482 302729 300338 298112 295759 293346 291132 289239
53751 289239 287726 286636 285713 284476 282892 281586 281070 281101 281150 281073 280959 280714 280213 279578 278969 278439 278226 278730
53733 278730 279883 281004 281581 281701 281473 280771 279918 279812 280745 281800 282085 281920 282059 282446 282651 282983 284154
53716 284154 286171 288496 291095 294379 298270 302127 305611 308842 311759 314024 315693 317364 319513 321967
53702 321967 324177 325861 327497 330140 334478 340038 345790 351465 357467 363420 367921 370234 371157 371578 371293
53687 371293 370108 368963 368730 368737 367919 366745 366534 367253 367545 366804 365810 365249 364875 364378 363939 363609 363101 362479
53669 362479 362233 362446 362544 362135 361491 361077 361099 361566 362235 362483 361759 360205 358506 357324 357215 358591 361054 363172
53651 363172 363730 362993 362026 361127 359868 358399 357585 357812 358569 359351 360164 361019 361644 361931 362184 362874 364513 367498
53633 367498 371555 375613 378877 381685 384617 387284 388986 390193 392173 395241 398528 401555 404863 408858
53619 408858 413110 417132 420966 424619 427697 430045 432119 434333 436558 438587 440617 442993 445784 448798
53605 448798 451780 454610 457570 461183 465414 469275 471780 473115 474307 475947 477738 479094 479586 479083 478041
53590 478041 477411 477614 477881 477241 475754 474120 472502 470647 468749 467205 465750 463826 461606 459683 457995
53575 457995 456030 453894 452104 450446 448126 445053 442002 439523 437618 436325 435648 435028 433825 432227 430822
53560 430822 429688 428931 429560 432248 435557 437089 436465 435561 435731 436459 437030 437763 439027 440513 442115 444188
53544 444188 446434 447867 448410 449207 450831 452596 454116 456049 458593 460875 462707 465437 470005 475604 481422
53529 481422 488213 496742 505946 514361 522438 531724 542401 553335 564227 576040 589329 603470 617726
53516 617726 632019 646546 661498 677243 694134 712079 730838 750577 771551 793503 815958
53505 815958 838873 862336 885818 908465 930085 951238 972311 992996 1012680 1031038 1048246
53494 1048246 1064875 1081435 1097846 1113592 1128558 1143403 1158842 1174878 1191036 1207049 1223081
53483 1223081 1239472 1256357 1273298 1289404 1304308 1318914 1334449 1350768 1366396 1380328 1392814
53472 1392814 1404168 1413930 1421735 1427940 1432623 1434882 1434046 1430858 1426484 1420858 1412972 1402468 1390075
53459 1390075 1376694 1362809 1348678 1334504 1320424 1306648 1293277 1279738 1264885 1248131 1230073
53448 1230073 1211647 1193251 1175166 1158013 1141982 1126152 1109524 1092490 1076517 1062651 1051047
53437 1051047 1041682 1034610 1029469 1025507 1022314 1020136 1019381 1020047 1021612 1023287 1024548 1025656 1027567 1031204
53423 1031204 1036991 1045005 1055046 1066491 1078696 1091808 1106583 1123207 1140974 1159422 1178943 1199800
53411 1199800 1221340 1242878 1264694 1287444 1311157 1335530 1360751 1387250 1415061 1444133 1474896
53400 1474896 1507854 1542953 1579974 1619117 1660568 1703845 1748310 1793979 1841166 1889623 1938732
53389 1938732 1988211 2037960 2087479 2136156 2183986 2231364 2278334 2324536 2369594 2413021 2454025
53378 2454025 2492004 2526975 2559060 2587946 2613328 2635350 2653902 2667987 2676688 2680416 2680339 2676840
53366 2676840 2669312 2657224 2640382 2618290 2590302 2556650 2518619 2477557 2434206 2388995 2342352
53355 2342352 2294624 2246144 2197406 2148776 2100219 2051842 2004566 1959715 1918012 1879306 1842990
53344 1842990 1808135 1773588 1738704 1703892 1669858 1636594 1603855 1572331 1543306 1517085 1492653
53333 1492653 1469102 1446684 1426240 1408256 1392729 1379381 1367653 1356938 1347055 1338122 1329784 1320969
53321 1320969 1310680 1298811 1286010 1272989 1260119 1247524 1235403 1224177 1214204 1205283 1196751 1188337
53309 1188337 1180732 1175047 1171900 1171182 1172369 1174675 1177242 1179748 1182733 1186971 1192649 1199524 1207642 1217378
53295 1217378 1228854 1241760 1255769 1270868 1287304 1305397 1325279 1346605 1368746 1391374 1414543
53284 1414543 1437954 1460553 1481217 1499541 1515712 1530011 1542717 1554017 1563609 1570769 1575183 1577195
53272 1577195 1576948 1573920 1567833 1559304 1548928 1536377 1521226 1504120 1486119 1467302 1446985 1425064
53260 1425064 1402143 1378471 1353716 1327884 1301664 1275754 1250378 1225402 1200376 1174642 1148027
53249 1148027 1121266 1095177 1069726 1044602 1020300 997664 976491 955625 934538 913938 894588
53238 894588 876257 858123 839773 821662 804885 790333 777674 765502 753012 741131 731291 723509
53226 723509 716635 710118 704349 699304 694046 687798 680560 672415 663161 652959 642495 632126 621494
53213 621494 610239 598509 586525 574272 561886 549800 538304 527426 517323 508212 499871 491839
53201 491839 484165 477283 471072 464757 457965 451135 444625 438056 430845 422903 414576 406345 398670 391616
53187 391616 384554 376853 368942 362081 356957 353086 349680 346419 343267 340268 337723 335964 334735 333409
53173 333409 331904 330662 329637 328220 326414 325184 325147 325680 325843 325525 325093 324529 323539 322117 320444 318545
53157 318545 316471 314587 313243 312399 311767 311040 309838 307876 305416 303176 301580 300492 299799 299735 300371 301289
53141 301289 302037 302533 302868 303224 304102 305963 308357 310044 310353 309881 309510 309381 309333 309664 310794 312531 314343
53124 314343 316064 317816 319543 321233 323389 326630 330777 334844 338085 340744 343666 347290 351097 354062
53110 354062 355667 356315 356655 356750 356282 355261 353903 351909 348702 344548 340615 337529 334615 331090 327353
53095 327353 324459 322731 321600 320451 318993 316992 314399 311753 309882 309071 308842 308612 308277 308130 308459 309211
53079 309211 309863 309722 308575 306967 305637 304773 304097 303510 303161 302876 302009 300242 298207 296851 296290 295764 294801
53062 294801 293854 293504 293547 293417 293155 293184 293364 293195 293021 293943 296129 298232 299208 299862 301669 304611 307246 308574
53044 308574 308869 308829 308831 309005 309218 308968 307949 306631 305682 305036 304272 303651 303831 304680 305362 305628 306075 307024 308066
53025 308066 308889 309649 310281 310281 309459 308230 307007 305968 305451 305754 306449 306798 306946 307725 309126 310095 310154 310118 310674
53006 310674 311331 311472 311486 312049 313055 314097 315465 317814 321149 324732 327708 329477 329907 329605 329509 329917 330356
52989 330356 330659 331502 333541 336621 340142 343499 345839 346294 345022 343290 341982 340778 339311 338195 338066
52974 338066 338363 338046 337068 336280 336314 337321 339334 342024 344452 345946 347010 348630 350903 352975 354121 354268
52958 354268 353677 352735 351789 350671 348693 345705 342725 340836 339834 338757 337431 336523 336190 335689 334533 333252
52942 333252 332598 332514 332228 331166 329460 327650 326036 324496 323074 322467 323410 325506 327336 328002 328021 328302 328880
52925 328880 329160 328916 328391 327770 327149 326767 326701 326604 326226 325900 326005 326282 326250 326025 326103 326532 326852 326759 326290 325481
52905 325481 324354 323186 322377 322093 322299 323015 324204 325595 326836 327654 327715 326764 325191 324037 324060 325097 326596
52888 326596 328284 329966 331291 332273 333547 335466 337373 338395 338594 338723 339197 340005 341313 343404 346117
52873 346117 348988 351869 354921 358108 361140 363780 365854 367185 367917 368541 369194 369210 367815 364933 360958
52858 360958 356275 351536 347806 345646 344408 343060 341342 339434 337061 333833 330164 326855 323958 320953
52844 320953 317931 315635 314285 313227 311889 310347 308790 307125 305326 303705 302607 302206 302593 303700 305171
52829 305171 306588 307710 308271 307935 306913 306246 306792 308168 309260 309524 309150 308314 307065 305802 305076 304950
52813 304950 305164 305756 306808 307782 307978 307654 307868 309082 310598 311472 311376 310452 308909 306948 304671 302048 299340
52796 299340 297353 296713 296990 297124 296600 295712 294846 294115 293538 292945 291891 290276 288804 288177 288126 288048 288251 289560
52778 289560 291852 294071 295667 296914 297769 297663 296751 296228 296820 297871 298527 299016 300120 301944 303828 305130
52762 305130 305651 305620 305535 305712 305862 305564 305205 305821 307794 310293 312258 313339 313651 313313 312663 312312 312488 312741
52744 312741 312708 312754 313468 314896 316687 318600 320419 321732 322295 322469 322855 323567 324188 324350 324081 323680 323516 323941
52726 323941 325165 327019 328883 329962 329807 328601 326833 324787 322646 320983 320477 320897 321045 320215 319166
52711 319166 318959 319364 319306 318628 318354 319170 320510 321433 321690 321653 321650 321665 321426 320728 319837 319376 319509 319624 319218 318717
52691 318717 318758 319115 319128 318859 318927 319448 320109 321032 322471 323784 323929 323063 322451 322569 322444 321257 319519 318162
52673 318162 317382 316895 316515 316012 315153 314317 314375 315597 317375 319238 321245 323149 324235 324509 325021 326361 327806
52656 327806 328620 329223 330269 331483 332462 333778 336107 338798 340531 341066 341257 341505 341306 340343 339052 337893
52640 337893 336822 335738 334872 334476 334468 334594 334690 334741 334843 335139 335673 336451 337704 339790 342639 345551 347727 348749
52622 348749 348403 346564 343701 341101 339963 340237 340699 340193 338600 336787 335842 336274 337698 339283 340478 341196
52606 341196 341449 341246 340846 340638 340644 340571 340411 340513 340897 341093 340911 340824 341188 341613 341539 341061 340743 340899 341510 342569
52586 342569 344119 346144 348656 351666 354823 357410 359005 359881 360541 361117 361433 361266 360327 358392 355808 353519
52570 353519 352235 351778 351505 351110 350784 350856 351511 352582 353494 353704 353287 352694 351921 350524 348618 347110 346570
52553 346570 346473 346064 345343 344641 343733 342130 339994 338110 337040 336795 337213 338165 339368 340375 340806 340561 339982
52536 339982 339809 340598 342006 342993 342995 342540 342494 343109 344085 345170 346352 347721 349405 351401 353319 354725 355847
52519 355847 357487 360023 363015 366067 369449 373468 377758 381689 385116 388301 391418 394513 397482 399724
52505 399724 400238 398544 395230 391296 387319 383511 379993 376585 372823 368718 365081 362606 361032 359629
52491 359629 358062 356244 353888 350878 347771 345297 343593 342435 341947 342472 343926 345766 347509 348989 350355
52476 350355 352072 354593 357710 360633 362998 365310 368082 371113 374060 377042 380101 382742 384777 387067
52462 387067 390592 395100 399442 402893 405309 406342 405483 402838 399104 394751 389854 384648 379574 374813
52448 374813 370330 366305 362927 359842 356423 352644 349196 346734 345375 344843 344684 344445 344055 343925 344342 344949
52432 344949 345216 345148 345081 345052 344838 344427 343982 343580 343461 344220 346176 348703 350717 351760 352215 352643 353357 354416
52414 354416 355638 356823 358287 360788 364526 368645 372280 375759 380243 386489 394465 403769 413829 423983
52400 423983 433786 442816 449863 453107 451908 447738 442456 436266 428424 419325 410589 403298 397375 392660
52386 392660 389365 387374 386140 385468 385577 386347 387347 388650 390739 393585 396666 399962 403957 408595 413146
52371 413146 417360 421772 426598 431131 434560 436708 437714 437693 436922 435740 434083 431735 429096 426960 425440
52356 425440 423916 422240 421138 421103 421719 422458 423421 424877 426697 428692 430876 433037 434587 435312 435858 437104
52340 437104 439406 442605 446282 449819 452793 455643 459453 464761 471025 477503 484158 491356 499217 507740
52326 507740 517237 528105 540295 553252 566268 578802 590586 601573 611733 621022 629727 638579
52314 638579 648240 658930 670894 684761 700750 717923 735116 752492 771243 791797 813351 835284
52302 835284 857949 881704 906074 930349 954261 977492 999180 1018437 1034959 1048744 1059678
52291 1059678 1067786 1073462 1077160 1079249 1080374 1081404 1082657 1083601 1083601 1082520 1080402 1077128 1072757 1067770 1062692
52276 1062692 1057785 1053302 1049528 1046358 1043279 1039999 1036748 1033931 1031964 1031394 1032434 1034314 1035931 1037439
52262 1037439 1040397 1046002 1053908 1063164 1073503 1085216 1098505 1113584 1130755 1149720 1169273 1188289
52250 1188289 1206525 1223947 1239868 1253418 1264442 1273226 1279711 1283716 1285721 1286723 1287320 1287366 1286350
52237 1286350 1283766 1279331 1273228 1265943 1257579 1247696 1236125 1223469 1210360 1196645 1181891 1166385
52225 1166385 1151007 1136336 1122420 1109199 1096578 1084125 1071249 1057795 1044224 1031284 1019718
52214 1019718 1010018 1002060 995076 988334 981808 976033 971491 968396 966820 966685 967721 969725 972701 976583
52200 976583 981037 985714 990484 995227 999786 1004436 1010039 1017258 1025706 1034220 1041856 1048354 1053765 1057919
52186 1057919 1060230 1059962 1056800 1051254 1044231 1036213 1027213 1017593 1008348 1000217 992974 986023 979340 973374
52172 973374 968301 963961 960412 958045 957061 957151 957812 958824 960355 962639 965579 968806 972251 976382 981483
52157 981483 986802 990936 993147 993813 993562 992570 990965 989371 988615 989130 990869 993478 996433 999391 1002585
52142 1002585 1006438 1010670 1014295 1016743 1018463 1020183 1022102 1024137 1026439 1029275 1032859 1037699 1044638 1054164
52128 1054164 1065979 1079528 1094521 1110681 1127552 1145020 1163520 1183284 1203837 1224632 1245629
52117 1245629 1266748 1287300 1306552 1324450 1341260 1357017 1371958 1386999 1402890 1419159 1434701
52106 1434701 1449351 1464255 1480673 1498905 1518236 1537460 1555510 1571999 1587132 1600896 1612615
52095 1612615 1621489 1627137 1629251 1627301 1621155 1611600 1599667 1585907 1570918 1555991 1542274 1529487
52083 1529487 1516328 1502034 1486873 1471291 1455486 1439839 1424937 1410923 1397414 1384182 1371427
52072 1371427 1359400 1348339 1338819 1331576 1326787 1323958 1322576 1322592 1324351 1328517 1335889 1346646 1359716
52059 1359716 1373530 1387518 1402445 1419175 1437596 1456756 1475423 1492386 1506818 1518770 1529041
52048 1529041 1538300 1546417 1552657 1556268 1556904 1554877 1551057 1546295 1540903 1534889 1528471 1521907 1514935 1506975
52034 1506975 1497946 1488380 1478629 1468469 1457647 1446305 1434538 1421862 1407451 1390821 1372250 1352716
52022 1352716 1333418 1314974 1297005 1278798 1260478 1243119 1227580 1213651 1200658 1188490 1177575
52011 1177575 1168029 1159328 1150878 1142536 1134348 1125990 1116785 1106297 1094777 1082910 1071189 1059655 1048166
51998 1048166 1036791 1025936 1016163 1007824 1000663 993779 986162 977305 967171 955681 942495 927281
51986 927281 910002 891032 871260 851890 833599 815921 798000 779977 763000 747755 733752
51975 733752 720426 708217 698021 690140 684444 681167 680807 683380 688330 695045 703047 711771 720595 728930
51961 728930 736053 741122 743710 743993 742067 737616 730933 723820 718598 716235 716128 717640 721040 726817 734931
51946 734931 745252 758227 774578 794456 817214 841939 867826 893860 918237 938520 952755
51935 952755 960561 962908 960833 954594 943973 928958 910054 888470 866087 844582 824178 803659
51923 803659 781953 759220 736239 713523 691634 671672 654512 639879 626936 615642 606788 600821
51911 600821 597304 595583 595460 597159 600953 606700 613480 619927 625282 629870 634162 637704 639310 637983
51897 637983 633269 625228 614637 602811 590582 577780 564311 551286 540290 531862 525430 520517
51885 520517 517198 515606 515806 518062 522470 528433 535206 542882 552152 563133 575077 587148 598801
51872 598801 609531 618830 626324 631451 633362 631868 628192 624016 620064 616412 613743 613099 614509 616942
51858 616942 619610 622329 624705 626179 626982 627830 628350 626980 622793 616376 608452 598808 587343 575213
51844 575213 563959 553930 544355 534748 525625 517950 512174 507844 504080 500577 497949 496840 497049 498000
51830 498000 499577 501699 503541 504325 504644 505657 506939 506618 503996 500672 498463 497457 496831 496435 496569 497066
51814 497066 497565 498134 498812 499151 498897 498502 498219 497418 495674 493930 493546 494567 495859 496694 497284 497949 498750
51797 498750 499945 501946 504601 507118 508917 510145 511229 512247 512912 512986 512631 512359 512554 513017 513263 513283 513571
51780 513571 514231 514613 514272 513929 514933 517898 522261 527118 532193 537976 545131 553750 563193 572709 582070
51765 582070 591184 599127 604143 604936 601657 595504 587677 578962 569819 560511 551256 542371 534084 526218
51751 526218 518458 511008 504552 499446 495329 491656 488222 485105 482605 481311 481683 483411 485700 488263
51737 488263 491419 495144 498772 501957 505185 508970 513170 517421 521499 524800 526317 525904 525011 525391 527416
51722 527416 530278 533403 536888 540721 544307 546838 547749 546899 544634 541604 538351 535238 532781 531467 530959
51707 530959 530000 527650 524306 521203 519334 519232 521203 525000 529358 532532 533435 532201 529851 527597 526132
51692 526132 525322 524792 524833 526174 528695 530990 531613 530261 527391 523371 518703 514495 511858 510931 511050 511667
51676 511667 512582 513501 514032 514161 514265 514581 514885 514695 513762 512573 512406 514542 519317 526216 534810 544985
51660 544985 556068 566568 575166 581428 585247 586326 584814 581820 578685 576127 574600 574898 577725 582986
51646 582986 589917 597448 603976 607466 606625 601747 593933 583913 572173 559627 547295 535549 524292
51633 524292 513616 503772 494875 487201 481325 477374 474603 472365 471024 471152 472326 473523 474288 474633 474207
51618 474207 472532 469848 466795 463458 459625 455776 452780 450669 448652 446405 444500 443506 443460 444284 445929
51603 445929 447979 449900 451830 454501 458319 463216 469375 477249 486695 497009 508156 521154 536518
51590 536518 552688 566524 575267 577977 575515 569677 562351 555110 549187 545422 544113 545144 548389 553799
51576 553799 561116 570013 580734 594005 609940 627528 645634 664022 683068 703174 724929 748938
51564 748938 774602 799897 823596 847258 873820 904499 938244 973848 1011033 1049212 1086479
51553 1086479 1120300 1148292 1168181 1178136 1177845 1168648 1152205 1129497 1101246 1068590 1033065 996373
51541 996373 960197 925495 891853 858248 824652 792327 762501 735544 711478 690353 671763
51530 671763 654754 638643 623378 608940 595113 582115 570706 561258 553323 546385 540358 535048
51518 535048 529855 524493 519393 514964 511021 507344 504192 501719 499448 496867 494162 491877 490138 488697
51504 488697 487462 486594 486295 486792 488233 490381 492725 495094 497747 500645 503129 504593 505063 504812 503951 502823
51488 502823 502301 502999 504462 505688 506346 506896 507525 507527 506001 502874 498944 494960 490927 486502 481878 477802
51472 477802 474604 471679 468314 464642 461226 458019 454459 450482 446708 443628 441269 439737 439398 440292 441923
51457 441923 443770 445546 446914 447674 448411 450257 453680 458134 463169 469199 476745 485549 494991 504968 515829
51442 515829 527788 540849 554884 569175 582059 591656 597100 598918 598402 596808 594938 592951 590391
51429 590391 586438 580265 571421 560235 547936 536096 525750 517040 509564 502883 496865 491838 488295
51416 488295 486184 484725 483301 482243 482178 482899 483567 483901 484385 485337 486582 488163 490499 493557 496679 499637
51400 499637 503244 508464 515326 523067 530934 538602 546235 554386 563544 573712 584820 597434 612385
51387 612385 629719 648804 669687 693563 721622 754127 790854 831687 876418 924581 975799
51376 975799 1029641 1084944 1140056 1193831 1245189 1291182 1326782 1347752 1353192 1344630 1323552 1290859
51364 1290859 1248041 1197447 1141451 1082213 1022055 963131 906670 853205 803493 758562 718914
51353 718914 684262 654096 628088 606030 587816 573367 562160 552994 544621 536510 528724 521414
51341 521414 514819 509338 504968 500901 496321 491424 487089 483632 480476 477026 473304 469701 466534 463918
51327 463918 461724 459591 457232 454744 452472 450727 449790 449910 450978 452370 453452 454156 454850 455907 457629
51312 457629 460301 463920 468029 472135 476136 480112 483910 487131 489295 489855 488469 485617 482536 480131
51298 480131 478190 476020 473446 470714 467772 464337 460576 457221 454927 453842 453750 454365 455497 457168 459530
51283 459530 462607 466241 470332 474894 479811 484937 490434 496532 502774 508050 511628 513606 514158 513049
51269 513049 510331 506930 503985 502086 501570 502870 505828 509215 511774 513482 515057 516513 516921 515466 512106
51254 512106 507360 502079 497288 493605 490784 488208 485682 483372 481223 478966 476538 474103 471828 469997
51240 469997 468976 468684 468439 467848 467373 467466 467575 466734 464813 462441 459960 457260 454516 452341 451175 451042
51224 451042 451773 452964 453959 454391 454568 454846 455058 455154 455865 457799 460276 462077 463191 464821 467739 471632
51208 471632 476001 480638 485046 488524 491154 493891 497316 501071 504787 508696 512840 516360 518206 518147 516742
51193 516742 514679 512501 510567 508893 507261 505620 504137 502790 501337 499857 498912 499009 500149 501902 503594
51178 503594 504463 504080 502735 501124 499678 498485 497625 497017 496040 493980 490890 487490 484285 481430 479366
51163 479366 478755 479532 480771 481856 483190 485402 488332 491158 493171 494158 494393 494490 494978 495768 496287 496168 495532
51146 495532 494615 493593 492790 492615 493139 494108 495362 496762 497796 497837 496894 495575 494266 492949 491867 491602
51130 491602 492260 493232 494110 495200 496837 498817 500892 503247 506018 508805 511216 513496 516077 518730 520656
51115 520656 521370 521221 521131 521981 524070 526950 529850 532319 534370 536113 537584 538802 539636 539724 539072 538610 539413
51098 539413 541300 542953 543638 544006 544873 546006 546683 546794 546602 545899 544245 541960 540206 539974 541343 543671
51082 543671 546137 548041 548920 548623 547384 545892 545128 545773 547737 550485 553807 557866 562569 567446 572358
51067 572358 577776 584110 591159 598621 606795 616444 628174 642207 658493 676756 696586 717615 739328
51054 739328 760557 779456 794239 803863 808177 808089 805806 804241 805358 808963 813209 816141 816804 815392
51040 815392 812714 809243 804383 796876 786220 773570 761145 751001 744359 741371 740841 740377 737466 730894
51026 730894 721356 710942 701997 696055 693451 693811 696735 701824 708342 715469 722887 730669 738599 746142
51012 746142 753138 759819 765964 770758 773875 775977 777618 778196 776707 773236 769036 765251 762014 758765
50998 758765 755060 751064 747415 744594 742455 740626 739323 739262 740651 742950 746029 751006 759300 771097
50984 771097 785205 800325 816044 832800 851319 872086 895117 920137 946808 974499 1001980
50973 1001980 1028051 1052779 1077739 1104747 1134839 1168571 1206597 1249385 1296839 1348737 1405155
50962 1405155 1465947 1530234 1596933 1665478 1735442 1805726 1874711 1941000 2003432 2060608 2111065
50951 2111065 2153944 2189011 2216101 2235014 2246003 2249920 2247777 2240332 2228090 2211599 2191973 2171172
50939 2171172 2151191 2132469 2113399 2091887 2067221 2040141 2011676 1982576 1953509 1924817 1896007
50928 1896007 1866196 1835180 1803499 1771262 1737471 1700846 1661027 1618791 1575370 1531711 1488161
50917 1488161 1444709 1401609 1359765 1320310 1283809 1250035 1218467 1188809 1160997 1134957 1110509
50906 1110509 1087480 1065850 1045723 1027141 1010032 994476 980805 969161 959106 950148 942519 936791
50894 936791 932647 928833 924622 920690 918057 916759 916133 915836 915950 916427 917145 918338 920412 923540 927888
50879 927888 934007 942316 952383 963251 974417 986060 998492 1011903 1026504 1042442 1059588 1077800
50867 1077800 1097295 1118454 1141501 1166721 1194632 1225455 1258759 1294164 1332167 1373767 1419657
50856 1419657 1470503 1527662 1592750 1666473 1748585 1838936 1937941 2046096 2163714 2290990 2427472
50845 2427472 2571457 2720653 2873593 3029693 3187906 3346091 3501798 3652661 3795535
50836 3795535 3925945 4039088 4131241 4200214 4245155 4266432 4265345 4243568 4203035 4146352 4076779
50825 4076779 3997610 3912031 3823770 3737191 3656064 3582408 3516754 3459083 3408919 3364637 3323296
50814 3323296 3281516 3236543 3186577 3130272 3066280 2993609 2912418 2823996 2729667 2630087 2525990
50803 2525990 2419152 2312005 2206587 2104523 2007692 1917887 1835736 1760877 1693347 1633952
50793 1633952 1582955 1539215 1501147 1467922 1439358 1415264 1395444 1379862 1368211 1359631 1353248 1348685
50781 1348685 1345694 1343640 1341739 1339519 1336700 1332984 1328293 1322926 1317128 1310811 1303956 1296835 1289402 1280890
50767 1280890 1270536 1258507 1245647 1232595 1219612 1206988 1195045 1183768 1172923 1162601 1153373
50756 1153373 1145954 1140860 1138184 1137475 1138121 1140228 1144875 1153109 1164895 1179520 1196793 1217295 1241546
50743 1241546 1269512 1301081 1336481 1375963 1419356 1466191 1516175 1569506 1626828 1688903 1756135
50732 1756135 1828292 1904653 1984265 2066044 2148940 2232339 2316064 2399579 2481261 2558849 2630679
50721 2630679 2696164 2755044 2806473 2848883 2880377 2898978 2902792 2890442 2861787 2818372 2763187
50710 2763187 2699766 2631401 2561152 2492316 2428246 2371298 2322160 2280500 2246005 2218365 2196556
50699 2196556 2178848 2163611 2149562 2135045 2117683 2095228 2066559 2031608 1990618 1943937 1892363
50688 1892363 1837328 1780676 1724350 1670078 1618992 1571562 1528078 1489029 1454766 1425007 1399213
50677 1399213 1377481 1360596 1349068 1342564 1340459 1342465 1348356 1357540 1369452 1384134 1401754 1421579
50665 1421579 1441976 1461564 1479917 1497051 1512848 1527338 1541180 1555344 1570445 1586591 1603699
50654 1603699 1621607 1640016 1658662 1677625 1697277 1718057 1740444 1764968 1792003 1821633 1853932
50643 1853932 1889183 1927556 1968699 2012006 2057216 2104398 2153407 2203747 2255042 2307134 2359519
50632 2359519 2410952 2459988 2505907 2548954 2589743 2628600 2665611 2701158 2735952 2769843 2800208
50621 2800208 2821851 2829316 2820067 2795965 2762192 2724823 2688818 2657172 2631185 2611247 2597251 2588330
50609 2588330 2582730 2578528 2574602 2570584 2565909 2559197 2548557 2532093 2508125 2475560 2434419 2385739
50597 2385739 2330675 2269866 2203912 2134169 2062681 1991357 1921484 1853948 1789517 1728741 1671766
50586 1671766 1618494 1568957 1523462 1482403 1446066 1414611 1388073 1366203 1348442 1334324 1323954
50575 1323954 1317809 1316078 1318419 1324364 1333542 1345294 1358567 1372636 1387628 1403919 1421269 1439043
50563 1439043 1457008 1475215 1493217 1510170 1525940 1541475 1557787 1575082 1593274 1612868 1634770
50552 1634770 1659343 1686034 1713889 1742183 1770598 1799031 1827277 1854866 1881214 1905992 1929322
50541 1929322 1951766 1974346 1998589 2026208 2058531 2096277 2139842 2189549 2245508 2307400 2374571
50530 2374571 2446354 2522408 2602977 2688812 2780595 2878354 2981451 3089012 3200049 3313137
50520 3313137 3426270 3537185 3643732 3743938 3835857 3917313 3985715 4038425 4073683 4091158
50510 4091158 4091380 4074867 4042205 3994640 3933832 3861076 3777637 3686146 3591000 3496944 3407680 3326136
50498 3326136 3255315 3198055 3156032 3129461 3117666 3119547 3133546 3157567 3188974 3224550 3260551
50487 3260551 3292973 3317605 3329883 3325269 3300424 3254151 3187213 3101704 3000931 2889407 2771987
50476 2771987 2652565 2533618 2416785 2303394 2194468 2090846 1993629 1904230 1823639 1751798
50466 1751798 1687921 1631319 1581645 1538486 1501217 1469466 1443397 1423208 1408560 1398903 1394268 1395138
50454 1395138 1401357 1411668 1424710 1440128 1458302 1479314 1502687 1527951 1554892 1583277 1612911
50443 1612911 1643974 1676790 1711077 1745709 1779060 1809116 1833399 1849735 1857634 1858513 1854341 1846440
50431 1846440 1835686 1823154 1809967 1796842 1784254 1772742 1762656 1753807 1745882 1739130 1734336 1732244
50419 1732244 1733312 1737976 1746820 1760402 1779006 1802571 1830878 1863916 1902037 1945478 1993727 2045580
50407 2045580 2099824 2155519 2211669 2267156 2321176 2373249 2422511 2467416 2506513 2539167 2565150
50396 2565150 2583779 2593827 2594086 2583709 2562227 2529629 2486423 2433589 2372740 2306441 2237916 2169983
50384 2169983 2104377 2042190 1984629 1933055 1888652 1852382 1824932 1806273 1795539 1791698 1794185 1802536
50372 1802536 1815610 1831457 1847722 1861862 1871300 1873968 1868874 1856019 1835946 1809509 1777861 1742371
50360 1742371 1704603 1666417 1629639 1595355 1563631 1533858 1504780 1474091 1439017 1398207 1352891
50349 1352891 1305804 1259402 1215478 1175668 1141157 1111947 1087154 1066098 1048660 1034850 1024613
50338 1024613 1017803 1013665 1010621 1007496 1004918 1004706 1007808 1013500 1020567 1028418 1036802 1045247 1053273 1060713
50324 1060713 1067606 1074171 1081042 1089015 1098362 1108814 1120287 1133078 1147180 1161975 1176834 1191567
50312 1191567 1206104 1220288 1234282 1248702 1264091 1280756 1299344 1320987 1346471 1375823 1409124
50301 1409124 1447128 1490511 1539075 1592363 1650161 1710639 1767561 1810626 1830062 1821627 1787812
50290 1787812 1735303 1671757 1603911 1536784 1473385 1414998 1362052 1314785 1273187 1236696 1204464
50279 1204464 1176029 1151625 1131826 1116998 1106978 1101056 1098192 1097519 1098766 1102133 1107758 1115498 1125142
50266 1125142 1136539 1149362 1163062 1177283 1192138 1207927 1224681 1241974 1258945 1274496 1288001
50255 1288001 1300075 1312144 1324812 1336954 1346781 1353461 1357190 1358077 1355711 1349824 1340740 1329074 1315537
50242 1315537 1301183 1287345 1274996 1264409 1255636 1249068 1245246 1244098 1244408 1243992 1240519 1232397 1219055
50229 1219055 1200721 1178403 1154203 1130917 1110536 1093096 1077370 1062485 1048482 1035602 1023790
50218 1023790 1012995 1003348 994772 986810 979000 971192 963385 955577 947895 940599 933882 927750 922098 916663
50204 916663 911019 904926 898586 892285 885897 879156 872254 865700 859595 853542 847350 841339 835875 831004
50190 831004 826657 822776 819140 815443 811696 808245 805337 802985 801270 800385 800306 800814 801842 803436 805365
50175 805365 807238 809042 811044 813122 814751 815760 816512 817192 817533 817590 818144 819915 822797 826248 830023 834175
50159 834175 838754 843939 850106 857392 865489 874344 884769 897875 914056 932879 953778 976468 1000770
50146 1000770 1026336 1052473 1078143 1102427 1125208 1147093 1168408 1188655 1207334 1224872 1242197
50135 1242197 1259646 1276792 1293122 1308138 1320820 1329598 1333099 1330570 1321564 1305838 1283913 1257410
50123 1257410 1228503 1199071 1170434 1143502 1118776 1096325 1076077 1058242 1043196 1030838 1020183
50112 1020183 1009727 998293 985637 972459 959998 949421 941261 935198 930449 926382 922696 919187
50100 919187 915639 912001 908271 904108 898976 892902 886601 880506 874230 867548 861379 856913 853941 851053
50086 851053 847473 843790 840668 837888 835142 832928 831854 831582 831240 830732 830989 833003 836981 842387 848383
50071 848383 854241 859642 864674 869581 874672 880436 887227 894587 901318 906601 910850 915117 919895 924759
50057 924759 928955 931958 933662 934327 934327 933796 932690 931316 930403 930438 931200 932263 933581 935273 937209 939352
50041 939352 942290 946958 953898 963110 974368 987298 1001319 1016027 1031636 1048735 1067728 1088758
50029 1088758 1111842 1136591 1162032 1187308 1212478 1238048 1263750 1288347 1310643 1330162 1346856
50018 1346856 1360910 1373035 1384179 1394350 1402101 1405599 1403962 1397220 1385445 1368660 1347511 1323329
50006 1323329 1297234 1269615 1240759 1211669 1183824 1158276 1135394 1115455 1098908 1085780 1075192
49995 1075192 1065924 1057365 1049567 1042525 1035943 1029688 1023810 1017729 1009870 998673 983914 966756 948657
49982 948657 930587 913152 896944 882514 870108 859558 850348 841842 833665 825961 819247 813974 810178
49969 810178 807477 805334 803365 801502 799857 798494 797440 796869 797074 798195 800138 802831 806479 811587 818799
49954 818799 828578 840667 853852 866582 877947 887832 896205 902710 907140 909837 911302 911667 910773 908465
49940 908465 904527 898661 890898 881874 872473 863410 855221 848098 841285 833112 822435 810006 797881
49927 797881 787467 778688 771015 764551 759684 756151 753100 750108 747795 747239 748900 752270 756560 761547
49913 761547 767589 774819 782588 789871 796222 802358 809780 819718 832210 846175 860425 874397 887823
49900 887823 900087 910513 919156 926692 933489 939309 943914 947191 948447 946350 940110 930255 917911
49887 917911 903879 888792 873447 858298 843170 828253 814920 804673 797415 791552 785724 779815
49875 779815 774410 770073 767160 765649 764999 764762 765327 767532 771509 776580 782361 789231 797509 806869 816976
49860 816976 828103 840594 854087 867841 881635 895769 910085 923330 933780 940525 944152 946179
49848 946179 947843 949419 950487 950503 948948 945251 938930 929899 918593 905979 893380 881858 871524
49835 871524 861845 852802 845270 839832 835771 831895 828038 825062 823631 823710 825156 827991 832005 836801 842420
49820 842420 849344 857756 867245 877296 887457 896996 905035 911265 916059 919755 922398 924276 925946 927352
49806 927352 927512 925574 921737 916703 910659 903368 894990 886279 878021 870580 863776 856880 848857 839062
49792 839062 827781 815938 804373 793543 783769 775462 768992 764451 761625 760280 760540 762818 767155
49779 767155 772668 778006 782482 786580 791303 797296 804653 813226 822835 833273 844262 855366 865837
49766 865837 874630 880780 883966 884890 885017 885561 886503 886725 885205 881792 876742 870118 862154 853701 845562
49751 845562 837596 829214 820604 812673 805820 799639 794000 789556 786800 785377 784783 785144 786765 789362 792277
49736 792277 795228 798385 801970 806187 811387 817902 825783 834801 844535 854331 863529 872001 880356 889423
49722 889423 899728 911469 924598 938680 952872 966305 978449 989209 998896 1007890 1015778 1020779
49710 1020779 1020678 1014631 1003784 990168 975566 961435 948945 938573 930207 924074 920964 921107 923416
49697 923416 926350 928942 930441 929707 926004 920200 914324 909997 907836 908069 910781 915524 921500 928417 936662
49682 936662 946525 957737 969962 983312 998168 1014884 1033901 1055946 1081731 1111063 1141790 1169523
49670 1169523 1189090 1197318 1194892 1185487 1173191 1160791 1149781 1140866 1134121 1129331 1126708 1127093 1130980
49657 1130980 1137126 1142131 1141586 1132288 1114043 1089632 1062956 1037071 1013698 993771 977616 964674
49645 964674 953809 944270 936131 929739 925140 922203 920909 921160 922397 923677 924114 923263 921164 918095 914192
49630 914192 909262 903020 895441 886831 877646 868456 859925 852521 846137 840285 834790 830078 826689 824651
49616 824651 823502 822753 822116 821349 820189 818642 817240 816770 817595 819323 821207 822739 823702 823864 823034 821558
49600 821558 820365 820236 821075 822050 822344 821733 820576 819436 818606 817960 817357 817087 817580 818640 819405 819279 818564
49583 818564 817926 817558 817250 817006 817148 817970 819678 822471 826235 830326 834200 838236 843384 849973 857454 865462
49567 865462 874563 885547 898375 912247 926391 940244 953052 963929 972490 978936 983285 984900
49555 984900 983185 978531 972125 964957 957408 949809 942778 936773 931776 927728 924902 923449 922959 922964 923592
49540 923592 925128 927143 928758 929751 930820 932705 935666 939913 945882 953916 964145 976734 991674 1008229
49526 1008229 1025382 1043087 1062479 1084634 1109880 1138450 1170605 1205238 1239068 1268144 1289868
49515 1289868 1303270 1308388 1306564 1300784 1294360 1289191 1285986 1285617 1288883 1294817 1300386 1302293 1298521 1288295
49501 1288295 1271815 1250588 1227139 1203572 1180639 1158468 1137621 1118978 1103015 1089738 1079152
49490 1079152 1071353 1066153 1062824 1060324 1057863 1055469 1053865 1053559 1054087 1054475 1054414 1054678 1056372 1059946 1064822
49475 1064822 1069747 1073723 1076961 1080665 1085476 1090482 1094390 1097369 1100823 1105400 1110182 1114103 1117331 1120827
49461 1120827 1125169 1130216 1135392 1139952 1143414 1146104 1148872 1151904 1154187 1154480 1152508 1148982 1144836 1140706
49447 1140706 1136778 1132813 1128531 1124154 1120339 1117550 1115884 1115490 1116598 1119015 1122228 1126188 1131435 1138288
49433 1138288 1146664 1156896 1169890 1185960 1204248 1223712 1243900 1264166 1283089 1299588 1313997
49422 1313997 1327355 1340590 1355276 1373684 1395682 1415777 1425628 1420732 1403800 1381483 1359246 1339902
49410 1339902 1324970 1315265 1310465 1309653 1312578 1319668 1330853 1345146 1361407 1378826 1396542 1413393
49398 1413393 1428491 1441847 1454290 1466792 1479740 1492598 1504318 1514217 1522289 1528498 1532047 1531793
49386 1531793 1527276 1518973 1507669 1494045 1478800 1462642 1446025 1429286 1413088 1398272 1385154 1373461
49374 1373461 1363163 1354917 1349428 1346824 1346915 1349554 1354286 1360148 1366389 1373061 1380218 1386869 1391524 1393677
49360 1393677 1393914 1392447 1388451 1381158 1370882 1358500 1344506 1329174 1313319 1298301 1285372 1275195
49348 1275195 1267688 1262011 1257049 1252325 1248318 1245636 1244124 1243018 1241691 1239970 1238047 1236383 1235332 1234630
49334 1234630 1233726 1233027 1234228 1238843 1246860 1257404 1269975 1283918 1297099 1306530 1310669 1310249 1306733 1300889
49320 1300889 1293113 1284081 1274407 1264212 1253523 1242661 1231794 1220598 1208799 1196740 1185132 1174588
49308 1174588 1165631 1158701 1153803 1150556 1148841 1149019 1151305 1155370 1160807 1167396 1174603 1181463 1187485 1193087
49294 1193087 1198580 1203188 1205706 1205791 1204026 1201062 1197232 1192588 1186636 1178449 1167840 1156229 1145567 1136559
49280 1136559 1128734 1122077 1117542 1115802 1116443 1118751 1122572 1127913 1134348 1141352 1148855 1156962 1165322 1173198
49266 1173198 1179998 1185480 1189637 1192678 1195026 1197127 1199310 1201876 1205152 1209467 1215452 1224410 1237744 1255474
49252 1255474 1275631 1295654 1314232 1331188 1345649 1355257 1357704 1352624 1341428 1325619 1306065 1284014
49240 1284014 1261947 1242611 1227286 1215452 1206050 1198502 1192556 1187997 1185154 1185279 1189544 1197501 1207039
49227 1207039 1216093 1224137 1231942 1240344 1249644 1259857 1270866 1282208 1293169 1303331 1312822 1321781 1329818
49214 1329818 1336313 1341140 1344761 1347684 1350246 1352980 1356742 1362199 1369541 1378902 1390642 1404775 1420538
49201 1420538 1437091 1454414 1472827 1491745 1509752 1526059 1541111 1555403 1568404 1579231 1587839
49190 1587839 1594870 1600642 1605029 1608240 1611030 1613958 1616975 1619972 1623441 1628358 1635600 1645686 1658937
49177 1658937 1675740 1696576 1721887 1751907 1786652 1826097 1870382 1919755 1973967 2031147 2086916
49166 2086916 2134973 2169483 2187684 2190632 2181927 2166027 2147192 2128647 2111860 2096691 2082596 2069540
49154 2069540 2057774 2047326 2038157 2030561 2025034 2021953 2021655 2024415 2029974 2037375 2045720 2054823 2064772 2075209
49140 2075209 2085676 2096454 2108340 2121580 2135563 2149687 2164048 2179105 2194990 2211370 2227809
49129 2227809 2244150 2260600 2277371 2294303 2311116 2328189 2346632 2367290 2390068 2414741 2442029
49118 2442029 2473329 2509677 2551607 2599827 2655281 2718606 2790304 2871499 2963994 3069599 3190283
49107 3190283 3329218 3490519 3676153 3881352 4092111 4288829 4457090 4599221 4734275
49098 4734275 4880504 5032501 5155855 5208504 5171507 5061776 4917054 4768821 4625978 4478558
49088 4478558 4313387 4127473 3930576 3738099 3562073 3407351 3273963 3161037 3067983 2993179
49078 2993179 2933164 2883767 2841724 2805061 2772466 2742997 2716379 2692985 2673041 2656049 2641248
49067 2641248 2628369 2617500 2608342 2600122 2592401 2585423 2579429 2573900 2567868 2560857 2553322 2546299 2540747
49054 2540747 2537087 2535140 2534545 2535309 2537847 2542498 2549108 2557011 2565036 2571409 2574067 2571557 2563810 2552127
49040 2552127 2538583 2525367 2514128 2505551 2499583 2496209 2495795 2498591 2504209 2511817 2520648 2530094 2539639
49027 2539639 2548999 2558088 2566451 2572916 2576296 2576476 2574526 2571772 2569101 2567072 2566144 2566471 2567756 2569661 2572302
49012 2572302 2576041 2580769 2585687 2590046 2594013 2598460 2603876 2609834 2615770 2621901 2628785 2636097 2642532 2647188
48998 2647188 2650539 2653752 2657459 2661563 2665823 2670057 2673910 2676944 2679037 2680353 2681012 2681131 2681137 2681564 2682333 2682506
48982 2682506 2680952 2677241 2671816 2665454 2658584 2651017 2642238 2631934 2620255 2607626 2594403 2580707 2566417
48969 2566417 2551316 2535516 2519869 2505648 2493617 2483588 2475123 2468434 2464249 2462996 2464477 2468324
48957 2468324 2474440 2483017 2494386 2508792 2525979 2545032 2564950 2585455 2606965 2629739 2653339 2676984
48945 2676984 2700073 2722199 2742968 2762218 2780462 2798856 2818609 2840365 2864152 2889862 2917654
48934 2917654 2947815 2980265 3014387 3049428 3084981 3121117 3158270 3197090 3238101 3281318 3326344
48923 3326344 3372946 3421298 3471442 3522889 3575095 3628002 3681636 3735323 3787959 3839154 3889656
48912 3889656 3940366 3991286 4041646 4090849 4139039 4186761 4234231 4280958 4326163 4369542 4411462
48901 4411462 4452287 4491691 4528754 4562510 4592191 4617325 4638168 4655946 4672118 4687240 4700744
48890 4700744 4711805 4720121 4725951 4729779 4731955 4732354 4730482 4726219 4720184 4712732 4702738 4688274 4668697
48877 4668697 4645354 4619840 4592197 4561254 4526227 4487422 4445725 4401936 4356409 4308918 4259017
48866 4259017 4206857 4153567 4100632 4049103 3999474 3951872 3906066 3861660 3818680 3777701 3739065
$$ [...]
##END NTUPLES=NMR SPECTRUM
##END=
