##TITLE=AC1677_GUAAH14385_8571455_6ssWUDYM9Q
##JCAMPDX= 6.0         $$ Bruker NMR JCAMP-DX V2.0
##DATA TYPE= NMR SPECTRUM
##DATA CLASS= NTUPLES
##ORIGIN= BRUKER
##OWNER= Administrator
$$ 1.72 TOPSPIN		Version 2.1
$$ 2014-04-11 23:48:57.902 -0700  Administrator@X
$$ Compression mode = diff/dup
##.OBSERVE FREQUENCY= 400.02188249412
##.OBSERVE NUCLEUS= ^1H
##.ACQUISITION MODE= SIMULTANEOUS (DQD)
##.ACQUISITION SCHEME= undefined
##.AVERAGES= 8
##.DIGITISER RES= 22
##SPECTROMETER/DATA SYSTEM= spect
##.PULSE SEQUENCE= zg30
##.SOLVENT NAME= COFFEE_meoh
##.SHIFT REFERENCE= INTERNAL, COFFEE_meoh, 1, 14.98509
##AUDIT TRAIL= $$ (NUMBER, WHEN, WHO, WHERE, PROCESS, VERSION, WHAT)
$$ ##TITLE= Audit trail, TOPSPIN		Version 2.1
$$ ##JCAMPDX= 5.01
$$ ##ORIGIN= Bruker BioSpin GmbH
$$ ##OWNER= Administrator
$$ $$ E:\/data/COFFEE/nmr/AC1677_GUAAH14385_8571455_6ssWUDYM9Q/10/pdata/1/auditp.txt
$$ ##AUDIT TRAIL=  $$ (NUMBER, WHEN, WHO, WHERE, PROCESS, VERSION, WHAT)
(   1,<2014-04-11 23:48:50.574 -0700>,<Administrator>,<X>,<go>,<TOPSPIN 2.1>,
      <created by zg
	started at 2014-04-11 23:47:44.762 -0700,
	POWCHK enabled, PULCHK disabled,
       configuration hash MD5:
       C8 4E 4E 5D D3 5C D8 9E 9F 52 82 E0 59 8A DE 15
       data hash MD5: 64K
       43 84 F1 20 FF 4E 3D 54 A2 2E 7A 7C BA 1E 58 87>)
(   2,<2014-04-11 23:48:53.684 -0700>,<Administrator>,<X>,<proc1d>,<TOPSPIN 2.1>,
      <Start of raw data processing
       efp LB = 0 FT_mod = 6 PKNL = 1 PHC0 = 0 PHC1 = 0 SI = 32K 
       data hash MD5: 32K
       2B A6 E9 12 61 34 94 5F B6 15 06 01 16 0F 7F 50>)
(   3,<2014-04-11 23:48:54.043 -0700>,<Administrator>,<X>,<proc1d>,<TOPSPIN 2.1>,
      <pk PHC0 = 94.75708 PHC1 = 0 
       data hash MD5: 32K
       BF D8 1F 58 CC 48 D1 32 62 DA E4 BD B9 3D 38 7E>)
(   4,<2014-04-11 23:48:54.262 -0700>,<Administrator>,<X>,<proc1d>,<TOPSPIN 2.1>,
      <abs ABSG = 1 
       data hash MD5: 32K
       FF 46 27 81 E0 E5 07 B1 19 57 A0 9F E6 E3 4C 96>)
(   5,<2014-04-11 23:48:54.356 -0700>,<Administrator>,<X>,<proc1d>,<TOPSPIN 2.1>,
      <abs ABSG = 2 
       data hash MD5: 32K
       5E B0 16 FE BD C3 5B 81 67 A8 E9 B5 34 0E 1A A5>)
(   6,<2014-04-11 23:48:54.449 -0700>,<Administrator>,<X>,<proc1d>,<TOPSPIN 2.1>,
      <abs ABSG = 3 
       data hash MD5: 32K
       D3 51 95 D4 73 E9 82 0F 62 79 C8 B1 74 8B 39 8A>)
(   7,<2014-04-11 23:48:54.496 -0700>,<Administrator>,<X>,<proc1d>,<TOPSPIN 2.1>,
      <abs ABSG = 4 
       data hash MD5: 32K
       10 09 6E C2 B5 AE 96 B5 49 35 49 49 47 86 22 47>)
(   8,<2014-04-11 23:48:54.559 -0700>,<Administrator>,<X>,<proc1d>,<TOPSPIN 2.1>,
      <abs ABSG = 5 
       data hash MD5: 32K
       0B 20 3D 92 BA 4A 9D 7A A7 F0 92 BC 9D 21 28 89>)
$$ ##END=
$$ 
$$ $$ hash MD5
$$ $$ 0F E2 18 00 63 31 C7 7E B7 1B 48 78 D9 A2 6F A6
##$RELAX= 
##$RELAX= 
##$RELAX= 
##$RELAX= 
##$RELAX= 
##$RELAX= 
##$RELAX= 
$$ Bruker specific parameters
$$ --------------------------
##$DU= <E:\>
##$EXPNO= 10
##$NAME= <AC1677_GUAAH14385_8571455_6ssWUDYM9Q>
$$ [...]
##$TP= (0..7)
150 150 150 150 150 150 150 150
##$TP07= 0
##$TPNAME0= <>
##$TPNAME1= <>
##$TPNAME2= <>
##$TPNAME3= <>
##$TPNAME4= <>
##$TPNAME5= <>
##$TPNAME6= <>
##$TPNAME7= <>
##$TPOAL= (0..7)
0.5 0.5 0.5 0.5 0.5 0.5 0.5 0.5
##$TPOFFS= (0..7)
0 0 0 0 0 0 0 0
##$TUNHIN= 0
##$TUNHOUT= 0
##$TUNXOUT= 0
##$USERA1= <user>
##$USERA2= <user>
##$USERA3= <user>
##$USERA4= <user>
##$USERA5= <user>
##$V9= 5
##$VALIST= <valist>
##$VCLIST= <CCCCCCCCCCCCCCC>
##$VD= 0
##$VDLIST= <DDDDDDDDDDDDDDD>
##$VPLIST= <PPPPPPPPPPPPPPP>
##$VTLIST= <TTTTTTTTTTTTTTT>
##$WBST= 1024
##$WBSW= 4
##$XGAIN= (0..3)
0 0 0 0
##$XL= 0
##$YL= 0
##$YMAX_a= 649239
##$YMIN_a= -551556
##$ZGOPTNS= <>
##$ZL1= 120
##$ZL2= 120
##$ZL3= 120
##$ZL4= 120
##$ABSF1= 14.98509
##$ABSF2= -5.573092
##$ABSG= 5
##$ABSL= 3
##$ALPHA= 0
##$AQORDER= 0
##$ASSFAC= 0
##$ASSFACI= 0
##$ASSFACX= 0
##$ASSWID= 0
##$AUNMP= <proc_prof1d_extract_pilot.lims>
##$AXLEFT= 0
##$AXNAME= <>
##$AXNUC= <1H>
##$AXRIGHT= 0
##$AXTYPE= 0
##$AXUNIT= <>
##$AZFE= 0.1
##$AZFW= 0.1
##$BCFW= 0
##$BC_mod= 0
##$BYTORDP= 0
##$COROFFS= 0
##$CY= 15
##$DATMOD= 1
##$DC= 0
##$DFILT= <>
##$DTYPP= 0
##$F1P= 0
##$F2P= 0
##$FCOR= 0.5
##$FTSIZE= 32768
##$FT_mod= 6
##$GAMMA= 0
##$GB= 0
##$INTBC= 1
##$INTSCL= 1
##$ISEN= 128
##$LB= 0
##$LEV0= 0
##$LPBIN= 0
##$MAXI= 10000
##$MC2= 0
##$MEAN= 0
##$ME_mod= 0
##$MI= 0
##$NCOEF= 0
##$NC_proc= -8
##$NLEV= 6
##$NOISF1= 0
##$NOISF2= 0
##$NSP= 0
##$NTH_PI= 0
##$NZP= 0
##$OFFSET= 14.98509
##$PC= 1
##$PHC0= 94.75708
##$PHC1= 0
##$PH_mod= 1
##$PKNL= yes
##$PPARMOD= 0
##$PPDIAG= 0
##$PPIPTYP= 0
##$PPMPNUM= 2147483647
##$PPRESOL= 1
##$PSCAL= 4
##$PSIGN= 0
##$PYNMP= <proc.py>
##$REVERSE= no
##$SF= 400.02
##$SI= 32768
##$SIGF1= 0
##$SIGF2= 0
##$SINO= 400
##$SIOLD= 32768
##$SPECTYP= <>
##$SREGLST= <1H.CDCl3>
##$SSB= 0
##$STSI= 32768
##$STSR= 0
##$SW_p= 8223.68421052631
##$SYMM= 0
##$S_DEV= 0
##$TDeff= 65536
##$TDoff= 0
##$TI= <>
##$TILT= no
##$TM1= 0
##$TM2= 0
##$TOPLEV= 0
##$USERP1= <user>
##$USERP2= <user>
##$USERP3= <user>
##$USERP4= <user>
##$USERP5= <user>
##$WDW= 1
##$XDIM= 32768
##$YMAX_p= 457603924
##$YMIN_p= -737679
##$CURPLOT= <Network HP LaserJet P1505>
##$CURPRIN= <$Network HP LaserJet P1505>
##$DFORMAT= <normdp>
##$LAYOUT= <+/1D_H.xwp>
##$LFORMAT= <normlp>
##$PFORMAT= <normpl>
##$SURQMSG= 1
$$ End of Bruker specific parameters
$$ ---------------------------------
##NTUPLES= NMR SPECTRUM
##VAR_NAME=  FREQUENCY,     SPECTRUM/REAL,   SPECTRUM/IMAG
##SYMBOL=    X,             R,               I
##VAR_TYPE=  INDEPENDENT,   DEPENDENT,       DEPENDENT
##VAR_FORM=  AFFN,          ASDF,            ASDF
##VAR_DIM=   32768,         32768,           32768
##UNITS=     HZ,            ARBITRARY UNITS, ARBITRARY UNITS
##FACTOR=    0.250966925370066, 1,           1
##FIRST=     8223.43324360094, 25912,        -11985
##LAST=      0,             174953,          43223
##MIN=       0,             -737679,         0
##MAX=       8223.43324360094, 457603924,    0
$$ Real data points
##PAGE= N=1
##DATA TABLE= (X++(R..R)), XYDATA
$$ [...]
19536f5116J9450p5208J7759d0431k76607f9421k05170Q7275B65035b41048f3760
19524A11037a14694A13790N708K9730b65584c8365M84k65227o4137a4813B78635
19512d15839J54143F3565b32127M4578j4891b4474k76289i7324j50779f7790B08219
19500F0177j3659A5233K49253a0278n9645F5696b24009C185b54223a09466a5365
19488b5841k69987I7692c7939q8673r929N9038B10170N8349j29410b18856C19172
19476a19354a3399j70869d2557E9952d2081a6244l32637A63391c34251a2197E490
19464A56394L6753F6322d6364C6317a13245M0663j60125C8827e2480j9286j06595
19453a78361Q3673b030k10541a7131j640p5537C9141L2871a29582j01940n7431
$$ y = [-65116, -45666, -120874, -103115, -40431, -317038, -69421, -274591, -187316, 265035, -241048, -63760, 111037, -114694, 113790, 119498, 149228, -265584, -38365, -37881, -303108, -367245, -14813, 278635, -415839, -261696, 63565, -232127, -187549, -202440, -24474, -300763, -97324, -248103, -67790, 208219, 60177, 46518, 15233, 264486, -10278, -69923, 65696, -224009, 3185, -254223, -109466, -15365, -25841, -295828, 97692, -37939, -126612, -136541, -77503, 210170, 268519, 139109, -218856, 319172, -119354, -13399, -184268, -42557, 59952, -42081, -16244, -348881, 163391, -334251, -12197, 5490, 156394, 193147, 66322, -46364, 36317, -113245, -72582, -232707, 38827, -52480, -71766, -178361, -94688, -2030, -212571, -17131, -18771, -94308, 39141, 72012, -129582, -231522, -288953]
19442b88953A38420b6674D2778a0078j01102q5186P2887j0743K1016j1942B20171
19430A74739e8308k82190k8366I7229b43732c2619r3758p9898h2577l17580B54927
19418a63732j02309G3895b07245A5700k552Q9410O3888b70752A57402h4114j41876
19407b25990A71821E8506b40493r1637J64973n862b1296p7955j66565J06205b0918
19395b56795B29310a15441L7656G5823d6224o54163G3894a34706c6254k18011
19385b54265f8926n2241j0569j75489g4022a5634A52664a74993D01471a47413
19374F8863a59466A53601m4526g0280J3109j6640j62528g3653C96931g0932G5834
19362b54318J03058A27007a78028B25041b40732g1026o4830O1237G6754B886Q6720
$$ y = [-288953, 138420, -26674, 42778, -10078, -111180, -196366, -123479, -134222, -113206, -125148, 220171, 174739, -58308, -340498, -368864, 97229, -243732, -32619, -126377, -206275, -82577, -400157, 254927, -163732, -266041, 73895, -207245, 15700, 13148, 102558, 166446, -270752, 157402, -84114, -225990, 171821, 58506, -240493, -332130, -167157, -173019, -21296, -99251, -265816, -159611, -20918, -256795, 229310, -115441, -77785, 75823, -46224, -700387, 73894, -134706, -36254, -254265, -68926, -121167, -131736, -307225, -74022, -15634, 152664, -174993, 401471, -147413, 68863, -159466, 153601, 109075, -70280, -57171, -73811, -236339, -73653, 396931, -70932, 75834, -254318, -151260, 127007, -178028, 225041, -240732, -71026, -135856, -74619, 76754, 2886, 89606]
19351H9606B6662P0222d14632J43128l3835G3704B7232c9280c20n3078A18142
19339c42642F4955a11878k15846F5276B9047L2625b39704m0681H8401r704g2903
19327C9509A2845a10435j94864B0212b5098p0524r7354q141B31846F1612J61572
19316B23184F0470J20610i9567j32367B34006c98781a88081l1932D31009B13153
19305e1515k87266e8410n6671j00936A44172d02619J48618J03818G4869f1633
19294A61349C011a66668G4069M1926a79802e6588j60164h4808B2718a28320j8494
19283a46814g148j8355k26102A45229g8948m21864H2141a40576k7886A79279m4781
19272A34498n0689b14395G6119b00354j35407A17179a19917G1781a76057H2179
$$ y = [89606, 26662, 96884, -414632, -271504, -305339, 73704, 27232, -39280, -320, -53398, 118142, -342642, 64955, -111878, -327724, 65276, 29047, 61672, -239704, -280385, 88401, 78697, -72903, 39509, 12845, -110435, -305299, 20212, -25098, -95622, -192976, -201117, 231846, 61612, 223184, 60470, 181080, -99567, -231934, 234006, -398781, -188081, -220013, 431009, 213153, -51515, -338781, -58410, -115081, -216017, 144172, -402619, -254001, -150183, 74869, -61633, 161349, 3011, -166668, 74069, 115995, -179802, -56588, -216752, -84808, 22718, -128320, -146814, -7148, -25503, -251605, 145229, -78948, -500812, 82141, -140576, -168462, 179279, 134498, 83809, -214395, 76119, -200354, -335761, 117179, -119917, 71781, -176057, 82179]
19261B67682g3638m265k40582D9824c9978r0027J6525d349F8780i8989j30317
19250b29306A70706b51733A7088K31586A1218D34a94573j8748Q962L3068K8249
19239a43042p4360c9659q6522m794b0326j68243d9871C65720j31494b67628i4488
19227a84559g8521A0194P969a58752I1943d7313q3758k38397B46287b3327C38603
19215a1984k2998p5031c8098p7154j56078a08096k5059j6676B9468L361a54763
19203b71279B1721R2098J49622I1592i4596A84602l9659g168l05219A03731a37834
19191b42897A18641c68047a11687A3774i4255B6445o416R9082e954C0729g474
19179i0540C08536A46183i2655j07391A85800a73934j74616J64840k0153F6222
$$ y = [267682, -73638, -77903, -318485, 49824, -39978, -130005, -113480, -4349, 68780, -98989, -229306, 170706, -251733, 17088, 248674, 11218, 434, -194573, -213321, -204359, -171291, -143042, -217402, -39659, -126181, -130975, -20326, -188569, -49871, 365720, 234226, -267628, -94488, -184559, -78521, 10194, 18163, -158752, 91943, -47313, -131071, -369468, 246287, -23327, 338603, -11984, -34982, -110013, -38098, -115252, -271330, -108096, -133155, -149831, 29468, 32829, -154763, -271279, 21721, 113819, 263441, 91592, -94596, 184602, 144943, -7168, -312387, 103731, -137834, -242897, 118641, -368047, -111687, 13774, -94255, 26445, 20029, 119111, -5954, 30729, -7474, -90540, 308536, 146183, -92655, -200046, 185800, -173934, -348550, -183710, -203863, 66222]
19168g549C43522b16643n3109e2999C640e46214H3403a88957i3550M1939j56506
19157b08117A72998f774A26934b39736K1287R6204a4203k65777B73504b07133
19146A06274B4605c81361a49021k2829K4249H1484O6479b6975A89854k4320c20800
19134d6851n7824b7067E5490J2548b62733H5477a58369p1801L987R4959E6553
19122a363C7477R9094b05817A00262A9772b29539D9602N4591b08958J6911A10870
19110A92430f6746n2495e2566d396G018K9523a64416k7470f1230l15257i8771
19098C900b39465D1698a74131p2930A67452R2978g9694H2928A1330P0435l0683
19087E1082R7907b77886h8234g062A6840J86468Q7325l48a51926p2778j6681c6313
$$ y = [-7549, 343522, -216643, -269752, -52999, 3640, -546214, 83403, -188957, -93550, -51611, -208117, 172998, -6774, 126934, -239736, -218449, -122245, -14203, -279980, 273504, -207133, 106274, 24605, -381361, -149021, -171850, -147601, 81484, 147963, -26975, 189854, 165534, -320800, -46851, -104675, -27067, 55490, 68038, -262733, 85477, -158369, -230170, -226183, -131224, 56553, -1363, 37477, 136571, -205817, 100262, 19772, -229539, 49602, 104193, -208958, -192047, 110870, 192430, -66746, -119241, -52566, -4396, 7018, 36541, -164416, -191886, -61230, -376487, -98771, 3900, -239465, 41698, -174131, -247061, 167452, 260430, -79694, 82928, 11330, 81765, 51082, 148989, -277886, -88234, -7062, 16840, 203308, 290633, 290285, -151926, -224704, -241385, -36313]
19074H5009h3184m0051B0371a95618q7888F7728c51736e9215h889j27781H7264
19062a51643e5248l6294B04163d5185B7265Q4950c05009a18043m1437L1541B10306
19050a63730A30023R9604a13480C9488J27262a33553d4874B02292d9156H6227
19039c32209f8255H214N3185b5059A64790G4589a93764I2939a47951c1038l0370
19028f1408A92067e5367A66367Q6786j01252e8506C26317D0045a58482E9318K11753
19017B71071M1160b84394h1342K3575A4040b42804c7993F3530i0865M5079j70805
19006b16591A14560a49482A02635c72518G7733a27804N942r3017a4184j73717
18996a87901L4306L3151A30078a32060B53299a2074j70790A01192A1820a10123
$$ y = [85009, -83184, -123235, 20371, -195618, -283506, 67728, -351736, -59215, -8889, -136670, 87264, -151643, -55248, -91542, 204163, -45185, 27265, 112215, -305009, -118043, -159480, -127939, 210306, -163730, 130023, 229627, -113480, 39488, 166750, -133553, -44874, 202292, -49156, 86227, -332209, -68255, 8214, 61399, -25059, 164790, 74589, -193764, 92939, -147951, -31038, -61408, 192067, -55367, 166367, 253153, 151901, -58506, 326317, 40045, -158482, 59318, 271071, 312231, -284394, -81342, -57767, 14040, -242804, -37993, 63530, -90865, -45786, -216591, 114560, -149482, 102635, -372518, 77733, -127804, -121862, -214879, -14184, -187901, -153595, -120444, 130078, -132060, 253299, -12074, -182864, 101192, 11820, -110123]
18985C39a74421j6269j01165A68613E0911f9834j75624k1176f0648I4338O51J31571
18973B26560b50345J02562K4411f1465B89802h8076l2620I5408a21366l9902E1914
18961D9932R970p461e7470C76038A65508a71644F3522h5085A5017d23172C62152
18949D09753b64267L4168C548L02089a47309o2739A37119a99916F9458c9485k08599
18938b48084c4806k82657J00872A03912a89871i2541B85913a78800k17962A6215
18927A81890q3708J12656b92172a23981A93213o4450b12018J4227F553a53380
18916c12506R7403l43446K74747D6179j0906K43995D7865c20648B3635b78829
18905D980R814J97765q7323H730b66178g0700C59270F9615g4415P910o27A17580
$$ y = [339, -174421, -190690, -291855, 168613, 50911, -69834, -245458, -266634, -60648, 94338, 94989, 226560, -250345, -147783, -123372, -61465, 289802, -88076, -120696, 95408, -121366, -161268, 51914, 49932, 59902, 52441, -57470, 376038, 165508, -171644, 63522, -85085, 15017, -423172, 362152, 409753, -264267, -230099, 3548, 305637, -147309, -210048, 137119, -199916, 69458, -39485, -248084, -34806, -317463, -216591, 103912, -189871, -92541, 285913, -178800, -396762, 16215, 181890, 98182, 210838, -292172, -123981, 193213, 128763, -212018, -197791, 6553, -153380, -312506, -215103, -558549, -283802, 46179, 35273, 279268, 47865, -320648, 23635, -278829, 4980, 14794, 212559, 125236, 8730, -266178, -70700, 359270, 69615, -74415, -66505, -67132, 117580]
18892f0654r0972e7224k02983A47942a56481n9500a8267j6907m71732H690N8713
18881F7403f0252I4936l1281B5020b88854L8054i9606k30104C2459L5884a70450
18869a66079O1048H1075j9865k53c0678A39258R523B5607a42586A35918E6323
18857E3151g1027B41749A1726c33349J17354g4264E41781a13635D2513J00399
18847A42912L9230a82223A24331h5897j01895P5021l4703h604D1720b59996a07681
18835A35513c60464a33477j39973j0635A72466b4941j91605J6145E1837J08562
18825A60399a50743B31043j01110J8815a54422A77961g8969A17704L46469B4362
18814h606k07977g3896j74426o6127J48969C82517h0696q4384A45330N835h0085
$$ y = [-60654, -151626, -57224, -260207, 147942, -156481, -215981, -18267, -35174, -506906, 8690, 67403, -60252, 94936, 63655, 25020, -288854, -250800, -99606, -329710, 32459, 68343, -170450, -166079, -105031, 81075, 61210, 60957, -30678, 139258, 148781, 25607, -142586, 135918, 56323, 53151, -71027, 241749, 11726, -333349, -215995, -74264, 541781, -113635, 42513, 142912, 182142, -182223, 124331, -85897, -187792, -112771, -147474, -8604, 41720, -259996, -107681, 135513, -360464, -133477, -273450, -284085, 172466, -24941, -216546, -200401, 51837, 160399, -150743, 231043, 129933, 148748, -154422, 177961, -78969, 117704, 464173, 24362, -8606, -216583, -73896, -248322, -314449, -165480, 382517, -80696, -165080, 145330, 151165, -80085]
18802A50365a5607k85373i6413o5643A98543a49605R740j84122b8849A07648a7543
18790A8376h887c077k2494B22836b744j51523N9781b9998B25738b33872J09393
18779a24479I9176J80659b03562M7707m9624J00694j78195h6606J508q8594j35124
18768c08816e2409d981j4946A43102h1884k79812h4663A81414a91191q0716A79708
18756A69295K09010a39406j73578B39478g2736k48253K999a38751f4952j10112
18746a75064H673b26226a11024A57607a719j75300B0267b24846J5772E3549R6226
18735A49775B3865b12373E4087b3990G128a18514H0245c13637a45857A65936g3992
18723c79717M8658b6772j53023l24634A23748F0244J32758f3730j37148b945r0696
$$ y = [150365, -15607, -300980, -96413, -162056, 198543, -149605, -139865, -323987, -28849, 107648, -17543, 18376, -8887, -3077, -25571, 222836, -2744, -154267, -94486, -29998, 225738, -233872, -124479, 99176, 279835, -203562, -155855, -205479, -104785, -282980, -86606, -85098, -173692, -308816, -52409, -4981, -19927, 143102, -81884, -361696, -84663, 181414, -191191, -271907, 179708, 169295, 378305, -139406, -312984, 239478, -72736, -320989, -317990, -138751, -64952, -175064, 8673, -226226, -111024, 157607, -1719, -177019, 20267, -224846, -209074, 53549, 149775, 23865, -212373, 54087, -23990, 7128, -118514, 80245, -313637, -145857, 165936, -73992, -379717, -331059, -26772, -179795, -504429, 123748, 60244, 193002, -63730, -200878, -2945, -93641]
18712i3641A42991b59574A05236f8501D60911j78531I0597C7937a6387m779i599
18700b32725D9181c7857j08331D4562c59510A9229d57629a95413b4667F9534J17008
18689A86542k6664K159p9067b94136P5480K206B67765a75481F3057J5089f846
18677c02699B23799a68603j66036J66405e7212m17363a26650p8937B0513M0431
18667F0944b57150B74472b92564A83144G4587c6360o8544A0846M5037c54300e7356
18655b12173H6441J82044b0958j43093I2616d8471r4756j14054e1656B09328B5678
18643f9909j18313P1052C72247i8568j0928H33f2666j76476A14575j3654c6517
18631B05236j01951D6169a33146n5521O1404L1868A79557n9616B8076c68777C2285
$$ y = [-93641, 142991, -259574, 105236, -68501, 460911, 282380, 90597, 37937, -16387, -21166, -9599, -232725, 49181, -37857, -146188, 44562, -359510, 19229, -457629, -195413, -24667, 69534, 186542, 159878, 162037, 82970, -294136, -218656, -216450, 267765, -175481, 63057, 78146, -6846, -302699, 223799, -168603, -334639, -168234, -57212, -474575, -126650, -205587, 20513, 60944, -257150, 274472, -292564, 183144, 74587, -36360, -104904, 10846, 55883, -354300, -57356, -212173, 86441, 268485, -20958, -164051, 92616, -48471, -143227, -257281, -51656, 209328, 25678, -69909, -188222, -117170, 372247, -98568, -109496, 833, -62666, -239142, 114575, 100921, -36517, 205236, 103285, 46169, -133146, -188667, -127263, -95395, 179557, 119941, 28076, -368777, 32285]
18619b76295a8568E8000g1707j22784A2497c54707J44045d6226H7516J41456b2365
18607a40809d6255I8455M7668c7751D1621a62178l9938O3439f6430k1364m86567
18596e74361K19597E2964c2347A3011J66149a14921B30903I8600b39791N9499
18586a80292n4307O168B24719n0818F735M2937b78734j5389a3933A8104K6150
18575D4254J55805a55920l04244a83411c7268g026k0947j03078h183k29861A3504
18563b64270h7178B57039b77662N1306j53628a53997b2985A3241a69580P8030
18553i1550r163j11968A05098k5419f2509k54751q6063J68663d5781H4870b5475
18541c66464c169E5796P0154c24857H1332e9107B01847n2773K9895e6857A20057
$$ y = [-276295, -18568, 58000, -71707, -194491, 12497, -354707, -210662, -46226, 87516, 228972, -22365, -140809, -46255, 98455, 146123, -37751, 41621, -162178, -202116, -138677, -66430, -87794, -574361, -354764, 52964, -32347, 13011, 179160, -114921, 230903, 98600, -239791, -180292, -234599, -228431, 224719, 173901, 6735, 49672, -278734, -294123, -13933, 18104, 44254, 200059, -155920, -460164, -183411, -37268, -7026, -27973, -131051, -8183, -238044, 13504, -264270, -87178, 257039, -277662, -226356, -379984, -153997, -22985, 13241, -169580, -91550, -100713, -212681, 105098, 79679, -62509, -317260, -403323, -234660, -45781, 84870, -25475, -366464, -3169, 55796, 125950, -324857, 81332, -59107, 201847, 149074, 178969, -56857, 120057]
18529b63224p010g5125k52584A51922e1067n0978A90906m9721h7622j5336k15811
18518c18769H1509d9219k17662P1284A90401a42309d0074k65656A21231h1875
18507a52581A30840n3560J15696d22090C7480d2189A72083d2600k94621E31517
18496A8574b10657B62444I8710b40472o0683O4678J10096A35700b51148a03514
18485a29015C06552G3693h3903j87979B7694d1807A6616J1745f7726B765M19215
18474D21980c66611G78O4211K39309n2625i9215L3472m9362q995K9088H5194A2871
18461d1111j7158A38909b04711j54679H5280a38108A21654a89670A85562K8223
18451B13785a24489j7113N7988k5912A54793C4080K86777G4274a24544Q237G8785
$$ y = [-263224, -270234, -75125, -327709, 151922, -51067, -102045, 190906, 141185, -87622, -102958, -318769, 81509, -49219, -266881, -195597, 190401, -142309, -40074, -305730, 121231, -81875, -152581, 130840, 77280, 192976, -422090, 37480, -42189, 172083, -42600, -337221, 531517, 18574, -210657, 262444, 98710, -240472, -301155, -236477, -126381, 135700, -251148, -103514, -129015, 306552, 73693, -83903, -271882, 27694, -41807, 16616, 28361, -67726, 2765, 421980, -366611, 778, 64989, 304298, 251673, -99215, -65743, -115105, -124100, -95012, 85194, 12871, -41111, -58269, 138909, -204711, -359390, 85280, -138108, 121654, -189670, 185562, 213785, -124489, -141602, -83614, -109526, 154793, 34080, 320857, 74274, -124544, -116307, 78785]
18439G2747d55369a52234B77230G4571i7887b7634o617A86946J63930b84573A11707
18427c3881R940j999A03926a8155l46943l48R4514b6311g859A02658b00758D5952
18414b18671h7690j11400a8901k61011k6398E40825A71005a05450A46112l33b43631
18402A64392E6427b9448A26550a34468C5865O5024m7249c14789B53247c8096k28919
18391b67015A25592b45004b8474C4554f8572C7463a19771N0405l12862a3095j2055
18380b5150j07189C8982f2042A44347C9708K9972a95035C77892f4274C4641d4820
18368C93434b16575a4986C1029B317K01251G3054P4804o8226a69577m30904A01735
18356A38938L2833b85330C22180d50237G252J04129J38462b5519j3019A02917
$$ y = [72747, -455369, -152234, 277230, 74571, -97887, -27634, -34251, 186946, 350876, -284573, 111707, -33881, -23941, -25940, 103926, -18155, -365098, -365446, -270932, -26311, -7859, 102658, -200758, 45952, -218671, -87690, -199090, -18901, -279912, -306310, 540825, 171005, -105450, 146112, 145779, -243631, 164392, 56427, -29448, 126550, -134468, 35865, 100889, 53640, -314789, 253247, -38096, -267015, 125592, -245004, -28474, 34554, -68572, 37463, -119771, -69366, -382228, -13095, -25150, -132339, 38982, -62042, 144347, 39708, 69680, -195035, 377892, -64274, 34641, -44820, 393434, -216575, -14986, 31029, 2317, 203568, 73054, 147858, 79632, -169577, -600481, 101735, 138938, 171771, -285330, 322180, -450237, 7252, 111381, 249843, -25519, -38538, 102917]
18345d68281I5455k536b93410J28326D28086A39777a71199b824A58913a98476
18334A10042d9791j48018E5197j0518c74326c8327j33162k8767F0823b22647h1812
18322a28888l50718c1408n17874Q4585a44567b9786k01817a10934j13333A27667
18311c30733B17373a25577D404d1374C9600g3601Q256k60354A13015Q2591E0235
18299b33291o8613i4169G850e3956n8448A45645a05210k85034H1860O8708b66085
18287E1050J24551E9678a53696j8902j45105D0656c72830J68232Q6393M9758l4417
18276a02864b7577A33704J17839G4933d2480k19277a25462j34931a04074b3085
18265C65018d7687B23947F0770L6559b23510G208b54363j10081a67036j88202
$$ y = [-468281, 95455, 92919, -293410, -165084, 428086, 139777, -171199, -2824, 158913, -198476, 110042, -49791, -197809, 55197, 44679, -374326, -38327, -171489, -200256, 60823, -222647, -81812, -128888, -479606, -31408, -549282, -464697, -144567, -29786, -231603, -110934, -224267, 127667, -330733, 217373, -125577, 4404, -41374, 39600, -73601, -65345, -325699, 113015, 195606, 50235, -233291, -301904, -94169, 7850, -53956, -112404, 145645, -105210, -390244, 81860, 150568, -266085, 51050, 175601, 59678, -153696, -172598, -317703, 40656, -372830, -204598, -118205, -68447, -102864, -27577, 133704, 251543, 74933, -42480, -261757, -125462, -260393, -104074, -23085, 365018, -47687, 223947, 60770, 97329, -223510, 7208, -254363, -364444, -167036, -355238]
18255c55238E3225a03002j6826j31960A295a61873B31717G9282a09982B18053
18244d5571H0979L49048b20095A05695A4950g4039B04559q9716k4346K02627a35998
18232A24677h0185B3171o387b66295C63573E9236N239A1059J73784K27819j79908
18221B32754a14377e219l16890A08058k6446f2398k0948C24371a15503j23266
18211b38769N0676J1953J1290A38586a92230A06064a72874p871A54084P811a24328
18199c2822D10227b7101n1768E9836a44739L4785I1093c46528r0658c0512l02126
18188c32638N8749A10425a1100j01825D5540a78764I7213J25832d9385n1657K6012
18177g5030i064B83180A34487M81b35679a03728A08980A0828O60020c3704k46144
$$ y = [-355238, 53225, -103002, -119828, -251788, 1295, -161873, 231717, 79282, -109982, 218053, -45571, 80979, 430027, -220095, 105695, 14950, -74039, 204559, 114843, 90497, 293124, -135998, 124677, -80185, 23171, 16784, -266295, 363573, 59236, 64475, 11059, 184843, 412662, 232754, -114377, -5219, -322109, 108058, 81612, -62398, -83346, 324371, -115503, -238769, -188093, -176140, -164850, 138586, -192230, 106064, -172874, -180745, 154084, 161895, -124328, -32822, 410227, -27101, -78869, 59836, -144739, -109954, 91093, -346528, -437186, -30512, -332638, -273889, 110425, -11100, -112925, 45540, -178764, 97213, 223045, -49385, -101042, -75030, -9064, 283180, 134487, 134968, -235679, -103728, 108980, 10828, 670848, -33704, -279848]
18166b79848D34411a10400j65075b3720j1595j97573F1019N9731d9065b457A3331
18154c4739k79692F9366B2324J30641K9382b47787A43257o2521b55854b2601G4084
18142a60458A40196a4194A21405D0667J7339d10463a37759e8423p8757r8817O6290
18131a69707H6165O5479d7791e165p1499m0882d3367A12383c75550i4326j5696
18120a10022A25415h4267j75779M3500K9939j51823f2053A07928a36679j81401
18110c18080a57753B3902i6186D41615A99685F2562b36198C05495A40544R3216
18100B33760a09666R518L0967k9137B10940L41372c02619Q4804j28132a56231
18089A54999i811p6736G0501b18549a02769j44324k6334h001E9358B1948P9125
$$ y = [-279848, 434411, -110400, -275475, -23720, -35315, -232888, 61019, 120750, -49065, -2457, 13331, -34739, -314431, 69366, 22324, 152965, 182347, -247787, 143257, 80736, -255854, -22601, 74084, -160458, 140196, -14194, 121405, 40667, 58006, -410463, -137759, -58423, -137180, -235997, -169707, 86165, 151644, -47791, -5165, -76664, -117546, -43367, 112383, -375550, -94326, -110022, 125415, -84267, -260046, -216546, -186607, -338430, -62053, 107928, -136679, -318080, -157753, 23902, -96186, 441615, 199685, 62562, -236198, 305495, 140544, 233760, -109666, -100148, -69181, -98318, 210940, 552312, -302619, -217815, -345947, -156231, 154999, -9811, -86547, 70501, -218549, -102769, -247093, -273427, -8001, 59358, 21948, 101073]
18078A01073a30935N4253C4851g5741j20834c6584A18592c55663a56048K4824
18068a31224l1969J2422j35645h7070l02348C35550H1087B3857e9954F1808b49527
18056G1045j7470a72328m1335B3241d233A9014F521a59192F4165a05429C14843
18044B57213G5956h8651F2398a34512n2031d7070l7670o9628p8955c3701l59948
18033c93649A54063b01837c1548A55321M902p6108J76301b80836B05668E4597
18022C9769K1808a67026f3242A42582k9636a30894B74398i9767l75434B8359a86847
18010G7042J44749g6533l1699D5697p146a20604A99889B5440b18775d8308D4572
17998C286b34107P9774H8338b84721a27474j9257M1530B85374B3864b8368r2948
$$ y = [101073, -130935, -76682, 34851, -75741, -196575, -36584, 118592, -355663, -156048, -131224, -163193, -150771, -286416, -87070, -389418, 335550, 81087, 23857, -59954, 61808, -249527, 71045, 53575, -172328, -213663, 23241, -4233, 19014, 6521, -159192, 64165, -105429, 314843, 257213, 75956, -88651, 62398, -134512, -186543, -47070, -84740, -154368, -233323, -33701, -393649, 154063, -201837, -31548, 155321, 160223, 84115, 260416, -280836, 205668, 54597, 39769, 61577, -167026, -63242, 142582, 112946, -130894, 274398, -99767, -475201, 28359, -186847, 77042, 221791, -76533, -108232, 45697, 38551, -120604, 199889, 25440, -218775, -48308, 44572, 3286, -234107, -154333, 88338, -284721, -127474, -146731, -105201, 285374, 23864, -28368, -121316]
17987a21316A72814A6579c04444I0322J29036g0126j76105h6127C8730J68228
17977B06958c1518j45625B02230p2521B7130f8201J7789j73635A94622b09935
17966a71072Q2118E4851a76408O927a4829E1849i3192j269M7152a5622j55859
17955a71481H7093b03550B23352a06992k56554A68917p1886b04497G3842a61674
17944a77750A79785e2266A1450c37391A60595a19546B40018i8636k5908c4705
17933B5352d9546n5814C4530a7440P207k21334R3669H1488b4763k4042C8196J64304
17921B02500P1905I3944L05251I0188L2940a44464p296H5331m1992c9727k52664
17910b92391a03635j19540K1555e0380E5165J98293K3826b43890J2673a09970
$$ y = [-121316, 172814, 16579, -304444, 90322, 219358, -70126, -246231, -86127, 38730, 206958, -31518, -177143, 202230, 129709, 27130, -68201, -50412, -224047, 194622, -209935, -171072, -88954, 54851, -176408, -169481, -14829, 51849, -93192, -94461, -47309, -15622, -171481, 87093, -203550, 223352, -106992, -363546, 168917, 97031, -204497, 73842, -161674, -177750, 179785, -52266, 11450, -337391, 160595, -119546, 240018, -98636, -124544, -34705, 25352, -49546, -105360, 34530, -17440, -10233, -231567, -137898, 81488, -24763, -48805, 38196, 202500, 274405, 93944, 399195, 90188, 123128, -144464, -151760, 85331, 43339, -39727, -292391, -103635, -223175, -201620, -50380, 55165, 253458, 277284, -243890, -231217, -109970]
17899G5552K11385a70508B11274a77457M9423A64228c8112h849j61370a7374B96847
17887A5927b95687J26283A60009A1874a01505h799A34625C3370a80681C8937R3648
17876A32585h993k25894E953d4304m632k80305B9157b60839A81440J76635e0357
17864B00301p5390K94321a9441j47043F6893a06836I7655d7342a0321r7662G8129
17852b43779Q9403C77313D8529A9851J86243p7462g7859F1565a41989j54431A3794
17840g0730o3209J3608B3976e4101k12258c0644a3280D5620d7368A43487R0733
17829B34220F8446B1120g5692j57514B3003a96179j4794g346b264H3440j3045
17818G0395q345f4334I2459a50326B94856G6685J38267a71632C54914R951a42546
$$ y = [75552, 286937, -170508, 211274, -177457, -128034, 164228, -38112, -8849, -170219, -17374, 296847, 15927, -295687, -169404, 160009, 11874, -101505, -8799, 134625, 33370, -180681, 38937, 132585, -8993, -234887, 5953, -44304, -48936, -329241, 29157, -260839, 181440, 358075, -50357, 200301, 124911, 419232, -19441, -166484, 66893, -106836, 97655, -47342, -10321, -107983, 78129, -243779, -154376, 377313, 48529, 19851, 206094, 128632, -77859, 61565, -141989, -296420, 13794, -70730, -133939, -120331, 23976, -54101, -266359, -30644, -13280, 45620, -47368, 143487, 234220, 68446, 21120, -75692, -233206, 23003, -196179, -210973, -7346, -2264, 83440, 70395, 62050, -64334, 92459, -150326, 294856, 76685, 214952, -171632, 354914, 364865, -142546]
17806c65954a6613A81069h1355A6022i2318B90084Q8208b63357M7112a03434D39
17794b17495A32746P0874B5441L7547K44431E6826M2065l4658L14702b99994f7633
17782A88694g0804a7496A41818K14890a55545H5189R8725p1154c1097A64570b40162
17770A77596f9063j07776L1951L8663E0236h7436D08417l5800o9624j21907K5004
17759B06090A9653J25712g9170B58461b20767I2275h1512L9943I302K22222c0482
17747A27264d5281B40567b5388j27079A3354N4574c37732D0980i6679M1041D5636
17735C14298b21631A89469J68886b306p4870C5974O1548a66397B12791b43580
17724c9185p3403j22894j4820J06219H0985J95407c9050j36637E0733M6030f1819
$$ y = [-365954, -16613, 181069, -81355, 16022, -92318, 290084, 378292, -263357, -216245, -103434, 439, -217495, 132746, 203620, 25441, 62988, 307419, 56826, 98891, 64233, 378935, -299994, -67633, 188694, -70804, -17496, 141818, 356708, -155545, 85189, 183914, 112760, -31097, 164570, -240162, 177596, -69063, -176839, -144888, -106225, 50236, -87436, 408417, 372617, 302993, 181086, 206090, 19653, 145365, -79170, 258461, -220767, 92275, -81512, -41569, 9302, 231524, -30482, 127264, -45281, 240567, -25388, -152467, 13354, 67928, -337732, 40980, -96679, -55638, 45636, 314298, -221631, 189469, 358355, -2306, -77176, 35974, 97522, -166397, 212791, -243580, -39185, -112588, -235482, -250302, -144083, 80985, 276392, -39050, -175687, 50733, 96763, -61819]
17712a09574A2501b49774A38461F4490a2510r2151A41414e509C2383R9728B5167
17700d3876a1686A10835a11401A17743c5412H8987E061d690n8925k14596A22047
17688A93626J00285a86421K699p0947a16143B51062a24700a8869B1606J15403
17678A37009Q7799b5313k5189j37850B09043q8587a42568J5981B96741N9311E0288
17666B67334E2014d6040A62990C8013K44788a56359B13627d7861m7737A16041
17655C00064G7134b01704r242A17905b07636C0635L60687d8197A5247b48563A13387
17643A37526b92219o4466b6484I276a3878A62715b84876G0476a0065A38747b80882
17631F2651M740A7725L2355c4546F8333g591D2407K16077o0079b79145i2320D3740
$$ y = [-109574, 12501, -249774, 138461, 64490, -12510, -104661, 141414, -5509, 32383, 132111, 25167, -43876, -11686, 110835, -111401, 117743, -35412, 88987, 5061, -4690, -63615, -278211, 122047, 193626, 293911, -186421, -183722, -254669, -116143, 251062, -124700, -18869, 21606, 137009, 224808, -25313, -50502, -188352, 209043, 120456, -142568, -126587, 296741, 356052, 50288, 267334, 52014, -46040, 162990, 38013, 282801, -156359, 213627, -47861, -95598, 116041, 300064, 77134, -201704, -210946, 117905, -207636, 30635, 391322, -48197, 15247, -248563, 113387, 137526, -292219, -356685, -26484, 9276, -13878, 162715, -284876, 70476, -10065, 138747, -280882, 62651, 67391, 17725, 50080, -34546, 68333, -7591, 42407, 258484, 198405, -279145, -92320, 43740]
17618a51027i821m7241G6230K81924E2799J2096R1387g2559l6311C9573N485a14826
17605A56526b0686A15421a62304Q362C0183a50105C7426L8372f9745B84617i42
17593b07710D2602a35222A92323a4585j66322A74411J5383c94667B40170g2616
17582b12368A58812C2354b2882A48488Q7694a40059A84279e7115A36829a48245
17571B82699d56900A57477P5752a61414a2508C5298f385m2287C38404j09818P8067
17560C06653H9558a37508B32161P7912C8654a32486D3075b45594q8876Q4149D4804
17548a78456A39030a39489A49346B4253c2102C35165d63764h3406C63481I9313
17537C17869A00120L97138I8949C2480J33714G3023K63608B8890J13988R5097
$$ y = [-151027, -9821, -57062, 76230, 358154, 52799, 64895, 156282, -72559, -108870, 39573, 45058, -114826, 156526, -20686, 115421, -162304, -153942, 30183, -150105, 37426, 75798, -69745, 284617, -942, -207710, 42602, -135222, 192323, -14585, -180907, 174411, 189794, -394667, 240170, -72616, -212368, 158812, 32354, -22882, 148488, 236182, -140059, 184279, -57115, 136829, -148245, 282699, -456900, 157477, 233229, -161414, -12508, 35298, -6385, -48672, 338404, 228586, 306653, 89558, -137508, 232161, 310073, 38654, -132486, 43075, -245594, -334470, -250321, 44804, -178456, 139030, -139489, 149346, 24253, -32102, 335165, -463764, -83406, 363481, 99313, 317869, 100120, 497258, 98949, 32480, 166194, 73023, 336631, 28890, 142878, 237975]
17527B37975j06893K00506q7436b7865E6976G907g9081A26403m6726J28326j4952
17516A93051q4423o00L9761J53096b32598i7931B48629b4393m59778B07260E7261
17504a83058A6938Q9050J18642b617C2808R6427b62455R3142j45224Q8321g104
17492a01801C46569j8836A17878a80740C67499D4453K0196L95348j38196j33869
17482A87932K9004b7660D50401f4631B13523G8656M1488m9500M7694l1324J67114
17471B54128O1627J7432F0751f548B06121C1619b2846j26691C68474a34244B14877
17459A90228f9283B61453B6100K48651Q8500i4334C97449H4382K48399r1056j08198
17448A33527M3487K7531N375l3356L88245k49125A55655J28593n9415J61792j30497
$$ y = [237975, 131082, 331588, 244152, -27865, 56976, 7907, -79081, 126403, 79677, 208003, 193051, 108628, 108028, 147789, 300885, -232598, -97931, 248629, -24393, -484171, 207260, 57261, -183058, 16938, 105988, 224630, -2617, 32808, 129235, -262455, -169313, -314537, -226216, -7104, -101801, 346569, 327733, 117878, -180740, 367499, 44453, 64649, 459997, 321801, 187932, 216936, -27660, 450401, -64631, 213523, 78656, 120144, 70644, 118338, 87014, 254128, 315755, 333187, 60751, -6548, 206121, 31619, -22846, -149537, 368474, -134244, 214877, 190228, -69283, 261453, 26100, 274751, 363251, -94334, 397449, 84382, 332781, 241725, 133527, 177014, 204545, 209920, 176564, 564809, 315684, 155655, 284248, 224833, 386625, 256128]
17437B56128Q11a03326A65604K46557k8648q2698j23459l2927M06536e8224A28126
17425C76911K588A17151e603B48170A4267O16118A93371J15506r7155j2678J83233
17414C82277A00349M06236A89985F5472M57892j84484n8443G0874J1168j8909
17404F3133Q4134l442b6163D56929R2984I6390c652A32924a75918C26031C1270
17392a55191c0020A91669Q6767P1797A03454o330J52756J02977A47541K69912
17382D17453l6582a54969C0006a99730D76426k18782F9840i9262A9602Q3721J04948
17371B08271c9943j3064G7546P2764h4147A44782M7001a05951a7200B29828O2671
17360B92499a55680H2232Q7143N5348J12901A4465M57039B10509D4696k189L55293
$$ y = [256128, 256939, -103326, 165604, 412161, 383513, 300815, 177356, 144429, 550965, -58224, 128126, 376911, 379499, 117151, -5603, 248170, 14267, 630385, 193371, 308877, 211722, 199044, 382277, 100349, 506585, 189985, 65472, 523364, 338880, 280437, 70874, 82042, 63133, 147267, 143825, -26163, 456929, 549913, 96390, -3652, 132924, -175918, 326031, 31270, -155191, -30020, 191669, 278436, 350233, 103454, 97124, 249880, 352857, 147541, 417453, 380871, -154969, 30006, -199730, 476426, 257644, 69840, -99262, 19602, 103323, 208271, -39943, -53007, 77546, 150310, -84147, 144782, 191783, -105951, -17200, 229828, 292499, -155680, 82232, 169375, 224723, 337624, 14465, 471504, 210509, 44696, 42507, 397800]
17349C97800H4813K24710D7624K1529J09613n5911R670b04984C04546g8301G4924
17337I0593J57729O1573j32180F5212a0224A7527b61266A37234h5874a3688A19504
17325a75051A83437f7175A96360a60565l8139A91825j4205n0348K07709D7357
17314A5099A904M7100o482K22415E7432K24421f8563A92948K4607m1470G9153
17302A05483O6896Q0337b27241L5760A45949d9447n4575C43446M6630j22318J5176
17291B82934o7744Q6148L6657o6078C0060A2138J72143q9616k2601h3153A31945
17279A29706J38875k7029K16878A06028K16538n9864N9079F6114e7296C58937
17268A89799I2465L17079A99687N17p1060L34780n2488A38894b11527B04600k5396
$$ y = [397800, 84813, 309523, 47624, 69153, 178766, 122855, 132525, -204984, 304546, -78301, 74924, 90593, 248322, 309895, 177715, 65212, -10224, 17527, -261266, 137234, -85874, -13688, 119504, -175051, 183437, -67175, 196360, -160565, -198704, 191825, 177620, 127272, 334981, 47357, 15099, 1904, 49004, 42522, 264937, 57432, 281853, -68563, 192948, 217555, 176085, 79153, 105483, 172379, 252716, -227241, -191481, 145949, -49447, -104022, 343446, 390076, 267758, 282934, 215190, 301338, 337995, 271917, 30060, 12138, 184281, 94665, 72064, -83153, 131945, 129706, 268581, 241552, 458430, 106028, 322566, 262702, 321781, 66114, -57296, 358937, 189799, 92465, 409544, 199687, 200204, 129144, 463924, 411436, 138894, -211527, 204600, 179204]
17257A79204O2879j10602R1687j07471Q8099J92179j09550j34059K03810j42593
17247B13583M6820K01138m3987k06462J21718A06369a9318A99096K34035a33424
17236B7485a26980C41174j1423H2045M81197g1201A68715Q4021M3596k6739N727
17225B75320a58942B06028F1909a3651o7757D541c7437C49357k0980o5184a16643
17213D58035A51400h434A99755o2819J85403q2762j13063E8435B8101L04746R7156
17202D30003A29134K26910J16421A49344J3869c7525D34242K2415A12331j4784
17192I7547J24824N1299Q4954q0692J19539h4595n6149d2046E09583A38555E2568
17180B78642M4096C6758K98668n0399e2586H2890L7727M00867o6395B10732n0431
$$ y = [179204, 242083, 131481, 223168, 115697, 203796, 395975, 286425, 152366, 356176, 213583, 260403, 461541, 417554, 211092, 332810, 106369, -19318, 199096, 433131, -133424, 27485, -126980, 341174, 329751, 82045, 563242, -71201, 168715, 252736, 296332, 269593, 275320, -158942, 206028, 61909, -13651, -81408, 4541, -37437, 349357, 328377, 263193, -116643, 458035, 151400, -8434, 199755, 136936, 322339, 239577, 126514, 58435, 28101, 332847, 430003, 129134, 356044, 472465, 149344, 163213, -37525, 434242, 456657, 112331, 97547, 222371, 273670, 358624, 277932, 397471, -84595, -140744, -42046, 509583, 138555, 52568, 278642, 322738, 36758, 335426, 285027, -52586, 82890, 120617, 521484, 455089, 210732, 160301]
17169A60301K99600A22944M74438k96911l3241Q915j26968K01181A47345K53610
17159D00955A78443j861l6564j5092J11599m321q4603P4816L0862J73727k00581
17148B26425N1273E95M57570J46528k06522n6839j00977M6757P2334j56829L34451
17137E37068B33164r535K10746J16800B61362J45244j00432J11347A84916K84187
17127D69103j58175k9405K0023R6367j14663J07705j65321N6600A07878J35219
17117B43097K0454C2968c1238D19059j87640m0618K04111j30664K49267j17018
17107C96497A26252K5578L65067o9365j31760L5838l0619O54489C35124r7836
17097B37288K16540j75359j10395N1849p4141J88977K39338k14911L06437r3766
$$ y = [160301, 459901, 122944, 597382, 300471, 267230, 276145, 149177, 350358, 147345, 400955, 178443, 176582, 140018, 124926, 236525, 232204, 147601, 222417, 253279, 427006, 226425, 277698, 595, 458165, 604693, 398171, 341332, 240355, 287112, 359446, 202617, 537068, 233164, 223629, 434375, 551175, 261362, 406606, 306174, 417521, 184916, 469103, 310928, 281523, 301546, 397913, 283250, 390955, 225634, 282234, 107878, 243097, 263551, 32968, -31238, 419059, 231419, 190801, 394912, 264248, 513515, 396497, 126252, 151830, 516897, 447532, 315772, 351610, 320991, 975480, 335124, 237288, 453828, 278469, 168074, 219923, 145782, 334759, 574097, 359186, 665623, 571857]
17087E71857A13605J89785J33166L2324N4491J03399k29877L3603n4044j7580
17077C58872A63787L24436A93290J31226m2162K30861j12253J31452Q582J91370
17067G32366j81156C3588K80062K5940M09446j06575j95945J13796O3454L0060
17057F53826p1806k90379J60466K00285k20194J62528k72457K10778q575o0744
17047D63728o3841N8705B03277L86394K86138l24881j42147O7615R3860J73368
17037G43624J3657k73219O4081J96430l16382J49575n8794k4994k8193L1115J95858
17026F92758k61552M44354k20432q2489B14232Q09292D33995K47924J18690j56010
17016F44599l15985M70816l07586L48622m05560J96760K32287l27377J93694l27053
$$ y = [571857, 113605, 303390, 436556, 468880, 523371, 626770, 396893, 430496, 376452, 358872, 163787, 488223, 193290, 324516, 282354, 513215, 400962, 532414, 540996, 732366, 551210, 33588, 313650, 339590, 749036, 642461, 446516, 560312, 623766, 653826, 582020, 291641, 452107, 652392, 432198, 594726, 322269, 533047, 524472, 463728, 399887, 458592, 203277, 589671, 875809, 550928, 408781, 476396, 570256, 743624, 757281, 484062, 548143, 744573, 428191, 577766, 518972, 493978, 465785, 496900, 692758, 431206, 875560, 655128, 572639, 214232, 1023524, 433995, 681919, 800609, 644599, 328614, 799430, 491844, 840466, 434906, 631666, 863953, 536576, 730270, 403217]
17006D03217O47430j61451l5795j20063l2316k88895N28005m09335N15016l12273
16996G33540M0025l51077N10608P2275l5265k23693j07612J20809K07900N3508
16986A021018j52420l99795K05964K56246J42379E20617N62377l83306R0979K78250
16976A068917m6746j30863J68122j2261n4566J81051n65297P4826K91975Q5373
16966A060531J11593j72445k22290M95554r8460j59768n6363k07849Q3491J19824
16956I53818L10328m09656L92931j43631k82308J73558L81326o38980M49772L3999
16946A221157l53583K16332L38799k87925k3009M8692j26656M27604n85043P3826
16936I50194M38115j39100j07170J17255j51745L62497j68762j81429K29726k84415
$$ y = [403217, 1050647, 889196, 853401, 733338, 701022, 412127, 940132, 530797, 1045813, 733540, 773565, 422488, 933096, 1005371, 970106, 746413, 638801, 759610, 967510, 1021018, 868598, 468803, 674767, 931013, 1073392, 520617, 1082994, 699688, 790667, 1068917, 1022171, 891308, 1059430, 1047169, 992603, 1173654, 608357, 683183, 975158, 1060531, 1172124, 999679, 777389, 1272943, 1174483, 1014715, 958352, 750503, 833994, 953818, 1264146, 854490, 1247421, 1103790, 821482, 995040, 1376366, 737386, 1187158, 1221157, 867574, 1083906, 1422705, 1134780, 1111771, 1160463, 1033807, 1461411, 876368, 950194, 1388309, 1249209, 1142039, 1259294, 1107549, 1470046, 1301284, 1119855, 1349581, 1065166]
16926A065166K62351q1998K0964J59967j21914N8177Q5467k00738J39111L33413
16916A719966m12742P1674J82564k23597L66205k12092N279k603o8808Q9403k48454
16905A266795K80714J69359j95209n7630K32772j32543K1978J81457l79049N86106
16895A974750l71806L97530J5802k61731K64171q0236j91270J59671J63597n8921
16885B011557j26882K49317N66088o88389L56352p4552k14374K58301j34424K21673
16875B424667O6067j98212K70870k60903q5028K81172j11476o2854K01426n4505
16865B471224J75445R9363k33078L95047j12589j16837J78810N3619R5431o4411
16855B942024j21986K35827m3774L5258K71691J32925j27383J30421M96128l28138
$$ y = [1065166, 1327517, 1245519, 1266483, 1426450, 1304536, 1362713, 1448180, 1247442, 1386553, 1719966, 1307224, 1378898, 1561462, 1337865, 1704070, 1491978, 1497257, 1494654, 1425846, 1515249, 1266795, 1547509, 1716868, 1521659, 1464029, 1696801, 1564258, 1586236, 1767693, 1388644, 1974750, 1602944, 2000474, 2016276, 1754545, 2018716, 1938480, 1747210, 1906881, 2070478, 2011557, 1884675, 2133992, 2700080, 2011691, 2368043, 2293491, 2079117, 2337418, 2202994, 2424667, 2490734, 2292522, 2563392, 2302489, 2217461, 2498633, 2387157, 2324303, 2525729, 2471224, 2646669, 2746032, 2512954, 2908001, 2795412, 2678575, 2857385, 2911004, 3006435, 2942024, 2820038, 3055865, 3012091, 3047349, 3319040, 3451965, 3324582, 3455003, 3951131, 3622993]
16845C622993k30724j60392N60255j07945Q8765J98903k95327J88105k07834N0951
16835C707750M44436O0414O8684N1237L4608M03977N6656j4419M1909k94736k7333
16824D533183N34887K96927l63048J90721K24659k09248J98634K90429J13096
16815E810240j2536K81579J03651k2968M51107l0061J27392M23913l61499M50296
16805G221114Q4908J46839K72480j8448J42723K57300J20128J23943O62119Q595
16795I021701K44576P7898L19742L23N28382K40110Q620P76168P0397o0267P84502
16784A2012152J97546M86341O08341K30596K90569O48940K1573N92734N13707
16775A5602499N36935J40108O16874J167752M37618O88613N14154P86255R36343
$$ y = [3622993, 3392269, 3231877, 3792132, 3684187, 3772952, 3971855, 3676528, 3864633, 3656799, 3707750, 4152186, 4212600, 4281284, 4332521, 4367129, 4771106, 4827762, 4813343, 4855252, 4560516, 4533183, 5068070, 5364997, 5001949, 5192670, 5417329, 5208081, 5406715, 5697144, 5810240, 5797704, 6079283, 6182934, 6159966, 6611073, 6581012, 6708404, 7132317, 6770818, 7221114, 7306022, 7452861, 7725341, 7706893, 7849616, 8106916, 8227044, 8350987, 9013106, 9021701, 9266277, 9344175, 9663917, 9664240, 10192622, 10432732, 10441352, 11217520, 11287917, 11227650, 12012152, 12209698, 12696039, 13304380, 13534976, 13825545, 14474485, 14496058, 15088792, 15602499, 16139434, 16279542, 16896416, 18064168, 18501786, 19190399, 19704553, 20490808, 21427151]
16766B1427151N30814J239029P46084J022297R51390J267125J070143J220145
16758B9474178P05708J487482J447510J475272J729326J943251J565360K134659
16750D1962746J797052K590528K236778K557305K948479K568865K746192L682133
16742F3090078L907042M025836L863085M515085M732458N242093N125401O218532
16734A00719610O187521O273984O687473P377309P175725P816323P440776Q039749
16726A57718470P646942O828746O483026O200216M569635M383023K655846J474166
16718A97960070L48927j102113k431044l670137m666318n298379o601760p038933
16710A67500313p460857p794256p626691p753104p815835o956458p527650o887275
$$ y = [21427151, 21957965, 23196994, 23943078, 24965375, 25916765, 27183890, 28254033, 29474178, 30179886, 31667368, 33114878, 34590150, 36319476, 38262727, 39828087, 41962746, 43759798, 46350326, 48587104, 51144409, 54092888, 56661753, 59407945, 63090078, 66997120, 71022956, 74886041, 79401126, 84133584, 89375677, 94501078, 100719610, 106907131, 113181115, 119868588, 127245897, 134421622, 142237945, 149678721, 157718470, 165365412, 172194158, 178677184, 184877400, 189447035, 193830058, 196485904, 197960070, 198308997, 197206884, 194775840, 191105703, 186439385, 181141006, 174539246, 167500313, 160039456, 152245200, 144618509, 136865405, 129049570, 122093112, 114565462, 107678187]
16702A07678187o200095o163805n664612n202405n082984m654407m584071l732422
16694F6393386l388838m006314l008465l378300k612741k768326k675294k101724
16686D2453384k239499j815000j746539j652181j869390j389824j488163j337302
16678B8915486j304868j106290j037620q70894j380750p75938o91290j177661
16670B0570175q45688p34217n58400n65563o91126o73293r09582J2413o73655
16661A4931064l11574o80414n99656n7229p45009l24558m25182r2872m69299p09497
16651A0515774n6673m44781k44125j03143m47581j56880j97209l54288O8905k13815
16641H366184j90497k74462k95948j83470R2702M8734m97667k60742j61351j05391
$$ y = [107678187, 101478092, 95314287, 89649675, 84447270, 79364286, 74709879, 70125808, 66393386, 63004548, 58998234, 55989769, 52611469, 49998728, 47230402, 44555108, 42453384, 40213885, 38398885, 36652346, 35000165, 33130775, 31740951, 30252788, 28915486, 27610618, 26504328, 25466708, 24595814, 23215064, 22439126, 21747836, 20570175, 19724487, 18990270, 18431870, 17866307, 17175181, 16501888, 15592306, 15604719, 14931064, 14619490, 13939076, 13339420, 13282191, 12537182, 12212624, 11787442, 11694570, 11225271, 10515774, 10459101, 10014320, 9770195, 9667052, 9219471, 9062591, 8865382, 8511094, 8579999, 8366184, 8175687, 7901225, 7605277, 7421807, 7514509, 7563243, 7065576, 6804834, 6643483, 6538092]
16631F538092R9659o48505M1686R0443n63805P1512k23732K2296l7154n4009l80482
16620D956001R2134o35296L18568l9097k36675J44620j32706r6697n1028j96298
16610D123526l13443m0479j27610K14571k04470M8617q3261N5130k79344J19458
16600C512695J71909l50655j36876K61553k18423k13515K50248j03380l51769
16591B821787k40345L61479L4933j8993n10182J19631j51781J60887j44910L66355
16581B798861l39362p5983j46024J00766k54911L86552k76338J76750k65446J48884
16571B253749l03378K48663J83061m61468L48172n9610k78081j25995O4255J08665
16561A978033j527k66665L59940l35621K27136j60826k00060J70426k92665Q5565
$$ y = [6538092, 6637751, 5989246, 6030932, 6121375, 5557570, 5629082, 5405350, 5427646, 5390492, 5336483, 4956001, 5048135, 4412839, 4731407, 4692310, 4455635, 4600255, 4467549, 4370852, 4319824, 4123526, 3810083, 3769604, 3641994, 3856565, 3652095, 3700712, 3617451, 3672581, 3393237, 3512695, 3684604, 3333949, 3197073, 3458626, 3240203, 3026688, 3276936, 3173556, 2821787, 2581442, 2942921, 2977854, 2958861, 2448679, 2568310, 2416529, 2577416, 2432506, 2798861, 2459499, 2383516, 2237492, 2338258, 2083347, 2469899, 2193561, 2370311, 2104865, 2253749, 1950371, 2199034, 2382095, 1920627, 2268799, 2209189, 1931108, 1805113, 1869368, 1978033, 1976506, 1709841, 2069781, 1734160, 1961296, 1800470, 1600410, 1770836, 1478171, 1563736]
16551A563736j57122P9852M20733k57142m1639j37483j96316k74963j03296P38561
16541A634921o09620J30955K89496L2879J90117m1503n22236L60164j79968k11288
16531A073917L63106o4636n39906M5785M57658m39319O55165l81649n2889j81499
16521I35733J32641k9103r7763k4344K02077r1173J45580N980q9099l5853j35276
16510I19400J11241J2743j06849J39434k17825l9334K30378L3377k63518J71643
16500I90690k3075k47346L32973j43067j52210K9680M2099j72216K37615j92852
16490G02291J09426j15380M3353l33072L53434j63562J79857j08433O932J37804
16480H12650j85198K27787j7549n2617C38641K79290N0537j39804J59060J37841
$$ y = [1563736, 1406614, 1486466, 1907199, 1650057, 1608418, 1470935, 1274619, 999656, 896360, 1634921, 1025301, 1156256, 1445752, 1478631, 1668748, 1627245, 1105009, 1465173, 1285205, 1073917, 1437023, 1372387, 832481, 878266, 1335924, 896605, 1551770, 1170121, 1117232, 935733, 1068374, 1039271, 941508, 917164, 1119241, 1028068, 1173648, 1179628, 1090529, 1054676, 919400, 1030641, 1043384, 936535, 1075969, 858144, 818810, 1049188, 1082565, 819047, 990690, 967615, 720269, 1053242, 910175, 757965, 787645, 829744, 657528, 895143, 702291, 811717, 696337, 739690, 406618, 760052, 596490, 776347, 667914, 674846, 812650, 627452, 855239, 837690, 785073, 338641, 617931, 668468, 528664, 687724, 825565]
16470H25565l09767K97220B45341J71492K96615m9975J16150M4228O5761n969
16460H83643l30674m5682M7747K57591k90208j5075j36334p5025E0528J06563
16450A57091P7210J94041K44851k00700M15709l72609J66869N0717j62135M1550
16440F12594l8376O9205k61146A76757J59366R5969P5090B27313K19949j16208
16430C31054J78563J91749F4280j1051J65705M8062L16875B79713G7834L75550
16420D53384K22332j93599A12562J64099k581J71217q8818j07059K39491q0522
16410D08389K21362h0705C27413h048F72118B21535n4732K84857M1484B10563
16399B43906q3984J94223D3700L22729j8015A20596R2854G2473L39555K64910
$$ y = [825565, 515798, 813018, 245341, 416833, 713448, 663473, 779623, 823851, 889612, 883643, 552969, 507287, 555034, 812625, 522417, 507342, 371008, 295983, 50528, 157091, 234301, 428342, 673193, 472493, 888202, 515593, 682462, 733179, 571044, 612594, 574218, 643423, 382277, 176757, 336123, 432092, 507182, 227313, 447262, 331054, 509617, 701366, 64280, 53229, 218934, 266996, 583871, 279713, 77834, 453384, 675716, 482117, 112562, 276661, 274080, 445297, 356479, 249420, 488911, 408389, 629751, -80705, 327413, -8048, 672118, 221535, 166803, 451660, 493144, 210563, 243906, 159922, 354145, 43700, 366429, 348414, 120596, 213450, 72473, 412028, 676938]
16389F76938B82593L466k8204b10282C67722O9013l5395q8077K12075j49582I1400
16377C05163j13472L10967D5099K47290K69479k79546L1268q9430H1131L97896
16367D79027B7500L27054A30089P6796J82526j63652a9091B12288K02242r1620
16357C22910E1420J70700J21138j36307O4979C8192L79731j74132j6315H1339
16346B3909J69196A8186h017C2133J16859J54326j3771N9922K21537k26753E8348
16334A08029K03268f389B61288o8594K27138A84039e0277A99493N2623n6795Q4636
16323B79957O9869j67768l9833b22177C06880a21275A00685k4311a49428A25291
16312B19709l0647R7802A24692m2212n036G795M91981A37756C7342J96611p1829
$$ y = [676938, 282593, 286059, 257855, -210282, 367722, 436735, 401340, 313263, 525338, 375756, 91400, 305163, 191691, 502658, 45099, 292389, 561868, 282322, 313590, 224160, 81131, 479027, 27500, 354554, 130089, 206885, 389411, 225759, -19091, 212288, 414530, 322910, 51420, 222120, 343258, 206951, 271930, 38192, 417923, 243791, 227476, 81339, 23909, 193105, 18186, -8017, 32133, 148992, 303318, 289547, 349469, 571006, 344253, 58348, 108029, 311297, -6389, 261288, 192694, 419832, 184039, -50277, 199493, 252116, 195321, 279957, 349826, 182058, 142225, -222177, 306880, -121275, 100685, 76374, -149428, 125291, 219709, 189062, 286864, 124692, 82480, 77444, 7795, 499776, 137756, 37342, 233953, 162124]
16301A62124g0230G4195R6535J64588A30852a30233B24492E3967Q4767E4730R5767
16290A50497B5119L70651A65525N3490p3639J05901O0496a40203A43156A2987
16279C1052j4115c54960B46232C9822g3700F4963J94586K70239A2452O9485b57039
16267D0066J07568O7170K54443B10995J577b2423k82672C17304b8528C97458e6481
16255B23572o4433e7564A30188L8682A6832g423A86347D8491e1124F4370f0935
16243a69298h0851C0899c4719A84342J28467a2939F0822M2690j7011g3006I4221
16231a47105c1504A43199A8789G130L53250A31849K54110I8215D4355K69319O1008
16220C74682j60304m7239E6865K02881a31832d1894F1578L31793A16119g4484
$$ y = [162124, -70230, 74195, 170730, 335318, 130852, -130233, 224492, 53967, 138734, 54730, 150497, 25119, 395770, 165525, 219015, 145376, 251277, 311773, -140203, 143156, 12987, 31052, 16937, -354960, 246232, 39822, -73700, 64963, 259549, 529788, 12452, 81937, -257039, 40066, 147634, 214804, 469247, 210995, 212572, -22423, -305095, 317304, -28528, 397458, -56481, 223572, 159139, -57564, 130188, 168870, 16832, -7423, 186347, 48491, -51124, 64370, -60935, -169298, -80851, 30899, -34719, 184342, 312809, -12939, 60822, 103512, 86501, -73006, 94221, -147105, -31504, 143199, 18789, 7130, 360380, 131849, 385959, 98215, 44355, 313674, 374682, 214378, 167139, 56865, 259746, -131832, -41894, 61578, 393371, 116119, -74484]
16209a64273f9295n9314A22867J99775b4612o5104D9964a97620A52981c71521
16198a86849B06746c1856o3783B31684f1653I2023J28198a26470L668A66678q3018
16187H3660L6599O330J24322A21698n9153h9214A21331c88537C8287J82033k4212
16176A96108J21467B953J11423j6477b08750i7213a8267o2361J8754A12139l4019
16165G8120a52451K0052J9910A26844a73227g3591B1026M9337a23235F7851a54831
16153a15339A06524p23f1242I0386b6474j37786P0668C36205e8109M59A16559
16141A46966D4133c07669B2149J84324a5236H6004J9007f7780l7768j10682A89813
16129A82918a66378A98993F9916a61916a330H663a54530R687B36230F7076a23875
$$ y = [-164273, -69295, -128609, 122867, 322642, -24612, -89716, 49964, -197620, 152981, -371521, -186849, 206746, -31856, -95639, 231684, -61653, 92023, 220221, -126470, -122802, 166678, 83660, 120259, 126589, 250911, 121698, 62545, -89214, 121331, -388537, 38287, 220320, 196108, 317575, 2953, 114376, 97899, -208750, -97213, -18267, -80628, -61874, 112139, 78120, -152451, -132399, -112489, 126844, -173227, -73591, 21026, 70363, -123235, 67851, -154831, -115339, 106524, 105801, -61242, 90386, -26474, -164260, -93592, 336205, -58109, -57650, 116559, 146966, 44133, -307669, 22149, 206473, -15236, 86004, 105011, -67780, -105548, -216230, 189813, 182918, -166378, 198993, 69916, -161916, -1330, 8663, -154530, -144843, 236230, 67076, -123875]
16117F4198f2004k40040d2736a2818k31394B53494h1471A33119J18756A11462
16106A93052m3239n1063M6433m843J13165l170r0905K2395J3049J890M2263i9352
16093F2624a58898A10146a59218E3828c0723E3987b48165L3247C29229A4360J67880
16082A82240f9439m0867k4350a0218o7242A71202g7486B5826c06749J0345J02541
16071a93863p4259c737B321g4786J8561l5667F9859O5784P4460I0207K0811a5017
16058b61273l1557A37366B3964P6910a49678A97234N9672a17308j57010h393A60007
16046E3100d1946j98984A49936j0885f6951k464r538A86179b59797B38655c06796
16034a64490C985e58207b860m1636L829k35855j78253F5372P4810L245A5623Q8852
$$ y = [64198, -62004, -302044, -42736, -12818, -244212, 253494, -81471, 133119, 251875, 111462, 193052, 149813, 98750, 145183, 140340, 253505, 250335, 159430, 181825, 194874, 196764, 239027, -99352, 62624, -158898, 110146, -159218, 53828, -30723, 53987, -248165, -214918, 329229, 14360, 182240, -69439, -110306, -134656, -10218, -77460, 171202, -77486, 25826, -306749, -296404, -193863, -268122, -3737, 2321, -74786, -56225, -91892, 69859, 135643, 210103, 90207, 111018, -15017, -261273, -292830, 137366, 23964, 100874, -149678, 197234, 256906, -117308, -274318, -8393, 160007, 53100, -41946, -240930, 149936, 139051, -66951, -69415, -78953, 186179, -259797, 238655, -306796, -164490, 3985, -558207, -2860, -44496, -40667, -276522, -454775, 65372, 140182, 143427, 15623, 104475]
16022A04475j5920a0487C40085d8908I2613a57115j4064j25721F6511f1105j83812
16011b44917E4222J89739G9471h9873j44191A55651d38026C20478d375j562k6512
16000c2449k65312C9911N3791K18233a80419i490C00650j46851a94931G2054b10564
15988b11955h7479L3091B70774j31354L66530B31663G4115B5175J58815J91230
15978C75220d1860I8695d7799J6653F1916a7734j559j52763d4808q2005D801P0426
15966G5227J20515N3923d5286B4707O8773M0016a25866n9656J762Q5575j74540
15955b72725J23196k83346J82630o8576J01937O752j78353a31925e0939A2341
15944b5869j42996B28029A09926a60380H8487l053f2011m3598k41776a37802p7347
$$ y = [104475, 88555, -10487, 340085, -48908, 92613, -157115, -171179, -296900, 66511, -61105, -244917, 54222, 243961, 79471, -89873, -234064, 155651, -438026, 320478, -4375, -5937, -32449, -297761, 39911, 93702, 311935, -180419, -9490, 300650, 153799, -194931, 72054, -210564, -211955, -87479, -54388, 270774, 139420, 505950, 231663, 74115, 25175, 183990, 375220, -41860, 98695, -47799, -31146, 61916, -17734, -19293, -172056, -44808, -126813, 4801, 75227, 195742, 249665, -45286, 24707, 93480, 133496, -125866, -185522, -183760, -98185, -272725, -149529, -432875, -250245, -318821, -216884, -210132, -388485, -131925, -50939, 12341, -25869, -168865, 228029, 109926, -160380, 88487, 85434, -62011, -105609, -347385, -137802, -215149]
15933b15149A43987A8540a84403j53589B338c35973B22694C9956c1274A63606
15922a38441L6063M2188m89598D9742f3224k14514J6396n4964H920a35686k47684
15911c83370G8634h4274j09177A22570n790b80410g3109E7002J72596j01311b1418
15899c54784A84993a61036j42257h3585j64864C8612d06984f2791o5548O165A36569
15887g1382E1048k984a47729B47487a85502G5814a31143A40881a37321j80954
15877c18275B12966g6584Q316m3661M5600q3718G7219b1720l03516i9942E4023
15865a6942k95632a05337a3028B30615c97968B4097e8163J2421B1835C518e616
15853a12397C2128b795k8325C02634b3526D1759J07760p0214P0544G847K4067
$$ y = [-215149, 143987, 18540, -184403, -337992, 2338, -335973, 222694, 39956, -31274, 163606, -138441, -102378, -60190, -549788, 49742, -63224, -277738, -261342, -316306, 8920, -135686, -383370, 78634, -84274, -193451, 122570, 116780, -280410, -73109, 57002, 229598, 128287, -21418, -354784, 184993, -161036, -303293, -83585, -248449, 38612, -406984, -62791, -128339, -122174, 136569, -71382, 51048, 48064, -147729, 247487, -185502, 75814, -131143, 140881, -137321, -318275, 212966, -76584, -68268, -111929, -66329, -150047, 77219, -21720, -325236, -99942, 54023, -16942, -312574, -105337, -13028, 230615, -397968, 24097, -58163, -45742, 21835, 3518, -5616, -112397, 32128, -2795, -31120, 302634, -23526, 41759, 149519, 79305, 149849, 7847, 31914]
15842C1914a52268e6937G4426b20011b5255C097K70506a78252j27976a32163R831
15831a22332L8951B18454D5206a28246L1459j81715a04359b0961j59348P5752
15821a04557G3770P2725F9327b73175G2953L07306c55121J9211j8383A65791b15513
15809F4463l0804a55627b9591B23374D0671g3884k52573M6390J38648B1413a21848
15797a08863G1508c3464B28598I6976C8198J33727b84552C40045A21157d5334
15786B45675b5734m9307k01352C02568a29414d2019A33706c34868J51773k28175
15776d11270a61849B47956M8419p1687c8331F0548J43067c26326H0835K07670
15766B88505A39182D8495a54646B9195L8092J20654c41178H6293C075K0239K77583
$$ y = [31914, -152268, -56937, 74426, -220011, -25255, 3097, 273603, -178252, -306228, -132163, -122332, -83381, 218454, 45206, -128246, -96787, -278502, -104359, -20961, -180309, -104557, 73770, 146495, 69327, -273175, 72953, 380259, -355121, -335910, -354293, 165791, -215513, 64463, 33659, -155627, -29591, 223374, 40671, -73884, -326457, -280067, -141419, 21413, -121848, -108863, 71508, -33464, 228598, 96976, 38198, 171925, -284552, 340045, 121157, -45334, 245675, -25734, -75041, -276393, 302568, -129414, -42019, 133706, -334868, -183095, -411270, -161849, 247956, 296375, 224688, -38331, 60548, 203615, -326326, 80835, 288505, 139182, 48495, -154646, 29195, 67287, 187941, -341178, 86293, 3075, 23314, 300897]
15755C00897p8j17667n6813j8600c35986g4904j8937A96335a30379c5448G1046
15743C18321a34486B09930A8675h2695G3162K2219B9745b51112F1260a55114n0251
15732b05365c5550A23618A4414i703q9790j16371H4820a93533I3532a11318L4328
15721g6990k54379a41100B5215a8478l12175B12619a16885A23648c68994e8779
15710a68471O7792C1631a44169G1805j6529c11663a002C22023f9054q0588O314
15699a43328f1113j01922M5358q5802G3028J41103d3583G0884P7896k3449O2663
15688A87994I1481N0994e0438A60636b26900K7977A34333b07625i0479D9151a17675
15676b94387D16978E6979a90542B15034i3554A50072K61157n931j56492q3856
$$ y = [300897, 300819, 183152, 126339, 107739, -335986, -74904, -93841, 196335, -130379, -35448, 71046, 318321, -134486, 209930, 18675, -82695, 73162, 95381, 29745, -251112, 61260, -155114, -205365, -35550, 123618, 14414, -9703, -99493, -215864, 84820, -193533, 93532, -111318, -76990, -331369, -141100, 25215, -18478, -330653, 212619, -116885, 123648, -368994, -58779, -168471, -100679, 31631, -144169, 71805, 55276, -311663, -1002, 322023, -69054, -149642, -143328, -61113, -163035, -117677, -203479, 73028, 214131, -43583, 70884, 148780, 125331, 187994, 91481, 142475, -50438, 160636, -226900, -198923, 134333, -207625, -90479, 49151, -117675, -294387, 416978, 56979, -190542, 215034, -93554, 150072, 411229, 405298, 248806, 164950]
15666A64950M6004a4084k65944A4248b5873D7696J4918c14738c4045o0898j37279
15655b32222i0136j90341f1218j49811B68093b81253k5595A62619A8763a35048
15644A91769n915j6655O4544a42184k42376J77873i4625A24010a46153M9237M5158
15633e1758B19553a69012a9150D0671Q3132J60143c19438d3754k06161B46229
15622A26534b10992B59692c24590F2781c35467a64274A54637a49436H7092K55123
15612C42215B9572i9343F6992J34826D8553a99436O0541G9895C7380C42a36355
15600a60020G031b62433C4643J52083d7543J101l3967l3289j87829b7059k21669
15589b48728k2507J10093e9341A05625i5228A53935c05976H4023R6259c95063
$$ y = [164950, 210954, -14084, -280028, 14248, -25873, 47696, 62614, -314738, -34045, -94943, -232222, -90136, -280477, -61218, -211029, 268093, -281253, -306848, 162619, 18763, -135048, 191769, 185854, 169199, 233743, -142184, -384560, -206687, -94625, 124010, -146153, -96916, -51758, 219553, -169012, -19150, 40671, 123803, 283946, -319438, -43754, -249915, 246229, 126534, -210992, 259692, -324590, 62781, -335467, -164274, 154637, -149436, 87092, 342215, 29572, -99343, 66992, 201818, 48553, -199436, -138895, 79895, 37380, 342, -136355, -160020, 7031, -262433, 34643, 186726, -47543, -46442, -80409, -113698, -301527, -27059, -248728, -271235, -161142, -59341, 105625, -95228, 153935, -305976, 84023, 180282, -395063]
15578G8414a5858j30584o7215D8942N4659b20528R4108M2714k25311e2232A33153
15566f0078A33764i0453j13939A51019P9893M0680a70870b3033F843a80464A63228
15554A00866e9825A04502l2059K44963a35696c7249B0485K42347F7298J05642
15544A72940H3451b50981C44412b9610A82370m7266n5888a26812F1682J52287
15534B13969b4240C3453b44905O2806n8862d6003j0814E4068A0875k161g0723
15522a32325F1473K29168r6518K79493j97768F1241a69600C01047c80085C21101
15511B03297N8307d6772G6680a9465H6412B1690i7787M8268K4716B33474c11373
15499a32216M2196k2236e3640j11380g7360D8686a0640j40257M2884n3907f0390
$$ y = [78414, -15858, -146442, -213657, 48942, 103601, -220528, -126420, -83706, -309017, -52232, 133153, -60078, 133764, -90453, -204392, 151019, 230912, 271592, -170870, -23033, 6843, -180464, 163228, 100866, -59825, 104502, 72443, 317406, -135696, -37249, 20485, 262832, 67298, 172940, 83451, -250981, 344412, -29610, 182370, 135104, 79216, -126812, 61682, 213969, -24240, 33453, -244905, -182099, -240961, -46003, -56817, 54068, 10875, 8714, -70723, -132325, 61473, 290641, 194123, 473616, 275848, 61241, -169600, 301047, -380085, 321101, 203297, 261604, -46772, 76680, -19465, 86412, 21690, -97787, -49519, -24803, 233474, -311373, -132216, -90020, -112256, -53640, -165020, -77360, 48686, -10640, -150897, -108013, -161920, -60390]
15487a32715A09710c4396H5162c3094A46397C2346J76967a7406j90496C10651
15476A9610M4408M0471b97907m1435A41691O890i1165i725j2655H1552c93962
15464A89316i9978n5973C3215a49517B31741b48708a332B17168q9090e8259A06211
15452A60506a49860C6211b98445a42783A65886b03098E2183e590A06396b67952
15441a48999d1165A19606a92633A82301a19060j82821E27631d7724G9229a04246
15430c78376f643A99376a05634c1196B3329L0729K55842A41565F1924c977l83153
15419c87130A97292o5854E5381i2465j47967A01595O2763D62J35852a07273C3733
15407a50292A10777b10655L1030d1647a7084j62764J7783D7654J9283B4257J04801
$$ y = [-132715, 109710, -34396, 85162, -33094, 146397, 32346, 209313, -17406, -207902, 310651, 19610, 64018, 104489, -297907, -339342, 141691, 148581, -91165, -9725, -22380, 81552, -393962, 189316, -99978, -155951, 33215, -149517, 231741, -248708, -1332, 217168, 128078, -58259, 106211, 160506, -149860, 36211, -298445, -142783, 165886, -203098, 52183, -5590, 106396, -267952, -148999, -41165, 119606, -192633, 182301, -119060, -301881, 527631, -47724, 79229, -104246, -378376, -6643, 199376, -105634, -31196, 23329, 54058, 309900, 141565, 61924, -3977, -387130, 197292, 131438, 55381, -92465, -240432, 101595, 164358, 462, 136314, -107273, 33733, -150292, 110777, -210655, -179625, -41647, -17084, -179848, -162065, 47654, 66937, 24257, 129058]
15396A29058L0126d5409I2831a15868A05786a01k0970n843A63285p0968b5276
15384a02006L4541m2745o8808c3087E3156a69558A8037i2586A20510N7722a52500
15372A55781C4165K45809a03253r378F1321h4672A94263b78096b7294A00614i3740
15360h6032B05879d09858h197A40265g3720B24659b38422C0701d2476j27387B24953
15348a16414J9290k85955D3161O344J06489c4067j83271a1219q6699o1616K7183
15337a32351C40753b51676A77700K8944l5327b32295B40862r5985D7515a02381
15326B57898E0231f8620D2787A5273J68599p0795l2880J03225a80443b5278C08637
15314a40515A48214i1981q8317A29340C4596J1047a58621D408K16063Q819k072
$$ y = [129058, 159184, -45409, 92831, -115868, 105786, -101, -21071, -26914, 163285, 92317, -25276, -102006, -67465, -110210, -179018, -33087, 53156, -169558, 18037, -92586, 120510, 178232, -152500, 155781, 34165, 279974, -103253, -112631, 61321, -84672, 194263, -278096, -27294, 100614, -93740, -86032, 205879, -409858, -8197, 140265, -73720, 224659, -238422, 30701, -42476, -169863, 224953, -116414, -97124, -383079, 43161, 49505, 155994, -34067, -217338, -11219, -97918, -159534, -132351, 340753, -251676, 177700, 206644, 171317, -232295, 240862, 144877, 47515, -102381, 257898, 50231, -68620, 42787, 15273, 183872, 113077, 80197, 183422, -180443, -25278, 308637, -140515, 148214, -91981, -180298, 129340, 34596, 45643, -158621, 4408, 220471, 229290, 227218]
15303B27218G4869g326A24667a02071C1580b0541k2769B66235J65282k00946b18788
15291d9986C03683j39736a53704D08951H2201C7600f5381j46426A2975D296b58256
15279a58727k66335B88899b32132C13934r5711C0402a23954A65353a80966A85506
15268A28471h5418A08283K85330A6896L1388O446E972J61334J28900a00962B24862
15256g3678B09610J39381a51972A96893r315J22958N5071M48859j08291P44294
15246A450469o9449k03133L07775C93624j6802j5350d7198C10680b87877E9933
15235h9209B08429a25413A16532K4817a31062B53320j09623n4301N0824C057a95578
15223A11656J4696Q3253c7352j3614m7727C97126A65425Q3112c3960D51207c18962
$$ y = [227218, 74869, -7326, 124667, -102071, 31580, -20541, -43310, 266235, 431517, 230571, -218788, -49986, 303683, 163947, -153704, 408951, 82201, 37600, -65381, -211807, 12975, 4296, -258256, -158727, -425062, 288899, -232132, 313934, 218223, 30402, -123954, 165353, -180966, 185506, 128471, -85418, 108283, 393613, 16896, 48284, 54730, 5972, 167306, 296206, -100962, 224862, -73678, 209610, 348991, -151972, 196893, 187578, 310536, 365607, 814466, 706175, 1450469, 1381020, 1177887, 1485662, 393624, 376822, 361472, -47198, 310680, -287877, 59933, -89209, 208429, -125413, 116532, 141349, -131062, 253320, 143697, 89396, 140220, 3057, -195578, 111656, 126352, 209605, -37352, -50966, -98693, 397126, 165425, 248537, -33960, 451207, -318962]
15211a42899A74502H1191P3363O3816d12002C61909I5514J48898c50916B12081
15200B15675J05997F585e5393q6710C3336b89916I7703K911K22103a42789A43453
15188A9900c07344B77628H7980Q3251D8731L5802g6954I5030d7270q6305D6625
15176b03534I6070f9696B68006p114b3625H6054h311k73687A13046j3121l6382
15165F3543a22960k34611B43980B5521a8903A97298h3126c6770A59760b19019
15154C64755e6197l47281D69335h6062G8690a42534B67034A02558b47798f7233
15143b5368C81422k3796A78103D7542J78442H1115J6185a18381B9093R8536d6076
15131A68119e6208k85818d1875A34308n2006K11384J9225j13785q6412c2521H7040
$$ y = [-142899, 174502, 81191, 154554, 218370, -412002, 361909, 95514, 244412, -350916, 212081, 215675, 321672, 6585, -55393, -142103, 33336, -289916, 97703, 100614, 322717, -142789, 143453, 19900, -307344, 277628, 87980, 171231, 48731, 84533, -76954, 95030, -47270, -133575, 46625, -203534, 96070, -69696, 268006, 260892, -23625, 86054, -8311, -281998, 113046, 99925, 63543, -122960, -357571, 243980, 25521, -18903, 197298, -83126, -36770, 159760, -219019, 364755, -56197, -403478, 469335, -86062, 78690, -142534, 267034, 102558, -247798, -67233, -25368, 381422, 357626, 178103, 47542, 225984, 81115, 97300, -118381, 29093, 127629, -46076, 168119, -56208, -342026, -41875, 134308, 82302, 293686, 312911, 199126, 112714, -32521, 87040]
15119B00644l1357l1403e6720A01604d3750B34080J21598L5078A06441l9873K32613
15108B99181E1704K45446N4143A54830J98571a714I8280J13434J88675k5302g9752
15096A80454L42837k20610J8711j55132b0867D81592j28152B3994h6823a2380
15085A90757l9650h1590A78985n8981d9490o5781H254J15019a52540d0790C29165
15073B07367E5989J15656D3229J41366k2895a00981F4373k247a753B25667J77145
15062D02812J00277A26141J87386h5896b3940H4665J24378g2115I0408M3450L13371
15051D47229B0132A116M11730B1565K46741A26149a56987A31104M7018J35254
15041C13376h8072B72290K72968k17899j33027K05802p7834P3001A88345H6731
$$ y = [200644, 169287, 137884, -56720, 101604, -43750, 234080, 355678, 390756, 106441, 66568, 299181, 51704, 297150, 351293, 154830, 353401, -1714, 98280, 211714, 400389, 375087, -79752, 180454, 523291, 302681, 321392, 166260, -20867, 481592, 353440, 23994, -86823, -12380, 190757, 151107, -81590, 178985, 120004, -49490, -115271, 8254, 123273, -152540, -40790, 329165, 207367, 55989, 171645, 43229, 184595, 161700, -100981, 64373, 62126, -1753, 225667, 402812, 503089, 126141, 313527, -85896, -23940, 84665, 209043, -72115, 90408, 133858, 447229, 20132, 1116, 412846, 21565, 268306, 126149, -156987, 131104, 178122, 313376, -88072, 272290, 545258, 327359, 194332, 400134, 322300, 395301, 188345, 86731]
15030C92659A88270f8910C98829A96674J2541b2723A01850r564O2155d6740B95114
15018B08328d4308H3547J41880J44383n6159j9142E5428K06255G1584j0698J57764
15007B18650J63990n2235A18599K17986b1265k01427D57012J87980k63739r9294
14997B81959J8007C7797J90923F7687J95822J16491a15152d3275k50420B54858
14986G5815a9862B89727A37647M5731M8512n7917K37488A36930J8212K35735o6216
14975C24661i9781C99342A02012c5714j4484B30631J17831j6625A23733l3634
14965I0099r344O2746n384O9516B2571a40507C04274G7794i2954k6424E1963K25482
14953B77445j26138J19381N7823N6927Q0394k13556j11859F7904L22667o6745
$$ y = [392659, 188270, -68910, 398829, 196674, 209215, -22723, 101850, 92286, 154441, -46740, 295114, 208328, -44308, 83547, 225427, 369810, 313651, 294509, 55428, 261683, 71584, 60886, 218650, 382640, 330405, 118599, 336585, -21265, -222692, 457012, 644992, 381253, 281959, 299966, 37797, 228720, 67687, 263509, 380000, -115152, -43275, -293695, 254858, 75815, -19862, 289727, 137647, 183378, 231890, 173973, 411461, 136930, 155142, 390877, 324661, -99781, 399342, 102012, -35714, -50198, 230631, 348462, 331837, 123733, 90099, 80755, 143501, 138117, 207633, 22571, -140507, 304274, 77794, -92954, -119378, 51963, 277445, 151307, 270688, 328511, 385438, 465832, 252276, 140417, 67904, 390571, 323826]
14943C23826K15841B58514A06968M01356A42159L54021A54007L23892j84014m2396
14933B51489A18376K61588j89657J82087A09976J42068K29642k01809K0174q7367
14923B12684K00250A98178o8938L16045m8708l0534l4113A44777L5126K39304
14913D19207j63777M425j05192A5897J70499J1146a8488B40067L5670j21728Q4997
14902B39006J30939B6370K84542J8602N3459A22954B3993K60147q0824j544J53110
14891C54882A56462J27716K18872q4839j99275B160M60919P2219k30171A25069
14880B98826J744n7192A15671L9752J14481J84201j58221K06538q115K1826J65338
14869F81471k92919m3854K66794p6141j28784J22559k50969J47103J85892B67724
$$ y = [323826, 539667, 258514, 106968, 508324, 142159, 496180, 154007, 477899, 293885, 251489, 118376, 379964, 190307, 372394, 109976, 252044, 481686, 279877, 300051, 212684, 412934, 198178, 129240, 445285, 396577, 366043, 331930, 144777, 179903, 419207, 255430, 259855, 154663, 15897, 186396, 197542, -18488, 240067, 275737, 154009, 239006, 369945, 26370, 310912, 329514, 382973, 122954, 23993, 284140, 203316, 201772, 354882, 156462, 284178, 503050, 418211, 218936, 2160, 463079, 535298, 305127, 125069, 298826, 300570, 243378, 115671, 155423, 269904, 454105, 295884, 502422, 494307, 516133, 681471, 388552, 344698, 611492, 535351, 406567, 529126, 278157, 425260, 611152, 267724]
14858C47608J16268o3869K68163O2413A94469J96913L10461J81364C16165j42974
14848A73191O20057j42717j85952j2188J17443j87975K08683B17782M3983R2664
14838C54429q1238J83762j84238M37724K2824A54204M10096q5444j7982Q3055
14828E43929B29839J75480n6028J16041j33499o4571r5002M89529C09414K03131
14818E12545P2080J3771k93794K95820p780K0219p0268j10269j6952J03596J28130
14807F47098k86837Q3208J53381J91653k69623K39502j2369k17641R7445j78859
14797D46958R1112Q2611j27757K36940j83426M9302j21708P0511J8303j92845
14787C70001k3482L96859l48961M0025J28229B39934O45259C92972R9324j12972
$$ y = [347608, 463876, 400007, 668170, 730583, 194469, 391382, 701843, 883207, 316165, 173191, 793248, 650531, 464579, 452391, 569834, 381859, 590542, 217782, 261765, 354429, 273191, 456953, 272715, 710439, 733263, 154204, 564300, 478856, 460874, 543929, 229839, 405319, 349291, 465332, 331833, 267262, 172260, 661789, 309414, 512545, 584625, 598396, 304602, 600422, 592642, 612861, 542593, 432324, 415372, 518968, 647098, 360261, 443469, 596850, 788503, 518880, 758382, 746013, 528372, 625817, 446958, 538070, 620681, 492924, 729864, 546438, 595740, 474032, 544543, 562846, 370001, 346519, 743378, 394417, 434442, 562671, 239934, 885193, 392972, 492296, 379324]
14777C79324M31306k4909j70714p8m6007r4170N1495K02423J10003j46071l36585
14766C56017L21280k70489L58430j08186N3443J26588m00589L93151r0171J2987
14756G52461k06404L31211q6789l53567J35601m2695O738J56717m3155R0464r7775
14745F42807j01198J95527o1121J85486q0594C84163K26708N0489K04972k17080
14735F49252K10082Q5446M3225j91859k0066o6963j6718L8383K94137j20734n3459
14724H50726j66706j59867M40066P9282l44930j42930L02598l7755j56324K1396
14714F85556L0882k95661M43022j57554K76822D48631L34353P4471p3688K54149
14704A037916k98518o7964N2429J68840K25901k38928j63008J58160k38129K8991
$$ y = [379324, 810630, 785721, 615007, 614929, 568922, 474752, 526247, 728670, 838673, 692602, 356017, 677297, 406808, 765238, 657052, 710495, 837083, 436494, 829645, 739474, 752461, 546057, 877268, 790479, 436912, 572513, 529818, 536556, 693273, 650118, 740582, 642807, 541609, 737136, 676015, 861501, 780907, 384163, 610871, 661360, 866332, 649252, 859334, 944780, 988005, 796146, 776080, 709117, 692399, 730782, 1024919, 904185, 850726, 684020, 524153, 964219, 1043501, 698571, 555641, 858239, 820484, 664160, 685556, 716438, 420777, 863799, 706245, 983067, 448631, 782984, 857455, 783767, 1037916, 739398, 671434, 723863, 892703, 1118604, 879676, 716668, 874828, 636699, 665690]
14694F65690L22574n8034n2880n1401q4123J98280J00218n9735k6255p102J93042
14683A140274j71223J58579k21309K81395k56713j7203l04640M57423j31675J41114
14673A076022J56662o6343l10831K10984k48407L24107p7431o4799Q6591K06241
14663A292796k28565n5492K59500p4037J57988m06993M5000k28861L77619j14483
14653A024472K10821k87588L51539l30687J50556j93230K79176J15083k37024
14644A083118M3219R2954M03464l44882l77693N31208k73802j17465O11285l95950
14634A255456K33239o65838N16387J10607j89757J26603j20013L55323j39560
14625A482447J92854r7690m20336L71876o1250J02970k71411J80458j14342J91233
$$ y = [665690, 988264, 930230, 877350, 825949, 741826, 940106, 1040324, 980589, 954334, 947232, 1140274, 969051, 1127630, 906321, 1187716, 931003, 913800, 609160, 1066583, 934908, 1076022, 1232684, 1166341, 855510, 1066494, 818087, 1142194, 1064763, 999964, 1086555, 1292796, 1064231, 1008739, 1268239, 1194202, 1352190, 945197, 990197, 761336, 1138955, 1024472, 1235293, 947705, 1299244, 968557, 1119113, 925883, 1205059, 1320142, 1083118, 1126337, 1219291, 1622755, 1277873, 900180, 1431388, 1157586, 1040121, 1651406, 1255456, 1488695, 822857, 1339244, 1449851, 1260094, 1386697, 1266684, 1622007, 1482447, 1675301, 1577611, 1157275, 1529151, 1467901, 1570871, 1299460, 1479918, 1365576, 1556809]
14615A556809n0634j64482K67788l96903R2200K17149k78015M64627l87091K82074
14605A603522k03847J78115l2023K76221j54790k21943K5526J14072L11209l37987
14595A558075K26628k22689K89091J19068l99122k3003N80656m23412K58362l54449
14585A609205K62507O7866L05640l24277J56848j64532P7954M2300j74194K56195
14575B115512j03374J12830k55537J34209L59689R4883j57123k10173J40698J53187
14565B384801J36352j75258K31451L2469j44156J23923J36924J57631k3665J33841
14555B994313M27418L77120k99370Q98995R04116J685571L261966N375585O061929
14546B1687643Q851006J1720072j9636770j0894988n598952k607105j126001M1702
$$ y = [1556809, 1506175, 1341693, 1609481, 1212578, 1304778, 1521927, 1243912, 1708539, 1321448, 1603522, 1399675, 1577790, 1545767, 1821988, 1667198, 1445255, 1470781, 1584853, 1896062, 1558075, 1784703, 1562014, 1851105, 1970173, 1571051, 1548048, 2128704, 1705292, 1963654, 1609205, 1871712, 1939578, 2245218, 1920941, 2077789, 1913257, 1991211, 2033511, 1859317, 2115512, 2012138, 2124968, 1869431, 2003640, 2363329, 2458212, 2301089, 2090916, 2231614, 2384801, 2521153, 2345895, 2577346, 2609815, 2465659, 2589582, 2726506, 2884137, 2860472, 2994313, 3421731, 3798851, 3499481, 4398476, 5302592, 6988163, 10250129, 15625714, 21687643, 30538649, 42258721, 22621951, 11726963, 6128011, 3520906, 2394905, 2436607]
14538B436607M3054k46051j27192j55776K8846L89133n01653L03232m0034J55125
14528B285291k07469K47088O1621j05351K46232O6280m95755J63953K55524r3061
14518B424353K12826L3127K6146J07356k57971N2250J51871R9856j7736K84220
14508C116298k64527n4845J36789J07143k07917L81205j78330K2525L15541l00825
14498C073057L57098l98322J26584J25225k21260K90101r9974K07538Q6106J05070
14488C651223j03761j12419N729P4653K81469j47238J52605J81827l23807J79492
14478C839773K32619r1375M20303l08330p9610K59527q5545r8050K64114J44785
14468D498211p7343J38129k26677N04229j40766J20042r9758j00738J50555q6542
$$ y = [2436607, 2479661, 2233610, 2106418, 1950642, 1979488, 2368621, 1866968, 2170200, 2130166, 2285291, 2077822, 2324910, 2386531, 2281180, 2527412, 2593692, 2097937, 2261890, 2517414, 2424353, 2637179, 2670306, 2696452, 2803808, 2545837, 2598087, 2749958, 2849814, 2832078, 3116298, 2851771, 2796926, 2933715, 3040858, 2832941, 3214146, 3035816, 3058341, 3373882, 3073057, 3430155, 3031833, 3158417, 3283642, 3062382, 3352483, 3252509, 3460047, 3546153, 3651223, 3547462, 3435043, 3440772, 3515425, 3796894, 3649656, 3802261, 3984088, 3660281, 3839773, 4072392, 3981017, 4401320, 4092990, 4013380, 4272907, 4187362, 4089312, 4353426, 4498211, 4420868, 4558997, 4332320, 4836549, 4695783, 4815825, 4716067, 4615329, 4765884, 4679342]
14458D679342J08715M89127j78158k86424M59789j01526M2516L11650l64012M37855
14448E598874l72984L30646J26175J65124j47266k4929J62861J54104J12236K76012
14438F380853k74273N18491l98233L78663J62275j38611Q9556j12734L24225K4187
14428F954399J00398l6351K7901K60969K84540k07446J06691L07105q7165K3573
14418G734614O16525l22871L71318J13033n7951K02224R6242J92720J63702R6615
14408I206171l616J02900M95947L51035j15990M064L53210k39194M17820J32424
14398A0704771l0858L27181L75770J82300O7661M3244N00774K85660j0067p6208
14388A2370228O32066J02613K87784j22982P13234Q2120L83169K03018J24869
$$ y = [4679342, 4788057, 5277184, 5099026, 4812602, 5272391, 5170865, 5213381, 5525031, 5161019, 5598874, 5225890, 5556536, 5682711, 5847835, 5700569, 5675640, 5838501, 5992605, 6104841, 6380853, 6106580, 6625071, 6226838, 6605501, 6767776, 6629165, 6718721, 6605987, 6930212, 6954399, 7054797, 7018446, 7046347, 7307316, 7591856, 7384410, 7491101, 7798206, 7711041, 7734614, 8351139, 8028268, 8399586, 8512619, 8454668, 8656892, 8753134, 8945854, 9109556, 9206171, 9202555, 9305455, 9801402, 10152437, 10036447, 10040511, 10393721, 10154527, 10572347, 10704771, 10673913, 11001094, 11376864, 11559164, 11626825, 11670069, 12170843, 12456503, 12446436, 12370228, 13002294, 13104907, 13392691, 13269709, 13982943, 14065063, 14448232, 14651250, 14776119]
14379A4776119K85937N54781M3275K65105M91155K4226N39367L3330K34718L83945
14369A7631958J044842J09558K76202M3244P91205P518N69157L00826Q70532O64389
14359B2309431M02610M67874L88543P48281M67682M20945P14309N24775O49046
14350B7093496N87834P63953J034823N04773Q51737M96510P74864Q28384J069609
14341C4005983J005096R01545R38351J135147Q13499J149205J375980Q65573J392890
14332D3583269J443092J497208J394041J052256J943679J239918J896575J668560
14324E5718598J995556J716427K045542K142666K356657K415108K576122K697125
14316G3663801K817250K769170L387746L155421L318856L601968M304123L675978
$$ y = [14776119, 15062056, 15616837, 15660112, 15925217, 16416372, 16440598, 16979965, 17013295, 17248013, 17631958, 18676800, 18786358, 19062560, 19105804, 19897009, 19904527, 20473684, 20774510, 21645042, 22309431, 22712041, 23179915, 23568458, 24316739, 24784421, 25205366, 25919675, 26444450, 27093496, 27681330, 28445283, 29480106, 29984879, 30836616, 31333126, 32107990, 32936374, 34005983, 35011079, 35912624, 36850975, 37986122, 38799621, 39948826, 41324806, 42190379, 43583269, 45026361, 46523569, 47917610, 48969866, 50913545, 52153463, 54050038, 55718598, 57714154, 59430581, 61476123, 63618789, 65975446, 68390554, 70966676, 73663801, 76481051, 79250221, 82637967, 85793388, 89112244, 92714212, 97018335, 100694313]
14308A00694313M417518M593230M900406M925757N503826N532113O106985O034550
14300A42708698O434712P058132P632552P984562Q330719Q894276R571488R906963
14292B08522102J0847083J1046404J1423723J2069894J2989723J3189497J4085197
14285B94173623J4451461J4630011J4798240J5435824J5348781J5256840J4594873
14278C98689653J4616592J3028588J2246799R157127M460066l70016k551933j145826
14270D48131050M643389M829485j974769m064708n141710p740682r956696j1867354
14262D16858005j3082613j3666104j3495203j5342126j5496305j5428757j4952399
14255C15394498j5053766j3930112j3120661j3731561j2600697j2219085j1619666
$$ y = [100694313, 105111831, 109705061, 114605467, 119531224, 125035050, 130567163, 136674148, 142708698, 149143410, 156201542, 163834094, 171818656, 180149375, 189043651, 198615139, 208522102, 219369185, 230415589, 241839312, 253909206, 266898929, 280088426, 294173623, 308625084, 323255095, 338053335, 353489159, 368837940, 384094780, 398689653, 413306245, 426334833, 438581632, 447738759, 452198825, 451828809, 449276876, 448131050, 452774439, 457603924, 455629155, 451564447, 446422737, 438682055, 428725359, 416858005, 403775392, 390109288, 376614085, 361271959, 345775654, 330346897, 315394498, 300340732, 286410620, 273289959, 259558398, 246957701, 234738616, 223118950]
14248B23118950j0620816j0581047r695721r240405q550525q150831p948080p319016
14240A51012509o831377o646675n800381n488430n691262n240994m622474m612580
14232A06078336m596174l826830m114128l421350l544677l000610l273008l269355
14224G7032204k910397k419101k570990k334904k442999j660235k576258j626253
14216E8491067j940370k100469j467694j269306j889107j647252j304584j444026
14208D5428259r03788j147636q18138j821081j010275j166518j421058m63106
14200C6676659q41185j026750j036213o25687j074582q23567n73099q48221p38956
14191B9088399o16247j053751k49778q51701o60163l03598j089082l26674k22936
$$ y = [223118950, 212498134, 201917087, 192221366, 182980961, 174430436, 166279605, 158331525, 151012509, 144181132, 137534457, 131734076, 126245646, 120554384, 115313390, 110690916, 106078336, 101482162, 97655332, 93541204, 90119854, 86575177, 83574567, 80301559, 77032204, 74121807, 71702706, 69131716, 66796812, 64353813, 62693578, 60117320, 58491067, 56550697, 54450228, 52982534, 51713228, 49824121, 48176869, 46872285, 45428259, 44524471, 43376835, 42558697, 40737616, 39727341, 38560823, 37139765, 36676659, 35835474, 34808724, 33772511, 33146824, 32072242, 31248675, 30675576, 29827355, 29088399, 28472152, 27418401, 27168623, 26316922, 25656759, 25353161, 24264079, 23937405, 23714469]
14182B3714469n79326p99537k95845m91599q28324j40726m46236j10687k14965
14173A9807224m88148k68367n75310l24811k39811l57184n49502l53211k48840
14164A6402040k93571j07295m42851n52354p3801j46982j99964k88364j30808
14155A4166050m74882R236l16456k55311j68954k91849m64834J2801j69065p6335
14145A1970401l29862J12481m07143m10790K23552j4841p31417n9989n07247O13510
14135A0458655l90388o5223k39751k73859k2456K95380l84032l39186m0342J3746
14125I012544j74183k66814J28264k56363P1257j48790m68055J01079j6566k27041
14115G755332J72526m13578M7080l13628m044l0915J11710j17262O6k77072k73809
$$ y = [23714469, 23135143, 22335606, 22039761, 21548162, 20719838, 20579112, 20132876, 20022189, 19807224, 19319076, 19050709, 18475399, 18150588, 17910777, 17553593, 17004091, 16650880, 16402040, 16108469, 16001174, 15558323, 15005969, 14932168, 14785186, 14585222, 14296858, 14166050, 13691168, 13700404, 13383948, 13128637, 12959683, 12667834, 12203000, 12215801, 12046736, 11970401, 11640539, 11753020, 11345877, 10935087, 11158639, 11143798, 10412381, 10352392, 9845145, 10458655, 10068267, 10003044, 9763293, 9489434, 9466978, 9762358, 9378326, 9039140, 8998798, 9012544, 8838361, 8571547, 8699811, 8443448, 8514705, 8365915, 7897860, 7998939, 7982373, 7755332, 7927858, 7514280, 7561360, 7247732, 7243688, 7212773, 7324483, 7207221, 7207287, 6930215, 6656406]
14104F656406K58349p71009O16928l83422R5430k72998p7279J57231j66469j00493
14094F012674j74479k41279J57359k12165L70748o09134L55409l98918M5469o6692
14084E238992R222p3115J76411o79688J20778K11462j08346l9629j51611L04534
14074E009010m07212L7916J19418k60822N0816q6426j03467J77886j71256J696
14064D367559k9695j71555Q205j744J119L7191k6597l45641J58724J0524j05224
14053C902866j7083J1660K57900l94849j24570J58019l8079j75470P3495l18288
14043C335601K96524j86264k30338J66160k28951K69291K34375m13610J18325
14034C361113k67118m2115J38062J07956j72490J40977o8967j29984l61242K85508
$$ y = [6656406, 6914755, 6143746, 6760674, 6377252, 6472682, 6199684, 6122405, 6279636, 6113167, 6012674, 5838195, 5596916, 5754275, 5542110, 5912858, 5303724, 5659133, 5260215, 5305684, 5238992, 5248214, 5175099, 5351510, 4671822, 4792600, 5004062, 4895716, 4856087, 4704476, 5009010, 4601798, 4639714, 4759132, 4498310, 4549126, 4462700, 4359233, 4537119, 4365863, 4367559, 4337864, 4166309, 4174514, 4172770, 4173889, 4211080, 4184483, 3838842, 3997566, 4008090, 3902866, 3885783, 3897443, 4155343, 3760494, 3635924, 3793943, 3755864, 3580394, 3653889, 3335601, 3632125, 3445861, 3215523, 3381683, 3152732, 3422023, 3656398, 3242788, 3361113, 3093995, 3051880, 3189942, 3297898, 3125408, 3266385, 3197418, 3067434, 2706192, 2991700]
14024B991700J14528n31940L36019K19713k90228N9785j36230O5862m204L67461
14014C192466n00005j22133J91284l26675R2082k48320L8919K76632J52416o81818
14004B064848J62325o1443K99518j01372k97140K86276Q6431j51243l11220J25306
13994B102286J4064p8905K09090m968J112687K693427M626043N657832Q939971
13985B5271527J6467654j3842277j3021451n873646k509662j426733q73465m05959
13977C785988m22021j76024j88879p0616j2519j35059K08238l23546J4078m12870
13967B266770N48592l39257j02581j06173L04940k71667k57096J12494j15725
13958B040297K3592r4559J1372J77942J11490n8832r5813J01177J02971m04534
$$ y = [2991700, 3106228, 2574288, 2910307, 3130020, 2839792, 2899577, 2763347, 2829209, 2825005, 3192466, 2692461, 2570328, 2761612, 2434937, 2527019, 2278699, 2317618, 2594250, 2746666, 2064848, 2227173, 2165730, 2465248, 2363876, 2066736, 2353012, 2439443, 2288200, 1976980, 2102286, 2116350, 2037445, 2246535, 2241567, 3354254, 6047681, 10673724, 16331556, 25271527, 41739181, 27896904, 14875453, 9001807, 6492145, 5065412, 4191947, 3785988, 3363967, 3187943, 2999064, 2928448, 2915929, 2780870, 2989108, 2665562, 2679640, 2266770, 2815362, 2476105, 2373524, 2267351, 2572291, 2300624, 2043528, 2156022, 2040297, 2063889, 1969330, 1980702, 2158644, 2270134, 2211302, 2115489, 2216666, 2319637, 1915103]
13948A915103k06582J38125j25113M20545k60280J09241j19822l25131M86842
13939B032928L5346l53000K26626p4674K2074l47855N10496k69987J58268l90866
13929A549356L49798L0757j73544J7400j80963r2763L5888j42856K36419k21366
13919A408126J08786k312j24509o256K06707k10696J19906j43106K01556k59212
13909A298990M3653l6024L54049j04469O9837l98497q2805K26502K8338J11121
13899A510695l8918j08878K82956l88624j40073K14381k44536K88085o8446j3587
13889A293055O740J21705k57475K19354l06057K86133j31674N3249q1895l5780
13879A167355o7282J01045J48426J22175l23093M7292J43536k35786k20440O22400
$$ y = [1915103, 1708521, 1846646, 1721533, 2142078, 1881798, 1991039, 1871217, 1546086, 2032928, 2068274, 1715274, 1941900, 1867226, 1889300, 1541445, 2051941, 1781954, 1940222, 1549356, 1899154, 1929911, 1756367, 1773767, 1592804, 1500041, 1535929, 1393073, 1629492, 1408126, 1516912, 1514600, 1390091, 1383835, 1590542, 1379846, 1499752, 1356646, 1558202, 1298990, 1342643, 1306619, 1660668, 1556199, 1626036, 1227539, 1144734, 1371236, 1399574, 1510695, 1471777, 1362899, 1645855, 1257231, 1117158, 1331539, 1087003, 1375088, 1306642, 1293055, 1299795, 1421500, 1164025, 1383379, 1077322, 1363455, 1231781, 1285030, 1203135, 1167355, 1100073, 1201118, 1349544, 1471719, 1148626, 1195918, 1339454, 1103668, 883228, 1505628]
13869A505628l73312J15413p8458L2914L3642O7459o2449k09691j26749O1861
13859I66258K25743j65519K2496p3554J29135n7474o2740k3913N1051j00666L20827
13848A231644l66745M27128m51171L15248j26740l1072o0110r0333L11316l26779
13838H32386M44297j12731m28732L60209L6804j59730k58959N66476l53079K20862
13828A147803k14424k87451L85991P7468Q447p3577m61951M46966l82703J57467
13818H04036K9988K30101j08584R1313N158m18643q0928J34656R9746K18971n4481
13807I51333q8693j56397J13171j23820K10286l33J01667D63319N39799C52800
13796H25910R3271J77736j43925j34348o335J00258j11142L0802l71508L90452
$$ y = [1505628, 1132316, 1247729, 1169271, 1202185, 1235827, 1303286, 1240837, 1031146, 904397, 966258, 1192001, 1026482, 1048978, 975424, 1104559, 1047085, 984345, 960432, 1011483, 910817, 1231644, 864899, 1292027, 840856, 1156104, 1029364, 998292, 938182, 847849, 1159165, 832386, 1276683, 1163952, 735220, 1095429, 1132233, 972503, 713544, 1280020, 926941, 1147803, 933379, 645928, 1031919, 1109387, 1117834, 1044257, 582306, 1029272, 646569, 804036, 834024, 1064125, 955541, 1046854, 1052012, 633369, 552441, 687097, 786843, 1005814, 951333, 862640, 706243, 819414, 695594, 905880, 905547, 1007214, 463319, 1003118, 352800, 825910, 919181, 1096917, 952992, 818644, 812309, 912567, 801425, 832227, 460719, 851171]
13786H51171j56318P4828L3332j01334M30291p1911l57640j28430L17757j98460
13776F93286k23633O13447k13770J24592k96924J34917Q7454j22098M648k330
13766G99589n42J9081K66433E26263M44456p0062C92131M21672k6879k42566l5912
13755E08446j23651L45228r8765J80043j32185o7554Q4331N092n4760L10129j60528
13744G95826J73367l94357K05461r096j01712k74254K59301K25588k95050l356
13734E81718M5666K6430j25090l9840N15004n01573O9311O3000k81454M89286
13724H42458k44371N7902k64262L26680k85046L56377l20789K4318K93495k4740
13714G62022B69991O33755B02479N09736j23772k8726k6898q9857L06759l25355
$$ y = [851171, 694853, 769681, 803013, 701679, 1131970, 1060059, 702419, 573989, 891746, 693286, 469653, 1083100, 869330, 993922, 696998, 831915, 919369, 797271, 801919, 799589, 799047, 818128, 1084561, 526263, 970719, 900657, 392131, 813803, 786924, 544358, 508446, 384795, 730023, 631258, 811301, 679116, 611562, 695893, 700985, 646225, 956354, 795826, 969193, 574836, 780297, 771201, 669489, 395235, 654536, 880124, 585074, 581718, 627384, 653814, 528724, 488884, 1003888, 502315, 571626, 634626, 353172, 842458, 598087, 655989, 391727, 718407, 433361, 789738, 468949, 493267, 786762, 762022, 269991, 903746, 202479, 712215, 588443, 559717, 532819, 442962, 749721, 424366]
13704D24366J11847r3656j37092R5400N961K68731l9293k08830K10364j20534
13694E17264K49918j38873B61165M07572p4774J45151l13102m8451O8553R5363
13684E41477J81893J34154r741C81839L7950K7632p2160J96321r0018R1564j08228
13673D64900o1999L33443k33453K7512B15277j00132K52040K20183J52745C11386
13662C95520J5536m1096l3641n3360L28358M5133B80702K28133J27628j32611
13652E03852J8322n5394A60397L99027K84876l89767l7475M5542K24777C24258
13641E37917n5256P2774B22368K14601p9011J74607l632o8156J74068N672j65228
13630D75289j63128A44953J70519K89692j68950r3398p0407J08766Q1944J62697
$$ y = [424366, 536213, 442557, 305465, 400865, 406826, 675557, 636264, 427434, 637798, 517264, 767182, 628309, 261165, 668737, 593963, 739114, 426012, 377561, 446114, 541477, 723370, 857524, 847783, 381839, 419789, 447421, 375261, 571582, 481564, 573128, 464900, 402901, 736344, 502891, 530403, 215277, 115145, 367185, 587368, 740113, 311386, 395520, 411056, 369960, 336319, 282959, 611317, 656450, 280702, 508835, 636463, 503852, 522174, 466780, 160397, 559424, 844300, 454533, 417058, 462600, 687377, 324258, 537917, 482661, 555435, 222368, 436969, 357958, 532565, 528933, 460777, 634845, 640517, 475289, 312161, 144953, 315472, 605164, 436214, 342816, 272409, 381175, 463119, 625816]
13620F25816B42592I7530K66842j42155M98313j19391k91216J32136K0530J2597
13610D75186A85736M1849K17005O9972G7816M62431j35293a9665D85140j62653
13600C22487K98980p8718n5095j80859G4091O8541K69710j2062m5272O4101K17722
13589F36831E2699K46672j2376J16860J12472j4050j41325n7178l3486L44136
13579F14424k6017j91397Q1324G2682K10982J41506q32A12411K07154J58982j96901
13568B81646K3055p4932L6063N9705j6268H7335L07796q3561j09047h2633B60924
13556E79493B85764J0549M677J09635N0080m6093A83417J86228R2904A37366L16461
13545D53827j21514q6789M58664k64983J70376j59814j29592q2089J25173J29602
$$ y = [625816, 242592, 97530, 364372, 222217, 720530, 601139, 309923, 442059, 462589, 475186, 185736, 227585, 444590, 514562, 77816, 540247, 404954, -19665, 485140, 322487, 621467, 542749, 487654, 306795, 74091, 142632, 412342, 400280, 355008, 419109, 636831, 52699, 299371, 286995, 403855, 516327, 502277, 360952, 303774, 270288, 614424, 588407, 397010, 478334, 72682, 283664, 425170, 424338, 112411, 319565, 478547, 281646, 304701, 229769, 265832, 325537, 309269, 87335, 395131, 311570, 202523, -82633, 260924, 579493, 285764, 296313, 300990, 410625, 460705, 414612, 183417, 369645, 462549, 137366, 453827, 332313, 245524, 704188, 439205, 609581, 449767, 320175, 238086, 363259, 492861]
13535D92861A93882O4425l4638L4568k9309O5276A3965J44118e2987C63361E7378
13523D17017n3939A11526J07227j9009q699L09191A18043L00821p6217d1781B35727
13511C30841n2489K24452G7482M6601h6113C84978L763Q9183j9190k14186K45320
13500D89868J54249j24840E9252K48872D1924J16756L88803j02616D4610P9674
13490A24284j3043a94981C44833F4770j8649R9603K17528M8697A61818J29437
13480B91255m4124J34106l400j77445K07055n7941k4963A56908N1235J34517A18877
13468A06197b98386B89852H0858K70609K14298k14787E1253J31990p4859j3469
13458I4915J36633k4298O2292e2556r8923I0457i9472D1232M79786A09256J33269
$$ y = [492861, 193882, 258307, 223669, 258237, 228928, 294204, 13965, 158083, -52987, 363361, 57378, 417017, 363078, 111526, 218753, 199744, 191045, 500236, 118043, 418864, 342647, -41781, 235727, 330841, 278352, 502804, 77482, 124083, -86113, 384978, 388741, 477924, 458734, 244548, 489868, 644117, 519277, 59252, 308124, 41924, 158680, 547483, 444867, 44610, 124284, 111241, -194981, 344833, 64770, 46121, 145724, 363252, 411949, 161818, 291255, 247131, 381237, 377837, 200392, 407447, 349506, 324543, 156908, 208143, 342660, 118877, 106197, -298386, 289852, 80858, 351467, 565765, 350978, 51253, 183243, 108384, 94915, 231548, 207250, 269542, -52556, -151479, 90457, -99472, 41232, 521018, 109256, 242525]
13447B42525K1455p5214N10j348L71171r1986k20869p2692K47333A32274Q8823
13436B21097J70062O3618B21853j4539J0007R3556j15441b8862A91815J66234
13426C58049r2072M2500P797j05904P0215A26132o1263e7015C35388J17368A0664
13414C9633K90264A39191a36615e3034C3572K69148P3519p9009R1377A17444J71825
13403B89269G8755K72523E4107K27050J45192A94114n4313C5450M452N91455k37163
13392C94194H8106L6352K16812N7415a31169C51932a0856B31712r1847J55434
13382B95299A40918R7516j01543b6854G1738P2803N7822G509J30669J06379K28060
13371D72617H7039P1768N8210N5743M4282h9807D17261A04955C3050L88016j46855
$$ y = [242525, 263980, 188766, 189276, 187928, 559099, 467113, 246244, 173552, 420885, 132274, 221097, 391159, 454777, 221853, 207314, 217321, 310877, 195436, -28862, 191815, 358049, 265977, 308477, 316274, 210370, 280585, 126132, 64869, -57015, 335388, 452756, 10664, 39633, 329897, 139191, -136615, -53034, 33572, 302720, 376239, 297230, 388607, 117444, 289269, 78755, 351278, 54107, 281157, 426349, 194114, 139801, 35450, 39902, 631357, 394194, 88106, 124458, 341270, 398685, -131169, 351932, -10856, 231712, 139865, 295299, 140918, 238434, 136891, -26854, 71738, 144541, 202363, 7509, 138178, 244557, 472617, 87039, 158807, 217017, 272760, 317042, -89807, 417261, 104955, 33050, 421066, 274211]
13360B74211n9325G3986L57239A30701K7402J95367A61156J92227R23f6563I6766
13348D76839c4532C08895A50346f1893C46313o3705C9618L56209j06115H5415
13337B14322L9254A14176J02541J66624j56475K5795j08838O3521J83162A87125
13326A20980O7243N0458L02468j73260A18452e1671A5713K28009J07755L1017
13316C82494q0581A50276b9034B26360g5348c6120A77355J27335A09928K10874
13306C20802K62418j21074k8719g6396D43661C2210a4015B13163J92446a36640
13295b44267A07534K84230j10362I7491R7333k6898K9448n1258J99607A66640
13284A18464p538E3404K56937A9452J8972M00630A90688c3760C05405c2669E793
$$ y = [274211, 214886, 73986, 431225, 130701, 158103, 353470, 161156, 353383, 354306, -66563, 96766, 476839, -34532, 308895, 150346, -61893, 346313, 282608, 39618, 395827, 289712, 85415, 214322, 253576, 114176, 216717, 383341, 226866, 252661, 143823, 207344, 390506, 187125, 120980, 188223, 238681, 541149, 367889, 118452, -51671, 15713, 243722, 351477, 382494, 301913, 150276, -29034, 226360, -75348, -36120, 177355, 304690, 109928, 320802, 583220, 462146, 433427, -76396, 443661, 32210, -14015, 213163, 405609, -136640, -244267, 107534, 391764, 281402, 97491, 194824, 167926, 197374, 146116, 345723, 166640, 118464, 110926, 53404, 310341, 19452, 38424, 439054, 190688, -33760, 305405, -32669, 5793]
13272B76999A06449H560L38092A16256a41884H2031a8158B14001E3723M68662
13262E22385B36138c54281G7337i8906M4123q8222I9698J08207e0195B15180a3819
13250a73729A2488K42144a69047C58994j73364b77308A70625L1493D8551d8355
13239D84704B35826A09269c1190A33188A3033L08733G2005M1880l7409A9277K12605
13228B31882M7410q5767o9480d186B41143i7003B23011J01278B4772b6446D01582
13216D22928j94590a58520F7980a55202A23019B2807J67849b4280D47369A88260
13205a42452B30102P9886j21146q0565L11318A07755M9358a28977J6346A77465
13194D3523J06582J39169a47333e8824B78872B2563K32659I4141i0847k29535
$$ y = [276999, 106449, 8560, 346652, 116256, -141884, 82031, -18158, 214001, 53723, 522385, 236138, -354281, 77337, -98906, -54783, -143005, 99698, 207905, -50195, 215180, -13819, -173729, 12488, 254632, -169047, 358994, 185630, -277308, 170625, 202118, 48551, -48355, 484704, 235826, 109269, -31190, 133188, 13033, 321766, 72005, 113885, 76476, 19277, 231882, 279292, 193525, 124045, -4186, 241143, -97003, 223011, 324289, 24772, -26446, 401582, 422928, 228338, -158520, 67980, -155202, 123019, 22807, 190656, -24280, 447369, 188260, -142452, 230102, 309988, 188842, 108277, 419595, 107755, 157113, -128977, -112631, 177465, 43523, 150105, 289274, -147333, -58824, 278872, 22563, 255222, 94141, -90847, -320382]
13184c20382a50347a7952C66714j53404b27018b6696E61460a56770H9931f8733
13173A38718M8698A7039K139L6602B0555a15868j09305A95467G1695P9031J36862
13162B87588I2429M13945k19031a35358B88294j15116l2835R369l9628L41729
13152D51813A49894a42206A87708b00934R8955B2814c2309H3067k231g9032A0413
13140C0372L65916f2045B6453b99826H7376i8613I4342h7343I0647J09897C1718
13128E0099b17523O9008A21671a33537B49656C5189N2490K09475J15096A29841
13117A76528k6034c65507A73488b9391A08238R5863a84321C0450J9455J33915
13107A83820n9274J70719k7499F3423K8343k3157B6432O780L64083j95037n9211
$$ y = [-320382, -150347, -17952, 366714, 213310, -227018, -26696, 561460, -156770, 89931, -68733, 138718, 187416, 17039, 19178, 55780, 20555, -115868, -225173, 195467, 71695, 150726, 287588, 92429, 506374, 287343, -135358, 288294, 173178, 140343, 149712, 110084, 451813, 149894, -142206, 187708, -200934, -101979, 22814, -32309, 83067, 80836, -79032, 10413, 30372, 396288, -62045, 26453, -299826, 87376, -98613, 94342, -87343, 90647, 200544, 31718, 50099, -217523, -148515, 121671, -133537, 249656, 35189, 87679, 297154, 412250, 129841, 176528, 150494, -365507, 173488, -29391, 108238, 204101, -184321, 30450, 49905, 183820, 124546, 295265, 267766, 63423, 91766, 68609, 26432, 33212, 397295, 202258, 143047]
13096A43047J42653l5472A23315J10763q5574J3391J49261E5765e4431j06148
13086a60579D89928d6871B45120a81139D427e0498I4395a93496I138c8996A9934
13074C03507j06711E17O02144G5782J02265K11287q5914D5229d3211A85735n1189
13063A34546A6190J49661a25961A44654M8258B3851a2824B74522F2542M45859
13053E08401I3331J23004e0384a0556A49615n7148M8665a74634K7786O4142I1588
13041b7193A19818c24315a05863N854D11487n6617a5132B07461K18096b06942
13030A52555l0930A10b9922I8261J17030j9568f3304j20658A3551K62571K4065
13019C00187b9184B4729L16884a59103A19850a30287F4228c7108q5924F5955L5454
$$ y = [143047, 285700, 250228, 123315, 234078, 148504, 161895, 311156, 55765, -54431, -160579, 489928, -46871, 245120, -181139, 4427, -50498, 94395, -193496, 9138, -38996, 19934, 303507, 196796, 517, 602661, 75782, 178047, 389334, 303420, 45229, -43211, 185735, 134546, 16190, 165851, -125961, 144654, 192912, 23851, -12824, 274522, 62542, 508401, 93331, 216335, -50384, -10556, 149615, 92467, 141132, -174634, -146848, -82706, 91588, -27193, 119818, -324315, -105863, -100009, 411487, 354870, -15132, 207461, 425557, -206942, 152555, 121625, 110, -29922, 98261, 215291, 195723, -63304, -183962, 13551, 276122, 300187, -29184, 24729, 341613, -159103, 119850, -130287, 64228, -37108, -123032, 65955, 101409]
13008A01409a18248C24173d3992A34982A9841M10190f6413A12466J63739e135
12997D52180k06148G1332J21360o7691F0915N7618J29668K098j03020B3599J96114
12986B19713d8071C20603a52506H530a07021C38128a38556O7974q1124B88221
12975E1316e9805A37898q675n9319d5024M391B53665O258J93335D8429e1565F4395
12962C87968i1706n7543I2871B2440P9866J61278b5375j05116i578B76292q1412
12951A94880a12508e0551k27744a07663e158A37857A6761a4841B97788B1153L98
12940B1551L08333j38981e4827j63822C97898i8382A09197b28439A87063J81121
12930C68184F8441a5464C43229g8187I1421L4790c7453A73207E8976J08931n0018
$$ y = [101409, -118248, 324173, -43992, 134982, 19841, 430031, -66413, 112466, 276205, -5135, 452180, 246032, 71332, 192692, 125001, 60915, 118533, 248201, 250299, 147279, 23599, 219713, -48071, 320603, -152506, 8530, -107021, 338128, -138556, -70582, -151706, 288221, 51316, -59805, 137898, 129223, 69904, -45024, -40633, 253665, 259923, 453258, 48429, -51565, 64395, 387968, -91706, -149249, 92871, 22440, 102306, 263584, -25375, -130491, -9578, 276292, 194880, -112508, -50551, -278295, -107663, -5158, 137857, 16761, -14841, 297788, 21153, 21551, 329884, 190903, -54827, -218649, 397898, -98382, 109197, -228439, 187063, 368184, 68441, -15464, 343229, -78187, 91421, 126211, -37453, 173207, 58976, 167907, 117889]
12919A17889f855B86839g7622m8358I1962a32455A9987Q4733R8435f2434A62956
12907A27539f3765A77097b53622g9019j26701B5582J85317i3173B61J24651J03798
12896B28710e7039D9901J28116a79661C8619Q6792l3525c1600d773D50079I8026
12884h4605j35799A94918g2290l34380a39513O4976A17813m7676k0348c44828
12873B9221a74908j17962h378C15604J54577I5564a85633I0179a58480j9880A4243
12861C7484c2816A56465q650a85436d0822F5152g104j13187j05168D26459G0759
12849G2962d5778L160F2421c2790A54244m0954b2264G5089B167e27020a05413
12837C5617a19545p8129A18637b79074b7834L794B72430a10096L3231k9984C8241
$$ y = [117889, -6855, 286839, -77622, -125980, 91962, -132455, 19987, 104720, 203155, -62434, 162956, 127539, -63765, 177097, -253622, -79019, -205720, 25582, 210899, -93173, 261, 124912, 228710, -57039, 49901, 178017, -179661, 38619, 125411, 91886, -31600, -4773, 450079, 98026, -84605, -220404, 194918, -72290, -406670, -139513, -74537, 117813, 70137, 49789, -344828, 29221, -174908, -292870, -8378, 315604, 470181, 95564, -185633, 90179, -158480, -178360, 14243, 37484, -32816, 156465, 147815, -185436, -40822, 65152, -7104, -120291, -225459, 426459, 70759, 72962, -45778, -42618, 62421, -32790, 154244, 113290, -22264, 75089, 2167, -527020, -105413, 35617, -119545, -197674, 118637, -279074, -27834, -24040, 272430, -110096, -76865, -106849, 38241]
12825d1984A1450J76619b97543D74043b1571c314j32288E6450N6354a42090D67173
12813H589M4353J09365c2725l3729G2907c12260i1019A73028E607K74979b4548
12801B70040A088J14813c8823C3630J89980K22212D4789P3552c9820F2819a27247
12789c84475f2473B275e7440K4803l57870D71668a17265a8538B17939a23015A20483
12777g1995A47952D8801a17424L2352c2052B32022a87899a1304k22729A21184
12766B05129O0147j02221J21957p8420K6117A13024K25327A6238R9365d7161A43603
12754A46300i325j05104k00536a33056l4984A64330A1660J93128L06328A38605
12743A88315O320a5339p2451j42549G4618j1250J23829n729A1085K59681h1288
$$ y = [-41984, 11450, 188069, -297543, 474043, -21571, -3314, -135602, 56450, 112804, -142090, 467173, 8589, 52942, 162307, -32725, -66454, 72907, -312260, -91019, 173028, 5607, 280586, -24548, 270040, 1088, 115901, -38823, 33630, 223610, 445822, 44789, 118341, -39820, 62819, -127247, -384475, -62473, 2275, -57440, -32637, -390507, 471668, -117265, -18538, 217939, -123015, 120483, -71995, 147952, 48801, -117424, -85072, -32052, 232022, -187899, -11304, -234033, 121184, 205129, 265276, 163055, 285012, 206592, 232709, 113024, 338351, 16238, 115603, -47161, 143603, 146300, -9325, -114429, -314965, -133056, -168040, 164330, 11660, 204788, 511116, 138605, 188315, 194635, -15339, -87790, -230339, 74618, 63368, 187197, 181468, 11085, 270766, -81288]
12731B80892j28687l646l5142a69820g156A82192E5820J96142o1180H512J99660
12720B08172n5156K10778j43522c36037A59209N9033f0888l9592B45642j22013
12710A23629J6430K8427K36808p8695N8511j78655H3564j0929K07843D4770L92173
12699D36943J2220j84836Q8221A71439m4210c82032c8561E0248K12339a53553
12688E8244B6275J1600A2587a45380c2399F8562a69990g8270p377B78199a07182
12676a9867I0800R614L0766M0583n0272J26299p6805O3597B5872e4024B34112
12664B07704J12358J17871A34747a81552b133F4643f8674l7384A82117a67766
12653A94038p5532K89478A31059J53852I5032A742c35055C26790a90403n3960
$$ y = [280892, 152205, 148559, 113417, -169820, -7156, 182192, 55820, 251962, 190782, 8512, 208172, 153016, 363794, 220272, -336037, 159209, 218242, -60888, -100480, 245642, 123629, 140059, 168486, 405294, 326599, 385110, 206455, 83564, 72635, 280478, 44770, 436943, 449163, 264327, 352548, 171439, 127229, -382032, -38561, 50248, 262587, -153553, 58244, 26275, 37875, 12587, -145380, -32399, 68562, -169990, -78270, -85647, 278199, -107182, -19867, 90800, 100414, 131180, 171763, 121491, 247790, 170985, 234582, 25872, -54024, 234112, 207704, 320062, 437933, 134747, -181552, -2133, 64643, -68674, -106058, 182117, -167766, 194038, 118506, 407984, 131059, 284911, 95032, 1742, -335055, 326790, -190403, -244363]
12643b44363A30706k4658a89601A68265e1635C6644e5594k218k15500C71003b48508
12631G3062k682J62985L3524P1085a9172A56090A2998M30086A5160a73642A63998
12619C58211j61781A2121P1403K09713h6391G13Q7752N8211L8283E6576k4718
12608C1858a75472j94730A98409k4448J00580i5788j78717B02015F3711a36605
12597a35996A72898f2167B9233J0126a60903A6589a36229B68814b05754A70839
12586B8275B614a90411n030m4222A37794d10584A91734p4638J7659j8628a38942
12574B8237a34231B1019a66316f8831j57860B56742G8363L6208j411m1020J30849
12563B02989N1710L6513C4108K18584A7607K50964C8222d5528A15120g0345A24753
$$ y = [-244363, 130706, 106048, -189601, 168265, -51635, 36644, -55594, -57812, -273312, 371003, -248508, 73062, 70380, 233365, 266889, 337974, -19172, 156090, 12998, 443084, 15160, -173642, 163998, 358211, 196430, 12121, 83524, 293237, -86391, 713, 88465, 146676, 184959, 56576, 31858, -175472, -370202, 198409, 173961, 274541, -95788, -274505, 202015, 63711, -136605, -135996, 172898, -62167, 29233, 39359, -160903, 16589, -136229, 268814, -205754, 170839, 28275, 2614, -190411, -195441, -239663, 137794, -410584, 191734, 117096, 134755, 116127, -138942, 28237, -134231, 21019, -166316, -68831, -226691, 256742, 78363, 114571, 113160, 72140, 202989, 254699, 291212, 34108, 252692, 17607, 268571, 38222, -45528, 115120, -70345, 124753]
12551A30771M6046B291g1395B03170G0387a18329K6499D8101R3437A899b9196
12539i5883D7664a53661f3356j02521A18340C4688i847j84653g0842J1864B76766
12527a47804E8180K14423p1034e1553B79678B8579K0902k4666m943K71548E8785
12515f5778k369a8164B39388b55881A16874d4213p9435J8183f581B68189I1941
12503A20449L76741d1821A72637p5750L2476i2578I1637C5446e3538q9173C33665
12491a18669e7883j0133A81611d12149a25446o500b237A31187E6677A6803a8026
12479B7325a07395j10097P1542H8786a27261A75458n7006d5938n1988j16218A90740
12467B89110E5589A6547b7546j92458A17589b30673A26472d00986a21402A7467
$$ y = [130771, 176817, 2291, -71395, 203170, 70387, -118329, -91830, 48101, 141538, 1899, -29196, -95883, 47664, -153661, -63356, -165877, 118340, 34688, -9847, -194500, -70842, -58978, 276766, -147804, 58180, 272603, 201569, -51553, 279678, 28579, 49481, 24815, 19872, 291420, 58785, -65778, -68147, -18164, 239388, -255881, 116874, -44213, -123648, -105465, -6581, 268189, 91941, 120449, 497190, -41821, 172637, 96887, 129363, -92578, 91637, 35446, -53538, -142711, 333665, -118669, -57883, -68016, 181611, -412149, -125446, -131946, -2237, 131187, 56677, 16803, -18026, 27325, -107395, -217492, -145950, 88786, -127261, 175458, 118452, -45938, -97926, -214144, 190740, 289110, 55589, 16547, -27546, -220004, 117589, -230673, 126472, -400986, -121402, 17467]
12456i2894b3724B26786n5452b09972E4395A8605J37651o3934K3935j8559L54105
12445D51803A40101C5729i001A77216h5082B09942d3975g252F5682a2516m7427
12434e9943J4513a99j41877l180F6587b27368d9625B16515a31937C2129a43786
12422A98840I0236a16461a1126B70245b45693e2417B63970a15244A33807f760
12411c3982q8454c833A89775b02314A62720J3425a12604j02320M1971l6739Q9038
12400a20654c2534A549a72361A34372K15237A63114m8332C4164a29035D3003J55791
12389A98794I5664c12709B0775f4805q8508A62296p1076b89870A33453c8469A36133
12377a15201e1734H8396k4278f9774A06242j1157a45531M1966H4721J4578f8568
$$ y = [-92894, -23724, 226786, 171334, -209972, 54395, 18605, 156256, 92322, 116257, 97698, 451803, 140101, 35729, -9001, 177216, -85082, 209942, -43975, -7252, 65682, -12516, -59943, -45430, -199, -142076, -145256, 66587, -227368, -49625, 216515, -131937, 32129, -143786, 198840, 90236, -116461, -11126, 270245, -245693, -52417, 263970, -115244, 133807, -6760, -33982, -122436, -3833, 189775, -202314, 162720, 176145, -112604, -214924, -172953, -209692, -120654, -32534, 1549, -172361, 134372, 349609, 163114, 114782, 34164, -129035, 43003, 198794, 95664, -312709, 20775, -64805, -153313, 162296, 91220, -289870, 133453, -38469, 136133, -115201, -51734, 88396, 64118, -69774, 106242, 95085, -145531, -103565, 84721, 99299, -68568]
12365c88964E83714k29940a8429B19626R551D6129a5623A27175l1012K56973a27849
12353B23490r8683e7316K51B9396a3114j92517A57052G5345k2480N6184b14169
12341h315k52421J04467N1481A53865o9755c36098b7222p0243A34865L1507g4666
12329b2368n6509n7717c232A10157j5938c14298J39023d4462L541p3632C8331
12317a59740A32319g5978B0952K93472O622H5998j7122O5110f8735C4482f2871
12305F373J00007h8045k25067J4264A55898i1927f49q2874B8622a05748d8029
12293B8779d297k5759C5483g4745A80926J22719G2903a92860B74713i2255B02256
12281A6811M860K70440J66018H937J55636K55625d3467F03902A98517J62563j57137
$$ y = [-388964, 583714, 353774, -18429, 219626, 229177, 46129, -15623, 127175, 96163, 353136, -127849, 223490, 124807, -57316, -57065, 29396, -13114, -205631, 157052, 75345, 52865, 109049, -214169, -8315, -260736, -156269, -104788, 153865, 84110, -336098, -27222, -97465, 134865, 166372, -74666, -22368, -78877, -136594, -3232, 110157, 94219, -314298, -175275, -44462, -40921, -114553, 38331, -159740, 132319, -75978, 20952, 314424, 321046, 85998, 68876, 133986, -68735, 34482, -62871, 6373, 106380, -88045, -313112, -298848, 155898, -91927, -649, -83523, 28622, -105748, -48029, 28779, -4297, -30056, 35483, -74745, 180926, 303645, 72903, -192860, 274713, -92255, 202256, 16811, 21671, 292111, 458129, 8937, 164573, 420198, -43467, 603902, 198517, 361080, 203943]
12270B03943J61274j45886a849I2645R5272H0405A4608c5009A2746K37584k7801
12259B22529a20733H3176a04446D95273b67082J15536I5130K63754P9745I5947
12248c8200B63267a8243A95940N7853E4414J74312j8712h0940A97172c9471D99812
12236A72004M1007d6791A40782K7260m97O2995Q9546B3735M81618H9794O108j8914
12224G6988b47124E05504I9990P9886E5199a16970b124A83730L9680A09469D0785
12212g5700C75379A08186d7777B07846B4687Q1830c3083E15845B32425B1764Q7653
12201A09417a55946F7756g4464C77254j34826J72541E6832K8064K86782A46032
12190H2539K77506m1086j13215L5514p3017J13826j29205f369C55862a2340B88099
$$ y = [203943, 365217, 219331, -1849, 92645, 187917, 80405, 14608, -35009, 12746, 250330, 222529, -120733, 83176, -104446, 495273, -267082, -151546, 95130, 358884, 438629, 95947, -38200, 263267, -18243, 195940, 253793, 54414, 228726, 210014, -80940, 197172, -39471, 499812, 172004, 213011, -46791, 140782, 168042, 167545, 230540, 320086, 23735, 505353, 89794, 95902, 76988, -247124, 505504, 99990, 179876, 55199, -116970, -2124, 183730, 223410, 109469, 40785, -75700, 375379, 108186, -47777, 207846, 24687, 106517, -33083, 515845, 232425, 21764, 109417, -155946, 67756, -74464, 377254, 242428, 414969, 56832, 84896, 371678, 146032, 82539, 360045, 318959, 205744, 241258, 168241, 282067, 152862, -6369, 355862, -12340, 288099]
12178B77621G9248J55444K329r5664K25634b09832A82186J51012A27727E3578
12167G3568b11797A05333i6710K7462j23874A42659P905K01745A13115J24470
12157B37585n6780J91671A81475a18981A55476o2735A8934J06734J351N1664K381
12146A81064J18419P073b96677f028B62182A6316a436A62567a28932A42478l3803
12135A08675f1910B15464D9516K7589O9729Q7852F1242J53365q105i0638r4409
12124a85047D1575P9154e6748A32656a88137A18914c61194a19009d629C808b3390
12112A96834b02889D14537f3004C23534b75782H8428k1505M1599C6514a2755p6860
12101h9615q5615D0176a96996B98289a30386B10534I6701b03534O3459r4561J0136
$$ y = [277621, 79248, 234692, 237021, 141357, 366991, -209832, 182186, 333198, 127727, 53578, 73568, -211797, 105333, -96710, -69248, -193122, 142659, 150564, 352309, 113115, 237585, 180805, 372476, 181475, -118981, 155476, 92741, 18934, 125668, 127019, 178683, 181064, 299483, 306556, -296677, -6028, 262182, 16316, -1436, 162567, -128932, 142478, 108675, -61910, 215464, 49516, 77105, 146834, 234686, 61242, 214607, 206502, -90638, -185047, 41575, 120729, -56748, 132656, -188137, 118914, -361194, -119009, -4629, 3808, -23390, 196834, -202889, 414537, -63004, 323534, -275782, 88428, 66923, 108522, 36514, -12755, -89615, -175230, 40176, -196996, 298289, -130386, 210534, 96701, -203534, -140075, -234636, -224500]
12090b24500c4426B69074a36686j80060c8133B77364b53990B01408l0093F7387
12079b10315O0650n6183E9293K18643L28297J40170J111648q58741B47724N3590
12069C01314d2437k01815B38699b93604A34276a21757A08925c0761C98501b26788
12058A00495b07150c1191j736B49316a0424B07592E5906a7329G3237a09892A13324
12046a18353C2921a87229C6884J23157b03540A43235c007E41513B3098h710j53279
12035a61989e4470B8913P0894K42594a97617a818q7346H8407J74850A15700k8226
12024H7474a27733c1845j14829b6418j66569g1872a4344A27215B6935a76676c2578
12012A1815c4940J2174B77870b27575B80733C9036b90116a35954K6106D6715a30791
$$ y = [-224500, -34426, 269074, -136686, -316746, -38133, 277364, -253990, 201408, 171315, 67387, -210315, -149665, -205848, 59293, 277936, 606233, 746403, 1858051, 999310, 247724, 301314, -42437, -244252, 238699, -293604, 134276, -121757, 108925, -30761, 398501, -226788, 100495, -207150, -31191, -32927, 249316, -10424, 207592, 55906, -17329, 73237, -109892, 113324, -118353, 32921, -187229, 36884, 160041, -203540, 143235, -3007, 541513, 23098, -8710, -161989, -54470, 28913, 99807, 342401, -197617, -1818, -89164, 88407, 263257, 115700, 87474, -127733, -31845, -146674, -26418, -192987, -71872, -14344, 127215, 26935, -176676, -32578, 11815, -34940, -22766, 277870, -227575, 280733, 39036, -290116, -135954, -109848, 46715, -130791]
12000A21157J836b15169I1343g7253j57773f4891A44760a9055A06132f0808k3633
11989h4441L6052C93788b74795a27359j27472I8408l9602C488M1513c0316o1808
11978i2124j06215B69699a6485m55557H57J46766c75291A34880c5115B439c03457
11966a45392P1236C6999J79678n669q2532m412A9764J31684c40999f5705b8376
11954g0728n8887A458i1840b0615l13151J47655M0890L5664D7637K918F718J42672
11942A49390d7371B6076a2468k03684k9082b27k182B22809F1995Q9245o0039a43801
11929E4856R945P6755a17013k06339b7134j48120B14845h9001H5840k7102k3958
11918C4780h5331A86383a39597N9533B64894b44606A41066c07215N2124A35970
$$ y = [121157, 122993, -215169, 91343, -77253, -235026, -64891, 144760, -19055, 106132, -60808, -84441, -48389, 393788, -274795, -127359, -254831, 98408, 58806, 3488, 45001, -30316, -92124, -198339, 269699, -16485, -472042, 857, 147623, -375291, 134880, -35115, 2439, -303457, -145392, -74156, 36999, 216677, 211008, 128476, 124064, 19764, 151448, -340999, -65705, -28376, -70728, -129615, 1458, -91840, -20615, -333766, -186111, -145221, -109557, 47637, 50555, 6718, 149390, -47371, 26076, -12468, -216152, -245234, -227, -2409, 222809, 61995, 151240, 91201, -143801, 54856, 64801, 141556, -117013, -323352, -27134, -175254, 214845, -89001, 85840, 58738, 34780, -85331, 186383, -139597, -80064, 264894, -244606, 141066, -307215, -255091, 135970]
11907I3426a40672K1072B65213M7927F8188B001g345k07837g6404j96871B35K70348
11895B70583a26712A54838O4670r520d62909B17046G1526e170j72610E4226K13346
11884B67572C0701a5652k11224A9908c0541k50019a33391H1270B452R0421a70761
11872a80154l6010k2437O5333L2260Q893N7412C8266a12795j80763J01792a5819
11860a04808D23710e5778B00989a43913E9654A1194b25018A67582K83431a99586
11849b49011n3726A02720b12B6657a61254A3578R4569l0354a36729I2387J63932
11838B56319J47505a90322A5514O9068J49533J7435E4089J10302c06485g2918
11827F0259a8887k75281f1506H771c43057a7786l39563J35436C5287a10969D4675
$$ y = [93426, -140672, -119600, 265213, 313140, 68188, 2001, -7345, -215182, -76404, -273275, 235, 270583, -126712, 154838, 219508, 209988, -462909, 217046, 71526, -5170, -177780, 54226, 267572, 30701, -15652, -226876, 19908, -30541, -280560, -133391, 81270, 2452, 92873, -170761, -180154, -216164, -238601, -173268, -141008, -132115, -74703, 38266, -112795, -293558, -191766, -15819, -104808, 423710, -55778, 200989, -143913, 59654, 11194, -225018, 167582, 451013, -199586, -249011, -302737, 102720, -212, 26657, -161254, 13578, 108147, 77793, -136729, 92387, 256319, 403824, -190322, 15514, 84582, 234115, 251550, 54089, 164391, -306485, -72918, 60259, -18887, -294168, -61506, 8771, -343057, -17786, -357349, -221913, 35287, -110969, 44675]
11815b08256c7809k93226J22651A77201J64402a1512A20870e232j70593Q6642
11805h9183k36852F2586O1853A7325J6082J48455d8761C20084r2596d5859A45090
11793B03513D8245O8631d5743A96105a36096A52269a21589j05220A8015J86581
11783B04596a02428j25756A1809M8440a33579j35632a13171A95280f3611H9883
11772b8769G037J26672b00083k13327A37803a11376B50000A08059c47692A77824
11761a5634B24805J16606a74060A15177b29245D00396A41296m5628a79576A63262
11750D6816K22421A22396q960g7624C19752A07761C264a16374E3569d2837D2739
11738C55012A40996n2802a63780k8288L1486A8863J61313g3899B14975b25088
$$ y = [-208256, -37809, -331035, -208384, 177201, 341603, -11512, 120870, -5232, -175825, -89183, -326035, 62586, 124439, 17325, 33407, 181862, -48761, 320084, 227488, -45859, 145090, 203513, 48245, 116876, -45743, 196105, -136096, 152269, -121589, -226809, 18015, 204596, -102428, -228184, 11809, 60249, -133579, -269211, -113171, 195280, -63611, 89883, -28769, 7037, 133709, -200083, -413410, 137803, -111376, 250000, 108059, -347692, 177824, -15634, 224805, 341411, -174060, 115177, -229245, 400396, 141296, 95668, -179576, 163262, 46816, 269237, 122396, 113436, -77624, 319752, 107761, 3264, -116374, 53569, -42837, 42739, 355012, 140996, 88194, -163780, -192068, -160582, 18863, 180176, -73899, 214975, -225088]
11727B48267A10200l1087j411d10492f3607P713A58249n7555n0175Q4544a31059
11715I3872a06593K7716A79961K65677e7359G9224D062b78988f4548B17582b27180
11703B16561F9940J68427j09750Q6m4709k2696K31800b04563e5270G7756a30828
11691f6791m2630D61808f4440j65502N9523A10415R5428a81512j31934A41423
11680A53221k3909L989i0744A27970d7622F1980g0895C65M7430b10607f1516F8955
11667F9979j6704a98117O2561f4443l4551o4644A12286b94481H628a79503L6294
11656a43209q5378B10855f3329j30511C07572b96248D3826d52819A51388k6259
11646A25129l6025e3412A38180b49282a19544p4343a7208B32877d7761m5140B06605
$$ y = [248267, 110200, 79113, 77702, -410492, -63607, -55894, 158249, 100694, 50519, 135063, -131059, 93872, -106593, -78877, 179961, 445638, -57359, 79224, 4062, -278988, -64548, 217582, -227180, 216561, 69940, 238367, 128617, 128703, 83994, 61298, 293098, -204563, -55270, 77756, -130828, -66791, -109421, 461808, -64440, -229942, -170419, 110415, 205843, -181512, -313446, 141423, 153221, 129312, 133301, -90744, 127970, -47622, 61980, -70895, 365, 47795, -210607, -61516, 68955, 69979, 53275, -198117, -135556, -64443, -98994, -163638, 112286, -294481, 8628, -179503, -143209, -228587, 210855, -63329, -193840, 307572, -296248, 43826, -452819, 151388, 125129, 89104, -53412, 138180, -249282, -119544, -193887, -17208, 232877, -47761, -92901, 206605]
11634b34112P0468G5937R2883e5369b2062j77664H8284g272D8643N5251h4313
11622a06244A90415C7271J72053e8154H6596j4609P8708h602j11652A30796m7733
11611H3063P8918G3628a62433N6796A93137g5549k59433A25629m7529g7604B28804
11599D11486p9147g9341H8184C3971J40090a45197o229A78454b0378B45960n6858
11588A89102J45923j58208J12581q0013H1801Q6167g7463K5563E938a2104A61888
11576B36520a06543B57572c7155A98439h9617d3632B71798A14274l0095B2222
11565D8971A4165J3335d7629k19338D4132i458I3928D1615J03607F9043J21587
11554A90630J08631C440J86849b07675C9435P1761K4940L5758J71608d9202l336
$$ y = [-234112, -163644, 75937, 168820, -55369, -22062, -199726, 88284, -7272, 48643, 103894, -84313, -106244, 190415, 37271, 209324, -58154, 86596, 71987, 150695, -8602, -120254, 130796, 83063, 161981, 73628, -162433, -105637, 193137, -75549, -334982, 125629, 78100, -77604, 228804, 411486, 332339, -79341, 88184, 33971, 174061, -145197, -151426, 178454, -20378, 245960, 189102, 335025, 176817, 289398, 209385, 81801, 167968, -77463, -51900, 5938, -12104, 161888, 236520, -106543, 257572, -37155, 198439, -89617, -43632, 271798, 114274, 84179, 22222, 48971, 14165, 27500, -47629, -266967, 44132, -9458, 93928, 41615, 145222, 69043, 190630, 299261, 3440, 190289, -207675, 39435, 111196, 136136, 171894, 343502, -49202, -52538]
11543e2538O42B17166a87093o4454A99318G3065J02584J54910A24460b2063A17234
11531C55061J40023i0776j41367A49265i6383A8229M47290b07444B64744B535
11520i8636A29103d9786l7536B72357R2624A0833O59684B51805J69889d791A75613
11508C82737j70053D2062K79085a97774C04464l7171k5675B3530J45087L04459
11498D73076j96134r4212p30g8944A26214L6557Q5520B0688O1112f4216G784a63888
11485e0781C66637c8533A65236n2745P2572n0077d7838B03449L8145G6057L60944
11474D37001a54652D9828J48961o4666b20740A27034N0696M8318r0877L32392
11464D67563C0459b70749C2589b56799A56753B5245N4646L27155g6530n5969A79629
$$ y = [-52538, -51896, 217166, -187093, -251547, 199318, 73065, 175649, 330559, 124460, -22063, 117234, 355061, 495084, -90776, -232143, 149265, -96383, 18229, 465519, -207444, 264744, 2535, -98636, 129103, -49786, -87322, 272357, 364981, 10833, 670517, 251805, 421694, -4791, 175613, 382737, 212684, 42062, 321147, -197774, 304464, 267293, 241618, 23530, 168617, 473076, 276942, 182730, 182000, -78944, 126214, 162771, 248291, 20688, 81800, -64216, 7784, -163888, -50781, 366637, -38533, 165236, 112491, 185063, 134986, -47838, 203449, 241594, 76057, 437001, -154652, 49828, 198789, 134123, -220740, 127034, 177730, 226048, 135171, 467563, 30459, -270749, 32589, -256799, 156753, 25245, 79891, 407046, -76530, -132499, 179629]
11452a8562A72177D9687Q2771J62676j29308j3580J51966j15360a85710A07168
11441A61255c528k9970A20876e1399b352o8727C7504f4537D5086B084J35234a4370
11428C05488j51678c9462k57333A77106a18276A01361L9872m5091n701b25814
11417d78534a22605A61277K32684a14828L1577A97844a08304r1732G5006C6376
11406a2990p85E63O1282RO5942m1760i9463m8978h538C01427i0618D00264I4748
11392c79671f8896k23197A02515h3917G4244b5138A10253j9508K9233E7847P1905
11381A29752a25050I6108J07185a34763B84671j23640R1294j4367c5557I1962
11370b59756C2901a23335B7018J21760E7065O5370a37846A6873K095a35853h096
$$ y = [-18562, 172177, 49687, 132458, 295134, 165826, 152246, 304212, 188852, -185710, 107168, 161255, -3528, -33498, 120876, -51399, -2352, -71079, 37504, -64537, 45086, 2084, 137318, -14370, 305488, 153810, -39462, -296795, 177106, -118276, 101361, 141233, 96142, 90441, -225814, -478534, -122605, 161277, 393961, -114828, -83251, 197844, -108304, -200036, 75006, 36376, -12990, -13775, 563, 61845, 61854, 127796, 86036, -99463, -148441, -8538, 301427, -90618, 400264, 94748, -379671, -68896, -292093, 102515, -83917, 74244, -25138, 110253, 90745, 119978, 57847, 129752, -125050, 96108, 203293, -134763, 284671, 161031, 252325, 237958, -35557, 91962, -259756, 32901, -123335, 27018, 148778, 57065, 122435, -137846, 16873, 18968, -135853, -8096]
11358b59724b131A00089K171Q0686c30869A1980N273J49643Q7955a03541D43b38605
11345F2188a28764a0139G0429b0910A34773m9408L3017b31697K9305d3369F7029
11333i9123k7889n6517B26209E4679A2742c25569O1929F5098b1966j35216A78063
11321b71858c0300l05427A36183d1317j70420A10053b4223j48891P9883l8179
11311a31410N7037j81230c0969A71342J29648A09438a00577I8478a72182A18353
11300a84051A08264d2184n7444F5703a54125o5705B60496a84473F5044a1592k61359
11289b72951A67031c75274E5247c08634M3337i6685k40682c0797k97849E7569
11278c32043B7209a73307K1346A14754h3289k1604B32536H9016J31213a35752
$$ y = [-259724, -2131, 100089, 102260, 182946, -330869, 11980, 17253, 166896, 254851, -103541, 443, -238605, 62188, -128764, -10139, 70429, -20910, 134773, 85365, 118382, -231697, -202392, -43369, 67029, -99123, -127012, -183529, 226209, 54679, 12742, -325569, -263640, 65098, -21966, -157182, 178063, -271858, -30300, -335727, 136183, -41317, -211737, 110053, -24223, -173114, -93231, -131410, -74373, -255603, -30969, 171342, 300990, 109438, -100577, 98478, -172182, 118353, -184051, 108264, -42184, -99628, 65703, -154125, -219830, 260496, -184473, 65044, -11592, -272951, 167031, -375274, 55247, -308634, -265297, -96685, -337367, -30797, -328646, 57569, -332043, 27209, -173307, -151961, 114754, -83289, -104893, 232536, 89016, 220229, -135752]
11267a94021A48253a09110j38155O5487A62129d00863J13733A6620K35966J1678
11257B64264r818c06391Q9802K6905K4249k2036F9758R0779C7933a69411A30961
11245A64647a48624m3054N974C8846a12257j85574A18114h6006q2797B22419h2633
11233C39340g7585A12470b74433h8809p7367H0065a09230b6074B16548e7329L847
11222e3482J0328A9173c4720j52664g8846k0441C35395h4129l29098a9283F4273
11210B51721i9909j91744d2896j25556A14053d3456j91366L9399A95400E5109
11199e3698I8589h4469A31213E8655a50564D6301a89554B29740a51101c8885A6731
11187g0769j54549J07901B06425h1064k89516b9859j44461J4952L6211d8080A387
$$ y = [-194021, 148253, -109110, -247265, -181778, 162129, -400863, -287130, 16620, 252586, 264264, 254446, -306391, -216589, -189684, -165435, -187471, 69758, 160537, 37933, -169411, 130961, 164647, -148624, -191678, -185704, 38846, -112257, -297831, 118114, -86006, -168803, 222419, -82633, 339340, -77585, 112470, -274433, -88809, -166176, 80065, -109230, -26074, 216548, -57329, -53482, -43154, 19173, -34720, -187384, -78846, -99287, 335395, -84129, -413227, -19283, 64273, 251721, -99909, -291653, -42896, -168452, 114053, -43456, -234822, -195423, 195400, 55109, -53698, 98589, -84469, 131213, 58655, -150564, 46301, -189554, 229740, -151101, -38885, 16731, -70769, -225318, -117417, 206425, -81064, -370580, -29859, -174320, -159368, -123157, -48080, 1387]
11175g5999G8282C2919J26189f7975G4394f7372L1867l39717A66313a85800d283
11163b4459F7575J16952c61713a74451d6260k64708e5603j9645p0041E5953b78407
11151B7404a83158a8821k23973A75880p6221M0216k9563a56233f3227B32210b70948
11139d9179l20901g7959A84136c922A00601D3302i4200o2090E5074N9327a77142
11127B13842a09696A87755i0425A18254B330N0848Q2796c16166I37d7868j54977
11116b02845H1524f1909B4290f4401B27862a11374e1868A95554e175n513B91229
11104B87415a66520G4360J15522Q7586J22777j91137i4148A42680I299a6365B8891
11092c8621A11133E2559J01387k771e9857D31206L122A93885n0293L65743k33796
$$ y = [-75999, 78282, 32919, 159108, -67975, 74394, -67372, -35505, -375222, 166313, -185800, -4283, -24459, 67575, 184527, -361713, -174451, -46260, -310968, -55603, -75248, -145289, 55953, -278407, 27404, -183158, -18821, -242794, 175880, 99659, 139875, 110312, -156233, -63227, 232210, -270948, -49179, -370080, -77959, 184136, -3922, 100601, 43302, -94200, -156290, 55074, 114401, -177142, 213842, -109696, 187755, -90425, 118254, 2330, 53178, 135974, -316166, 937, -47868, -202845, 81524, -61909, 24290, -64401, 227862, -111374, -51868, 195554, -5175, -10688, 291229, 287415, -166520, 74360, 189882, 277468, 400245, 209108, -94148, 142680, 9299, -16365, 28891, -38621, 111133, 52559, 153946, 151175, -59857, 431206, 434328, 193885, 143592, 509335, 275539]
11081B75539c955A98284k4480E8809M81879A28676J75992j02982N9315a09385
11070C25765L0357A66647J69209N1351A41278M04682J01573p2538k16382Q7039
11060D45652R8214l2375O0933p0971J67993r372O9374k23950L35481k15503J13048
11049G38524N657n8976l7708j12992m10K74598C01911O47438r3098R7494C77400
11037I02162k38527K40116C54920K71688J33423k35965J20200M89111E30696J09897
11027F40593J97134k37005K82334j26317j35963N286Q2858j45162L34056k54338
11017F43476l05977J92415K45519r0936j56436L5467M24387D36859K42261k65162
11007D13958M09814k43371k13433N90106p5120j70444j53657j69618P00171m47540
$$ y = [275539, -3955, 198284, 173804, 58809, 540688, 128676, 304668, 201686, 261001, -109385, 325765, 356122, 166647, 335856, 387207, 141278, 545960, 647533, 574995, 358613, 445652, 543866, 511491, 572424, 501453, 669446, 660074, 729448, 505498, 840979, 625476, 738524, 744181, 685205, 647497, 534505, 534095, 808693, 301911, 949349, 856251, 953745, 377400, 902162, 663635, 903751, 354920, 626608, 760031, 524066, 644266, 1133377, 530696, 640593, 837727, 600722, 883056, 756739, 620776, 626062, 708920, 563758, 897814, 643476, 337499, 529914, 775433, 684497, 528061, 563528, 987915, 436859, 679120, 413958, 823772, 580401, 366968, 957074, 881954, 711510, 557853, 388235, 1088406, 640866]
10997F40866o0209j24480j0311K59801p1825n8172N07216m44639M57417n35945
10987E59719Q1094K6380K94177P7988j7446K73482k22308J29559O5811O6983R5747
10976A431186M25775k94689N91960M30247j23573L56978L442m94237O3488q4300
10966B306277k11485j47449P4889k3668k06982J36189j58161K92700k99618L76431
10956B139123k44432J81061j45826m80761K20128J09762n08022l86651k70352
10947F14030L76050j37597A54238N65698C36636Q4953j54499k008c7050C40220
10936C18743l0787j21522K00284r258j52471K23513A61846c5827A98952o0775
10926A38177l2000f8339B84091h6834H8882b85027J33377H0917a9326m46288h5346
$$ y = [640866, 580657, 456177, 445866, 705667, 633842, 575670, 1082886, 638247, 1095664, 559719, 640813, 667193, 961370, 1039358, 1021912, 1295394, 1073086, 1202645, 1268456, 1335439, 1431186, 1856961, 1562272, 2154232, 2584479, 2460906, 2817884, 2821326, 2327089, 2390577, 2306277, 2094792, 1947343, 2022232, 1998564, 1791582, 1927771, 1769610, 2062310, 1762692, 2139123, 1894691, 2075752, 1929926, 1449165, 1669293, 1779055, 1271033, 884382, 614030, 990080, 852483, 154238, 719936, 336636, 421589, 267090, 265082, -37050, 340220, 318743, 287956, 166434, 366718, 357460, 204989, 428502, 161846, -35827, 198952, 138177, 106177, -68339, 284091, -86834, 88882, -285027, -151650, 80917, -19326, -465614, -85346]
10914h979j50850g4197B25039H0527K22795a71601A21972B7795J85668a05599
10903B54122H1775h1488f350n1262l5862A70395g6033B13279E68d1627D3602h235
10890C4708h7315l16416G0094C2253L9629a26404c7242r7465d1108j9742k3716
10879h4566A7987R2008m2392b62736b4351o2646A30079a25829L285r6372Q9191
10868a29725I0632J05072F566J10055j731Q2942c764q0140r1542I2952a38035
10856A19025c21485A74042G0050a51089P1208k3164m7731f8450l4409B85255a12666
10844b04841L2961D3509L0754M4435e0141D4315h7398E9382a72464B09123a55775
10832E5166g9408A22691O8126J16914C6819e6900A44073a09225A23158q733j0697
$$ y = [-8979, -159829, -74197, 225039, 80527, 303322, -171601, 121972, 27795, 213463, -105599, 254122, 81775, -81488, -6350, -57612, -93474, 170395, -76033, 213279, 568, -41627, 43602, -8235, 34708, -87315, -403731, 70094, 32253, 71882, -126404, -37242, -134707, -41108, -60850, -84566, 17987, 109995, 67603, -262736, -24351, -86997, 130079, -125829, -122544, -218916, -129725, 90632, 195704, 6566, 116621, 114890, 197832, -3764, -83904, -175446, 92952, -138035, 119025, -321485, 174042, 70050, -151089, -79881, -103045, -150776, -68450, -102859, 285255, -112666, -204841, -171880, 43509, 74263, 118698, -50141, 44315, -87398, 59382, -172464, 209123, -155775, 55166, -79408, 122691, 190817, 307731, 36819, -56900, 144073, -109225, 123158, 114425, 103728]
10821A03728a43552A02728a64079j00199F8024a77304b214j59638B84632a04958
10810H9132C7526b76460j21085g9950A82361g1902A86721f5893A98502b59055
10799b83363F5888b8657l6788n4006A71741N1882c35464r191C9833a05406A10758
10787b17224d589j98106f4537J8437A53991D1729a64260B49916d12047B05129
10776A05970A0344a37256q242N5465L5118j32416a1425l3425A4734c1986j98805
10765b30791j9260Q0525f2702j68313h5730A2200M923e926G4798i602j20247D8610
10752b58692A57974k292a23431G2442a41006A20518e8920j55719A96325r4938
10742A01387d3838B71859b27671O0147A12875E2879d9810B45263A435J73784q1180
$$ y = [103728, -143552, 102728, -164079, -264278, 68024, -177304, -2214, -161852, 284632, -104958, 89132, 37526, -276460, -397545, -79950, 182361, -71902, 186721, -65893, 198502, -259055, -283363, 65888, -28657, -65445, -119451, 171741, 223623, -335464, -344655, 39833, -105406, 110758, -217224, -4589, -202695, -64537, -46100, 153991, 41729, -164260, 249916, -412047, 205129, 105970, 10344, -137256, -145498, -90033, -54915, -187331, -11425, -44850, 14734, -31986, -230791, -250051, -169526, -62702, -231015, -85730, 12200, 17123, -5926, 74798, -9602, -129849, 48610, -258692, 157974, 155682, -123431, 72442, -141006, 120518, -58920, -214639, 196325, 101387, -43838, 271859, -227671, -167524, 112875, 52879, -49810, 245263, 1435, 175219, 94039]
10731I4039m1303b61603J21066B01860l0237E1637J50501c55092J33433m2221
10721b63880A19238a53044j37639a26969j02818A68471c28634a33464O6723p5468
10711a42209M0902p6036B13112o0173a32247D26159A14137a42717f1453B62345
10700B06739l8636l9105n6196Q427a35057A33033a60458g2772A91d5021f580j70798
10688a77378Q6030I518h5799h952A8083b44020Q4389l3044K8778H55b37534j94040
10676d31574b11996D61276b19127P251G58136c67144J6348a54944I6519a11877
10665A09291b40581J07027j93016a51490B4657K31146a78436l6255a1174D9399
10654d5450A92717m2414a5235C6349J88933b21373j21323c282l76634E8479h8026
$$ y = [94039, 52736, -261603, -140537, 201860, 171623, 51637, 202138, -355092, -221659, -263880, 119238, -153044, -290683, -126969, -229787, 168471, -328634, -133464, -66741, -142209, -101307, -177343, 213112, 152939, -132247, 426159, 114137, -142717, -61453, 262345, 206739, 168103, 128998, 72802, 81229, -135057, 133033, -160458, -72772, 191, -45021, -6580, -177378, -91348, 9518, -85799, -8952, 18083, -244020, -159631, -192675, -163897, 855, -237534, -431574, -211996, 461276, -219127, -211876, 758136, -367144, -350796, -154944, 96519, -111877, 109291, -240581, -133554, -326570, -151490, 24657, 255803, -178436, -214691, -11174, 49399, -45450, 192717, 150303, -15235, 36349, 225282, -221373, -342696, -3282, -379916, 58479, -88026]
10642A71636e130k94214E9326c23379c2930o6886j10007e6721b7189A96134c98447
10630A25260a12912H771M9705J0973B7565P2091b82903e4179a1942A01942d4761
10618a4099k1638k67862A48781R4325B0319c42222g5794n2431B35354E7642P3341
10607A30983a49310K5899B49969a95771Q3349l91519a10880j97654f625q0957
10597h7582j40027d869o34171A9043J71800f4880k5915K4806f588j90560l6766
10586b33914A31126E0612h7658l3350e1576q0650A1710b48772B59090A26381J37068
10575B63449j07253h0099k08884l00726A21301r394J11891e2169j83705J08677
10565a27197A65310B1155O6781k955K9625R7308e1015k9913k54845A28346c42041
$$ y = [171636, -5130, -299344, 59326, -323379, -32930, -99816, -209823, -56721, -27189, 196134, -398447, 125260, -112912, 8771, 58476, 69449, 27565, 99656, -282903, -54179, -11942, 101942, -44761, -14099, -35737, -303599, 148781, 243106, 20319, -342222, -75794, -128225, 235354, 57642, 130983, -149310, -123411, 249969, -195771, -112422, -503941, -110880, -308534, -6625, -87582, -227609, -4869, -639040, 19043, 190843, -64880, -90795, -65989, -6588, -197148, -233914, 131126, 50612, -87658, -121008, -51576, -132226, 11710, -248772, 259090, 126381, 263449, 156196, -80099, -288983, -589709, 121301, 111907, 223798, -52169, -235874, -127197, 165310, 21155, 87936, 84981, 114606, 211914, -51015, -80928, -335773, 128346, -342041]
10553B9398a10607j88996J4275a05421B5029r793d93649a62967I9618d7209l5424
10542h2633A98135c49823a11064A38293a40416k70753i5098L5949a9301A82864
10531a1494A57041R7928c68230J34298F2185P8522B7137K24128E8322a18570k9968
10520a48538B70446h0517J9103C60910b43871M1217M9844O7123k39008c5163j69205
10509b04368k0370A23319a23533A99908F2464O7589d9583B81406a93840E0497
10498B22439b6882r2858j76811B23103l3804E7671b73034J23255M1932R671k03346
10487c01522d1862A16647J20623J57834D1730K4760R0826K43265j11048J62741
10477D52274B09411f3874A82613f8448A06531g6525J4887p9268A10459b15212
$$ y = [29398, -110607, -299603, -285328, -105421, 25029, 15236, -493649, -162967, 99618, -47209, -82633, 198135, -349823, -111064, 138293, -140416, -411169, -95098, -59149, -19301, 182864, -11494, 157041, 254969, -368230, -233932, 62185, 140707, 27137, 251265, 58322, -118570, -148538, 270446, -80517, -61414, 360910, -243871, -202654, -152810, -85687, -324695, -35163, -204368, -224738, 123319, -123533, 199908, 62464, 130053, -49583, 281406, -193840, 50497, 222439, -26882, -119740, -296551, 223103, 189299, 57671, -273034, -149779, -107847, -98176, -301522, -41862, 116647, 237270, 395104, 41730, 66490, 157316, 400581, 289533, 452274, 209411, -63874, 182613, -68448, 106531, -76525, -61638, -140906, 110459, -215212]
10466a08128j9743K7491k6822C49856a70068p1974B38004a35775m53654A624a85656
10454B234J20644a84524l0219i4960A79106a78273l285E0459J87990a01157a2153
10442a8985C07371a7167F396b14894e7990B3876J23586J33478a30183A84217B4833
10430B829b65810J24294a0176o0753b0089A12576Q0223h5684A75166a43102A43016
10418a09029n1620i175D24137a94230e9622j06952f9702I5493k8544C2078a21268
10406h4308A21075a4876B68426D0970i5913R546B52706G1222f4196A29951b17346
10394D86K8936b56151B86519a52773B02454L6856G8142K95302G5878a57451I013
10382A23736J54269o8433r4967J06131b303G0014N4392e4628E2863J81243F2934
$$ y = [-108128, -127871, -100380, -127202, 349856, -170068, -242042, 238004, -135775, -589429, 1624, -185656, 2234, 122878, -184524, -214743, -94960, 179106, -178273, -181558, 50459, 238449, -101157, -12153, -18985, 307371, -17167, 6396, -214894, -57990, 23876, 147462, 280940, -130183, 184217, 24833, 2829, -265810, -141516, -10176, -70929, -20089, 112576, 192799, -85684, 175166, -143102, 143016, -109029, -160649, -9175, 424137, -194230, -59622, -166574, -69702, 95493, 66949, 32078, -121268, -84308, 121075, -14876, 268426, 40970, -95913, -86367, 252706, 71222, -64196, 129951, -217346, 486, 29422, -256151, 286519, -152773, 202454, 239310, 78142, 373444, 75878, -157451, 9013, 123736, 278005, 209572, 114605, 220736, -2303, 70014, 124406, -54628, 52863, 234106, 62934]
10370C09140M7214j5901R4141K11825k60236J7500A56479L22917d1226B21267
10359g6392C78210J03455k10766l5987A10011J10126O4349n775J73333p3892J64762
10348E42914L2201j66407A37988k9558L52037B25458L09983B35109n6341J1833
10338A90601H9321K74965b6107E00569e6878C9344J53890J07840j29120A2154
10327A51823J9998K7674E08K99501E293K26157r2802h3879A39357K57870j42831
10316B54396C3894K00989I9097j6376b6045i036A50846Q5874a94639E5824c6556
10304B35625b23355A3453a03259C2819d5117H2029L62237f2835n0771l4205M6546
10293a01265G0455M2328f9734j27257A15870a6336b844j38945C48660j11155A5754
$$ y = [309140, 356354, 340453, 434594, 646419, 386183, 403683, 156479, 479396, -41226, 221267, -76392, 378210, 481665, 270899, 234912, 110011, 220137, 284486, 278711, 452044, 378152, 542914, 575115, 408708, 137988, 108430, 460467, 225458, 535441, 235109, 178768, 190601, 89321, 364286, -26107, 500569, -56878, 39344, 193234, 301074, 171954, 12154, 151823, 171821, 199495, 508, 300009, 5293, 231450, 138648, -83879, 139357, 397227, 254396, 33894, 234883, 99097, 82721, -26045, -9036, 150846, 236720, -194639, 55824, -36556, 235625, -223355, 13453, -103259, 32819, -45117, 82029, 444266, -62835, -113606, -147811, -101265, 70455, 112783, -69734, -196991, 115870, -16336, -2844, -141789, 348660, 237505, 15754]
10281i7090A08464a67320c4887l81600a42649B47678k7425f1737B83139K18140
10271E01279A72838A5407J65278b61977C67094A0575K84093r2527M9204J21151
10261C72496E9591L34266j47138j3344J2520l0255j2419M4778a6423E1579P9911
10250A31490b3464A8076L8420f1800a2225B04083q7521L0971c75940C3175b490
10238a96169j02253A18585d04734J91830e0177A18320c56001J72367m2841a05801
10227A3407e3115l55392J10636h8732p5670f4763A25160K7222a15348k39107a46175
10215e0724J3746k21001B13754a13962j26468g2892r4588o7815h153D46d2352
10203A77119d5227F068g8757l17670o5823K07042C281K7505M2084K72034a00313
$$ y = [-97090, 108464, -167320, -34887, -416487, -142649, 247678, 220253, -61737, 283139, 501279, 172838, 15407, 180685, -261977, 367094, 10575, 294668, 202141, 251345, 372496, 59591, 393857, 246719, 233375, 245895, 215640, 203221, 247999, -16423, 51579, 131490, -23464, 18076, 56496, -61800, -12225, 204083, 116562, 147533, -375940, 33175, -2490, -196169, -298422, 118585, -404734, -212904, -50177, 118320, -356001, -183634, -226475, -105801, 13407, -53115, -408507, -297871, -88732, -164402, -64763, 125160, 152382, -115348, -354455, -146175, -50724, -36978, -257979, 213754, -113962, -240430, -72892, -167480, -235295, -8153, 446, -42352, 177119, -45227, 6068, -78757, -396427, -462250, -255208, 3281, 30786, 72870, 344904, -100313]
10191F5838i5866l4164k02525R1259J05285B97780d78724J39465a7642A38786
10180A69952a82875F1467a32941l80234b8380B91095a52595q608k91906a00126
10169F4803a54392L1563F4241b15722A19871b06574A8848a92876F2963a09050
10158a71636B03110h1501p9385A51472M3569F8682a69893e8574r8995f4465j81130
10147b45595c8460r7689B69796j23407j6509d28589j4497C04192h1114k619j40367
10136b24100A25289a09891B15312J00003H0989l0194O2882h9806A3191L9180c95379
10124A36626n777F157K1588a38335A19446f4874l68281A44038h1786I4937a13837
10112e9804B4594a45338c0550p818q9962B61507d6664k28492a11318K0107n8562
$$ y = [65838, -95866, -130030, -332555, -241296, -136011, 297780, -478724, -339259, -17642, 138786, 169952, -182875, 61467, -132941, -513175, -28380, 291095, -152595, -161203, -453109, -100126, 64803, -154392, -122829, 64241, -215722, 119871, -206574, 18848, -192876, 62963, -109050, -171636, 203110, -81501, -160886, 151472, 195041, 68682, -169893, -58574, -157569, -64465, -245595, -38460, -136149, 269796, 146389, 129880, -428589, -443086, 304192, -81114, -83733, -224100, 125289, -109891, 215312, 315315, 80989, 50795, 113677, -89806, 13191, 52371, -395379, 136626, 130849, 6157, 27745, -138335, 119446, -64874, -433155, 144038, -81786, 94937, -113837, -59804, 24594, -145338, -30550, -38368, -128330, 261507, -46664, -275156, -111318, -91211, -149773]
10101a49773A94194F3910j936c75524e8438k4625B7338e6243b0528l8508K4343
10090c4693k07060A27656K17179C7992b06740A88143i7899q1416A9926d0481B22433
10078b5056A40751Q0564j04532m1823d2281A7795g0411A02830O5311d0397j25423
10067a65820B9492b6226F8078a61819A15284a77871e0653B5618i9559j36077C51686
10055a11570k63930a3108o9788E3746a6726m2599l02188A21051c9134C24097c99738
10043f1676l23817J73925j498A01910Q5370a77563e6932j5910N649L1802k66296
10032c01687a33456D91390A02516b3583j86685B75109a46035P0712a523j46201
10022a47724d6878n7367K6217j54780A71126b7916l3512B11941b99504p652J27495
$$ y = [-149773, 194194, 63910, 61974, -375524, -58438, -83063, 27338, -56243, -20528, -59036, -34693, -241753, 127656, 344835, 37992, -206740, 188143, -97899, -179315, 19926, -40481, 222433, -25056, 140751, 221315, 116783, 74960, -42281, 17795, -70411, 102830, 168141, -40397, -165820, 29492, -26226, 68078, -161819, 115284, -177871, -50653, 25618, -99559, -235636, 351686, -111570, -375500, -13108, -82896, 53746, -16726, -59325, -361513, 121051, -39134, 324097, -399738, -61676, -385493, -211568, -213066, 101910, 187280, -177563, -56932, -72842, -67193, -35391, -301687, -133456, 491390, 102516, -23583, -210268, 275109, -146035, -75323, -1523, -147724, -46878, -104245, -78028, -232808, 171126, -27916, -61428, 211941, -299504, -307156, -179661]
10011a79661K3001d7323p1763m8609D9718d39282J91689c095F741g1293q782K1812
9999e8263A09970d3992A74987a30377j07773a04401A09138D1513b4507A50223
9988g6563A04577d6964A64475c12561M6288C9277h6613A7327a90033j82080A0761
9976b27745A761a27975d140A00098a3012j4356k20126A64545h1433J3382A55537
9964A91277C834J05070a31214D6343J62005B7333a37385o8992j33595a45095M4708
9953a00387J4110p9885L1895M2381j8480k69294f6335K7311j58457n1686J15574
9942a33593q8590k7815k1011i8821F3475c662C2547a26528C2183J78105b01401
9930c37351J65648A04372g5964j19098F7505O0819E821a15702k57694J38851Q048
$$ y = [-179661, -156660, -47323, -119086, -167695, 49718, -439282, -247593, -3095, 6741, -71293, -80075, -58263, 109970, -43992, 174987, -130377, -238150, -104401, 109138, 41513, -24507, 150223, -76563, 104577, -46964, 164475, -312561, -266273, 39277, -86613, 17327, -190033, -372113, 10761, -227745, 1761, -127975, -4140, 100098, -13012, -27368, -247494, 164545, -81433, -68051, 155537, 191277, 3834, 108904, -131214, 46343, 208348, 27333, -137385, -206377, -339972, -145095, -100387, -86277, -166162, -134267, -91886, -110366, -379660, -66335, -39024, -197481, -249167, -133593, -222183, -249998, -271009, -98821, 63475, -3662, 32547, -126528, 32183, 210288, -201401, -337351, -171703, 104372, -75964, -195062, 67505, 128324, 5821, -115702, -373396, -234545, -226497]
9919b26497B29695d7071p4360b9618o7239c6486i822j20412j86589d3603r5339
9908a38942o7707K2261H9747a81742A47363M4904o6032f7845A62404a86132m4303
9897b30435A43281d732j4450n1009l40985h6818a7898A6029L2442h3947l7993
9886a21940j99910H7732I909a53157j46031b2278F5847k4416b00481k44943B2873
9874a94123a1739l85682f4404k65163K6522c0052A44710i2217p6301a9140A40502
9862A49762c9363A64532a039l6535k30547B34636a06409A06141n0661c08863b7043
9850d0321A07724M39568i5988I3366N8632c21577J33997C10845b94610J42799
9840a51811N694m3499o1926e3728m4013B47983a88798b4086B10624b06126m1533
$$ y = [-226497, 229695, -47071, -121431, -29618, -96857, -36486, -9822, -130234, -316823, -43603, -138942, -206649, -184388, 89747, -181742, 147363, 192267, 126235, -67845, 162404, -186132, -230435, 143281, -4732, -19182, -70191, -411176, -86818, -17898, 16029, 48471, -83947, -121940, -321850, 87732, 9909, -153157, -299188, -22278, 65847, 41431, -200481, -445424, 22873, -194123, -11739, -397421, -64404, -329567, -303045, -30052, 144710, -92217, -168518, -19140, 140502, 149762, -39363, 164532, -1039, -37574, -268121, 234636, -106409, 106141, 55480, -308863, -27043, -40321, 107724, 547292, -95988, 93366, 151998, -321577, -187580, 310845, -294610, -151811, -146117, -189616, -251542, -53728, -97741, 247983, -188798, -24086, 210624, -206126, -247659]
9829b47659J15813o7935l4022a01186H558b27444B52226J5163i4172B35107f9537
9817C67940a90097j52176J09502D5825d05661g9410k60964h2387M0586j63591
9807b05392L3779B34208o0382i5238p0313M3563a2460o362o2767j78573i828k42036
9795b51864o5632N3003B5599K40078G0105l0889H853I25J86574e4437j17186g485
9782I3778b56193D1600O0265L1173B7700g3654A93734a96259r3376A50443b04794
9770a69363A7354b1846j24268j02446a19016B62415A21293J77468a56949d0624
9759c3889j26620B6144a45335j42854A18322e2047D1637c5665j81335A81140b38603
9747b10011l3022a00670k01384H9947A8913K9815Q5190N2443c32734C6275b83069
$$ y = [-247659, -131846, -199781, -233803, -101186, 8558, -227444, 252226, 267389, -94172, 235107, -69537, 367940, -190097, -342273, -232771, 45825, -405661, -79410, -340374, -82387, -41801, -205392, -171613, 234208, 173826, -95238, -165551, -121988, -12460, -18822, -81589, -260162, -9828, -251864, -317496, -264493, 25599, 265677, 70105, 39216, 8853, 925, 187499, -54437, -171623, -7485, 93778, -256193, 41600, 101865, 133038, 27700, -73654, 193734, -196259, -289635, 150443, -204794, -169363, 17354, -21846, -146114, -248560, -119016, 262415, 121293, 298761, -156949, -40624, -33889, -160509, 26144, -145335, -288189, 118322, -52047, 41637, -35665, -217000, 181140, -238603, -210011, -243033, -100670, -302054, 89947, 18913, 48728, 133918, 186361, -332734, 36275, -283069]
9735a43105m9474j27341p3231A24378l2434L3045c80938A63177k1919A8475L59935
9724C78410d58360J58583J12719e6992b4624j85038B86528l5109H0759a24887
9713b4693r8635A09366N8417b13025B23961g4452k87558A78875f3227n187j74485
9702b42899b0318f348n7545l0240A85460a38990j35172A56817O7975d2739e620
9690c27893A26704j6101a35361b3708r6930j22279P8835J3436l29700a20189k3450
9679a43639B7644a81653f4366J8089K526D8535P2914b56796f4663C5065a67410
9667G135J32892L7227a41681A45196b16695a05735F3639g0997D2787a25008l88853
9656e13861D5308Q5566a63407a6397j59442p0592A59117l5344h6845B01898d023
$$ y = [-143105, -192579, -319920, -393151, 124378, 91944, 124989, -380938, 163177, 141258, 18475, 378410, -458360, -299777, -187058, -56992, -24624, -209662, 286528, 251419, 80759, -124887, -24693, -123328, 109366, 167783, -213025, 223961, -74452, -362010, 178875, -63227, -68414, -242899, -20318, -6348, -63893, -94133, 185460, -138990, -274162, 156817, 224792, -42739, -5620, -327893, 126704, 110603, -135361, -23708, -120638, -242917, -164082, -150646, -480346, -120189, -143639, 27644, -181653, -64366, -46277, -43751, 48535, 121449, -256796, -64663, 35065, -167410, 7135, 140027, 177254, -141681, 145196, -216695, -105735, 63639, -70997, 42787, -125008, -513861, 45308, 130874, -163407, -16397, -175839, -246431, 159117, 123773, -86845, 201898, -4023]
9644h9615k5153d597j10177B7804f0585m9006C7979J77078M3486a37643L8600
9633i9043F3906b8622A16384Q6890E9787a7256A06535b17906E3009i2821E7573
9621d0669A76360c34918f1545p4790k59544J48487D1696g6528C8835l216i5485
9609h514D8279c45574P5773c3929m22808A5343J27192O5595a7930A8966b07702
9597a22172N2014k0070n6945l42399f7615j20391Q5358B50630I0077Q1856a41674
9585A752b61939f3221A0415P4828a22397q3622h0942j1368j10684A21445a33071
9573A77229p9078j6929J08541h0996j1069b475D1637a51389n7245j99039a99056
9561b6281p7301D0546a72909p4517k1378J05181J5334e0251B4069Q1654a53972
$$ y = [-89615, -114768, -4597, -114774, 27804, -60585, -109591, 37979, 215057, 258543, -137643, -99043, 63906, -28622, 116384, 203274, 59787, -17256, 106535, -217906, 53009, -92821, 57573, -40669, 176360, -334918, -61545, -136335, -395879, -247392, 41696, -76528, 38835, 35619, -95485, -8514, 48279, -345574, -269801, -33929, -456737, 15343, 142535, 208130, -17930, 18966, -207702, -122172, -70158, -90228, -147173, -489572, -67615, -188006, -102648, 250630, 90077, 171933, -141674, 1752, -261939, -63221, 10415, 85243, -122397, -206019, -80942, -92310, -202994, 121445, -133071, 177229, 98151, 81222, 189763, -80996, -92065, -2475, 41637, -151389, -208634, -407673, -199056, -26281, -103582, 40546, -172909, -247426, -268804, -163623, -148289, -50251, 24069, 105723, -153972]
9549D1175L0137b6532j02423a5497j38922F1559O3046K9588f1922D8077J17557
9538A65634c359j22701n7157l09175b07553j72021A04713e0575k68838A18805
9527A12568a97040A2901a44255O8559I9360a59934A8806o342a11318E2781c52530
9515A65490i6470L2583E5750a57796m5531B7986d828R52C82334d98068A11715
9503b20168g4078A1069a89471e6115l3917k5615A50814e5212E1702N9534a35925
9491h4047l11675a10412j30176M9922H5189J61801a4604I9024d0397A14146i6346
9479f535k49195j4323a03414A69840j9509c02847G6034p582c82438G8684a79543
9467a21971j88207A00886J43495f7194r705l7415M2668j32983B5179a67312F7257
$$ y = [41175, 71312, -26532, -128955, -15497, -154419, 61559, 124605, 154193, -61922, 48077, 165634, -3359, -126060, -183217, -492392, -207553, -379574, 104713, -50575, -319413, 118805, 112568, -197040, 12901, -144255, -75696, 99360, -159934, 18806, 12464, -111318, 52781, -352530, 165490, -96470, -63887, 55750, -157796, -203327, 27986, -4828, -3876, 382334, -498068, 111715, -220168, -74078, 11069, -189471, -56115, -90032, -115647, 150814, -55212, 51702, 111236, -135925, -84047, -395722, -110412, -240588, -190666, 85189, 246990, -14604, 99024, -40397, 114146, -96346, -6535, -255730, -270053, -103414, 169840, 150331, -302847, 76034, 68452, -382438, 78684, -179543, -121971, -310178, 100886, 244381, -67194, -76899, -114314, -71646, -204629, 25179, -167312, 67257]
9455a52862k4411b9128l77586A17323B4896f4245k04957A45065b50486C3681i2830
9443C11843A23225d39125a64352C32479c37214J0187a32337G444K11340f9245
9432a11072a3940b825E1445b09484m6238J20057M4497b5733k18614J19966N1466
9421g2915p809m6016E1582K7460a31121I2340L9991h5847A13434f169A49442E5656
9408B74329a31458A74464P1585c68639F1672a65819J2124A82450a93596B2984
9397C2647g8704k07657a28145G6816r914b63480O7280a4175A04881J6217O5150
9386A86248a53661f3017j6640B5791c8056E9802A0010j232c750j22011K6030c616
9373H7314b51583C758e33198K35652J25492e7954k6332k5272A85068g4508j88
$$ y = [-152862, -177273, -29128, -406714, 117323, 24896, -64245, -269202, 145065, -250486, 33681, -92830, 311843, 123225, -439125, -164352, 332479, -337214, -327027, -132337, 7444, 218784, -69245, -111072, -13940, -2825, 51445, -209484, -255722, -135665, -91168, -25733, -244347, -124381, -72915, -80724, -126740, 51582, 79042, -131121, 92340, 132331, -85847, 113434, -6169, 149442, 55656, 274329, -131458, 174464, 246049, -368639, 61672, -165819, -153695, 182450, -193596, 22984, 32647, -78704, -286361, -128145, 76816, 66902, -263480, -196200, -14175, 104881, 121098, 186248, -153661, -63017, -79657, 25791, -38056, 59802, 10010, 8778, -3750, -125761, -99731, -3616, 87314, -251583, 3758, -533198, -297546, -172054, -57954, -84286, -109558, 185068, -74508, -74696]
9362g4696l65600J80984B3900A482J81121H5985l5892h1098G4812J04910a03399
9350D5925c34708B3455b13003b2993D18885A96245a94300e5258j31802E4636g8873
9338D0020J3240c18093A72321a12443B41650a01437A55496b23319C9089A5529
9327a2623F9949a89368a2546j37229l1050l6303B29900b80548b2644j03655A10418
9315c9927j07871b7088p3360m1007B69099a19471m1503A5698L4373c25413d0173
9303A66644a83428c6397B39976j4214d5297A72240b21709A51384a44678D26681
9292B57296q9038B8505d39289f5928C49972a75224G3645P9639J02329E1595d8124
9280a46589O1680m21553N6750A65588p9026b55997h5011A8520b20547B8976L3385
$$ y = [-74696, -440296, -259312, 23900, 1482, 182603, 85985, 50093, -81098, 74812, 179722, -103399, 45925, -334708, 23455, -213003, -22993, 418885, 196245, -194300, -55258, -187060, 54636, -78873, 40020, 53260, -318093, 172321, -112443, 241650, -101437, 155496, -223319, 39089, 15529, -12623, 69949, -189368, -12546, -149775, -180825, -217128, 229900, -280548, -22644, -126299, 110418, -39927, -147798, -27088, -100448, -141455, 269099, -119471, -160974, 15698, 50071, -325413, -40173, 166644, -183428, -36397, 239976, 225762, -45297, 172240, -221709, 151384, -144678, 426681, 257296, 168258, 28505, -439289, -65928, 349972, -175224, 73645, 153284, 255613, 51595, -48124, -146589, -84909, -506462, -449712, 165588, 86562, -255997, -85011, 18520, -220547, 28976, 62361]
9269F2361j9247a93638I2674M400d81142D6663c66412h3276c2463q6534K0098
9258i8899j77245a25036j0775b4219G6427b77242f7297A00972c47795A24079f8509
9246a56330C9904a74653E6902a93693C02624b59008a9255H810b99633J01283p2542
9235b70892d6299A03486B7795D430N595J45408i2824q0072m9675A72946o5649
9224A07297J08583b37549A01885a8755k13789H8440e4430L409D6584h1224L0139
9213e1085N485c231q0081l10936e2011r5225d462A85994F853c3665q9154r1951
9201b14770A27551b1765q5590q926j50840h9782A00799M1200E3233Q5328m7766
9190I0795j8906a80055h3271o9621O7213r3251d0667l40076k8573c4677j96537
$$ y = [62361, 43114, -193638, 92674, 97074, -481142, 46663, -366412, -83276, -32463, -118997, -98899, -276144, -125036, -135811, -24219, 76427, -277242, -67297, 100972, -347795, 124079, -68509, -156330, 39904, -174653, 56902, -193693, 302624, -259008, -19255, 8810, -299633, -198350, -270892, -46299, 103486, 27795, 4430, 10025, 155433, -92824, -172896, -222571, 172946, 107297, 215880, -237549, 101885, -18755, -232544, 88440, -54430, -51021, 46584, -81224, -51085, -45600, -3231, -83312, -394248, -52011, -147236, -4462, 185994, 6853, -33665, -122819, -214770, 127551, -21765, -107355, -116281, -267121, -89782, 100799, 141999, 53233, 138561, 90795, 71889, -180055, -83271, -152892, -85679, -178930, -40667, -380743, -409316, -34677, -231214]
9179b31214n9009j5002A50291a9101E7478f1930j5357E9250a46829I7592e19034
9167a11182d4672A0181J43280a15746q4984h4109M0475C01282a06639j26889g1710
9155f0335o0613N570j56599f8877G9591c60407a14522n6789N641O5596a9334G000
9142B66624a52654b8074A80620b41714l043J21135F4389c03317A09144b19723
9131C1061f1409j46419e6753B3392a25725m2489H638a58707O27c9725A1370c95715
9118A70514h3307D37893b11107d4729j75772L6529F3759J62809H3926a2869C54968
9106a54528G9398C0664N1272b66354A28169L13126a33100A53610b9607A45089
9095D42391I7368a9984j19496k6170B42781a97152I5509b69578d8543j06577e3511
$$ y = [-231214, -290223, -305225, 150291, -19101, 57478, -61930, -77287, 59250, -146829, 97592, -519034, -111182, -44672, 10181, 153461, -115746, -200730, -84109, -43634, 301282, -106639, -233528, -71710, -60335, -120948, -115378, -271977, -68877, 79591, -360407, -114522, -171311, -165670, -100074, -19334, 7000, 266624, -152654, -28074, 180620, -241714, -244757, -123622, 64389, -303317, 109144, -219723, 31061, -61409, -207828, -56753, 23392, -125725, -168214, 8638, -158707, -158080, -39725, 11370, -395715, 170514, -83307, 437893, -211107, -44729, -220501, -183972, 63759, 226568, 83926, -12869, 354968, -154528, 79398, 30664, 81936, -266354, 128169, 441295, -133100, 153610, -29607, 145089, 442391, 97368, -19984, -139480, -165650, 242781, -197152, 95509, -269578, -48543, -155120, -53511]
9083e9455n6384j41044i1864C419c22208D0712f4595a3778o6173J4516A3302b03548
9070a56715O0443k9413n0496j99874a14673p489A70320f53A87630b8542k46434
9059b74976r8962a76914m5289l112b6864A31998J5349g565m48327I7186N3591
9048A50777a70756P4190k0085j29372c5723p8357r523A33174b37381n1805E1374
9036c56455e3405k46227B43295J49272j20860c4062i745j54564e7927j43957R2502
9025a09382O16C40291c35537i4327B31055K7471a18551a6471A87721j6613h5292
9013a08760c7907r031k82726G4807a41626e272n4289r8546C1041c0958H4959J76213
9001B61172f6046j78120A45158j2050b86850B16429d3585B3841M2306a25163p5986
$$ y = [-59455, -115839, -256883, -91864, 3419, -322208, 40712, -64595, -13778, -79951, -65435, 13302, -203548, -156715, -96272, -125685, -176181, -376055, -114673, -122162, 170320, -653, 187630, -28542, -274976, -373938, -176914, -222203, -225315, -26864, 131998, 147347, -7565, -455892, 97186, 150777, -170756, -96566, -116651, -246023, -35723, -114080, -123603, 133174, -237381, -289186, 51374, -356455, -53405, -299632, 243295, 392567, 271707, -34062, -9745, -164309, -57927, -201884, -109382, -108766, 340291, -335537, -94327, 231055, 258526, -118551, -16471, 187721, 171108, -85292, -108760, -37907, -46938, -329664, 74807, -141626, -5272, -59561, -158107, 31041, -30958, 84959, 261172, -66046, -244166, 145158, 133108, -286850, 216429, -43585, 23841, 66147, -125163, -201149]
8990b01149N4226I7976m5209p931a08752c961j47295f9647A6122g8231n0363r1373
8978b19967F2074a36975b3521D31933b54593r186J27289d925H1421K72726F7000
8966e469j20923j61212c5278A52046b07202J00072c2596m5158l28638J03254e811
8954f0201C7593j7415a2211m23862a64590I2200K4825K33204A38189a09182C06839
8942a52408j56507m5682a03666A17830d3997A0876P9756j2980J15060J88732b07437
8930a15060A24893m9841a37601O4222G4601M4987K15983R59823J083414K362027
8920D740835A827161F04514k70064D2663J10540a81783F0969b57346c4300C47964
8909B47291g1858C4686b5748j25227c2802G6512a43269e921k08529B32726B5221
$$ y = [-201149, -146923, 97976, 52767, 44836, -108752, -3961, -151256, -69647, 16122, -78231, -128594, -219967, 62074, -136975, -23521, 431933, -254593, -263779, -136490, -4925, 81421, 354147, 67000, -5469, -126392, -287604, -35278, 152046, -207202, -107130, -32596, -77754, -406392, -303138, -5811, -60201, 37593, 20178, -12211, -436073, -164590, 92200, 117025, 350229, 138189, -109182, 306839, -152408, -308915, -354597, -103666, 117830, -43997, 10876, 90632, 77652, 192712, 381444, -207437, -115060, 124893, 75052, -137601, -73379, 74601, 119588, 335571, 1295394, 2378808, 4740835, 1827161, 604514, 334450, 42663, 153203, -181783, 60969, -257346, -34300, 347964, 247291, -71858, 34686, -25748, -150975, -32802, 76512, -143269, -5921, -214450, 232726, 25221]
8897a03889d7259j97296L8394j26014e1500A74822C0570J19266a65617j49846
8887c15463B41160a30995J7183j72609j4157C24483d4342H5255a2166A85532A254
8875a04570d811q1661c5517F3893h9135k6836n029A26881e2913o8214B2229a20207
8862c0733G9721b45207I7913J8291B5205a73066G159N4769b06117D90869A45889
$$ y = [-103889, -47259, -244555, -206161, -332175, -51500, 174822, 30570, 149836, -165617, -315463, 241160, -130995, -113812, -286421, -300578, 324483, -44342, 85255, -12166, 185532, 1254, -104570, -4811, -86472, -35517, 63893, -89135, -115971, -121000, 126881, -52913, -121127, 22229, -120207, -30733, 79721, -245207, 97913, 116204, 25205, -173066, 7159, 61928, -206117, 490869, 145889]
$$ [...]
##END NTUPLES=NMR SPECTRUM
##END=
