##TITLE=AC1677_GUAAH14385_8571455_6ssWUDYM9Q
##JCAMPDX= 6.0         $$ Bruker NMR JCAMP-DX V2.0
##DATA TYPE= NMR SPECTRUM
##DATA CLASS= NTUPLES
##ORIGIN= BRUKER
##OWNER= Administrator
$$ 1.72 TOPSPIN		Version 2.1
$$ 2014-04-12 00:01:58.484 -0700  Administrator@X
$$ Compression mode = diff/dup
##.OBSERVE FREQUENCY= 400.02188249412
##.OBSERVE NUCLEUS= ^1H
##.ACQUISITION MODE= SIMULTANEOUS (DQD)
##.ACQUISITION SCHEME= undefined
##.AVERAGES= 64
##.DIGITISER RES= 22
##SPECTROMETER/DATA SYSTEM= spect
##.PULSE SEQUENCE= noesygpps1d.comp
##.SOLVENT NAME= COFFEE_meoh
##.SHIFT REFERENCE= INTERNAL, COFFEE_meoh, 1, 14.96117
##AUDIT TRAIL= $$ (NUMBER, WHEN, WHO, WHERE, PROCESS, VERSION, WHAT)
$$ ##TITLE= Audit trail, TOPSPIN		Version 2.1
$$ ##JCAMPDX= 5.01
$$ ##ORIGIN= Bruker BioSpin GmbH
$$ ##OWNER= Administrator
$$ $$ E:\/data/COFFEE/nmr/AC1677_GUAAH14385_8571455_6ssWUDYM9Q/12/pdata/1/auditp.txt
$$ ##AUDIT TRAIL=  $$ (NUMBER, WHEN, WHO, WHERE, PROCESS, VERSION, WHAT)
(   1,<2014-04-12 00:01:52.984 -0700>,<Administrator>,<X>,<go>,<TOPSPIN 2.1>,
      <created by zg
	started at 2014-04-11 23:50:22.871 -0700,
	POWCHK enabled, PULCHK disabled,
       configuration hash MD5:
       C8 4E 4E 5D D3 5C D8 9E 9F 52 82 E0 59 8A DE 15
       data hash MD5: 64K
       C6 AB 0C 74 5C EF 06 2D 56 23 7D 6E EC C1 E2 CC>)
(   2,<2014-04-12 00:01:56.093 -0700>,<Administrator>,<X>,<proc1d>,<TOPSPIN 2.1>,
      <Start of raw data processing
       efp LB = 0.3 FT_mod = 6 PKNL = 1 PHC0 = 0 PHC1 = 0 SI = 128K 
       data hash MD5: 128K
       C0 DD 1B 57 8D 0D 79 6D 29 8B 30 7A B9 60 BC 5F>)
(   3,<2014-04-12 00:01:57.172 -0700>,<Administrator>,<X>,<proc1d>,<TOPSPIN 2.1>,
      <pk PHC0 = -82.23816 PHC1 = 0 
       data hash MD5: 128K
       2B A6 EE 94 BD 2C 45 9A DA 8B 23 A0 4D AF D0 53>)
(   4,<2014-04-12 00:01:57.781 -0700>,<Administrator>,<X>,<proc1d>,<TOPSPIN 2.1>,
      <abs ABSG = 1 
       data hash MD5: 128K
       DB 58 19 75 67 7A E5 EC 7E FF 89 16 68 8F 9D 9B>)
(   5,<2014-04-12 00:01:57.906 -0700>,<Administrator>,<X>,<proc1d>,<TOPSPIN 2.1>,
      <abs ABSG = 2 
       data hash MD5: 128K
       03 81 2F 8C D0 1D 19 F4 B3 35 B2 72 4A 47 86 35>)
(   6,<2014-04-12 00:01:58.015 -0700>,<Administrator>,<X>,<proc1d>,<TOPSPIN 2.1>,
      <abs ABSG = 3 
       data hash MD5: 128K
       FD 3F 86 0B B2 AD 1E D3 3E 09 30 07 11 AD 89 5F>)
(   7,<2014-04-12 00:01:58.109 -0700>,<Administrator>,<X>,<proc1d>,<TOPSPIN 2.1>,
      <abs ABSG = 4 
       data hash MD5: 128K
       8A 02 52 4E 99 1A E5 C2 01 DC 3C E5 E4 EF CF D2>)
(   8,<2014-04-12 00:01:58.234 -0700>,<Administrator>,<X>,<proc1d>,<TOPSPIN 2.1>,
      <abs ABSG = 5 
       data hash MD5: 128K
       C8 4E AE 05 5D 80 06 8B 39 97 FF A1 94 43 32 FC>)
$$ ##END=
$$ 
$$ $$ hash MD5
$$ $$ 0F 39 B6 0C BE 21 DF BF F6 56 CE 75 34 E8 DC E2
##$RELAX= 
##$RELAX= 
##$RELAX= 
##$RELAX= 
##$RELAX= 
##$RELAX= 
##$RELAX= 
##$RELAX= 
$$ Bruker specific parameters
$$ --------------------------
##$DU= <E:\>
##$EXPNO= 12
$$ [...]
##$TP07= 0
##$TPNAME0= <>
##$TPNAME1= <>
##$TPNAME2= <>
##$TPNAME3= <>
##$TPNAME4= <>
##$TPNAME5= <>
##$TPNAME6= <>
##$TPNAME7= <>
##$TPOAL= (0..7)
0.5 0.5 0.5 0.5 0.5 0.5 0.5 0.5
##$TPOFFS= (0..7)
0 0 0 0 0 0 0 0
##$TUNHIN= 0
##$TUNHOUT= 0
##$TUNXOUT= 0
##$USERA1= <user>
##$USERA2= <user>
##$USERA3= <user>
##$USERA4= <user>
##$USERA5= <user>
##$V9= 5
##$VALIST= <valist>
##$VCLIST= <CCCCCCCCCCCCCCC>
##$VD= 0
##$VDLIST= <DDDDDDDDDDDDDDD>
##$VPLIST= <PPPPPPPPPPPPPPP>
##$VTLIST= <TTTTTTTTTTTTTTT>
##$WBST= 1024
##$WBSW= 4
##$XGAIN= (0..3)
0 0 0 0
##$XL= 0
##$YL= 0
##$YMAX_a= 6224799
##$YMIN_a= -12978952
##$ZGOPTNS= <>
##$ZL1= 120
##$ZL2= 120
##$ZL3= 120
##$ZL4= 120
##$ABSF1= 14.96117
##$ABSF2= -5.597012
##$ABSG= 5
##$ABSL= 3
##$ALPHA= 0
##$AQORDER= 0
##$ASSFAC= 0
##$ASSFACI= 0
##$ASSFACX= 0
##$ASSWID= 0
##$AUNMP= <proc_prof1d_extract.lims>
##$AXLEFT= 0
##$AXNAME= <>
##$AXNUC= <1H>
##$AXRIGHT= 0
##$AXTYPE= 0
##$AXUNIT= <>
##$AZFE= 0.1
##$AZFW= 0.1
##$BCFW= 0
##$BC_mod= 0
##$BYTORDP= 0
##$COROFFS= 0
##$CY= 15
##$DATMOD= 1
##$DC= 0
##$DFILT= <>
##$DTYPP= 0
##$F1P= 0
##$F2P= 0
##$FCOR= 0.5
##$FTSIZE= 131072
##$FT_mod= 6
##$GAMMA= 0
##$GB= 0
##$INTBC= 1
##$INTSCL= 1
##$ISEN= 128
##$LB= 0.3
##$LEV0= 0
##$LPBIN= 0
##$MAXI= 10000
##$MC2= 0
##$MEAN= 0
##$ME_mod= 0
##$MI= 0
##$NCOEF= 0
##$NC_proc= -2
##$NLEV= 6
##$NOISF1= 0
##$NOISF2= 0
##$NSP= 0
##$NTH_PI= 0
##$NZP= 0
##$OFFSET= 14.96117
##$PC= 1
##$PHC0= -82.23816
##$PHC1= 0
##$PH_mod= 1
##$PKNL= yes
##$PPARMOD= 0
##$PPDIAG= 0
##$PPIPTYP= 0
##$PPMPNUM= 2147483647
##$PPRESOL= 1
##$PSCAL= 4
##$PSIGN= 0
##$PYNMP= <proc.py>
##$REVERSE= no
##$SF= 400.020009570071
##$SI= 131072
##$SIGF1= 0
##$SIGF2= 0
##$SINO= 400
##$SIOLD= 131072
##$SPECTYP= <>
##$SREGLST= <1H.CDCl3>
##$SSB= 0
##$STSI= 131072
##$STSR= 0
##$SW_p= 8223.68421052631
##$SYMM= 0
##$S_DEV= 0
##$TDeff= 65536
##$TDoff= 0
##$TI= <>
##$TILT= no
##$TM1= 0
##$TM2= 0
##$TOPLEV= 0
##$USERP1= <user>
##$USERP2= <user>
##$USERP3= <user>
##$USERP4= <user>
##$USERP5= <user>
##$WDW= 1
##$XDIM= 131072
##$YMAX_p= 352466245
##$YMIN_p= -12257
##$CURPLOT= <Network HP LaserJet P1505>
##$CURPRIN= <$Network HP LaserJet P1505>
##$DFORMAT= <normdp>
##$LAYOUT= <+/1D_H.xwp>
##$LFORMAT= <normlp>
##$PFORMAT= <normpl>
##$SURQMSG= 1
$$ End of Bruker specific parameters
$$ ---------------------------------
##NTUPLES= NMR SPECTRUM
##VAR_NAME=  FREQUENCY,     SPECTRUM/REAL,   SPECTRUM/IMAG
##SYMBOL=    X,             R,               I
##VAR_TYPE=  INDEPENDENT,   DEPENDENT,       DEPENDENT
##VAR_FORM=  AFFN,          ASDF,            ASDF
##VAR_DIM=   131072,        131072,          131072
##UNITS=     HZ,            ARBITRARY UNITS, ARBITRARY UNITS
##FACTOR=    0.0627417313425164, 1,          1
##FIRST=     8223.62146879497, -941,         -60705
##LAST=      0,             1444,            -61459
##MIN=       0,             -12257,          0
##MAX=       8223.62146879497, 352466245,    0
$$ Real data points
##PAGE= N=1
##DATA TABLE= (X++(R..R)), XYDATA
$$ [...]
61672D25996k699j125k44k46j76N45J235R70p4r50j310j562j733j186J76J296
61656D18913J294P28P32J426K077K408K731K942K503J583J168J688K347K195J271
61641D46006K95k31k26J69O29Q20P85Q11Q36M78k38p19p10p65j428k366k784k413
61623D38949j764j564k170l292m166m247l790l479l512l545l424l351l272k827
61609C94546k060j505j366j360j593k726m778o504o689n511m071l094k645k603
61595C48041k695k524k151k270l176m002l692k399j215q01r12j106j207j170j021
61580C17700r11q53n89p8K06o9n33p11p76j081j293p92K96J155J294Q81K97q2
61562C14061J32R03J540J583J525J899K109J305J46K24J592K403J538K17P3P92
$$ plain form
61672 425996 423297 422172 421928 421682 421506 422051 423286 424256 424182 423232 421922 420360 418627 417441 417617 418913
61656 418913 420207 420935 421667 423093 425170 427578 430309 433251 435754 437337 438505 440193 442540 444735 446006
61641 446006 446301 446070 445844 446013 446642 447462 448247 449058 449894 450372 450134 449415 448705 447940 446512 444146 441362 438949
61623 438949 437185 435621 433451 430159 425993 421746 417956 414477 410965 407420 403996 400645 397373 394546
61609 394546 392486 390981 389615 388255 386662 383936 379158 372654 365965 360454 356383 353289 350644 348041
61595 348041 345346 342822 340671 338401 335225 331223 327531 325132 323917 323116 322204 321098 319891 318721 317700
61580 317700 316789 315936 315347 315269 315475 315406 314873 314162 313386 312305 311012 310220 310516 311671 312965 313846 314143 314061
61562 314061 314193 315096 316636 318219 319744 321643 323752 325057 325203 325427 327019 329422 330960 331177 331250 332042
61546C32042R13K07k18J25M36J28j69L23J282J759J480R97P69P52Q62J259J942
61529C44889K415K155J185j1r90j573j768j785j964k360k507j990j088m29j58
61514C34021M6K24J11j62p3L64M36j40o86n60l7L42N81Q27P71L01J29Q38J679
61495C39012J413J78n57O9J353K209K383K085J324J62q44j081n75J53P34J126
61479C49144J325J246R96R37J354K045K440K246J826J699J775J475O17k60o85
61464C68180q75j249j725j927j793j564j332j041p45n44l53N4Q04J853K863L222
61448C63828K599J567J094J234J146O04N38J508K587K686K107J767J653J176N74
61433C86668N66R88J083R65J451K413K710J951J046O49L21l41p95m71K66P38Q42
$$ plain form
61546 332042 332955 333162 332944 333069 333505 333633 333464 333787 335069 336828 338308 339305 340074 340826 341688 342947 344889
61529 344889 347304 349459 350644 350633 349643 348070 346302 344517 342553 340193 337686 335696 334608 334179 334021
61514 334021 334067 334291 334402 334240 334167 334531 334967 334827 334141 333581 333544 333886 334467 335294 336065 336366 336495 337333 339012
61495 339012 340425 340603 340046 340115 341468 343677 346060 348145 349469 349631 348787 347706 347131 347284 348018 349144
61479 349144 350469 351715 352711 353648 355002 357047 359487 361733 363559 365258 367033 368508 369125 368865 368180
61464 368180 367305 366056 364331 362404 360611 359047 357715 356674 355929 355385 355032 355086 355890 357743 360606 363828
61448 363828 366427 367994 369088 370322 371468 372072 372610 374118 376705 379391 381498 383265 384918 386094 386668
61433 386668 387234 388222 389305 390270 391721 394134 396844 398795 399841 400490 400811 400470 399675 399204 399470 400208 401050
61416D01050Q45Q31Q11Q44P28M8j090k039k489k788l044k761j779q79q01j193
61400C86294j215p55m34n83q59q00l93J0J27O5J89N93Q51N99J09j07o3r7p2N00
61380C83959J537K336K548K561K743K988L122L162L004K504K020K107K571K547
61366D19709J780J079J118J606J967K138K261K278K254K466K806K745K279K201
61352D48687K986M107M917N485O060O409O297O002N738N205M271L457L126K900
61338E15647K486K401L070L868L923L344K757K171J247K45l39p44j517k342k351
61323E33866j534q52q76j200j281j087o99n6P91J700K825M424O179P312P508P207
61307E64227O973P024P429Q151Q861R200R272R377R324Q559P007N115L045N65
$$ plain form
61416 401050 401895 402726 403537 404381 405109 405157 404067 402028 399539 396751 393707 390946 389167 388288 387487 386294
61400 386294 385079 384324 383890 383307 382448 381648 381255 381265 381392 381457 381646 382239 383090 383689 383798 383691 383628 383531 383459 383959
61380 383959 385496 387832 390380 392941 395684 398672 401794 404956 407960 410464 412484 414591 417162 419709
61366 419709 421489 422568 423686 425292 427259 429397 431658 433936 436190 438656 441462 444207 446486 448687
61352 448687 451673 455780 460697 466182 472242 478651 484948 490950 496688 501893 506164 509621 512747 515647
61338 515647 518133 520534 523604 527472 531395 534739 537496 539667 540914 541159 540820 540076 538559 536217 533866
61323 533866 532332 531480 530604 529404 528123 527036 526337 526281 527072 528772 531597 536021 542200 549512 557020 564227
61307 564227 571200 578224 585653 593804 602665 611865 621137 630514 639838 648397 655404 660519 663564 664129
61293F64129k113m194n296n933o602p066p068p106p784q739r013q337p339o515
61279E71024n653m441l064j921j107m82K9N14J206K248L355M095M398M590M939
61264E79730N414N812N870N320M243L333L377M329N304N664N623N544N202M213
61250F48978K769J448N03j64o08q68j144j524j778j809k003k650l374l682l662
61235F30432l569l150k140r86k35L69J251J932J817J650K696M609N618N066M188
61220F49548M015M060L744L606M200M972N285N540O267O945O713N583M122K624
61206G17224J453J418K760M337M792M195L727M121N123O131O706O780O892P759
61192G83418R229J0330J0720J1142J1907J1981J0440P831N176K667L29j086j258
$$ plain form
61293 664129 662016 657822 652526 646593 639991 632925 625857 618751 610967 602228 593215 584878 577539 571024
61279 571024 565371 560930 557866 555945 554838 554356 554385 554899 556105 558353 561708 565803 570201 574791 579730
61264 579730 585144 590956 596826 602146 606389 609722 613099 617428 622732 628396 634019 639563 644765 648978
61250 648978 651747 653195 653698 653534 652926 652058 650914 649390 647612 645803 643800 641150 637776 634094 630432
61235 630432 626863 623713 621573 620587 620352 620721 621972 623904 625721 627371 630067 634676 640294 645360 649548
61220 649548 653563 657623 661367 664973 669173 674145 679430 684970 691237 698182 704895 710478 714600 717224
61206 717224 718677 720095 722855 727192 731984 736179 739906 744027 749150 755281 761987 768767 775659 783418
61192 783418 792647 802977 813697 824839 836746 848727 859167 866998 872174 874841 875170 874084 872826
61179H72826j416k785m612n321m991n061n971o870p442q271r351r835r550r297
61165G82053r443r509r416r732j0424j0660j0277j0118j0430j0232q957p564p185
61152F58106p529p498o720n631m558l505k543j840j436j377j855k914m201n240
61138F01259n727n564m888m100l539l014j996k87J720L405M421M974N840P707
61124F00211J0203J2053J2651J2912J4005J5777J7276J8270J9239K0209K0779
61113G73585K1157K2021K3287K4010K3629K2461K0926J9149J7423J6120J4962
61102I98730J3164J0490P518M805K421K80j763m107p010j0089j2847j5406j7942
61089I68244j9872k0623k0843k1547k2295k1726j9876j8483j8605j9303j9131
$$ plain form
61179 872826 871410 868625 864013 858692 853701 848640 842669 835799 828357 820086 810735 800900 791350 782053
61165 782053 772610 763101 753685 743953 733529 722869 712592 702474 692044 681812 672855 665291 658106
61152 658106 650577 643079 636359 630728 626170 622665 620122 618282 616846 615469 613614 610700 606499 601259
61138 601259 595532 589968 585080 580980 577441 574427 572431 572144 573864 577269 581690 586664 592504 600211
61124 600211 610414 622467 635118 648030 662035 677812 695088 713358 732597 752806 773585
61113 773585 794742 816763 840050 864060 887689 910150 931076 950225 967648 983768 998730
61102 998730 1011894 1022384 1029902 1034707 1037128 1037408 1035645 1031538 1024528 1014439 1001592 986186 968244
61089 968244 948372 927749 906906 885359 863064 841338 821462 802979 784374 765071 745940
61078G45940j7771j5773j3699j2012j0857r670p906o171n566n783n220l295j238
61065F30979j58K65O42Q76J121K317M764P216Q420Q698R126R944J0718J1378J2182
61050G18488J3162J4293J5687J7176J8298J9109K0229K1692K2732K3096K3611
61039I27573K4839K6243K7306K8391K9826L1132L1995L2987L4475L5739L6099
61028A266605L6061L6506L7580L9205M1779M5456M9463N2991N6075N9021O1954
61017A782696O5613P1429Q0129R1398J05678J24813J49861J79857K14066K54030
61007C119570L01937L58442M23357M96238N73623O47408P09287P56719P92992
60998H179573Q23814Q57378R05611R79431J082485J214442J377410J563045J720698
$$ plain form
61078 745940 728169 712396 698697 686685 675828 666158 658252 652081 646515 640732 635512 632217 630979
61065 630979 630821 631086 631728 632604 633725 636042 640806 648022 656442 665140 674266 684210 694928 706306 718488
61050 718488 731650 745943 761630 778806 797104 816213 836442 858134 880866 903962 927573
61039 927573 952412 978655 1005961 1034352 1064178 1095310 1127305 1160292 1194767 1230506 1266605
61028 1266605 1302666 1339172 1376752 1415957 1457736 1503192 1552655 1605646 1661721 1720742 1782696
61017 1782696 1848309 1919738 1999867 2091265 2196943 2321756 2471617 2651474 2865540 3119570
61007 3119570 3421507 3779949 4203306 4699544 5273167 5920575 6629862 7386581 8179573
60998 8179573 9003387 9860765 10766376 11745807 12828292 14042734 15420144 16983189 18703887
60989A8703887J748528J545478J096232N07862m7544m34880o10025n95719m38308
60980B1475511k06986j5690O59k32509o65407j149689j533774j740966j776921
60971A4154228j689884j533647j351872j173344j010850q66022p37683o25693
60963E165233n29353m46539l75751l16992k69865k32398k02306j78161j58806
60954B455062j42744j28805j16653j06137r6662q7563p8726p0521o3355n7442
60944A506454n2846m9567m7636m6908m6723m6012m4122m1420l8818l6768l4968
60933A020666l2959l0757k8802k7341k5977k4000k1284j8618j6879j6042j5371
60922G62636j4412j3292j2127j0844r571q656q054p275o211n429n324n444n069
$$ plain form
60989 18703887 20452415 21997893 23094125 23601987 23554443 23119563 22509538 21913819 21475511
60980 21475511 21268525 21252835 21253494 21020985 20355578 19205889 17672115 15931149 14154228
60971 14154228 12464344 10930697 9578825 8405481 7394631 6528609 5790926 5165233
60963 5165233 4635880 4189341 3813590 3496598 3226733 2994335 2792029 2613868 2455062
60954 2455062 2312318 2183513 2066860 1960723 1864061 1776498 1697772 1627251 1563896 1506454
60944 1506454 1453608 1404041 1356405 1309497 1262774 1216762 1172640 1131220 1092402 1055634 1020666
60933 1020666 987707 956950 928148 900807 874830 850830 829546 810928 794049 778007 762636
60922 762636 748224 734932 722805 711961 702390 693734 685680 678405 672194 666765 661441 655997 650928
60909F50928m169l288k680k046j098j25K28l01j151j457j043o49q92j399j382
60894F29476q65o52j161j932k452k852l538m512n348n607n208m587m448n042n792
60879E75480o066o084o528p356p733p209o308n727n566n530n313m624l431k336
60865D95669k067k344k027p59K94K5r73j097K18J989L016L039K560K127J959J909
60849E03538J662J168Q46J041J415J266M91j81j64J43j16j071j980k313k455k931
60833E00359l388l011j845r39r53j309j186p68q82j653k312k186j401n69k02m48
60817D77307j020j480j782k320l201l798l540k792k356k405k581k858l504m267
60803D39403m498m113l692l560l516l514l780m092l763k707j748j525j704j679
$$ plain form
60909 650928 646759 643471 640791 638745 637647 637522 637750 637449 636298 634841 633798 633149 632257 630858 629476
60894 629476 628611 627959 626798 624866 622414 619562 616024 611512 606164 600557 595349 590762 586314 581272 575480
60879 575480 569414 563330 556802 549446 541713 534504 528196 522469 516903 511373 506060 501436 498005 495669
60865 495669 493602 491258 489231 488472 488766 488791 487818 486721 486939 488928 491944 494983 497543 499670 501629 503538
60849 503538 505200 506368 507214 508255 509670 510936 511427 511246 511082 511225 511109 510038 508058 505745 503290 500359
60833 500359 496971 493960 492115 491176 490223 488914 487728 486960 486078 484425 482113 479927 478526 477957 477755 477307
60817 477307 476287 474807 473025 470705 467504 463706 460166 457374 455018 452613 450032 447174 443670 439403
60803 439403 434905 430792 427100 423540 420024 416510 412730 408638 404875 402168 400420 398895 397191 395512
60789C95512j435j295j320j409j572j711j488p70N4N22O00N27N03O73J055J358
60773C89804J225P67M81N86R06J464K471L633M145L764L190L021K989K658K259
60758D23363K174K132J648Q82L93K14j44q48j512j812j862j842j625j004j06M69
60742D20520Q5j242k676l321l176l072l593m511n309n768n758m985l498k082j610
60727C70004j980k230j759j039q70j234j301o53Kk25j019j166l03N21L73k44l40
60710C56537K0R5j50j14K11K79J31M44J300K007K241K384K554K409K123K379L071
60693C77921L178K379J658J723K010J950K043K744L305K909K096J905K214K074
60679D10109J299O18M67N83O28M70O4l02rR76J621J020l62j375j703j873k158
$$ plain form
60789 395512 394077 392782 391462 390053 388481 386770 385282 384512 384566 385088 385688 386215 386718 387391 388446 389804
60773 389804 391029 391796 392277 392863 393769 395233 397704 401337 405482 409246 412436 415457 418446 421104 423363
60758 423363 425537 427669 429317 430199 430592 430806 430662 429814 428302 426490 424628 422786 421161 420157 420051 420520
60742 420520 420605 419363 416687 413366 410190 407118 403525 399014 393705 387937 382179 377194 373696 371614 370004
60727 370004 368024 365794 364035 362996 362126 360892 359591 358938 358940 358715 357696 356530 356227 356748 357121 356877 356537
60710 356537 356557 356652 356502 356388 356599 356878 357009 357453 358753 360760 363001 365385 367939 370348 372471 374850 377921
60693 377921 381099 383478 385136 386859 388869 390819 392862 395606 398911 401820 403916 405821 408035 410109
60679 410109 411408 412026 412493 413076 413704 414174 414238 413936 413927 414903 416524 417544 417182 415807 414104 412231 410073
60662D10073k455k894l634m224m079l435k967k611j786o13Q7O5l2K33N10M33J89
60645C82860J55M65J109J820J897P88j011k270k415k037j973k335k607k223j073
60630C71150K10N71l43j517j644p02K01M01K51J88J77K49P01J440J853J688J397
60613C76271J324J184O72j4o21j234j822j937j313l63L40O67P60O75N65P85J373
60596C77312J759J441O77J23N9L07P65J446K147K448K187J699J479J724K156K334
60580D00063K114J779J602J488J232J028J265J916K536K959L550M528N521O060
60566D37641O227O490P056P681Q074Q220Q286Q306Q022P133N705M148K681J037
60552E26707r52k766l611l355k602j812q67M48K042L708N304O550P172P424Q036
$$ plain form
60662 410073 407618 404724 401090 396866 392787 389352 386385 383774 381988 381375 381462 381527 381495 381728 382238 382671 382860
60645 382860 383015 383480 384589 386409 388306 389094 388083 385813 383398 381361 379388 377053 374446 372223 371150
60630 371150 371360 371931 371588 370071 368427 367725 367926 368327 368578 368766 368943 369192 369893 371333 373186 374874 376271
60613 376271 377595 378779 379451 379437 378816 377582 375760 373823 372510 372147 372487 373154 373914 374589 375154 375939 377312
60596 377312 379071 380512 381189 381312 381371 381678 382443 383889 386036 388484 390671 392370 393849 395573 397729 400063
60580 400063 402177 403956 405558 407046 408278 409306 410571 412487 415023 417982 421532 426060 431581 437641
60566 437641 443868 450358 457414 465095 473169 481389 489675 497981 506003 513136 518841 522989 525670 526707
60552 526707 525755 522989 519378 516023 513421 511609 510742 511190 513232 516940 522244 528794 535966 543390 551426
60537E51426R265J0436J0834J0722J1015J2134J3622J4745J5053J4308J2339R224
60525F95123N483J842j292m052o661q802r745r307q387q049q201p788o317m550
60511F19297l425k867k083o12J427L779O189Q297R929J1484J3545J6159J8861
60498F99980K1347K3718K6069K8326L0604L3131L5636L7206L7129L5577L3176
60487A041899L0234K6787K3051J9217J4908R438K724m488j1439j7998k4333l0414
60475A079586l6032m0876m4373m5893m5445m3829m1688l8908l5351l1647k8508
60464F47036k5663k2467j9301j7261j6365j5232j3020j0642r361q991q366p101
60452D73266n931n441n322m955m184l308k665k349k187k020j916j981k031j796
$$ plain form
60537 551426 560691 571127 581961 592683 603698 615832 629454 644199 659252 673560 685899 695123
60525 695123 700606 702448 701156 697104 690443 681641 671896 662589 654202 646153 637952 630164 623847 619297
60511 619297 615872 613005 610922 610310 611737 615516 621705 630002 639931 651415 664960 681119 699980
60498 699980 721327 745045 771114 799440 830044 863175 898811 936017 973146 1008723 1041899
60487 1041899 1072133 1098920 1121971 1141188 1156096 1165534 1168258 1163770 1152331 1134333 1110000 1079586
60475 1079586 1043554 1002678 958305 912412 866967 823138 781450 742542 707191 675544 647036
60464 647036 621373 598906 579605 562344 545979 530747 517727 507085 497724 488733 480367 473266
60452 473266 467335 461894 456572 451617 447433 444125 441460 439111 436924 434904 432988 431007 428976 427180
60438D27180j468j475j671j368m18M30N98L66P3n76j671k388k025j205j037j463
60422D11882j519r46m45l95m27k23J16O19J382J937J631P40K58M24M96K06L30
60405D16066J323K455K950L073L291L179K162Q38M69J307K321K622K397K276K319
60390D49048K122J624J460K219L483M013L171J889J638K602L537L490K801K185
60376D85282J715J229J087J680K585K976K683K221J851J366P74N42Q95J363J361
60361E09610R52P48J195K114K913L120K718K094J687J710K106K742L530M379N035
60346E46653N153M690M104L887L855L276J846J05j339k569l901n124n783n964
60332E48889o088o102n565m551l774l684m008m282m229l635k539j631j650k224
$$ plain form
60438 427180 425712 424237 422566 421198 420780 421210 421808 422174 422247 421671 420000 417612 415587 414382 413345 411882
60422 411882 410363 409417 408972 408577 408150 407927 408043 408662 410044 411981 413612 414352 414610 415034 415530 415736 416066
60405 416066 417389 419844 422794 425867 429158 432337 434499 435337 435806 437113 439434 442056 444453 446729 449048
60390 449048 451170 452794 454254 456473 459956 463969 467140 469029 470667 473269 476806 480296 483097 485282
60376 485282 486997 488226 489313 490993 493578 496554 499237 501458 503309 504675 505449 505991 506886 508249 509610
60361 509610 510562 511310 512505 514619 517532 520652 523370 525464 527151 528861 530967 533709 537239 541618 546653
60346 546653 551806 556496 560600 564487 568342 571618 573464 573569 572230 569661 565760 560636 554853 548889
60332 548889 542801 536699 531134 526583 522809 519125 515117 510835 506606 502971 500432 498801 497151 494927
60318D94927k044n82J213K318K948L781M643M921M838N355O848Q599R736J0080
60304E57581J0010R909R931J0063J0319J0837J1590J1913J0769P856M218J241
60292F66237r00l298o885j1194j4685j6114j5580j4259j3114j1975j0131p643
60280E40459n463m189l358k405j694j940l021m056m524m620m597m395m032l751
60266D88414l639l532l385l361l381l030k131j133o47q21j340j861k184k164j744
60251D54061j115o28m33k71K26J079J864K149J954J717J793K088K185J800J102
60236D69571O18P17J222J618J671J626J677J639J440J551K380L432L771L327L044
60221D99304L604M616N373N770O071O225O027N695N723O252O943P442P675P753
$$ plain form
60318 494927 492883 492301 493514 495832 498780 502561 507204 512125 516963 522318 529166 537765 547501 557581
60304 557581 567591 577500 587431 597494 607813 618650 630240 642153 652922 660778 664996 666237
60292 666237 665337 662039 655154 643960 629275 613161 597581 583322 570208 558233 548102 540459
60280 540459 534996 530807 527449 525044 523350 521410 518389 514333 509809 505189 500592 496197 492165 488414
60266 488414 484775 481243 477858 474497 471116 468086 465955 464822 464175 463354 462014 460153 457969 455805 454061
60251 454061 452946 452318 451885 451614 451840 452919 454783 456932 458886 460603 462396 464484 466669 468469 469571
60236 469571 470189 470906 472128 473746 475417 477043 478720 480359 481799 483350 485730 489162 492933 496260 499304
60221 499304 502908 507524 512897 518667 524738 530963 536990 542685 548408 554660 561603 569045 576720 584473
60207E84473P824P960Q002P694P061O504O312O318O147N595M629L317K006J244
60193F65086J226J511J516J066K46q43j927k539k618k789l504m272m371m088m457
60178F39243n685o733o701n958n396n087m428l327k539k606l074l048k303j402
60164E80956q93p81q16q94r63q55n69m63q02j201r75j1J024J438J139N07k5j30
60146E75686L53J278K243K927L255L254K969K569K327K450L016L963M977N579
60132F16846N647N653N934O018N277M098L557L869M017L250K175J880K547L522
60118F74290M278M730M821M422L631K811K253J912J422M73o05r08j01P43K12j553
60102G02831k989l249l182l741m493m473l722l050k819k830k991l270l302k820
$$ plain form
60207 584473 592297 600257 608259 615953 623014 629518 635830 642148 648295 653890 658519 661836 663842 665086
60193 665086 666312 667823 669339 670405 670651 669808 667881 665342 662724 659935 656431 652159 647788 643700 639243
60178 639243 633558 626825 620124 614166 608770 603683 599255 595928 593389 590783 587709 584661 582358 580956
60164 580956 580063 579282 578466 577572 576609 575754 575185 574722 573920 572719 571744 571733 572757 574195 575334 575841 575816 575686
60146 575686 576039 577317 579560 582487 585742 588996 591965 594534 596861 599311 602327 606290 611267 616846
60132 616846 622493 628146 634080 640098 645375 649473 653030 656899 660916 664166 666341 668221 670768 674290
60118 674290 678568 683298 688119 692541 696172 698983 701236 703148 704570 705043 704438 703530 703429 704172 704384 702831
60102 702831 699842 696593 693411 689670 685177 680704 676982 673932 671113 668283 665292 662022 658720 655900
60088F55900k180j804j442o64J95M23n3p30j451k435l510m101l935l281k593k379
60072F25960l121m657n958o245o101o582p564p892p103n979n257m784m222l694
60058E46801l356l018k569k244k137j945j431p39m5O29J128J196R87J054J619
60043E35930K368L122M138N508O709P131O714N823M768L695K641J523L05p00j096
60028E88579j030j165j859k749l409l977m858n961o673o495n618m833m805n393
60014E29754n800n562n151n253n734n829n226m417l947l838l770l450k745j803
60000D67229j051o83l13M26J163J347J273J668K347K319J476J038J815K964L237
59985D86255K723K424K602K568J947J272J130J377J372O58p16k277l372l568k954
$$ plain form
60088 655900 653720 651916 650474 649810 650005 650428 650375 649645 648194 645759 642249 638148 634213 630932 628339 625960
60072 625960 622839 618182 612224 605979 599878 593296 585732 577840 570737 564758 559501 554717 550495 546801
60058 546801 543445 540427 537858 535614 533477 531532 530101 529362 529317 529946 531074 532270 533257 534311 535930
60043 535930 538298 541420 545558 551066 557775 564906 571620 577443 582211 585906 588547 590070 590375 589675 588579
60028 588579 587549 586384 584525 581776 578367 574390 569532 563571 556898 550403 544785 539952 535147 529754
60014 529754 523954 518392 513241 507988 502254 496425 491199 486782 482835 478997 475227 471777 469032 467229
60000 467229 466178 465495 465182 465608 466771 468118 469391 471059 473406 475725 477201 478239 480054 483018 486255
59985 486255 488978 491402 494004 496572 498519 499791 500921 502298 503670 504328 503612 501335 497963 494395 491441
59970D91441k119j790k342l455m263m136l338k586k019j086L49J468J461O90K59
59955D68534O18J161J182P29L79N11J008J514J782J758J531J198Q63P07R32J496
59939D85903J961J770Q33j93m64J15P18O16J91M79J709K947L386L338L539L998
59923E10846M239M321M783N644O255O185N659N045M520M286M474M607L884K285
59909E77033Q77N84J067J270P45L6j25M09J189J683J726J525J278R76O23M30M89
59892E91815N35M05N37J466K922L992M246M151M309M687M817M363L442K673K770
59877F37130L707M417L881K401J249J036J233J190Q66L42n02j593k578l433m419
59862F44927n239n059l755k310j507r52m1Q84J134Q46Q50J578K713L691M059L714
$$ plain form
59970 491441 489322 487532 485190 481735 477472 473336 469998 467412 465393 464307 464656 466124 467585 468275 468534
59955 468534 469152 470313 471495 472224 472603 473114 474122 475636 477418 479176 480707 481905 482768 483475 484407 485903
59939 485903 487864 489634 490467 490274 489810 489925 490643 491259 491450 491929 493638 496585 499971 503309 506848 510846
59923 510846 515085 519406 524189 529833 536088 542273 547932 552977 557497 561783 566257 570864 574748 577033
59909 577033 577910 578494 579561 580831 581576 581612 581487 581896 583085 584768 586494 588019 589297 590273 590896 591326 591815
59892 591815 592350 592755 593292 594758 597680 601672 605918 610069 614378 619065 623882 628245 631687 634360 637130
59877 637130 640837 645254 649135 651536 652785 653821 655054 656244 657110 657452 656950 655357 652779 649346 644927
59862 644927 639688 634629 630874 628564 627057 626105 626064 626948 628082 628928 629778 631356 634069 637760 641819 645533
59846F45533L203L374M312N165N432N716O506O919N675K928P6k005l484m463m419
59831F80468l091j156L54P66j95k430n195p314q047p633o792o018n386m786m141
59816F19404l558l304l485l856m074m049l799l181k165j186p70q60r30p91p88
59801E82608j066j142m95O37J393J136K5j215j972k193k199k240k338k498k732
59786E65709k841k524j909j581j869k376k538k341k081j815j472j266j340j226
59772E38530l10J066J769J354P68J169K432L443L626L578M086N018N613N590N452
59757E83184N576N594N088M536M906O290P648Q106P861P518P112O354N413M719
59743F69905M218L504K619K088K052J938J236J80o03q34p89q94j296j757j943
$$ plain form
59846 645533 648736 652110 656422 661587 667019 672735 679241 686160 691835 694763 694839 692834 689350 684887 680468
59831 680468 677377 676221 676575 677341 677146 674716 669521 662207 654160 646527 639735 633717 628331 623545 619404
59816 619404 615846 612542 609057 605201 601127 597078 593279 590098 587933 586747 585977 585117 584187 583396 582608
59801 582608 581542 580400 579905 580542 581935 583071 583096 581881 579909 577716 575517 573277 570939 568441 565709
59786 565709 562868 560344 558435 556854 554985 552609 550071 547730 545649 543834 542362 541096 539756 538530
59772 538530 538220 539286 541055 542409 543177 544346 546778 550221 553847 557425 561511 566529 572142 577732 583184
59757 583184 588760 594354 599442 603978 608884 615174 622822 630928 638789 646307 653419 659773 665186 669905
59743 669905 674123 677627 680246 682334 684386 686324 687560 687740 687137 686303 685514 684620 683324 681567 679624
59728F79624j853j819j967j879j157j79J64m11j191j354r22n30n84r33j300j597
59712F62112j826j868j563q98o7O69J163J481J867K549L474M222M396M107L911
59697F83729M123M403M234L713L467L832M485M905M899M472L549K140O18n10j100
59682G30959j464j999k805l658m220m343m214m218m620n345o002o164n763n273
59668F70871n222n441n059l594j716n46l68n42n24l30j9O05J532K331K674K682
59652F57334K607K509K438K555K835L020K941K549J632L2j867l478m879o626q488
59637F55114r280q498p272o978p440p355o121m472l414l209l448l580l323k853
59623E77871k699l177m020m601m452l612k733k692l636m493m120k904k297k658
$$ plain form
59728 679624 677771 675952 673985 672106 670949 670770 670934 670523 669332 667978 667056 666526 665942 665009 663709 662112
59712 662112 660286 658418 656855 655957 655890 656559 657722 659203 661070 663619 667093 671315 675711 679818 683729
59697 683729 687852 692255 696489 700202 703669 707501 711986 716891 721790 726262 729811 731951 732569 732059 730959
59682 730959 729495 727496 724691 721033 716813 712470 708256 704038 699418 694073 688071 681907 676144 670871
59668 670871 665649 660208 655149 651555 649839 649293 648925 648383 647859 647529 647510 648115 649647 651978 654652 657334
59652 657334 659941 662450 664888 667443 670278 673298 676239 678788 680420 680452 678585 675107 670228 663602 655114
59637 655114 645834 637336 630064 623086 615646 608291 602170 597698 594284 591075 587627 584047 580724 577871
59623 577871 575172 571995 567975 563374 558922 555310 552577 549885 546249 541756 537636 534732 532435 529777
59609E29777k759j873j002j149j500p20P62J337P22K85Q74J753K045J951J970
59594E32473J822R25n93j935k475k198j496p96k50J93M08M2q64j565j429q37p15
59577E20710j284j911k101k026k030k122k123j897j436r86j023j717k514k683
59563D94857k150j365o21O8N39N78L48K08K05K36N25J321K271K769K822K984L516
59546E09111M263N213O409P394P512O840O159N990O250O809P619Q435R252J0903
59532F08159J4029J7265J7684J3616O402j006o345q764q461o522m434k954j750
59519F36919n63Jo01j756k357k219k139k821m279o040p376p662p061o640p176
59504E78230q064q046o809n294m401m067l715l080k307j613j098p54m46L5Q04
$$ plain form
59609 529777 527018 525145 524143 522994 521494 520774 521536 522873 523595 523880 524754 526507 528552 530503 532473
59594 532473 534295 535220 534627 532692 530217 528019 526523 525727 525477 525670 526078 526120 525256 523691 522262 521425 520710
59577 520710 519426 517515 515414 513388 511358 509236 507113 505216 503780 502794 501771 500054 497540 494857
59563 494857 492707 491342 490721 490789 491328 491906 492254 492462 492667 492903 493428 494749 497020 499789 502611 505595 509111
59546 509111 513374 518587 524996 532390 539902 546742 552901 558891 565141 571950 579569 588004 597256 608159
59532 608159 622188 639453 657137 670753 677155 676149 669804 661040 652579 646057 641623 638669 636919
59519 636919 636356 636357 635756 634000 631643 629424 627285 624464 620185 614145 606769 599107 592046 585406 578230
59504 578230 570166 562120 555311 550017 545616 541549 537834 534754 532447 530834 529736 528982 528536 528571 529375
59489E29375J728K436K575K184J838K151L034L681L461K666K141K289K696K731
59475E64986K337K083K540L635M694N085M719L979L271K774K394J909J327J030
59461F06763J364J956J984J356J144K228M019N173N320N262N598O054O272O388
59447F60881O486O211N362M303L393K388Q64j080k979m569n870o869p452p529
59433F53540p033n956m508l108k030j241n93qO36J549K770M107N395O714Q213
59418F58447R861J1404J2482J2842J2627J2317J2186J2028J1728J1904J3398J5979
59406H07203J7906J7024J2227M195m876j2288j6270j6796j5054j2177q539m047
59394G68508J056N461O812L274m228j1906j6104j6298j4535j2620j0857r111p569
$$ plain form
59489 529375 531103 533539 536114 538298 540136 542287 545321 549002 552463 555129 557270 559559 562255 564986
59475 564986 567323 569406 571946 575581 580275 585360 590079 594058 597329 600103 602497 604406 605733 606763
59461 606763 608127 610083 612067 613423 614567 616795 620814 625987 631307 636569 642167 648221 654493 660881
59447 660881 667367 673578 678940 683243 686636 689024 689888 688808 685829 681260 675390 668521 661069 653540
59433 653540 646507 640551 636043 632935 630905 629664 629071 629063 629699 631248 634018 638125 643520 650234 658447
59418 658447 668308 679712 692194 705036 717663 729980 742166 754194 765922 777826 791224 807203
59406 807203 825109 842133 854360 858555 853679 841391 825121 808325 793271 781094 772555 768508
59394 768508 769564 775025 781837 785111 780883 768977 752873 736575 722040 709420 698563 689452 681883
59381F81883o129m287k094l11P16J486K346L026L439M026M834N243N085N047N378
59366G09688N237M088K810K540L115L622L813L990M052L756L566M189N454O535
59352G66455P129P636Q305R083J0133J1615J2999J3432J2919J2291J1969J1527
59340H95493J0683R823R199Q294O550M223K026K32j355k883m374o032q040j0034
59326I13805j1282j1595j1612j1891j2094j1556j0476r810r898r889q967p620
59314G87115p000p375p889p799p278o855o706o603o225n370m137k980k248j826
59300G06824j521j547j994k096q99J360L393M609N656O892P158M942L05n006r076
59285G19000j1063j1263j0520r502q293o714m904l205j527N50K964N088O637P913
$$ plain form
59381 681883 675754 671467 669373 669062 669778 671264 673610 676636 680075 684101 688935 694178 699263 704310 709688
59366 709688 714925 719013 721823 724363 727478 731100 734913 738903 742955 746711 750277 754466 759920 766455
59352 766455 773584 781220 789525 798608 808741 820356 833355 846787 859706 871997 883966 895493
59340 895493 906176 915999 925198 933492 940042 944265 946291 946523 945168 942285 937911 931879 923839 913805
59326 913805 902523 890928 879316 867425 855331 843775 833299 823489 813591 803702 794735 787115
59314 787115 780115 772740 764851 757052 749774 742919 736213 729610 723385 718015 713878 710898 708650 706824
59300 706824 705303 703756 701762 699666 698767 700127 703520 708129 713785 720677 727835 732777 733082 728076 719000
59285 719000 707937 696674 686154 676652 668359 661645 656741 653536 652009 652559 655523 660611 667248 675161
59271F75161Q944R215Q666Q233Q685R509R649Q880P823O822N561L668J247j162
59257G70901k940l841m327n194o637p970q422p886o766n540m673m395m278l509
59243F94523j920l10N72R10J424K487L926N253N860N481M635M148M098L876L332
59228G38295L010L006K580J345o5j082k043l355m659n586o478p549q131p635o595
59213F95058n880n481n039m829n178n407m657l288k380k070j661j091j079j743
59199F45275k265k102j565r88k01Q21J619J895J945K107K283K263K181K406L109
59184F58783M060M729M736M299M013M140M446M864N637O529O656N731M731M627
59170G27981N060N168N097N555O222N913M324K554J655J510J428J071M78k96j265
$$ plain form
59271 675161 684105 693320 701986 710219 718904 728413 738062 746942 754765 761587 767148 770816 772063 770901
59257 770901 767961 764120 759793 754599 747962 739992 731570 723684 716918 711378 706705 702310 698032 694523
59243 694523 692603 692293 692865 693775 695199 697686 701612 706865 712725 718206 722841 726989 731087 734963 738295
59228 738295 741305 744311 746891 748236 748171 747089 745046 741691 737032 731446 724968 717419 709288 701653 695058
59213 695058 689178 683697 678658 673829 668651 663244 658587 655299 652919 650849 649188 648097 647018 645275
59199 645275 643010 640908 639343 638355 638154 638975 640594 642489 644434 646541 648824 651087 653268 655674 658783
59184 658783 662843 667572 672308 676607 680620 684760 689206 694070 699707 706236 712892 718623 723354 727981
59170 727981 733041 738209 743306 748861 755083 760996 765320 767874 769529 771039 772467 773538 774016 773720 772455
59155G72455k506m161o179q110r464j0158j0401j0414j0513j1061j1868j2071
59143F65549j1126r570q350p773p594p619p577o967n780m858m727m535l177j061
59129E74835L66O77Q62J633K462K623K311K299K973M068N085N870O838Q406J0072
59114F31380J0639R761Q627Q496R144R529R345Q954Q358P339O276N631M990L742
59100G42211K461K243K837K808J650L66l46j108k510l858m076l175k161j905k504
59085G32933l398l828l510k978k977l582m325n012n779o526o962p178p532q010
59071F61336q203p883p104n944m691l972m052m326m131l701l580l609l382l165
59057E93593l378l609l253k733k789l033k587j821j892k668k776j777o70l0O67
$$ plain form
59155 772455 769949 765788 759609 751499 742035 731877 721476 711062 700549 689488 677620 665549
59143 665549 654423 644853 636503 628730 621136 613517 605940 598973 593193 588335 583608 579073 575896 574835
59129 574835 575201 575878 576740 578373 580835 583458 585769 588068 591041 595109 600194 606064 612902 621308 631380
59114 631380 642019 651780 660407 668903 678047 687576 696921 705875 714233 721572 727848 733479 738469 742211
59100 742211 744672 746915 749752 752560 754210 754576 754230 753122 750612 746754 742678 739503 737342 735437 732933
59085 732933 729535 725707 722197 719219 716242 712660 708335 703323 697544 691018 684056 676878 669346 661336
59071 661336 653133 645250 638146 632202 627511 623539 619487 615161 611030 607329 603749 600140 596758 593593
59057 593593 590215 586606 583353 580620 577831 574798 572211 570390 568498 565830 563054 561277 560607 560577 561244
59042E61244J468J429L43n26k35N45Q88J039J564K166K324K401L123M488N863
59027E88124O703O728N985N176N277O413P695Q464Q979R574R983R914R484Q700
59013F97199P226N137L132J632L94o43r72m61J42K01k8q5k8O5N62J653K836L523
58995G21485L712L633L253K530J669Q45P2n05p20q32j216j588j366p74o79j193
58979G28326j409p79L21J560L122M868O128O799P583Q750R726J0293J1050J2085
58965H08423J2436J1560J0273R434Q732P632O496N736M731K636k30k832m798o517
58951H73712q289j0103j1945j3723j5093j5813j5917j5388j4076j2232j0506r235
58939G21392q287p686p561p432o467m750l307k614k110j405q66o33k76J62J1o89
$$ plain form
59042 561244 562712 564141 564484 563958 563723 564268 565156 566195 567759 569925 572249 574650 577773 582261 588124
59027 588124 594827 601555 607540 612716 617993 624406 632101 640565 649544 659118 669101 679015 688499 697199
59013 697199 704425 709562 712694 714326 714720 714077 713105 712644 712786 712987 712959 712874 712846 712911 713473 715126 717962 721485
58995 721485 725197 728830 732083 734613 736282 737127 737199 736694 735974 735142 733926 732338 730972 730198 729519 728326
58979 728326 726917 726138 726459 728019 731141 736009 742137 748936 756519 765269 774995 785288 796338 808423
58965 808423 820859 832419 842692 852126 860858 868490 874986 880722 885453 888089 887859 885027 880229 873712
58951 873712 865423 855320 843375 829652 814559 798746 782829 767441 753365 741133 730627 721392
58939 721392 713105 705419 697858 690426 683959 679209 675902 673288 671178 669773 668907 668274 667998 668160 668171 667482
58923F67482r79o36o43j341j608p38K42K51j37R0O93J006J435K667M178M936N026
58906F81924N279N858O337O765P558Q708J0014J1674J3722J5398J5959J5657J5194
58893H20047J4733J4213J3957J4163J4385J4295J4307J4741J5127J5058J4969
58882I79995J5117J4660J2746R851P032M510J970m39k364m016n729p343q733j0235
58868A007022j1827j2704j2563j2331j2687j2823j1836j0423r928j0383j0822
58857H78695j0821j0620j0279r877j0013j0949j1840j1821j1194j0600r909q918
58845G51854q230q240q169p392o755p195q020q094p756p857p838o712n173m687
58831F49736m954m389k905k048k372k631j921q71k91n2L19R86K001L112L563L076
$$ plain form
58923 667482 666503 665867 665224 663883 662275 661537 661779 662030 661893 661983 662676 663682 665117 667784 671962 676898 681924
58906 681924 687203 693061 699398 706163 713721 722429 732443 744117 757839 773237 789196 804853 820047
58893 820047 834780 848993 862950 877113 891498 905793 920100 934841 949968 965026 979995
58882 979995 995112 1009772 1022518 1032369 1039401 1043911 1045881 1045442 1043078 1039062 1033333 1025990 1017257 1007022
58868 1007022 995195 982491 969928 957597 944910 932087 920251 909828 899900 889517 878695
58857 878695 867874 857254 846975 837098 827085 816136 804296 792475 781281 770681 760772 751854
58845 751854 743624 735384 727215 719823 713068 705873 697853 689759 682003 674146 666308 659596 654423 649736
58831 649736 644782 640393 637488 635440 633068 630437 628516 627645 627354 627302 627621 628607 630608 633720 637283 640359
58815F40359K679L414M629M937M407M196M400M005K856J864J233K03j212j939
58801F76031j613j161j327j967k987m517n909n967m671l391l030l101k953k674
58787F30763k413j925j164m09M11J567K704L172L160L418L901L911L499L369L446
58772F57410K952J927J156M44j390m426p080q182q178p815p032n940n389n710
58758F02747n903n005l422k158j491j072p05l49J27P43J327J846K385K751K704
58743E94525K516K632K936L113L522M643N903O200N618N313N662N758N022M108
58729F57471L798M064M540M989N015M256L195K865L480M215M426M246L846L172
58715G13578K553K587L108L214K546J663J046N48Kn69j391k748m321n598o820
$$ plain form
58815 640359 643038 646452 651081 656018 660425 664621 669021 673026 675882 677746 678979 679182 677970 676031
58801 676031 674418 673257 671930 669963 666976 662459 656550 650583 645912 642521 639491 636390 633437 630763
58787 630763 628350 626425 625261 624852 625263 626830 629534 632706 635866 639284 643185 647096 650595 653964 657410
58772 657410 660362 662289 663445 663889 662499 658073 650993 642811 634633 626818 619786 613846 608457 602747
58758 602747 596844 591839 588417 586259 584768 583696 582991 582642 582769 583512 584839 586685 589070 591821 594525
58743 594525 597041 599673 602609 605722 609244 613887 619790 625990 631608 636921 642583 648341 653363 657471
58729 657471 661269 665333 669873 674862 679877 684133 687328 690193 693673 697888 702314 706560 710406 713578
58715 713578 716131 718718 721826 725040 727586 729249 730295 730843 730845 730276 728885 726137 721816 716218 709398
58700G09398q547j0426j1483j1678j1948j2700j3308j3241j2647j1749j0655r755
58688E71261r310q806p690o474n964n776m962l749l141l049k527j639j335j453
58674E05386p99P00J805K206K959M245M673L637K596L074M741O340P233P322O668
58659E62786N825N496N301M083J725n62k113l565n331o764p385p586p579o940
58645E37391n709m655l972l033j821j234j503j706j343r94r71p10N7Q40J498K438
58629E14573L391L462K708K112J797R20l61p52m7M66K92M26J225J672J596K353
58613E35833M323N789N500M473M029L927L582L354L291K412N40q04n78L41J077
58598E77089K185L785M273K680N90q3K18Q2k37M39J915K995L454L988M853N855
$$ plain form
58700 709398 700851 690425 678942 667264 655316 642616 629308 616067 603420 591671 581016 571261
58688 571261 561951 553145 545455 538981 533017 527241 522279 518530 515389 512340 509813 508174 506839 505386
58674 505386 504587 505287 507092 509298 512257 516502 521175 524812 527408 530482 535223 541563 548796 556118 562786
58659 562786 568611 574107 579408 583491 585216 584654 582541 578976 573645 566881 559496 551910 544331 537391
58645 537391 531682 527027 523055 520022 518201 516967 515464 513758 512415 511421 510450 509740 509797 510637 512135 514573
58629 514573 517964 521426 524134 526246 528043 528963 528602 527850 527803 528269 528561 528987 530212 531884 533480 535833
58613 535833 540156 545945 551445 555918 559947 563874 567456 570810 574101 576513 577053 576249 575671 576012 577089
58598 577089 579274 583059 587332 590012 590602 590519 590737 590819 590582 591021 592936 595931 599385 603373 608226 614081
58582F14081P025Q203Q817Q924R420J0381J0625R841R501J0452J1306J0738R740
58569G39054R912J0978J1859J2830J4591J6294J6599J5993J6201J7795J9855K1475
58557I23436K2142K1332J9071J6366J3916J1146P384L140q34m575p971j0069j0498
58544A003986j0362j0516j0283r202q585r701j1755j3306j4515j6232j8092j9218
58532H52219j9767k0090j9448j7363j5117j4033j3306j1378q564o378n087l937
58520F97751l006k924l248k984k320k152k427k480k498l047l654l376k344j392
58506F59899p04o4J94j99n75k96J34P2o9J34K8q39j435p59M74J170J740L035M515
58487F66455N269N838P187Q772R434R519J0239J1607J2643J3028J3031J2561J1709
$$ plain form
58582 614081 621106 629309 638126 647050 656470 666851 677476 687317 696818 707270 718576 729314 739054
58569 739054 748966 759944 771803 784633 799224 815518 832117 848110 864311 882106 901961 923436
58557 923436 945578 966910 985981 1002347 1016263 1027409 1034793 1037933 1037099 1032524 1024553 1014484 1003986
58544 1003986 993624 983108 972825 963623 955038 945337 933582 920276 905761 889529 871437 852219
58532 852219 832452 812362 792914 775551 760434 746401 733095 721717 713153 706775 701688 697751
58520 697751 694745 691821 688573 685589 683269 681117 678690 676210 673712 670665 667011 663635 661291 659899
58506 659899 659195 659131 659325 659126 658551 658255 658389 658461 658392 658526 658554 657715 656280 655521 655995 657165 658905 661940 666455
58487 666455 671724 677562 684749 693521 702955 712474 722713 734320 746963 759991 773022 785583 797292
58474G97292J1442J2165J2494J0942P966M918J963j398m664o867p929q150p275
58461H22899n439l792k900j736L00J940K183K252L629N665P004P827Q713Q822
58447H57367P331N142L124K44m284q694j0900j1435j1749j1290r041o377n306
58434G94132n164l931j679J28J607L615N109M492K800K440L509M314M695N761
58420H21828O942O551M796L315K070l22l590n990p149q064q711q319p572p791
58406G87994q412p883o528n829n606m558l025k373k293j395R0R45J447K566L573
58391G48713L263K574L085L972L567K688L120L978L168J474J407K873L739L890
58377G91511M816N897N249L783M302O767Q442Q527Q690R251Q920Q207R038J0931
$$ plain form
58474 797292 808734 820899 833393 844335 852301 857219 859182 857784 853120 846253 838324 830174 822899
58461 822899 817460 813668 810768 809032 809332 811272 813455 815707 819336 825001 832005 839832 848545 857367
58447 857367 864698 869840 872964 873208 868924 860230 849330 837895 826146 814856 805815 799438 794132
58434 794132 788968 785037 783358 783486 785093 788708 793817 798309 801109 803549 807058 811372 816067 821828
58420 821828 828770 835321 840117 843432 845502 845180 841590 835600 828451 820387 811676 803357 795785 787994
58406 787994 779582 771699 765171 759342 753736 749178 746153 743780 741487 740092 740182 741127 742574 745140 748713
58391 748713 751976 754550 757635 761607 765174 767862 770982 774960 778128 779602 781009 783882 787621 791511
58377 791511 796327 802224 807473 811256 815558 822325 830767 839294 847984 857235 866155 874362 883400 894331
58363H94331J1487J0627J0446J0999J0357Q828Q841J0446J1083J0097R398R377
58351A016317Q280N976M330L540K097N36J073L293M382L968M518O629Q148Q328
58337A081415Q693R478R418R198J0780J3209J3573J2218J2255J3932J4428J3428
58325A222025J3507J4596J3495R763O723N700M539K764K738M542N098L815L769
58312A313074N895P284O750O855Q762J0235J0348J1132J3071J3983J3727J4858
58300A435974J7309J7850J6136J5712J7618J8669J7686J7543J9381K0626K0503
58289A635007K1644K4391K5531K4498K4774K7243K8518K7695K8269L1183L2730
58278A931483L1708L1888L4750L6616L5770L5669L8201M0395M0773M2223M5669
$$ plain form
58363 894331 905818 916445 926891 937890 948247 957075 965916 976362 987445 997542 1006940 1016317
58351 1016317 1024597 1030573 1034903 1038443 1040540 1041076 1042149 1045442 1049824 1053792 1058310 1064939 1073087 1081415
58337 1081415 1090108 1099586 1109004 1118202 1128982 1142191 1155764 1167982 1180237 1194169 1208597 1222025
58325 1222025 1235532 1250128 1263623 1273386 1280109 1285809 1290348 1293112 1295850 1300392 1305490 1309305 1313074
58312 1313074 1318969 1326253 1333003 1339858 1348620 1358855 1369203 1380335 1393406 1407389 1421116 1435974
58300 1435974 1453283 1471133 1487269 1502981 1520599 1539268 1556954 1574497 1593878 1614504 1635007
58289 1635007 1656651 1681042 1706573 1731071 1755845 1783088 1811606 1839301 1867570 1898753 1931483
58278 1931483 1963191 1995079 2029829 2066445 2102215 2137884 2176085 2216480 2257253 2299476 2345145
58267B345145M7658M7161M7862N0907N2488N1533N2322N6397N9440N9502O0571
58256B930986O4574O7683O7998O9055P2215P3736P2837P4258P9319Q3252Q4786
58245C740699Q9057R7337J03803J06641J11998J22342J31600J36899J44162J56564
58235D941102J68463J76722J86883K01979K16605K28372K43580K65051K86340
58226F915097L04680L27115L57035L87754M16498M50976M94762N40924N87800
58217A0782641O45505P18645P99187Q85230R89283J118766J267657J437888J648991
58208B0293793J915843K239038K629502L119375L735752M488582N396040O488933
58200E0306858P767743R176657J0625224J1995412J3121927J3837836J4093517
$$ plain form
58267 2345145 2392803 2439964 2487826 2538733 2591221 2642754 2695076 2751473 2810913 2870415 2930986
58256 2930986 2995560 3063243 3131241 3200296 3272511 3346247 3419084 3493342 3572661 3655913 3740699
58245 3740699 3829756 3927093 4030896 4137537 4249535 4371877 4503477 4640376 4784538 4941102
58235 4941102 5109565 5286287 5473170 5675149 5891754 6120126 6363706 6628757 6915097
58226 6915097 7219777 7546892 7903927 8291681 8708179 9159155 9653917 10194841 10782641
58217 10782641 11428146 12146791 12945978 13831208 14820491 15939257 17206914 18644802 20293793
58208 20293793 22209636 24448674 27078176 30197551 33933303 38421885 43817925 50306858
58200 50306858 58074601 67251258 77876482 89871894 102993821 116831657 130925174
58193A30925174J4000449J3738241J3477675J3413230J3762003J4651737J6093263
58186B30061772J8096831K0554756K2692783K2759618J8823252J0334518j065827
58179C42257703j2422167k1184472k6247490k7833226k6896062k4654206k2214417
58172A80805663k0202511j8644120j7239620j5743524j4105029j2391204j0704564
58165G1775091r151136p798851o647472n662483m824637m125065l538991l038458
58157B6987998k616413k272193j987622j740444j527246j352023j205233j073605
58149A3213219r57992q63343p82593p06982o40637n89114n44476m96842m50136
58140G181104m12133l79049l43988l10811k85798k64577k40546k17892k03673
$$ plain form
58193 130925174 144925623 158663864 172141539 185554769 199316772 213968509 230061772
58186 230061772 248158603 268713359 291406142 314165760 332989012 343323530 342257703
58179 342257703 329835536 308651064 282403574 254570348 227674286 203020080 180805663
58172 180805663 160603152 141959032 124719412 108975888 94870859 82479655 71775091
58165 71775091 62623955 54825104 48177632 42515149 37690512 33565447 30026456 26987998
58157 26987998 24371585 22099392 20111770 18371326 16844080 15492057 14286824 13213219
58149 13213219 12255227 11391884 10609291 9902309 9261672 8672558 8128082 7631240 7181104
58140 7181104 6768971 6389922 6045934 5735123 5449325 5184748 4944202 4726310 4522637
58131D522637j94780j84607j74953j69737j64589j54082j42338j35443j30155
58122C071953j20785j10491j05021j01491r4088q5170q0362p7892p2823o6987
58112B156843o4896o4344o0491n5056n2567n1510m7901m3638m2861m3718m1964
58101A587897l9012l8540l8764l6003l2341l1952l3099l1458k8279k7586k8325
58090A222538k6742k3893k3384k4106k2310j8776j7092j6867j5277j3285j3952
58079A006854j6349j7211j6766j7212j7512j5504j3052j3321j4888j4273j2300
58068H38466j2238j3568j3306j1776j1474j1881j0823r343r808j0815r416o842
58056G07176o591q226q490p302p357q770r270q771q912r028p320n051m839n863
$$ plain form
58131 4522637 4327857 4143250 3968297 3798560 3633971 3479889 3337551 3202108 3071953
58122 3071953 2951168 2840677 2735656 2634165 2540077 2454907 2374545 2296653 2223830 2156843
58112 2156843 2091947 2027603 1967112 1912056 1859489 1807979 1760078 1716440 1673579 1629861 1587897
58101 1587897 1548885 1510345 1471581 1435578 1403237 1371285 1338186 1306728 1278449 1250863 1222538
58090 1222538 1195796 1171903 1148519 1124413 1102103 1083327 1066235 1049368 1034091 1020806 1006854
58079 1006854 990505 973294 956528 939316 921804 906300 893248 879927 865039 850766 838466
58068 838466 826228 812660 799354 787578 776104 764223 753400 744057 734249 723434 714018 707176
58056 707176 700585 692359 683869 676567 669210 660440 651170 642399 633487 624459 617139 612088 607249 601386
58042F01386n388l958m292o056o506n548n445o227n985n107n668p115o988n506
58028E21597n189o359p115p287q247r279q316o058n268o191o506n590m974m820
58014D30398l777k211j945k818k936k161j976k249j559l96n23j453j036N65J081
57999D07004J83j17Q07J347Q10L41M40L24j33k60l01q34r98K01J490R18q64j726
57981D08632j664k262l323l208k082j678k200k438k495l345m181l297j239p7k
57966C75141L58Q67L13o13j77R66N66j240k176j783j706k121j425K94R60N7p46
57949C67535q48j446k596k690j432l68P2J194L178M398M222L895M062L977L575
57934C86728L857M795N156M797M709M854M255L262L078L129J713p60k140k194
$$ plain form
58042 601386 595998 592040 587748 581692 575186 569638 564193 557966 551981 546874 541206 534091 527103 521597
58028 521597 516408 510049 502934 495647 487400 478121 469805 463747 458479 452288 445782 440192 435218 430398
58014 430398 426621 424410 422465 419647 416711 414550 412574 410325 408766 408370 407847 406394 405358 405923 407004
57999 407004 407187 407070 407877 409224 410034 410375 410815 411139 411006 410746 410445 409611 408613 408814 410304 411222 410358 408632
57981 408632 406968 404706 401383 398175 396093 394415 392215 389777 387282 383937 379756 376459 375220 375143 375141
57966 375141 375499 376366 376679 376066 375889 376855 377421 376181 374005 372222 370516 368395 366970 367264 368224 368281 367535
57949 367535 366687 365241 362645 359955 358523 358155 358227 359421 362599 366997 371219 375114 379176 383153 386728
57934 386728 390585 395380 400536 405333 410042 414896 419151 422413 425491 428620 430333 429573 427433 425239
57920D25239k872m628n650n258m943n341n203m174l746m379m441l079j640j197
57906C68688j022m51j7J80J022K424K965K178J252P90N6j072j542j137q90r51
57890C72473k32J302K192J841J180O06m37j525j387m14m78j747k332j649j348
57875C68045k188k733k197j842k397k691k073j699k153k162j017L3P2K4O47J266
57859C46935J690L029N252O322N271L970M229N294N707N666N794N558M626L972
57845D13315M024L478J556l83j115j561k782l836l611l102l703m658m455l578
57831C89589l646m601m939m198l345l011k897k727k475j983j294r96j345j617
57817C50515j203o75q54j533j974k112k283k417k226j843j687k111l413n430o992
$$ plain form
57920 425239 422367 417739 412089 406831 401888 396547 391344 387170 383424 379045 374604 371525 369885 368688
57906 368688 367666 367215 367198 367378 368400 370824 373789 375967 377219 378009 378065 376993 375451 374314 373424 372473
57890 372473 372241 373543 375735 377576 378756 379362 378925 377400 376013 375599 375121 373374 371042 369393 368045
57875 368045 365857 363124 360927 359085 356688 353997 351924 350225 348072 345910 344893 344926 344998 345022 345669 346935
57859 346935 348625 351654 356906 363228 368499 372469 376698 381992 387699 393365 399159 404717 409343 413315
57845 413315 417339 420817 422373 421990 420875 419314 416532 412696 409085 405983 402280 397622 393167 389589
57831 389589 385943 381342 376403 372205 368860 365849 362952 360225 357750 355767 354473 353477 352132 350515
57817 350515 349312 348637 347783 346250 344276 342164 339881 337464 335238 333395 331708 329597 326184 320754 313762
57802C13762o768m988l319k722k575k189j807j613j100r1P02Q34P77J002J387
57787B91292J909K763L604L923M259N558P164P262N646M249M292M869M939M868
57773C56597N094N042M411L888L695L018J674P05M41k41j797k981l007k901l526
57758C70112m117m010m010m670m962m120l124k882k596j523o60r13j165j22J291
57743C32529J455P50O80J217J117K78j59K79R46J319J415J303J184J504K185K476
57727C50478K241K411L287L770L201K640L048L520K809J379M33p7q76j779k193
57712C74292k399k893l331l412l835m963n602m703l305l075l805m120l875l965
57698C21009m383m297l730l453l478l144k486k105j905j303m25J07K92N67R21
$$ plain form
57802 313762 306994 302006 298687 295965 293390 291201 289394 287781 286681 286590 287292 288126 288903 289905 291292
57787 291292 293201 295964 299568 303491 307750 313308 320472 327734 333380 337629 341921 346790 351729 356597
57773 356597 361691 366733 371144 375032 378727 381745 383419 384124 384565 384324 382527 379546 376539 373638 370112
57758 370112 365995 361985 357975 353305 348343 344223 341099 338217 335621 334098 333438 332525 331360 331238 332529
57743 332529 333984 334734 335414 336631 337748 338026 337867 338146 339092 340411 341826 343129 344313 345817 348002 350478
57727 350478 352719 355130 358417 362187 365388 368028 371076 374596 377405 378784 379217 379140 378264 376485 374292
57712 374292 371893 369000 365669 362257 358422 353459 347857 343154 339849 336774 332969 328849 324974 321009
57698 321009 316626 312329 308599 305146 301668 298524 296038 293933 292028 290725 290300 290407 290699 291266 292187
57683B92187J248K062L783N789P362Q948J1330J4067J6157J7643J9262K0862K1484
57670D42184K0911K0000J9677K0517K2875K6614L0876L4548L6253L3598K4012
57659G32065P771j0832k6658l7405m3404m5307m3761m0189l5934l0998k5124j9421
57647C80803j5359j2755j0412q222p003o675o255n318m119k613p75N83P26K35
57633C02841L0k05j057j706r58M84Q39l6o25l71l26j096j935k230k299k322j886
57616B87142r66k38o5j27k53o84j438k169k598k480j525j27N14j66j113j206r40
57599B71561j287j804j534j042j691l217l944l305k408k034j764j310j147j522
57585B43552k003k261k283j893j053m49o69j143j006n97p92j399j639j754k475
$$ plain form
57683 292187 293435 295497 299280 305069 312431 321379 332709 346776 362933 380576 399838 420700 442184
57670 442184 463095 483095 502772 523289 546164 572778 603654 638202 674455 708053 732065
57659 732065 739836 729004 702346 664941 621537 576230 532469 492280 456346 425348 400224 380803
57647 380803 365444 352689 342277 334055 327052 320377 314122 308804 304685 302072 301297 301880 302606 302841
57633 302841 302871 302666 301609 299903 298945 299429 300268 300232 299607 299236 298910 297814 295879 293649 291350 289028 287142
57616 287142 286176 285938 285873 285746 285493 284809 283371 281202 278604 276124 274599 274472 274986 274820 273707 272501 271561
57599 271561 270274 268470 266936 265894 264203 260986 257042 253737 251329 249295 247531 246221 245074 243552
57585 243552 241549 239288 237005 235112 234059 233610 232941 231798 230792 230195 229403 228004 226365 224611 222136
57570B22136l311l120k208k015k748l077k330j340r60j150j662k208k024o38R75
57555A94320J476J187J425K150K089J077K96J55mQJ214L082L437J588l90m77P76
57538B13409J549J142J28p00o70M15J633J628L82p15q33n08k80P6N80P44O30Q99
57520B19509J368J041l5m90K69J187J455J652K222K411J730J053J200J594J368
57505B37534P81M73K94j48n87o29m47l04j19m7n76j534j959j558j239j610k012
57488B26313j784j403j560k038k321k441k436j830m87P72J222J179J263J306P74
57473B16529k87j356k002j983j352p62j007j972k737k882k767k459j538k50L51
57458A93526k6m03j09K51N9l03m03n92j036r62J82J605K125J582O54n4j65M67
$$ plain form
57570 222136 218825 215705 213497 211482 208734 205657 203327 201987 201027 199877 198215 196007 193983 193345 194320
57555 194320 195796 196983 198408 200558 202647 203724 204020 204175 204171 204179 205393 208475 211912 213500 213110 212633 213409
57538 213409 214958 216100 216228 215528 214858 215273 216906 218534 218916 218201 217368 216860 216580 216656 217236 217980 218610 219509
57520 219509 220877 221918 221883 221393 221662 222849 224304 225956 228178 230589 232319 233372 234572 236166 237534
57505 237534 238315 238788 239082 238934 238347 237718 237271 236967 236848 236801 236225 234691 232732 231174 229935 228325 226313
57488 226313 224529 223126 221566 219528 217207 214766 212330 210500 210013 210785 212007 213186 214449 215755 216529
57473 216529 216242 214886 212884 210901 209549 208787 207780 205808 203071 200189 197422 194963 193425 193175 193526
57458 193526 193500 193097 192988 193239 193298 192995 192592 192000 190964 190002 190184 191789 193914 195496 196150 196096 195931 196398
57440A96398J305J469R86Q66J454J744R56k11p27n96l19J77J090J952K211K009
57424B10764J691J170M35J0J96M38J86k69l77k17j40j01Q1L41O30J038J373J270
57406B18519J008J304K068K276J489M84m7l28n85m34J41L28k55q34p26l07n1L57
57388B24407J156J720J602J422J799K282K195J824J805K107K367K608K810K522
57374B52626J635P77L20j87r38j227o63l6p5k41K66J155J628J561J213N11m79
57357B57846j080r06m94l46j49L28M80m9m18K40J446K117K042J725J455J312J406
57340B66955J465R28K5j96M77R26N45K43P40J240R42N41Q63J300R96M80O55J127
57322B80252J090Q40R52Q68r6j162j139k99K84N52J097J753K084K522L414L784
$$ plain form
57440 196398 197703 199172 200158 201024 202478 204222 205178 204967 204240 203644 203325 203502 204592 206544 208755 210764
57424 210764 212455 213625 214060 214070 214266 214704 214890 214621 214244 214027 213887 213786 213867 214208 214838 215876 217249 218519
57406 218519 219527 220831 222899 225175 226664 227148 227101 226773 226188 225754 225895 226223 225968 225134 224408 224101 224050 224407
57388 224407 225563 227283 228885 230307 232106 234388 236583 238407 240212 242319 244686 247294 250104 252626
57374 252626 254261 255038 255358 255171 254233 253006 252343 252307 252232 251991 252257 253412 255040 256601 257814 258325 257846
57357 257846 256766 255860 255366 255020 254871 255199 255679 255630 255212 255452 256898 259015 261057 262782 264237 265549 266955
57340 266955 268420 269348 269373 269177 269654 270580 271125 271368 272108 273348 274290 274831 275694 276994 277990 278470 279125 280252
57322 280252 281342 282182 283134 284002 283906 282744 281605 281306 281590 282142 283239 284992 287076 289598 293012 296796
57306B96796K707J157O97J145J360J541K633M023M090K883K111K596L584M480
57292C31803N327N672M918L770L497L783L241J997J629K439L032K910L279M602
57278C81899N477M832L525K772K662K967L934N312O046N889N938O767P268O517
57264D51805N442N465O453P219P383P543Q080Q797R443R907J0137J0363J1060
57251E59097J2267J3420J4138J4739J5614J6610J7380J7905J8359J8800J9289
57240G37618J9984K0935K2073K3352K4654K5786K6947K8838L1597L4082L5108
57229A030974L5109L5595L7142L9038M0751M2506M4192M5062M4924M4566M4485
57218A484344M4036M2397L9660L6435L3011K9455K6145K3796K3016K3825K5307
$$ plain form
57306 296796 299503 300660 301357 302502 303862 305403 308036 312059 316149 319032 321143 323739 327323 331803
57292 331803 337130 342802 347720 351490 354987 358770 362011 364008 365637 368076 371108 374018 377297 381899
57278 381899 387376 392208 395733 398505 401167 404134 408068 413380 419426 425315 431253 438020 445288 451805
57264 451805 457247 462712 469165 476384 483767 491310 499390 508187 517630 527537 537674 548037 559097
57251 559097 571364 584784 598922 613661 629275 645885 663265 681170 699529 718329 737618
57240 737618 757602 778537 800610 823962 848616 874402 901349 930187 961784 995866 1030974
57229 1030974 1066083 1101678 1138820 1177858 1218609 1261115 1305307 1350369 1395293 1439859 1484344
57218 1484344 1528380 1570777 1610437 1646872 1679883 1709338 1735483 1759279 1782295 1806120 1831427
57207A831427K5963K4960K2834K0545J8135J5181J2099R996R207Q995Q713Q427
57195B016482Q342Q464Q934R975J1483J3247J5421J8053K0562K2469K4234K6409
57183B204075K8370K9123K8931K8781K8627K7698K6401K6108K7007K7769K7658
57172B510548K7310K7058K6225K4676K3443K3022K2447K0974J9321J8359J7761
57161B761144J6969J6502J7139J8586J9942K0903K1697K2361K2835K3275K3679
57150B985032K3700K3290K2942K2837K2433K1406K0390K0244K1056K2286K3345
57139C228961K3839K3794K3836K4449K4949K4062K1745J9421J8073J7188J6096
57128C466413J5267J5609J7340K0352K4923L1229L8691M6508N4440O2605P0924
$$ plain form
57207 1831427 1857390 1882350 1905184 1925729 1943864 1959045 1971144 1981140 1990347 1999342 2008055 2016482
57195 2016482 2024824 2033288 2042222 2052197 2063680 2076927 2092348 2110401 2130963 2153432 2177666 2204075
57183 2204075 2232445 2261568 2290499 2319280 2347907 2375605 2402006 2428114 2455121 2482890 2510548
57172 2510548 2537858 2564916 2591141 2615817 2639260 2662282 2684729 2705703 2725024 2743383 2761144
57161 2761144 2778113 2794615 2811754 2830340 2850282 2871185 2892882 2915243 2938078 2961353 2985032
57150 2985032 3008732 3032022 3054964 3077801 3100234 3121640 3142030 3162274 3183330 3205616 3228961
57139 3228961 3252800 3276594 3300430 3324879 3349828 3373890 3395635 3415056 3433129 3450317 3466413
57128 3466413 3481680 3497289 3514629 3534981 3559904 3591133 3629824 3676332 3730772 3793377 3864301
57117C864301P9178Q7178R4660J01720J09576J20121J34367J52072J73261J99121
57107E115555K30952K69239L14677L69408M36435N18271O16912P34648Q73947
57098I480044J036448J222389J430730J659151J903468K156793K409623K652028
57090B3950674K877259L083494L271312L438803L578278L675995L715377L685190
57082E1276382L589979L450473L283412L071918K756703K266314J567614O95762
57074G1958557k59231j194608k032117k730096l275720l674114l942400m104239
57066E0746032m180400m180539m104345l951014l727416l448886l135407k807619
57058B1210406k483481k175475j890385j631757j401928j201737j030044q84623
$$ plain form
57117 3864301 3943479 4030657 4125317 4227037 4336613 4456734 4591101 4743173 4916434 5115555
57107 5115555 5346507 5615746 5930423 6299831 6736266 7254537 7871449 8606097 9480044
57098 9480044 10516492 11738881 13169611 14828762 16732230 18889023 21298646 23950674
57090 23950674 26827933 29911427 33182739 36621542 40199820 43875815 47591192 51276382
57082 51276382 54866361 58316834 61600246 64672164 67428867 69695181 71262795 71958557
57074 71958557 71699326 70504718 68472601 65742505 62466785 58792671 54850271 50746032
57066 50746032 46565632 42385093 38280748 34329734 30602318 27153432 24018025 21210406
57058 21210406 18726925 16551450 14661065 13029308 11627380 10425643 9395599 8510976
57050H510976p62878o61512n76962n07027m50895m06800l70797l38805l08916
57041D126384k80911k54594k29559k05689j82942j61173j40715j22236j05629
57032B442936r0044p5503o3179n3594m5912l9590l4953l1381k6834k0270j2447
57021A949229k984J0364K6317L5670K6630m146m7492q8693j17062j29706j29514
57010A528613j21578j10324r8195q6241p5270o5848n7733n0439m4229l9576l5894
56999G43286l1921k7303k2908j9488j6937j4868j3109j1565j0280r606r790j0453
56987E45058j0989j1180j1002j0165q441o187m057k673k869n557j0603j6376k1067
56974D23892k3952k4926k3774k0743j7079j3906j1142q334n785l932k354n21J137
$$ plain form
57050 8510976 7748098 7086586 6509624 6002597 5551702 5144902 4774105 4435300 4126384
57041 4126384 3845473 3590879 3361320 3155631 2972689 2811516 2670801 2548565 2442936
57032 2442936 2352892 2277389 2214210 2160616 2114704 2075114 2040161 2008780 1981946 1961676 1949229
57021 1949229 1946245 1956609 1982926 2018596 2045226 2041080 1993588 1904895 1787833 1658127 1528613
57010 1528613 1407035 1296711 1198516 1112275 1037005 971157 913424 862985 818756 779180 743286
56999 743286 711365 684062 661154 641666 624729 609861 596752 585187 574907 565301 555511 545058
56987 545058 534069 522889 511887 501722 493281 487094 483037 480364 477495 471938 461335 444959 423892
56974 423892 399940 375014 351240 330497 313418 299512 288370 280036 274251 270319 267965 267444 268581
56961B68581K044K728M119O202Q494J1142J4156J6062J4763R733K280n935j3504
56948C40865j8908k1137k0669j8820j6223j2899r336o205l219L73M207O920P874
56935B32823P786P712Q283R814J2243J5045J7778K0185K1076J8065R881j530j2506
56922C66655k0842k6325k9004k8833k6821k4623k2709k0307j7218j4284j1968
56911A23721r866p791o121m944l955l267l087k787j522K22J185J307J803L148
56897H8046M587N699O902Q140Q641Q381Q352Q891R179Q894R012J0307J2256J3990
56883B11277J5117J5076J2994Q928M239Pl820p170q873p895m725o95L450P577
56869B45487J1426J4539J6599J7520J7561J7557J8336J9810K1301K2941K5823
$$ plain form
56961 268581 270625 273353 277472 283674 292168 303310 317466 333528 348291 358024 360304 354369 340865
56948 340865 321957 300820 280151 261331 245108 232209 222873 216668 213449 213822 218029 224949 232823
56935 232823 240609 248321 256604 266418 278661 293706 311484 331669 352745 370810 380691 379161 366655
56922 366655 345813 319488 290484 261651 234830 210207 187498 167191 149973 135689 123721
56911 123721 113855 106064 99943 94999 91044 87777 84690 81903 80381 80603 81788 83095 84898 88046
56897 88046 92633 98332 105234 113374 122015 130396 138748 147639 156818 165712 174724 185031 197287 211277
56883 211277 226394 241470 254464 263392 267631 267638 263818 256648 247775 239880 235155 234460 237910 245487
56869 245487 256913 271452 288051 305571 323132 340689 359025 378835 400136 423077 448900
56858D48900L0368L5188L7783L5843K8047J4895p74j4886k4386k8366k7380k2720
56846E12512j6157r122j830N941J3306J8691K1820K3927K5835K7264K8265K9829
56834F80281L2609L6528M1937M9141N5573N5370M3784K1664n264l0564m9724o0433
56822H70902o2782n9219n2749m4737l5150k4553j4619o650n97M135P671R930J1420
56809F03002J3235J6304K0806K6345L2242L7073L7899L1116J5336o379k7951m4139
56797G54889n2989n5279n2974m8167m2235l5408k7655j9865j3445q785n200k286
56785C90601k34J319L346O060Q726J1241J4420J7918J9182J5617P144m042j5442
56772D75856k5184l1956l5194l5319l3240k9915k6420k3675k1628j9399j6647
$$ plain form
56858 448900 479268 514456 552239 588082 616129 631024 630250 615364 590978 562612 535232 512512
56846 512512 496355 487233 485403 491344 504650 523341 545161 569088 594923 622187 650452 680281
56834 680281 712890 749418 791355 840496 896069 951439 995223 1016887 1011623 981059 931335 870902
56822 870902 808120 748901 696152 651415 616265 591712 577093 570443 569846 573981 581652 591582 603002
56809 603002 616237 632541 653347 679692 711934 749007 786906 818022 833358 826979 799028 754889
56797 754889 701900 646621 593647 545480 503245 467837 440182 420317 406872 398087 392887 390601
56785 390601 390367 391686 395032 401092 409818 421059 435479 453397 472579 488196 495340 491298 475856
56772 475856 450672 418716 383522 348203 314963 285048 258628 234953 213325 193926 177279
56761A77279j4044j2116j0462q673p087o060n252m308l485l057k795k571k668
56748I4701k953k661j646r36j228j720j337l84J46K54O95J447J518L68j328k411
56732H2525k298j347m77k59k66K98J302J730J249P86J062J443J072L49L56J207
56716H8732J978K036J639J278J134J182J347J480J411J106O62K84J84K88J89j89
56700A04741j80P05J669J442J31q34p18k57j79j56J77L01k45q91p93K6R57J596
56682A07492J783J456J030J230K069K679K524K052J761J469J079J084J679K109
56668A31496J653N77l92q51n58O18K046K545J870J147J197J415R86K23j75l06
56652A43491n53o18l7R14J635J959J894J275L15k90l83p02j548k114j801j185
$$ plain form
56761 177279 163235 151119 140657 131984 124897 118837 113585 109277 105792 102735 99940 97369 94701
56748 94701 91748 89087 87441 86505 85277 83557 82220 81836 81982 82236 82931 84378 85896 86264 84936 82525
56732 82525 80227 78880 78403 78144 77878 78176 79478 81208 82457 83243 84305 85748 86820 87169 87525 88732
56716 88732 90710 92746 94385 95663 96797 97979 99326 100806 102217 103323 103985 104269 104453 104741 104930 104741
56700 104741 104561 105266 106935 108377 108508 107674 106956 106699 106520 106364 106541 106842 106597 105706 104913 104939 105896 107492
56682 107492 109275 110731 111761 112991 115060 117739 120263 122315 124076 125545 126624 127708 129387 131496
56668 131496 133149 133726 133334 132483 131925 132543 134589 137134 139004 140151 141348 142763 143749 143972 143797 143491
56652 143491 142938 142320 142283 143197 144832 146791 148685 149960 150275 149985 149602 148900 147352 145238 143437 142252
56636A42252r27p32l29l32r97j296m63M68J27j068j666j423j240j300r37j56J47
56619A30128l94j060j091n19P1P0o59j451j351m06K69R6j92K5K02j22k18N14J110
56600A25022L79j063j598q32L38J314K067K258J533M58j56m81j100j598j098J27
56584A25570R97J330J850K610K811K247J656J496J419J148R19R81J353K094L143
56569A51624M095M731N380O111O238N445M722N033N734N569M762M699N918P709
56555B27770R343J0308R637O625K259j371l248l920m046l744l318l257l331k878
56541B36829k107j932k419k605k127j799k222k842k862k347j937k032k476k702
56527B04420k213j266q07j239j739j482r41j063j628j661j081p66j093j522j660
$$ plain form
56636 142252 141325 140593 140264 139932 138935 137639 137176 137644 137771 136703 135037 133614 132374 131074 130137 129981 130128
56619 130128 129734 128674 127583 127064 127135 127205 126546 125095 123744 123338 123607 123703 123511 123536 123738 123616 123398 123912 125022
56600 125022 125401 124338 122740 121908 122246 123560 125627 127885 129418 129876 129720 129239 128139 126541 125443 125570
56584 125570 126567 127897 129747 132357 135168 137415 139071 140567 141986 143134 144053 145034 146387 148481 151624
56569 151624 155719 160450 165830 171941 178179 183624 188346 193379 199113 204682 209444 214143 220061 227770
56555 227770 237113 247421 257058 263683 265942 264571 261323 257403 253357 249613 246295 243038 239707 236829
56541 236829 234722 232790 230371 227766 225639 223840 221618 218776 215914 213567 211630 209598 207122 204420
56527 204420 202207 200941 200134 198895 197156 195674 194733 193670 192042 190381 189300 188534 187441 185919 184259
56512A84259j695j745j656j470j357j210r14q06j106j307q94k50k0p6L0M8m53
56495A69378j072j122p59n63m44q4J55j59m91j28N07N93L48M99Q86R19Q33J062
56477A70358J044K19m79J10J206J114K5k98N83J249Q87K63M5k6j2M65J047Q38
56459A78638N1j57L41M71j8j23N10R18N81K48M57O93N50M34N21L25k36m51O3Q37
56439A84653J411J687J438N49k33q4M88L06n65j022q88r70j276r53q8K66N5L25
56421A85099J139J300N30K8L06L57l49q36l33N76J282K019K713K465J105q9r0
56404A97222O48J249J508J364N60n82j121p19Q8R88K068K871K673J837J412J302
56388B13368N30o89r67q6O02M81M52R45J108N73K08N12R32J284K016K694K180
$$ plain form
56512 184259 182564 180819 179163 177693 176336 175126 174212 173406 172300 170993 170099 169849 169829 169753 169783 169831 169378
56495 169378 168306 167184 166425 165862 165418 165334 165489 165330 164839 164711 165218 165811 166159 166658 167544 168463 169296 170358
56477 170358 171402 171621 171142 171252 172458 173572 173597 173299 173882 175131 176018 176281 176326 176300 176288 176753 177800 178638
56459 178638 178689 178532 178873 179344 179326 179203 179713 180631 181212 181460 181917 182610 183160 183594 184115 184440 184204 183753 183816 184653
56439 184653 186064 187751 189189 189738 189505 189421 189909 190215 189650 188628 187740 186770 185494 184541 184453 184719 184774 185099
56421 185099 186238 187538 188068 188096 188402 188759 188410 187574 187241 187817 189099 191118 193831 196296 197401 197312 197222
56404 197222 197870 199119 200627 201991 202551 201969 200848 200129 200217 201205 203273 206144 208817 210654 212066 213368
56388 213368 213898 213209 212242 212156 212758 213239 213691 214636 215744 216317 216525 217037 217969 219253 221269 223963 226143
56371B26143P75J35N91P30J37J27J058J432P48O51J976K992K242Q75N30Q67R31
56354B42940J070J739K057J316M33L91O55N81P39J437J554M16p10n56K33O16J046
56337B55957K116K946K672K180K597L287L190K892L517M575M746M028L472L456
56323C01631L599L703L573K756J429O46P48P02p0n39R6R21Q67M03M05O73Q16J316
56305C23675K363L030K797K564L012L413L281L587M933O172O265N917N934N608
56291C82551M347L237L315L871M056M556N928O960O613O004O552P694Q269Q664
56277D62617R569J0234R999J0094J1708J3635J4080J3570J3924J5483J7470J9847
56265F22230K2767K5350K7056K9105L2588L6526L9733M3146M8086N3765N8871
$$ plain form
56371 226143 226918 227053 227644 228374 228511 228638 229696 231128 231876 232527 234503 237495 239737 240612 241142 242009 242940
56354 242940 244010 245749 247806 249122 249555 249946 250601 251182 251921 253358 254912 255328 254618 254062 254295 254911 255957
56337 255957 258073 261019 263691 265871 268468 271755 274945 277837 281354 285929 290675 294703 298175 301631
56323 301631 305230 308933 312506 315262 316691 317337 318085 318787 318717 318178 318274 319195 320062 320465 320870 321543 322359 323675
56305 323675 326038 329068 331865 334429 337441 340854 344135 347722 352655 358827 365092 371009 376943 382551
56291 382551 386898 390135 393450 397321 401377 405933 411861 418821 425434 431438 437990 445684 453953 462617
56277 462617 472186 482420 492419 502513 514221 527856 541936 555506 569430 584913 602383 622230
56265 622230 644997 670347 697403 726508 759096 795622 835355 878501 926587 980352 1039223
56254A039223O4231P1328P9455Q6954R4019J01732J09376J15443J20322J25362
56244B007445J30100J33111J34671J35924J36048J33034J26732J18534J08554
56235C164153R5665P9973O2743M4177K3493J045k1741m4048o5359q4098r8748
56224C157255j09833j18871j26013j30558j32901j33759j32513j28375j22437
56215B021995j16339j09965j02613r5322q9514q4359p8098p1166o5407o1038n6820
56204A091354n2496m8565m4493l9643l5095l2104k9750k6573k3294k1262j9532
56193G18547j6520j3333j2183j2544j2159j0958j0555j0620r341o971n498n129
56181E92736m404l316l046l038j806j74k09j311j032N90J219O45J081K880L794
$$ plain form
56254 1039223 1103454 1174782 1254237 1341191 1435210 1536942 1646318 1761761 1882083 2007445
56244 2007445 2137545 2270656 2405327 2541251 2677299 2810333 2937065 3055599 3164153
56235 3164153 3259818 3339791 3402534 3446711 3470204 3471249 3449508 3405460 3340101 3256003 3157255
56224 3157255 3047422 2928551 2802538 2671980 2539079 2405320 2272807 2144432 2021995
56215 2021995 1905656 1795691 1693078 1597756 1508242 1423883 1345785 1274619 1209212 1148174 1091354
56204 1091354 1038858 990293 945800 906157 871062 838958 809208 782635 759341 738079 718547
56193 718547 702027 688694 676511 663967 651808 640850 630295 619675 610334 603363 597865 592736
56181 592736 588332 585016 581970 578932 577126 576952 576743 575432 574400 574990 576209 576854 577935 580815 584609
56166E84609K971K185K511L128L826N481P619Q604Q617R333J0598J0771J0466
56153F70719J2272J6386K0036K1972K4017K7467L1319L4885L8930M3335M6712
56142I88050M9136N2468N7244O2075O6520P1606P7104Q1368Q4136Q6356Q6865
56131A762928Q2701P3413O2003N1041M0968L2564K7455K5151K2574J7430R641
56120B207869n47j2735k4421l2361l6388l9053m1578m3518m6232n2494o2035p1180
56108A745327p7511q1429q2881q0452p4434o7093n9272n0220m1031l4369l0222
56097A066413k5875k0498j5944j2703r200n532l558k854r14K152L600L222L779
56084I82088N703O331N195N039O596P417P046Q048J0677J1753J0459R999J1782
$$ plain form
56166 584609 587580 589765 592276 595404 599230 604711 612330 620934 629551 638884 649482 660253 670719
56153 670719 682991 699377 719413 741385 765402 792869 824188 859073 898003 941338 988050
56142 988050 1037186 1089654 1146898 1208973 1275493 1347099 1424203 1505571 1589707 1676063 1762928
56131 1762928 1845629 1919042 1981045 2032086 2073054 2105618 2133073 2158224 2180798 2198228 2207869
56120 2207869 2207322 2194587 2170166 2137805 2101417 2062364 2020786 1977268 1931036 1878542 1816507 1745327
56108 1745327 1667816 1586387 1503506 1423054 1348620 1281527 1222255 1172035 1131004 1096635 1066413
56097 1066413 1040538 1020040 1004096 991393 982193 976661 973103 970249 969335 971487 975087 978309 982088
56084 982088 987791 994122 999317 1004356 1010952 1018369 1025415 1033463 1044140 1055893 1066352 1076351 1088133
56071A088133J3101J2509J2354J3934J5142J4904J5108J6215J5957J4307J4585
56060A246249J7582J9743J9231J8600J9412J9574J8267J7989J9360J9386J7339
56049A452732J6817J9299K1282K0581J9902K1293K2633K2647K3818K7178K9613
56038A697795K9430K9300L0810L1619L0815L1321L4137L6002L5732L6770M0541
56027B064272M3506M3933M5119M8695N1302N1290N1990N4892N6511N5560N6170
56016B623240O0321O4242O6023O9196P4993P8940P9364Q1170Q6879R2130R4520
56005C471018R8284J05493J11529J14274J18687J27107J34573J39045J46255J58709
55995D724974J70272J77864J87660K03085K18050K29230K43355K64521K86242
$$ plain form
56071 1088133 1101234 1113743 1126097 1140031 1155173 1170077 1185185 1201400 1217357 1231664 1246249
56060 1246249 1263831 1283574 1302805 1321405 1340817 1360391 1378658 1396647 1416007 1435393 1452732
56049 1452732 1469549 1488848 1510130 1530711 1550613 1571906 1594539 1617186 1641004 1668182 1697795
56038 1697795 1727225 1756525 1787335 1818954 1849769 1881090 1915227 1951229 1986961 2023731 2064272
56027 2064272 2107778 2151711 2196830 2245525 2296827 2348117 2400107 2454999 2511510 2567070 2623240
56016 2623240 2683561 2747803 2813826 2883022 2958015 3036955 3116319 3197489 3284368 3376498 3471018
56005 3471018 3569302 3674795 3786324 3900598 4019285 4146392 4280965 4420010 4566265 4724974
55995 4724974 4895246 5073110 5260770 5463855 5681905 5911135 6154490 6419011 6705253
55986F705253L04425L25925L55398L86372M14740M48042M91512N38584N85610
55977A0555861O41712P13025P92231Q75699R75289J100756J247314J414456J619712
55968A9936055J879643K196448K579366L059419L666356M412377N314489O404213
55960D9448366P688901R121217J0617077J2065221J3302395J4142787J4495574
55953A30881538J4434931J4129484J3757648J3529385J3698422J4454259J5859478
55946B30745145J7949052K0666756K3344547K4254897K1200143J3106671J199034
55939C52466245j1515860k2020893k8719984l1592611l1506843k9546173k6659103
55932A70904778k3505298k0429411j7569084j4989461j2724235j0763314r077467
$$ plain form
55986 6705253 7009678 7335603 7691001 8077373 8492113 8940155 9431667 9970251 10555861
55977 10555861 11197573 11910598 12702829 13578528 14553817 15654573 16901887 18316343 19936055
55968 19936055 21815698 24012146 26591512 29650931 33317287 37729664 43044153 49448366
55960 49448366 57137267 66258484 76875561 88940782 102243177 116385964 130881538
55953 130881538 145316469 159445953 173203601 186732986 200431408 214885667 230745145
55946 230745145 248694197 269360953 292705500 316960397 338160540 351267211 352466245
55939 352466245 340950385 318929492 290209508 258616897 227110054 197563881 170904778
55932 170904778 147399480 126970069 109400985 94411524 81687289 70923975 61846508
55925F1846508p653423o477931n509347m697690m017795l457554k991376k591554
55917B4449838k251374j972752j742808j543126j370068j226152j102269r86790
55909A2254499q82109p95134p20626o49653n85122n33657m90601m47634m07194
55900F742769l75502l48854l20155k91984k70379k52390k31956k11795j97659
55891D242095j86715j72947j58499j48771j41665j32158j22423j17073j13297
55882B948547j05675r6294r0407q6380p9414p1147o6416o4345o1378n9412o2136
55871B105543o6646o7289o4753o3452o2956n9979n5877n4320n4041n1311m7120
55860A457799m4864m3444l9712l5221l3688l4064l2689l0091k9153k8911k6572
$$ plain form
55925 61846508 54193085 47715154 42205807 37508117 33490322 30032768 27041392 24449838
55917 24449838 22198464 20225712 18482904 16939778 15569710 14343558 13241289 12254499
55909 12254499 11372390 10577256 9856630 9206977 8621855 8088198 7597597 7149963 6742769
55900 6742769 6367267 6018413 5698258 5406274 5135895 4883505 4651549 4439754 4242095
55891 4242095 4055380 3882433 3723934 3575163 3433498 3301340 3178917 3061844 2948547
55882 2948547 2842872 2746578 2656171 2569791 2490377 2419230 2352814 2288469 2227091 2167679 2105543
55871 2105543 2038897 1971608 1906855 1843403 1780447 1720468 1664591 1610271 1556230 1504919 1457799
55860 1457799 1412935 1369491 1329779 1294558 1260870 1226806 1194117 1164026 1134873 1105962 1079390
55849A079390k3459k2676k3042k1544j9520k0143k1956k1218j8753j8151j8972
55838H49956j7973j5551j4793j5430j4649j2720j2166j2486j1275r453r781j1250
55826F92429j0477p828o763p785q249p660q041r398r675q948r155j0054r669q300
55812E70427p914q128o923m616l155k257l10J793J880O68O16J476J131L6M69K121
55796E47314K647J985J937K084M61k229l396l281m621p699r886j0059r577q784
55782D96896o477l118q61k07M1l71k777o146p658o873n922n479m044j333J152
55767D46823L186O066R272J0095P196J947l971r635j3651j4806j4120j3651j3367
55754D01384j1827r491q303q212p331n512m617n104n442n112n203n793n598m552
$$ plain form
55849 1079390 1055931 1033255 1010213 988669 969149 949006 927050 905832 887079 868928 849956
55838 849956 831983 816432 801639 786209 771560 758840 746674 734188 722913 713460 703679 692429
55826 692429 681952 674124 667361 659576 651327 643667 635626 626228 616553 607605 598450 588396 578727 570427
55812 570427 562513 554385 547462 542846 539691 537434 537124 538917 540797 541465 542081 543557 544688 544724 545193 547314
55796 547314 549961 551946 553883 555967 556428 554199 550803 547522 542901 535202 525316 515257 505680 496896
55782 496896 490419 487301 486440 486233 486274 485903 483126 476980 469322 462449 456527 451048 447004 445671 446823
55767 446823 450009 456075 465347 475442 482638 484585 480614 470979 457328 442522 428402 414751 401384
55754 401384 389557 380066 371763 363551 356220 350708 346091 340987 335545 330433 325230 319437 313839 309287
55740C09287m014m198l981l253k921k651j395L0k77j994l001k975l490m634m757
55725B65776l785l493m108l815k231j259j751k196j530n69J4O48J221R96N70J386
55709B45874K924L083J763J209K262L071K307Q84l68k068m333n957o514o992p569
55694B29576p081n433m130l636k645p83M59L52J94R11J692J897K163K678K513
55679B18727J573J138J630J965J755J953K511J922l0j496j553j583k499l025k162
55664B20826j061r25j039m53K34K44J42N67J024J169J594K273J965M01o87j42
55648B26132P26K81j063k054k713l622m386m294l623k954k263j630j794k976m181
55633A89586m655m868n235n191m406l670l534l341k546j773j618j616j403j557
$$ plain form
55740 309287 305273 301075 297094 293841 290920 288269 286874 286904 286627 284633 281632 278657 275167 270533 265776
55725 265776 261991 258498 254390 250575 248344 247085 245334 243138 241608 241039 241053 241701 242922 243918 244488 245874
55709 245874 248798 251881 253644 254853 257115 260186 262493 263377 263009 260941 256608 250651 244137 237145 229576
55694 229576 222495 217062 212932 209296 206651 205868 206327 206679 206873 207784 209476 211373 213536 216214 218727
55679 218727 220300 221438 223068 225033 226788 228741 231252 233174 233144 231648 230095 228512 226013 222988 220826
55664 220826 219765 218840 217801 217348 217582 217826 217968 218535 219559 220728 222322 224595 226560 226961 226274 226132
55648 226132 226858 227139 226076 224022 221309 217687 213301 209007 205384 202430 200167 198537 196743 193767 189586
55633 189586 184931 180063 174828 169637 165231 161561 158027 154686 152140 150367 148749 147133 145730 144173
55619A44173k319k689j909o98l2K26M73K95o75j789k209j906j220l76O2n47j678
55602A27182j970j299j007j545j644o94j8o59j557j336m21Q4K33N12M94k64r76
55585A15115p56l6L54O49J341J918J690J097R44J029P85M46M82N79L02R7N49J348
55567A27933J973K607L454L887L313K148R91l28j911k896k554j520r07q36q26
55552A34528q41r84r39o66q44j702k246j687p09k82j44L81R68J002Q80J243J569
55535A29527R55k34q85q53q26q08j22J162J945J358m47k652m269m585l818k977
55519A12471k633k266j397n33l12m76n38p07j189j395q68l13n77j240j368j055
55503I5604r95j074o64L1K28m4m5L33M45Q0k76l83m87n95l81Q2K24k52r71j346
$$ plain form
55619 144173 141854 139165 137256 136558 136526 136752 137225 137520 136845 135056 132847 130941 129721 129345 129407 128860 127182
55602 127182 125212 123913 122906 121361 119717 119023 119005 118346 116789 115453 115032 115116 115349 115861 116355 116091 115115
55585 115115 114359 114323 114677 115326 116667 118585 120275 121372 122316 123345 124130 124576 125058 125637 125939 126036 126585 127933
55567 127933 129906 132513 135967 139854 143167 145315 146306 145978 144067 141171 138617 137097 136190 135354 134528
55552 134528 133687 132703 131764 131098 130254 128552 126306 124619 123910 123628 123484 123865 124833 125835 126715 127958 129527
55535 129527 130482 130248 129363 128510 127684 126876 126754 127916 129861 131219 130772 128120 123851 119266 115448 112471
55519 112471 109838 107572 106175 105642 105330 104854 104316 103609 102420 101025 100157 99844 99267 98027 96659 95604
55503 95604 94609 93535 92871 92902 93130 93086 93041 93374 93819 93899 93623 93240 92753 92158 91777 91859 92083 91831 90860 89514
55483H9514j037j50O96Q62N37N78J163J288K96r42j167m97J7J09M06J079J454
55466I4206R99q2j236j917j690n85O44J169Q59J48n71j093j301j340j475j463
55450H5272p00N87J102J04j385j815r59K28R60J003K50j004j740j166J64R71Q02
55433H2674K17k47n28o43o31p59j135j241m91Q81K028K451K289J919J645J581
55417I0010J488J048M45J71J19l57j167j276l23N23J99o83q81l49M6Qo7n4j27
55398H8773k13k67o36j309j463o58J52j12r27r49q3N44M29J94L16N47O67P82P67
55379H6554L24l69q08q85q44o54k27K3l02p44n50J12M51L52L78O40O03Q0n05p97
55359H2832p22j04J019J899J760R48M85O41P83O34N80P11N22j62q14r48n92M1
$$ plain form
55483 89514 88477 88327 89023 89885 90422 91000 92163 93451 93747 92805 91638 91141 91158 91267 91673 92752 94206
55466 94206 95205 95123 93887 91970 90280 89695 90339 91508 92367 92515 91944 90851 89550 88210 86735 85272
55450 85272 84572 85159 86261 86365 84980 83165 82206 82434 83394 84397 84647 83643 81903 80737 80901 81872 82674
55433 82674 82891 82644 82116 81473 80842 80083 78948 77707 77216 78097 80125 82576 84865 86784 88429 90010
55417 90010 91498 92546 92991 93162 93281 92924 91757 90481 90158 90681 90880 90197 89316 88967 89013 89021 88954 88900 88773
55398 88773 88560 88293 87657 86348 84885 84227 84379 84267 83340 82391 82308 82852 83281 83475 83791 84338 85005 85787 86554
55379 86554 86878 86509 85701 84816 83972 83318 83091 83114 82812 82068 81518 81630 82081 82433 82811 83451 84054 84134 83629 82832
55359 82832 82110 82006 83025 84924 86684 87632 88117 88758 89541 90175 90755 91466 91988 91826 91012 90064 89472 89513
55341H9513O49O70j62j097j056j15N93M89J21m5l20q67j005k26Q02R57J21p46
55323H8276q65m18r9j64k63p8J48L7j97J6O06P75J50o11q15p03q06r24m94L72
55303H3943J011J116R21N97J01m72q60q37k60P59J529J270K69j96M16J058O74
55286I1039k34n23j21K29L30N16O65L81j34m10n62q61q76j30P64P48r2p35q00
55267H9194q14j040j144r51n84K8Q48J198N81j89J42J344J911J129j71r35q70
55250H9677j10J001J657J174O3m51KO14O80K51l64q75q54k56R8m50j219j159n89
55231H8890o46j273j336o56j97j51L64J374J566M15p75p57MM32L65K12O6k2K67
55212H8142Q92J254J109Q60O49P9p29r48l70J75J84J87N04N50K3l68j94j58p58
$$ plain form
55341 89513 90162 90832 90670 89573 88517 88402 88995 89484 89605 89560 89240 88373 87368 87142 87944 88901 89022 88276
55323 88276 87411 86993 86894 86730 86467 86389 86537 86574 86377 86393 86999 87774 87924 87313 86498 85795 84989 84065 83571 83943
55303 83943 84954 86070 86991 87588 87689 87217 86357 85520 85260 86019 87548 88818 89087 88891 89307 90365 91039
55286 91039 90805 90282 90161 90390 90720 91236 91901 92282 92148 91738 91176 90315 89439 89309 90073 90821 90729 89994 89194
55267 89194 88380 87340 86196 85245 84661 84689 85537 86735 87316 87127 87269 88613 90524 91653 91482 90547 89677
55250 89677 89567 90568 92225 93399 93462 93011 93013 93627 94307 94558 94194 93319 92465 92209 92307 91857 90638 89479 88890
55231 88890 88244 86971 85635 84979 84782 84631 84995 86369 87935 88350 87575 86818 86822 87254 87619 87831 87897 87875 88142
55212 88142 89034 90288 91397 92257 92906 92985 92256 91308 90938 91113 91297 91484 91988 92538 92561 92193 91999 91841 91083
55193I1083j170n71L72M83j47n55m83l91k78L46J399K073J834R82J82j18Q4M17
55175I5542N34N56Q37J261J269O71j59r40j620j789r02O42J531J131K24k45k26
55158I8317nN23J285J583R57j29j012j606j927j684r45m34n02n08Q1P22P37M67
55140I5920N52P47M29k06m58l13l46o73q20n94l23k61k88j84J41N74P17K71l76
55121I4509m53M0K20l35q70o66j35K0L7N11J175J277Q34N30N31L20l18q55p71
55102I5601j53N24R12J004J024J073R03L64k4L82J239J473Q69M64R06J430J167
55085A09158N14K71K46j44n45j30Q81J370R03J53k20j97lJ91R2l93p18k84N57
55066A11702Q05J79n63q07q27j062j261q27K72J367J823J689J473J370R29k44
$$ plain form
55193 91083 89913 89342 89714 90197 90050 89495 89012 88621 88343 88689 90088 92161 93995 94977 95159 95041 95125 95542
55175 95542 96076 96632 97469 98730 99999 100670 100511 99571 97951 96162 95260 95902 97433 98564 98788 98543 98317
55158 98317 98312 98835 100120 101703 102660 102531 101519 99913 97986 96302 95357 94923 94421 93913 93994 94716 95453 95920
55140 95920 96472 97219 97648 97442 96984 96671 96325 95652 94832 94238 93915 93654 93366 93182 93323 93897 94614 94885 94509
55121 94509 94056 94096 94316 93981 93111 92445 92310 92330 92367 92878 94053 95330 96164 96694 97225 97545 97227 96372 95601
55102 95601 95448 95972 96884 97888 98912 99985 100888 101252 101228 101610 102849 104322 105191 105655 106561 107991 109158
55085 109158 109672 109943 110189 110045 109500 109370 110251 111621 112524 112677 112457 112260 112257 112448 112540 112147 111429 111145 111702
55066 111702 112507 112686 112123 111316 110489 109427 108166 107339 107611 108978 110801 112490 113963 115333 116262 116018
55050A16018j684k415k071j235o17m09n32r03j293j412j354j407j386q55m0L66
55034I8771M17Q81J677J631M43m36J10J055P95l84q95l34J93L1k40p5J85R1k58
55015A03658o08r37j183j122o76j8O70J207J327R97O27N91P62Q80J002J171J120
54998A09468P52M91N79O03K64Q7N88J301J446J068O86K56n33j312j411r28n06
54981A12899k88K6L03J83r3K0L58L08j09l59m26o96r60n82L45J025J109Q90M86
54962A14439j32l76M28J681J934Q80k00l10J42M21N22N58J54p95j579j535q73
54945A15359j50M73R56R91M79j29l92l64j89K05O61O78J79j25L31J171J615J461
54927A23210J150J192J909L252M567M938M189L208K942L423M065M507M726M714
$$ plain form
55050 116018 114334 111919 109848 108613 107996 107587 107055 106152 104859 103447 102093 100686 99300 98445 98405 98771
55034 98771 99188 100069 101746 103377 103820 103384 103494 104549 105344 104960 104065 103731 103924 103955 103715 103640 103825 103916 103658
55015 103658 103050 102113 100930 99808 99132 99114 99784 100991 102318 103315 103942 104533 105295 106175 107177 108348 109468
54998 109468 110220 110711 111290 111893 112157 112244 112832 114133 115579 116647 117333 117589 117056 115744 114333 113405 112899
54981 112899 112611 112637 112940 113123 113030 113050 113408 113716 113607 113248 112822 112126 111166 110584 110929 111954 113063 113953 114439
54962 114439 114307 113931 114359 116040 117974 118854 118654 118344 118486 118907 119429 119987 120141 119346 117767 116232 115359
54945 115359 115209 115682 116638 117629 118108 117979 117587 117223 117034 117239 117900 118578 118757 118632 118963 120134 121749 123210
54927 123210 124360 125552 127461 130713 135280 140218 144407 147615 150557 153980 158045 162552 167278 171992
54913A71992M440L948L145J737k49k157l222l374l236l489m280n150n399m766
54899A49940l768l130k920k586j853j077n99l01p5j63o30q84l24P45J356J102
54883A34833O77J006K102L031L095K735K964L938M549L749J981Q27J233K560L414
54868A72694L105K102J180M24p89k747m602n129m251l270l271l947m362m326m244
54853A38567m029l107j494j59j8j006k179k597k098j381j273j801k300k411k353
54838A10361k148j400k99J57l69p63o0J016J274R52J023J255O67m69q20k28K7
54821A10176n31q06o8Q12Q61M24L47P52J317J845J937J093k85r85o37k41m50n16
54803A15045K00Q16K55r26j305o41N8J78P3J48L67O80J133J497J437J070Q72J038
$$ plain form
54913 171992 176432 180380 183525 185262 185013 182856 179634 176260 173024 169535 165255 160105 154706 149940
54899 149940 146172 143042 140122 137536 135683 134606 134007 133706 133631 133468 132838 131954 131630 132375 133731 134833
54883 134833 135510 136516 138618 141649 144744 147479 150443 154381 158930 162679 164660 165487 166720 169280 172694
54868 172694 175799 177901 179081 179505 178716 175969 171367 166238 161987 158717 155446 151499 147137 142811 138567
54853 138567 134538 131431 129937 129778 129760 128754 126575 123978 121880 120499 119226 117425 115125 112714 110361
54838 110361 108213 106813 106514 106671 106302 105539 105479 106495 107769 108721 109744 110999 111666 111197 110377 110149 110176
54821 110176 109645 108839 108771 109583 110444 110868 111215 111967 113284 115129 117066 118159 117874 116889 116252 116011 115561 115045
54803 115045 115245 116061 116316 115390 114085 113444 113502 113680 113753 113901 114268 114948 116081 117578 119015 120085 120957 121995
54785A21995J296J280Q55J95k39l7O45J226J459J622J865J935J787J826K244K677
54769A42631K914L232L636L561K827K223K460L221L873M375M773M482L037J079
54755A88324m02j432k689m099m874m830m638m745m841m552l952l210k374j575
54741A40111j008o06j97N0k07q37j223r68k32O12J258J504J345J062R48J006J186
54724A43804J631K413L178L526L458L206K866K616K854L592M042L505K332J338
54710A84361N04q53k747m337n123n465n610n220m239l427l348l471k940j930j405
54695A34750j699k115j998j562j364j443j428j194r30o72k55J89K37j64m56j97
54679A19699K94M80M04M03L44j28p07o61pL71J0m49l38J4j54q85j540j585r38
$$ plain form
54785 121995 123291 124571 125426 125621 125382 125345 125990 127216 128675 130297 132162 134097 135884 137710 139954 142631
54769 142631 145545 148777 152413 155974 158801 161024 163484 166705 170578 174953 179726 184208 187245 188324
54755 188324 187922 186490 183801 179702 174828 169998 165360 160615 155774 151222 147270 144060 141686 140111
54741 140111 139103 138497 138300 138350 138143 137306 136083 135115 134883 135495 136753 138257 139602 140664 141612 142618 143804
54724 143804 145435 147848 151026 154552 158010 161216 164082 166698 169552 173144 177186 180691 183023 184361
54710 184361 184865 184012 181265 176928 171805 166340 160730 155510 151271 147844 144496 141025 138085 136155 134750
54695 134750 133051 130936 128938 127376 126012 124569 123141 121947 121017 120345 120090 120279 120516 120352 119896 119699
54679 119699 119993 120473 120877 121280 121624 121496 120789 120128 120121 120492 120502 120053 119715 119729 119575 118690 117150 115565 114627
54660A14627J52J176J534J121M50jk91n68o34l42l9q7l13l50j87K8L53P88J013
54641A18430Q77Q16J167J465J027oq10r54p11m19r3L25P31Q74M83m34j231j025
54623A20512J58J173J092K95k71l96m33l59P8N69N01q6n62o85p49q42p21m42l72
54604A18460n40n76l53o8K62P40J091Q94L07p0j17k04l48j07N29R45Q16N27L59
54585A22547J3o81j185r01j0P22Q03M04J11L40Q28P87j30j215j500j006n39m33
54567A18955k88P2K56J67K71P23R76O82L04L48O81J004J398J820J761J072N23
54550A30725Q30J528J579Q21j9n12q72j111p49L63J502J789J177M24K23N63R22
54533A39183R33P48O79N99M5j020j912j971j379q78r07j230j410j177m92M51J158
$$ plain form
54660 114627 114779 115955 117489 118610 119060 119059 118768 118200 117566 117224 117185 117098 116785 116435 116248 116276 116629 117417 118430
54641 118430 119307 120123 121290 122755 123782 123776 122966 122012 121301 120882 120789 121114 121845 122719 123202 122768 121537 120512
54623 120512 120670 121843 122935 123230 122959 122563 122130 121771 121849 122418 122919 122833 122271 121586 120837 119995 119274 118832 118460
54604 118460 117920 117344 116991 116923 117185 117925 119016 119910 120217 120147 120030 119826 119478 119371 119900 120845 121661 122188 122547
54585 122547 122560 121879 120694 119793 119783 120505 121308 121712 121823 122163 122991 123778 123648 122433 120933 119927 119388 118955
54567 118955 118667 118739 118995 119162 119433 120156 121132 121814 122118 122466 123147 124151 125549 127369 129130 130202 130725
54550 130725 131555 133083 134662 135483 135464 134952 134080 132969 132220 132583 134085 135874 137051 137475 137698 138261 139183
54533 139183 140116 140864 141543 142142 142187 141167 139255 137284 135905 135027 134120 132890 131480 130303 129811 130262 131420
54516A31420J146M65k23k43M66J282J429O60m50j000o71q0Ql23k96L91J056R39
54498A35976K61j21O7K25r8n51o07m02m29o74o66k86O9J95L79P59R73P34L83M19
54478A36606Q10J134J213J163J041Q11N61M13K55p0l88k93L11J066J483J336P40
54461A48192L4m83p86r96j033o79q6K06l1l66l22J0K97M56M78J47m93q29l87L94
54441A43723O98L56k47q84j473j584q96NJ55m52q50n40q1l0j56l0K75M97P28J185
54421A40399J799K317K527K244J459O40M38Q74J236R08j5j046j755j848j245l78
54405A48554J09P3lK55P03J056J242J259J124J038J131J107O60K44O18J577J999
54388A62746J358L50k59n12o10l58J88L69J3l4P46J460J028q7n60j19K99J13l12
$$ plain form
54516 131420 132566 133031 132808 132565 133031 134313 135742 136402 135952 134952 134281 134201 134209 133886 133590 133981 135037 135976
54498 135976 136237 136116 136183 136408 136310 135759 135152 134750 134321 133647 132981 132695 132764 132959 133338 134097 135070 135804 136187 136606
54478 136606 137416 138550 139763 140926 141967 142778 143339 143752 144007 143937 143549 143256 143567 144633 146116 147452 148192
54461 148192 148226 147743 146957 145961 144928 144249 144163 144369 144338 143972 143650 143660 143957 144413 144891 145038 144545 143716 143329 143723
54441 143723 144421 144777 144530 143646 142173 140589 139693 139698 139853 139401 138551 138011 137930 137900 137744 137714 137989 138486 139214 140399
54421 140399 142198 144515 147042 149286 150745 151385 151823 152697 153933 154841 154826 153780 152025 150177 148932 148554
54405 148554 148663 148736 148733 148988 149691 150747 151989 153248 154372 155410 156541 157648 158308 158552 159170 160747 162746
54388 162746 164104 164454 164195 163683 163073 162715 162903 163272 163285 163251 163997 165457 166485 166398 165838 165719 166018 166131 165819
54369A65819n51n81l17M02J183J335Q90O79J169J936K438K571K326J645R21R08
54353A82773J646K156J655N82j15k54l99r12j572k080k350k421k444k676l084
54338A70505l132k401j373j017j503j920j513o64k09k14j14J83J07n02r24o09
54322A54700l7J4k76r2O19R49L81m44o97m89m38n96n02j16J4l98r36j147j135
54303A49374j230j368j190o01R2O19R30R82O19o9n67m24J53N89P22Q84J095P36
54285A51346m55j597j503k64P39N35k79m12M98J602K012J726J341J127P22k13
54269A56925j284j604p91N43J442J519J002K46m30o16j19O85J202J340J446J620
54253A63126J666J630J798J963J454J73r73j137o57n51j211k036k244j646o85
$$ plain form
54369 165819 165268 164687 164370 164772 165955 167290 168180 168859 170028 171964 174402 176973 179299 180944 181865 182773
54353 182773 184419 186575 188230 188812 188697 188443 188044 187132 185560 183480 181130 178709 176265 173589 170505
54338 170505 167373 164972 163599 162582 161079 159159 157646 156982 156773 156559 156445 156628 156735 156233 155309 154700
54322 154700 154663 154677 154401 154309 154928 155877 156258 155814 155117 154628 154190 153594 153092 152976 152990 152592 151656 150509 149374
54303 149374 148144 146776 145586 144985 145077 145696 146626 147608 148227 148158 147591 147167 147320 147909 148631 149515 150610 151346
54285 151346 150891 149294 147791 147527 148266 148801 148522 148110 148608 150210 152222 153948 155289 156416 157138 156925
54269 156925 155641 154037 153246 153789 155231 156750 157752 157998 157568 156952 156833 157518 158720 160060 161506 163126
54253 163126 164792 166422 168220 170183 171637 171810 170837 169700 169043 168492 167281 165245 163001 161355 160670
54238A60670J7J59m1j80j94l09m87l25L26R86J080N89j2k62jN62R56Q68N49M69
54218A65420N70L48k45n94l90j41l19o22n96m62o00p09k73L86L95l93j192j396
54200A59187j231j098r18m67R1L55J88j91m88n48l84p0L05N98O09K93n1p0J37
54181A56247J82J07L67R19J047M94R9N28J056O05l82l73Q83J785J067m52j115
54164A63064n97L0j0m45p52q46p98n17q1J5n85j459j679p54Q37K095K307J463
54146A61288Q3j157j741j552r30l64p5J04L99P49Q43M76j67n64l46K49N81M44
54128A58320M45J184K212K361J171m28j115m69Q40J837J967J389Q04Q08J215J308
54112A73849P86J00k67l74m31k89J66N60M76J34J59P19J316J363P40r8l69M38
$$ plain form
54238 160670 160687 160846 160805 160625 160431 160122 159635 159310 159636 160622 161702 162291 162279 162017 162016 162578 163534 164402 164951 165420
54218 165420 165990 166338 166093 165499 165109 164968 164649 164027 163431 162969 162369 161660 161387 161773 162168 161775 160583 159187
54200 159187 157956 156858 155940 155473 155564 155919 156107 155916 155428 154880 154496 154426 154731 155329 155938 156231 156180 156110 156247
54181 156247 156429 156536 156903 157822 158869 159363 159462 159990 161046 161651 161269 160896 161779 163564 164631 164179 163064
54164 163064 162467 162497 162487 162042 161290 160444 159646 159129 159048 159063 158478 157019 155340 154586 155423 157518 159825 161288
54146 161288 161371 160214 158473 156921 155991 155627 155552 155656 156055 156804 157647 158123 157956 157392 157046 157295 157876 158320
54128 158320 158765 159949 162161 164522 165693 165265 164150 163681 164521 166358 168325 169714 170518 171326 172541 173849
54112 173849 174635 174735 174468 174094 173663 173374 173540 174100 174576 174710 174869 175588 176904 178267 179007 178909 178540 178978
54094A78978J921K977K908K143J621J781K434L207L727L652L091K686K804K924
54080B16854K321J101p7j050k147l232l568k803j544o72m60n51m80r9L12L36m4
54063B04197l25j60J24J9m12p30p84o31n3J117K318K668K183J822K204K884L170
54046B19611L058L006L316L967M795N511N908O166O650P250P398O893O256N983
54032B95768N846N372M632M148M154M325M255L868L329K674J793P59Mj20J14Q2
54016C41003k86l36K19N87j90j937l640m748n514o158o510o517o374o015n158
54001B88426m011l297l372l802m087m209m265m096l632l118k763k463k146j944
53987B41221j925j963k057k263k350j981j357j075j198j159p34m10m59m32j3L42
$$ plain form
54094 178978 180899 183876 186784 188927 190548 192329 194763 197970 201697 205349 208440 211126 213930 216854
54080 216854 219175 220276 220199 219149 217002 213770 210202 207399 205855 205183 204723 204172 203692 203593 203905 204241 204197
54063 204197 203872 203712 203836 203855 203443 202713 201929 201298 201245 202362 204680 207348 209531 211353 213557 216441 219611
54046 219611 222669 225675 228991 232958 237753 243264 249172 255338 261988 269238 276636 283529 289785 295768
54032 295768 301614 306986 311618 315766 319920 324245 328500 332368 335697 338371 340164 340923 340927 340807 340921 341003
54016 341003 340717 340381 340600 341187 340997 339060 335420 330672 325158 319000 312490 305973 299599 293584 288426
54001 288426 284415 281118 277746 273944 269857 265648 261383 257287 253655 250537 247774 245311 243165 241221
53987 241221 239296 237333 235276 233013 230663 228682 227325 226250 225052 223893 223159 222749 222290 221858 221845 222187
53971B22187J83j96l54m61q01r85m44N93J332J442J273J196J269J451J707K009
53955B31401K538L554M809N525N381N076N328N802N698N083M809N333O364P605
53941C04306R012J0337J1114J1215J0849R892P901M881J564j231l080l834l576
53928C69350k804k118j567p66L18J269J946K705L706M645N358O110O953P441P388
53913D09934P333P733Q208Q164P786P663P678O984N229L172J871J593J639J069
53899D86056m58k401l822m314m345m606n207n763o077o282o451o524o660p184
53885D15962q029q617q563q172q027q244q421q168p509o804o332n880m902l387
53871C14907k367k934m671n809n344m240l962m500m801m579m519m755m513l544
$$ plain form
53971 222187 222370 222174 221820 221359 220558 219573 219129 219722 221054 222496 223769 224965 226234 227685 229392 231401
53955 231401 233939 237493 242302 247827 253208 258284 263612 269414 275112 280195 285004 290337 296701 304306
53941 304306 313318 323655 334769 345984 356833 366725 374626 379507 381071 379840 376760 372926 369350
53928 369350 366546 364428 362861 362095 362413 363682 365628 368333 372039 376684 382042 388152 395105 402546 409934
53913 409934 417267 425000 433208 441372 449158 456821 464499 471483 476712 479884 481755 483348 484987 486056
53899 486056 485598 483197 479375 475061 470716 466110 460903 455140 449063 442781 436330 429806 423146 415962
53885 415962 407933 399316 390753 382581 374554 366310 357889 349721 342212 335408 329076 323196 318294 314907
53871 314907 312540 309606 304935 299126 293782 289542 285580 281080 276279 271700 267181 262426 257913 254369
53857B54369k752k834l248l212k844k542j958o60O64Q17k16j193j282r21p80p76
53841B30632m91n1m3p27j668k065j490l85K65Nm96l34M31R72R73J018J550K093
53823B30189J908R67n9n47l71J80P71J305J939K671L092K821K109J632J689K026
53807B52322K362K687L018L390M054N169O192O251N338M572M898O035O996P277
53793C20561O993O304N233L970K917K373K320K498K513K021R67l31j392j875j865
53778C53207j938k667l848m533m287l995m752o281p235o988o220n627n066m321
53764B85449l764l747l983m084m115m197m057l466k643j865j160o47o39j041j286
53749B44755j256j526k304k878k652k010j491r23j03M18J73k72j53K72K99M6J23
$$ plain form
53857 254369 251617 248783 245535 242323 239479 236937 234979 234319 234983 235800 235584 234391 233109 232188 231408 230632
53841 230632 230141 230090 230047 229320 227652 225587 224097 223712 223977 223982 223486 223152 223583 224555 225528 226546 228096 230189
53823 230189 232097 233064 233005 232458 232087 232267 233038 234343 236282 238953 242045 244866 246975 248607 250296 252322
53807 252322 254684 257371 260389 263779 267833 273002 279194 285445 290783 295355 300253 306288 313284 320561
53793 320561 327554 333858 339091 343061 345978 348351 350671 353169 355682 357703 358670 358339 356947 355072 353207
53778 353207 351269 348602 344754 340221 335934 331939 327187 320906 313671 306683 300463 294836 289770 285449
53764 285449 281685 277938 273955 269871 265756 261559 257502 254036 251393 249528 248368 247721 247082 246041 244755
53749 244755 243499 241973 239669 236791 234139 232129 230638 229715 229612 230030 230203 229931 229778 230050 230349 230395 230518
53732B30518M29M15K18L96P34M86k61o31l28O3K70P27J584K323K624K662K400
53715B44629J516K99k61K68J246J916K160K050J592J222J641K665L127K548K014
53700B68632K713M267N314N113L934K352J001N73J207K100K374K095J848J678
53686C05201J217N73K21J10l34j206j900k034j900j789j480p91p5K50L48O38J040
53669B98089J036L96n21j246j607j577j093k88L07K01m07p19k32O35J017N67k74
53652B94284q54r44p53n51l80j51Q4Q0k94o91n29L74J532K296K448K165J766J597
53634C01479J898K436K591K140J666J772K147K033J468J367K262L571M421M646
53620C35897M644M592M275L577K846K669L313M382N094N040M583M325M341M249
$$ plain form
53732 230518 230947 231362 231580 231976 232710 233196 232935 232304 231976 232039 232309 233036 234620 236943 239567 242229 244629
53715 244629 246145 246444 246183 246451 247697 249613 251773 253823 255415 256637 258278 260943 264070 266618 268632
53700 268632 271345 275612 280926 286039 289973 292325 293326 293899 295106 297206 299580 301675 303523 305201
53686 305201 306418 306991 307212 307322 306988 305782 303882 301848 299948 298159 296679 295888 295813 296063 296411 297049 298089
53669 298089 299125 299521 299000 297754 296147 294570 293477 293189 293496 293697 293290 292571 292339 292974 293991 294558 294284
53652 294284 293430 292486 291733 291182 290802 290651 290735 290815 290521 289830 289301 289675 291207 293503 295951 298116 299882 301479
53634 301479 303377 305813 308404 310544 312210 313982 316129 318162 319630 320997 323259 326830 331251 335897
53620 335897 340541 345133 349408 352985 355831 358500 361813 366195 371289 376329 380912 385237 389578 393827
53606C93827L876L472L217L006K796K756K930L022K714K000J142M82K60L63L12
53591D26175k03q36j047r59j198j857k226j839j186j029j395j649j364p21k30
53576D08436k53p62j370j700j723j665j620j569j630j825j703q23L06M95n98j819
53560C90177j854p42M21Q22M91j46n91m30L31J090J307J135J070J142J013P20
53544C95956P85J460K301K674K494K310K763L946N194N694N393N072N373O064
53530D47479O564O884P512Q565R650J0525J1382J2357J3179J3552J3568J3634
53518E74851J4126J5141J6378J7295J7674J8004J8955K0456K1738K2345K2641
53507G79604K3159K3901K4579K5106K5410K5153K4194K3164K2896K3233K3056
$$ plain form
53606 393827 397703 401175 404392 407398 410194 412950 415880 418902 421616 423616 424758 425240 425500 425863 426175
53591 426175 425972 425136 424089 423130 421932 420075 417849 416010 414824 413795 412400 410751 409387 408666 408436
53576 408436 408183 407421 406051 404351 402628 400963 399343 397774 396144 394319 392616 391793 392099 392594 391996 390177
53560 390177 388323 387581 388002 388824 389315 389169 388578 388148 388479 389569 390876 392011 393081 394223 395236 395956
53544 395956 396741 398201 400502 403176 405670 407980 410743 414689 419883 425577 430970 436042 441415 447479
53530 447479 454043 460927 468439 477004 486654 497179 508561 520918 534097 547649 561217 574851
53518 574851 588977 604118 620496 637791 655465 673469 692424 712880 734618 756963 779604
53507 779604 802763 826664 851243 876349 901759 926912 951106 974270 997166 1020399 1043455
53496A043455K1753K0107J9337J9587J9877J9419J8400J7480J7008J6971J7297
53485A250691J7830J8148J7826J6952J6118J5815J5895J5741J4980J3910J3113
53474A427019J2585J1536R305O313L703K026P22r69l131n420p712r998j1981j3338
53460A420660j4214j4950j5495j5558j5246j5075j5342j5931j6720j7668j8565
53449A245896j9115j9321j9350j9057j8142j6811j5710j5120j4718j4181j3445
53438A060926j2295j0402q056o161n134m326l002j321J27J253K285L097L429L645
53424A024065M546O379Q502J0170J1293J2317J3659J5368J7202J8926K0563K2303
53412A185293K4145K5821K7125K8195K9376L0943L2896L4882L6419L7435L8475
$$ plain form
53496 1043455 1065208 1085315 1104652 1124239 1144116 1163535 1181935 1199415 1216423 1233394 1250691
53485 1250691 1268521 1286669 1304495 1321447 1337565 1353380 1369275 1385016 1399996 1413906 1427019
53474 1427019 1439604 1451140 1460445 1466758 1470461 1472487 1473209 1472240 1469109 1463689 1455977 1445979 1433998 1420660
53460 1420660 1406446 1391496 1376001 1360443 1345197 1330122 1314780 1298849 1282129 1264461 1245896
53449 1245896 1226781 1207460 1188110 1169053 1150911 1134100 1118390 1103270 1088552 1074371 1060926
53438 1060926 1048631 1038229 1030173 1024012 1018878 1014552 1011550 1010229 1010356 1011609 1013894 1016991 1020420 1024065
53424 1024065 1028611 1034990 1043492 1053662 1064955 1077272 1090931 1106299 1123501 1142427 1162990 1185293
53412 1185293 1209438 1235259 1262384 1290579 1319955 1350898 1383794 1418676 1455095 1492530 1531005
53401A531005L9958M1424M2164M2528M3780M6373M9229N1127N2100N2852N3483
53390B046023N3569N3120N2611N2322N2169N2004N1492N0049M7491M4497M1807
53379B597154L9293L6404L3167K9926K6428K2177J7487J3146R045M226j434o723
53367B820296j0712j3995j7724k2199k7065l2229l7636m2593m6145m8099m9016
53356B472883m9378m9360m9374m9962n0897n0988m9312m6367m3495m1388l9610
53345A952752l7721l6199l5824l6438l6944l6596l5724l4862l3762l1809k9188
53334A567685k6902k5566k4718k3538k1851k0109j8617j7158j5413j3573j2306
53323A347934j2123j2791j3589j4058j4309j4492j4339j3545j2321j1075r727
$$ plain form
53401 1531005 1570963 1612387 1654551 1697079 1740859 1787232 1836461 1887588 1939688 1992540 2046023
53390 2046023 2099592 2152712 2205323 2257645 2309814 2361818 2413310 2463359 2510850 2555347 2597154
53379 2597154 2636447 2672851 2706018 2735944 2762372 2784549 2802036 2815182 2824227 2828453 2827019 2820296
53367 2820296 2809584 2795589 2777865 2755666 2728601 2696372 2658736 2616143 2569998 2521899 2472883
53356 2472883 2423505 2374145 2324771 2274809 2223912 2172924 2123612 2077245 2033750 1992362 1952752
53345 1952752 1915031 1878832 1843008 1806570 1769626 1733030 1697306 1662444 1628682 1596873 1567685
53334 1567685 1540783 1515217 1490499 1466961 1445110 1425001 1406384 1389226 1373813 1360240 1347934
53323 1347934 1335811 1323020 1309431 1295373 1281064 1266572 1252233 1238688 1226367 1215292 1205565
53312A205565p792n287l019j741j220m90J056L054M634N399N785O493P761R352
53298A229550J1094J3016J4960J6555J7782J9094K0640K1781K1922K1506K1609
53287A429509K2593K3690K3905K2923K1142J9173J7391J5685J3691J1406R317
53276A630425P594N616K794m90l482o242r363j2609j4970j6238j7453j9340k1268
53263A524974k2410k3087k4083k5217k5604k5133k4785k5425k6887k8314k8939
53252A245090k8508k7415k6479k6258k6490k6419k5688k4539k3315k2179k1334
53241I66466k1028k1095k0887j9982j8813j8192j8284j8387j7837j6826j6037
53230G59098j5581j4781j3182j1369j0301j0072r911r432r218r867j0974j1670
$$ plain form
53312 1205565 1197773 1192486 1189467 1187726 1186506 1186016 1187072 1190126 1194760 1200159 1205944 1212437 1220198 1229550
53298 1229550 1240644 1253660 1268620 1285175 1302957 1322051 1342691 1364472 1386394 1407900 1429509
53287 1429509 1452102 1475792 1499697 1522620 1543762 1562935 1580326 1596011 1609702 1621108 1630425
53276 1630425 1638019 1643635 1646429 1645939 1642457 1636215 1626852 1614243 1599273 1583035 1565582 1546242 1524974
53263 1524974 1502564 1479477 1455394 1430177 1404573 1379440 1354655 1329230 1302343 1274029 1245090
53252 1245090 1216582 1189167 1162688 1136430 1109940 1083521 1057833 1033294 1009979 987800 966466
53241 966466 945438 924343 903456 883474 864661 846469 828185 809798 791961 775135 759098
53230 759098 743517 728736 715554 704185 693884 683812 673901 664469 655251 645384 634410 622740
53218F22740j1839j2170j3019j3854j3993j3483j2919j2629j2452j2136j1671
53207D82575j1146j0599j0079r674r313q759p941p178o787o576o152n668n813
53194C76890o817p869p950p037o042n683n822n811n211m113l112k826l212l465
53180C01920k951k144k046k827l540l377k541j678j012n07l92r37j874k488k353
53165B71253j714j157j044j255j319r55m15j55j79j03J27J0p05j464j520q72k10
53148B58323o8l93p97r13n98l0M37O93R36J144Q59j40j237j560j058n03m38o22
53130B54035n24L7Q66J628K051K113K130K349K533K294J718J294J150R80P05O57
53114B76016Q50O98p3p59n21M24J096J011N00j04q31j555j887j877k136k804l013
$$ plain form
53218 622740 610901 598731 585712 571858 557865 544382 531463 518834 506382 494246 482575
53207 482575 471429 460830 450751 441077 431764 423005 415064 407886 401099 394523 388371 382703 376890
53194 376890 370073 362204 354254 347217 341175 335492 329670 323859 318648 314535 311423 308597 305385 301920
53180 301920 298969 296825 294779 291952 288412 285035 282494 280816 279804 279297 278905 277968 276094 273606 271253
53165 271253 269539 268382 267338 266083 264764 263809 263394 263239 263060 262957 263084 263094 262389 260925 259405 258533 258323
53148 258323 258255 257862 257065 256152 255554 255524 255961 256654 257590 258734 259593 259453 258216 256656 255598 255095 254657 254035
53130 254035 253511 253548 254414 256042 258093 260206 262336 264685 267218 269512 271230 272524 273674 274654 275359 276016
53114 276016 276866 277564 277491 276732 276211 276635 277731 278742 279242 279138 278307 276752 274865 272988 270852 268048 265035
53097B65035k066p25m48j466k426k127r10Q6L75K81N6m10j016j265r18m64n66
53080B51026j209j706j561j005n97m30j13N22J015Q74K81j59k50l30n45n69k14
53063B45030J58K06J28K39L91K81P8J24K57L2m16m53N0M23J50m02n55j70M05Q93
53043B46849J144R43K52m74o06p2N30O39K94j03l46n20o34n18j89J0j50l15K8
53024B46762P61J225J142R12P94M65k67q53q02o01r96j697j653n98N76J118J224
53007B47512J330J404J282J109R99P86M74M43Q14J102Q81L50j28n76j082j325
52991B55375r43n9R07J694K128J991J342P12N36O80Q45J057J351J441J173J009
52975B71239J409K069K294J969J551J276R59N17P6l47q31j233j290r97n43l4M19
$$ plain form
53097 265035 262969 262244 261796 260330 257904 255777 254867 254953 255328 255609 255665 255255 254239 252974 252056 251592 251026
53080 251026 249817 248111 246550 245545 244948 244518 244405 244927 245942 246816 247097 246938 246688 246358 245813 245244 245030
53063 245030 245188 245394 245522 245761 246152 246433 246511 246635 246892 246924 246508 246055 246105 246528 246678 246276 245721 245551 245956 246849
53043 246849 247993 248936 249188 248714 248108 248036 248566 249205 249499 249396 249050 248530 247896 247378 247189 247199 247049 246734 246762
53024 246762 247523 248748 249890 250802 251596 252061 251794 250941 250139 249538 248542 246845 245192 244594 245170 246288 247512
53007 247512 248842 250246 251528 252637 253636 254422 254896 255339 256153 257255 258136 258486 258358 257782 256700 255375
52991 255375 254432 254373 255280 256974 259102 261093 262435 263147 263683 264363 265208 266265 267616 269057 270230 271239
52975 271239 272648 274717 277011 278980 280531 281807 282766 283283 283359 283012 282181 280948 279658 278661 278118 278084 278503
52958B78503N45K77j9j26m40j235j846j409k70L40j0m85l89j57m52j059j248q06
52940B69714k26p2m82j127j457j242r24j092j646j902j586j183j102j088p59k25
52924B53601J81L75M44M15M25O74R83Q27J57l26j53J82k1o00r15r04j010j220
52906B53115r79j39O92Q97M92j32n76n16P3O06L43n89j138o00M75J034P67J29
52888B53954m81r17q57L2J386K200J859P06n24j372j543q24M14J163Q88L92Q08
52871B57284J929K471J916J166J093J456J725K049K562K566J476J36n1Q73J470
52856B80121R76K08K6Q2l12j014j575k209l312m428m665l940l060k593k391k200
52840B49714k054j910j584j190j100j266j159o46l34o30r88p24j33k3k81J40J586
$$ plain form
52958 278503 279048 279325 279306 279180 278740 277505 275659 274250 273980 274320 274310 273825 273436 273279 272827 271768 270520 269714
52940 269714 269488 269416 268934 267807 266350 265108 264184 263092 261446 259544 257958 256775 255673 254585 253826 253601
52924 253601 253782 254157 254601 255016 255441 256115 257098 257925 258082 257756 257603 257785 257764 257164 256249 255345 254335 253115
52906 253115 252136 251997 252689 253586 254078 253946 253370 252854 252927 253533 253876 253287 252149 251549 252024 253058 253825 253954
52888 253954 253473 252556 251699 251731 253117 255317 257176 257882 257358 255986 254443 253619 254033 255196 256084 256476 257284
52871 257284 259213 261684 263600 264766 265859 267315 269040 271089 273651 276217 277693 277829 277778 278651 280121
52856 280121 281097 281305 281331 281413 281101 280087 278512 276303 272991 268563 263898 259958 256898 254305 251914 249714
52840 249714 247660 245750 244166 242976 241876 240610 239451 238805 238471 237841 236853 236129 235996 235973 235692 235832 237418
52823B37418K873K643J047n51j282j441j518j368p04K00Q23J094J299J473J412
52808B43418J181J097J148R87O13N49R83J226N33p71j586j412r05r00j390j763
52792B43008j709j526j574j827j964j660q20K63R65Q57K88J43Q04J626J735J135
52776B39744N34K95O9m11q53r09p35o35m95q4L80L96q8o19q28p55o15n60o44p12
52756B32475m03M12J284J723J894K228K404J594n3j058l36J284K075J589R46J079
52740B49137J581J597J088O98P76J116J449J708J840J772J615J531J371P86q8
52725B67977m60K02J341J800J134j6q42j182j271j250j226j446j941k229j837
52710B58754j014n39q09j477j925j768j037j92J50r2j89N35J630J948J151J41
$$ plain form
52823 237418 240291 242934 243981 243430 242148 240707 239189 237821 237117 237317 238140 239234 240533 242006 243418
52808 243418 244599 245696 246844 247831 248444 248993 249976 251202 251735 250964 249378 247966 247061 246161 244771 243008
52792 243008 241299 239773 238199 236372 234408 232748 231928 232191 233156 234013 234301 234444 235248 236874 238609 239744
52776 239744 240278 240573 240642 240231 239378 238469 237734 237099 236604 236520 236900 237296 237208 236589 235761 235006 234391 233831 233187 232475
52756 232475 232072 232484 233768 235491 237385 239613 242017 243611 243558 242500 242164 243448 245523 247112 248058 249137
52740 249137 250718 252315 253403 254101 254877 255993 257442 259150 260990 262762 264377 265908 267279 268065 267977
52725 267977 267517 267719 269060 270860 271994 271978 271136 269954 268683 267433 266207 264761 262820 260591 258754
52710 258754 257740 257201 256392 254915 252990 251222 250185 249993 250143 250051 249862 250397 252027 253975 255126 255267
52694B55267j61J75N98Q72R74P10O2m67m19p4p3n11q84q00l36J90M45K22k92n17
52674B54981j75K38R1m92q63p74n28k94L3L37L23J04J38M84P17P97J206J997K368
52655B60688J774Q06L88O02R48J351K041K731K738J930Q61n6q43j351j157l46
52639B73105K85J28n35j096j360j358r43j25N46N14l8m38m30k41P1P46J697K309
52621B72837K103J263K91n52j314k071k780l212k991j957n35N39R43R88J036J107
52605B65695J162J295J403J093K89l85l89n5j11n72p44k98L05N50N11M63L49K3
52587B70584k98k37K08O79R63J217J606J903J672Q23p5k52M40J280J413P54m3
52570B82637m93p86j234j596j306l44N40O18Ko22q68r58j120j094o00M0J93k25
$$ plain form
52694 255267 255106 255281 255879 256751 257725 258435 258497 258030 257611 257537 257464 256953 256069 255269 254933 255123 255568 255790 255498 254981
52674 254981 254806 255044 255135 254643 253780 253006 252478 252184 252217 252554 252877 252981 253119 253603 254320 255117 256323 258320 260688
52655 260688 262462 263268 263656 264258 265206 266557 268598 271329 274067 275997 276858 276802 275959 274608 273451 273105
52639 273105 273390 273518 272983 271887 270527 269169 268226 268101 268647 269161 269123 268685 268255 268014 268085 268831 270528 272837
52621 272837 274940 276203 276494 275942 274628 272557 269777 266565 263574 261617 261082 261621 262564 263552 264588 265695
52605 265695 266857 268152 269555 270648 270937 270552 270163 270108 269997 269425 268681 268383 268688 269238 269749 270212 270561 270584
52587 270584 270286 270049 270257 270936 271899 273116 274722 276625 278297 279120 279045 278793 279233 280513 281926 282680 282637
52570 282637 282144 281358 280124 278528 277222 276878 277418 278036 278038 277416 276548 275590 274470 273376 272776 272816 273009 272784
52552B72784o47o65m46k36L6L56L48j18m83k07L76N10J56m4J54K92J51J96Q18
52533B73331J612J855J364N43j57n10m35L4P71J634K427K827K611J995J400R38
52517B92240M53M7j5J09o1l82n6J079J945J628P53O57J479K027J466K62o90j124
52499C01817j260j278j319j589k127k582k637k327j842j223n25n6p1l73m92k91
52483B81825r9k06m16k77L59J138J600J588J295J013R61J208J548J553R88K09
52467B94287j51R4N97J146J965L031L600K983J591N74M96Q48R36O35R9p02j741
52450C10288k684l215l461l606l453k786j989j710j942j982j461q63o96p35m63
52435B79242J1J21k22m64k81l8j74n37o37l07K57Q87J549K096K298K060J502Q50
$$ plain form
52552 272784 272137 271472 271026 270790 270826 271182 271530 271412 270929 270722 271098 271608 271764 271720 271874 272166 272317 272513 273331
52533 273331 274943 276798 278162 278705 278548 278038 277603 277637 278408 280042 282469 285296 287907 289902 291302 292240
52517 292240 292693 292740 292725 292834 292773 292391 292335 293414 295359 296987 297740 298397 299876 301903 303369 303631 302941 301817
52499 301817 300557 299279 297960 296371 294244 291662 289025 286698 284856 283633 283108 283052 282981 282608 282116 281825
52483 281825 281726 281520 281104 280827 281186 282324 283924 285512 286807 287820 288781 289989 291537 293090 294078 294287
52467 294287 294136 294230 294827 295973 297938 300969 304569 307552 309143 309717 310213 311061 311997 312632 312731 312029 310288
52450 310288 307604 304389 300928 297322 293869 291083 289094 287384 285442 283460 281999 281136 280440 279705 279242
52435 279242 279253 279374 279152 278688 278407 278369 278195 277658 277021 276714 276971 277858 279407 281503 283801 285861 287363 288213
52417B88213M18N41J253K152K796L145L318L216K746K318K549L402M116M144L808
52402C28135L822M521N658O611O651N397L243J063o92k285l897n031n176m626
52388C43394m123l814l197k057r64n75p89q76l31N84J173J091P20P28J362K300
52372C34626L095L544L644L528L508L846M317M346L725K888K228J546M70q80j985
52357C72446k459k181j189J57J116J234R55J081J716K221K223K077K247K653K957
52342C87254L107L289L568L872M284N007O027O974P462P493P495P873Q691R804
52328D72200J1102J2399J3274J3534J3752J4788J6544J7859J8002J7765J8366
52317F39585J9667K0320J9641J8526J8200J8768J9399J9564J9590J9999K0681
$$ plain form
52417 288213 288631 289172 290425 292577 295373 298518 301836 305052 307798 310116 312665 316067 320183 324327 328135
52402 328135 331957 336478 342136 348747 355398 360795 364038 365101 364409 362124 358227 353196 348020 343394
52388 343394 339271 335457 332260 330203 329239 328664 327875 326999 326668 327252 328425 329516 330236 330964 332326 334626
52372 334626 337721 341265 344909 348437 351945 355791 360108 364454 368179 371067 373295 374841 375311 374431 372446
52357 372446 369987 367806 366617 366774 367890 369124 370079 371160 372876 375097 377320 379397 381644 384297 387254
52342 387254 390361 393650 397218 401090 405374 410381 416408 423382 430844 438337 445832 453705 462396 472200
52328 472200 483302 495701 508975 522509 536261 551049 567593 585452 603454 621219 639585
52317 639585 659252 679572 699213 717739 735939 754707 774106 793670 813260 833259 853940
52306H53940K0915K0196J8925J8058J7972J8051J7525J6452J5384J4365J2915
52295A044698J0977R223Q199P568O519M660K326R9j735l410n288p170q155p623
52281A060888o236n389n552n745m898l205j645o39K31J335K496L493M544O075
52267A045753Q135J0271J1899J2766J3102J3307J3570J3856J4227J4890J5755
52256A187531J6243J5846J4759J3644J2851J2225J1692J1468J1472J0992R401
52245A328124P025M721K775P14j717m052n764o973q014q819r228r579j0350j1347
52231A267516j1890j1774j1439j1125j0532r477q332p492o898o340n812n268m467
52218A156670l412k536k102j751j003J25J307K427L500M387M906N048M873M526
$$ plain form
52306 853940 874855 895051 913976 932034 950006 968057 985582 1002034 1017418 1031783 1044698
52295 1044698 1055675 1064898 1073097 1080665 1087184 1091844 1094170 1094269 1092534 1089124 1083836 1076666 1068511 1060888
52281 1060888 1054652 1049263 1043711 1037966 1033068 1029863 1028218 1027579 1027810 1029145 1031641 1035134 1039678 1045753
52267 1045753 1053888 1064159 1076058 1088824 1101926 1115233 1128803 1142659 1156886 1171776 1187531
52256 1187531 1203774 1219620 1234379 1248023 1260874 1273099 1284791 1296259 1307731 1318723 1328124
52245 1328124 1335149 1339870 1342645 1343359 1341642 1337590 1331826 1324853 1316839 1308020 1298792 1289213 1278863 1267516
52231 1267516 1255626 1243852 1232413 1221288 1210756 1201279 1192947 1185455 1178557 1172217 1166405 1161137 1156670
52218 1156670 1153258 1150722 1148620 1146869 1145866 1145991 1147298 1149725 1153225 1157612 1162518 1167566 1172439 1176965
52204A176965M493N320O724P566P146O036N156M644M241M201M929O022O623O518
52190A256584O154N715M920L723K474J444P42N30O46L00j143l264n179o728q222
52175A258696r394r653r267r055q951q125o572n308m674l866k613j961k496k999
52161A173762j992J85J879K245J892J768K183K812L025K379J165J33m79j166k073
52146A187718k467j792n77L60J001J713K318K401K093J822J604J368J555K562
52132A201679L868M612M905N747P640J0058J2314J4237J5929J7463J9015K0829
52120A338296K2892K4902K6581K7745K8209K7938K7186K6173K4830K3198K1778
52109A619728K1019K0664K0026J8773J7028J4959J2710J0574Q794P383O433O189
$$ plain form
52204 1176965 1181458 1186778 1193502 1201068 1208214 1214250 1219406 1224050 1228291 1232492 1237421 1243443 1250066 1256584
52190 1256584 1262738 1268453 1273373 1277096 1279570 1281014 1281756 1282286 1282932 1283232 1282089 1278825 1273646 1266918 1258696
52175 1258696 1249302 1239649 1230382 1221327 1212376 1204251 1197679 1192371 1187697 1183831 1181218 1179257 1176761 1173762
52161 1173762 1171770 1171955 1173834 1176079 1177971 1179739 1181922 1184734 1187759 1190138 1191303 1191436 1190957 1189791 1187718
52146 1187718 1185251 1183459 1182882 1183242 1184243 1185956 1188274 1190675 1192768 1194590 1196194 1197562 1199117 1201679
52132 1201679 1205547 1210159 1215064 1220811 1228451 1238509 1250823 1265060 1280989 1298452 1317467 1338296
52120 1338296 1361188 1386090 1412671 1440416 1468625 1496563 1523749 1549922 1574752 1597950 1619728
52109 1619728 1640747 1661411 1681437 1700210 1717238 1732197 1744907 1755481 1764275 1771658 1778091 1784280
52097A784280O325N696L524M93k080l890n584p386q881j0190j2171j5042j7667
52084A717427j8787j8398j7372j6199j4659j2561j0238q268o867n709m351k754
52072A581264j180M49K609N315P774R372J0627J2388J4407J5538J5316J4533J4111
52059A702523J4110J4047J3607J2763J1666J0568R531Q256O567M920L792K694
52047A815044O04k528n527p555r136j1245j3989j6646j8598j9757k0404k0886
52035A669377k1269k1173k0319j9282j9045j9602j9723j8472j6402j4746j3943
52024A465401j3596j3440j3611j4033j4195j3725j2837j2141j2073j2537j3019
52013A320194j3119j2938j2796j2742j2589j2339j2192j2236j2611j3821j6182
$$ plain form
52097 1784280 1790605 1796301 1799825 1800318 1798238 1794348 1788764 1781378 1772497 1762307 1750136 1735094 1717427
52084 1717427 1698640 1680242 1662870 1646671 1632012 1619451 1609213 1600945 1594078 1588369 1584018 1581264
52072 1581264 1580084 1580533 1583142 1588457 1596231 1605603 1616230 1628618 1643025 1658563 1673879 1688412 1702523
52059 1702523 1716633 1730680 1744287 1757050 1768716 1779284 1788815 1797071 1803638 1808558 1812350 1815044
52047 1815044 1815648 1813120 1807593 1800038 1790902 1779657 1765668 1749022 1730424 1710667 1690263 1669377
52035 1669377 1648108 1626935 1606616 1587334 1568289 1548687 1528964 1510492 1494090 1479344 1465401
52024 1465401 1451805 1438365 1424754 1410721 1396526 1382801 1369964 1357823 1345750 1333213 1320194
52013 1320194 1307075 1294137 1281341 1268599 1256010 1243671 1231479 1219243 1206632 1192811 1176629
52002A176629j8845k0306k0185j9762k0331k1721k2941k3482k3324k2282k0368
51991I43082j8375j7168j6545j5697j4659j4381j5201j6162j6245j5602j5153
51980G67894j5346j5789j5858j5291j4209j2892j1675j0876j0633j0631j0120
51969F24574q552o273m289l159k396j245K96J620K428L015L696M394M855M908
51955F23872M463L490K069L33j575l366m573m923m570l756k414n10J469K901L819
51940F16729M839O267P770R049J0238J1375J1963J1582J0637J0015J0046J0102
51928G30612R284P218M193P74k539n363p399q488q757q562q208p772p318p195
51914F80480p925r730j2258j4784j6548j7051j6259j4588j2593j0552q461o414
$$ plain form
52002 1176629 1157784 1137478 1117293 1097531 1077200 1055479 1032538 1009056 985732 963450 943082
51991 943082 924707 907539 890994 875297 860638 846257 831056 814894 798649 783047 767894
51980 767894 752548 736759 720901 705610 691401 678509 666834 655958 645325 634694 624574
51969 624574 616022 609749 605460 602301 599905 598660 598956 600576 603004 606019 609715 614109 618964 623872
51955 623872 628335 631825 633894 634227 632652 629286 624713 619790 615220 611464 609050 608540 610009 612910 616729
51940 616729 621568 627835 635605 644654 654892 666267 678230 689812 700449 710464 720510 730612
51928 730612 739896 747114 751307 752081 749542 744179 736780 728292 719535 710973 702765 694993 687675 680480
51914 680480 672555 662825 650567 635783 619235 602184 585925 571337 558744 548192 539731 533317
51902E33317m742l707l156k625j741m91P66J539J519P57n31k253m417o729q514
51887D98992r197q773p735o534n302l995k640j342j37J052K251L297M018M552
51873D68507N278O286P082P142O597N992N413M428L005J811J188M56j078k847
51859E19260l623l275l012l647m522m552l634k405j205kJ005J431J237N91n99
51844D93048k402m210n159n247n292n664n755n064m104l702l847l837l268k377
51830D33120j531q26j54O49J607K390K418J442o4j346k026k224k221k212k202
51815D26820j981j366o10k41l13k55K85Q98J072J022J291J823K006J478L98q87
51799D31440j946k199j431l11K20O7q5J03J44m27j368k127k458k421k082j555
$$ plain form
51902 533317 528575 524868 521712 519087 517346 516855 517621 519160 520679 521436 520905 518652 514235 507506 498992
51887 498992 489795 481022 473287 466753 461451 457456 454816 453474 453337 454389 456640 459937 463955 468507
51873 468507 473785 480071 487153 494295 500892 506884 512297 516725 519730 521541 522729 523185 522107 519260
51859 519260 515637 512362 509350 505703 501181 496629 492995 490590 489385 489383 490388 491819 493056 493647 493048
51844 493048 490646 486436 481277 476030 470738 465074 459319 454255 450151 446449 442602 438765 435497 433120
51830 433120 431589 430763 430609 431258 432865 435255 437673 439115 439051 437705 435679 433455 431234 429022 426820
51815 426820 424839 423473 422863 422622 422309 422054 422339 423237 424309 425331 426622 428445 430451 431929 432327 431440
51799 431440 429494 427295 425864 425553 425773 425840 425755 425858 426002 425575 424207 422080 419622 417201 415119 413564
51783D13564j040o83m65k53J92J053K111K726K595K272K430K885K969K701K764
51768D35821L360M004M597N704P373Q573Q385P093N532L964K295Q37o2q41k420
51753D94215m931p401q781q918q440p999p696p133n922m200k557j439q51n91l99
51738D16957J45J462L429N239O178O357O510P179Q175Q661P789N533K850P60o16
51723D86608j678k241j681k17Q90P84j54j320k809m625n798n357l766k445k027
51708D54164j952j649j308j351j760k143k065j315j35R08J494J801J916J447K30
51693D48282j009j432j258j381j961k229j751j070q48j064j370j736k254k699
51679D26220k697k251j720j385j159p36Q3J212K403L478M329M737M482L701K950
$$ plain form
51783 413564 412524 411841 411376 411123 411315 412368 414479 417205 419800 422072 424502 427387 430356 433057 435821
51768 435821 439181 443185 447782 453486 460859 469432 477817 484910 490442 494406 496701 497538 497476 496635 494215
51753 494215 489284 481883 473102 464184 455744 447745 440049 432916 426994 422794 420237 418798 417947 417356 416957
51738 416957 417102 418564 421993 427232 433410 439767 446277 453456 461631 470292 478081 483614 486464 487224 486608
51723 486608 484930 482689 481008 480791 481681 482465 482311 480991 478182 473557 467759 462402 458636 456191 454164
51708 454164 452212 450563 449255 447904 446144 444001 441936 440621 440486 441394 442888 444689 446605 448052 448282
51693 448282 447273 445841 444583 443202 441241 439012 437261 436191 435343 434279 432909 431173 428919 426220
51679 426220 423523 421272 419552 418167 417008 416272 416355 417567 419970 423448 427777 432514 436996 440697 443647
51664D43647K782L462N051P319R446J0317R491P493M963J983j341m244n840o054
51650D88475n513m778m097l471k492o04J816L101J873j300m533o637p762q299
51636D45779q263p716o915n843m352k834j996j850j651j021l99k22l16l05j8O61
51620D02739J756K726K698J425l91j896k770l077k978k730k465j968j111m36n77
51605C90945j149j064o8Q83J048Q78J189K080L075L703L674L055K591L169M680
51590D18689O107O917P461P694O596L721L41j829k528k580k279j211N79K309L468
51575D53455M366N577P389R837J2709J5485J7630J8942J9484J9387J9068J9324
51563F22653K0608K2322K3250K2715K1119J9505J8843J9450K0698K1494K1389
$$ plain form
51664 443647 446429 449891 454942 462261 471707 482024 491515 499008 503971 505954 504613 500369 494529 488475
51650 488475 482962 478184 474087 470616 468124 467520 469336 472437 474310 473010 468477 461840 454078 445779
51636 445779 437516 429800 422885 417042 412690 409856 407860 406010 404359 403338 402939 402717 402401 402096 402078 402739
51620 402739 404495 407221 409919 411344 410953 409057 406287 403210 400232 397502 395037 393069 391958 391522 390945
51605 390945 389796 388732 388664 389547 390595 391473 392662 394742 397817 401520 405194 408249 410840 414009 418689
51590 418689 424796 431713 439174 446868 453464 457185 457526 455697 453169 450589 448310 447099 447678 449987 453455
51575 453455 457821 463398 470787 480624 493333 508818 526448 545390 564874 584261 603329 622653
51563 622653 643261 665583 688833 711548 732667 752172 771015 790465 811163 832657 854046
51552H54046K0870K0204J8344J3772O366k154r807j5905k0976k5497k9157l1322
51540G98784l1903l1538l0861k9866k8180k5736k2837j9712j6554j3792j1756
51529E36049j0084q192o272n077m628m098l224k760l018l078k213j203j199k049
51515D78954k812l329m085m927n189m884m676m623m171l425l316m156m965m722
51501D19674l568k415j826j703j645j359r10o61p74r23q30p99j191j594j270l18
51485C97888L53K23l45q91j343j615j515j314j644k493k937k333j193m95m97p24
51469C79125p92q15j124j892k846l325k877j882j225j222j294q58j08L27J96j89
51453C59199l06K00J293K512L390L910M342M684M704M465M402M674M988N176N555
$$ plain form
51552 854046 874916 895120 913464 927236 933602 931448 921641 905736 884760 859263 830106 798784
51540 798784 766881 735343 704482 674616 646436 620700 597863 578151 561597 547805 536049
51529 536049 525965 517773 511501 506424 501796 497698 494474 491714 488696 485618 483405 482202 481003 478954
51515 478954 476142 472813 468728 463801 458612 453728 449052 444429 440258 436833 433517 429361 424396 419674
51501 419674 416106 413691 411865 410162 408517 407158 406248 405587 404813 403890 403060 402261 401070 399476 398206 397888
51485 397888 398241 398464 398119 397228 395885 394270 392755 391441 389797 387304 384367 382034 380841 380346 379849 379125
51469 379125 378333 377518 376394 374502 371656 368331 365454 363572 362347 361125 359831 358973 358865 359192 359388 359199
51453 359199 358893 359093 360386 362898 366288 370198 374540 379224 383928 388393 392795 397469 402457 407633 413188
51438D13188O534Q122R878J0981J0425P742L698j76k838m083l895k372n30q4j712
51423D54878m171n762o106n809n034l482j529k66k34q32j293j563j905k098j611
51408D13183m62O24J029R36Q93R12M99l96r74n95L06R03J302K358M240O086P235
51391D38079Q027R023J0208J1400J2857J4871J7229J9508K1570K3388K4849K6113
51379F37122K7693K9759L1819L3432L4701L5630L5774L5105L4376L3658L1277
51368A000346K5419J6472O573k886j1984k0667k7983l3432l7732m1490m4008m4354
51356G84274m2888m0841l8709l5991l2406k8618k5530k3222k0877j7828j4499
51345D62865j2146j1367j1219j0273q397o786o225o099n517m532l679k941k011
$$ plain form
51438 413188 419722 427844 437722 448703 459128 466870 470568 470392 467554 463471 459576 457204 456674 456590 454878
51423 454878 450707 444945 438839 433030 427996 424514 422985 422719 422485 421653 420360 418797 416892 414794 413183
51408 413183 412721 413345 414374 415310 416203 417115 417614 417218 416244 415649 415955 416858 418160 420518 424758 430844 438079
51391 438079 446106 455129 465337 476737 489594 504465 521694 541202 562772 586160 611009 637122
51379 637122 664815 694574 726393 759825 794526 830156 865930 901035 935411 969069 1000346
51368 1000346 1025765 1042237 1048810 1045924 1033940 1013273 985290 951858 914126 872636 828628 784274
51356 784274 741386 700545 661836 625845 593439 564821 539291 516069 495192 477364 462865
51345 462865 450719 439352 428133 417860 409463 402677 396452 390353 384836 380304 376625 373684 371673
51332C71673j209j210j906k367j973j024n2P94J462J691J422J114J214J529J527
51317C72685J081N36J63l9k4L49R14J172R53P10Q58J065P17j29p79r80j311k225
51299C75716l228l427k656j566q12n70p19j015j100p87m15n01r67j096m60N65
51283C56962J356J752J959K061K069K193K671L411M102M572M738M403L506K531
51269C98286K114K174J873Q06k73l09O19J340J066L32J90Q47J459J179j8j469
51253D10216k506k863k731k574k767l268l658l591l082k430k004k119k823l667
51239C70133l930l339k329j473q56k79J82L04K22L63Q14J175J121P53L07r9k21
51222C62848L21J486K491K482J494M52K30Q82J812K479K819L051L182K861J871
$$ plain form
51332 371673 370464 369254 367348 364981 363008 361984 361932 362726 364188 365879 367301 368415 369629 371158 372685
51317 372685 373766 374302 374465 374426 374402 374751 375665 376837 377790 378500 379358 380423 381140 381011 380232 379252 377941 375716
51299 375716 372488 369061 366405 364839 364027 363457 362738 361723 360623 359836 359421 358920 357953 356857 356397 356962
51283 356962 358318 360070 362029 364090 366159 368352 371023 374434 378536 383108 387846 392249 395755 398286
51269 398286 400400 402574 404447 405253 404980 404671 405290 406630 407696 408028 408218 409065 410524 411703 411685 410216
51253 410216 407710 404847 402116 399542 396775 393507 389849 386258 383176 380746 378742 376623 373800 370133
51239 370133 366203 362864 360535 359062 358206 357927 358109 358413 358635 358998 359812 360987 362108 362861 363168 363069 362848
51222 362848 363169 364655 367146 369628 371122 371574 371804 372686 374498 376977 379796 382847 386029 388890 390761
51207C90761O09j98k63N7K87K93J45k7J44J092K584L600L433K593K020J696P71
51190D09597r34k444k901k574k200j877j251m40j8j51l69k02K84P29Q63O17J62
51173C96891j08J17O28P89K23p65j525j648j174m12K88P47J061J426J864K254
51157D00656K646L222L879M077L383J944K63j285k498l168l216k912k635k501
51143D01855k447k542k884l188k960k105j051k26K84M91L39l6k09Q3N52P53O36
51126C87345N86R13J558K206K580K675K781L178L724L950L661L160K781K445J989
51111D25532J638J746K158K274J788J058O17N67O47O96Q97J488K323K798K403
51096D48630J295J75m62o94p56o13k48Kk05o38p70n56m60o56o97k40L71M90P0
$$ plain form
51207 390761 391370 391172 390909 390966 391253 391546 391691 391664 391808 392900 395484 399084 402517 405110 407130 408826 409597
51190 409597 408663 406219 403318 400744 398544 396667 395416 394976 394958 394807 394438 394236 394520 395249 396112 396729 396891
51173 396891 396783 396900 397528 398317 398540 397775 396250 394602 393428 393016 393304 394051 395112 396538 398402 400656
51157 400656 403302 406524 410403 414480 417863 419807 420070 418785 416287 413119 409903 406991 404356 401855
51143 401855 399408 396866 393982 390794 387834 385729 384678 384452 384736 385227 385566 385530 385321 385404 385956 386709 387345
51126 387345 387931 388844 390402 392608 395188 397863 400644 403822 407546 411496 415157 418317 421098 423543 425532
51111 425532 427170 428916 431074 433348 435136 436194 436811 437378 438025 438721 439618 441106 443429 446227 448630
51096 448630 449925 450100 449638 448944 448188 447575 447327 447329 447124 446486 445716 445160 444700 444044 443347 443107 443478 443968 444038
51077D44038j89L50J453K173J885J066P61J339K211K914L810N206O381O407N683
51062D85488N658O928Q581R644J0302J1279J2805J4689J6672J8005J7413J4380
51050F31844J0164O775N222N315O658Q754J0368J0013P453M031J247n32j898l656
51036G01758o352r829j2914j4068j2761r898o865m672m018n225p604r577j0086
51023E87889r439q361o802m440j825o0N97J019K023L530N006O113O776P060P220
51008E96306P559Q091Q602R070R677J0312J0474R863Q783P832P303P011O543N662
50994G13088M617L977L946L948L278K080J193J086J451J934K646L719M958O290
50980G58211Q087J0538J3198J5625J8146K1316K4889K7890K9743L0674L1164L1566
$$ plain form
51077 444038 443849 444199 445652 447825 449710 450776 451537 452876 455087 458001 461811 467017 473398 479805 485488
51062 485488 491146 498074 506655 516299 526601 537880 550685 565374 582046 600051 617464 631844
51050 631844 642008 648783 654005 659320 665978 674732 685100 695113 702566 706597 707844 707312 705414 701758
51036 701758 695406 685577 672663 658595 645834 635936 629071 624399 620381 615156 607552 597975 587889
51023 587889 578450 570089 563287 558847 557022 556962 557559 558578 560601 564131 569137 575250 582026 589086 596306
51008 596306 603865 611956 620558 629628 639305 649617 660091 669954 678737 686569 693872 700883 707426 713088
50994 713088 717705 721682 725628 729576 732854 734934 736127 737213 738664 740598 743244 746963 751921 758211
50980 758211 766298 776836 790034 805659 823805 845121 870010 897900 927643 958317 989481 1021047
50968A021047L2405L4388L7781M2077M6465N0411N3710N6376N8626O0730O2698
50957A556714O4338O5586O6450O6560O5313O2651N9254N5617N1404M6096L9953
50946B199936L3781K8012K2643J7856J3996J0864P814M824K826K401K618J770
50934B349341r33m922r319j3689j7764k1234k4259k7527l1303l4873l7688m0627
50922B085203m5096n0867n5960n9077o1115o3487o5810o6399o4684o1823n8948
50911A431937n6028n2705m9180m5613m1556l6819l2284k9024k6972k5230k3383
50900A013143k1701k0229j8546j6459j4306j2380j0665r161p950o869n626m374
50888H64877l569l186k596j525m75J25O65J769L319M618N329N852O795Q397J0327
$$ plain form
50968 1021047 1053452 1087840 1125621 1167698 1214163 1264574 1318284 1374660 1433286 1494016 1556714
50957 1556714 1621052 1686638 1753088 1819648 1884961 1947612 2006866 2062483 2113887 2159983 2199936
50946 2199936 2233717 2261729 2284372 2302228 2316224 2327088 2334902 2339726 2342552 2344953 2347571 2349341
50934 2349341 2348408 2343486 2334167 2320478 2302714 2281480 2257221 2229694 2198391 2163518 2125830 2085203
50922 2085203 2040107 1989240 1933280 1874203 1813088 1749601 1683791 1617392 1552708 1490885 1431937
50911 1431937 1375909 1323204 1274024 1228411 1186855 1150036 1117752 1088728 1061756 1036526 1013143
50900 1013143 991442 971213 952667 936208 921902 909522 898857 889696 881746 874877 869251 864877
50888 864877 861308 858122 855526 854001 853526 853651 854316 856085 859404 864022 869351 875203 881998 890395 900722
50873I00722J1936J2806J3210J3795J4712J5548J6249J7593K0204K3591K6754
50862A087120K9480L2306L5472L8686M2008M6100N1334N7233O3171O9119P5366
50851A627395Q1908Q8609R5633J03225J11107J18572J25113J30703J35494J39521
50841B757280J42691J44789J45459J44407J41732J37811J32669J25621J15762
50832C988221J02917Q7969P2271N6768M1868K7907J5462M961l709j0968j6995
50821D366672k1604k4554k5656k4680k1675j7609j4354j3680j6349k2224l0957
50810D133330m2202n5410o9843q4830r9743j13748j25989j36076j44099j50071
50800C111319j53538j53970j51298j45914j38359j29205j19050j08320r7161q5786
$$ plain form
50873 900722 912658 925464 938674 952469 967181 982729 998978 1016571 1036775 1060366 1087120
50862 1087120 1116600 1148906 1184378 1223064 1265072 1311172 1362506 1419739 1482910 1552029 1627395
50851 1627395 1709303 1797912 1893545 1996770 2107877 2226449 2351562 2482265 2617759 2757280
50841 2757280 2899971 3044760 3190219 3334626 3476358 3614169 3746838 3872459 3988221
50832 3988221 4091138 4179107 4251378 4308146 4350014 4377921 4393383 4398344 4394635 4383667 4366672
50821 4366672 4345068 4320514 4294858 4270178 4248503 4230894 4216540 4202860 4186511 4164287 4133330
50810 4133330 4091128 4035718 3965875 3881045 3781302 3667554 3541565 3405489 3261390 3111319
50800 3111319 2957781 2803811 2652513 2506599 2368240 2239035 2119985 2011665 1914504 1828718
50790A828718p4893o5326n7203m9745m2249l4964k8714k3798j9746j6096j2983
50779A403001j0737r315q447q076q285q864r427r962j0884j2336j3744j4338j4019
50766A264567j3526j3743j4898j6399j7349j7282j6458j5452j4521j3472j2110
50755A099357j0526q867p054m950k656l47K093M963Q220J1363J4035J6546J9564
50742A141741K3366K7679L2135L6620M1057M5180M8859N2447N6446O0823O5022
50731A631375O8660P1904P4932P7455P9000P9392P8601P6467P3071O9167O5629
50720B445653O2427N8749N4207M9309M4512L9287L2618K4089J4152L605o771j6241
50708B805596k4127k9866l2917l2873k9972k5283k0184j5681j2282j0119q910
$$ plain form
50790 1828718 1753825 1688499 1631296 1581551 1539302 1504338 1475624 1451826 1432080 1415984 1403001
50779 1403001 1392264 1382949 1374502 1366426 1358141 1349277 1339850 1329888 1319004 1306668 1292924 1278586 1264567
50766 1264567 1251041 1237298 1222400 1206001 1188652 1171370 1154912 1139460 1124939 1111467 1099357
50755 1099357 1088831 1079964 1072910 1067960 1065304 1064957 1067050 1072013 1080233 1091596 1105631 1122177 1141741
50742 1141741 1165107 1192786 1224921 1261541 1302598 1347778 1396637 1449084 1505530 1566353 1631375
50731 1631375 1700035 1771939 1846871 1924326 2003326 2082718 2161319 2237786 2310857 2380024 2445653
50720 2445653 2508080 2566829 2621036 2670345 2714857 2754144 2786762 2810851 2825003 2828608 2821837 2805596
50708 2805596 2781469 2751603 2718686 2685813 2655841 2630558 2610374 2594693 2582411 2572292 2563382
50697B563382q136p771q619j1651j7155k4829l4243m4779n5323o4757p2567p8602
50685B134950q2395q3466q2139p9274p5136o9286o1755n3549m5662l8235l1061
50674A432992k4332j8354j2906p453j784L807Q818J2802J5639J7697J9394K0440
50662A466760K0137J8635J7253J6991J7278J6880J5639J4617J4721J5848J7398
50651A652157J8875J9984K0682K1269K2158K3514K5365K7828L0845L3891L6419
50640A932987L8533M0699M2982M5093M7036M8999N0652N1207N0271M7994M4395
50629B440848L9407L3755K8883K5408K2471J9300J6743J6156J6895J5888J0093
50618B685847p99j4054k5826l3453l6473l5990l3339k9407k4964k0905j7697j4960
$$ plain form
50697 2563382 2555246 2547475 2538856 2527205 2510050 2485221 2450978 2406199 2350876 2286119 2213552 2134950
50685 2134950 2052555 1969089 1886950 1807676 1732540 1663254 1601499 1547950 1502288 1464053 1432992
50674 1432992 1408660 1390306 1377400 1369947 1368163 1371970 1380788 1393590 1409229 1426926 1446320 1466760
50662 1466760 1486897 1505532 1522785 1539776 1557054 1573934 1589573 1604190 1618911 1634759 1652157
50651 1652157 1671032 1691016 1711698 1732967 1755125 1778639 1804004 1831832 1862677 1896568 1932987
50640 1932987 1971520 2012219 2055201 2100294 2147330 2196329 2246981 2298188 2348459 2396453 2440848
50629 2440848 2480255 2514010 2542893 2568301 2590772 2610072 2626815 2642971 2659866 2675754 2685847
50618 2685847 2685048 2670994 2645168 2611715 2575242 2539252 2505913 2476506 2451542 2430637 2412940 2397980
50606B397980j2227r990r441j1105j4262j7975k2246k7850l5253m3935n2665o0206
50594B080825o5759o9092p0334o9774o7794o4942o1822n8724n5413n1444m6773
50583A398954m2026l7983l4832l2054k9141k6229k3817k1921j9879j7105j3720
50572A100247j0233o837l395N2L119N529P430R171J1001J3025J5185J7179J8601
50559A180074J9392J9947K0672K1531K2359K3346K4873K6886K8764K9922L0252
50548A448018K9945K9305K8872K9288L0636L2165L3122L3717L4847L6980L9860
50537A806755M3268M7487N2742N8650O4586P0316P6031Q1889Q7821R3497R8341
50526B581383J01863J04265J06435J08983J11415J12559J11663J08834J04585
$$ plain form
50606 2397980 2385753 2375763 2366322 2355217 2340955 2322980 2300734 2272884 2237631 2193696 2141031 2080825
50594 2080825 2015066 1945974 1875640 1805866 1738072 1673130 1611308 1552584 1497171 1445727 1398954
50583 1398954 1356928 1318945 1284113 1252059 1222918 1196689 1172872 1150951 1131072 1113967 1100247
50572 1100247 1090014 1083177 1079782 1079834 1082953 1088482 1095912 1105083 1116084 1129109 1144294 1161473 1180074
50559 1180074 1199466 1219413 1240085 1261616 1283975 1307321 1332194 1359080 1387844 1417766 1448018
50548 1448018 1477963 1507268 1536140 1565428 1596064 1628229 1661351 1695068 1729915 1766895 1806755
50537 1806755 1850023 1897510 1950252 2008902 2073488 2143804 2219835 2301724 2389545 2483042 2581383
50526 2581383 2683246 2787511 2893946 3002929 3114344 3226903 3338566 3447400 3551985
50517C551985R9218R2542Q3992P3191O0485M6680L2145J6758R35j4070k7529m0161
50505C976171n2756o4408p3324p9114q2904q5138q4624q0283p2690o3251n2805
50494C184874m1811l1075k1327j2548m454K754Q630J2895J4885J3150O591m325
50482C128239j8214l4323n2437p1436q8966j02845j12229j17422j19227j18589
50472B292551j16144j11851j05469r7469q8956q0610p2323o3981n6054m9034m2805
50461A407855l6989l1650k7297k4240k2064j9812j6734j2999r487o697m171j271
50449A194444J827M475O589Q596J0458J1637J2141J2865J4517J6805J9016K0752
50437A334122K1734K1479J9720J6844J3481J0020O824M544L650L889M663N710
$$ plain form
50517 3551985 3651203 3743745 3827737 3900928 3961413 4008093 4040238 4056996 4057931 4043861 4016332 3976171
50505 3976171 3923415 3859007 3785683 3706569 3623665 3538527 3453903 3373620 3300930 3237679 3184874
50494 3184874 3143063 3111988 3090661 3078113 3073659 3076413 3085043 3097938 3112823 3125973 3132564 3128239
50482 3128239 3110025 3075702 3023265 2951829 2862863 2760018 2647789 2530367 2411140 2292551
50472 2292551 2176407 2064556 1959087 1861618 1772662 1692052 1619729 1555748 1499694 1450660 1407855
50461 1407855 1370866 1339216 1311919 1287679 1265615 1245803 1229069 1216070 1206583 1199886 1195715 1194444
50449 1194444 1196271 1200746 1207335 1215931 1226389 1238026 1250167 1263032 1277549 1294354 1313370 1334122
50437 1334122 1355856 1377335 1397055 1413899 1427380 1437400 1444224 1448768 1452418 1456307 1460970 1466680
50425A466680P016Q394R623J0915J2717J5066J7547J9859K2091K4412K6872K9548
50413A670740L2637L6214M0065M3785M7073M9950N2659N5184N6945N7257N6048
50402B198557N3725N0313M5375L9067L2539K6636K0780J3897O088j638r093j7251
50390B458995k6636l6333m5053n2269n7802o1047o1601o0138n7761n4621n0041
50379A895693m3956l7248l0515k3401j5734q553l191L43L199N912P588O968L734
50366A760839j586q436j6422k4920l3086m0253m6030n0067n2092n2267n1154m9204
50354A335322m6515m3113l9306l5546l2157k9251k6768k4424k1782j8566j4948
50343A002946j1395q193n131j731J998M990N637L187j247n463p936q694q563q027
$$ plain form
50425 1466680 1473696 1482090 1491713 1502628 1515345 1530411 1547958 1567817 1589908 1614320 1641192 1670740
50413 1670740 1703377 1739591 1779656 1823441 1870514 1920464 1973123 2028307 2085252 2142509 2198557
50402 2198557 2252282 2302595 2347970 2387037 2419576 2446212 2466992 2480889 2486977 2485339 2476246 2458995
50390 2458995 2432359 2396026 2350973 2298704 2240902 2179855 2118254 2058116 2000355 1945734 1895693
50379 1895693 1851737 1814489 1783974 1760573 1744839 1736286 1733095 1733438 1736637 1742549 1750137 1757105 1760839
50366 1760839 1759253 1750817 1734395 1709475 1676389 1636136 1590106 1540039 1487947 1435680 1384526 1335322
50354 1335322 1288807 1245694 1206388 1170842 1138685 1109434 1082666 1058242 1036460 1017894 1002946
50343 1002946 991551 983358 978227 976496 978494 983484 989121 992308 991061 985598 977662 968968 960405 952378
50329I52378o953n094k546R7J963K578K466K759L989N603O835P634Q333Q791Q594
50314I97427P862P220O868O336N338M338L915L964L932L714L860M952O933R083
50300A075742J0623J1365J1909J3029J4836J6617J7663J7988J8047J7990J7596
50289A243405J6945J6636J7219J8759K1217K4584K7904K8352K2538R651o911k1669
50277A418630l0892l4263l3448l0193k5853k1580j7952j4672j1262p894n103k987
50265A182531j343l69m82j395k070j853j046j09J063K650M250N360O249P665R780
50250A210881J1924J3456J4426J5277J6233J7130J7545J7070J5690J3952J2552
50239A376136J1723J1275J1180J1583J2148J1939J0229P106K992j945p479j2906
$$ plain form
50329 952378 945425 940331 937785 937882 939845 942423 944889 947648 951637 957240 964075 971709 980042 988833 997427
50314 997427 1005289 1012509 1019377 1025713 1031051 1035389 1039304 1043268 1047200 1050914 1054774 1059726 1066659 1075742
50300 1075742 1086365 1097730 1109639 1122668 1137504 1154121 1171784 1189772 1207819 1225809 1243405
50289 1243405 1260350 1276986 1294205 1312964 1334181 1358765 1386669 1415021 1437559 1447210 1440299 1418630
50277 1418630 1387738 1353475 1320027 1289834 1263981 1242401 1224449 1209777 1198515 1190621 1185518 1182531
50265 1182531 1181188 1180819 1180337 1178942 1176872 1175019 1173973 1173864 1174927 1177577 1181827 1187187 1193436 1201101 1210881
50250 1210881 1222805 1236261 1250687 1265964 1282197 1299327 1316872 1333942 1349632 1363584 1376136
50239 1376136 1387859 1399134 1410314 1421897 1434045 1445984 1456213 1463319 1466311 1464366 1456887 1443981
50227A443981j7512k1208k4075k5638k5393k3932k2559k1643k0319j8240j6713
50216A206749j7350k0211k3983k7476l0126l1423l0965k9085k6648k4048k1112
50205I24322j7993j5427j3782j2580j1278j0003r053q272p370o502n992n713n251
50192G95106m552l982l803l923m110m239m328m526m969n504n725n447m920m443
50178G30635m037l726l778m262m649m373l629l080k858k436j536n59N5L95P45
50163F92907J089J258J276J235J145J244K115L991O041O989O552N822O025P187
50149G44876Q384R045R539J0554J2207J3966J5200J5651J5564J5496J5947J7010
50137I03439J8453K0153K2300K5050K8118L0994L3503L5895L8322M0369M1239
$$ plain form
50227 1443981 1426469 1405261 1381186 1355548 1330155 1306223 1283664 1262021 1241702 1223462 1206749
50216 1206749 1189399 1169188 1145205 1117729 1087603 1056180 1025215 996130 969482 945434 924322
50205 924322 906329 890902 877120 864540 853262 843259 834206 825934 818564 812062 806070 800357 795106
50192 795106 790554 786572 782769 778846 774736 770497 766169 761643 756674 751170 745445 739998 735078 730635
50178 730635 726598 722872 719094 714832 710183 705810 702181 699101 696243 693807 692271 691712 691767 692162 692907
50163 692907 693996 695254 696530 697765 698910 700154 702269 706260 712301 719290 725842 731664 737689 744876
50149 744876 753260 762305 771844 782398 794605 808571 823771 839422 854986 870482 886429 903439
50137 903439 921892 942045 964345 989395 1017513 1048507 1082010 1117905 1156227 1196596 1237835
50126A237835M0357L7852L4540L1413K8971K6993K5003K2868K0750J8538J5505
50115A540625J0699L704m909j3827k1758k8065l2665l5519l6604l6451l6049l5817
50103A273364l5094l3214l0635k8304k6189k3484k0186j7446j6023j5423j4993
50092A012373j4934j5511j6001j5266j3021r803o125k388O92K541L472M242M958
50079I35229N160M964N234O390P745Q357Q008P046N788M470L385K672K151J658
50065A008257J371J459J584J117j45j714k976l814m539n311n866n945n713n499
50051I72266n234m494l145j609l64M81J012J360J922L241N351P512Q998R826J0438
50036A007561J1023J1515J1898J2051J1799J1468J1922J3303J4320J3667J1865
$$ plain form
50126 1237835 1278192 1316044 1350584 1381997 1410968 1437961 1462964 1485832 1506582 1525120 1540625
50115 1540625 1551324 1555028 1550119 1536292 1514534 1486469 1453804 1418285 1381681 1345230 1309181 1273364
50103 1273364 1238270 1205056 1174421 1146117 1119928 1096444 1076258 1058812 1042789 1027366 1012373
50092 1012373 997439 981928 965927 950661 937640 927837 921712 919324 920016 922557 926029 930271 935229
50079 935229 940389 945353 950587 956977 964722 973079 981087 988133 993921 998391 1001776 1004448 1006599 1008257
50065 1008257 1009628 1011087 1012671 1013788 1013643 1011929 1008953 1005139 1000600 995289 989423 983478 977765 972266
50051 972266 967032 962538 959393 957784 957420 957901 958913 960273 962195 965436 970787 978299 987297 997123 1007561
50036 1007561 1018584 1030099 1041997 1054048 1065847 1077315 1089237 1102540 1116860 1130527 1142392
50025A142392J0635J0593J0679R904Q578P420O496N625N103N322O175P318Q677
50012A244917J0190J1385J1686J0976R550P764N993M583L554K565J442M99J06
49999A325210K07M29M30j73j890n021r356j4302j9238k3615k7106k9699l1462
49986A164414l2142l1390k9486k7363k5708k4497k3557k3049k2968k2685k1533
49975H80036j9635j7706j6207j5087j4127j3119j1841j0265q810p970p698p364
49963G30207o438n028l757l098k858k369j350l31N9O8N29J678K889L807M906O562
49947G25476Q178Q874Q657Q211P754O789M986K801J060K12j7l91j550l369n070
49932G72601o065o657p662r447j1509j2924j3201j2663j2030j1503j0520q660
$$ plain form
50025 1142392 1153027 1163620 1174299 1184203 1192781 1200201 1206697 1212322 1217425 1222747 1228922 1236240 1244917
50012 1244917 1255107 1266492 1278178 1289154 1298704 1306468 1312461 1317044 1320598 1323163 1324605 1325104 1325210
49999 1325210 1325417 1325846 1326276 1326103 1324213 1319192 1309836 1295534 1276296 1252681 1225575 1195876 1164414
49986 1164414 1132272 1100882 1071396 1044033 1018325 993828 970271 947222 924254 901569 880036
49975 880036 860401 842695 826488 811401 797274 784155 772314 762049 753239 745269 737571 730207
49963 730207 723769 718741 714984 711886 709028 706659 705309 704978 705037 705105 705634 707312 710201 714008 718914 725476
49947 725476 733654 742528 751185 759396 767150 773939 778925 781726 782786 782998 782981 782590 781040 777671 772601
49932 772601 766536 759879 752217 742770 731261 718337 705136 692473 680443 668940 658420 649760
49920F49760o484m923m027l099j970j154o59L72K262M006M527M090L766M054M735
49905F55256N543O296O827P339Q364R760J0415R745Q725Q568Q935Q556P128N454
49891G66911L993K470P61r46k789m928o797p701q089r047j0537j1399j1197j0728
49877F89977j0500j0064r231q624q458p990o835n678n011m253k946j707j048k25
49863F07407J556L583M553M479M533N318O413P367Q100Q501Q575Q892R970J1241
49849G00488J1522J0467Q835P294N827M310K920J752O97k12r55k033m042o632
$$ plain form
49920 649760 643276 638353 634326 631227 629257 628103 627444 627816 630078 634084 638611 642701 646467 650521 655256
49905 655256 660799 667095 673922 681261 689625 699385 709800 719545 728270 736838 745773 754329 761457 766911
49891 766911 770904 773374 774135 773189 770400 765472 758675 750974 742885 733838 723301 711902 700705 689977
49877 689977 679477 669413 660182 651558 643100 635110 628275 622597 617586 613333 610387 608680 607632 607407
49863 607407 608963 612546 617099 621578 626111 631429 637842 645209 653309 661810 670385 679277 689247 700488
49849 700488 712010 722477 731312 738606 744433 748743 751663 753415 754112 753900 752945 750912 746870 740238
$$ [...]
##END NTUPLES=NMR SPECTRUM
##END=
