##TITLE=AC1678_CTIAH14386_8571367_QHY9PKHRzM
##JCAMPDX= 6.0         $$ Bruker NMR JCAMP-DX V2.0
##DATA TYPE= NMR SPECTRUM
##DATA CLASS= NTUPLES
##ORIGIN= BRUKER
##OWNER= Administrator
$$ 1.72 TOPSPIN		Version 2.1
$$ 2014-04-11 23:16:32.508 -0700  Administrator@X
$$ Compression mode = diff/dup
##.OBSERVE FREQUENCY= 400.02188249412
##.OBSERVE NUCLEUS= ^1H
##.ACQUISITION MODE= SIMULTANEOUS (DQD)
##.ACQUISITION SCHEME= undefined
##.AVERAGES= 8
##.DIGITISER RES= 22
##SPECTROMETER/DATA SYSTEM= spect
##.PULSE SEQUENCE= zg30
##.SOLVENT NAME= COFFEE_meoh
##.SHIFT REFERENCE= INTERNAL, COFFEE_meoh, 1, 14.98509
##AUDIT TRAIL= $$ (NUMBER, WHEN, WHO, WHERE, PROCESS, VERSION, WHAT)
$$ ##TITLE= Audit trail, TOPSPIN		Version 2.1
$$ ##JCAMPDX= 5.01
$$ ##ORIGIN= Bruker BioSpin GmbH
$$ ##OWNER= Administrator
$$ $$ E:\/data/COFFEE/nmr/AC1678_CTIAH14386_8571367_QHY9PKHRzM/10/pdata/1/auditp.txt
$$ ##AUDIT TRAIL=  $$ (NUMBER, WHEN, WHO, WHERE, PROCESS, VERSION, WHAT)
(   1,<2014-04-11 23:16:25.086 -0700>,<Administrator>,<X>,<go>,<TOPSPIN 2.1>,
      <created by zg
	started at 2014-04-11 23:15:18.883 -0700,
	POWCHK enabled, PULCHK disabled,
       configuration hash MD5:
       C8 4E 4E 5D D3 5C D8 9E 9F 52 82 E0 59 8A DE 15
       data hash MD5: 64K
       03 2A CA D3 31 8E BA 29 11 D0 53 FA 7D 51 BB 1C>)
(   2,<2014-04-11 23:16:28.211 -0700>,<Administrator>,<X>,<proc1d>,<TOPSPIN 2.1>,
      <Start of raw data processing
       efp LB = 0 FT_mod = 6 PKNL = 1 PHC0 = 0 PHC1 = 0 SI = 32K 
       data hash MD5: 32K
       D6 B5 1F 3C 24 E0 A5 9B 09 F2 24 7F 34 95 E5 2B>)
(   3,<2014-04-11 23:16:28.618 -0700>,<Administrator>,<X>,<proc1d>,<TOPSPIN 2.1>,
      <pk PHC0 = 94.70215 PHC1 = 0 
       data hash MD5: 32K
       72 5D 2C 58 CA DB 79 57 5B 0C EE 15 E0 06 7C 86>)
(   4,<2014-04-11 23:16:28.836 -0700>,<Administrator>,<X>,<proc1d>,<TOPSPIN 2.1>,
      <abs ABSG = 1 
       data hash MD5: 32K
       58 E6 C5 16 A0 DE 58 07 25 4B 4B AD 60 0F 58 EF>)
(   5,<2014-04-11 23:16:28.961 -0700>,<Administrator>,<X>,<proc1d>,<TOPSPIN 2.1>,
      <abs ABSG = 2 
       data hash MD5: 32K
       08 2E B7 7C D2 DC C4 7B 43 80 D3 98 50 1A 38 52>)
(   6,<2014-04-11 23:16:29.040 -0700>,<Administrator>,<X>,<proc1d>,<TOPSPIN 2.1>,
      <abs ABSG = 3 
       data hash MD5: 32K
       43 AA 53 02 CE 51 87 17 E9 36 FB 6D 07 F2 86 5E>)
(   7,<2014-04-11 23:16:29.118 -0700>,<Administrator>,<X>,<proc1d>,<TOPSPIN 2.1>,
      <abs ABSG = 4 
       data hash MD5: 32K
       C0 FE 7B A5 92 20 CE 8E AD 70 03 45 19 0B 73 9A>)
(   8,<2014-04-11 23:16:29.180 -0700>,<Administrator>,<X>,<proc1d>,<TOPSPIN 2.1>,
      <abs ABSG = 5 
       data hash MD5: 32K
       2B C7 D1 86 CE E4 F0 5F 9D 63 27 23 AF 80 4F 86>)
$$ ##END=
$$ 
$$ $$ hash MD5
$$ $$ 1D B0 A1 01 76 06 BB 36 03 7B 2F 87 7C AC B3 1D
##$RELAX= 
##$RELAX= 
##$RELAX= 
##$RELAX= 
##$RELAX= 
##$RELAX= 
##$RELAX= 
$$ Bruker specific parameters
$$ --------------------------
##$DU= <E:\>
##$EXPNO= 10
##$NAME= <AC1678_CTIAH14386_8571367_QHY9PKHRzM>
$$ [...]
150 150 150 150 150 150 150 150
##$TP07= 0
##$TPNAME0= <>
##$TPNAME1= <>
##$TPNAME2= <>
##$TPNAME3= <>
##$TPNAME4= <>
##$TPNAME5= <>
##$TPNAME6= <>
##$TPNAME7= <>
##$TPOAL= (0..7)
0.5 0.5 0.5 0.5 0.5 0.5 0.5 0.5
##$TPOFFS= (0..7)
0 0 0 0 0 0 0 0
##$TUNHIN= 0
##$TUNHOUT= 0
##$TUNXOUT= 0
##$USERA1= <user>
##$USERA2= <user>
##$USERA3= <user>
##$USERA4= <user>
##$USERA5= <user>
##$V9= 5
##$VALIST= <valist>
##$VCLIST= <CCCCCCCCCCCCCCC>
##$VD= 0
##$VDLIST= <DDDDDDDDDDDDDDD>
##$VPLIST= <PPPPPPPPPPPPPPP>
##$VTLIST= <TTTTTTTTTTTTTTT>
##$WBST= 1024
##$WBSW= 4
##$XGAIN= (0..3)
0 0 0 0
##$XL= 0
##$YL= 0
##$YMAX_a= 585926
##$YMIN_a= -499380
##$ZGOPTNS= <>
##$ZL1= 120
##$ZL2= 120
##$ZL3= 120
##$ZL4= 120
##$ABSF1= 14.98509
##$ABSF2= -5.573092
##$ABSG= 5
##$ABSL= 3
##$ALPHA= 0
##$AQORDER= 0
##$ASSFAC= 0
##$ASSFACI= 0
##$ASSFACX= 0
##$ASSWID= 0
##$AUNMP= <proc_prof1d_extract_pilot.lims>
##$AXLEFT= 0
##$AXNAME= <>
##$AXNUC= <1H>
##$AXRIGHT= 0
##$AXTYPE= 0
##$AXUNIT= <>
##$AZFE= 0.1
##$AZFW= 0.1
##$BCFW= 0
##$BC_mod= 0
##$BYTORDP= 0
##$COROFFS= 0
##$CY= 15
##$DATMOD= 1
##$DC= 0
##$DFILT= <>
##$DTYPP= 0
##$F1P= 0
##$F2P= 0
##$FCOR= 0.5
##$FTSIZE= 32768
##$FT_mod= 6
##$GAMMA= 0
##$GB= 0
##$INTBC= 1
##$INTSCL= 1
##$ISEN= 128
##$LB= 0
##$LEV0= 0
##$LPBIN= 0
##$MAXI= 10000
##$MC2= 0
##$MEAN= 0
##$ME_mod= 0
##$MI= 0
##$NCOEF= 0
##$NC_proc= -8
##$NLEV= 6
##$NOISF1= 0
##$NOISF2= 0
##$NSP= 0
##$NTH_PI= 0
##$NZP= 0
##$OFFSET= 14.98509
##$PC= 1
##$PHC0= 94.70215
##$PHC1= 0
##$PH_mod= 1
##$PKNL= yes
##$PPARMOD= 0
##$PPDIAG= 0
##$PPIPTYP= 0
##$PPMPNUM= 2147483647
##$PPRESOL= 1
##$PSCAL= 4
##$PSIGN= 0
##$PYNMP= <proc.py>
##$REVERSE= no
##$SF= 400.02
##$SI= 32768
##$SIGF1= 0
##$SIGF2= 0
##$SINO= 400
##$SIOLD= 32768
##$SPECTYP= <>
##$SREGLST= <1H.CDCl3>
##$SSB= 0
##$STSI= 32768
##$STSR= 0
##$SW_p= 8223.68421052631
##$SYMM= 0
##$S_DEV= 0
##$TDeff= 65536
##$TDoff= 0
##$TI= <>
##$TILT= no
##$TM1= 0
##$TM2= 0
##$TOPLEV= 0
##$USERP1= <user>
##$USERP2= <user>
##$USERP3= <user>
##$USERP4= <user>
##$USERP5= <user>
##$WDW= 1
##$XDIM= 32768
##$YMAX_p= 456386774
##$YMIN_p= -694815
##$CURPLOT= <Network HP LaserJet P1505>
##$CURPRIN= <$Network HP LaserJet P1505>
##$DFORMAT= <normdp>
##$LAYOUT= <+/1D_H.xwp>
##$LFORMAT= <normlp>
##$PFORMAT= <normpl>
##$SURQMSG= 1
$$ End of Bruker specific parameters
$$ ---------------------------------
##NTUPLES= NMR SPECTRUM
##VAR_NAME=  FREQUENCY,     SPECTRUM/REAL,   SPECTRUM/IMAG
##SYMBOL=    X,             R,               I
##VAR_TYPE=  INDEPENDENT,   DEPENDENT,       DEPENDENT
##VAR_FORM=  AFFN,          ASDF,            ASDF
##VAR_DIM=   32768,         32768,           32768
##UNITS=     HZ,            ARBITRARY UNITS, ARBITRARY UNITS
##FACTOR=    0.250966925370066, 1,           1
##FIRST=     8223.43324360094, -43569,       -187445
##LAST=      0,             52443,           -137214
##MIN=       0,             -694815,         0
##MAX=       8223.43324360094, 456386774,    0
$$ Real data points
##PAGE= N=1
##DATA TABLE= (X++(R..R)), XYDATA
$$ [...]
19570C18626b17362A24325a04556A4831d7566j20530A47148b63924A90920b6029
19559a53250C3274A2268K2371c3692o6290k49501G2583g0158A24139L38238b3777
19547c75153I3869a45929A28484a61223f8049B36600J52423D6666b63699c8255
19536C0746J60560b0958A19556l1416a65470G6078b65111C4813Q8900J9254k9474
19525A13493h6722F2517l489a06479I677b7568j14842q8618i1965j79327a2975
19513d99637A08617L2086a52000B00599m611B8498i7036C6882b50627j2735a05454
19501a05113c4959o5384l5824e5361A66777b19207A10619a43841d3935n5623m63169
19490e62727a21109A43012j4776c5962B21811b15476m4928A40789a30424p7619
$$ y = [318626, -217362, 124325, -104556, 14831, -47566, -168096, 147148, -263924, 190920, -26029, -153250, 33274, 12268, 34639, -33692, -99982, -349483, 72583, -70158, 124139, 462377, -23777, -375153, 93869, -145929, 128484, -161223, -68049, 236600, 389023, 46666, -263699, -38255, 30746, 191306, -20958, 119556, 88140, -165470, 76078, -265111, 34813, 123713, 142967, 113493, -86722, 62517, 59028, -106479, 9677, -27568, -142410, -231028, -91965, -271292, -12975, -499637, 108617, 140703, -152000, 200599, 195988, 28498, -97036, 36882, -250627, -263362, -105454, -105113, -34959, -100343, -136167, -55361, 166777, -219207, 110619, -143841, -43935, -99558, -562727, -121109, 143012, 128236, -35962, 221811, -215476, -260404, 140789, -130424, -208043]
19480b08043N6115N051A82420b09300a9481B2726b90288j14283J90026d9551j17916
19469a67467E8875a01749j42554B6953a63735l49145I5927b874k68147g7517C5222
19457h6858j52972C41001A27985m5544m052Q5707a55076i027m3544a5311E1780
19445G3830i8237g603G4033a41554A49943b52267d0839A41147b9450F2596R3568
19434A56164D3049c05396i9449A13325b98389H4611b40217k20844E2209c84069
19423B8970e0625m72511d6739A58464D212d5736L434A93482R5320a75193j68593
19412c43786f6696I4613J13948I3588O9172b50893H0107C366g9641H3240a27412
19400b38213A42390a06049B0129K16780f4258B96701j39198c15412a3113A24107
$$ y = [-208043, -151928, -146877, 182420, -209300, -19481, 22726, -290288, -404571, -214545, -49551, -167467, 58875, -101749, -244303, 26953, -163735, -512880, 95927, -2874, -271021, -77517, 35222, -86858, -239830, 341001, 127985, 82441, 78389, 164096, -155076, -9027, -52571, -15311, 51780, 73830, -98237, -7603, 74033, -141554, 149943, -252267, -40839, 141147, -29450, 62596, 156164, 43049, -305396, -99449, 113325, -298389, 84611, -240217, -461061, 52209, -384069, 28970, -50625, -523136, -46739, 158464, 4212, -45736, -42302, 193482, 288802, -175193, -343786, -66696, 94613, 208561, 93588, 162760, -250893, 80107, 3366, -79641, 83240, -127412, -238213, 142390, -106049, 20129, 236909, -64258, 296701, 157503, -315412, -13113, 124107]
19389a70370A9122K38553q9477o9054j9029a15794q9683k24C6284L579M7667b29709
19376a00724M5845E2778k091N6714b31034O187b8015k9087C4451a44777E801a12515
19363b6909l35573a6830f86A17575a45496j50459F5194e6323p8629k5775G6606
19351a02415m634D35842d5496k30924J33778A4976b84393B19844a35781j4849
19341a50630A75418a31930m3416E0688J01019b32094r2488P7489g128m931j319
19330a3378B34533b32311R8740l0909A15694j8614a50789C49743b03382b5527
19319d43555B97466H1003J38799d28759A77105H0069g9163k49360f0892l0856
19309i1748c0338m6312A47799b27566B3384c67213E167O3587a47700J9890A00160
$$ y = [-170370, 19122, 257675, 168198, 99144, 80115, -115794, -205477, -205701, 36284, 39863, 87530, -229709, -100724, -54879, 52778, 50687, 107401, -231034, -224847, -28015, -57102, 34451, -144777, 5801, -112515, -26909, -362482, -16830, -686, 117575, -145496, -295955, 65194, -56323, -134952, -160727, 76606, -102415, -107049, 435842, -45496, -276420, -142642, 14976, -284393, 219844, -135781, -150630, 175418, -131930, -175346, 50688, 151707, -232094, -324582, -247093, -7128, -12059, -13378, 234533, -232311, -133571, -164480, 115694, 97080, -150789, 349743, -203382, -25527, -443555, 297466, 81003, 219802, -428759, 177105, 80069, -79163, -328523, -60892, -91748, -30338, -76650, 147799, -227566, 23384, -367213, 5167, 68754, -147700, -127810, 100160]
19297D5731c27384a05626q351C99970d27078J07522p7210g1648A46914e7491p4292
19286a31783Q034c0483A38558a91734q1462A45137a21700A51641a1273A08991
19275c76020A16923m7561j6255Q435k6191N3621b46180Q5666m7788g122C6072
19263c36832J24567A51169a46056A83003C9218e3183j00196f908C81849B2709
19252a71053A31192g5251B07785a94616B64202i8236n5834C59491b56704N4709
19242b01995H1047a65048g2500k3713D6112A4041a94103j97828b2397B62018r3939
19231A68079c7276E2966c46004f419D5968a19319D3380a02807j43718j30239l3376
19220d10140a06470f972j4755j75294K4546G6752e19016a42757A41993h3128B40982
$$ y = [45731, -327384, -105626, -113977, 399970, -427078, -319556, -396766, -71648, 146914, -57491, -131783, -123749, -30483, 138558, -191734, -273196, 145137, -121700, 151641, -11273, 108991, -376020, 116923, 69362, 53107, 61542, 35351, 88972, -246180, -160514, -208302, -7122, 36072, -336832, -212265, 151169, -146056, 183003, 39218, -53183, -153379, -6908, 381849, 22709, -171053, 131192, -75251, 207785, -194616, 264202, -98236, -154070, 359491, -256704, -201995, 81047, -165048, -72500, -96213, 46112, 14041, -194103, -391931, -22397, 262018, 168079, -37276, 52966, -346004, -6419, 45968, -119319, 43380, -102807, -246525, -376764, -410140, -106470, -6972, -21727, -197021, -172475, 76752, -519016, -142757, 141993, -83128, 240982]
19208a81446O155N9267B3153b29085J02532M4665j66474p0855b2356A7744c47169
19196B2140d3034A81695q6166c1104l71461J40700E1191J3762h6168C8433a48093
19184d2061D9187c6052G8249b44936O9032E24M9175R5071a25482j61404A92424
19172b72939C46618a65675E9210a83187E4990b45512K1266Q4016H0453e2135B04745
19160f4834A79100a81763n6747B02676a6217A05576j3912b21672k37243f5204
19149b656j16982M9269k7837j33340g4933j88287C79788a25539a2804k89480C07238
19137D049a90346o4847A40942O5088H1188b6887j68878M6678j8874g269k64503
19126b71772P7432A3379K2548J06851m2568k0492C8586b9792A17472O1652C4995
$$ y = [-181446, -175291, -116024, 23153, -229085, -126553, -81888, -248362, -319217, -22356, 17744, -347169, 22140, -43034, 181695, 95529, -31104, -402565, -261865, 51191, 64953, -86168, 38433, -148093, -42061, 49187, -36052, 78249, -244936, -175904, 524, 49699, 144770, -125482, -286886, 192424, -272939, 346618, -165675, 59210, -183187, 54990, -245512, -224246, -140230, 80453, -52135, 204745, -64834, 179100, -181763, -238510, 202676, -16217, 105576, 91664, -221672, -458915, -65204, -2656, -119638, -70369, -98206, -231546, -74933, -263220, 379788, -125539, -12804, -302284, 307238, 4049, -190346, -255193, 140942, 206030, 81188, -26887, -195765, -149087, -167961, -7269, -271772, -194340, 13379, 35927, 142778, 100210, 79718, 38586, -29792, 117472, 179124, 34995]
19114I0780a22486B54697F8175b49435i0553m78421B14313e0481A400N0506j929
19103D9977a27136c6113A18724i8772a9620r0930j71146c1456o2592n0725c5378
19091h9934C17999d5809A01695O2565K56006b44980h6108D73360c41598J5442
19081c26156B26313l6484b24195n3193A68246a3679n7539m68983e3947j15826
19071a69773D840b5354B23439f2951A07438a41947I189M2757A7867O5553b97575
19059a79j91425h452j77690C3172J60396a98079C7740d11887J84727a09297k4810
19048a34107q1463A2049h2003r2703Q5787n51420a27874A40630a03866j45412
19038b49278f1372D7738e6212A91550b23426f0533j9218q8516A18175D6024K2106
$$ y = [90780, -122486, 254697, 68175, -249435, -90553, -568974, 214313, -50481, 1400, 51906, 49977, -127136, -36113, 118724, -98772, -19620, -110550, -281696, -31456, -94048, -144773, -35378, -89934, 317999, -45809, 101695, 164260, 420266, -244980, -86108, 473360, -341598, -326156, 226313, 189829, -224195, -277388, 168246, -13679, -71218, -540201, -53947, -169773, 4840, -25354, 223439, -62951, 107438, -141947, 9189, 51946, 17867, 83420, -297575, -179, -191604, -8452, -186142, 33172, 193568, -198079, 37740, -411887, -227160, -109297, -134107, -215570, 12049, -82003, -174706, -88919, -640339, -127874, 140630, -103866, -249278, -61372, 47738, -56212, 191550, -223426, -60533, -79751, -168267, 118175, 46024, 68130]
19027F8130B3306a7428j25587C1553b26116e9368b2664k84104P8549I5713a17512
19015b24640d6205C2446b33471d2543C56846F9267K39688b1072i811l05672B32184
19003A10815a68416A0096c43474a44182O6629F0151M60344A02091a07228H8814
18992B5777b59040f4512j92611A08746b42841A3848J44465a50732H2168j3566
18982F8602M8356e0569k7976C3062A178a52365B17200b66591A98820E1210J31550
18971A82760B0667P8789l5286a49134A7208O984b30378A06015l2835e231k78099
18960b83330d7398m25567K24928f4977B11697a52161C16863a71178r3794A92829
18949A70073a95073D1235P8769K66104a07568A67158d00921B53112e6307A93811
$$ y = [68130, 23306, -17428, -143015, 31553, -226116, -59368, -22664, -306768, -228219, 95713, -117512, -224640, -46205, 32446, -233471, -42543, 356846, 69267, 308955, -21072, -9811, -315483, 232184, 110815, -168416, 10096, -343474, -144182, -77553, 60151, 520495, 102091, -107228, 88814, 25777, -259040, -64512, -257123, 108746, -242841, 13848, 158313, -150732, 82168, 68602, 116958, -50569, -78545, 33062, 1178, -152365, 217200, -266591, 198820, 51210, 182760, 20667, 99456, 64170, -149134, 17208, 24192, -230378, 106015, 73180, -5231, -283330, -47398, -472965, -248037, -64977, 211697, -152161, 316863, -171178, -264972, 192829, 170073, -195073, 41235, 120004, 386108, -107568, 167158, -400921, 253112, -56307, 193811]
18938A03741g833r9337B22708b76073A9144J32334d71007A21606b3042h810D1268
18926a40098O8958p3247q133G7883h5675r1370d0300m7192A98648d10101E7310
18914b26905e4643j88077Q1503d3909A3080a61789l3842M3960k41233B02878m9050
18903A53828a70050p642K2971C05204a03102A16342a66195C10062a62650O8477
18893i4173p2673a6781j4983B38779c8049J4677j73591f1036H3330K05596e4265
18881A4552h4248A21446F181Q8899o234C030b72038a6780j55941A21911M0021
18870A61932a62113e8592n605A53995b31307o3126c3353l2180p432D5342a60167
18858c6774r1228N5581j4972j54032J05162B76157q5468c86501A50464m0181E0969
$$ y = [103741, -7833, -107170, 222708, -276073, 19144, 151478, -471007, 121606, -23042, -8810, 41268, -140098, -71140, -144387, -152520, 77883, -85675, -177045, -40300, -87492, 198648, -410101, 57310, -226905, -54643, -242720, -161217, -43909, 13080, -161789, -195631, -151671, -392904, 202878, 153828, -170050, -177692, -154721, 305204, -103102, 116342, -166195, 310062, -162650, -94173, -166846, -16781, -31764, 238779, -38049, -23372, -196963, -61036, 83330, 288926, -54265, 14552, -84248, 121446, 6181, 95080, 88846, 3030, -272038, -16780, -172721, 121911, 161932, -162113, -58592, -64197, 153995, -231307, -294433, -33353, -65533, -72965, 45342, -160167, -36774, -128002, -72421, -87393, -241425, -136263, 276157, 190689, -386501, 150464, 110283, 50969]
18846a98826L0559b9077q4562K992K4987c4092g769j19561a4412k30136e3633
18834a26056I1072J40706m718I7577a8589B25101F9953A9980J8335a12559k56714
18823c69273C4482b61436A86053c01159E9385R0620a27348c3945o265q7780L5011
18812i2979E1597h9532I8706N4985o3689k8359K680J61447e6329F111c14245g9923
18799b05264A62677K88A3066K3556a07213a5498r3526O048b2181k18088g7898
18787b58965h0249A84131f4524A37014c49614a00560G1787a25747q2655i366F3115
18775A51721c8277j53843o3829d751m00782a18666C39545a57156N8693m4838F8635
18763a3011n1375m4612F7487J50410d14613f1976N244J3788E090i2781E7904k4879
$$ y = [-198826, -168267, -29077, -113639, -110647, -85660, -34092, -7769, -127330, -14412, -244548, -53633, -126056, 91072, 231778, 227060, 97577, -18589, 225101, 69953, 19980, 38315, -112559, -369273, 34482, -261436, 186053, -301159, 59385, 150005, -127348, -33945, -40210, -127990, -92979, 51597, -89532, 98706, 153691, 90002, 61643, 64323, 225770, -56329, 6111, -314245, -79923, -205264, 162677, 162965, 13066, 36622, -107213, -15498, -109024, -102976, -22181, -240269, -77898, -258965, -80249, 184131, -64524, 137014, -349614, -100560, 71787, -125747, -208402, -9366, 63115, 151721, -38277, -192120, -255949, -4751, -405533, -118666, 339545, -157156, -98463, -143301, 68635, -13011, -64386, -108998, 67487, 217897, -414613, -61976, -56732, -42944, 5090, -92781, 57904, 33025]
18751C3025g229H5749J93237a40342l14964E8234q761A2976c16965A19311n642
18740A13669K14034b0959k31456i7575o1276e6319j83637I4616J14473i0888A48630
18728B2416b08420j44694J35384e8871B0821b7023k67367j22220a35862A0103
18717A1454K60143A0742A822P9093a81253D4054b49481r5208f4836j97442D8312
18705e5720A36664m5619K29428A0042h2576R548j00153h0079A51001c4014j69317
18694b03331B5798b43194O6035A7399Q8052e7456j34563j72624A3755a37451b9802
18682I2350i0060B1674f5548E1228a0248A03629D6676c00579D7524i9429j43892
18671b43321b6700g689q8786B05586B8981J34162e2721G1836G716J2599K8138
$$ y = [33025, -7229, 85749, 278986, -140342, -455306, 58234, 49473, 12976, -316965, 119311, 113669, 327703, -20959, -252415, -97575, -158851, -56319, -239956, 94616, 209089, -90888, 148630, 22416, -208420, -353114, -217730, -58871, 20821, -27023, -294390, -416610, -135862, 10103, 11454, 271597, 10742, 1822, 80915, -181253, 44054, -249481, -344689, -64836, -262278, 48312, -55720, 136664, 91045, 320473, 10042, -82576, -73028, -173181, -80079, 151001, -34014, -203331, 25798, -243194, -177159, 17399, 105451, -57456, -192019, -364643, 13755, -137451, -29802, 92350, -90060, 21674, -65548, 51228, -10248, 103629, 46676, -300579, 47524, -99429, -243321, -26700, -7689, -96475, 205586, 28981, 163143, -52721, 71836, 7716, 20315, 48453]
18660D8453a07567K6287F2341L20792A44458B5451f0077K5458I5226m4848b0319
18648F0308b47921a7153B70481g1161M60G9698Q0440a77364a6659j53188b8364
18636a19904k39996J2602f7983D9783d0591k65152A29355L14416A53708n6987
18626I6721e195B33857G0192c83380b4554q2617j42136A07397d9549H3774a69366
18614d0214B33832H5589P9307a40783p3610Q362n0366J15890A78493k7155a65068
18602G3697a8500k22036C20086E9671b40507I7875L0660o2052c328A2638c20354
18590a27501A6357e6429r7462D18170c46204A60974j0076d8005j7448I000c87122
18578B1391c11455B8842M6770c74576a73414O7451A03139b78220E7886M4531c8182
$$ y = [48453, -107567, -81280, 62341, 383133, 144458, 25451, -60077, -34619, 95226, 50378, -20319, 60308, -247921, -17153, 270481, -71161, -70701, 79698, 160138, -177364, -16659, -169847, -28364, -119904, -359900, -347298, -67983, 49783, -40591, -305743, 129355, 443771, 153708, 96721, -5195, 233857, 70192, -383380, -24554, -107171, -249307, 107397, -49549, 83774, -169366, -40214, 233832, 85589, 164896, -140783, -214393, -206031, -256397, -140507, 178493, 151338, -165068, 73697, -18500, -240536, 320086, 59671, -240507, 97875, 128535, 66483, -3328, 12638, -320354, -127501, 16357, -56429, -153891, 418170, -346204, 160974, 150898, -48005, -65453, 9000, -387122, 21391, -311455, 28842, 75612, -374576, -173414, -105963, 103139, -278220, 57886, 102417, -38182]
18566e7738j75240B82537a40189A63584m0031b5332I1399e9136a0297r1041A21398
18554a54824d3345k83342b8167l20087d5416f655j16443A16761b14574A15208
18543a82856o0187Q7745E9309a8228k38923Q3969I5745a58748M4300M8059I1942
18531B15184c07370a17817Q629n9104b4540j54218A08180d85158G4815c53815
18520B03722a14343q4114A24692O1668F9787e6498r5335P472A45941b78184M4891
18509b33293G3211R0670F435J75841b3426I3534L4686Q099l383a73203m7091Q1391
18497a38903a6603E8757b42800B40419b40756A82500a41894L8973b3133I4715
18486a27410m5131P8854l26195a67136I9372b09284D4115E291h1071A90888j7686
$$ y = [-57738, -232978, 282537, -140189, 163584, 123553, -25332, 91399, -59136, -10297, -101338, 121398, -154824, -43345, -326687, -28167, -348254, -45416, -6655, -123098, 116761, -214574, 115208, -182856, -243043, -155298, 59309, -18228, -257151, -173182, 95745, -158748, -114448, -66389, 91942, 215184, -307370, -117817, -109188, -168292, -24540, -178758, 108180, -485158, 74815, -353815, 203722, -114343, -198457, 124692, 186360, 69787, -56498, -151833, -144361, 145941, -278184, -233293, 73211, 163881, 6435, 182276, -23426, 93534, 128220, 136319, 132936, -173203, -220294, -138903, -16603, 58757, -242800, 240419, -240756, 182500, -141894, -102921, -23133, 94715, -127410, -172541, -93687, -419882, -167136, 99372, -209284, 44115, 5291, -81071, 190888, 173202]
18475A73202q0351e0105k33844A3211a25239e3737n6433H6689B2625J53241a43407
18463b52251N2782b2513H5854d08044M8527N500a41917O4998j95084a9412A4463
18451A06055a36233F4224J28870J50284c2965m1050k14489I3247D4656H260c05890
18439e4017B92991g7946E8432J03607d8926A30107i9178k11073Q940A7165d8898
18427h2543B88326a25053l2978a6036m0457C2440i7686A02168a50308c5780j23978
18416a59758D5945d9512I3288a28121n3369M9280j2364D25867A61425C7652A2047
18404B77085a46222b0927B57654b21887C41732G9153J44925a91817B42387G1596
18393a28470C881J10125e4011m399j29212A62772b66480M3578B0498a28259B34935
$$ y = [173202, 92851, -50105, -283949, 13211, -125239, -53737, -110170, 86689, 22625, 175866, -143407, -252251, -199469, -22513, 85854, -408044, -359517, -354017, -141917, -76919, -272003, -19412, 14463, 106055, -136233, 64224, 193094, 343378, -32965, -74015, -288504, 93247, 44656, 8260, -305890, -54017, 292991, -77946, 58432, 162039, -48926, 130107, -99178, -310251, -301311, 17165, -48898, -82543, 288326, -125053, -158031, -16036, -56493, 32440, -97686, 102168, -150308, -35780, -159758, 45945, -49512, 93288, -128121, -181490, -132210, -144574, 425867, 161425, 37652, 12047, 277085, -146222, -20927, 257654, -221887, 341732, 79153, 224078, -191817, 242387, 71596, -128470, 3881, 114006, -54011, -58410, -187622, 162772, -266480, -222902, 20498, -128259, 234935]
18381b30819A69331L2991o3869c08842A73689c47820H0648C4326R8868C0300e7777
18369A1431b83548D80096E1035a13785C14340D1614O0612J6139a41166a7590j89332
18358b06922b7964D7307J24463J3228g949j19358r2969h2270C0444b78192h6440
18346a73261E8192f043H5902a59842H2364j0388b25893B3224d3304D8127a1773
18334A38712J52258a33141g62j02354l9298O6129A43306f3057A42280a87336B83496
18322I6167a50178A067a41814M3525B86914b26312D3458L3064g8003E0968h499
18310B7093c5815m2591q7127m5218H3496b17689N3624l6098P9262j12747J1043
18299b22605O9881L8733J6566B89263e6983j06780j05696B1414N4837a29816M6771
$$ y = [-230819, 169331, 202322, 138453, -308842, 173689, -347820, 80648, 34326, 133194, 30300, -57777, 11431, -283548, 480096, 51035, -113785, 314340, 41614, 102226, 118365, -141166, -17590, -206922, -27964, 47307, 171770, 184998, -7949, -127307, -220276, -82270, 30444, -278192, -86440, -173261, 58192, -6043, 85902, -159842, 82364, 71976, -225893, 23224, -43304, 48127, -11773, 138712, 290970, -133141, -762, -103116, -142414, -76285, 143306, -63057, 142280, -187336, 283496, 96167, -150178, 1067, -141814, -98289, 286914, -226312, 43458, 76522, -78003, 50968, -8499, 27093, -35815, -78406, -165533, -210751, 83496, -217689, -164065, -200163, -120901, -233648, -222605, -152724, -113991, -97425, 289263, -56983, -163763, -269459, 21414, 76251, -129816, -83045]
18288h3045j88683J18647C3653c02976a19543j49075R111g6179j15106f8673k40613
18277c09286J8925a6196H0004B1511b02845G0789b59272A74098B5984Q745b3281
18265a52854A56198a62440p182l5164j15470J54330k1890j68167C53568b27893
18254h6078A8211a84536g3213k82923A64805d2118E0264a6541j19981F1938c16776
18242D7859B2583Q2770a74667J8084j05945k3416F159K65521d58937b2064A79488
18230D53213c49330A91791H4280N2297R0457G0004a65945D6673a9527B34232K68124
18219E02356d10414A40158c7010B2506Q7370b76425A58576G8267a86629K9586
18209a57043N3788k9450A15243b62518E4618K4904Q5573c6100A05126J37870e046
$$ y = [-83045, -271728, -153081, 33653, -302976, -119543, -268618, -259507, -76179, -191285, -68673, -309286, -290361, -16196, 80004, 21511, -202845, 70789, -259272, 174098, 25984, 34729, -23281, -152854, 156198, -162440, -169622, -204786, -320256, -165926, -187816, -355983, 353568, -227893, -86078, 18211, -184536, -73213, -356136, 164805, -42118, 50264, -16541, -136522, 61938, -316776, 47859, 22583, 105353, -174667, -156583, -262528, -285944, 6159, 271680, -458937, -22064, 179488, 453213, -349330, 191791, 84280, 136577, 227034, 70004, -165945, 46673, -19527, 234232, 502356, -410414, 140158, -37010, 22506, 109876, -276425, 158576, 78267, -186629, -157043, -103255, -132705, 115243, -262518, 54618, 79522, 165095, -36100, 105126, 242996, -5046]
18197D4845b04265C66498A79084b48684A43011a66868B23207c37768e1157A7569
18186b60837A36117i1999a3744k8238A09196Q0415a03403j04585B21968G3702
18175B06194b1979j14809c3750E6382g5512B88265a0774A78821D7776d1851l48851
18164c90702a793A6750N71851I8218J08445a30325A26533a79256A77045c62071
18153i7179j1465e1417a5517A00009a33967K1354k38895F1845a04704B24656a36352
18141g0211A04295A925K37813K6838O30a76807A64964a98398A40147a62998A09860
18129D1843a20557j43238B30440b09552a1717r269j23556f6668B8410g0987A39496
18117B75590i588H230b38402A11186a61516b8603B706Q7364N9760l6508C4540
$$ y = [44845, -204265, 366498, 179084, -248684, 143011, -166868, 223207, -337768, -51157, 17569, -260837, 136117, -91999, -13744, -41982, 109196, 189611, -103403, -207988, 221968, 73702, 206194, -21979, -136788, -33750, 56382, -75512, 288265, -10774, 178821, 47776, -41851, -390702, -1793, 16750, 588601, 98218, 206663, -130325, 126533, -179256, 177045, -362071, -97179, -108644, -51417, -15517, 100009, -133967, -112613, -351508, 61845, -104704, 224656, -136352, -70211, 104295, 1925, 239738, 266576, 267206, -176807, 164964, -198398, 140147, -162998, 109860, 41843, -120557, -263795, 230440, -209552, -11717, -20986, -144542, -66668, 28410, -70987, 139496, 275590, -9588, 8230, -238402, 111186, -161516, -28603, 2706, 90070, 149830, 113322, 34540]
18105b44195g2552A10648c29587j8921A35088b56458O405K9348J1703C63749A74779
18093A52981c14125g3174B48992j09488a84376B38288b11736a8242H6989b47206
18082d3117j79655A11835a56405A31588D5560b60529a3080A45835e12821K05704
18072c07117F7610a27894j16550j00517b7956p1653j8601j79222f4458n7246d4600
18060A19325m4998a99814A28412c19707d6925A77953d9616G6006J1329k6546a72765
18048d64680A37038b25970j56828A52699Q92b351B96972A26327c6688k7424F0529
18036c08276a16661J6472p8538n4365d1722j0776k03997h567C05073G5645b31717
18024C84901F7285b48210b1484I0593a28915r3388C52260a71024M8785A945J73600
$$ y = [-244195, -72552, 110648, -329587, -348508, 135088, -256458, -250053, -220705, -209002, 363749, 174779, 152981, -314125, -73174, 248992, 139504, -184376, 238288, -211736, -18242, 86989, -247206, -43117, -222772, 111835, -156405, 131588, 45560, -260529, -13080, 145835, -512821, -307117, 67610, -127894, -244444, -344961, -27956, -99609, -118210, -297432, -64458, -121704, -44600, 119325, 74327, -199814, 128412, -319707, -46925, 177953, -49616, 76006, 87335, 60789, -172765, -464680, 137038, -225970, -382798, 152699, 153591, -2351, 296972, 126327, -36688, -64112, 60529, -308276, -116661, -100189, -178727, -233092, -41722, -52498, -256495, -8567, 305073, 75645, -231717, 384901, 67285, -248210, -21484, 90593, -128915, -222303, 352260, -171024, -122239, 1945, 175545]
18013A75545c8808B68792h9778k2750P179k13435J40691n9072B7232P6450a03727
18001h7816D6975R0209a50290H5750c63975a60464q8760A32066a80228Q9301a5847
17989A3159b44258B3540f1004m7975A61178a25305A04664A4575J33586a34521
17978e927j28730K9513j7640j56193g3609m8668q65a3989B07659H299J89094d34859
17965a7560j21133G3709a6805A22044a37172F8471O2589k5132P47b03366h3718
17953A10262i3959l1132A865L15272A26094a47541D0128e7787r290k85756a24806
17941G0272a0501G2672a06489K8974I5038c4580B43306H4532J41323A09556a40693
17929I5932a64513j21036a30804A03895b20623E8582a35414I7893K39444D3544
$$ y = [175545, -38808, 268792, -89778, -112528, -105349, -318784, -178093, -237165, 27232, 103682, -103727, -87816, 46975, 137184, -150290, 85750, -363975, -160464, -249224, 132066, -180228, -90927, -15847, 13159, -244258, 23540, -61004, -108979, 161178, -125305, 104664, 14575, 148161, -134521, -5927, -134657, -105144, -122784, -278977, -73609, -122277, -123142, -13989, 207659, 8299, 197393, -434859, -17560, -138693, 73709, -16805, 122044, -137172, 68471, 131060, 105928, 106675, -203366, -83718, 110262, -93959, -125091, 1865, 317137, 126094, -147541, 40128, -57787, -67077, -352833, -124806, 70272, -10501, 72672, -106489, -77515, 95038, -34580, 243306, 84532, 225855, 109556, -140693, 95932, -164513, -285549, -130804, 103895, -220623, 58582, -135414, 97893, 337337, 43544]
17918f9740A61213E0796a4908j10632O1730l64479J54173a2142k87845A86083
17907a4764G9955J1576J26850f5368A33732b8480B28317b62437A11553a01434
17896A45020e4170A92290o8354l7392d507j45628B74085o754a93047n9215C2979
17884b93051B03024e1407k54674J36950A03195d1329p1494b7688A24431C0572
17873b47229c18A88662d9286A80554p0607a21150b3405j06446F6939g1502N588
17862f5914A73299b51207B19407g9114A52314a01479A4688a68726B36763j13064
17852A23699C0770a43648H9164l5462A6782c1077B37822I1875b1604k7130A61540
17840a14436B40957a84848b2107k23020a0344C52532A47996p0824j0675K13931
$$ y = [-69740, 161213, 50796, -14908, -125540, -63810, -428289, -274116, -12142, -299987, 186083, -14764, 79955, 91531, 218381, -65368, 133732, -28480, 228317, -262437, 111553, -101434, 145020, -54170, 192290, 123936, 86544, -4507, -150135, 274085, 267331, -193047, -252262, 32979, -293051, 203024, -51407, -306081, -169131, 103195, -41329, -112823, -27688, 124431, 30572, -247229, -318, 188662, -49286, 180554, 109947, -121150, -23405, -129851, 66939, -71502, -65914, 173299, -251207, 219407, -79114, 152314, -101479, 14688, -168726, 236763, 123699, 30770, -143648, 89164, 53702, 16782, -31077, 237822, 91875, -21604, -48734, 161540, -114436, 240957, -184848, -22107, -245127, -10344, 352532, 147996, 77172, 66497, 280428]
17830B80428n9591C5326L7460e8757G3781c4586A65131a38439A63123R523E3946
17818c52503A49297b43323N3567A25701c88399a04546J515A77856c04116a4839
17807a3871j07394A10626M4468P854l4452N9692b4793A44114k0315E124i3790
17795b35703b9791l002b848n5650m4145A86227i7465D3165b61771N9836B8913
17783d3769j65496A45759b14875A04754h5984K1380I7717D0924b60668A14624
17772A75791K40984f3446l2455b2883A27706a90594G8907M3233A0302i6116D36552
17760c3387a3521m62498i6554j54698J7836p8061f4186A4858J71009a54705O3843
17749i0862f343m26296C40364c35085A53420G4277i5830A93458D6052f0887I5754
$$ y = [280428, 220837, 35326, 72786, -58757, 73781, -34586, 165131, -138439, 163123, 172646, 53946, -352503, 149297, -243323, -189756, 125701, -388399, -104546, -103031, 177856, -304116, -14839, -13871, -121265, 110626, 155094, 162948, 128496, 188188, -24793, 144114, 123799, 5124, -93790, -235703, -29791, -32793, -2848, -58498, -102643, 186227, -97465, 43165, -261771, -201935, 28913, -43769, -209265, 145759, -214875, 104754, -85984, -64604, 97717, 40924, -260668, 114624, 175791, 416775, -63446, -95901, -22883, 127706, -190594, 78907, 122140, 10302, -96116, 436552, -33387, -13521, -476019, -96554, -251252, -233416, -311477, -64186, 14858, 185867, -154705, -90862, -6343, -432639, 340364, -335085, 153420, 74277, -95830, 193458, 46052, -60887, 95754]
17737a1443G5693b03775B66343a56466m9494B9651J34617g6985j26658b4063B72763
17725a34338I5081c28865i9298B31974b73413B5039c39706A6532Q0724Q5896R8975
17714B82127b11116I9903a77760P2014A88173G7440g573j18081A37358E6988b68249
17702a84019A15020a57594I4209R970i6925d58A30589c427j3208k03868F906a8425
17689G1136c31907D48011A00786R994a45477A89316a92285q1948A64777b6951
17678h3361o2273n0912B3292b42131j00954h3406C6288b9724l53065a07635j87039
17667b94674B24017a1801E6367J52153B613c51721B66930j14051C5999i4277F1094
17655A29880d5638C83893a97317I551K2559b56296J26109A1719J16197f36j04467
$$ y = [-11443, 75693, -203775, 266343, -156466, -205960, 29651, 164268, -76985, -203643, -24063, 272763, -134338, 95081, -328865, -99298, 231974, -273413, 25039, -339706, 16532, 97256, 183152, 282127, -211116, 99903, -177760, -105746, 188173, 77440, -7573, -125654, 137358, 56988, -268249, -184019, 115020, -157594, 94209, 104179, -96925, -458, 130589, -3427, -16635, -220503, 6906, -18425, 71136, -331907, 448011, 100786, 110780, -145477, 189316, -192285, -274233, 164777, -26951, -83361, -145634, -196546, 23292, -242131, -343085, -83406, 36288, -29724, -382789, -107635, -294674, 224017, -11801, 56367, 208520, 2613, -351721, 266930, 152879, 35999, -94277, 61094, 129880, -45638, 383893, -197317, 9551, 32110, -256296, -130187, 11719, 127916, -636, -105103]
17644a05103b958r7444b5274j48541A45940b32571O4384A59574P1770a35087O1784
17633g3303b5955r3638C67613b09458q8224A40107a96137A96417I639N0840J93679
17622B54158j05601b1184E3501L4192a23845H1191j5107f9240K3975H0400K8309
17611A08709Q0172d46599A81040o8297B7480J91840K8456d0986A80843c66799
17600I9084O0055D4463a18192A9010L7662J53693h9335O020b6028B34843E0333
17588C40739b19334D63506g1243A66840J0794J31351E1363c00011A71755a10818
17577b01506h2859B32207J11144i1000j02754j68804J4532B1138i0673K3166D3913
17565A28461a23336b1960A87107f6621a1497B15788I8353J36973a72499H6684
$$ y = [-105103, -2958, -100402, -25274, -173815, 145940, -232571, -168187, 159574, 231344, -135087, -73303, -25955, -119593, 367613, -209458, -297682, 140107, -196137, 196417, 9639, 60479, 254158, 148557, -21184, 53501, 87693, -123845, 81191, 66084, -69240, -45265, 80400, 108709, 188881, -446599, 181040, 112743, 27480, 219320, 247776, -40986, 180843, -366799, 99084, 159139, 44463, -118192, 19010, 56672, 210365, -89335, -83315, -26028, 234843, 50333, 340739, -219334, 463506, -71243, 166840, 177634, 308985, 51363, -300011, 171755, -110818, -201506, -82859, 232207, 343351, -91000, -193754, -362558, -348026, 21138, -90673, -67507, 43913, 128461, -123336, -21960, 187107, -66621, -11497, 215788, 98353, 235326, -172499, 86684]
17554B11195J2137g4594a5787B01378p2057k6081J927J93532b83780D3778J2598
17543E6376a11763k01863A66021b80960e6276D7193L6349a74495O0237A28902
17532D0968O9026J30993i5809j17773A09711a21056j82228R0848b5970o8925j51758
17521b46653A69357i8196B9703K23208F9967c7080D0685j5591f5550A20935a896
17509F5321M9141C1566b9735B79037G6916j4189J85544i0479i634A84800a44442
17497A83522b50922D64841b21710C77002A46716F4058J44980O1887a00434A57653
17486A00214a72267A90267b32037B59816h2347k17514H1726l7437K98377r723
17476C32943A06903J36091j04796F001J08537N7196B8805i0075j69391N3377d6020
$$ y = [211195, 223332, -74594, -15787, 201378, 129321, 103240, 105167, 298699, -283780, 43778, 56376, -111763, -313626, 166021, -280960, -56276, 47193, 83542, -174495, -114258, 128902, 40968, 109994, 240987, -95809, -213582, 109711, -121056, -303284, -212436, -25970, -94895, -246653, 169357, -98196, 29703, 252911, 69967, -37080, 40685, 25094, -65550, 120935, -1896, 65321, 114462, 31566, -29735, 279037, 76916, 62727, 248271, -90479, -9634, 184800, -144442, 183522, -250922, 464841, -221710, 377002, 146716, 64058, 209038, 270925, -100434, 157653, 100214, -172267, 190267, -232037, 259816, -82347, -299861, 81726, 44289, 342666, 332943, 106903, 242994, 138198, 6001, 114538, 171734, 28805, -90075, -259466, -206089, -46020]
17464A84822M4486g836B06125F5204K69728C2092f6513F0170h2052B89631A01313
17452H09755A92800M0167p6104f2153G05863A47286G465J14856J49270a35010
17441A27129b3928B10834m678J65658d4536B48713J78884A49646A1352J45257
17431A56609j1496a04262B86762A14839D3879J32463N8339J55594m6282k1086
17421C22907J03103F9140J32439O6344p734a73940a7997C57772l8651j17339D8550
17409C73691A51037B6449J15143J53860a33732G9314a04843A19377C4331L8742
17399G3073c2844F5958K68876j60703M6504A02889d5510G502a40394E006L62812
17388C67818a65083C41938j36860J2913j08566K8544J32721H1515J71872b13910
$$ y = [184822, 229308, -7836, 206125, 65204, 334932, 32092, -66513, 60170, -82052, 289631, 101313, 809755, 192800, 232967, 156863, -62153, 705863, 147286, 7465, 122321, 271591, -135010, 127129, -23928, 210834, 206156, 371814, -44536, 248713, 427597, 149646, 11352, 156609, 145113, -104262, 286762, 114839, 43879, 176342, 234681, 390275, 343993, 322907, 426010, 69140, 201579, 267923, 260189, -173940, -17997, 357772, 319121, 201782, 48550, 373691, 151037, 26449, 141592, 295452, -133732, 79314, -104843, 119377, 34331, 73073, -32844, 65958, 334834, 174131, 220635, 102889, -45510, 7502, -140394, 5006, 367818, -165083, 341938, 205078, 217991, 109425, 137969, 270690, 81515, 253387, -213910]
17377C4830L37919A48555E2402A64J92725m7386m455g4344C54962a62838F0537
17365G7467j8982D91J04158N6066f808C33838F3892K60150b52101B84288j03412
17354A80876R4132A05497R8052M4192m3093F1050K10214E7626J08626L38857j95043
17343C10066c3728A55766R9709K9897r040k2830m3252q2586K18835J47897B44635
17331C21854b6854C88259l8772j45487h081C28064b43316B28926j12162K29013
17321C45777H6980J08119A6027g806B90516b8980C52267j59219M23889B88264
17310C13673b35387D66822D8514J2663J46941N6166B9784J05428R4720R1564A08829
17298C31969G7355i4407A86955h0635m3397d6409r4487D8066K84146A15166a63496
$$ y = [34830, 372749, 148555, 52402, 164, 192889, 145503, 141048, -74344, 354962, -162838, 60537, 77467, 58485, 491, 104649, 160715, -6808, 333838, 63892, 324042, -252101, 284288, 180876, 275008, 105497, 203549, 247741, 204648, 61050, 271264, 57626, 166252, 505109, 310066, -33728, 155766, 255475, 285372, 276332, 253502, 210250, 127664, 346499, 494396, 244635, 321854, -26854, 388259, 349487, 204000, -8081, 328064, -243316, 228926, 116764, 345777, 86980, 195099, 16027, -7806, 290516, -28980, 352267, 193048, 616937, 288264, 313673, -235387, 466822, 48514, 61177, 208118, 264284, 29784, 135212, 229932, 321496, 108829, 331969, 77355, -94407, 186955, -80635, -124032, -46409, -140896, 48066, 332212, 115166, -163496]
17286C32066j40439A7212K46197d3958C37474j31466o287m3415b9839C32716C6186
17274A82678a95877C15688r4035F035M99566B28098b592A73678b30300E7813J56147
17263B13960Q7768o6883a73407A37863K25594j59582G3954L74652A21047P8834
17253A99881K73698E8498J85525e8394l74435b7439C1281K6935N18499B61411
17242a64674E0143R9670b30191C41388i6191b7246I5900K74385E8545d8096A6042
17230C10741j24582O1793g3602B44266J78860j73045n4649J3252J59625k7491
17220C40818b331l07362B82036K4342K01560j23086c6969A871J21700C0902A4797
17208B44131l8966J32502j40168g7541B43231n3567k5416b89296A90024N480C3810
$$ y = [332066, 191627, 17212, 263409, -43958, 337474, 206008, 199721, 156306, -29839, 332716, 36186, 182678, -195877, 315688, 221653, 6035, 505601, 228098, -2592, 173678, -230300, 57813, 213960, 301728, 234845, -173407, 137863, 363457, 203875, 73954, 448606, 121047, 199881, 473579, 58498, 244023, -58394, -432829, -27439, 31281, 58216, 576715, 261411, -164674, 50143, 149813, -230191, 341388, -96191, -27246, 95900, 370285, 58545, -48096, 16042, 310741, 186159, 247952, -73602, 244266, 423126, 250081, 195432, 208684, 368309, 340818, -2331, -309693, 282036, 306378, 507938, 384852, -36969, 1871, 123571, 30902, 14797, 244131, 205165, 337667, 197499, -77541, 243231, 189664, 164248, -289296, 190024, 195504, 33810]
17196H3317J41115l7066E4981L19186B3144K09765K45945I4128E513b22799D19048
17184C51677j46335L1989M9114L24695B90126r5627L04865l597H5419J01922J27443
17173C14784L42673F3910M80688k59313E2476J99920K19015j09154j04621j7614
17163B40022a35776B54333q310o9959K08021O7434J1550n8283C9306K00075K18062
17152D57443j51337K5693b7346C10207n1698F0531L32899A34071A0958M42850
17142D53808n9454A70621J73426K45461B54025D8426K18476K94737j10522j07550
17132C43567j57770n5324J97888b8653B98025J19072j99905D0204O8546L10683
17122D19433F9478K59488A51132J44497A21005K08782c0578A76431N2118K0750
$$ y = [83317, 224432, 187366, 54981, 374167, 23144, 232909, 478854, 94128, 5513, -222799, 419048, 351677, 205342, 237331, 286445, 611140, 290126, 194499, 499364, 495767, 85419, 187341, 314784, 657457, 63910, 544598, 285285, 52476, 252396, 471411, 362257, 257636, 240022, -135776, 254333, 246023, 176064, 384085, 451519, 463069, 404786, 39306, 239381, 457443, 306106, 331799, -27346, 310207, 258509, 60531, 393430, 134071, 10958, 453808, 394354, 170621, 344047, 589508, 254025, 48426, 266902, 561639, 451117, 343567, 185797, 130473, 328361, -28653, 298025, 417097, 217192, 40204, 108750, 419433, 69478, 328966, 151132, 295629, 121005, 329787, -30578, 176431, 228549, 249299]
17112B49299J51137n5462J57586B25336j1535j024K01430j53723K3241A27512
17101E67903q1518J25830k67782J08019J48691k11295j72242J67542j64333N25685
17091G46500B68887K72384n5177K2631j18643p08J35004j16720n2910K00661J1126
17080E66535A42478D4873J01539K25784N6447o2444n617J6907K55269k57911n2265
17069C22582K71117B26330n013M57973k04050J44025j85196j6429M04571C40937
17058B70718J5894K97052k34272K76864J8014R1498k98559j85328M72419M6841
17048G71141j47709k4807k17544M99188C63407J58658J09130j35397k18205J33430
17038D11023o7802K33689m5054J72461j42999J43157B97565L97387j39313J10481
$$ y = [249299, 400436, 344974, 502560, 225336, 213801, 212777, 414207, 260484, 283725, 127512, 567903, 486385, 612215, 344433, 452452, 601143, 389848, 217606, 385148, 220815, 746500, 268887, 541271, 486094, 508725, 390082, 389374, 524378, 407658, 354748, 555409, 566535, 142478, 44873, 146412, 372196, 428643, 366199, 360582, 377489, 632758, 374847, 322582, 593699, 226330, 221317, 679290, 475240, 619265, 434069, 417640, 822211, 340937, 270718, 286612, 583664, 349392, 626256, 644270, 735768, 437209, 251881, 724300, 771141, 623432, 598625, 381081, 880269, 363407, 522065, 631195, 495798, 277593, 411023, 343221, 576910, 531856, 704317, 561318, 704475, 297565, 694952, 555639, 666120]
17028F66120B22676K68790k07284K12249R8899l784j65091p5230K79004L65297
17018I95526D26205K02387J53004k12272l2579L9971p2385K46137N0528J16708
17008I17704k21164m5139N2797K25976D50066J58074K28532j64676j67239k5716
16998D79041J20489l9239p9039K06182j41557J24180j15505Q1687j18177J7072
16988E35134j47244L91789k89188O5890L42052k34314J00785j06774J19468J07074
16978H84672J62955k10253K22763E11951L91959K80572k40609k11951K6670J56301
16968I14893k98961R4112K4214K79318j36976J44479m04096N16133l30705N6154
16958H58565j49742L8064J40168k512J75320N0741j81141j83321N93755l64948
$$ y = [666120, 222676, 491466, 284182, 496431, 595330, 591546, 426455, 351225, 630229, 995526, 426205, 628592, 781596, 569324, 536745, 576716, 504331, 750468, 800996, 917704, 696540, 651401, 704198, 930174, 450066, 608140, 836672, 671996, 504757, 479041, 599530, 560291, 481252, 687434, 545877, 670057, 554552, 636239, 518062, 535134, 387890, 779679, 490491, 556381, 898433, 664119, 764904, 658130, 777598, 884672, 1047627, 837374, 1060137, 511951, 903910, 1184482, 943873, 731922, 758592, 914893, 615932, 710044, 734258, 1013576, 876600, 1021079, 616983, 1133116, 802411, 858565, 708823, 746887, 887055, 884543, 1059863, 1110604, 929463, 746142, 1339897, 974949]
16948I74949j24657K55207p6123L33826k47184k26043K72136P1362j94820j73853
16938H64800J21420K10736j71806P9671o3610J78099L3438L7283j59046k12087
16928I18898K51056J84641k02734J7462J34690K03682P5419j17358j37668k24571
16918A103517Q4023K2369J94204k65539L15710k16071j75922J5716K55990L2066
16908A366063M66296n76326R1377L69512R4419o32920L87467j34876J51004J59310
16898A741326J46333j5585j05018J79464k49202p9067J95409q7222J12404o7639
16888A771203K62912o5325l5171j63844K30982L54893n19490j7020K31407p745
16878B042802o6621L41008k14969K76876k90206J97165J8435l75804L70397K23609
$$ y = [974949, 850292, 1105499, 1029376, 1363202, 1116018, 889975, 1162111, 1233473, 1038653, 864800, 986220, 1196956, 1025150, 1104821, 1041211, 1219310, 1252748, 1290031, 1130985, 918898, 1169954, 1354595, 1151861, 1169323, 1304013, 1507695, 1583114, 1465756, 1328088, 1103517, 1187540, 1209909, 1404113, 1138574, 1454284, 1238213, 1062291, 1078007, 1333997, 1366063, 1832359, 1256033, 1347410, 1716922, 1811341, 1178421, 1565888, 1431012, 1582016, 1741326, 1887659, 1872074, 1767056, 1946520, 1697318, 1618251, 1813660, 1726438, 1838842, 1771203, 2034115, 1968790, 1933619, 1769775, 2000757, 2355650, 1836160, 1819140, 2050547, 2042802, 1976181, 2317189, 2102220, 2379096, 2088890, 2286055, 2304490, 1928686, 2299083, 2522692]
16868B522692j22412m2399j33539k00368J54620M01840J07663k08762j67259O85508
16858B997584l82713j6067J00948R6046J64506m8562N9439J71349j16633L18149
16848C344046m59618O01104j07838o1105l6571K21011J23313m09678N22178j3188
16838C723654n818j42449j31858M95939j7738K65814k12282Q8350Q0338p901K4837
16827D160886J14589J55096J66808O5109K17979k02998J86286P9505Q1922l03268
16817D721914L46345K92780K14887J48282J85185j09911k34138N46940P2471R6766
16807F281521m8120M85573j8273J43459K3615Q8478L71370M60190j33044L7164
16797G691933N45944L16070m11626M73190J19156P11581m0881J31510J8209M05238
$$ y = [2522692, 2400280, 2357881, 2224342, 2023974, 2178594, 2580434, 2688097, 2479335, 2312076, 2997584, 2614871, 2598804, 2699752, 2795798, 2960304, 2911742, 2971181, 3142530, 3025897, 3344046, 2884428, 3485532, 3377694, 3316589, 3280018, 3501029, 3624342, 3214664, 3736842, 3723654, 3717836, 3575387, 3443529, 3939468, 3921730, 4187544, 3975262, 4063612, 4143950, 4136049, 4160886, 4275475, 4430571, 4597379, 4662488, 4880467, 4677469, 4863755, 4943260, 5025182, 4721914, 5068259, 5361039, 5575926, 5724208, 5909393, 5799482, 5565344, 6112284, 6184755, 6281521, 6233401, 6718974, 6700701, 6844160, 6867775, 6956253, 7327623, 7787813, 7654769, 7691933, 8237877, 8553947, 8142321, 8615511, 8734667, 9446248, 9405367, 9536877, 9555086, 9960324]
16787I960324J40849L87574K73717Q5488O85000N39308k45886L41158M69292N81992
16777A3218816P665K71545R06349M74133J66325N71899P33694K80681M26166Q43050
16767A7900323N44158P67461J86897J118898O87715P75787Q93976J183572Q54061
16758B4912848J029620J051278J066277Q80086J618444J341685J680335J107353
16750C4687926J784791K084488J550782J826860K363994K056467K419059K831082
16742E1605449K571572K898045L549568K784317L860117L922978M480426M366417
16734H0038889M516584N606201N363618N496255O068127O359230O581427O655622
16726A26685953O989307O800192P111056O499402O090176N842691M584851L810570
$$ y = [9960324, 10101173, 10488747, 10762464, 10847952, 11532952, 12072260, 11826374, 12167532, 12636824, 13218816, 13226481, 13498026, 14404375, 14878508, 15044833, 15616732, 16350426, 16631107, 17057273, 17900323, 18444481, 19211942, 19398839, 20517737, 21205452, 21981239, 22875215, 24058787, 24912848, 25942468, 26993746, 28060023, 28940109, 30558553, 31900238, 33580573, 34687926, 36472717, 38557205, 40107987, 41934847, 44298841, 46355308, 48774367, 51605449, 54177021, 57075066, 60624634, 63408951, 67269068, 71192046, 75672472, 80038889, 84555473, 90161674, 95525292, 101021547, 107089674, 113448904, 120030331, 126685953, 133675260, 140475452, 147586508, 154085910, 160176086, 166018777, 170603628, 174414198]
16718A74414198L589110J118934P86004q80574j977387l146800m328102n731325
16710A63844058n703349o318942p280866p411048o971273o702835p164572o925779
16702A09365394o431892o180734n831660n389526n800656m260361m465082m316937
16694F6688546m167999k989991l796862l084015k920694k542875k600038k261135
16686D2324937k176776k270954j234385k280419j325545j823782j765909j052152
16678B8395015j039701j538680r18712j150994r99750q81468p88887j064020r80238
16669A9032565o52760o28114n48682o24633p89433j26027r21459o91581k00046
16660A3849830n09625j13223m51994p29170J99895o68196n1764r74453k62082
$$ y = [174414198, 178003308, 179122242, 179908246, 179027672, 177050285, 173903485, 169575383, 163844058, 158140709, 151821767, 144540901, 137129853, 130158580, 123455745, 116291173, 109365394, 102933502, 96752768, 90921108, 85531582, 79730926, 75470565, 71005483, 66688546, 62520547, 59530556, 55733694, 52649679, 49728985, 47186110, 44586072, 42324937, 40148161, 37877207, 36642822, 34362403, 33036858, 31213076, 29447167, 28395015, 27355314, 25816634, 24897922, 23746928, 22747178, 21865710, 21076823, 20012803, 19032565, 18379805, 17751691, 17203009, 16578376, 15788943, 15662916, 14741457, 14049876, 13849830, 13340205, 13226982, 12774988, 12045818, 12245713, 11577517, 11525753, 10551300, 10289218]
16651A0289218r3920o82497K40241n84798n72133J10578l54039j01891K8431o79551
16641G599639j23299k14735k41786j15204P414l43719L0696l72555l09817r7043
16631E819591l3021k33054N1333k57247j53262k46659M38864p19199M20970k41010
16621D847306j98776M16455n75444j30453k13304K09113k2604p10506K93364r6382
16611C818769j43816J89644k45459k10600K4802J26239P5163p31231L75693j18867
16601C160337j8270Q0560l61662K81240o5740n1420n10034K44190J19382l77182
16591B501401P9253n3109l0233J9377o2508k3765J16421k02777j74575l72J11680
16580B280793J79984l21220j58296L08180k1464j98359q1168P9394J19262l40775
$$ y = [10289218, 10195298, 9512801, 9753042, 9168244, 8596111, 8706689, 8352650, 8250759, 8279190, 7599639, 7476340, 7261605, 7019819, 6904615, 6912029, 6568310, 6599006, 6226451, 5916634, 5819591, 5786570, 5553516, 5604849, 5347602, 5194340, 4947681, 5386545, 4667346, 5088316, 4847306, 4648530, 5064985, 4489541, 4359088, 4145784, 4354897, 4332293, 3621787, 3915151, 3818769, 3674953, 3864597, 3619138, 3408538, 3433340, 3559579, 3634742, 2903511, 3279204, 3160337, 3142067, 3222627, 2860965, 3142205, 3076465, 3025045, 2515011, 2759201, 2878583, 2501401, 2580654, 2527545, 2497312, 2516689, 2454181, 2430416, 2546837, 2344060, 2169485, 2169113, 2280793, 2460777, 2139557, 1981261, 2289441, 2267977, 2069618, 1988450, 2067844, 2187106, 1846331]
16570A846331M04163l47201k25262J29665n4810K5254j03089q4028K85744l46087
16560A530680O0792Q9415k46312K30825m2011q8140k87456L67944k15463j48313
16550A251961j91302L16970P3432j60285K46493j43548M0243n5223l2529J48118
16540A494330j55420R3862P3309l38392Q471M8694P401k3649O7195k25964L85155
16529A434992k50683j87104K4427J43872J6094N8491K26011m97835J18051k48773
16519H37543J18877k3088K64420j16129J0963k51962m0237J02695q5423k08162
16509F09497K86941O7404j20740p0769N1381J84631l45891J29230n4526n6552
16499F80606M15550k47303j46370J3579L12823J34777n14356L40909j3807k41752
$$ y = [1846331, 2250494, 1903293, 1678031, 1807696, 1752886, 1778140, 1675051, 1591023, 1876767, 1530680, 1591472, 1680887, 1434575, 1665400, 1623389, 1535249, 1247793, 1615737, 1400274, 1251961, 1060659, 1377629, 1451061, 1290776, 1537269, 1393721, 1433964, 1378741, 1346212, 1494330, 1338910, 1432772, 1506081, 1167689, 1176160, 1224854, 1232255, 1208606, 1275801, 1049837, 1434992, 1184309, 997205, 1021632, 1165504, 1181598, 1240089, 1466100, 968265, 1086316, 837543, 956420, 933332, 1197752, 1081623, 1092586, 840624, 800387, 903082, 817659, 609497, 896438, 963842, 843102, 772333, 823714, 1008345, 662454, 791684, 737158, 680606, 1096156, 848853, 702483, 716062, 1028885, 1163662, 649306, 990215, 976408, 734656]
16489G34656j2611o7014J00753P7344l72838R0709N790J80357k13214M9485j19098
16478D54319K34355C01369N10755k26889Q6839n7805j52917K03402B85247K4026
16468C09273J63214n089J19255O314j35232K62611n5124j10498k00171j7792M46955
16457G83716B55999K01311R8306J58171k26131K36063B97624L39388J04006j78197
16447E62821j04220N9567A21662L96624q6998A98347L29098A97054J87938L30456
16437G15448k50251j05395J76717J00553J18852k73434K0121k19859J26336L7344
16427D46432J87811p3382M7045A13851K39980J86979p5508A94501j9149L15761
16417D91113n3407J96673k00062o2105L0677J934J27414G4959K28778K22067b6728
$$ y = [734656, 722045, 655031, 755784, 833128, 460290, 550999, 556789, 737146, 523932, 573417, 454319, 688674, 301369, 812124, 585235, 672074, 614269, 461352, 664754, 285247, 309273, 472487, 467398, 586653, 592967, 457735, 720346, 665222, 554724, 354553, 336761, 783716, 255999, 457310, 555616, 713787, 487656, 723719, 297624, 637012, 741018, 562821, 458601, 518168, 121662, 518286, 431288, 198347, 527445, 197054, 384992, 715448, 465197, 359802, 536519, 637072, 755924, 482490, 502611, 282752, 409088, 446432, 634243, 560861, 607906, 113851, 353831, 540810, 465302, 194501, 175352, 491113, 437706, 634379, 434317, 372212, 402889, 404823, 532237, 74959, 303737, 525804, -26728]
16405E27658J52999E5209L09577K7879n1997J52694A09958N67318k83573A62817
16394D81826q9922R0151A90663O4198L84987l12211J41708J64771A18247N5318
16384A73565m4558J55090n7189J89841J14732e616j93955B80097J26214j76390
16374B29921A0265N9904J82244J23918K87118B50732J31749K6234K3099m1822
16364C89992A51913K84908G2509J74111O5742L2178j31818J63971L8786A67170
16353A23909E7400J61572l8167p181l9575L2968O8425M5857L4910j29588j0580
16342A76041J82198j36907p1121A0231K1866L83850j30448g4270C72792p9844
16332B92948c19281A16269L822M2308J09380e1674J8787D68234c3100o4755L6312
$$ y = [527658, 680657, 55209, 364786, 392665, 340668, 493362, 109958, 677276, 393703, 162817, 481826, 391904, 482055, 190663, 254861, 639848, 327637, 469345, 634116, 118247, 173565, 129007, 284097, 226908, 416749, 531481, -5616, -199571, 280097, 406311, 229921, 10265, 70169, 252413, 376331, 663449, 250732, 382481, 408715, 431814, 389992, 151913, 436821, 72509, 246620, 312362, 344540, 212722, 376693, 415479, 167170, 123909, 57400, 218972, 180805, 173624, 134049, 167017, 235442, 281299, 316209, 186621, 176041, 358239, 221332, 150211, 10231, 32097, 415947, 285499, -74270, 372792, 292948, -319281, 116269, 120091, 162399, 271779, -51674, -32887, 468234, -33100, -97855, -61543]
16321f1543j86767E3363J99977K0926q1585e0434F2148K07580J73783I4566K29608
16310C24174b5711C35829C16f5187G5007b0636B88886j22237K1992A4528L28194
16299C42722B765K48051Q8502F8781a4941A96767J89101A30065b07006A84538
16288C68629M6554H6453K97497E2592J1625J08548K74349A18594f0964j19824
16278a80788A29446r861d6497A54686k8198K8312D3026J32128k5774K1591F5461
16266B65573n9464H5774C4030b6433B25275h9261C7392b86651B23852j09694M6449
16255A60607a75851N1665k92299B21195j09403M0152l7404J92169E1579c5923
16244C17531A34618J93587A01806O0143a49799P2290h584l64907J72378B45373
$$ y = [-61543, -248310, 53363, 253340, 274266, 192681, -50434, 62148, 269728, 443511, 94566, 324174, -25711, 335829, 316, -65187, 75007, -20636, 288886, 166649, 188641, 14528, 342722, 2765, 250816, 339318, 68781, -14941, 196767, 385868, 130065, -207006, 184538, 368629, 415183, 86453, 383950, 52592, 64217, 172765, 447114, 118594, -60964, -180788, 129446, 119585, -46497, 154686, 126488, 154800, 43026, 175154, 149380, 170971, 65461, 265573, 206109, 85774, 34030, -26433, 225275, -89261, 37392, -286651, 223852, 114158, 160607, -175851, -124186, -416485, 221195, 111792, 151944, 114540, 306709, 51579, -35923, 317531, 134618, 328205, 101806, 161949, -149799, -77509, -8584, -373491, -201113, 245373]
16233e1103J6556C4414d7872J825H3227f658C34019j35865D2675b38298A73993
16221A65629A1023K89656b83258P7689G1298J38024c65518b3493C12484a87294
16210A65718K1981L0266n50C1433K2548J1912a56928A12942B0677M42784k13172
16199B50289a38563A45182N0697J38140b91156O6979A76693B091L83829A52657
16188A16951a7202A52404J56962d1835A36108a74086B73154c3376A05214K44433
16178C49647b3043A5479K49525i0964L2243K8786B32306q2837e4406j75539B1660
16166E5490a02885L383K6849j7501A91451B5404J14070e6312j03360j11248F0522
16154i1509j40788E1728P4140L2631n5935e9511B04421i675A97356P4346C1651
$$ y = [-51103, -34547, 34414, -47872, -46047, 83227, -6658, 334019, 198154, 42675, -238298, 173993, 165629, 11023, 300679, -283258, -205569, 71298, 209322, -365518, -23493, 312484, -187294, 165718, 187699, 217965, 217415, 31433, 53981, 65893, -156928, 112942, 20677, 463461, 250289, -138563, 145182, 195879, 334019, -291156, -224177, 176693, 2091, 385920, 152657, 116951, -17202, 152404, 309366, -41835, 136108, -174086, 273154, -33376, 105214, 349647, -23043, 15479, 265004, -90964, -58721, -29935, 232306, 149469, -54406, -229945, 21660, 55490, -102885, -99502, -72653, -90154, 191451, 25404, 139474, -56312, -159672, -270920, 60522, -91509, -232297, 51728, 125868, 158499, 102564, -59511, 204421, -9675, 197356, 271702, 31651]
16142b58772D03693e6187B0520K97226a87112H8679b65769f6192A22915J07519
16132B30434o0461a55075N3130C03595A8223e0410m8571M6538A18465b86937e9040
16120e542C22465C6903c7063j53727K8647C33415h4111A36630C0206P2948B3767
16108g8836O195j1615p1412m1135P5868A13901a17530C34072a98323B98746c17734
16096A53753K27265C221M8270Q6772K9197i6286q4343B45778P9250b43402A3368
16084h1836J5863j81573A56040a09851j39257b4386j48276B8660K27282C8032
16073B81824j25625j7499C7773J2127f407H3609k8044K5965M4624Q7410b30734
16061E3050a03856c2687k34565J23140M2118A44628K5786G0808f1822A94129k8299
$$ y = [-258772, 403693, -56187, 20520, 317746, -187112, 88679, -265769, -66192, 122915, 230434, 169973, -155075, -101945, 303595, 18223, -50410, -98981, -52443, 118465, -286937, -59040, -5542, 322465, 36903, -37063, -190790, -162143, 333415, -84111, 136630, 30206, 103154, 23767, -78836, -72641, -84256, -155668, -196803, -120935, 113901, -117530, 334072, -198323, 298746, -317734, 153753, 381018, 3221, 51491, 138263, 167460, -96286, -180629, 245778, 325028, -243402, 13368, -81836, -65973, -247546, 156040, -109851, -249108, -24386, -172662, 28660, 255942, 38032, 281824, 156199, 138700, 37773, 49900, -6407, 83609, 55565, 81530, 126154, 213564, -230734, 53050, -103856, -32687, -267252, -144112, -101994, 144628, 170414, 70808, -61822, 194129, 165830]
16050A65830c57302J49390F761J10587j7845f0857C88995G1303J79792l7136d8286
16038c451F1290a58963A10768K46366h1505B04916c10053N6390P7886d634j67891
16027a72525B71383A25457a43612l698A33011d7571m600j9400G1079b0241m2842
16016f3083B0867b43482a6631a396r2802B6580D761R5824a3758k07713J841F0701
16003a60044C4932K34809A12402j4121a01110c8043C41900h9079L3349k34561
15993b90291a35244O0559B49781a9253j07270N6327j36392c3084D5901K72036
15983C17937K00051a51323A46519n0899J23667b56256G7930J43486a19063I3063
15972h8889J759C06004A6662i2389C0420a64110B20877H4577o554i153j52210
$$ y = [165830, -357302, -207912, 6761, 117348, 99503, -60857, 388995, 71303, 251095, 213959, -48286, -3451, 61290, -158963, 110768, 357134, -81505, 204916, -310053, -253663, -175777, -4634, -172525, 271383, 125457, -143612, -147310, 133011, -47571, -52171, -71571, 71079, -20241, -63083, 20867, -243482, -16631, -1396, -94198, 26580, 4761, 100585, -13758, -221471, -219630, 60701, -160044, 34932, 269741, 112402, 98281, -101110, -38043, 341900, -89079, -55730, -290291, -135244, -74685, 249781, -19253, -126523, -70196, -206588, -33084, 45901, 317937, 517988, -151323, 146519, 95620, 219287, -256256, 77930, 221416, -119063, 93063, -88889, -87130, 306004, 16662, -92389, 30420, -164110, 220877, 84577, 78023, -9153, -161363]
15961a61363B56943b2172k52549Q1212N2096A43120a68197j03787L2807R076R7635
15950a32466k1354F5701b72472B38208e899k55987J27241H6026a17582A75049
15939A08302J96719a95539a3530j52664p1864A3345h7695j00836l4242B02687
15928A08933a0630j66369A47938E3700i991p127k8360j78747h8767h354C77092
15916B68985a53534p2155d049j22488A91133n7768o0082K503J46277a28413k09089
15905c37502E0697a5051p9887A12732L5200j8715a1914j77830C7133e8458B07714
15893C1441a92614D9214e150j59578K6917b452k54914B43284a27676A23304J07128
15882B30432a77975Q7131d3403B38924g5246j44511k26340I7357a25345B7118
$$ y = [-161363, 256943, -22172, -274721, -193509, -141413, 143120, -168197, -271984, -239177, -230101, -132466, -153820, 65701, -272472, 238208, -5899, -261886, -134645, 86026, -117582, 175049, 108302, 305021, -195539, -13530, -166194, -238058, 13345, -87695, -188531, -222773, 202687, 108933, -10630, -176999, 147938, 53700, -9991, -17118, -45478, -224225, -88767, -8354, 377092, 268985, -153534, -225689, -4049, -126537, 191133, 133365, 73283, 75786, 222063, -128413, -337502, 50697, -15051, -94938, 112732, 147932, 129217, -11914, -189744, 37133, -58458, 207714, 31441, -192614, 49214, -5150, -164728, -137811, -2452, -257366, 243284, -127676, 123304, 230432, -177975, -90844, -43403, 238924, -75246, -219757, -446097, 97357, -125345, 27118]
15871A31767K7309b47993B46028F4285c4692r0574F3040O6791O1162b18304d2332
15859A02437l5590b33096C63998b788G7162L6071i4279J2976j6871K1018j2841
15848h9997m8280I8451b9622k15905F6217b06587j61388a51824B05270E6836g3452
15836b95144F7430c48162a1225C3049d58932i5898o9654Q0795j9317d0309A11111
15824E1348J2542A8373b92688D3875a28533b3749j15270A687J29077a90909A69393
15812B4650a82827Q8315M5686k32112B30018p2242N0124p3127b86945B8549g6194
15800c207D5768a35404G8269a47568j935A65248F1418R9787p3853N0118c9073
15788F8673C1768a28146R167N5358B34966c54593B17059o0216J6845A001M5882
$$ y = [131767, 159076, -247993, 246028, 64285, -34692, -125266, 63040, 129831, 190993, -218304, -42332, 102437, 66847, -233096, 363998, -2788, 77162, 113233, -94279, -81303, -98174, -77156, -89997, -138277, 98451, -29622, -245527, 66217, -206587, -367975, -151824, 205270, 56836, -73452, -295144, 67430, -348162, -11225, 33049, -458932, -95898, -165552, -84757, -104074, -40309, 111111, 51348, 63890, 18373, -292688, 43875, -128533, -23749, -139019, 1687, 130764, -190909, 169393, 24650, -182827, -94512, -48826, -280938, 230018, 157776, 207900, 134773, -286945, 28549, -76194, -3207, 45768, -135404, 78269, -147568, -149503, 165248, 61418, 161205, 87352, 137470, -39073, 68673, 31768, -128146, -118979, -63621, 234966, -354593, 217059, 156843, 173688, 1001, 46883]
15777D6883c6445A61178a33337n6914P2758M0M3480j04329J0595c8660A51920
15765b17132F6142e2838k55752B13191b12014A45798b20298A99237D0840b26501
15754D5439P7349a17399r263A09502J9558N7120p571h9979A1700N0987a17256
15742C68559a24724G3463b51754D0969a24588N8021D5133b87450A02024a38772
15731b76308A81204b55978h0960C9020f0995C3387b13016A91591b04243p3359
15721b77602B29235l2750b37911M794R8533B0707a22029k51131A9082q051Q6762
15710I7793J438B346K08510P0555f8815j64157a009m2593D7630e8113C82806b2774
15697A42902J08203I9647d0003B59969p5785a97807B80794c7693A36757f1914
$$ y = [46883, -36445, 161178, -133337, -190251, -117493, -117453, -73973, -178302, -167707, -38660, 151920, -217132, 66142, -52838, -308590, 213191, -212014, 145798, -220298, 199237, 40840, -226501, 45439, 122788, -117399, -126662, 109502, 129060, 186180, 178609, -89979, 11700, 62687, -117256, 368559, -124724, 73463, -251754, 40969, -124588, -66567, 45133, -287450, 102024, -138772, -276308, 181204, -255978, -80960, 39020, -60995, 33387, -213016, 191591, -204243, -277602, 229235, 196485, -237911, -233117, -134584, 20707, -122029, -373160, 19082, 11031, 97793, 99231, 2346, 210856, 281411, -68815, -232972, -1009, -43602, 47630, -58113, 382806, -22774, 142902, 251105, 99647, -40003, 259969, 184184, -197807, 280794, -37693, 136757, -61914]
15686a3023j11215L0330j8846d7708k11597a05891n7559a312j86642a8034k12826
15675b30860A37801b6282l32358J41561i4089A0969N4088c89812D1825J57010
15665A98835d44192J32335j70334K14756R009O2050C24931b9140H7684R2481g3500
15653c5140B15624i5591J6191m34025b3035B50350l0536j07033J01174i1826J0155
15642h1671A53271G3902J25436N311G0226R7803f1528r2967a1223C01484H0752
15630A25455a93331g1126k8090C124a85539A14602h3496c1929C250R8556Q2064
15619A83870o6712B1102J96973c083A46318k418e7783p1646l19396a88989J5503
15608a73486C77183A33834a33363o3106q3332I5686l3026c2906m32229A65264
$$ y = [-13023, -124238, -93908, -112754, -47708, -259305, -105891, -163450, -1312, -187954, -18034, -230860, 137801, -26282, -358640, -217079, -94089, 10969, 65057, -389812, 41825, 198835, -444192, -311857, -482191, -267435, -258426, -196376, 324931, -29140, 87684, 180165, -73500, -35140, 215624, -95591, -79400, -513425, -23035, 250350, 219814, 112781, 213955, -91826, -81671, 153271, 73902, 199338, 204649, 70226, 168029, -61528, -154495, -11223, 301484, 80752, 125455, -193331, -71126, -99216, 3124, -185539, 114602, -83496, -31929, 3250, 101806, 183870, 117158, 21102, 218075, -3083, 146318, 143900, -57783, -129429, -448825, -188989, -173486, 377183, 133834, -133363, -196469, -279801, 95686, 62660, -32906, -465135, 165264]
15597e6483k17569B34368a78033H243d87172g2786A33286B1583a4539k51766a13169
15585I7144J6396a87646C48891A15745R709R0760g9076A27727e9620B72547n0257
15574B22290b51099E1612Q1932k8205A7347L33528a89585B61066m5424b53273
15563C6460i85D5254b56368A84576a892j67787B46924J7278b06j41958k47915
15552c90079J46469d290p7305j50300D4444d589A4663K88621a0109l3681G7247
15540H4733e2297G6561K9985K84779i7176p682F100a41360D11403a26480j11430
15529b37910O8734A61534a294j05006A85862A4663J97599a28079j80083H2949
15518A79604A6917e729k9496A1902b68304j64447D6966J28882b58283f4155A25014
$$ y = [-56483, -274052, 234368, -178033, 8243, -487172, -72786, 133286, 21583, -14539, -266305, -113169, 97144, 113540, -187646, 348891, 115745, 125454, 216214, -79076, 127727, -59620, 272547, 222290, -251099, 51612, 133544, 105339, 17347, 350875, -189585, 261066, 215642, -253273, 36460, -985, 45254, -256368, 184576, -1892, -169679, 246924, 264202, -206, -142164, -390079, -243610, -4290, -81595, -231895, 44444, -4589, 14663, 303284, -10109, -43790, 77247, 84733, -52297, 76561, 106546, 391325, -97176, -104858, 6100, -141360, 411403, -126480, -237910, -169176, 161534, -1294, -106300, 185862, 14663, 212262, -128079, -308162, 82949, 179604, 16917, -5729, -35225, 11902, -268304, -432751, 46966, 175848, -258283, -64155, 125014]
15506d511E0685c62779A78608b4517j7389o8840q0737A10103a97008o3539B44797
15494a03464B57018a9632A32531d0780n9417j89614A30724J8102a33264G0878
15483B21550a90079B65512A13346b058r0794H9014C9962h329m1959A94924a85988
15471c03757f529o9443j54337Q3000L7731k63514F3223b71589M1263D494L63678
15460C68172f601I2744C6780a36231k41738A49675p0496a92846C5710g8877l8600
15449a17477I0537e7560A16018n6585b88981C7721d50669a78998h8221F6562g018
15437B75094A07491a25726A99488q9809g2118k00273F8444b19819A30455l8309
15427I2146J6054P4068b17457I9114a16941J4698K8459B13184A01998a03762I5268
$$ y = [-4511, 50685, -362779, 178608, -24517, -41906, -110746, -191483, 110103, -197008, -260547, 244797, -103464, 257018, -19632, 132531, -40780, -100197, -289811, 130724, 148826, -133264, 70878, 221550, -190079, 265512, 113346, -2058, -92852, 89014, 39962, -8329, -50288, 194924, -185988, -303757, -6529, -75972, -230309, -147309, -109578, -373092, 63223, -271589, -230326, 4494, 368172, -6601, 92744, 36780, -136231, -377969, 149675, 79179, -192846, 35710, -78877, -117477, 90537, -57560, 116018, 59433, -288981, 37721, -450669, -178998, -88221, 66562, -7018, 275094, 107491, -125726, 199488, 109679, -72118, -272391, 68444, -219819, 130455, 92146, 108200, 182268, -217457, 99114, -116941, -102243, -73784, 213184, 101998, -103762, 95268]
15415A3350d3801j71780D2981d025D0798O4061f1170I9226Q1615b41923A74842
15403e2175k6504F8070J7398b10798M0930C89762a74932j12811g1622B0252c42748
15391A17604j1195j2219a31421o5835j39362B47931c41858A30110b21570d26C30942
15379C2917K26798a5737d033j75674j04887A14682k2810c74556d2955l0530H210
15367c18887a36376k183A13820b8040C39558I8316M8729J27992I3579c6709A61718
15355b34134R7877H7874R5425K8140i6511p8j13940C28095A57692a21097C96239
15343b96424g9049G5217f5640m5120c5528D6583b11374j7829d0423j07463A3018
15331B861g6563b1982k2344A04722K2626a28217A94008b88551H9683a64889g5976
$$ y = [13350, -43801, -215581, 42981, -4025, 40798, 104859, -61170, 99226, 180841, -241923, 174842, -52175, -78679, 68070, 85468, -210798, -169868, 389762, -174932, -287743, -71622, 20252, -342748, 117604, 106409, 94190, -131421, -197256, -336618, 247931, -341858, 130110, -221570, -426, 330942, 32917, 259715, -15737, -4033, -179707, -284594, 114682, 91872, -374556, -42955, -73485, 8210, -318887, -136376, -138559, 113820, -28040, 339558, 98316, 147045, 275037, 93579, -36709, 161718, -234134, -136257, 87874, 183299, 211439, -96511, -96589, -210529, 328095, 157692, -121097, 396239, -296424, -79049, 75217, -65640, -110760, -35528, 46583, -211374, -229203, -40423, -147886, 13018, 2861, -76563, -21982, -44326, 104722, 127348, -128217, 194008, -288551, 89683, -164889, -75976]
15319A4388h7793a7546A35191b02342b9664j13763A54251b55521a9192A37557
15308i6947A86994p9225a03587B90366F5042a8047A16680c6251B23620E0901d5401
15296a80877A56384D6643A4261J5263j4680c7261B49722C2012Q3684a27923A47632
15284A87763g3831I0115J853j2601k0245e9322D7897K3207a11100I37a34295G2962
15271A60710C7559L09973B1088B902K94419r7951M4795j00113b89221A58781E6260
15259b4760B76575j30366h2171p2063A38489a07893C152J28960L13165j05143
15249C40134K56706P21023j60693m4432J2061E39333p9029H5236f4206G1986J45363
15238B17349k7971G2715R5216d0545J9791A65397J39661b840j52754A70892a63167
$$ y = [14388, -87793, -17546, 135191, -202342, -29664, -143427, 154251, -255521, -19192, 137557, -96947, 186994, 107769, -103587, 290366, 65042, -18047, 116680, -36251, 223620, 50901, -45401, -180877, 156384, 46643, 14261, 29524, 14844, -37261, 249722, 32012, 115696, -127923, 147632, 187763, -73831, 90115, 91968, 79367, 59122, -59322, 47897, 71104, -111100, 937, -134295, 72962, 160710, 37559, 347532, 21088, 2902, 297321, 199370, 244165, 144052, -289221, 158781, 56260, -24760, 276575, 146209, -82171, -154234, 138489, -107893, 3152, 132112, 445277, 340134, 596840, 1317863, 1157170, 1112738, 1124799, 539333, 460304, 85236, -64206, 71986, 217349, 189378, 72715, 167931, -40545, -20754, 165397, 305058, -2840, -155594, 170892, -163167]
15226a22392l038d6893B55679b9988j16152r8644D5542A2989L3699b46722c034
15214b24065A52849A4208a31892A73894i0143B20690f1223G2100c63748C15129
15203B19378a00972B16105b063C35969C3550c8143l99077H1011c03329i8027M8649
15192d9378A80265n7670L5638a97463A26210m5952a01510M2380D36820A32357
15181b69215C17130g6568F3277J73642p4919K26629a41740K5770n5596q5534A33450
15169b74015A2058R7950f9901B35553E6537E242a36059j45716B94269A14237I355
15157a86393J4776B21495K21856B5345A332P3616J67378A19792P1498a421A54107
15145a75555E59748A20394J12637b09148A75805a30194e8680A50622c4464p9944
$$ y = [-122392, -125430, -46893, 255679, -29988, -146140, -244784, 45542, 12989, 46688, -246722, -3034, -224065, 152849, 14208, -131892, 173894, -90143, 220690, -61223, 72100, -363748, 315129, 219378, -100972, 216105, -2063, 335969, 33550, -38143, -437220, 81011, -303329, -98027, -49378, 180265, 122595, 158233, -197463, 126210, 80258, -101510, -59130, 436820, 132357, -269215, 317130, -76568, 63277, 236919, 162000, 388629, -141740, -115970, -171566, -257100, 133450, -274015, 12058, 110008, -69901, 235553, 56537, 5242, -136059, -281775, 294269, 114237, 9355, -186393, -171617, 221495, 443351, 25345, 1332, 74948, 242326, 119792, 191290, -1421, 154107, -175555, 559748, 120394, 233031, -209148, 175805, -130194, -58680, 150622, -34464, -114408]
15135a14408b8141q2223k162A22759b32588E3709M30517A42083e1629q1519A55937
15123B60097n1891e9704A08352g0970A29703N367o345k9073L20655I8592K72541
15112C71133B4251a9592j62352C25103a08821D21644j17512j08893f1107A7725
15101D1707M11627A70258a6025n9291n91k2387B36317I1464R8013b33250a09544
15089A22658a19957a7878k04062B13427a8349E02049b1460A47148e8150n9517
15079a17667c0178F4533c43271A20125J62024J89515B12507b8431j60015A50898
15068A08798J6821f9220B66530J3927F7290l392E501J19913J35261j04804J57585
15057C13456a43475a8765D55118j21505A16426h846B83520B9212i75B42725q0114
$$ y = [-114408, -28141, -110364, -112526, 122759, -232588, 53709, 484226, 142083, -51629, -133148, 155937, 260097, 208206, -59704, 108352, -70970, 129703, 135070, 128725, 99652, 420307, 98592, 371133, 24251, -19592, -181944, 325103, -108821, 421644, 304132, 195239, -61107, 17725, 41707, 453334, 170258, -16025, -75316, -75907, -98294, 236317, 91464, 189477, -233250, -109544, 122658, -119957, -17878, -221940, 213427, -18349, 502049, -21460, 147148, -58150, -117667, -30178, 64533, -343271, 120125, 282149, 471664, 212507, -28431, -188446, 150898, 108798, 125619, -69220, 266530, 280457, 67290, 63898, 5501, 125414, 260675, 155871, 313456, -143475, -18765, 455118, 333613, 116426, -8846, 283520, 29212, -975, 242725, 162611]
15046A62611J89801L3279G1821i5948D12803Q1052A97335a03735A06402r974d5132
15034B44512g750A72330p8254O6601n9584q68j0052K68137j22907j00489K66898
15023D01812A83213Q9920j35704P733n877K78983A3739P4804a39262A59496J66513
15012C26009G5974R9455G629R1948J95930m142j18821L85403A14647d9156G7657
15000B79181J48848q4397e096j14417E38252j88682j52680b0940C99446D4654
14989C74254b2094E00958G0475b35779g9756D2738P6208K72029j03760A33567
14978C54595a00660A13912K41576j44711b0996M890A1513J90247Q4491a09205
14967A97350d320C14930J64033F8665J66711h8760A66353L3527J77506J23142
$$ y = [162611, 352412, 385691, 71821, -95948, 412803, 493855, 197335, -103735, 106402, 96428, -45132, 244512, -7750, 172330, 94076, 160677, 101093, 100225, 90173, 358310, 235403, 134914, 401812, 183213, 273133, 137429, 145162, 139285, 418268, 13739, 88543, -139262, 159496, 326009, 75974, 175429, 7629, 99577, 295507, 291365, 172544, 557947, 114647, -49156, 77657, 279181, 428029, 343632, -5096, -119513, 538252, 349570, 196890, -20940, 399446, 44654, 374254, -22094, 500958, 70475, -235779, -79756, 42738, 118946, 390975, 287215, 133567, 354595, -100660, 113912, 355488, 210777, -20996, -16106, 11513, 201760, 286251, -109205, 197350, -4320, 314930, 478963, 68665, 235376, -88760, 166353, 199880, 377386, 500528]
14957E00528A65343gB14793K7599H7573J3703M25785B47189l3472J17488l0959
14946C00246E5022O3621L0353J35367l8903a51628E14916A16565N03200B13402
14935B39075J7231l9938a3686B56402J8800r2742K46805A72979K07267A8764a9002
14923A05149K77095o9850k6470A05045L18898D4806L96990j3648A18747K76922
14913C95669E9198j1365R1251P551E4490J93069K09232j31549H3194K12205j172
14902B94227o9376A0805j99J06890K46134j20448K01127j39819L912A07211K69909
14891C77120q2354l1723L2031O0309I6287J60812n2456L36006F1383L27381A72804
14879D98010O5099k67858H6467J97309q9554D6545O81363k80114A14407P6291
$$ y = [500528, 165343, -7, 214793, 242392, 87573, 101276, 527061, 247189, 213717, 331205, 300246, 55022, 118643, 148996, 284363, 245460, -151628, 514916, 116565, 619765, 213402, 239075, 256306, 216368, -13686, 256402, 275202, 182460, 429265, 172979, 380246, 18764, -19002, 105149, 382244, 312394, 285924, 105045, 423943, 44806, 441796, 428148, 118747, 395669, 59198, 47833, 139084, 146635, 54490, 247559, 456791, 325242, 83194, 295399, 294227, 224851, 10805, 10606, 117496, 363630, 243182, 444309, 304490, 308402, 107211, 377120, 294766, 263043, 295074, 355383, 96287, 257099, 204643, 540649, 61383, 388764, 172804, 498010, 563109, 295251, 86467, 283776, 194222, 46545, 727908, 447794, 114407, 190698]
14869A90698M48579k86793J15318P2081B20258j03347Q2652D6528L11840l4991
14859C23377P8698r1856A38363l3849J23093L15848j80614m2512K15506B7929
14848B16077L31588k8924j31248R6054B01809K72631M4183r9600n7460E6142M64717
14837E20859l3708k42501J83888q1434o6592r0060K00786J02256j25020A77399
14826C53792m3567R8409j78787J48602j31042K68471J21168B66939K85610j16301
14816D36248j60984J28775O3601J05914O8024m3150O9325k4511B5004L12075K07941
14805E45020k16020K47165B10634M15881m4210j4475l6918K60059l91097k5861
14795C74013J15525J19041p1524J43834k98396l7255K10881b837A01397L53964
$$ y = [190698, 639277, 352484, 467802, 539883, 220258, 116911, 199563, 46528, 358368, 323377, 402075, 310219, 138363, 104514, 227607, 543455, 362841, 320329, 535835, 27929, 216077, 547665, 518741, 387493, 483547, 201809, 474440, 518623, 419023, 361563, 56142, 520859, 487151, 244650, 428538, 347104, 280512, 190452, 391238, 493494, 368474, 177399, 353792, 310225, 408634, 229847, 378449, 247407, 515878, 637046, 266939, 552549, 436248, 275264, 404039, 467640, 573554, 641578, 598428, 667753, 643242, 25004, 337079, 545020, 329000, 576165, 210634, 626515, 582305, 567830, 530912, 790971, 399874, 374013, 489538, 608579, 537055, 680889, 382493, 345238, 556119, -2837, 101397, 455361]
14785D55361K72642k84998A59559N77436A35647N16167q2422k43565K0180L54056
14775G00063B42483K92663K57485B46810J91253J41337l4253j24246J9053J8802
14765D58756K56441j34848j43178o3576J71796j89555N8022Q5814k9606K25240
14755F95306B87418J80668L02236l22002j26184M1950L00308j09635A40127L03125
14745D43252O1544r0520J93632J15900l7699n5448j02492J22118q0050k0306P6811
14734F26742k44945K9928p2854K43925B55656J2962O2237K1396k2231L01743K2848
14723F54611M1148m3021J20808j3296k48076K35187r5664j30683K60039O0320
14713H41373j45245n8217o8324k0065K12495j70805M4003j43827M8459J14926
$$ y = [455361, 728003, 443005, 159559, 736995, 135647, 651814, 569392, 325827, 346007, 700063, 242483, 535146, 792631, 246810, 438063, 579400, 545147, 420901, 439954, 458756, 715197, 580349, 437171, 373595, 545391, 355836, 413858, 499672, 470066, 695306, 287418, 468086, 770322, 448320, 322136, 364086, 664394, 554759, 140127, 443252, 504796, 414276, 607908, 723808, 686109, 630661, 528169, 650287, 570237, 549931, 626742, 381797, 411725, 338871, 582796, 255656, 268618, 330855, 352251, 330020, 631763, 654611, 695759, 652738, 773546, 760250, 512174, 747361, 651697, 521014, 781053, 841373, 696128, 637911, 569587, 549522, 762017, 591212, 635215, 491388, 539847, 654773]
14703F54773K82428k37260K48942m61866J40804j01207M32715k13696k48599O07434
14693A104468l47435q5626J69525J21539k05998K00685m75547N3531K99253J76022
14683A010417N99k37756j08794j07803M88974l53827J45892j97733j28597O14728
14673A126100k97973Q5629J99193n3004Q2249l90493N9936q5246M38339m33863
14663G30867K78682m13279L62398j46403N5667n9696Q6717L01881q0950K9535
14653A145419m32813L86410r6547J4554j23603L15973l31365J46485Q9582k17003
14643H97092J66465j53022J48537l14122J86071K60602k16249L30692k48938K57616
14633A314744j20258m52386M19444Q8419Q1608J22816l41987J76543p6246N9709
$$ y = [654773, 937201, 699941, 948883, 487017, 627821, 526614, 959329, 745633, 497034, 1104468, 757033, 671407, 840932, 962471, 756473, 957158, 481611, 535142, 834395, 1010417, 1011016, 773260, 664466, 556663, 1045637, 691810, 837702, 639969, 511372, 1126100, 828127, 913756, 1112949, 1059945, 1142194, 751701, 811637, 726391, 1164730, 730867, 1009549, 596270, 958668, 812265, 867932, 808236, 894953, 1196834, 1115884, 1145419, 712606, 1099016, 1002469, 1017023, 893420, 1209393, 878028, 1024513, 1114095, 897092, 1063557, 910535, 1059072, 744950, 931021, 1191623, 975374, 1306066, 1057128, 1314744, 1194486, 742100, 1161544, 1249963, 1331571, 1454387, 1112400, 1288943, 1212697, 1272406]
14623A272406j02362J49465k489l24868K69972p8335Q0227j71629j32766K54170
14613A213791J94876j02772J705L8369j49884M8263J07476K94225j32115M8385
14603A562319k15607J5777O1291j166j29869P0290M1104q138M6800m993j5355
14592A422453n477l7318L44071k88391M6417j38913M03475o5105n0273j00330
14582A530609K71630l28166K07766j75470J01389K24436k65612L93586n28474
14573A431694N79001j04096N964J82434L65734l60818J53700k17300n6468P5093
14563B054938J91307Q0493k8795m04240P54346K60040j96277k73396O63108K26470
14553C327994k6305L07486O74825P13376K555915M389182P114937J5774166O685927
$$ y = [1272406, 1170044, 1319509, 1317020, 992152, 1262124, 1183789, 1264016, 1092387, 959621, 1213791, 1408667, 1305895, 1307600, 1345969, 1196085, 1244348, 1351824, 1646049, 1513934, 1562319, 1346712, 1362489, 1423780, 1422614, 1292745, 1363035, 1404139, 1396001, 1442801, 1437808, 1422453, 1416976, 1379658, 1723729, 1435338, 1481755, 1342842, 1746317, 1681212, 1630939, 1530609, 1802239, 1474073, 1681839, 1506369, 1607758, 1832194, 1566582, 1960168, 1431694, 2010695, 1906599, 1912563, 2094997, 2460731, 2099913, 2253613, 2036313, 1979845, 2054938, 2246245, 2326738, 2297943, 1893703, 2648049, 2908089, 2711812, 2438416, 3101524, 3327994, 3301689, 3609175, 4284000, 4997376, 7553291, 11942473, 19057410, 34831576, 41517503]
14544D1517503A7692363G231314l215056j405122o22280K6608k42750k67337L41702
14535A847079k80567J76124K33707l0582j14033M3726K3395L8445R5542J54048
14525B186884l95199L76950r7535K63398k64130P4654r775J98743L6407o7027
14515B303370L11745K68179k28546O2415p9516l46985k97559O36018O0963l85308
14505B304776K45500M0172r2004L33057j75877N7076k549M34897m32449L12489
14495C025088l26270r4538N84377q9907K48286n14977J18810J75839l180M25156
14485C548684k29911N8279k0276K72351l89134n1029K67509J29853K07935m69325
14475C324936L69151L31314m92676J07933o185j26958M93489J90570J51m8099
$$ y = [41517503, 17692363, 7231314, 4016258, 2611136, 1988856, 2015464, 1772714, 1505377, 1847079, 1566512, 1742636, 1976343, 1945761, 1831728, 1875454, 1898849, 1937294, 2032836, 2186884, 1791685, 2168635, 2071100, 2334498, 2070368, 2145022, 2135247, 2333990, 2370397, 2303370, 2615115, 2883294, 2654748, 2717163, 2637647, 2290662, 1993103, 2629121, 2690084, 2304776, 2550276, 2590448, 2498444, 2831501, 2655624, 2712700, 2710151, 3145048, 2712599, 3025088, 2698818, 2604280, 3188657, 3098750, 3347036, 2832059, 2950869, 3126708, 3123528, 3548684, 3318773, 3377052, 3356776, 3629127, 3239993, 3188964, 3456473, 3586326, 3794261, 3324936, 3694087, 4025401, 3532725, 3640658, 3634473, 3507515, 4001004, 4191574, 4191725, 4143626]
14465D143626k34419L40165K12869j73836J05309l0808j12634K17778R8973k16300
14455D350723L88268M6180o8948J07645m7890J66283j29296n8165K26625l15566
14445D665859K27160J83457K64449O782o5463J56114K4176L39399p7491k32676
14435E491766M33717j75733J0227J22298N8251K32642J97409n41224P45258k62644
14425F311967O47509Q8347l09872L2901L63093m9619J38348k51399L76783J64571
14415G512629K82733k27419K18666K79604l93J35858J32362j71874N88102J30021
14405H880289j14609q1942K66951J79276J99055Q3029N17617p5588J78K34134
14395A0088390J54188M04980k40422M94721J92750J06648n1044L66364M24531
$$ y = [4143626, 3909207, 4249372, 4462241, 4288405, 4393714, 4362906, 4250272, 4468050, 4567023, 4350723, 4738991, 4785171, 4716223, 4823868, 4775978, 4942261, 4812965, 4754800, 4981425, 4665859, 4893019, 5076476, 5340925, 5347707, 5282244, 5438358, 5462534, 5801933, 5724442, 5491766, 5925483, 5749750, 5759977, 5882275, 5940526, 6173168, 6370577, 5829353, 6574611, 6311967, 6959476, 7047823, 6737951, 6770852, 7133945, 7084326, 7222674, 6971275, 7348058, 7512629, 7795362, 7567943, 7786609, 8066213, 8065820, 8201678, 8334040, 8162166, 8750268, 8880289, 8765680, 8683738, 8950689, 9129965, 9329020, 9412049, 9929666, 9854078, 9854256, 10088390, 10242578, 10647558, 10407136, 10901857, 11094607, 11201255, 11150211, 11516575, 11941106]
14386A1941106p397N76894l3266N26734l73326O05420j27613N03734L69675J08802
14376A4090763J46399M52518K16366L23310K07117M71976M63073k79946O61367
14367A6752943K79356O02768O8914q584J092099j37973O88064n3370J071246J57170
14357B0512633N37018O49494J09320P88028M17849O15344N02340M23929Q06985
14348B5362940O25731O40376N83524N48244P95299N68380P84787Q85637P66523
14339C1561441Q82852J143567P11602J160641Q33917R11173J261754J140688J194349
14330D0801984J391774J371257R65290J486219J740648J536319J671858J618181
14322E2583530J645197J991516J651077J928521K561460K143587K266774K844202
$$ y = [11941106, 11933709, 12510603, 12477337, 13004071, 12630745, 13236165, 13108552, 13612286, 13981961, 14090763, 14237162, 14689680, 14906046, 15229356, 15436473, 15908449, 16371522, 16091576, 16752943, 17032299, 17635067, 17703981, 17695397, 18787496, 18649523, 19337587, 19284217, 20355463, 20512633, 21049651, 21699145, 21808465, 22596493, 23014342, 23629686, 24132026, 24555955, 25362940, 25988671, 26629047, 27212571, 27760815, 28556114, 29124494, 29909281, 30794918, 31561441, 32444293, 33587860, 34299462, 35460103, 36294020, 37205193, 38466947, 39607635, 40801984, 42193758, 43565015, 44530305, 46016524, 47757172, 49293491, 50965349, 52583530, 54228727, 56220243, 57871320, 59799841, 62361301, 64504888, 66771662, 69615864]
14314F9615864K534332K501261L811909K760348L613065L820194L807345L599288
14306I6063606M291144M300651M927317N225386N515990N204806N978192O735267
14298A38242359O657838O947487P533488Q620010Q385750R199742J0069981J0091545
14290B05748200J1190326J1453063J2094995J3139498J3827845J3900886J4641771
14283B95996584J4998049J5809757J5672085J6294440J6600225J5639243J5889355
14276D06899738J4268504J3584494J1296934M409801M54245J590502L532392L50164
14268D56386774l181152m451147q045580j0963338j2588606j4410086j5555915
14261C87190950j6102744j6921589j6974302j6863473j7203779j6430508j4629591
$$ y = [69615864, 72150196, 74651457, 78463366, 81223714, 84836779, 88656973, 92464318, 96063606, 100354750, 104655401, 109582718, 114808104, 120324094, 125528900, 131507092, 138242359, 144900197, 151847684, 159381172, 168001182, 176386932, 185586674, 195656655, 205748200, 216938526, 228391589, 240486584, 253626082, 267453927, 281354813, 295996584, 310994633, 326804390, 342476475, 358770915, 375371140, 391010383, 406899738, 421168242, 434752736, 446049670, 450459471, 450913716, 452504218, 456036610, 456386774, 453205622, 448754475, 440708895, 429745557, 417156951, 402746865, 387190950, 371088206, 354166617, 337192315, 320328842, 303125063, 286694555, 272064964]
14254B72064964j4419242j4087752j3487651j2722405j1969874j0801180j0487155
14247A84089705r687288q987584q473561p574048p274262p842376o455713o118713
14239A21676160n450679n420382m897133m864683m705322m113851l976056l395155
14231H4852899l262290l438845l212625l330394k307218k916220k629838k484279
14223F1271190k355852j902445k080970j978353j291731k063723k257243j033837
14215D6307036j791693r90111q42195j658774j640875j009125j264405p00009
14207C6409849o78663j186494j192690j130392j235770q06007n61802k43913r84878
14198B8389240r06116p61296o41166n82724o34899n45811j72352j514870n81738
$$ y = [272064964, 257645722, 243557970, 230070319, 217347914, 205378040, 194576860, 184089705, 174402417, 165414833, 156941272, 149367224, 142092962, 134250586, 127794873, 121676160, 116225481, 110805099, 105907966, 101043283, 96337961, 92224110, 88248054, 84852899, 81590609, 78151764, 74939139, 71608745, 69301527, 66385307, 63755469, 61271190, 58915338, 57012893, 54931923, 52953570, 51661839, 49598116, 47340873, 46307036, 44515343, 43525232, 42683037, 41024263, 39383388, 38374263, 37109858, 36409849, 35731186, 34544692, 33352002, 32221610, 30985840, 30179833, 29618031, 29374118, 28389240, 27483124, 26721828, 26080662, 25497938, 24863039, 24317228, 24144876, 22630006, 22048268]
14189B2048268j40207n50268p42517k46549k39038q29134M381o76950n40278j68682
14179A7919026o06526n06018j176n65297j51665m04494m46095j7639l37401n89398
14169A4293317P3053o86417j91784J29450k68791o05913q0731p4498k22492k62442
14159A2102752n3920n37482j41137M6107n02294J011k67310l22873j6939j98591
14149A0109324j44831L1209k31700l40357J32067j97468o09934L97587j64383
14140H981514k91080K812R8101l89950j89684l00047N5452p7751j90465m48007
14130G250895L60094K9298k16795l46795J5943l75378J61841k52225K23208k75182
14120F574904j01143J97541k87761P8551m87780J85627j75890K14267j68543k3628
$$ y = [22048268, 21908061, 21357793, 20615276, 20368727, 20129689, 19300555, 19304936, 18627986, 18087708, 17919026, 17312500, 16806482, 16805306, 16240009, 16088344, 15683850, 15237755, 15220116, 14882715, 14293317, 14366370, 13679953, 13488169, 13617619, 13348828, 12742915, 12662184, 12587686, 12365194, 12102752, 12048832, 11511350, 11370213, 11416320, 10914026, 10915037, 10647727, 10324854, 10307915, 10109324, 9964493, 9995702, 9764002, 9423645, 9555712, 9358244, 8748310, 9145897, 8981514, 8690434, 8693246, 8791347, 8401397, 8211713, 7911666, 7967118, 7889367, 7698902, 7250895, 7610989, 7640287, 7423492, 7076697, 7092640, 6717262, 6879103, 6626878, 6850086, 6574904, 6473761, 6671302, 6383541, 6462092, 5974312, 6159939, 5984049, 6198316, 6029773, 6006145]
14110F006145j85837j51784r119k75006J13581q294N2513k87224j22008O3115
14100E196082j16816M6213Q4929J05144p87447K28165m24707M55192j38668o5209
14090D582878j74468m3137J42833j3699J29741m74920r0635J67880J8084l68487
14080C876070J45930J53072k43192K10457o3252j15104M0346k97985J75662q7506
14070C794498m9920j85699J25273J19237m8986k97975M3570J37764n46985J31381
14060C222158N99194l93109J23498k71925P8923k61046m8774L26321l96182J46768
14050C125826R5342j07145J63060k04002O6530j55980l44169J57770L3022Q6662
14040B916916p2038k68238P477j8082J418J02700O9205m4623j01921L4709p6946
$$ y = [6006145, 5820308, 5668524, 5659405, 5384399, 5497980, 5489686, 5542199, 5254975, 5132967, 5196082, 5079266, 5125479, 5210408, 5315552, 4528105, 4756270, 4331563, 4786755, 4648087, 4582878, 4408410, 4365273, 4508106, 4494407, 4624148, 4149228, 4058593, 4226473, 4244557, 3876070, 4022000, 4175072, 3931880, 4142337, 4079085, 3963981, 4004327, 3706342, 3882004, 3794498, 3744578, 3558879, 3684152, 3803389, 3754403, 3456428, 3499998, 3637762, 3090777, 3222158, 3821352, 3428243, 3551741, 3279816, 3358739, 3097693, 3048919, 3375240, 2979058, 3125826, 3221168, 3114023, 3277083, 3073081, 3139611, 2983631, 2639462, 2797232, 2830254, 2916916, 2844878, 2576640, 2584117, 2566035, 2567453, 2670153, 2739358, 2694735, 2592814, 2627523, 2550577]
14029B550577J18655K7013p8665P2279l90393k8956L11759l02036k93208K80967
14019B267992M825q2040L09055j61025k13217J74728j69863J3561K6532k16078
14009A954470j04437L04893m00133K49088j86819Q5008K28988j48117Q6598J2136
13999B081675k72346L0266K02627J0437L25342m84906K3025R5069j30850M93396
13989B373735J766801L210741O013166J5131482J4549836k1404604A0735892m263811
13981F472081j649248o81014n86091m50095l19762J18417l11935l09345q5352
13972B197656j05248J14381J7330j69431j37037M0784L3658J45547n2537l28885
13962A756218l3055L26948j93606j43281O0376M4027l02576L96819r9150K28445
$$ y = [2550577, 2669232, 2696245, 2617580, 2689859, 2299466, 2270510, 2582269, 2280233, 1987025, 2267992, 2272817, 2190777, 2499832, 2338807, 2125590, 2300318, 2130455, 2144016, 2170548, 1954470, 1850033, 2154926, 1754793, 2003881, 1817062, 1902070, 2131058, 1982941, 2069539, 2081675, 1809329, 1839595, 2042222, 2052659, 2378001, 1893095, 1916120, 2011189, 1880339, 2373735, 4140536, 7351277, 13364443, 28495925, 43045761, 21641157, 10735892, 6472081, 4822833, 4141819, 3555728, 3105633, 2785871, 2904288, 2592353, 2283008, 2197656, 2092408, 2206789, 2224119, 2054688, 1917651, 1958435, 1992093, 2137640, 2085103, 1756218, 1723163, 2050111, 1856505, 1713224, 1773600, 1817627, 1515051, 1911870, 1812720, 2041165]
13952B041165k00181k24782r3225o4896J75662L3066j87930j7382K0710p9958
13942A402249L00546k65226o2399l34345L16820j09497k46123N42271J71045n58458
13932A156883L07651k2816k35906L49989l43759L9469J61732j74211L63091k87249
13922A314874m9819K51000j99455J78460m40965M99328l22825J58516J28226k41472
13912A275868j94402R4008L23102k1720j88195m52643N7727J63695J70445k09305
13902A018580J91715j67311O1968J65091j09053l02111P79585o22782j4486K95938
13892A297134k11609J39475j19352Q9294j22645j22144L32096j92752J67202j48386
13882A108313K04744j89166J94058O2718k04748l82981o2667J56924J85925j06
$$ y = [2041165, 1840984, 1616202, 1522977, 1458081, 1633743, 1666809, 1478879, 1461497, 1482207, 1402249, 1702795, 1437569, 1375170, 1040825, 1357645, 1248148, 1002025, 1544296, 1715341, 1156883, 1464534, 1441718, 1205812, 1555801, 1212042, 1251511, 1413243, 1239032, 1602123, 1314874, 1265055, 1516055, 1316600, 1495060, 1054095, 1553423, 1230598, 1389114, 1517340, 1275868, 1081466, 1175474, 1498576, 1476856, 1288661, 836018, 893745, 1057440, 1227885, 1018580, 1210295, 1042984, 1104952, 1270043, 1160990, 858879, 1638464, 1015682, 1001196, 1297134, 1085525, 1225000, 1105648, 1194942, 1072297, 950153, 1282249, 1089497, 1256699, 1108313, 1313057, 1123891, 1317949, 1380667, 1175919, 792938, 730271, 887195, 1073120, 1073014]
13872A073014n3632J52629k04014K78149m18446q9844K72063J83736n73903N97692
13862A217444j93895j97487L43995E19352L52775m7179O0855R4856L20023n05189
13852G95493J99281K12921k69347m512l1888l8587K74495k9897l81091R8277J14971
13841I40116n2991k38855J99954J70943p7306r5515K93517k33385j1139J60466
13831A055805m27130J03397j23982J72035j91752L34118j42331n071K05484K12385
13821A192958l01601k34327J26691M9385k41714M28535l22617J68048J23701m63526
13811E25533L94743K29349n22438B63781M49472M08115j05317k26508q7299K5247
13801G27491o2766m4307j92151L00494K72742j32418o5908l17102L11701l67119
$$ y = [1073014, 1019382, 1172011, 967997, 1246146, 827700, 737856, 1009919, 1193655, 619752, 1217444, 1023549, 826062, 1170057, 519352, 872127, 824948, 885803, 980659, 1300682, 795493, 994774, 1207695, 938348, 933836, 901948, 863361, 1137856, 1107959, 726868, 825145, 940116, 887125, 648270, 848224, 1019167, 941861, 846346, 1139863, 906478, 895339, 1055805, 628675, 732072, 608090, 780125, 588373, 922491, 780160, 775089, 980573, 1192958, 891357, 657030, 783721, 833106, 591392, 1019927, 697310, 865358, 989059, 525533, 920276, 1149625, 627187, 263781, 713253, 1121368, 1016051, 789543, 702244, 727491, 664725, 620418, 428267, 728761, 1001503, 869085, 803177, 486075, 797776, 430657]
13791D30657K57817J64953r1239J95931k08148r5388l8274N3908o2586J79283
13781G86914q7204j50262J84088q1911J91212l55841K90382r3230k88819J47802
13771E43131K52800k69705p5225M13986k59651j63100J90640B33329K73717N4335
13761E61381r8010J02608J96605J73727m50787o705L2252k6561J68641l0496j55511
13750D67144M24378l23102K02280l728k07224j25082J15281j31632J41572j70639
13740C89248K28116r1221r1763j47364L31004m2074K0310K00903k33180k7300
13730E36679j17483J12299J24535j66469J34009d582G05982J11435l32184J92774
13720F78007k6358k64337N9274P5088A90323K39453J9306J09009j09812q7995
$$ y = [430657, 688474, 853427, 762188, 958119, 749971, 654583, 616309, 670217, 607631, 786914, 699710, 549448, 733536, 651625, 842837, 486996, 777378, 684148, 395329, 543131, 795931, 526226, 451001, 864987, 605336, 442236, 632876, 233329, 507046, 561381, 463371, 565979, 762584, 936311, 485524, 478819, 511071, 484510, 653151, 622655, 467144, 891522, 568420, 770700, 766972, 559748, 434666, 549947, 418315, 559887, 389248, 617364, 526143, 434380, 287016, 618020, 575946, 596256, 797159, 563979, 536679, 419196, 531495, 656030, 489561, 623570, -4582, 705982, 817417, 485233, 678007, 651649, 387312, 446586, 521674, 190323, 429776, 449082, 558091, 448279, 360284]
13710C60284K43242L1148l0188j15267k12295I3619L73573K59942C43405p499
13700C35906K19703j66212r4306K62764l11r7511A78504L26808K60259l51446
13690D14125o7937l6801L43183K3300b1919E03198B22221N08031j26396B81771
13679B43620J92299o0802L70543l40014I8258L93596L25592C86349P3370l7729
13669D21990M7141L9082n1623N7859R9938B15867J01791Q4814r1991J38590K476
13658D51547l588j55220J86782j24977j25681N7826J36994Q6413M4159j56713
13648C97542j52859j1048M5589p2877J67865K04328j99904L83714o9004l07906
13638C85440J34334J3999B40244K8385N0521N2068j69436a09820C66053A07853
$$ y = [360284, 603526, 634674, 604486, 489219, 276924, 93619, 467192, 727134, 343405, 335906, 555609, 389397, 295091, 557855, 557544, 460033, 178504, 505312, 765571, 414125, 346188, 309387, 652570, 675870, -21919, 503198, 222221, 730252, 603856, 281771, 243620, 435919, 375117, 745660, 405646, 98258, 491854, 817446, 386349, 459719, 421990, 469131, 508213, 456590, 514449, 614387, 215867, 317658, 402472, 310481, 449071, 451547, 447959, 292739, 479521, 354544, 228863, 286689, 423683, 510096, 554255, 397542, 244683, 233635, 279224, 206347, 374212, 578540, 378636, 762350, 693346, 385440, 519774, 533773, 240244, 268629, 319150, 371218, 201782, -109820, 366053, 107853]
13627D36542j37478M57633A27071L93002B12246J62422P4023n0176K1017L530
13617D23062J64721J18376K52422C04046o6261r8443J5110R1276J42533J96947
13607E85208k36390M71518B56859H695J30827L99892k04114c295D69469A11505
13596B93898J84729A63165J45426l4111A35459a16971D34440k4003b48416C82151
13585C21478A52451K06341r2809M0478J20694J60065k56997o0571J37112A0237
13574C55117r3896K6834q1480P8162f8488F55199A76389M91k8894L71113A50326
13562B95131n6987J00168D1573L65396q5443A56679P6629O1409J99252B27339
13551C37338n3315j23192K689N7654J42141K60984A05986B1480C538K13829k2022
$$ y = [436542, 299064, 756697, 127071, 520073, 212246, 374668, 448691, 398515, 419532, 423062, 587783, 706159, 958581, 304046, 237785, 139342, 154452, 245728, 388261, 585208, 348818, 820336, 256859, 8695, 139522, 539414, 335300, -3295, 469469, 111505, 293898, 478627, 163165, 308591, 274480, 135459, -116971, 434440, 410437, -248416, 382151, 321478, 152451, 358792, 265983, 306461, 427155, 587220, 330223, 269652, 406764, 10237, 355117, 261221, 288055, 206575, 284737, -68488, 655199, 176389, 176880, 147986, 519099, 150326, 295131, 238144, 338312, 41573, 406969, 321526, 156679, 233308, 294717, 493969, 227339, 337338, 284023, 160831, 163520, 221174, 363315, 624299, 105986, 21480, 3538, 217367, 195345]
13540A95345L95427B77210j10224K76704A15202J16561J22549q0063j25379L85215
13530E34085g2078C39788L7199m7080A56022L09435k17747L07553A39551C4849
13519H2754q248K95860A24061J78649J89761B33308L1788p8681K28038J15228
13509E29681r288K0923b1275A38934O7256J95068D4394j6547K62583m790A21734
13497G6471L98498k04210k3704H3261J12783K0269O1849R4071A61641F8647J96679
13486B65326a159A47480L61768D4440K6914j6362j6995N47011k7204B59090K27655
13475D86745k01152O9506A64385P0460n3322K15823j63548a81939C41677A10602
13464A94773l0153J9136J23002M117c0458m648m1843C89991H1121J2066J51366
$$ y = [195345, 590772, 277210, 166986, 443690, 115202, 231763, 354312, 274249, 148870, 534085, -72078, 339788, 376987, 329907, 156022, 465457, 247710, 555263, 139551, 34849, 82754, 74506, 370366, 124061, 302710, 492471, 233308, 265096, 186415, 414453, 529681, 520393, 541316, -21275, 138934, 206190, 401258, 44394, 27847, 290430, 285640, 121734, 76471, 474969, 270759, 247055, 83261, 196044, 216313, 278162, 372233, 161641, 68647, 265326, -1159, 147480, 509248, 44440, 71354, 54992, 37997, 585008, 557804, 259090, 486745, 285593, 355099, 164385, 234845, 181523, 397346, 233798, -181939, 341677, 110602, 194773, 164620, 183756, 306758, 310875, -30458, -35106, -76949, 389991, 81121, 93187, 244553]
13453B44553e1324p3975A75769p5445K48647e1736H8540M27343k46039L2063e5270
13441C63541A21023i934A69190L25763j71346k7778j048H3668L06697N6092F4630
13429D16165j16937A20943J63225B730K85547q7598Q844N0073C8025P1434P7994
13418A87453J6880d046p7619D03711F5044O1475J82273R1829A94251J08252N3762
13407C56265q6948n8485m8412m3076M01409m6411a54878B72389c8282B11364J03725
13396C15089n2226O0962H5183a15104C32926j3748q469H8098P6355k1087O2928
13385B06294L8299M349D4653K50810l4059J11479i8293D82305H7191R4116J28197
13374C09504N1769n0302L0169p3630j29737K03174j57682a01456B2741J37510
$$ y = [244553, -51324, -125299, 175769, 100324, 348971, -51736, 88540, 515883, 269844, 301907, -55270, 363541, 121023, -9934, 169190, 494953, 323607, 295829, 294781, 83668, 390365, 446457, 64630, 416165, 299228, 120943, 284168, 2730, 288277, 200679, 209523, 259596, 38025, 109459, 187453, 204333, -4046, -81665, 403711, 65044, 126519, 308792, 400621, 194251, 302503, 356265, 269317, 210832, 162420, 119344, 520753, 474342, -154878, 272389, -38282, 211364, 315089, 262863, 323825, 85183, -115104, 332926, 319178, 310709, 88098, 164453, 143366, 206294, 244593, 248942, 44653, 295463, 261404, 372883, -98293, 482305, 87191, 181307, 309504, 361273, 310971, 341140, 267510, 137773, 340947, 183265, -101456, 22741, 160251]
13364A60251E1636J42010J15729g7604l5701A30932o1950N5396a37647A04357
13353B56697F3515J80673j08750Q7266j9431J2089P0099j3776E8481J33042J98257
13342C89780E3665L2043b1409B88172l0379O7319D3502K58282J34431F8594J13451
13331A82045J35685j35047b5766F60397A93731N8336J22364j33361J90956C6647
13320C42717r147K06545B59022K93437j95969N7362A27393J62432a01010A8506
13309C5015d8228A02957J97114a25162B76761R3762j62488i2188B50836l1804
13299B19032C9603M8979a23548A57563E638a20437B04026f5803A64474a21579
13288C9327P0944D1211J63762K06221l5120B9080K30531a10370j6237I4815J12141
$$ y = [160251, 51636, 193646, 309375, -77604, -113305, 130932, 68982, 124378, -137647, 104357, 256697, 63515, 244188, 135438, 222704, 203273, 215362, 285461, 271685, 58481, 191523, 389780, 53665, 85708, -21409, 288172, 257793, 325112, 43502, 301784, 436215, 68594, 182045, 317730, 182683, -25766, 660397, 193731, 252067, 374431, 241070, 432026, 36647, 342717, 333570, 540115, 259022, 552459, 356490, 413852, 127393, 289825, -101010, 18506, 35015, -48228, 102957, 300071, -125162, 276761, 370523, 208035, -92188, 250836, 219032, 39603, 88582, -123548, 157563, 5638, -120437, 204026, -65803, 164474, -121579, 39327, 110271, 41211, 204973, 411194, 376074, 29080, 259611, -110370, -126607, 94815, 206956]
13277B06956J7624C5859c32642A73988m6496m0910O3343Q6801a0447B02867A9260
13265a91176C02147j28986a39631B22772N3404k4317F2350C699J90265Q1680N5870
13254C31514j59223Q4170N7605L6146h7829b9409B714N8197b6007D5449L96395
13243D41844A72245C9828h750A16287l671J90595b2776B85881d4964L787C6547
13231D43682b05939C03205A8666K54022p1480b27587A38234J9425f3291F4876
13220C12048A27332J05947A06908D8513J30635m5686a06419A22228P1858k3221
13210A70865p3229M07007c11780e3470j02556B62730F2066m75e171B48258J65782
13199D14040A25819b2600H6139M575R4635A0322K5448Q6505d6747h195A95647
$$ y = [206956, 224580, 35859, -332642, 173988, 127492, 86582, 149925, 236726, -10447, 202867, 19260, -191176, 302147, 173161, -139631, 222772, 276176, 251859, 62350, 3699, 193964, 275644, 331514, 172291, 256461, 314066, 350212, -87829, -29409, 2714, 60911, -26007, 45449, 441844, 172245, 39828, -8750, 116287, 112616, 303211, -22776, 285881, -44964, -41177, 36547, 443682, -205939, 303205, 18666, 272688, 201208, -227587, 138234, 157659, -63291, 64876, 312048, 127332, 233279, 106908, 48513, 179148, 133462, -106419, 122228, 194086, 170865, 97636, 504643, -311780, -53470, -156026, 262730, 62066, 61591, -5171, 248258, 414040, 125819, -22600, 86139, 90714, 185349, 10322, 35770, 122275, -46747, -8195, 195647]
13187A27937R1722n3610c8172A9937K138O8708C6780b8913C08833N6039a63942
13175C69580n7932p7399K1828f1300q5485O5720A22743a66039d2106B77464r8789
13164A78675d18608G7823K09110f0575A07977O5878J22523m3514H120M8457Q2549
13153A39126b29156C5094M50417D0320K38051n8649k1358J15543r9171q5563d2669
13141F82J80870Q6173L6807b58589f1878b6443B89933p6685F1210J32500i44A05587
13128a05835A46356Q9515i8537A8007a04334A63746h7347A27015H600K48276A10515
13116D05826a06221A66442m7609L8875J69371O3600b0136C03811j34565L6844
13106B06090r5515a22165B57246r9417F6167J60495p5157b27740a05108L3176
$$ y = [127937, 219659, 166049, -38172, 19937, 22075, 90783, 36780, -28913, 308833, 364872, -163942, 369580, 311648, 234249, 256077, -61300, -146785, -81065, 122743, -166039, -42106, 277464, 178675, -418608, 77823, 286933, -60575, 107977, 173855, 296378, 252864, 8120, 56577, 139126, -229156, 35094, 485511, 40320, 278371, 219722, 198364, 313907, 214736, 129173, -42669, 682, 181552, 267725, 304532, -258589, -61878, -26443, 289933, 213248, 61210, 193710, -944, 105587, -105835, 146356, 235871, -98537, 18007, -104334, 163746, -87347, 127015, 8600, 256876, 110515, 405826, -106221, 166442, 118833, 157708, 327079, 390679, -20136, 303811, 169246, 206090, 110575, -122165, 257246, 157829, 66167, 226662, 151505, -227740, -105108, -71932]
13096g1932L2135B25286D2421a15762G8818a14596A92942q6481B3259L46487h0871
13084C66900F4679N3472D750M39237e0976J0351A14573e9708D7394L29901e4919
13072I1977a06190B01929n8048e05B60888a68881P4122a6107B71380h8627f62
13060A39638L17835j42380f5504D6158J36267J08721j34530a34066I6216g919
13049A43587o1060J8626a4371C15468j12087P4887K21374b7212B33046B3897c9744
13037D7462a24985c6504a2670A70677f6648k22091D717a17713F4587K46080G3873
13025a44187E24451n8797C790b6424A86825G699b00337C7412A6144J1253L46704
13014C74101A66358l3818E3373K29756k2163A27166a10854D8224J84034a01874
$$ y = [-71932, -39797, 225286, 42421, -115762, 78818, -114596, 192942, 106461, 23259, 369746, -80871, 366900, 64679, 118151, 4750, 443987, -50976, -40625, 114573, -59708, 47394, 377295, -54919, 91977, -106190, 201929, 143881, -505, 260888, -168881, -94759, -16107, 271380, -88627, -662, 139638, 457473, 315093, -65504, 46158, 182425, 291146, 156616, -134066, 96216, -7919, 143587, 82527, 101153, -14371, 315468, 203381, 278268, 499642, -27212, 233046, 23897, -39744, 47462, -124985, -36504, -12670, 170677, -66648, -288739, 4717, -117713, 64587, 310667, 73873, -144187, 524451, 465654, 3790, -26424, 186825, 7699, -200337, 37412, 16144, 27397, 374101, 166358, 132540, 53373, 283129, 260966, 127166, -110854, 48224, 232258, -101874]
13003B17415p6865C6513J31405Q7581m1919F3963L45372A71964m2863d297B19855
12991G5418e2314A59713l0357A9277a26370B9093H525M4842M8880e40241J56797
12980c83444f6204K008k3186d3428A70328a44621B29185K0753a81951D09046e2235
12968A96860h8100k29538A19921c5635o991A64623A802J94297n0180J61887K4356
12957C32162j65098B9756M7014J72501a75819j25168q41g4632H4956b6175F6195
12945e4115k45967A57412a70462G8607j7677N8868a48749M9139B58602e0212k43190
12934b93402B57383A05958g1928j28615A79329o8385J25222P4566a11502A38954
12923b81740E2837J01340L14728k28112c6069D2226J8128b62564l6021A36099
$$ y = [217415, 140550, 36513, 167918, 255499, 213580, 63963, 409335, 171964, 129101, -4297, 219855, 75418, -52314, 159713, 129356, 19277, -126370, 29093, 8525, 53367, 102247, -540241, -383444, -66204, -64196, -87382, -43428, 170328, -144621, 229185, 249938, -181951, 409046, -52235, 196860, -88100, -317638, 119921, -35635, -42626, 164623, 1802, 196099, 145919, 307806, 332162, 167064, 29756, 76770, 249271, -175819, -300987, -301828, -74632, 84956, -26175, 66195, -54115, -300082, 157412, -170462, 78607, 60930, 119798, -148749, -99610, 258602, -50212, -293402, 257383, 105958, -71928, -200543, 179329, 110944, 236166, 310732, -111502, 138954, -281740, 52837, 154177, 468905, 240793, -36069, 42226, 60354, -262564, -298585, 136099]
12912i2521E8260J558K6080J49496h0967E4999f1462C81338a03313H4864h7096
12900a87126C18030a40919F1919Q2109F2934k5253J36521c75460B41740D4199
12889I3909a68395J1899A65155m0568a27549B09770l8702Q42C323J74616h9205
12877A30208F0690M7578f8858A38378e1526K3982A81075b38295j17189B74568
12866A2736b70570c1286j92158B50821i0102B28593b2940j73580B31849D524K84241
12855B88765J57063b36150E4782b26610A04679G16c00228o3630b1250j21930A05819
12843D2551b1482C01517c0276E04869b10713A64501A0466c9804o9050A39248b31439
12831a23384j41554a05361C6454a47915C08408F1718L61454a27910F0739K7128
$$ y = [-92521, 58260, 59818, 85898, 235394, -80967, 54999, -61462, 381338, -103313, 84864, -87096, -187126, 318030, -140919, 61919, 144028, 62934, 37681, 174202, -375460, 241740, 44199, 93909, -168395, -156496, 165155, 124587, -127549, 209770, 171068, 171910, 3323, 177939, -89205, 130208, 60690, 108268, -68858, 138378, -51526, -27544, 181075, -238295, -355484, 274568, 12736, -270570, -31286, -223444, 250821, -90102, 228593, -22940, -196520, 231849, 4524, 288765, 445828, -236150, 54782, -226610, 104679, 716, -300228, -363858, -21250, -143180, 105819, 42551, -21482, 301517, -30276, 504869, -210713, 164501, 10466, -39804, -108854, 139248, -231439, -123384, -264938, -105361, 36454, -147915, 308408, 61718, 423172, -127910, 60739, 87867]
12821H7867g5181K3284A20235e7320b7927E0960a37148N6214j17616A49800a44848
12809F449R3015D1257b10193A43462A8P5003a42789c9565o3215m8254B42615a24825
12796F6947Q1337L207b964B305b16779o9884A22799b7969B09748E2800K20068
12785B72868a71532N8993A21389c02020A2296c8544F4365J3525J57972k0952d49693
12773b04229a1964C1771C276J79282b21173j18339c3385A26994a53255K0907B57903
12761A20513a87316A15077b77940a32574A3313J35210F6438e721A21081E3946
12750h2605A4474K33059J09012a18258M5632G2576k4979K23225i4278A2654J06360
12739A19014J79503r7284i691H9416j6904a50425A16955b90799a17752j22907
$$ y = [87867, -75181, -51897, 120235, -57320, -27927, 50960, -137148, -80934, -198550, 149800, -144848, 6449, 99464, 41257, -210193, 143462, 18, 75021, -142789, -39565, -102780, -151034, 242615, -124825, 66947, 148284, 151491, -2964, 2305, -216779, -286663, 122799, -27969, 209748, 52800, 272868, -171532, -112539, 121389, -302020, 12296, -38544, 64365, 77890, 235862, 214910, -449693, -204229, -11964, 31771, 3276, 182558, -221173, -339512, -33385, 126994, -153255, -132348, 257903, 120513, -187316, 115077, -277940, -132574, 13313, 148523, 66438, -5721, 121081, 53946, -82605, 14474, 247533, 356545, -118258, -72626, 72576, 47597, 270822, -94278, 12654, 119014, 298517, 201233, -9691, 89416, 72512, -150425, 116955, -290799, -117752, -240659]
12729b40659A76621b606m07382a04434r901A01235C4002d2787A02928a18861N8279
12718f0582C1341K87160a99267k67929B8087Q8810J34230D2645J48994K45252
12708D36891j55852a35970C90559a75102B05353J61200L2976b3223F6948B0652
12697B46974K17627f3589G997J69626C9893I829a29610K3566r8978O93N1216B77886
12684a27730A16921h7564A54140p4793g472q6531A34200K37910j81323p61O1648
12673B51674d12j6420B09272a09899j27411D4826A4069K09011q3605K1606a67523
12661A69143k2164e832A64180A5740R1471L509A0057a91068C95554j40899D7134
12649A0613L57552r9841B5974R2697J4636b2802k93434C43179d839D7622d5534
$$ y = [-240659, 176621, -2606, -409988, -104434, -114335, 101235, 34002, -42787, 102928, -118861, -60582, 31341, 318501, -199267, -467196, 28087, 116897, 251127, 42645, 191639, 436891, 281039, -135970, 390559, -175102, 205353, 366553, 399529, -23223, 66948, 20652, 246974, 464601, -63589, 7997, 177623, 39893, 9829, -129610, -106044, -205022, -204329, -153113, 277886, -127730, 116921, -87564, 154140, 79347, -7472, -94003, 134200, 372110, 190787, 190026, 251674, -412, -16832, 209272, -109899, -237310, 44826, 14069, 223080, 139475, 161081, -167523, 169143, 146979, -5832, 164180, 15740, 107211, 110720, 10057, -191068, 395554, 254655, 47134, 10613, 368165, 268324, 25974, 118671, 133307, -22802, -316236, 343179, -4839, 47622, -45534]
12637a85135k4434B19473b90062i9337q4522C73108j14648l8289a49872B5616
12626I5412K8842J25937J77941I4903m3802L85738a81870M1265j91363A20J19450
12615A19570n2512P0764D4047N7362B9341g206b475G296i4273d0331p4472A05368
12602D2247J86849m3930N5569g1548c4567l3944C15853A47604k4746a2995B96427
12590b456F2598h8106k1785d9578j06853g0137l3193K0333F3796K34406d0245
12578H1246b40989P5233B0884h2696b7625H0185C5742A6771f3794k899B62386
12566b87955B95661m0598O1623a66363B27002a14679A09790b80641D94362f2439
12555C39907G7240L2165g1608j2761j33210j06392b2801j81205B49849A24241
$$ y = [-185135, -209569, 219473, -290062, -99337, -183859, 373108, 258460, 220171, -149872, 25616, 95412, 124254, 250191, 428132, 94903, 51101, 436839, -181870, -140605, -331968, 120, 119570, 67058, 137822, 44047, 101409, 29341, -7206, -2475, 7296, -94273, -40331, -114803, 105368, 42247, 229096, 185166, 240735, -71548, -34567, -68511, 315853, 147604, 122858, -12995, 296427, -2456, 62598, -88106, -109891, -49578, -156431, -70137, -103330, -82997, 63796, 298202, -40245, 81246, -240989, -165756, 20884, -82696, -27625, 80185, 35742, 16771, -63794, -66693, 262386, -287955, 295661, 255063, 316686, -166363, 227002, -114679, 109790, -280641, 494362, -62439, 339907, 77240, 109405, -71608, -84369, -217579, -323971, -22801, -204006, 249849, 124241]
12544f5754E584O3600L79131b93629a9115k30516l81c4581A14682B8491c01314
12532C79232G1654O4892b68777C0300L06429E6045K82177A56350n8970a31155
12521A65206B6636R0504J88626a5293B52647b9089m3691I2009Q3504D9730a22940
12509b25015I1768e7548a4056f301A03989m6020J24805B9156a82382L8203B88985
12497b225j57400H1602K01925b82725a01129A21257m664n0327e5879o2134e6613
12485c33743E908Q6037a53397B30665q9833e9240D2654c63713A09740L0875a00519
12473A85269o0563K98692a94577I9156a09489D53104E6978K74095I8971h1371
12462G1665J27167h4950A93277a73977A49321a60194a3593A81732i0934l5947
$$ y = [-65754, 5584, 69184, 448315, -293629, -19115, -249631, -250012, -34581, 114682, 28491, -301314, 379232, 71654, 136546, -268777, 30300, 336729, 56045, 338222, 156350, 97380, -131155, 165206, 26636, 117140, 305766, -15293, 252647, -29089, -72780, 92009, 175513, 49730, -122940, -225015, 91768, -57548, -14056, -6301, 103989, 57969, 182774, 29156, -182382, -144179, 288985, -2225, -159625, 81602, 283527, -282725, -101129, 121257, 116593, 66266, -55879, -118013, -56613, -333743, 5908, 91945, -153397, 230665, 140832, -59240, 42654, -363713, 109740, 140615, -100519, 185269, 124706, 423398, -194577, 99156, -109489, 453104, 56978, 331073, 98971, -81371, 71665, 198832, -84950, 193277, -173977, 149321, -160194, -13593, 181732, -90934, -126881]
12452a26881A71078a47687j46264a00825j48620b5888n8904c9702m8149K5724
12442f2127J1076E9464c8641J1264l5728B98456a18426d4214m9268m0445j520
12431a35447I7117B4117O3705O4024h1894P001A71137K6129b38451f1618A10488
12419a18547e2499k2099B9944d2558k96006A19853d3447A62285a11655L0696A4517
12407b607H5387a48634D885K0696d7488E8997L36096D9831J17807h9712B21934
12395c4692j22723d7615I7514a5394l2574B9804d17696a67890g5435A28513b16579
12383A89813B7251F217h6762A37871A1243a15425B8290a10730H309M07027b32020
12371D89592c99409A31704J56963j37790A466K19463M1322F1832j9766b36942
$$ y = [-126881, 171078, -147687, -293951, -100825, -249445, -25888, -84792, -39702, -87851, -62127, -51051, 59464, -38641, -27377, -63105, 298456, -118426, -44214, -93482, -133927, -135447, 97117, 24117, 87822, 151846, -81894, -74893, 171137, 197266, -238451, -61618, 110488, -118547, -52499, -74598, 29944, -42558, -338564, 119853, -43447, 162285, -111655, -80959, 14517, -2607, 85387, -148634, 4885, 25581, -47488, 58997, 395093, 49831, 167638, -89712, 221934, -34692, -157415, -47615, 97514, -15394, -47968, 29804, -417696, -167890, -75435, 128513, -216579, 189813, 27251, 6217, -86762, 137871, 11243, -115425, 28290, -110730, 8309, 415336, -232020, 489592, -399409, 131704, 288667, 150877, 1466, 220929, 262251, 61832, 42066, -236942]
12360B13729c68616a34157f0507K5681F1953K480N992a0931j83777G0244J37419
12349B07663h5342A31711R3161e8222k118b1555I9342R0413h169B86340f4343
12337e9000H9861e3129k58220H4655P0962a80075K1161L444l2639K5886F5908
12325A83800g1491q5800A4545K24085I5571C3139L696k117O801i4741L6849A90618
12312A0338M06123h9784j53046a5170B57878A12394f8444C32980J08722A40690
12301c1775j72118A77102B4121K10023a7922B807J74223G8742d3308G2388b8993
12289a16168L8820A418c96206A12634K0375P8044b45511R3868D5470O8464C1413
12277H5486f3950p8356B82458O0362b64190B49053J05121c6967A02356Q4155A0850
$$ y = [213729, -368616, -134157, -60507, -34826, 61953, 64433, 70425, -10931, -194708, 70244, 207663, -85342, 131711, 224872, -58222, -60340, -21555, 99342, 189755, -8169, 286340, -64343, -59000, 89861, -53129, -311349, 84655, 155617, -180075, -158914, -155470, -188109, -162223, 65908, 183800, -71491, -157291, 14545, 238630, 95571, 33139, 36835, 34718, 41519, -94741, -57892, 190618, 10338, 416461, -89784, -242830, -15170, 257878, 112394, -68444, 332980, 441702, 140690, -31775, -203893, 177102, 24121, 234144, -17922, 2807, 177030, 78742, -43308, 72388, -28993, -116168, -77348, 1418, -396206, 112634, 133009, 211053, -245511, -151643, 45470, 113934, 31413, 85486, -63950, -142306, 282458, 342820, -264190, 249053, 354174, -36967, 102356, 186511, 10850]
12265I286K64847n6980b93555b9124B55018a51324G314K15782e576A48298K8997
12254A77295a2027j3258p0648i112C80840B5308J50952a30194B70766a6749A33467
12242A80106l5884K68471j44696a05901M3926j78495a19359B07954n2988Q8564
12232B43530o9454J82110A21998i349C16018j19667k8189N8030p7349p2339N4398
12221A30902I698N02059B09546L0924k1206E139b52174B01307k3680a31960O4924
12210f7036A90430L57452k2471f5653D05694K2541A55795Q3244e9788j32553B6367
12198A60738I340a02073B17420G3257J63486A2344J12224h8652a2948j13228M7200
12187g8976l8133K502D2423J78112g3925B57960a86670F2103L01142C0880K65693
$$ y = [9286, 274133, 217153, -293555, -29124, 255018, -151324, 7314, 223096, -5576, 148298, 177295, -12027, -25285, -95933, -9112, 380840, 25308, 176260, -130194, 270766, -16749, 133467, 180106, 144222, 412693, 267997, -105901, -61975, -240470, -119359, 207954, 154966, 243530, 174076, 356186, 121998, -9349, 316018, 196351, 168162, 226192, 148843, 76504, 130902, 9698, 511757, 209546, 240470, 219264, 5139, -252174, 201307, 177627, -131960, -67036, 190430, 547882, 525411, -65653, 405694, 428235, 155795, 239039, -59788, -192341, 26367, 160738, 9340, -102073, 217420, 73257, 236743, 12344, 124568, -88652, -12948, -126176, -78976, -117109, -114607, 42423, 220535, -73925, 257960, -186670, 62103, 363245, 30880, 296573]
12176B96573B1399a0822A92502b44495J05503B62402A19361a3758A63318m6421
12166A16897b48392c5124D10197j71712n9607a01041A27417J41562n7083A5282
12155c7037j16974B03355H8100a65671D45644a02950m653G1086L92614c37725
12144A35388J9218L34068A89368J10753b95286C03025c2828a3704q0728D3062
12133B74613j25530f6320I9737K9823K3024g9648D3550O626J52691I9939b57918
12121a07221j69300c1226k7397p1544A57191c54122d2930k6567A18220M7872C8763
12109a81059G2354M4210g3123k7791A15246a05411B47409G367K4622J85005h3071
12097A03727a78797Q6189L0310B23466a55981G3575h3827n9110D0304b34728B40189
$$ y = [296573, 21399, -10822, 192502, -244495, -138992, 262402, 119361, -13758, 163318, 116897, -248392, -35124, 410197, 238485, 178878, -101041, 127417, 268979, 211896, 15282, -37037, -154011, 203355, 88100, -165671, 445644, -102950, -107603, 71086, 463700, -337725, 135388, 154606, 488674, 189368, 300121, -295286, 303025, -32828, -13704, -94432, 43062, 274613, 149083, -66320, 99737, 129560, 152584, -79648, 43550, 50176, 202867, 99939, -257918, -107221, -276521, -31226, -58623, -130167, 157191, -354122, -42930, -69497, 118220, 166092, 38763, -181059, 72354, 116564, -73123, -100914, 115246, -105411, 247409, 7367, 31989, 216994, -83071, 103727, -178797, -92608, -62298, 223466, -155981, 73575, -83827, -142937, 40304, -234728, 240189]
12085c32351I2739D3928a45030j10459P0870C9379M3868C1754K34805J1019N77773
12074H55351J011811H48549C67772j06226H9006b00737D4049g0121k34589d3195
12063C9955c63287G2947P4815a18141A67521n1101i1397J8659B6623J1366c71824
12051a19727G0874d51450A15817b12828J2691R4375K7816A6430J22678d6244o4573
12040a10817j3689e6144m254K1996k5533A02088L95321b10628a0431j50168G7618
12028B85422b2860p5188I0925a02133E1691a11953G2569B1247b1595L144C6927
12016B7232e724A99439b42097R1427A6490N4109a53846a3397A10919a03634k6875
12005a30509A13969K267D999J32016b09193B59931g9474B48655a31970a5170A90564
$$ y = [-332351, 92739, 43928, -145030, -255489, -184619, 39379, 83247, 31754, 266559, 277578, 855351, 1867162, 848549, 367772, 261546, 89006, -200737, 44049, -70121, -304710, -43195, 39955, -363287, 72947, 147762, -118141, 167521, 116420, -91397, -72738, 26623, 37989, -371824, -119727, 70874, -451450, 115817, -212828, -200137, -105762, -77946, 16430, 139108, -46244, -110817, -124506, -56144, -60398, -38402, -63935, 102088, 497409, -210628, -10431, -160599, 77618, 285422, -22860, -98048, 90925, -102133, 51691, -111953, 72569, 21247, -21595, -18451, 36927, 27232, -5724, 199439, -242097, -150670, 16490, 70599, -153846, -13397, 110919, -103634, -130509, 113969, 116236, 4999, 137015, -209193, 259931, -79474, 248655, -131970, -15170, 190564]
11993D54537a88752F9715b9875A54279d856C14362C3280d36350a52382F1071P0406
11982A31477c9788o0154B21572a2988j21574H5313c9279J9500B05858k3026j0445
11971A72387b5934j21046B80682a49469k1346A17743P4761L343B0412a27764G0295
11959f7752B58415m623A16693c8763A64735i689F5381a70004A53535K95234H2051
11947D37215e7124j03266k836e4997A72004M2323I4342c12221c8427A16471b29831
11935a24371d0252A55717J7070q2050L08295f0047A42279f2522j34836F4150e2606
11923a47950C5687f2757B21202G0539O3215J12160A6986O811K41519A11760h8771
11911a2235j00384a6752j23469j13811c5228K998k63036A48876a03637j82821
$$ y = [454537, -188752, 69715, -29875, 154279, -4856, 314362, 33280, -436350, -152382, 61071, 131477, -39788, -99942, 221572, -12988, -134562, 85313, -39279, -19779, 205858, 182832, 172387, -25934, -146980, 280682, -149469, -170815, 117743, 192504, 195847, 20412, -127764, 70295, -67752, 258415, 253792, 116693, -38763, 164735, -9689, 65381, -170004, 153535, 448769, 82051, 437215, -57124, -160390, -163226, -54997, 172004, 214327, 94342, -312221, -38427, 116471, -229831, -124371, -40252, 155717, 172787, 90737, 399032, -60047, 142279, -62522, -197358, 64150, -52606, -147950, 35687, -62757, 221202, 70539, 133754, 245914, 16986, 23797, 265316, 111760, -88771, -12235, -112619, -16752, -140221, -254032, -35228, -32230, -295266, 148876, -103637, -286458]
11901b86458A52661c33219A76870a87245e9650A16004J72981o4470a51815L0139
11891a21676B77052H2326b39810E074a00222M824L2294l9959a9742k53297a15282
11879a41538P0267j09697D4000i6267A17378a5758C9162a97059e1574B52075a08563
11867C14984o3059a64208B04630p2366a12366E5911c50755L1979a01647k38670
11857c40317J01299D206b675F7636a37306q190j37146B51401h3601G3335a41638
11845i9227F2195b3222o3689A18857E8476d5275n6765B84632i1047K7682n4642
11834a18007j99792c9389k35130H6371a34569m0197j05748Q6783O3342A53184
11823B77542b58760A53365P9768b2376j72735n2223L9045P6636e342B9729b4253
$$ y = [-286458, 152661, -333219, 176870, -187245, -59650, 116004, 288985, 224515, -151815, -121676, 277052, 82326, -239810, 5074, -100222, -95398, -63104, -103063, -19742, -273039, -115282, -141538, -71271, -180968, 44000, -96267, 117378, -15758, 39162, -197059, -51574, 252075, -108563, 314984, 251925, -164208, 204630, 132264, -112366, 55911, -350755, -318776, -101647, -340317, -239018, 4206, -2675, 67636, -137306, -145496, -282642, 251401, -83601, 73335, -141638, -99227, 62195, -23222, -86911, 118857, 58476, -45275, -102040, 284632, -91047, -63365, -118007, -317799, -39389, -274519, 86371, -134569, -174766, -280514, -193731, -130389, 153184, 277542, -258760, 153365, 233133, -22376, -195111, -247334, -208289, -131653, -5342, 29729, -24253]
11811a25448N3735k94821A50928A1904J97685J60039D0630f5391K3546A52538
11800i0326B10653E0636B2005b13822I3406b33709N8604a7473B11625f5981H0285
11788a25898A47104g7089C154M671K8821b62220Q8392A85726a44629H3796a87486
11776B02383q469C4742N5437c5375j45613e693m8109j70728C21664h3604l0544
11765a14148E3110L1234h7360A38151a88912B43838F2605c79856A56099b64590
11754A12450N4090E9722g6350a7363q8583A22025l2894b82989D65573a7363F7998
11742D8711J16475b30140f6365J04l6671A21798i1706H3971a50653b4768m908
11731b9676A2176M6597a38119D2021f5271c468m54652A66215d2104j34628G0738
$$ y = [-125448, -71713, -366534, 150928, 11904, 209589, 369628, 40630, -65391, -41845, 152538, -90326, 210653, 50636, 22005, -213822, 93406, -233709, -175105, -17473, 211625, -65981, 80285, -125898, 147104, -77089, 3154, 7825, 36646, -262220, -173828, 185726, -144629, 83796, -187486, 202383, 193914, 34742, 90179, -35375, -180988, -5693, -53802, -224530, 321664, -83604, -114148, 53110, 84344, -87360, 138151, -188912, 243838, 62605, -379856, 156099, -264590, 112450, 166540, 59722, -76350, -17363, -105946, 122025, 89131, -282989, 465573, -17363, 67998, 48711, 165186, -230140, -66365, -66261, -102932, 121798, -91706, 83971, -150653, -24768, -29676, 12176, 58773, -138119, 42021, -65271, -3468, -458120, 166215, -42104, -176732, 70738]
11719A09468a30333C0087a36761r0504C19528E1472J22285B7888K37379d955G2687
11707B3849O060M8035g2086j0366B09056d2987E8828K01316R4f1368p3658M1480
11695i3546n0440A86808a06807C20084D4348i3077j070d1123e896j85694G7008
11683A50474b2261D05245A92715L2347g1753j47567J05972e5350I9569h9569k01354
11672b90923h2625c5234E4787M2726M9967b59937a08303C15227a5436p0729E2610
11660b6623A30797h3533H4732h2649B70251a93612d4312B9215O670c04187c6181
11648D57265A93024c29326d2932E5513J35204i9037b4844M312A73561e1357k20121
11637b71478B76146E0263J37187h3073A79254m0553i5519A23361n6548O7225b27029
$$ y = [109468, -130333, 30087, -136761, -227265, 319528, 51472, 173757, 27888, 265267, -4955, 72687, 23849, 29909, 77944, -72086, -82452, 209056, -42987, 58828, 260144, 260238, -61368, -135026, -93546, -143986, 186808, -106807, 320084, 44348, -93077, -94147, -41123, -5896, -191590, 77008, 150474, -22261, 405245, 192715, 225062, -71753, -219320, -113348, -55350, 99569, -89569, -290923, -82625, -35234, 54787, 97513, 147480, -259937, -108303, 315227, -15436, -86165, 52610, -26623, 130797, -83533, 84732, -82649, 270251, -193612, -44312, 29215, 35885, -304187, -36181, 457265, 193024, -329326, -42932, 55513, 190717, -99037, -24844, -20532, 173561, -51357, -271478, 276146, 50263, 187450, -83073, 179254, 138701, -95519, 123361, 66813, 134038, -227029]
11625F3775A2882c2772j54649L6300M1090B30317l8890g1759K6068a7064l10783
11614c27847B07748q2149a68324D1619P3596L0726e5400J5611j02675A85545a41779
11602B07211a71166a3477G3913P8188G0715K38508a16514C9644b2435C2865a1812
11590A00407K13818J00518j25123l0256j14655f2468B44670G5336C4366Q9020
11580A23386C3466c08258P7319A33212l2008a02998L845j71414c2868A63517J83340
11569C46857j23664q0111a34355n065C5057K06652E4662K59269c291D2297h0051
11557A96285b4977A80308O0249a2099B15064b1766A55702r152J62976F5836J17072
11546A82908d6833r330k17806A91253f23934a16075M3504A11055D1768c57948
$$ y = [63775, 12882, -32772, -187421, -151121, -110031, 230317, 191427, -71759, -45691, -17064, -327847, 207748, 125599, -168324, 41619, 115215, 145941, -55400, -39789, -142464, 185545, -141779, 207211, -171166, -13477, 73913, 152101, 70715, 309223, -116514, 39644, -22435, 32865, -11812, 100407, 314225, 414743, 289620, 259364, 144709, -62468, 244670, 75336, 34366, 123386, 33466, -308258, -230939, 133212, 101204, -102998, -99153, -270567, -32868, 163517, 346857, 223193, 143082, -134355, -139420, 35057, 241709, 54662, 313931, -3291, 42297, -80051, 196285, -24977, 180308, 240557, -12099, 215064, -21766, 155702, 146550, 309526, 65836, 182908, -46833, -56163, -273969, 191253, -623934, -116075, -72571, 111055, 41768, -357948]
11535D0845a25527I2971a555j81779e1245p8911F7846h73k96966B0658J27119
11524A47777a57874I7773e6981B82532D0046M1506K15993a88127B7508J60464
11514A87972J92565J44558r2576A47281B7269K33258L4745P2336B8103a07633
11503C53502A72908h6068B05309o9588j8012J68255d9379D35597A26080l4907
11493I1173Q1689J30575J2166a48047m3385B48509F8927c16635G5685J99466R5212
11482C70363G403J68934m3553K06070A21203J43562q4714J29299r2286r9793N4032
11471A71303c8994p9915C05564A20582a8983j02055j50451E94712D0314K5603
11461F5917M3751h1201A7527L13424F3832k5304e5861B709J01215g6163I9646
$$ y = [40845, -125527, 92971, -1555, -183334, -51245, -130156, 67846, -873, -297839, 20658, 147777, -157874, 97773, -56981, 282532, 40046, 81552, 297545, -188127, 27508, 187972, 380537, 525095, 432519, 147281, 27269, 260527, 295272, 367608, 28103, -107633, 353502, 172908, -86068, 205309, 135721, 117709, 285964, -49379, 435597, 126080, 91173, 172862, 303437, 315603, -148047, -191432, 248509, 68927, -316635, 75685, 275151, 370363, 7403, 176337, 132784, 338854, 121203, 264765, 180051, 309350, 217064, 117271, 171303, -38994, -118909, 305564, 120582, -18983, -121038, -271489, 594712, 40314, 65917, 109668, -81201, 17527, 330951, 63832, 38528, -55861, 2709, 103924, -76163, 99646]
11449c600B68662E1283a1634H3028p271d4139m7119A204h9248A58969a58039k0770
11437a78809A80434n5985O44a47015I7331K5878d4438B47330b1466j93417E3266
11425A37668J80654F1573f896J959A22217i2220A02996b65931j02033a1079A29643
11413b9837D4871l047b19540a7120k63565E7778O5510J65569a38937E1721b02493
11401C35805K8432D2518a1228G043a04137k56364c7679F334K01598a25788K0177
11390a05611A18129J06340j0798Q5204B4562c79276G3980C0338P8502b22411C50237
11378A51863K1068B3158a94639L3610P2649C42188A1616h4926E7219K30186b95950
11366a34996D0403J94688I9087K44178j07685o0651b08535j15272J6309B9654
$$ y = [-3600, 268662, 51283, -11634, 83028, 75757, -44139, -91258, 1204, -89248, 158969, -158039, -178809, 180434, 124449, 125093, -147015, 97331, 123209, -44438, 247330, -21466, -214883, 53266, 137668, 318322, 61573, -6896, -4937, 122217, -92220, 102996, -265931, -367964, -11079, 129643, -29837, 44871, 41824, -219540, -17120, -280685, 57778, 123288, 288857, -138937, 51721, -202493, 335805, 364237, 42518, -11228, 7043, -104137, -360501, -37679, 6334, 207932, -125788, -105611, 118129, 224469, 213671, 298875, 24562, -379276, 73980, 30338, 108840, -222411, 350237, 151863, 172931, 23158, -194639, -161029, -88380, 342188, 11616, -84926, 57219, 287405, -295950, -134996, 40403, 235091, 99087, 343265, 235580, 174929, -208535, -323807, -307498, 29654]
11355B6255J82310a29276N8619o9402C53082b48651D0230J15927l3206f7707A54480
11343H4061C6144i7351q0131g871p7232j99949I2564r502c02007a4544o0097j3527
11331h8168A94587a61025B64106b45136A46402a70149A69478b97975a7116j51262
11321a68378M6650A9263c9738A627P5295e7015a5957l51139B44697P209g5047
11309g7876m662I0468i0328c4551D0173g1852G9011g6988R971B1511a95222j09277
11297c04499A0148K48004b55105A19060c78730B10175m3099b1257r6043j07739
11287b25039b0208j55748e6472L124j16343b0154j74031j28249a35934G4409K1982
11276I6391D2016J02118c13514d838o255H8004R2776A3191b0079A97953E4972
$$ y = [26255, 208565, -129276, -70657, -140059, 353082, -248651, 40230, 156157, 122951, -67707, 154480, 84061, 36144, -97351, -177482, -7871, -85103, -285052, 92564, 83062, -302007, -14544, -74641, -88168, 194587, -161025, 264106, -245136, 146402, -170149, 169478, -297975, -17116, -168378, -121728, 19263, -39738, 1627, 76922, -57015, -15957, -367096, 244697, 251906, -75047, -77876, -82538, 90468, -90328, -34551, 40173, -71852, 79011, -76988, -67017, 21511, -195222, -304499, 10148, 258152, -255105, 119060, -378730, 210175, 167076, -21257, -117300, -225039, -20208, -175956, -56472, -53348, -169691, -20154, -194185, -322434, -135934, 74409, 96391, 42016, 144134, -313514, -4838, -11093, 88004, 180780, 13191, -20079, 197953, 54972]
11264A00316P2315h6578B8748L01860a14756m4824P5602j25870D7966K09631E0781
11252A25793K54977p6415F5305d0319A15987C4882R5948K20930c2122j64730O3284
11241a33568q3819B18652a74849B47558a12828p8813j45542B27210a42160A4805
11230h7837A28194a43066q8889k01782A2686J46901b10465L5395M690e1071C7530
11218A79431b99161d6696o2536b3647k38104A95851L3671d15982D7154a17926
11207C29889B7587i2988F4149c0094k88398B25742j07410J57321d77771O0333
11197d17438c8315o4317n9373k59621Q1397J27547A12613A6723J04630a44208
11186a20755k2696i713o7366B62100b1987C16179A27402J15847a46463A26863
$$ y = [100316, 172631, -86578, 28748, 330608, -114756, -159580, -83978, -209848, 47966, 257597, 50781, 125793, 380770, 304355, 65305, -40319, 115987, 34882, 130830, 351760, -32122, -196852, -133568, -217387, 218652, -174849, 247558, -112828, -191641, -337183, 227210, -142160, 14805, -87837, 128194, -143066, -231955, -433737, 12686, 159587, -210465, -175070, -170380, -51071, 37530, 179431, -299161, -46696, -109232, -23647, -261751, 195851, 229522, -415982, 47154, -117926, 329889, 27587, -92988, 64149, -30094, -318492, 225742, 118332, 275653, -477771, -417438, -38315, -102632, -162005, -421626, -340229, -212682, 112613, 16723, 121353, -144208, -120755, -143451, -9713, -77079, 262100, -21987, 316179, 127402, 243249, -146463, 126863]
11175A01406i8404l3714A0626a68191F1905b67063C06421C9536J8554A1379h692
11163F2511f4538A83123c09019B26200a34332K4560B4023K62399H479O5508B0055
11151a59796D660L85565d57557a46734A26736a08220j55480A22296j1926c72535
11140A73229E3250A4189K252a45871r2089c8323k53281c7949m68606D8209F184
11128c9207j02189L2721G1844b01312n5626Q7129H7975J1554a51194C25349l4282
11117B91067J28318c20494A62658p9566M4614R2779a72253B02880N8611n9816
11107B01675D9304K16778D2710O1090J07978e6911D80841G4980P9532L16926G9326
11095h6785r0509a4314C41474J38987H6496K13545Q941J47036A85776J81884A15364
$$ y = [101406, -98404, -132118, 10626, -168191, 61905, -267063, 306421, 39536, 58090, 11379, -8692, 62511, -64538, 183123, -309019, 226200, -134332, -109772, 24023, 286422, 8479, 73987, 20055, -159796, 4660, 390225, -457557, -146734, 126736, -108220, -263700, 122296, 110370, -372535, 173229, 53250, 14189, 16441, -145871, -237960, -38323, -291604, -37949, -506555, 48209, 6184, -39207, -141396, -108675, 71844, -201312, -256938, -169809, 87975, 99529, -151194, 325349, 291067, 419385, -320494, 162658, 83092, 127706, 220485, -172253, 202880, 261491, 201675, 49304, 266082, 42710, 103800, 211778, -56911, 480841, 74980, 154512, 471438, 79326, -86785, -177294, -14314, 341474, 480461, 86496, 300041, 308982, 456018, 185776, 367660, 115364]
11083b6873B98082a82111P6224B71117l9606L12471g293B27199P9671j29276J33532
11072C11126J85938p5982j81743M8235J76704I3955M96559j36519p1285M2601
11062D25311r2054M2866L68778k42731K73966l75000K12256A80162M62566L0084
11052F72812k60126O48993n10349l8220K6213N1610j0502j30731K13041k0958
11042F41783l04395L33550p3593j58994Q4203p8097J38387j37079J03669O0876
11032F10310A98837L59893l9507L7122K71145k63470K47140j97789B59393L76390
11022F35783o4221j11403R0696L9779P159L04783B82223J37346K4775J44614q0266
11011E08692j95842K86252J93168B51717K06466K08404j60096K74418P8877k34457
$$ y = [-26873, 298082, -182111, -105887, 271117, 231511, 543982, -7293, 227199, 306870, 177594, 311126, 497064, 421082, 239339, 287574, 464278, 93955, 590514, 453995, 382710, 425311, 333257, 376123, 744901, 502170, 776136, 401136, 613392, 180162, 642728, 672812, 412686, 1061679, 551330, 513110, 539323, 590933, 580431, 449700, 662741, 641783, 337388, 670938, 597345, 438351, 522554, 444457, 582844, 445765, 549434, 610310, 198837, 558730, 519223, 556345, 827490, 564020, 811160, 613371, 259393, 635783, 571562, 460159, 550855, 590634, 597793, 902576, 282223, 419569, 444344, 588958, 508692, 312850, 599102, 792270, 251717, 458183, 666587, 506491, 780909, 859786, 625329]
11001F25329j72405j41129P9114K03856k45181K93774R9709l54277q9698J83436
10991D82528j2278K06718J09268k65637K87279l90217M85906J83074m74183L27847
10981I40305k3358J76102J09819L748K02829K42691n2870P13506k22579J93749
10971B283942j39067N9510O2745k74435l58671K02191k70261R7426q4003k08154
10961A371223o6960J17346J32495j23897J30636J16529l27810j15421L02182o05863
10951I30460P5046l97743B73959P6705P76N6094p0369q3112J60435E7222J14280
10940A71502L3152l1182N7679B1523K83390K51529d0542J5821C9026Q0875J14647
10929B34548G361K52846d2254A1888M14093C9582c57295A42006C5522a2377B91230
$$ y = [625329, 452924, 311795, 390909, 594765, 349584, 643358, 743067, 388790, 299092, 482528, 470250, 676968, 786236, 520599, 807878, 417661, 903567, 1086641, 612458, 940305, 916947, 1093049, 1202868, 1206616, 1409445, 1652136, 1599266, 2312772, 2090193, 2283942, 2144875, 2204385, 2267130, 1992695, 1634024, 1836215, 1565954, 1663380, 1579377, 1371223, 1304263, 1421609, 1554104, 1430207, 1560843, 1677372, 1349562, 1234141, 1536323, 930460, 1005506, 607763, 273959, 350664, 351440, 407534, 337165, 254053, 414488, 57222, 171502, 204654, 173472, 231151, 21523, 304913, 556442, -40542, -24721, 39026, 119901, 234548, 7361, 260207, -42254, 11888, 425981, 39582, -357295, 142006, 35522, -12377, 291230]
10917C31005j23006q255A4698Q1705L9163C7480b47686N6414B99350a31947B85640
10905C74427I7511d3316j7842A73127b97181h1189C83374C9642f7154l58073d4730
10893E6777f3405A00779K32399j55089f6920j36511m5169A39225e6856j11742
10883a68598o8320C40473h090l02122C49213i1530b6839j73643o3132C3798b00322
10871I9040P1827c02796b9841q9357n6941j1905J231A09091J17985A03580A8000
10859e3523C0706h0550A12009K6061j1585E8004a92741L8112A4336a46089B51125
10847C3296P6967a82912L8838j1515P3069l4650j86908J03360A44277b69258A5107
10835a14111j84803E2970b02044A80199c55386J61939B03415c3966A16229b84249
$$ y = [331005, 207999, 199744, 14698, 96403, 135566, 37480, -247686, -191272, 299350, -131947, 285640, 374427, 97511, -43316, -61158, 173127, -297181, -81189, 383374, 39642, -67154, -425227, -44730, 56777, -63405, 100779, 333178, 178089, -66920, -203431, -248600, 139225, -56856, -168598, -236918, 340473, -8090, -310212, 349213, -91530, -26839, -200482, -263614, 33798, -200322, 99040, 170867, -302796, -29841, -119198, -176139, -188044, -186813, 109091, 227076, 103580, 18000, -53523, 30706, -80550, 112009, 138070, 126485, 58004, -192741, -154629, 14336, -146089, 251125, 33296, 110263, -182912, -144074, -155589, -82520, -117170, -304078, -200718, 144277, -269258, 15107, -114111, -298914, 52970, -202044, 180199, -355386, -193447, 203415, -33966, 116229, -284249]
10824E767L24781A3834e3040I4218b99884A1998d0112A48792G0420K0340b09102
10812d3246m9557k31840F0492d6168B13203a48205c5326m5330A77776a59827n0820
10801b10647Q1862n0782B45836m5267a40581A18256a65892B4024a93196B31258
10790A74765B491J86919a07016G3028a47557B12495F3385J1925J4358K2456B7140
10778B39479b94956H477a28493A28302m1086i6583m3868g665B7237J72447p1105
10767A28579C9336L59986a47249o6042C8447j2320K48334d2863m8797k1215b1551
10755C2252a29716j70109j33559d8672B6511L6945d0658B26092b33849A62789
10744B10100c66790J45359a9169A98913b65153a19268J1548A22694i8750A50048
$$ y = [5767, 330548, 13834, -53040, 94218, -299884, 11998, -40112, 148792, 70420, 90760, -209102, -43246, -92803, -324643, 60492, -46168, 213203, -148205, -35326, -80656, 177776, -159827, -210647, -128785, -179567, 245836, 200569, -140581, 118256, -165892, 24024, -193196, 231258, 174765, 2491, 189410, -107016, 73028, -147557, 212495, 63385, 75310, 89668, 112124, 27140, 239479, -294956, 8477, -128493, 128302, 87216, -96583, -140451, -7665, 27237, 199684, 128579, 39336, 399322, -147249, -213291, 38447, 26127, 274461, -42863, -91660, -112875, -21551, 32252, -129716, -299825, -433384, -48672, 26511, 63456, -40658, 226092, -233849, 162789, 210100, -366790, -221431, -19169, 198913, -265153, -119268, -107720, 122694, -98750, 150048]
10733f7708b2423A13186a43364F29a31993d129E9767j0936a02800F078L2818i6540
10720a35284I8405d3166C0614L08996K2764e1630n5774r2415J5481Q0425E6097
10708a68300K956k2399F5429l0971a27204c2813j57534A32480J36390h5813A82502
10696B79826a51057m0606l30379a87866K4996e6138m1028d2838I3754P8426a4672
10684b1338k3925j5546p3448J8080l8480A35972e9710D7097J38793g0183A61716
10672A19859K51438c03737A42266d72413A3359M0884p531k2697J23111a21614
10661A50912J02909r9777c3044B67105h9074C45011d64079b0709j65480e1722
10650h2660E0958a25343B97750e4030d06j0969B5943J22911a69242P2005q7090
$$ y = [-67708, -22423, 113186, -143364, 629, -131993, -4129, 59767, 48831, -102800, 6078, 38896, -96540, -135284, 98405, -43166, 30614, 339610, 362374, -51630, -107404, -199819, -184338, -103913, 56097, -168300, -165344, -187743, 65429, 34458, -127204, -32813, -190347, 132480, 268870, -85813, 182502, 279826, -151057, -191663, -522042, -187866, -162870, -56138, -97166, -42838, 93754, 172180, -14672, -21338, -45263, -60809, -134257, -116177, -154657, 135972, -59710, 47097, 185890, -70183, 161716, 119859, 371297, -303737, 142266, -472413, 13359, 54243, 46712, 24015, 147126, -121614, 150912, 253821, 154044, -33044, 267105, -89074, 345011, -464079, -20709, -186189, -51722, -82660, 50958, -125343, 297750, -54030, -406, -11375, 25943, 148854, -169242, -97237, -184327]
10639a84327L7431j80868J30695A23343b26896b4344F5752a18278c4748A17829
10628A95118C9847b75230J36615H4329b7151j63797j86998a32054M2848j19940
10618b09146h5181b4452k79033a44371o4809d0919B0923c02298f7668J7952B11029
10606b32695a14060c6821I6581c19069a10885A37943c13355J13139F75069A32949
10595a83289d0686m54766C23077d83339f1740j7033A39026C3131b0473H6195l7884
10584D8311J36131C3379R1581b15045E9875b95412J23873D50248a96065i7191
10573a79744d713F6622e0782A09185a12374n0986n5330N8652f6833j23525h6418
10561b49943l158E6063J21635b1750n9228k71770I6836Q5255b90106B25110q5948
$$ y = [-184327, -146896, -327764, -197069, 123343, -226896, -24344, 65752, -118278, -34748, 117829, 195118, 39847, -275230, -138615, 84329, -27151, -190948, -377946, -132054, -89206, -209146, -85181, -24452, -303485, -144371, -209180, -40919, 20923, -302298, -67668, -49716, 211029, -232695, -114060, -36821, 96581, -319069, -110885, 137943, -313355, -200216, 675069, 132949, -183289, -40686, -495452, 323077, -483339, -61740, -78773, 139026, 33131, -20473, 86195, 48311, 184442, 33379, 124960, -215045, 59875, -295412, -171539, 450248, -196065, -97191, -179744, -4713, 66622, -50782, 109185, -112374, -163360, -218690, -160038, -66833, -190358, -86418, -249943, -253101, 56063, 177698, -21750, -80978, -352748, 96836, 182091, -290106, 225110, 139162]
10550A39162a08701j34140B25854e940j60046A6941K25765a45430f6334A14258
10539A77232D0785a10235k5240M2623B44015J66630f1147F6040a89892J4742C0966
10527b80268G9538c8748m0852K5728q6603A64851g4064c746D6543b15247B08699
10515A73284A7817J7192J92941a17398A12467F60b71417J26853A72147D6093f409
10503a22353H3342f8782F7748b60834J2505A88376b12516j0496C70472e9903D4964
10491E4126J35980M2053B7721a44052I2053K54827e7098O411B92522O2880K47728
10480F03130j83441K1244i2621c0203C31046B3097L4976R4651A2342c36826B07902
10468F109c1181o1243j84985g9565o263k05091R2988j55031a56012B46795h5485
$$ y = [139162, -108701, -242841, 225854, -5940, -165986, 16941, 242706, -145430, -66334, 114258, 177232, 40785, -110235, -135475, -92852, 244015, 410645, -61147, 66040, -189892, -175150, 30966, -280268, 79538, -38748, -79600, -53872, -140475, 164851, -74064, -3746, 46543, -215247, 208699, 173284, 17817, 35009, 227950, -117398, 112467, 660, -271417, -144564, 172147, 46093, -6409, -122353, 83342, -68782, 67748, -260834, -248329, 188376, -212516, -223012, 370472, -59903, 44964, 54126, 190106, 232159, 27721, -144052, 92053, 346880, -57098, -50687, 292522, 355402, 603130, 419689, 440933, -92621, -30203, 331046, 23097, 58073, 152724, 12342, -336826, 207902, 6109, -31181, -92424, -277409, -79565, -85828, -290919, -197931, -352962, -156012, 246795, -85485]
10456b01450A69132p8345a42410O9281A92892g9238j16793A30770J4740b96077
10445a05638k3442l59921a11668B99141a29819b2349j36643A75758G0022J13942
10435A83964c13858A84845j1908c87244B06108a79278P6024b0136F25037g9571
10424b45453L2073B03903d38046J7292J05442C14486G6583a4402F7762h7147k4061
10413a11208J8951K6684j46560C36005a71462k03378g9331E1136a4317k27554
10403b41871B6609J40763a23249G1435G054b61968F6511C0693b71907C22556C4747
10391A1021j049J46267D6602P2592M4305b93697c3955B03793b3909B78244i8060
10379F6218J71836D707K20230J53184L48166I3400O1322k6642J76981A14215L9460
$$ y = [-201450, 169132, 90787, -142410, -73129, 192892, -79238, -196031, 130770, 145510, -296077, -105638, -129080, -489001, -111668, 299141, -129819, -22349, -158992, 175758, 70022, 183964, -313858, 184845, 172937, -387244, 206108, -179278, -103254, -20136, 625037, -79571, -245453, -213380, 203903, -438046, -420754, -315312, 314486, 76583, -14402, 67762, -87147, -111208, -92257, -65573, -212133, 336005, -171462, -374840, -79331, 51136, -14317, -241871, 26609, 167372, -123249, 71435, 7054, -261968, 66511, 30693, -271907, 322556, 34747, 11021, 9972, 156239, 46602, 119194, 163499, -293697, -33955, 203793, -23909, 278244, -98060, 66218, 238054, 4707, 224937, 378121, 726287, 93400, 154722, 128080, 305061, 114215, 153675]
10368A53675J53340J34658k4185p5970M0094J3021H0994R1922K62768j37102j10577
10357A88005d2566C75410j76176L7181J50368P3098A96292J78935M3711k9510
10347C89428j70193a70417e4276E18773m2067J4991A29373a480B80476j4267p0548
10336A95661A2466K66093H1195B2098P55d5753j08864A48638P7612C5115b09887
10324a7538j776m24805D03921r7742J64611A50630a42185A66311C5383J79487
10314B14870q7308D7660K36728a66812K1464n9004A79333p2138h3752B62062f6865
10302F0222b39603K0407C55103A26262b05184j24460A51293a67283m2337O5498
10292a44122G9106f0401A34863a09817k29432f7508E7696b11757F6334f4095G3235
$$ y = [153675, 307015, 441673, 417488, 341518, 381612, 394633, 80994, 172916, 435684, 298582, 188005, -42566, 375410, 199234, 236415, 386783, 459881, 196292, 375227, 418938, 389428, 219235, -170417, -54276, 518773, 476706, 491697, 129373, -1480, 280476, 266209, 195661, 12466, 278559, 81195, 22098, 22853, -45753, -154617, 148638, 226250, 35115, -209887, -17538, -19314, -444119, 403921, 306179, 470790, 150630, -142185, 166311, 35383, 214870, 127562, 47660, 284388, -166812, -145348, -204352, 179333, 107195, -83752, 262062, -66865, 60222, -239603, -219196, 355103, 126262, -205184, -329644, 151293, -167283, -209620, -144122, 79106, -60401, 134863, -109817, -339249, -67508, 57696, -211757, 66334, -64095, 73235]
10280a3381l00088e3284B42480c2866B61725c2087B68974a09078N2466A19224
10269C82932f6528C36934c64256d5638j30743j39883A54140K114o6318K05393
10259B95329J34588l4807j75500Q2334c3581k65815C45399a31702B12739d6152
10248b14820d7462j17034d2428j63329Q9678q1303A55751c01200J19511e9919
10237A36920D4779b85959a09273b3706F2300j3271a58643M7511L5286A39527b16606
10225d11045A34896B6357K55564a4631n2108H4615b19892L4374h9102B4878d32751
10213g5748C17756A41090F646a19179E8263a02210B68120H7199A445b81232a8955
10201c81725f4166k57957J09183Q2319B13228a41105C3045a14982C9860a99724
$$ y = [-13381, -313469, -53284, 242480, -32866, 261725, -32087, 268974, -109078, -56612, 119224, 382932, -66528, 336934, -364256, -45638, -176381, -316264, 154140, 156254, 89936, 295329, 429917, 395110, 219610, 301944, -33581, -299396, 345399, -131702, 212739, -46152, -214820, -47462, -164496, -42428, -205757, -116079, -197382, 155751, -301200, -181689, -59919, 136920, 44779, -285959, -109273, -23706, 62300, 49029, -158643, -111132, -75846, 139527, -216606, -411045, 134896, 26357, 281921, -14631, -66739, 84615, -219892, -185518, -89102, 24878, -432751, -75748, 317756, 141090, 6646, -119179, 58263, -102210, 268120, 87199, 1445, -281232, -18955, -381725, -64166, -322123, -212940, -130621, 213228, -141105, 33045, -114982, 39860, -199724]
10190c20104a16756j40969Q8765M0902k84362a01645B4844b55132D3012a09892
10179a1115B83779G8548a35578C6725J7129d24112a36153b4676k03046j28243
10169c55965J39987G5866M4719b58526J00045C1266a10110e1708q0850j12855
10159b45413a22297p3293J5490h6120m8956q5335h3030r5652A18420K4952B5314
10147a03339C29455a15211N5473F6303K1145b34577B98306B8638b26789B66451
10136a04279k39294A01869g4807j95872R3438G8086b31954h1680H3234q232j6304
10125E8698g0572E4784a71754E3283a98609G6446a95374h9638A38684c14945d3032
10113F8872d0072F4770J05233i5005a0639A01550k6310C2946h9836A42804a63435
$$ y = [-320104, -116756, -257725, -168960, -128058, -412420, -101645, 24844, -255132, 43012, -109892, -11115, 283779, 78548, -135578, 36725, 53854, -424112, -136153, -24676, -227722, -355965, -215978, 75866, 120585, -258526, -158481, 31266, -110110, -51708, -132558, -245413, -122297, -195590, -180100, -86120, -135076, -220411, -83030, -178682, 118420, 143372, 25314, -103339, 329455, -115211, -59738, 66303, 87448, -234577, 298306, 28638, -226789, 266451, -104279, -343573, 101869, -74807, -270679, -177241, 78086, -231954, -81680, 83234, 75002, 58698, -70572, 54784, -171754, 53283, -198609, 76446, -195374, -89638, 138684, -314945, -43032, 68872, -40072, 64770, 170003, -95005, -10639, 101550, 75240, 32946, -89836, 142804, -163435]
10101H018L6914J37054a22738j03114A9120b099j27060k8650g0808j37326A05869
10089e1718k8565F6605f9173K6449M351A85098K89012I1514c5381C03437d35745
10077C12395G427a48571L8425I72K26830G690J31392g2572j29273C26397b65431
10065A3458N5662a4852B1076a63799j1272e896k91490J44143n7669I7739a98063
10053b12787A00042l4167j3716b33116A16496a03834k5828k8431E6098A8679J14231
10042A32910e9279F3555h6289o9172n6379A53315b82136a18793L7395k57920a53323
10030c59065D0015a60644B43239K4117A6500a40279L2724A04698a84765N8544
10020a26221K184L9210C56542A26472d7349m68447h437B89685c93141h0605o1887
$$ y = [8018, 44932, 181986, -122738, -225852, 19120, -2099, -129159, -157809, -70808, -208134, 105869, -51718, -80283, 66605, -69173, -42724, -38373, 185098, 474110, 91514, -35381, 303437, -435745, 312395, 7427, -148571, -110146, 972, 227802, 7690, 139082, -72572, -201845, 326397, -265431, 13458, 69120, -14852, 21076, -163799, -175071, -5896, -297386, -153243, -210912, 97739, -198063, -212787, 100042, 65875, 52159, -233116, 116496, -103834, -129662, -158093, 56098, 18679, 132910, -59279, 63555, -86289, -155461, -211840, 153315, -282136, -118793, -81398, -339318, -153323, -359065, 40015, -160644, 243239, 267356, 16500, -140279, -107555, 104698, -184765, -126221, -124037, -84827, 356542, 126472, -47349, -515796, -8437, 289685, -393141, -80605, -142492]
10009a42492j53604a22174p0544L0809k12047F4516a66836e1323j20623c8075
9998G0537a97500m9398h2644k2978j867m71607a45295q8282a09195j20107F9699
9986a06569k696A09439K8779c42908E8886A5084a21193K1167A73302a09805L3389
9975g6416B22964b82721M6855A71121p459B7630a89678A27713a74003C06745e7039
9963a59726H6035D2547e7551A28984K21317C804a61212E4373a25985m7998B7013
9951h9044H5300b14695k2447C1999K5874c8590o1977F0895O7070K06936c4615
9939B67536k6182c76938O7358C49297c1503j90431G0556A43c07439C6043c98502
9927c55147d0313B6545K9012a51716j49041o5614J81755A52328b1025B92312p1091
$$ y = [-142492, -296096, -122174, -192718, -161909, -373956, 64516, -166836, -51323, -171946, -38075, 70537, -197500, -246898, -82644, -105622, -107489, -579096, -145295, -233577, -109195, -229302, 69699, -106569, -109265, 109439, 138218, -342908, 58886, 15084, -121193, -100026, 173302, -109805, -76416, 222964, -282721, -235866, 171121, 163662, 27630, -189678, 127713, -174003, 306745, -57039, -159726, 86035, 42547, -57551, 128984, 350301, 3804, -161212, 54373, -125985, -173983, 27013, -89044, 85300, -214695, -237142, 31999, 57873, -38590, -100567, 60895, 127965, 334901, -34615, 267536, 241354, -376938, -309580, 349297, -31503, -221934, 70556, 143, -307439, 36043, -398502, -355147, -40313, 26545, 55557, -151716, -300757, -366371, -184616, 152328, -21025, 292312, 221221]
9916B21221a03617d0215j49329i2643j4240J819A53802f5202o5164N5488A4164
9904d9579p5200j62322j33171A79680f0460C3814g2223A11557d6744k08614C2193
9892G9955h022j14810l63707b7703l68224e0007B44084e1896A31970d9316k7921
9881g7237l26181O0748O2727C88374I8573i6274r9A21535J13480n5479a95692
9869a85405d56C58883b21500O5572e4715a4641j41328B19897c4718a5623C2976
9857B50112e0151D1482a36885A4108J86076A730b36031q600K0405B490R6466a00786
9844G8958c3570k12894r7016A32670E4202L55675a03996A5301J79955a8577j91441
9833b10018P6359l5330b3670j4645l2833q6832I3977F521a57253A13244a77019
$$ y = [221221, -103617, -40215, -189544, -92643, -106883, -105064, 153802, -65202, -130366, -74878, 14164, -49579, -124779, -287101, -420272, 179680, -60460, 33814, -72223, 111557, -46744, -255358, 32193, 79955, -8022, -122832, -486539, -27703, -395927, -50007, 244084, -51896, 131970, -49316, -77237, -403418, -342670, -279943, 388374, 98573, -96274, -96373, 121535, 235015, 179536, -195692, -185405, -456, 358883, -221500, -155928, -54715, -14641, -155969, 219897, -34718, -15623, 32976, 250112, -50151, 41482, -136885, 14108, 200184, 1730, -236031, -244631, -224226, 2490, 98956, -100786, 78958, -33570, -246464, -343480, 132670, 54202, 409877, -103996, 15301, 195256, -18577, -210018, -133659, -168989, -23670, -38315, -71148, -157980, 93977, 6521, -157253, 113244, -177019]
9821c76546C75356b38646H6719A5396a93601B66142n6615a76075k20569a28679
9810a03807k98695H3902A0681i8914r3009B8676a2406B24586b6383B61847c1582
9798H6985f14998c5190A48011a98729L7602e2993A06874P2499b01473c4670j36512
9787a71182d3151G2783c65230G3176a32050m0757g6130C33365b09889H513a11802
9775a69640l5915M9394e2135l00998A18808c9459F7643a09495r87I6675a07671
9763h2265K485b5471k82726E1656h9124n1867F124c68065a5612o2304c2917l6969
9751f9886J6196j2513K8512J6053A54067g8710A40099a96603B31472d62436A7210
9739a16055B13816G7341a00506r0882Q7956B00558o8489a37968l1537A00042a8346
$$ y = [-376546, 375356, -238646, 86719, 15396, -193601, 266142, 209527, -176075, -396644, -128679, -103807, -402502, 83902, 10681, -98914, -191923, 28676, -12406, 224586, -26383, 261847, -31582, 86985, -614998, -35190, 148011, -198729, -161127, -52993, 106874, 179373, -201473, -34670, -171182, -43151, 72783, -365230, 73176, -132050, -172807, -76130, 333365, -209889, 8513, -111802, -169640, -205555, -156161, -52135, -353133, 118808, -39459, 67643, -109495, -110482, 96675, -107671, -82265, -79780, -25471, -308197, 51656, -89124, -140991, 6124, -368065, -15612, -77916, -32917, -69886, -53690, -66203, -37691, -21638, 154067, -78710, 140099, -196603, 231472, -462436, 17210, -116055, 213816, 77341, -100506, -191388, -103432, 200558, 132069, -137968, -169505, 100042, -18346]
9727h1847J4110l04635I8334b60399a08503A09813f3841j15155P0886C10506O1918
9716C72424A34663K13233i8783H7488b67512j9806C08158a47036A31115D9530
9705a87107r5165g5329D3601a74023h3695A13886b61866Q9126A27492D6121b41240
9693b66320B8099c36253f4783q9097p7955A33467m0883G744J48698a93470b140
9681a16270M3735E6729b85443D32448H2549N6929e8360B05511D2917i3263E0350
9669a2827G8370k9100d9845C9713J50030J41601a4821m6685D353N0519E383c89214
9656a23949F3575a22216b7358A70928g7436j22072j09687B49769f4831m2974k54818
9645c62623J72143M5457J326a8236l29822a67463D6621a09963j14608Q8218L0332
$$ y = [-81847, -67737, -372372, 98334, -260399, -108503, 109813, -63841, -178996, -108110, 310506, 372424, 134663, 347896, -98783, 87488, -267512, -287318, 308158, -147036, 131115, 49530, -187107, -282272, -75329, 43601, -174023, -83695, 113886, -261866, -172740, 127492, 46121, -241240, -266320, 28099, -336253, -64783, -153880, -231835, 133467, 92584, 7744, 156442, -193470, -2140, -116270, -72535, 56729, -285443, 432448, 82549, 139478, -58360, 205511, 42917, -93263, 50350, -12827, 78370, 49270, -49845, 39713, 189743, 331344, -14821, -61506, 4353, 54872, 5383, -389214, -123949, 63575, -122216, -27358, 170928, -77436, -199508, -309195, 249769, -64831, -107805, -362623, -190480, -145023, -143697, -18236, -348058, -167463, 46621, -109963, -224571, -136353, -106021]
9634a06021n33I4391b2014q3935M8509C4522a1173o8219A06578m5618r759O6565
9622A17766j1736J969c62314R5045r452c4046k07569a18020b2078l17283B06285
9610e8537R179A78872a19886J4977q0406E2871K01748J05594b87239j70738a2620
9598B45583j17374B3809M25505A53872d29719D3158h2456A42498J17285E7889
9587G4858b33574A86232E2153L2137J40653e3984m52013A08473d3369j90460A08171
9575G7K59492d19761E20972a67933J2954e0144D0727C024O2088J4386a30592D734
9562b16045n1038G4238b974r8408j14681d7980B75791A14185a72831B62054c57499
9550F2901d12007C5963K0964A3587a07788A89661J98913C2599b50957M5231A6577
$$ y = [-106021, -106554, 94391, -22014, -105949, -57440, 34522, -11173, -79392, 106578, 60960, 51201, 117766, 106030, 107999, -362314, -267269, -276721, -34046, -241615, -118020, -22078, -339361, 206285, -58537, -49358, 178872, -119886, -104909, -185315, 52871, 254619, 360213, -287239, -457977, -12620, 245583, 128209, 23809, 449314, 153872, -429719, 43158, -82456, 142498, 259783, 57889, 74858, -233574, 186232, 52153, 84290, 224943, -53984, -505997, 108473, -43369, -233829, 108171, 77, 259569, -419761, 520972, -167933, -154979, -50144, 40727, 3024, 65112, 79498, -130592, 4734, -216045, -267083, 74238, -2974, -101382, -216063, -47980, 275791, 114185, -172831, 262054, -357499, 62901, -412007, 35963, 56927, 13587, -107788, 189661, 388574, 32599, -250957, -205726, 16577]
9538e8374j4365r2970B0267K32998l2257C3461K35098c97448A52904C5829b02751
9526A45487c62063M3378F9881b26281J5202a9970j59247o9153C11501B0356h5907
9514e0107G1193N8486c1466p0542A13137C9505J12710M9051i3428j24298b3750
9502C8678a08685B01000n8930f0020j58699f3733A61646g8268k36667i2711K7443
9491f5268p5708k54811b0200k00449n29j97906Q4923Q8032f2251J2044A4125J3397
9479B7522Q3463f6928A92051e4820j7797A27890c12918a0145r0641k73982J72554
9468b02214Q4005D4402J48376b35556l15783D8180M6651e5435A45530a57242F6654
9456B0758N6065L3540c51219B8086c37537q8628a83570A21084j6474B6995R9375
$$ y = [-58374, -72739, -165709, 20267, 253265, 221008, 33461, 268559, -397448, 152904, 35829, -202751, 145487, -362063, -318685, 69881, -226281, -211079, -19970, -179217, -248370, 311501, 20356, -85907, -50107, 71193, 129679, -31466, -102008, 113137, 39505, 152215, 201266, -93428, -217726, -23750, 38678, -108685, 201000, 142070, -60020, -218719, -63733, 161646, -78268, -314935, -92711, -65268, -140976, -395787, -20200, -220649, -221178, -419084, -334161, -246129, -62251, -50207, 14125, 27522, 110985, -66928, 192051, -54820, -72617, 127890, -312918, -10145, -100786, -374768, -202214, -118209, 44402, 192778, -235556, -551339, 48180, 94831, -55435, 145530, -157242, 66654, 20758, 76823, 110363, -351219, 28086, -337537, -426165, -183570, 121084, 104610, 26995, 126370]
9445A26370a41193C13231e8250C4934a44804k34651a24883N5742a3603q4875E7599
9433a77315B83128b57729l589J14237A3457M1825f1075F5284d881l04578J22165
9422a87294f4539j83511e6163a3736B28938a20341k44464D1773g9343k26597h8100
9410b38376j15905g3956A14260e6814k18229B0907c34112E0719J22270a09849
9399c66063E010g4096m53641A28515a22715D850P3524B8819J43659G1944i4191
9387d5967l62531d8070n0845c4388j00788J0707l0297d4060j76198l9441A17508
9375A53991C6521P9868J30611a63308A92334I1537R7170a30806L7604M5737A21645
9363A15072A2574J02643k28G939M774b8195l730J0611m1332K4571j92268A45383
$$ y = [126370, -141193, 313231, -58250, 34934, -144804, -379455, -124883, -69141, -13603, -98478, 57599, -177315, 283128, -257729, -261318, -147081, 13457, 55282, -61075, 65284, -4881, -309459, -187294, -64539, -248050, -56163, -13736, 228938, -120341, -364805, 41773, -79343, -305940, -88100, -238376, -354281, -73956, 114260, -56814, -275043, 20907, -334112, 50719, 172989, -109849, -366063, 5010, -74096, -527737, 128515, -122715, 4850, 78374, 28819, 172478, 71944, -94191, -45967, -408498, -48070, -98915, -34388, -135176, -124469, -154766, -44060, -220258, -259699, 117508, 153991, 36521, 116389, 247000, -163308, 192334, 91537, 188707, -130806, -93202, -47465, 121645, 115072, 12574, 115217, 114989, 7939, 12713, -28195, -31925, -21314, -62646, -38075, -230343, 145383]
9350d88907A66842g577D2875M4179a63843K6409E3381b5755B07773c43940C59955
9338g6154A7070b86924A22639J29776c13381I5283h9462D69290H652a24489n5799
9327a80288A08329J45213a8118B29120d47446a25640c1571j54124j00767k3182
9317c09644A95841a87014k83m36260d937j67462m9972j54124A24898b29982O1280
9306a68702q2717N4700r7726m2953i3712D0440a82453A58013e3261r0764k37930
9295c81955J06152i7375A24345b76246N7145j46004J69479N6933j21777B76269
9284D0290b56834A38431n9686c62116h2207A15497J45559d4404C06312I3155l6661
9273E6494Q1796c20927A115f6752A00546a60458D5798b1099j21456l32107f160
$$ y = [-488907, 166842, -7577, 42875, 87054, -163843, -137434, 53381, -25755, 207773, -343940, 359955, -76154, 17070, -286924, 122639, 252415, -313381, 95283, -89462, 469290, 8652, -124489, -180288, 108329, 253542, -18118, 229120, -447446, -125640, -31571, -185695, -286462, -309644, 195841, -187014, -187297, -623557, -4937, -172399, -222371, -376495, 124898, -229982, -168702, -251419, -196719, -294445, -337398, -93712, 40440, -182453, 158013, -53261, -144025, -381955, -275803, -97375, 124345, -276246, -219101, -365105, -195626, -138693, -260470, 276269, 40290, -256834, 138431, 78745, -362116, -82207, 115497, 261056, -44404, 306312, 93155, 56494, 138290, -320927, 1115, -66752, 100546, -160458, 45798, -21099, -142555, -474662, -6160]
9261A59037d2677B39443b14227J8832A24201j4810a64294P6758A38735l9520c32609
9249C0767b10165b8201k25677a5432k34149a20904a2192A83588j1402p8543b2935
9237B3086L7244g6317A56201h691q223j32308C3747b28425c4590m14837F6678
9225i3153B7064c046k11600F9197p37b51404A4869J35800M3634b125E2081J16511
9213A68592A1296m544b3251A88325D9851P9278f7116k9802M0030k6363A34976
9201d5845A35899b06336A89088E371K01279E9066b25299j2714a14383A3809L86776
9190D00585A65003c99925c2822A533M9693O6653M4551D3226a37096o7984O7565
9179a37515q6426Q7534j96788g328k2562l05274I1542a99386G6454R7350C0190
$$ y = [159037, -42677, 239443, -214227, -195395, 124201, 109391, -164294, -87536, 138735, 99215, -332609, 30767, -210165, -28201, -253878, -15432, -249581, -120904, -12192, 183588, 172186, 93643, -22935, 23086, 60330, -76317, 156201, -8691, -16914, -149222, 33747, -228425, -34590, -449427, 66678, -93153, 27064, -3046, -214646, 69197, 68460, -251404, 14869, 150669, 194303, -2125, 52081, 168592, 11296, 6752, -23251, 188325, 49851, 129129, -67116, -96918, -56888, -83251, 134976, -45845, 135899, -206336, 189088, 5371, 206650, 59066, -225299, -238013, -114383, 13809, 400585, 165003, -399925, -32822, 1533, 51226, 117879, 162430, 43226, -137096, -205080, -137515, -223941, -136407, -333195, -7328, -29890, -335164, 91542, -199386, 76454, 173804, 30190]
9167c61695a15944j03358A97122A1156a61812j42795B40162c11218e6237j63047
9157b19284A47823b32456l9639D2259L7267a68519A82145d62729g8179L0825C1377
9145a93917d8688n0814d7015A88132J35690E8270f201A68472j8375A1861b37227
9133A82218b5317l0918k7645j0117H5002h8774k35644b8688j24115p1887A06562
9121b36252P5856A96082C5585b29527R2329D2277d7721j93541A5504N3743b12773
9109a28612b4557A88462A6418K1743I115d4620A88870q086a23869M8704A00104
9097d0704p2872j0258p2922E1829d46960A19769m5708Q8754l158L170a57554L0151
9085a27403j81770H9986e1221D169h3829k41049b3695j77538A3569K5374J07548
$$ y = [-361695, -115944, -219302, 197122, 11156, -161812, -304607, 240162, -311218, -56237, -219284, 147823, -232456, -272095, 42259, 79526, -168519, 182145, -462729, -78179, -47354, 31377, -193917, -48688, -99502, -47015, 188132, 323822, 58270, -6201, 168472, 150097, 11861, -237227, 182218, -25317, -56235, -83880, -93997, 85002, -88774, -324418, -28688, -152803, -224690, 106562, -236252, -160396, 196082, 35585, -229527, -137198, 42277, -47721, -241262, 15504, 69247, -212773, -128612, -24557, 188462, 16418, 38161, 9115, -44620, 188870, 180784, -123869, -75165, 100104, -40704, -113576, -123834, -196756, 51829, -446960, 119769, 74061, 162815, 159657, 162827, -157554, -127403, -309173, 89986, -51221, 4169, -83829, -324878, -23695, -201233, 13569, 38943, 146491]
9074A46491b36506j68425J98828p5992j5427A14732J22558b35319N7671L1387
9064a46261J1678n4978k02405D4023d10170d3228C909c62476g3753I7367i8197
9052a88323O184k27553a9022j31183B20058b84259A39804L64839a90235i3322
9041c18006J14928g6896b4059j59889k22610J68191b0933I552M3970b39615q4841
9030c24456a11491D9891b7370C0482L36940o9702a67569H2065f6657M496H4004
9018B06124b12416g4839K7011j92532P5268A63969e8796o2331a9267p515m3018
9007f9800K4927j51751o5253H2592a7548j26597l1820j36926P5775d1670E8165
8995I0188i4794B29616j4606a798E2828O5927O0407b04331A39443h4526j03722
$$ y = [146491, -236506, -404931, -206103, -282095, -297522, 114732, 237290, -235319, -177648, -146261, -134583, -189561, -391966, 44023, -410170, -43228, 3909, -362476, -73753, 97367, -98197, -188323, -182139, -409692, -19022, -150205, 220058, -284259, 139804, 504643, -190235, -93322, -318006, -203078, -76896, -24059, -183948, -406558, -238367, -20933, 9552, 53522, -239615, -324456, -111491, 49891, -27370, 30482, 367422, 297720, -167569, 82065, -66657, -62161, 84004, 206124, -212416, -74839, -47828, -240360, -165092, 163969, -58796, -121127, -19267, -26782, -69800, -44873, -196624, -261877, 82592, -17548, -144145, -175965, -312891, -237116, -41670, 58165, 90188, -94794, 229616, 215010, -1798, 52828, 118755, 179162, -204331, 139443, -84526, -188248]
8984a88248A80931b20971g9238L7228j76130e3601A51886c01562J6148i08C8647
8972D6575O185k0244J43591D0624c7195j45444E1881L3892e7257j22286A4361
8960d9128B0068a87223k59166J41160a33042f270r8666G6954a67752A9090a27702
8948E400e10305K02983F3884c07156F4544a46246A12815a61170P8826K2732o5033
8937a24645c4106p3202E3088a4018j0196F7387c5169B0723r8J16126N2549f0743
8924A12003O30261Q43163M465720k769319A151934B98596m5904A02713J99858
8915C02571A10021B7725a13675H2774d80062A47174E2749i4719B86849H382K842
8904A1224b07626g6019l62920A00333J0885j5040a72850j55752J61477C0455c1986
$$ y = [-188248, 180931, -220971, -79238, -42010, -218140, -53601, 151886, -301562, -285414, -908, 38647, 46575, 52760, 32516, 176107, 40624, -37195, -182639, 51881, 85773, -57257, -179543, 14361, -49128, 20068, -187223, -446389, -305229, -133042, -6270, -104936, 76954, -167752, 19090, -127702, 5400, -510305, -307322, 63884, -307156, 64544, -146246, 112815, -161170, -82344, -59612, -124645, -34106, -107308, 53088, -14018, -24214, 67387, -35169, 20723, 20625, 136751, 189300, -60743, 112003, 742264, 1585427, 6051147, 3281828, 1151934, 298596, 252692, 102713, 302571, 110021, 27725, -113675, 82774, -480062, 147174, 52749, -94719, 286849, 8382, 11224, -207626, -76019, -438939, 100333, 111218, 96178, -172850, -328602, -167125, 30455, -31986]
8892b17590c2414l2687F1315a79348A34406g3355I5416b0697j10731C16031h1667
8880a11995q1687L7655m6320R2197B8019b0581l1163j19899h0098H6107J69441
8869B55548b6076k57382D3160a7182B09083G0892b23437j9656Q1061K2199O4502
8858g5331k10225B58891q5856e9940B53426p6801F0146b29791J5162d6427A308
8846B19761F1109a77149g0618k64739i9638A23868J83390a53452j18698d2233
$$ y = [-217590, -32414, -65101, 61315, -179348, 134406, -73355, 95416, -20697, -131428, 316031, -81667, -111995, -193682, -156027, -202347, -110150, 28019, -20581, -51744, -171643, -80098, 86107, 255548, -26076, -283458, 43160, -17182, 209083, 70892, -223437, -243093, -162032, -139833, -75331, -285556, 258891, 173035, -59940, 253426, 176625, 60146, -229791, -214629, -46427, 1308, 219761, 61109, -177149, -70618, -335357, -99638, 123868, 307258, -153452, -272150, -42233]
$$ [...]
##END NTUPLES=NMR SPECTRUM
##END=
