##TITLE=AC1678_CTIAH14386_8571367_QHY9PKHRzM
##JCAMPDX= 6.0         $$ Bruker NMR JCAMP-DX V2.0
##DATA TYPE= NMR SPECTRUM
##DATA CLASS= NTUPLES
##ORIGIN= BRUKER
##OWNER= Administrator
$$ 1.72 TOPSPIN		Version 2.1
$$ 2014-04-11 23:29:32.368 -0700  Administrator@X
$$ Compression mode = diff/dup
##.OBSERVE FREQUENCY= 400.02188249412
##.OBSERVE NUCLEUS= ^1H
##.ACQUISITION MODE= SIMULTANEOUS (DQD)
##.ACQUISITION SCHEME= undefined
##.AVERAGES= 64
##.DIGITISER RES= 22
##SPECTROMETER/DATA SYSTEM= spect
##.PULSE SEQUENCE= noesygpps1d.comp
##.SOLVENT NAME= COFFEE_meoh
##.SHIFT REFERENCE= INTERNAL, COFFEE_meoh, 1, 14.96071
##AUDIT TRAIL= $$ (NUMBER, WHEN, WHO, WHERE, PROCESS, VERSION, WHAT)
$$ ##TITLE= Audit trail, TOPSPIN		Version 2.1
$$ ##JCAMPDX= 5.01
$$ ##ORIGIN= Bruker BioSpin GmbH
$$ ##OWNER= Administrator
$$ $$ E:\/data/COFFEE/nmr/AC1678_CTIAH14386_8571367_QHY9PKHRzM/12/pdata/1/auditp.txt
$$ ##AUDIT TRAIL=  $$ (NUMBER, WHEN, WHO, WHERE, PROCESS, VERSION, WHAT)
(   1,<2014-04-11 23:29:27.071 -0700>,<Administrator>,<X>,<go>,<TOPSPIN 2.1>,
      <created by zg
	started at 2014-04-11 23:17:57.196 -0700,
	POWCHK enabled, PULCHK disabled,
       configuration hash MD5:
       C8 4E 4E 5D D3 5C D8 9E 9F 52 82 E0 59 8A DE 15
       data hash MD5: 64K
       58 6F 50 46 E4 D3 AF 06 CD 7F C6 B0 3B F2 6C 25>)
(   2,<2014-04-11 23:29:30.133 -0700>,<Administrator>,<X>,<proc1d>,<TOPSPIN 2.1>,
      <Start of raw data processing
       efp LB = 0.3 FT_mod = 6 PKNL = 1 PHC0 = 0 PHC1 = 0 SI = 128K 
       data hash MD5: 128K
       2C DE 86 FB 61 35 98 5F 8D A3 B5 1D 75 05 F7 B7>)
(   3,<2014-04-11 23:29:31.180 -0700>,<Administrator>,<X>,<proc1d>,<TOPSPIN 2.1>,
      <pk PHC0 = -82.53479 PHC1 = 0 
       data hash MD5: 128K
       DB 7C 37 81 69 30 1C 84 CC 62 83 AF 9E 30 FA 00>)
(   4,<2014-04-11 23:29:31.665 -0700>,<Administrator>,<X>,<proc1d>,<TOPSPIN 2.1>,
      <abs ABSG = 1 
       data hash MD5: 128K
       A7 72 7A E6 50 F8 40 AF B5 BE C4 03 47 50 2C 53>)
(   5,<2014-04-11 23:29:31.821 -0700>,<Administrator>,<X>,<proc1d>,<TOPSPIN 2.1>,
      <abs ABSG = 2 
       data hash MD5: 128K
       49 8C 55 BC 72 F1 44 D0 3C 6B F8 FD 51 82 FC DE>)
(   6,<2014-04-11 23:29:31.930 -0700>,<Administrator>,<X>,<proc1d>,<TOPSPIN 2.1>,
      <abs ABSG = 3 
       data hash MD5: 128K
       BA 57 CC 60 70 3B A8 56 E6 A9 EE 7C 7B A9 F9 00>)
(   7,<2014-04-11 23:29:32.055 -0700>,<Administrator>,<X>,<proc1d>,<TOPSPIN 2.1>,
      <abs ABSG = 4 
       data hash MD5: 128K
       CC 89 4B FE EA BA CD 06 76 15 6D D9 C9 C0 8C 5F>)
(   8,<2014-04-11 23:29:32.165 -0700>,<Administrator>,<X>,<proc1d>,<TOPSPIN 2.1>,
      <abs ABSG = 5 
       data hash MD5: 128K
       26 1F DC BA 8B 62 E9 82 BE 36 80 71 3F EA 5E B2>)
$$ ##END=
$$ 
$$ $$ hash MD5
$$ $$ 2B DB 79 06 59 91 E6 5E 0E B9 75 ED 9B 50 7B 18
##$RELAX= 
##$RELAX= 
##$RELAX= 
##$RELAX= 
##$RELAX= 
##$RELAX= 
##$RELAX= 
##$RELAX= 
$$ Bruker specific parameters
$$ --------------------------
##$DU= <E:\>
##$EXPNO= 12
$$ [...]
##$TP07= 0
##$TPNAME0= <>
##$TPNAME1= <>
##$TPNAME2= <>
##$TPNAME3= <>
##$TPNAME4= <>
##$TPNAME5= <>
##$TPNAME6= <>
##$TPNAME7= <>
##$TPOAL= (0..7)
0.5 0.5 0.5 0.5 0.5 0.5 0.5 0.5
##$TPOFFS= (0..7)
0 0 0 0 0 0 0 0
##$TUNHIN= 0
##$TUNHOUT= 0
##$TUNXOUT= 0
##$USERA1= <user>
##$USERA2= <user>
##$USERA3= <user>
##$USERA4= <user>
##$USERA5= <user>
##$V9= 5
##$VALIST= <valist>
##$VCLIST= <CCCCCCCCCCCCCCC>
##$VD= 0
##$VDLIST= <DDDDDDDDDDDDDDD>
##$VPLIST= <PPPPPPPPPPPPPPP>
##$VTLIST= <TTTTTTTTTTTTTTT>
##$WBST= 1024
##$WBSW= 4
##$XGAIN= (0..3)
0 0 0 0
##$XL= 0
##$YL= 0
##$YMAX_a= 6105542
##$YMIN_a= -12440893
##$ZGOPTNS= <>
##$ZL1= 120
##$ZL2= 120
##$ZL3= 120
##$ZL4= 120
##$ABSF1= 14.96071
##$ABSF2= -5.597472
##$ABSG= 5
##$ABSL= 3
##$ALPHA= 0
##$AQORDER= 0
##$ASSFAC= 0
##$ASSFACI= 0
##$ASSFACX= 0
##$ASSWID= 0
##$AUNMP= <proc_prof1d_extract.lims>
##$AXLEFT= 0
##$AXNAME= <>
##$AXNUC= <1H>
##$AXRIGHT= 0
##$AXTYPE= 0
##$AXUNIT= <>
##$AZFE= 0.1
##$AZFW= 0.1
##$BCFW= 0
##$BC_mod= 0
##$BYTORDP= 0
##$COROFFS= 0
##$CY= 15
##$DATMOD= 1
##$DC= 0
##$DFILT= <>
##$DTYPP= 0
##$F1P= 0
##$F2P= 0
##$FCOR= 0.5
##$FTSIZE= 131072
##$FT_mod= 6
##$GAMMA= 0
##$GB= 0
##$INTBC= 1
##$INTSCL= 1
##$ISEN= 128
##$LB= 0.3
##$LEV0= 0
##$LPBIN= 0
##$MAXI= 10000
##$MC2= 0
##$MEAN= 0
##$ME_mod= 0
##$MI= 0
##$NCOEF= 0
##$NC_proc= -2
##$NLEV= 6
##$NOISF1= 0
##$NOISF2= 0
##$NSP= 0
##$NTH_PI= 0
##$NZP= 0
##$OFFSET= 14.96071
##$PC= 1
##$PHC0= -82.53479
##$PHC1= 0
##$PH_mod= 1
##$PKNL= yes
##$PPARMOD= 0
##$PPDIAG= 0
##$PPIPTYP= 0
##$PPMPNUM= 2147483647
##$PPRESOL= 1
##$PSCAL= 4
##$PSIGN= 0
##$PYNMP= <proc.py>
##$REVERSE= no
##$SF= 400.020009751434
##$SI= 131072
##$SIGF1= 0
##$SIGF2= 0
##$SINO= 400
##$SIOLD= 131072
##$SPECTYP= <>
##$SREGLST= <1H.CDCl3>
##$SSB= 0
##$STSI= 131072
##$STSR= 0
##$SW_p= 8223.68421052631
##$SYMM= 0
##$S_DEV= 0
##$TDeff= 65536
##$TDoff= 0
##$TI= <>
##$TILT= no
##$TM1= 0
##$TM2= 0
##$TOPLEV= 0
##$USERP1= <user>
##$USERP2= <user>
##$USERP3= <user>
##$USERP4= <user>
##$USERP5= <user>
##$WDW= 1
##$XDIM= 131072
##$YMAX_p= 385809352
##$YMIN_p= -10944
##$CURPLOT= <Network HP LaserJet P1505>
##$CURPRIN= <$Network HP LaserJet P1505>
##$DFORMAT= <normdp>
##$LAYOUT= <+/1D_H.xwp>
##$LFORMAT= <normlp>
##$PFORMAT= <normpl>
##$SURQMSG= 1
$$ End of Bruker specific parameters
$$ ---------------------------------
##NTUPLES= NMR SPECTRUM
##VAR_NAME=  FREQUENCY,     SPECTRUM/REAL,   SPECTRUM/IMAG
##SYMBOL=    X,             R,               I
##VAR_TYPE=  INDEPENDENT,   DEPENDENT,       DEPENDENT
##VAR_FORM=  AFFN,          ASDF,            ASDF
##VAR_DIM=   131072,        131072,          131072
##UNITS=     HZ,            ARBITRARY UNITS, ARBITRARY UNITS
##FACTOR=    0.0627417313425164, 1,          1
##FIRST=     8223.62146879497, -130,         -50349
##LAST=      0,             754,             -50952
##MIN=       0,             -10944,          0
##MAX=       8223.62146879497, 385809352,    0
$$ Real data points
##PAGE= N=1
##DATA TABLE= (X++(R..R)), XYDATA
$$ [...]
$$ plain form
61544 315351 315626 316979 319102 321117 322410 323097 323556 323944 324461 325683 328060 331209 334131 336057 336814 336579
61528 336579 335728 334775 334042 333416 332731 332184 331958 331615 330442 328392 326142 324209 322559 321129 320179 319837 319708
61511 319708 319278 318485 317697 317284 317356 317770 318244 318527 318484 318059 317296 316500 316095 316082 315912 315156 314056 313046 312116
61492 312116 311184 310819 311812 314000 316181 317349 317467 316958 316113 315302 315191 316300 318533 321366 324248 326750
61476 326750 328646 330027 331063 331621 331450 330730 329971 329323 328558 327833 327834 328845 330222 331161 331555 331701 331630 331238
61458 331238 330752 330550 330676 330898 331115 331380 331735 332367 333698 335922 338537 340670 341784 341884 341272 340455 340099
61441 340099 340619 341770 342986 344142 345714 348164 351385 354799 357854 360370 362477 364267 365548 366065 365943
61426 365943 365685 365667 365887 366266 366882 367726 368525 369167 370089 371859 374404 376967 378850 379991 380815 381672 382451
$$ packed form
61544C15351K75J353K123K015J293O87M59L88N17J222K377L149K922J926P57k35
61528C36579q51r53p33o26o85n47k26l43j173k050k250j933j650j430r50l42j29
61511C19708m30p93p88m13P2M14M74K83m3m25p63p96m05j3j70p56j100j010r30
61492C12116r32l65R93K188K181J168J18n09q45q11j11J109K233K833K882K502
61476C26750J896J381J036N58j71p20p59o48p65p25JJ011J377R39L94J46p1l92
61458C31238m86k02J26K22K17K65L55O32J331K224K615K133J114J00o12q17l56
61441C40099N20J151J216J156J572K450L221L414L055K516K107J790J281N17j22
61426C65943k58j8K20L79O16Q44P99O42R22J770K545K563J883J141Q24Q57P79
$$ plain form
61409 382451 382638 381805 380076 377995 375904 373696 371313 369151 367644 366601 365409 363861 362386 361333 360400
61394 360400 359042 357271 355708 354893 354761 354877 354970 355098 355412 356006 356929 358082 359103 359629 359869 360552 362118
61377 362118 364159 365997 367546 369199 371073 372856 374389 375900 377564 379266 380848 382234 383247 383778
61363 383778 384271 385524 387750 390236 392271 394053 396343 399505 403306 407468 411994 416957 422302 427938
61349 427938 433879 440278 447356 455122 463108 470515 476803 482049 486666 490897 494733 498129 501130 503767
61335 503767 505987 507712 509019 510160 511256 511935 511606 510328 509054 508562 508439 507641 505897 503924 502305
61320 502305 501016 500184 500497 502463 505834 510098 515024 520455 526229 532682 540567 549918 559664 569050 578872
61305 578872 590427 603649 617209 630260 643070 655806 667567 676979 683203 686046 685597 682151 676283
$$ packed form
61409C82451J87q33j729k081k091k208k383k162j507j043j192j548j475j053r33
61394C60400j358j771j563q15j32J16R3J28L14N94R23J153J021N26K40O83J566
61377C62118K041J838J549J653J874J783J533J511J664J702J582J386J013N31
61363C83778M93J253K226K486K035J782K290L162L801M162M526M963N345N636
61349D27938N941O399P078P766P986P407O288N246M617M231L836L396L001K637
61335E03767K220J725J307J141J096O79l29j278j274m92j23p98j744j973j619
61320E02305j289q32L13J966L371M264M926N431N774O453P885R351R746R386R822
61305E78872J1555J3222J3560J3051J2810J2736J1761R412O224K843m49l446n868
$$ plain form
61292 676283 668702 660027 650701 640990 631037 621068 611439 602360 593730 585527 578123 571845 566317 560736
61278 560736 554916 549660 545977 544176 543837 544419 545666 547596 550282 553695 557710 562199 566995 571703 575754
61263 575754 578833 581241 583756 587250 592451 599734 608775 618527 627777 635773 642275 647247 650747 652932
61249 652932 653832 653254 651169 648099 644800 641658 638585 635450 632251 628944 625470 622039 619177 617343 616584
61234 616584 616527 616687 616946 617837 620225 624449 629939 635822 641749 647880 654332 661026 667963 675172 682363
61219 682363 689082 695336 701804 709208 717650 726638 735521 743792 751133 757451 762847 767416 771008 773354
61205 773354 774617 775745 777951 781650 786170 790846 796214 803598 813581 825494 838532 852670 868008
61192 868008 883796 898808 912502 925206 937154 947826 956304 961977 964869 965562 964919 963670 962146
$$ packed form
61292F76283p581q675r326r711r953r969r629r079q630q203p404o278n528n581
61278E60736n820n256l683j801l39N82J247J930K686L413M015M489M796M708M051
61263E75754L079K408K515L494N201P283R041R752R250P996O502M972L500K185
61249F52932R00n78k085l070l299l142l073l135l199l307l474l431k862j834p59
61234F16584n7J60K59Q91K388M224N490N883N927O131O452O694O937P209P191
61219F82363O719O254O468P404Q442Q988Q883Q271P341O318N396M569L592K346
61205G73354J263J128K206L699M520M676N368P384R983J1913J3038J4138J5338
61192H68008J5788J5012J3694J2704J1948J0672Q478N673K892O93o43j249j524
$$ plain form
61179 962146 960275 957673 953746 948078 940886 932814 924092 914234 902842 890316 877373 864230 850772
61166 850772 837241 824065 811017 797235 782285 766761 751612 737194 723254 709618 696635
61155 696635 685004 675315 667724 661923 657411 653840 651271 650178 651060 653822 657497 660679 662198 661320
61141 661320 657695 651684 644673 638355 633474 629631 626394 623973 622665 622431 623464 626574 632335 640229
61127 640229 649188 658754 669284 681345 695359 711526 729628 749199 770168 792973 817589 843067
61115 843067 868617 894722 922327 951266 980256 1008275 1035143 1060839 1085035 1107438 1127973
61104 1127973 1146481 1162728 1176710 1188418 1197203 1201870 1201596 1196487 1187223 1174461 1158611 1139957
61092 1139957 1118867 1095926 1071743 1046640 1020853 994966 969600 944643 919574 894797 871732
$$ packed form
61179I62146j871k602l927n668p192q072q722r858j1392j2526j2943j3143j3458
61166H50772j3531j3176j3048j3782j4950j5524j5149j4418j3940j3636j2983
61155F96635j1631r689p591n801m512l571k569j093Q82K762L675L182J519q78
61141F61320l625o011p011o318m881l843l237k421j308k34J033L110N761P894
61127F40229Q959R566J0530J2061J4014J6167J8102J9571K0969K2805K4616K5478
61115H43067K5550K6105K7605K8939K8990K8019K6868K5696K4196K2403K0535
61104A127973J8508J6247J3982J1708Q785M667k74n109r264j2762j5850j8654
61092A139957k1090k2941k4183k5103k5787k5887k5366k4957k5069k4777k3065
$$ plain form
61081 871732 851079 831911 813297 795875 780828 768069 756694 746663 738689 732742 728025 724281
61069 724281 721910 720813 720399 720848 723182 727764 733663 739756 745597 751142 756597 762816 770964 781365
61055 781365 793271 805838 818732 831869 845440 860253 877195 896218 916502 937622 959852
61044 959852 983499 1008729 1035865 1064916 1095066 1125621 1157151 1190543 1225202 1259616 1293523
61033 1293523 1328103 1364098 1401314 1439955 1480708 1523214 1566107 1608931 1652453 1696860 1741419
61022 1741419 1786305 1832922 1882024 1933540 1988831 2050959 2121818 2201041 2288633 2386518 2496812
61011 2496812 2621510 2765543 2937470 3145244 3393840 3688965 4039809 4455522 4942759
61002 4942759 5510965 6177667 6966169 7905268 9038209 10417826 12059324 13874872 15664061
$$ packed form
61081H71732k0653j9168j8614j7422j5047j2759j1375j0031p974n947m717l744
61069G24281k371j097m14M49K334M582N899O093N841N545N455O219Q148J0401
61055G81365J1906J2567J2894J3137J3571J4813J6942J9023K0284K1120K2230
61044I59852K3647K5230K7136K9051L0150L0555L1530L3392L4659L4414L3907
61033A293523L4580L5995L7216L8641M0753M2506M2893M2824M3522M4407M4559
61022A741419M4886M6617M9102N1516N5291O2128P0859P9223Q7592R7885J10294
61011B496812J24698J44033J71927K07774K48596K95125L50844M15713M87237
61002D942759N68206O66702P88502R39099J132941J379617J641498J815548J789189
$$ plain form
60993 15664061 17197128 18329031 19044577 19413094 19528056 19498363 19462630 19552970 19806508
60984 19806508 20113613 20273164 20113267 19570028 18673985 17492791 16099724 14577144 13017788
60975 13017788 11506286 10100725 8832507 7716228 6754613 5939113 5253733 4680933 4203894
60966 4203894 3805997 3471800 3188791 2946952 2737496 2553488 2390742 2246403 2117130
60957 2117130 1999933 1893926 1799525 1716174 1642211 1576535 1518804 1467941 1421685 1377916 1335572
60946 1335572 1294267 1253859 1214557 1176707 1140317 1105219 1071604 1039798 1009545 980103 951131
60935 951131 922991 896206 871033 847586 825968 806175 788102 771615 756472 742357 729159
60924 729159 716965 705596 694530 683634 673557 664931 657461 650315 643188 636506 630730 625985 622239
$$ packed form
60993A5664061J533067J131903P15546L68517J14962k9693l5733R0340K53538
60984A9806508L07105J59551j59897n43239q96043j181194j393067j522580j559356
60975A3017788j511502j405561j268218j116279r61615q15500o85380n72800m77039
60966D203894l97897l34197k83009k41839k09456j84008j62746j44339j29273
60957B117130j17197j06007r4401q3351p3963o5676n7731n0863m6256m3769m2344
60946A335572m1305m0408l9302l7850l6390l5098l3615l1806l0253k9442k8972
60935I51131k8140k6785k5173k3447k1618j9793j8073j6487j5143j4115j3198
60924G29159j2194j1369j1066j0896j0077q626p470p146p127o682n776m745l746
$$ plain form
60911 622239 619334 616909 614698 612922 611953 611636 611323 610595 609636 608918 608801 609366 610215 610476 609436 607255 604764
60894 604764 602528 600433 598208 595863 593417 590598 587177 583384 579626 575846 571527 566410 560987 556024
60880 556024 551681 547310 542203 536403 530624 525427 520714 516074 511399 506912 502739 498789 495189 492560
60866 492560 491461 491545 491639 490943 489930 489704 490614 491965 493120 494308 496032 498126 499917 501077 501836 502463
60850 502463 502965 503289 503446 503454 503406 503527 503864 504029 503597 502649 501477 499909 497432 494002 490165 486260 482100
60833 482100 477652 473471 470057 467141 464074 460725 457609 455269 453888 453465 453942 454948 455623 455064 453107
60818 453107 450543 448341 446696 445095 443291 441694 440604 439547 437882 435737 433781 432262 430792 428946
60804 428946 426555 423575 420312 417633 416239 415686 414838 413287 411531 409711 407209 403912 400896 399117 398106
$$ packed form
60911F22239k905k425k211j776r69l17l13p28r59p18j17N65Q49K61j040k181k491
60894F04764k236k095k225k345k446k819l421l793l758l780m319n117n423m963
60880E56024m343m371n107n800n779n197m713m640m675m487m173l950l600k629
60866D92560j099Q4R4o96j013k26R10J351J155J188J724K094J791J160P59O27
60850E02463N02L24J57Qm8J21L37J65m32r48j172j568k477l430l837l905m160
60833D82100m448m181l414k916l067l349l116k340j381m23M77J006O75n59j957
60818D53107k564k202j645j601j804j597j090j057j665k145j956j519j470j846
60804D28946k391k980l263k679j394n53q48j551j756j820k502l297l016j779j011
$$ plain form
60789 398106 396774 395050 393787 393330 393039 392340 391508 391162 391430 391871 392027 391823 391445 390897 389860 388202 386553
60772 386553 385948 386747 388314 389976 391874 394487 397707 400869 403517 405661 407340 408354 408486 407818 406832
60757 406832 406270 406607 407468 407838 407176 406033 405312 405273 405692 406584 408028 409539 410458 411061 412419 414829 417071
60740 417071 417680 416464 414175 411147 406997 401562 395354 388974 382696 376928 372522 370057 369003 368135 366749
60725 366749 365115 363734 362634 361590 360660 360154 360217 360675 361136 361103 360177 358438 356503 354971 353931 353232 353019
60708 353019 353674 355259 357393 359603 361561 363037 363979 364621 365265 365911 366370 366645 366938 367344 367914 368915 370584
60691 370584 372613 374353 375637 377005 378951 381342 383732 385850 387631 389088 390422 391922 393582 395059
60677 395059 396211 397389 398954 400742 402263 403331 404272 405541 407108 408150 407496 404731 400831 397343 394941
$$ packed form
60789C98106j332j724j263m57k91o99q32l46K68M41J56k04l78n48j037j658j649
60772C86553o05P99J567J662J898K613L220L162K648K144J679J014J32o68r86
60757D06832n62L37Q61L70o62j143p21l9M19Q92J444J511R19O03J358K410K242
60740D17071O09j216k289l028m150n435o208o380o278n768m406k465j054q68j386
60725C66749j634j381j100j044r30n06O3M58M61l3r26j739j935j532j040o99k13
60708C53019O55J585K134K210J958J476R42O42O44O46M59K75K93M06N70J001J669
60691C70584K029J740J284J368J946K391K390K118J781J457J334J500J660J477
60677C95059J152J178J565J788J521J068R41J269J567J042o54k765l900l488k402
$$ plain form
60662 394941 393183 391595 390340 389575 388837 387597 386097 385091 384897 385129 385297 385392 385808 386852 388307 389551
60646 389551 390239 390845 392137 394123 395870 396488 395907 394527 392572 390093 387246 384258 381347 378884 377340
60631 377340 376745 376461 375790 374686 373695 373396 374013 375309 376701 377703 378377 379106 379896 380347 380350 380286 380342 380281 380153
60612 380153 380590 381934 383600 384816 385489 385787 385411 384037 382178 380798 380242 380191 380491 381258 382193 382632 382435
60595 382435 382265 382761 383926 385514 387524 389957 392353 393907 394097 393172 392147 392201 393815 396404 398887 400627
60579 400627 401766 402825 404217 406078 408325 410858 413723 417088 421070 425830 431797 439414 448525 458422
60565 458422 468687 479563 491096 502364 512072 519702 525585 529939 532275 531770 528033 521679 514380
60552 514380 508022 503430 500082 497274 495179 494406 495011 496606 499156 502994 508171 514387 521561 529954 539740
$$ packed form
60662C94941j758j588j255p65p38j240j500j006j94K32J68R5M16J044J455J244
60646C89551O88O06J292J986J747O18n81j380j955k479k847k988k911k463j544
60631C77340n95k84o71j104r91k99O17J296J392J002O74P29P90M51Lo4N6o1j28
60612C80153M37J344J666J216O73K98l76j374j859j380n56n1L00P67R35M39j97
60595C82435j70M96J165J588K010K433K396J554J90r25j025N4J614K589K483J740
60579D00627J139J059J392J861K247K533K865L365L982M760N967P617R111R897
60565D58422J0265J0876J1533J1268R708P630N883M354K336n05l737o354p299
60552E14380o358m592l348k808k095p73O05J595K550L838N177O216P174Q393R786
$$ plain form
60537 539740 550902 563477 577410 592263 607449 622580 637063 649531 658382 662951 663712 661490
60525 661490 657069 651445 645560 639575 633012 625821 618728 612356 606595 601113 595957 591375 587485 584430
60511 584430 582457 581586 581589 582534 584988 589399 595684 603715 613866 626768 642759 661917 684350 710096
60497 710096 738889 770399 804681 842119 882793 925889 969711 1012254 1051806 1086949 1116011
60486 1116011 1136949 1148227 1149631 1141804 1125069 1099337 1065232 1024731 980374 934234 887819 842456
60474 842456 799235 758730 721156 686721 655667 628074 603819 582621 563964 547109 531435
60463 531435 516789 503418 491586 481274 472276 464537 458260 453493 449684 445988 442163 438747 436103
60450 436103 433686 430647 426830 422704 418706 415252 412915 411758 410703 408585 405815 403984 403689 403897 403727
$$ packed form
60537E39740J1162J2575J3933J4853J5186J5131J4483J2468Q851M569P61k222
60525F61490m421n624n885n985o563p191p093o372n761n482n156m582l890l055
60511E84430j973q71LR45K454M411O285Q031J0151J2902J5991J9158K2433K5746
60497G10096K8793L1510L4282L7438M0674M3096M3822M2543L9552L5143K9062
60486A116011K0938J1278J404p827j6735k5732l4105m0501m4357m6140m6415m5363
60474H42456m3221m0505l7574l4435l1054k7593k4255k1198j8657j6855j5674
60463E31435j4646j3371j1832j0312q998p739o277m767l809l696l825l416k644
60450D36103k417l039l817m126l998l454k337j157j055k118k770j831k95K08j70
$$ plain form
60435 403727 403680 404369 405123 404884 403835 402983 402439 401260 398990 396440 394687 393951 393734 393634 393738 394454 396036
60418 396036 398191 400246 401893 403517 405480 407322 408157 407743 406670 405537 404525 403858 404049 405293 407000
60403 407000 408383 409373 410581 412392 414433 416059 417115 417972 418912 419769 420342 420888 421844 423119 424082 424471
60387 424471 424986 426611 429449 432483 434570 435503 436122 437472 439854 442622 444926 446597 448153 449946 451636
60372 451636 452708 453167 453342 453233 452604 451786 451818 453392 455913 458020 459015 459442 460246 461748 463681 465934 468782
60355 468782 472340 476226 480007 483733 487695 491797 495501 498430 500769 503029 505617 508603 511592 513734
60341 513734 514139 512545 509540 506011 502499 499146 496062 493447 491368 489605 487813 485788 483505 480999
60327 480999 478334 475746 473620 472112 470801 469041 466779 464777 463787 463755 464137 464850 466468 469456 473629
$$ packed form
60435D03727m7O89P54k39j049q52n44j179k270k550j753p36k17j00J04P16J582
60418C96036K155K055J647J624J963J842Q35m14j073j133j012o67J91J244J707
60403D07000J383R90J208J811K041J626J056Q57R40Q57N73N46R56J275R63L89
60387D24471N15J625K838L034K087R33O19J350K382K768K304J671J556J793J690
60372D51636J072M59J75j09o29q18L2J574K521K107R95M27Q04J502J933K253K848
60355D68782L558L886L781L726L962M102L704K929K339K260K588K986K989K142
60341E13734M05j594l005l529l512l353l084k615k079j763j792k025k283k506
60327D80999k665k588k126j508j311j760k262k002r90l2L82P13J618K988M173
$$ plain form
60312 473629 478502 483905 490052 497207 505484 514887 525400 537046 549885 563868 578585 593190 606611
60299 606611 617947 626703 632618 635174 633433 626743 615719 602218 588169 574694 562390 551815
60287 551815 543163 535853 529156 523136 518432 515184 512795 510705 508803 506974 504768 501796 498022 493572
60273 493572 488594 483413 478460 473963 470075 467238 465897 465736 465746 465239 464327 463324 462233 461065 460040
60258 460040 459146 458016 456587 455357 454582 453787 452658 451949 452792 455324 458642 461980 465229 468273 470530
60243 470530 471477 471294 470695 470243 469983 469628 468948 467956 466817 465737 465046 465203 466430 468334 470210 471767 473315
60226 473315 475258 477704 480599 483789 486846 489322 491478 494322 498592 503983 509681 515332 521090 527033
60212 527033 533031 539157 545823 553437 562069 571395 580839 589882 598378 606506 614388 621929 629007 635487
$$ packed form
60312D73629M873N403O147P155Q277R403J0513J1646J2839J3983J4717J4605J3421
60299F06611J1336Q756N915K556j741o690j1024j3501j4049j3475j2304j0575
60287E51815q652p310o697o020m704l248k389k090j902j829k206k972l774m450
60273D93572m978n181m953m497l888k837j341j61J0n07r12j003j091j168j025
60258D60040q94j130j429j230p75p95j129p09Q43K532L318L338L249L044K257
60243D70530R47j83n99m52k60l55o80r92j139j080o91J57J227J904J876J557J548
60226D73315J943K446K895L190L057K476K156K844M270N391N698N651N758N943
60212E27033N998O126O666P614Q632R326R444R043Q496Q128P882P541P078O480
$$ plain form
60198 635487 641075 645558 649236 652587 655347 656495 655491 653013 650108 647103 643788 640107 636015 631009
60184 631009 624545 616819 608606 600423 592354 584554 577417 571200 565862 561236 557141 553432 550134 547325
60170 547325 544762 542084 539635 538380 538430 538346 536806 534473 533128 533191 533364 532806 532383 533259 535237 537240 538766
60153 538766 540143 541732 543519 545308 546817 547742 548073 548284 548991 550537 553061 556675 561226 566088 570539
60138 570539 574446 578443 583420 589829 597308 604953 612023 618432 624474 630219 635442 640107 644528 649006
60124 649006 653578 658210 662922 667555 671681 674933 677297 679042 680575 682385 684815 687723 690542 692761
60110 692761 694206 694891 694859 694198 692846 690334 686111 680312 673851 667574 661631 655796 649952 644004 637820
60095 637820 631750 626800 623727 622126 621001 620060 619829 620479 621305 621620 621604 621844 622475 623297 624426 626178 628228
$$ packed form
60198F35487N588M483L678L351K760J148j004k478k905l005l315l681m092n006
60184F31009o464p726q213q183q069p800p137o217n338m626m095l709l298k809
60170E47325k563k678k449j255N0q4j540k333j345O3J73n58m23Q76J978K003J526
60153E38766J377J589J787J789J509R25L31K11P07J546K524L614M551M862M451
60138E70539L907L997M977O409P479P645P070O409O042N745N223M665M421M478
60124F49006M572M632M712M633M126L252K364J745J533J810K430K908K819K219
60110F92761J445O85l2o61j352k512m223n799o461o277n943n835n844n948o184
60095F37820o070m950l073j601j125r41k31O50Q26L15j6K40O31Q22J129J752K050
$$ plain form
60078 628228 629412 628699 626205 623042 620202 617662 614497 609773 603361 595955 588370 580995 573941 567411
60064 567411 561491 555719 549437 542804 536954 532760 529790 526932 523744 520665 518140 516239 515190 515549
60050 515549 517530 520617 524106 527719 531476 535376 539465 543879 548597 553510 558894 565342 572842 580337
60036 580337 586707 591900 596570 600821 603840 604736 603340 600268 596534 592932 589390 585017 579136 572121
60022 572121 564880 557704 550139 541862 533129 524338 515687 507301 499303 491713 484691 478776 474358 470888
60008 470888 467287 463307 459893 457896 457039 456530 456107 455930 455829 455415 454807 454598 455040 455777 456557 457765 459945
59991 459945 463057 466509 469859 473251 477138 481714 486600 490996 494148 495847 496587 497110 497596 497343 495481
59976 495481 492002 487931 484366 481570 479088 476479 473686 470816 467912 464998 462220 459908 458489 458206
$$ packed form
60078F28228J184p13k494l163k840k540l165m724o412p406p585p375p054o530
60064E67411n920n772o282o633n850m194k970k858l188l079k525j901j049L59
60050E15549J981L087L489L613L757L900M089M414M718M913N384O448P500P495
60036E80337O370N193M670M251L019Q96j396l072l734l602l542m373n881p015
60022E72121p241p176p565q277q733q791q651q386p998p590p022n915m418l470
60008D70888l601l980l414j997q57n09m23j77j01m14o08k09M42P37P80J208K180
59991D59945L112L452L350L392L887M576M886M396L152J699P40N23M86k53j862
59976D95481l479m071l565k796k482k609k793k870k904k914k778k312j419k83
$$ plain form
59962 458206 458774 459455 459661 459499 459674 460920 463536 467191 470992 473928 475520 476028 475966 475705 475602 476138 477466
59945 477466 479060 480247 480938 481424 481604 481001 479567 477893 476428 474917 472932 470681 468973 468492 469267 470775
59929 470775 472438 474100 476145 479094 483051 487572 492049 496142 499913 503763 508226 513569 519436 524958
59915 524958 529327 532278 534059 535052 535508 535631 535854 536793 538728 541183 543334 544918 546452 548486 550943
59900 550943 553409 555669 557668 559236 560274 561076 562083 563432 565067 567216 570378 574770 580016 585332
59886 585332 589924 593394 595981 598283 600607 602846 605122 608103 612240 617040 621623 625757 629730 633356
59872 633356 635728 636011 634103 630569 626368 622487 619290 616239 612668 608758 605259 602422 599843 597357
59858 597357 595418 594412 594179 594376 594869 595622 596656 598265 600841 604423 608833 614265 621091 628923 636442
$$ packed form
59962D58206N68O81K06j62J75J246K616L655L801K936J592N08o2k61j03N36J328
59945D77466J594J187O91M86J80o03j434j674j465j511j985k251j708m81P75J508
59929D70775J663J662K045K949L957M521M477M093L771L850M463N343N867N522
59915E24958M369K951J781R93M56J23K23R39J935K455K151J584J534K034K457
59900E50943K466K260J999J568J038Q02J007J349J635K149L162M392N246N316
59886E85332M592L470K587K302K324K239K276K981M137M800M583M134L973L626
59872F33356K372K83j908l534m201l881l197l051l571l910l499k837k579k486
59858E97357j939j006k33J97M93P53J034J609K576L582M410N432O826P832P519
$$ plain form
59843 636442 642447 646594 648907 649204 647530 644777 642351 641201 641337 642074 642544 642137 640643 638052 634432
59828 634432 630134 625833 621876 617861 613335 608664 604518 600710 596498 591976 588129 585220 582261 578574
59814 578574 574867 571966 569326 565813 561441 557305 553997 551092 548213 545805 544522 544345 544600 544610 544184
59799 544184 543567 543003 542361 541276 539605 537554 535345 533112 531101 529560 528306 526797 524812 522647 520484
59784 520484 518078 515344 512762 510789 509263 507724 506006 504184 502313 500592 499469 499253 499880 501255 503356
59769 503356 505808 507911 509475 511087 513124 515218 517248 520155 524815 530565 535795 539881 543659 548101
59755 548101 553360 559122 565114 571119 577072 583271 589994 596906 603355 609167 614506 619065 622185 623943
59741 623943 625319 627023 628764 629919 630287 629788 628133 625386 622436 620222 618665 616929 614662 612454 611046
$$ packed form
59843F36442O005M147K313K97j674k753k426j150J36P37M70m07j494k591l620
59828F34432m298m301l957m015m526m671m146l808m212m522l847k909k959l687
59814E78574l707k901k640l513m372m136l308k905k879k408j283j77K55J0m26
59799E44184o17n64o42j085j671k051k209k233k011j541j254j509j985k165k163
59784E20484k406k734k582j973j526j539j718j822j871j721j123k16O27J375K101
59769E03356K452K103J564J612K037K094K030K907M660N750N230M086L778M442
59755E48101N259N762N992O005N953O199O723O912O449N812N339M559L120J758
59741F23943J376J704J741J155L68m99j655k747k950k214j557j736k267k208j408
$$ plain form
59726 611046 610495 610246 609696 608565 607004 605578 604955 605272 605815 605547 604076 601947 599943 598302 596808 595383
59710 595383 594277 593755 593965 595024 596881 599087 601199 603461 606541 610356 613742 615732 616742 617915 619622
59695 619622 621285 622640 624439 627567 631828 635924 638548 639344 638878 637884 636669 635282 634006 633359 633594
59680 633594 634449 635408 635891 635211 632857 629089 624849 620728 616333 611010 604909 598912 593707 589294 585255
59665 585255 581186 576995 573141 570441 569366 569602 570501 571737 573224 574699 575853 576822 578164 580318 583294
59650 583294 586757 590214 593270 595898 598275 600182 600888 599917 597576 594421 590585 586083 581393 577139 573444
59635 573444 570229 567862 566781 566531 565954 564496 562724 561365 560327 558907 556585 553420 549902 546556 543470
59620 543470 540252 536692 533214 530281 527565 524367 520879 518304 517460 517818 518256 518350 518543 519385 521039 523372
$$ packed form
59726F11046n51k49n50j131j561j426o23L17N43k68j471k129k004j641j494j425
59710E95383j106n22K10J059J857K206K112K262L080L815L386J990J010J173J707
59695F19622J663J355J799L128M261M096K624P96m66r94j215j387j276o47K35
59680F33594Q55R59M83o80k354l768m240m121m395n323o101n997n205m413m039
59665E85255m069m191l854k700j075K36Q99J236J487J475J154R69J342K154K976
59650E83294L463L457L056K628K377J907P06r71k341l155l836m502m690m254l695
59635E73444l215k367j081k50n77j458j772j359j038j420k322l165l518l346l086
59620E43470l218l560l478k933k716l198l488k575q44L58M38R4J93Q42J654K333
$$ plain form
59604 523372 526178 529246 532363 535289 537740 539473 540413 540625 540205 539333 538328 537467 536784 536198 535742 535492
59588 535492 535343 535091 534663 534071 533224 532014 530526 529009 527683 526650 525792 524647 522706 520062 517521 515781
59572 515781 514801 514174 513655 512993 511793 510235 509420 510218 512000 513329 513711 513824 514138 514301 514003 513520 513089
59555 513089 512547 511945 511884 512863 514742 517079 519500 521603 523129 524526 526742 530206 534570 539634 545774
59540 545774 553203 561747 571891 585098 601978 620466 636723 647764 652775 652432 648041 641402 634539
59527 634539 628937 625160 623215 622973 624263 626891 630637 635012 639120 642089 643651 644014 643217 640986 637200
59512 637200 632135 626117 619231 611535 603363 595207 587386 579956 572897 566340 560552 555713 551741 548402
59498 548402 545604 543411 541762 540386 539153 538327 538241 538791 539465 539881 540137 540637 541749 543679 546494 550093
$$ packed form
59604E23372K806L068L117K926K451J733R40K12m20q72j005q61o83n86m56k50
59588E35492j49k52m28n92q47j210j488j517j326j033q58j145j941k644k541j740
59572E15781r80o27n19o62j200j558q15P98J782J329L82J13L14J63k98m83m31
59555E13089n42o02o1R79J879K337K421K103J526J397K216L464M364N064O140
59540E45774P429Q544J0144J3207J6880J8488J6257J1041N011l43m391o639o863
59527F34539n602l777j945k42J290K628L746M375M108K969J562L63p97k231l786
59512F37200n065o018o886p696q172q156p821p430p059o557n788m839l972l339
59498E48402k798k193j649j376j233q26q6N50O74M16K56N00J112J930K815L599
$$ plain form
59482 550093 554203 558575 563252 568545 574601 581049 587331 593367 599625 606313 612783 618047 621766 624450
59468 624450 626720 628706 630155 630790 630548 629753 629126 629314 630337 631796 633689 636688 641404 647675 654866
59453 654866 662667 671280 680831 690844 700363 708613 715495 721347 726184 729358 730120 728302 724133 717636
59439 717636 708819 698479 688145 678882 670573 662720 655505 649551 644919 640950 637148 633806 631692 631387
59425 631387 632974 636155 640622 646495 654401 664928 678015 693078 709621 727440 746352 766387
59413 766387 788413 813761 842241 870518 893192 905994 907911 900569 886495 868389 849215 831822
59401 831822 818326 810310 809258 815561 826604 836701 840020 833949 819801 800803 779841 758657
59389 758657 738268 719587 703492 690350 679735 671005 664130 659510 657023 655841 655408 655879 657289
$$ packed form
59482E50093M110M372M677N293O056O448O282O036O258O688O470N264L719K684
59468F24450K270J986J449O35k42p95o27J88J023J459J893K999M716O271P191
59453F54866P801Q613R551J0013R519Q250O882N852M837L174P62j818m169o497
59439G17636q817j0340j0334r263q309p853p215n954m632l969l802l342k114l05
59425F31387J587L181M467N873P906J0527J3087J5063J6543J7819J8912K0035
59413G66387K2026K5348K8480K8277K2674J2802J917p342j4074j8106j9174j7393
59401H31822j3496q016j052O303J1043J0097L319o071j4148j8998k0962k1184
59389G58657k0389j8681j6095j3142j0615q730o875m620k487j182m33M71J410
$$ plain form
59376 657289 658984 660433 661959 663932 665775 666650 666812 667355 668727 670341 671692 673030 674831 677269 680378
59361 680378 684180 688482 692978 697659 702771 708459 714904 722622 731998 742615 753693 765175 777706
59348 777706 791576 806410 821908 837977 853998 868879 882221 894678 906701 917643 926534 933056
59336 933056 937182 938460 936382 931125 923320 913287 900991 886586 870600 853706 836621 820017
59324 820017 804250 789347 775418 762803 751559 741204 731326 722156 714198 707472 701546 696115 691144
59311 691144 686483 681748 676715 671710 667471 664555 662864 661819 661126 661302 663312 667849 675103 684737 695540
59296 695540 705250 711533 713357 711090 705383 696615 685470 673226 661014 649262 638186 628385 620568
59283 620568 615003 611536 609905 609829 611098 613726 617783 623065 629324 636822 646121 657178 669234 681758
$$ packed form
59376F57289J695J449J526J973J843Q75J62N43J372J614J351J338J801K438L109
59361F80378L802M302M496M681N112N688O445P718R376J0617J1078J1482J2531
59348G77706J3870J4834J5498J6069J6021J4881J3342J2457J2023J0942Q891O522
59336I33056M126J278k078n257p805j0033j2296j4405j5986j6894j7085j6604
59324H20017j5767j4903j3929j2615j1244j0355r878r170p958o726n926n431m971
59311F91144m661m735n033n005m239k916j691j045o93J76K010M537P254R634J0803
59296F95540R710O283J824k267n707q768j1145j2244j2212j1752j1076r801p817
59283F20568n565l467j631p6J269K628M057N282O259P498R299J1057J2056J2524
$$ plain form
59269 681758 694901 708742 722681 735975 748333 759547 768885 775356 778413 778215 775519 771421 766714
59256 766714 761262 754402 746127 737378 728922 720576 711911 703207 695311 688969 684649 682511 682134 682729 684002
59241 684002 686448 690489 695828 701969 708748 715857 722450 727918 732680 737583 742767 747587 751379 753810
59227 753810 754755 754232 752281 748637 742913 735383 727076 718686 709903 700283 690226 680502 671347 662686
59213 662686 654841 648235 642677 637631 632971 628817 624886 620774 616755 613615 611645 610368 609246 608204
59199 608204 607386 606822 606390 605887 605266 604921 605442 606805 608195 608997 609622 610911 613076 615652 618176 620463
59183 620463 622533 624732 627662 631591 636218 641314 647022 653039 658208 661762 664531 668058 672837 678249
59169 678249 683904 689982 696364 702428 707943 713333 718846 724068 728491 731969 734366 735173 733740 729735
$$ packed form
59269F81758J3143J3841J3939J3294J2358J1214R338O471L057j98k696m098m707
59256G66714n452o860q275q749q456q346q665q704p896o342m320k138l77N95J273
59241F84002K446M041N339O141O779P109O593N468M762M903N184M820L792K431
59227G53810R45n23j951l644n724p530q307q390q783r620j0057r724r155q661
59213F62686p845o606n558n046m660m154l931m112m019l140j970j277j122j042
59199F08204q18n64m32n03o21l45N21J363J390Q02O25J289K165K576K524K287
59183F20463K070K199K930L929M627N096N708O017N169L554K769L527M779N412
59169F78249N655O078O382O064N515N390N513N222M423L478K397Q07j433m005
$$ plain form
59155 729735 723383 715443 706762 697510 687097 675206 662641 650633 639552 628877 618284 608114
59143 608114 598883 590901 584342 579101 574554 569957 565149 560466 556104 552034 548439 545665 543713 542264
59129 542264 541213 540738 540874 541455 542468 544136 546654 550202 555029 561142 568064 575281 582807 590952 599746
59114 599746 608979 618572 628464 638345 648003 657625 667276 676355 684169 690767 696588 701552 705233 707712
59100 707712 709505 710663 710723 709604 707914 706248 704643 702748 700103 696378 691884 687808 685401 684917 685596
59085 685596 686454 686604 685256 682133 677826 673104 667983 661997 655148 647973 640894 634149 628103 622899 618006
59070 618006 612900 607994 604125 601284 598686 595930 593217 590591 587910 585523 583985 583084 582061 580801
59056 580801 579849 579199 578131 576467 574917 573931 573116 572146 571336 570847 570140 568710 566728 564641 562672 561004
$$ packed form
59155G29735o352p940q681r252j0413j1891j2565j2008j1081j0675j0593j0170
59143F08114r231p982o559n241m547m597m808m683m362m070l595k774j952j449
59129E42264j051m75J36N81J013J668K518L548M827O113O922P217P526Q145Q794
59114E99746R233R593R892R881R658R622R651R079P814O598N821M964L681K479
59100G07712J793J158O0j119j690j666j605j895k645l725m494m076k407m84O79
59085F85596Q58J50j348l123m307m722n121n986o849p175p079o745o046n204m893
59070F18006n106m906l869k841k598k756k713k626k681k387j538r01j023j260
59056E80801r52o50j068j664j550r86q15r70q10m89p07j430j982k087j969j668
$$ plain form
59040 561004 559778 558724 557455 556317 556204 557328 558973 560737 563052 566104 569192 571812 574639 578762
59026 578762 584488 591490 599525 608351 617449 626553 636241 647339 659753 672233 683201 691647 697473
59013 697473 701199 703159 702992 700258 695513 690243 685623 681833 678762 676776 676490 678194 681776 686902 693114
58998 693114 700056 707619 715551 723112 729685 735574 741431 746948 751014 753300 754746 756210 757574 758613
58984 758613 759741 761181 762131 761625 759893 758252 757905 759367 762730 767923 774775 783155 792937 803707 814776
58969 814776 825745 836812 848358 860425 872690 884737 896303 907487 918576 929401 939013 946471
58957 946471 951645 954682 954985 951590 944447 934401 921973 907155 890540 873547 857117 841041 824973
58944 824973 809258 794391 780507 767950 757533 749636 743592 738524 734203 730688 727785 725347 723586
$$ packed form
59040E61004j226j054j269j138j13J124J645J764K315L052L088K620K827M123
59026E78762N726P002Q035Q826R098R104R688J1098J2414J2480J0968Q446N826
59013F97473L726J960j67k734m745n270m620l790l071j986k86J704L582N126O212
58998F93114O942P563P932P561O573N889N857N517M066K286J446J464J364J039
58984G58613J128J440R50n06j732j641l47J462L363N193O852Q380R782J0770J1069
58969H14776J0969J1067J1546J2067J2265J2047J1566J1184J1089J0825R612P458
58957I46471N174L037L03l395p143j0046j2428j4818j6615j6993j6430j6076j6068
58944H24973j5715j4867j3884j2557j0417p897o044n068m321l515k903k438j761
$$ plain form
58931 723586 722590 722017 721698 721947 722802 723514 723364 722556 721828 721532 721533 721632 721670 721497 721152 720807 720343 719451 718286 717598
58911 717598 717963 719315 721386 724157 727703 732069 737423 743916 751412 759872 769881 782036 795883 810281
58897 810281 824733 839476 854353 868734 882672 896949 911762 926631 941939 959209 979257
58886 979257 1001244 1024127 1047647 1071114 1092507 1109951 1123206 1132718 1138157 1138995 1135749 1129420 1120236
58873 1120236 1108006 1093305 1077288 1060635 1043472 1026066 1008958 992686 977889 965189 954463
58862 954463 944741 935271 926085 917197 908080 898495 888843 879090 868376 856566 845100 835223 826255
58849 826255 816834 807103 798305 790787 783814 777024 770686 764552 757675 749570 740785 732226 724512 717802
58835 717802 711628 705063 697726 690474 684589 680494 677741 675884 674808 674542 675220 676914 679199 681414 683687
$$ packed form
58931G23586r96n73l19K49Q55P12j50q08p28k96JR9L8j73l45l45m64q92j165o88
58911G17598L65J352K071K771L546M366N354O493P496Q460J0009J2155J3847J4398
58897H10281J4452J4743J4877J4381J3938J4277J4813J4869J5308J7270K0048
58886I79257K1987K2883K3520K3467K1393J7444J3255R512N439Q38l246o329r184
58873A120236j2230j4701j6017j6653j7163j7406j7108j6272j4797j2700j0726
58862I54463r722r470r186q888r117r585r652r753j0714j1810j1466r877q968
58849H26255r421r731q798p518o973o790o338o134o877q105q785q559p714o710
58835G17802o174o565p337p252n885m095k753j857j076k66O78J694K285K215K273
$$ plain form
58820 683687 686950 691513 696477 701160 706096 711839 717691 722650 726806 730702 733986 735845 736245 735643 733959
58805 733959 730936 727114 723408 719949 716265 712224 707955 703332 698347 693524 689069 684201 678228 671655
58791 671655 665252 658844 652213 646426 642716 640536 638293 635800 634495 635319 637814 641319 645676 650491
58777 650491 654954 658754 662340 666028 669542 672405 674077 673780 670999 666128 660011 653049 645377 637543
58763 637543 630202 623479 617402 612534 609310 607197 605406 604027 603600 604096 605305 607563 610954 614406 616829
58748 616829 618614 620705 622810 624104 625279 628171 633365 639651 645832 651676 657207 662504 668198 674783
58734 674783 681423 686889 691619 697351 704632 712179 718899 725009 730808 735870 740012 743841 747810 751651
58720 751651 755091 758271 761372 764745 769331 775811 783338 790363 796664 803170 809772 814858 817294 817431
$$ packed form
58820F83687L263M563M964M683M936N743N852M959M156L896L284J859M00o02j684
58805G33959l023l822l706l459l684m041m269m623m985m823m455m868n973o573
58791F71655o403o408o631n787l710k180k243k493j305Q24K495L505M357M815
58777F50491M463L800L586L688L514K863J672k97k781m871o117o962p672p834
58763F37543p341o723o077m868l224k113j791j379m27M96J209K258L391L452K423
58748F16829J785K091K105J294J175K892N194O286O181N844N531N297N694O585
58734F74783O640N466M730N732P281P547O720O110N799N062M142L829L969L841
58720G51651L440L180L101L373M586O480P527P025O301O506O602N086K436J37
$$ plain form
58706 817431 815769 812025 806041 798335 789234 778507 766213 752836 738349 722394 705631 689592
58694 689592 674822 660523 646446 633721 623253 614593 607028 600563 595126 590014 584850 580063 575740
58681 575740 571090 565768 560710 556932 554355 552455 551158 550425 549863 549457 549963 551966 555274 559685 565536
58666 565536 572981 581559 590993 601597 613401 625634 637471 648430 657596 663447 665131 663241 658938
58653 658938 653080 646463 639849 633148 625516 616870 608504 601678 596444 592394 589612 588152 587309 586261
58639 586261 585005 584123 584079 585069 587037 589552 592213 595307 599358 603884 607443 609159 609403 608864 607858 606761
58623 606761 606126 606026 606109 606494 607729 609808 612280 615468 620316 626850 634025 641369 649385 657947 665762
58608 665762 672024 677237 681692 684529 685204 684681 684195 683755 682668 680642 677668 673763 669545 666087 663580
$$ packed form
58706H17431j662l744n984p706r101j0727j2294j3377j4487j5955j6763j6039
58694F89592j4770j4299j4077j2725j0468q660p565o465n437n112n164m787m323
58681E75740m650n322n058l778k577j900j297p33n62m06N06K003L308M411N851
58666E65536P445Q578R434J0604J1804J2233J1837J0959R166N851J684j890m303
58653F58938n858o617o614o701p632q646q366o826n234m050k782j460q43j048
58639E86261j256q82m4R90J968K515K661L094M051M526L559J716K44n39j006j097
58623F06761o35j00Q3L85J235K079K472L188M848O534P175P344Q016Q562P815
58608F65762O262N213M455K837O75n23m86m40j087k026k974l905m218l458k507
$$ plain form
58593 663580 661161 658667 657356 658106 660060 662084 664537 668605 674767 682884 692940 704657 717046 729253
58579 729253 741266 753091 764010 773449 781850 789907 797625 804880 812214 820334 829485 839958 852517
58566 852517 867640 885017 904415 926290 950911 977644 1005742 1035087 1065432 1095477 1123223
58555 1123223 1146691 1164104 1174406 1178113 1176867 1171806 1163386 1152939 1142935 1134993 1128783 1123472 1118843
58542 1118843 1114238 1107867 1098319 1085676 1070240 1051402 1028909 1004095 978659 953207 928142 904979
58530 904979 885355 869428 856449 846242 838922 833750 829476 825555 822141 819279 816870 814984 813545
58517 813545 812125 810503 808861 807050 804465 801094 797830 795316 793387 791950 791264 790888 789681 787406 785090
58502 785090 783160 780687 777219 773890 771764 770467 769473 769323 770430 771995 773307 774933 777501 780558 783800
$$ packed form
58593F63580k419k494j311P50J954K024K453M068O162Q117J0056J1717J2389J2207
58579G29253J2013J1825J0919R439Q401Q057P718P255P334Q120R151J0473J2559
58566H52517J5123J7377J9398K1875K4621K6733K8098K9345L0345L0045K7746
58555A123223K3468J7413J0302L707j246n061q420j0447j0004p942o210n311m629
58542A118843m605o371r548j2643j5436j8838k2493k4814k5436k5452k5065k3163
58530I04979j9624j5927j2979j0207p320n172m274l921l414k862k409j886j439
58517H13545j420j622j642j811k585l371l264k514j929j437o86l76j207k275k316
58502G85090j930k473l468l329k126j297r94j50J107J565J312J626K568L057L242
$$ plain form
58487 783800 788214 794748 802998 812291 822851 834782 847345 860586 876309 895835 917860 939975
58475 939975 961133 981200 999194 1013634 1023796 1029223 1028977 1022867 1012557 1000168 986613 972442
58463 972442 959106 947961 939078 932411 928991 929595 933389 939372 947945 959563 973141 987438 1002709
58450 1002709 1019100 1034550 1046198 1052954 1054953 1051652 1042591 1029205 1013873 997794 981496 966519
58438 966519 954544 945517 938466 933542 931437 931493 932238 933286 935135 937812 941324 946600 954284 963417 972946
58423 972946 983436 995439 1007227 1016286 1022296 1026512 1028984 1028502 1024727 1018378 1009931 1000052 990578 982944
58409 982944 976185 968456 959890 951996 945029 938142 931491 925974 921385 917027 913626 912457 912997 913641 914375
58394 914375 916600 920498 924600 927782 929946 931098 931467 932086 933564 934956 935418 936029 938101 940839 942899
$$ packed form
58487G83800M414O534Q250R293J0560J1931J2563J3241J5723J9526K2025K2115
58475I39975K1158K0067J7994J4440J0162N427k46o110j0310j2389j3555j4171
58463I72442j3336j1145q883o667l420O04L794N983Q573J1618J3578J4297J5271
58450A002709J6391J5450J1648O756J999l301r061j3386j5332j6079j6298j4977
58438I66519j1975r027p051m924k105N6P45J048J849K677L512N276P684R133R529
58423I72946J0490J2003J1788R059O010M216K472m82l775o349q447r879r474p634
58409I82944o759p729q566p894o967o887o651n517m589m358l401j169N40O44P34
58394I14375K225L898M102L182K164J152L69O19J478J392M62O11K072K738K060
$$ plain form
58379 942899 945204 949837 956981 965357 974844 986142 998604 1010957 1023529 1037282 1051351 1064124
58367 1064124 1076068 1088873 1102512 1115862 1129506 1144947 1161595 1177516 1192785 1209105 1226392
58356 1226392 1242672 1257135 1270344 1281604 1289203 1293370 1296177 1298432 1299413 1299597 1300845 1303757 1307456
58343 1307456 1311944 1318106 1325523 1332998 1341076 1351321 1363382 1375594 1388231 1403214 1420808 1439594
58331 1439594 1459407 1481107 1503525 1523926 1541591 1557872 1572632 1583883 1591125 1596014 1599583 1601762
58319 1601762 1603651 1607073 1611746 1615938 1619953 1625931 1634365 1643958 1654715 1667732 1682107 1695637 1708601
58306 1708601 1723310 1739963 1756634 1773258 1791711 1811810 1831207 1849590 1869094 1890215 1911215
58295 1911215 1931952 1954340 1978525 2002520 2026087 2051062 2077426 2103074 2127968 2154444 2182881
$$ packed form
58379I42899K305M633P144Q376R487J1298J2462J2353J2572J3753J4069J2773
58367A064124J1944J2805J3639J3350J3644J5441J6648J5921J5269J6320J7287
58356A226392J6280J4463J3209J1260P599M167K807K255R81J84J248K912L699
58343A307456M488O162P417P475Q078J0245J2061J2212J2637J4983J7594J8786
58331A439594J9813K1700K2418K0401J7665J6281J4760J1251P242M889L569K179
58319A601762J889L422M673M192M015N978Q434R593J0757J3017J4375J3530J2964
58306A708601J4709J6653J6671J6624J8453K0099J9397J8383J9504K1121K1000
58295A911215K0737K2388K4185K3995K3567K4975K6364K5648K4894K6476K8437
$$ plain form
58284 2182881 2211163 2239007 2268734 2301125 2334536 2368660 2405125 2443967 2483541 2524176 2567686
58273 2567686 2613135 2657581 2701081 2746351 2793507 2840223 2887099 2937490 2991771 3047277 3104249
58262 3104249 3166081 3233145 3302234 3372612 3446471 3522745 3596891 3667905 3739227 3811785 3882772
58251 3882772 3952506 4025576 4103678 4184068 4266624 4355481 4452030 4553306 4658982 4772859 4895747
58240 4895747 5024184 5157753 5300164 5451637 5608330 5770881 5944977 6131737 6326476
58231 6326476 6528930 6745270 6977762 7222315 7478814 7753740 8049855 8363875 8697184
58222 8697184 9057716 9448215 9864491 10308725 10792131 11320909 11892858 12511836 13191437
58213 13191437 13939918 14756776 15649716 16639552 17743436 18971161 20344983 21905452 23692037
$$ packed form
58284B182881K8282K7844K9727L2391L3411L4124L6465L8842L9574M0635M3510
58273B567686M5449M4446M3500M5270M7156M6716M6876N0391N4281N5506N6972
58262C104249O1832O7064O9089P0378P3859P6274P4146P1014P1322P2558P0987
58251C882772O9734P3070P8102Q0390Q2556Q8857R6549J01276J05676J13877J22888
58240D895747J28437J33569J42411J51473J56693J62551J74096J86760J94739
58231F326476K02454K16340K32492K44553K56499K74926K96115L14020L33309
58222H697184L60532L90499M16276M44234M83406N28778N71949O18978O79601
58213A3191437P48481Q16858Q92940R89836J103884J227725J373822J560469J786585
$$ plain form
58204 23692037 25740683 28112356 30906330 34238179 38226453 43006451 48726780 55518551
58196 55518551 63493888 72782111 83534852 95899600 110059085 126338214 145239219
58189 145239219 167377858 193459530 224205263 259775398 298580939 336386371 366970296
58182 366970296 384453801 385809352 371836104 346233079 313771899 278748839 244223107
58175 244223107 211958555 182773669 156967710 134576418 115442516 99256181 85645888
58168 85645888 74251525 64730525 56753526 50033504 44346458 39511661 35371558 31801217
58160 31801217 28713587 26037175 23700063 21643001 19829454 18229701 16807556 15531540
58152 15531540 14385007 13354965 12422303 11571395 10797790 10097749 9460119 8875633 8343819
$$ packed form
58204B3692037K048646K371673K793974L331849L988274M779998N720329O791771
58196E5518551P975337R288223J0752741J2364748J4159485J6279129J8901005
58189A45239219K2138639K6081672L0745733L5570135L8805541L7805432L0583925
58182C66970296J7483505J355551j3973248k5603025l2461180l5023060l4525732
58175B44223107l2264552k9184886k5805959k2391292j9133902j6186335j3610293
58168H5645888j1394363r521000p976999o720022n687046m834797m140103l570341
58160C1801217l087630k676412k337112k057062j813547j599753j422145j276016
58152A5531540j146533j030042r32662q50908p73605p00041o37630n84486n31814
$$ plain form
58143 8343819 7863386 7425324 7022182 6654485 6321197 6013125 5722680 5451425 5201208
58134 5201208 4966339 4741556 4529852 4335181 4154364 3983014 3822979 3677218 3543052
58125 3543052 3416720 3299260 3192148 3092167 2996039 2905262 2821465 2741844 2663981 2590347 2523272
58114 2523272 2460139 2398094 2338934 2284836 2233709 2183174 2134878 2090603 2048223 2005638 1964608
58103 1964608 1926741 1889675 1851171 1812949 1776658 1740064 1701227 1662613 1627222 1594359 1562949
58092 1562949 1535094 1512333 1491959 1471030 1450698 1432898 1416310 1399497 1384493 1373102 1362710
58081 1362710 1349808 1334908 1320148 1304968 1288051 1270875 1255370 1240394 1224244 1208331 1194784
58070 1194784 1182602 1169651 1156381 1144248 1132627 1120513 1109162 1099870 1091225 1081732 1073004 1067218
$$ packed form
58143H343819m80433m38062m03142l67697l33288l08072k90445k71255k50217
58134E201208k34869k24783k11704j94671j80817j71350j60035j45761j34166
58125C543052j26332j17460j07112r9981r6128r0777q3797p9621p7863p3634o7075
58114B523272o3133o2045n9160n4098n1127n0535m8296m4275m2380m2585m1030
58103A964608l7867l7066l8504l8222l6291l6594l8837l8614l5391l2863l1410
58092A562949k7855k2761k0374k0929k0332j7800j6588j6813j5004j1391j0392
58081A362710j2902j4900j4760j5180j6917j7176j5505j4976j6150j5913j3547
58070A194784j2182j2951j3270j2133j1621j2114j1351r292q645r493q728n786
$$ plain form
58058 1067218 1063444 1059544 1055607 1052406 1048576 1042577 1035569 1029212 1022538 1014105 1005359 998640 993569 988473
58044 988473 983684 980259 977090 972469 967056 962325 957569 951461 945070 940256 936428 931907 927181 923756
58030 923756 921002 917151 912300 907505 902049 894620 886203 878853 872513 865896 859585 855200 852187 848398
58016 848398 843513 839238 836479 834774 834076 834679 835666 835664 834874 834477 834637 834960 836066 838566 841241 842466 842837
57999 842837 844288 847302 850991 855162 860107 865014 868778 871904 875592 879608 883076 886542 891025 895578
57985 895578 898163 898541 898148 897470 895722 892883 889924 887044 883562 879505 875683 872364 869421 867412 866870
57970 866870 866930 866297 865235 865018 865857 866965 868187 869845 871457 872314 873051 874998 878222 881688 884926 888020
57954 888020 890369 891119 890530 889512 888119 885958 883655 882485 882823 884223 886555 889807 893315 896513 899978
$$ packed form
58058A067218l774l900l937l201l830n999p008o357o674q433q746o719n071n096
58044I88473m789l425l169m621n413m731m756o108o391m814l828m521m726l425
58030I23756k754l851m851m795n456p429q417p350o340o617o311m385l013l789
58016H48398m885m275k759j705o98O03R87kp90l97J60L23J106K500K675J225L71
57999H42837J451L014L689M171M945M907L764L126L688M016L468L466M483M553
57985H95578K585L78l93o78j748k839k959k880l482m057l822l319k943k009n42
57970H66870O0o33j062k17Q39J108J222J658J612Q57P37J947L224L466L238L094
57954H88020K349P50n89j018j393k161k303j170L38J400K332L252L508L198L465
$$ plain form
57939 899978 904576 910216 916526 923848 932317 940996 949344 958452 969201 980208 989316 996110 1001229 1004289
57925 1004289 1004581 1002921 1000643 997442 992309 985888 979781 974077 967792 961349 956358 953228 951078 949776
57911 949776 949986 951422 953089 955137 958506 962883 966959 970605 974838 979693 984022 987332 990031 992011
57897 992011 992850 993272 994553 996606 998494 1000512 1003695 1007426 1009858 1010809 1012104 1014796 1018069 1021108 1024005
57882 1024005 1026444 1027586 1027767 1028462 1030037 1031239 1031334 1030980 1030603 1029704 1028385 1027827 1028609 1029996 1031371 1032969
57866 1032969 1034812 1036436 1038097 1040748 1044435 1048193 1051869 1056526 1062669 1069599 1076863 1084753 1092996 1100679
57852 1100679 1107974 1116223 1125643 1134511 1141356 1146452 1150434 1152977 1153792 1153681 1153673 1154068 1154828 1155802 1156103 1154592
57836 1154592 1151611 1149012 1147858 1147353 1146555 1145766 1145427 1145045 1144240 1143827 1144795 1146970 1149470 1151801 1153873 1155674
$$ packed form
57939H99978M598N640O310P322Q469Q679Q348R108J0749J1007R108O794N119L060
57925A004289K92j660k278l201n133o421o107n704o285o443m991l130k150j302
57911I49776K10J436J667K048L369M377M076L646M233M855M329L310K699J980
57897I92011Q39M22J281K053J888K018L183L731K432R51J295K692L273L039K897
57882A024005K439J142J81O95J575J202R5l54l77q99j319n58P82J387J375J598
57866A032969J843J624J661K651L687L758L676M657O143O930P264P890Q243P683
57852A100679P295Q249R420Q868O845N096L982K543Q15j11qL95P60R74L01j511
57836A154592k981k599j154n05p98p89l39l82q05m13R68K175K500K331K072J801
$$ plain form
57820 1155674 1157545 1160091 1163339 1166602 1169474 1172220 1174908 1176982 1178006 1178050 1177141 1175196 1172639 1170179 1167855
57805 1167855 1165251 1162710 1161240 1161112 1161657 1162520 1163943 1165722 1167192 1168417 1170147 1172511 1175160 1178717 1184374
57790 1184374 1191726 1198760 1204552 1210322 1217214 1224788 1232529 1241104 1250962 1261078 1270289 1278847 1287674 1297173
57776 1297173 1307562 1319145 1331253 1342058 1350518 1357522 1364204 1370187 1374503 1377232 1379113 1380415 1381231
57763 1381231 1382079 1383138 1383610 1382808 1381217 1379718 1378548 1377826 1378214 1380023 1382433 1384578 1386735 1389554 1392800
57748 1392800 1395915 1399227 1403582 1409105 1415084 1420721 1425466 1429243 1432894 1437738 1444002 1450370 1455668 1460264
57734 1460264 1465221 1470955 1477463 1484949 1493259 1501401 1508537 1514886 1520959 1526660 1531912 1537315 1543268 1549166
57720 1549166 1554363 1559202 1564118 1568484 1571464 1573389 1575221 1577224 1579192 1581434 1584314 1587218 1589155 1590193
$$ packed form
57820A155674J871K546L248L263K872K746K688K074J024M4r09j945k557k460k324
57805A167855k604k541j470j28N45Q63J423J779J470J225J730K364K649L557N657
57790A184374P352P034N792N770O892P574P741Q575R858J0116R211Q558Q827R499
57776A297173J0389J1583J2108J0805Q460P004O682N983M316K729J881J302Q16
57763A381231Q48J059M72q02j591j499j170p22L88J809K410K145K157K819L246
57748A392800L115L312M355N523N979N637M745L777L651M844O264O368N298M596
57734A460264M957N734O508P486Q310Q142P136O349O073N701N252N403N953N898
57720A549166N197M839M916M366K980J925J832K003J968K242K880K904J937J038
$$ plain form
57706 1590193 1591270 1592766 1594206 1595218 1595947 1596658 1597628 1599229 1601477 1603843 1606175 1609368 1614303 1620488 1626548
57691 1626548 1631780 1636445 1640945 1645639 1651190 1658115 1666002 1673913 1681552 1689465 1698257 1708310 1720078
57678 1720078 1733952 1749836 1767368 1786554 1807881 1832061 1859982 1892574 1930433 1974082 2024806
57667 2024806 2084008 2150274 2217130 2274737 2314354 2331612 2326862 2303898 2268345 2226021 2181779
57656 2181779 2139275 2101068 2068423 2041393 2019665 2003141 1991496 1983766 1978894 1976289 1975532 1976098 1977845
57643 1977845 1981127 1985900 1991312 1996744 2002583 2009330 2016650 2024030 2031654 2039767 2047824 2055247 2062479 2070325
57629 2070325 2078773 2087402 2096419 2106123 2115749 2124007 2130658 2136586 2142598 2149123 2156784 2166017 2176138 2185841
57615 2185841 2194698 2203259 2211721 2219538 2226456 2232987 2239602 2246249 2252912 2260001 2267929 2276790 2286531 2296994
$$ packed form
57706A590193J077J496J440J012P29P11R70J601K248K366K332L193M935O185O060
57691A626548N232M665M500M694N551O925P887P911P639P913Q792J0053J1768
57678A720078J3874J5884J7532J9186K1327K4180K7921L2592L7859M3649N0724
57667B024806N9202O6266O6856N7607L9617J7258m750k2964l5553m2324m4242
57656B181779m2504l8207l2645k7030k1728j6524j1645p730m872k605p57N66J747
57643A977845L282M773N412N432N839O747P320P380P624Q113Q057P423P232P846
57629B070325Q448Q629R017R704R626Q258O651N928O012O525P661R233J0121R703
57615B185841Q857Q561Q462P817O918O531O615O647O663P089P928Q861R741J0463
$$ plain form
57601 2296994 2307774 2318426 2328721 2338347 2346758 2353912 2360792 2368476 2376951 2385579 2394328 2403627 2413248
57588 2413248 2422405 2430938 2439456 2448314 2457363 2466763 2477045 2488128 2499125 2509407 2519164 2528771 2538341
57575 2538341 2548091 2558346 2568854 2578814 2588013 2597380 2608001 2619973 2632510 2644828 2656620 2668010
57563 2668010 2679348 2690906 2702686 2714649 2727017 2740058 2753639 2767319 2780808 2794090 2807210
57552 2807210 2820334 2833869 2848162 2863197 2878840 2895092 2911717 2927908 2942866 2956476 2969052
57541 2969052 2980822 2992231 3004311 3017939 3032817 3047849 3062309 3076103 3089298 3102281 3116070
57530 3116070 3131407 3147497 3162626 3176126 3188951 3202223 3216089 3230201 3244458 3258970 3273912
57519 3273912 3289703 3306744 3324771 3342971 3360903 3378761 3396668 3414376 3431814 3449319 3467070
$$ packed form
57601B296994J0780J0652J0295R626Q411P154O880P684Q475Q628Q749R299R621
57588B413248R157Q533Q518Q858R049R400J0282J1083J0997J0282R757R607R570
57575B538341R750J0255J0508R960R199R367J0621J1972J2537J2318J1792J1390
57563B668010J1338J1558J1780J1963J2368J3041J3581J3680J3489J3282J3120
57552B807210J3124J3535J4293J5035J5643J6252J6625J6191J4958J3610J2576
57541B969052J1770J1409J2080J3628J4878J5032J4460J3794J3195J2983J3789
57530C116070J5337J6090J5129J3500J2825J3272J3866J4112J4257J4512J4942
57519C273912J5791J7041J8027J8200J7932J7858J7907J7708J7438J7505J7751
$$ plain form
57508 3467070 3484817 3502372 3519845 3537173 3553927 3569824 3585075 3600092 3615222 3630808 3647034
57497 3647034 3663598 3679924 3695808 3711486 3727119 3742666 3758232 3774042 3790112 3806439 3823454
57486 3823454 3841646 3860740 3879878 3898675 3917484 3936638 3956163 3976303 3997541 4019779 4042190
57475 4042190 4064188 4085963 4107722 4129017 4149330 4168906 4188579 4208927 4229878 4250985 4271898
57464 4271898 4292661 4313529 4334408 4354787 4374542 4394513 4415658 4437873 4460307 4482650 4505295
57453 4505295 4528282 4550968 4572953 4594594 4616362 4638373 4660735 4683632 4706839 4729870 4752878
57442 4752878 4776700 4801674 4827106 4852323 4877556 4903266 4929163 4954535 4979215 5003689 5028463
57431 5028463 5053705 5079248 5104626 5129347 5153441 5177572 5202415 5228126 5254468 5281087 5307529
$$ packed form
57508C467070J7747J7555J7473J7328J6754J5897J5251J5017J5130J5586J6226
57497C647034J6564J6326J5884J5678J5633J5547J5566J5810J6070J6327J7015
57486C823454J8192J9094J9138J8797J8809J9154J9525K0140K1238K2238K2411
57475D042190K1998K1775K1759K1295K0313J9576J9673K0348K0951K1107K0913
57464D271898K0763K0868K0879K0379J9755J9971K1145K2215K2434K2343K2645
57453D505295K2987K2686K1985K1641K1768K2011K2362K2897K3207K3031K3008
57442D752878K3822K4974K5432K5217K5233K5710K5897K5372K4680K4474K4774
57431E028463K5242K5543K5378K4721K4094K4131K4843K5711K6342K6619K6442
$$ plain form
57420 5307529 5333420 5358889 5384512 5410640 5437144 5463912 5491137 5518864 5546627 5573822 5600231
57409 5600231 5626073 5651860 5678199 5705296 5732560 5759157 5785107 5811311 5838337 5865721 5892746
57398 5892746 5919356 5945922 5972570 5999262 6026218 6053784 6081983 6110504 6138992 6167155 6194744
57387 6194744 6221727 6248422 6275352 6303002 6331596 6360889 6390201 6419015 6447558 6476589 6506545
57376 6506545 6537094 6567334 6596221 6623138 6648614 6674315 6701690 6730601 6759747 6788287 6816445
57365 6816445 6844731 6873422 6902867 6933329 6964249 6994481 7023673 7052765 7082687 7113104 7142897
57354 7142897 7171442 7199100 7226864 7255752 7286136 7317313 7348106 7378025 7407481 7436795 7465667
57343 7465667 7493859 7521762 7549889 7578209 7606249 7633546 7659903 7685708 7712075 7740001 7769147
$$ packed form
57420E307529K5891K5469K5623K6128K6504K6768K7225K7727K7763K7195K6409
57409E600231K5842K5787K6339K7097K7264K6597K5950K6204K7026K7384K7025
57398E892746K6610K6566K6648K6692K6956K7566K8199K8521K8488K8163K7589
57387F194744K6983K6695K6930K7650K8594K9293K9312K8814K8543K9031K9956
57376F506545L0549L0240K8887K6917K5476K5701K7375K8911K9146K8540K8158
57365F816445K8286K8691K9445L0462L0920L0232K9192K9092K9922L0417K9793
57354G142897K8545K7658K7764K8888L0384L1177L0793K9919K9456K9314K8872
57343G465667K8192K7903K8127K8320K8040K7297K6357K5805K6367K7926K9146
$$ plain form
57332 7769147 7798012 7825517 7851836 7877531 7902704 7927340 7951764 7976233 8000677 8025222 8050327
57321 8050327 8076017 8101592 8126595 8151438 8176621 8201956 8227102 8252251 8277633 8302838 8327254
57310 8327254 8350817 8373831 8396532 8419351 8443040 8467892 8493185 8517994 8542183 8566075 8589596
57299 8589596 8612462 8634810 8656919 8678585 8699508 8720115 8741266 8763122 8784955 8806123 8826753
57288 8826753 8847337 8868021 8888463 8908307 8927717 8947299 8967305 8987054 9005660 9023197 9040538
57277 9040538 9057959 9074767 9090540 9105884 9121435 9136881 9151632 9165820 9179857 9193504 9206205
57266 9206205 9218102 9230022 9242563 9255679 9268968 9282012 9294699 9307528 9321188 9335590 9349926
57255 9349926 9364075 9379211 9396385 9415202 9434721 9455045 9477016 9500728 9525398 9550440 9575669
$$ packed form
57332G769147K8865K7505K6319K5695K5173K4636K4424K4469K4444K4545K5105
57321H050327K5690K5575K5003K4843K5183K5335K5146K5149K5382K5205K4416
57310H327254K3563K3014K2701K2819K3689K4852K5293K4809K4189K3892K3521
57299H589596K2866K2348K2109K1666K0923K0607K1151K1856K1833K1168K0630
57288H826753K0584K0684K0442J9844J9410J9582K0006J9749J8606J7537J7341
57277I040538J7421J6808J5773J5344J5551J5446J4751J4188J4037J3647J2701
57266I206205J1897J1920J2541J3116J3289J3044J2687J2829J3660J4402J4336
57255I349926J4149J5136J7174J8817J9519K0324K1971K3712K4670K5042K5229
$$ plain form
57244 9575669 9600448 9623621 9644510 9663354 9680732 9697165 9713361 9730120 9747685 9765437 9782400
57233 9782400 9797945 9812139 9825585 9838757 9851351 9862592 9872226 9880648 9887859 9893162 9896473 9899224
57221 9899224 9903167 9908884 9916241 9925585 9937333 9950772 9964523 9978205 9992645 10008411 10025043 10041777
57209 10041777 10058118 10073551 10087506 10099869 10110917 10120650 10128713 10135027 10139829 10143031 10144205 10143332 10141000
57196 10141000 10137730 10133652 10128955 10124105 10119392 10114633 10109434 10103393 10096063 10087171 10076935 10065796 10053850
57183 10053850 10040892 10026846 10011643 9994736 9975324 9953163 9928781 9902843 9875590 9846815 9816063
57172 9816063 9782985 9747848 9711519 9674526 9636342 9595996 9553155 9508130 9461135 9412138 9361358
57161 9361358 9309312 9256404 9202868 9149018 9095188 9041649 8988915 8937774 8888569 8840905 8794655
$$ packed form
57244I575669K4779K3173K0889J8844J7378J6433J6196J6759J7565J7752J6963
57233I782400J5545J4194J3446J3172J2594J1241R634Q422P211N303L311K751
57221I899224L943N717P357R344J1748J3439J3751J3682J4440J5766J6632J6734
57209A0041777J6341J5433J3955J2363J1048R733Q063O314M802L202J174q73k332
57196A0141000l270m078m697m850m713m759n199o041p330q892j0236j1139j1946
57183A0053850j2958j4046j5203j6907j9412k2161k4382k5938k7253k8775l0752
57172I816063l3078l5137l6329l6993l8184m0346m2841m5025m6995m8997n0780
57161I361358n2046n2908n3536n3850n3830n3539n2734n1141m9205m7664m6250
$$ plain form
57150 8794655 8750791 8710446 8673452 8638564 8604932 8572652 8542074 8513285 8486113 8460003 8434007
57139 8434007 8407397 8380049 8351855 8322190 8290142 8254084 8210165 8152645 8077807 7987554 7888020
57128 7888020 7784926 7681250 7578428 7477595 7379540 7285288 7197238 7118560 7051304 6996264
57118 6996264 6954443 6926789 6912161 6907178 6908599 6914596 6923682 6934602 6948474 6969809 7004532 7057987
57106 7057987 7135272 7242058 7384231 7568008 7801488 8095604 8463748 8922570 9494479 10208052
57096 10208052 11094059 12179929 13486008 15024131 16799105 18814502 21079792 23611974
57088 23611974 26429399 29542213 32941883 36588168 40397916 44246894 47986426 51460258
57080 51460258 54510691 56983796 58747638 59715731 59854754 59173797 57714124 55550248
$$ packed form
57150H794655m3864m0345l6994l4888l3632l2280l0578k8789k7172k6110k5996
57139H434007k6610k7348k8194k9665l2048l6058m3919n7520p4838r0253r9534
57128G888020j03094j03676j02822j00833r8055r4252q8050p8678o7256n5040
57118F996264m1821k7654j4628m983J421N997R086J0920J3872K1335L4723N3455
57106G057987P7285J06786J42173J83777K33480K94116L68144M58822N71909P13573
57096A0208052Q86007J085870J306079J538123J774974K015397K265290K532182
57088B3611974K817425L112814L399670L646285L809748L848978L739532L473832
57080E1460258L050433K473105J763842R68093J39023o80957j459673k163876
$$ plain form
57072 55550248 52789703 49558744 45982948 42180211 38266561 34359922 30573267 27002960
57064 27002960 23720259 20767617 18158996 15884830 13920457 12233852 10790262 9555244
57056 9555244 8497563 7590698 6812013 6141293 5560564 5054702 4611468 4220976 3875268
57047 3875268 3567843 3292960 3045329 2820639 2616004 2429388 2258716 2101876 1957389
57038 1957389 1824515 1702691 1591353 1490344 1399820 1319409 1247929 1184398 1129180 1084125
57028 1084125 1052096 1036275 1038160 1054249 1074778 1087569 1084477 1064178 1029196 981719 922883 854702
57016 854702 781049 706699 636022 572131 516278 467931 425933 389584 358412 331495 307825
57005 307825 287092 269298 253688 238914 224347 210521 198085 186940 176630 167013 158141 149869
$$ packed form
57072E5550248k760545l230959l575796l802737l913650l906639l786655l570307
57064B7002960l282701k952642k608621k274166j964373j686605j443590j235018
57056I555244j057681r06865p78685o70720n80729n05862m43234l90492l45708
57047C875268l07425k74883k47631k24690k04635j86616j70672j56840j44487
57038A957389j32874j21824j11338j01009r0524q0411p1480o3531n5218m5055
57028A084125l2029j5821J885J6089K0529J2791l092k0299l4982m7477n8836o8181
57016H54702p3653p4350p0677o3891n5853m8347m1998l6349l1172k6917k3670
57005C07825k0733j7794j5610j4774j4567j3826j2436j1145j0310r617q872q272
$$ plain form
56993 149869 141991 134599 128039 122609 118462 115738 114721 115903 119832 126754 136359 147846 159942 170641
56979 170641 177333 177970 172444 162593 150704 138157 125477 113227 102404 93953 88141 84569 82763
56966 82763 82642 84351 87862 93027 99979 109128 120689 134511 150538 169037 189961 212007 232413
56953 232413 247664 254687 252107 240946 224049 204579 184905 166583 150677 137749 127906 121211
56941 121211 117725 116974 117944 120150 124327 131545 141944 154961 170556 189520 212541 239351 268449
56928 268449 296797 319784 332560 332396 320000 298597 271954 243109 214195 186745 161936 140638
56916 140638 123190 109175 97601 87523 78550 70808 64479 59390 55092 51323 48304 46427 45673
56903 45673 45592 45827 46426 47606 49525 52321 56079 60654 65811 71648 78600 86980 96860 108450 122129
$$ packed form
56993A49869p878p392o560n430m147k724j017J182L929O922R605J1487J2096J0699
56979A70641O692O37n526r851j1889j2547j2680j2250j0823q451n812l572j806
56966H2763j21J709L511N165O952R149J1561J3822J6027J8499K0924K2046K0406
56953B32413J5251P023k580j1161j6897j9470j9674j8322j5906j2928r843o695
56941A21211l486p51R70K206M177P218J0399J3017J5595J8964K3021K6810K9098
56928B68449K8348K2987J2776j64j2396k1403k6643k8845k8914k7450k4809k1298
56916A40638j7448j4015j1574j0078q973p742o329n089m298l769l019j877p54
56903D5673q1K35N99J180J919K796L758M575N157N837O952Q380R880J1590J3679
$$ plain form
56888 122129 138010 156014 176520 200156 226339 252311 274086 288263 293078 288668 277025 261290
56876 261290 244328 227916 213248 201512 193452 188983 187889 190515 197164 207320 220327 236590
56864 236590 257386 283632 315545 353444 398175 450331 508728 568798 622224 659361 673842
56853 673842 665572 639397 601621 558163 514509 475109 442169 415956 396481 384224 379370 381559
56841 381559 390652 406987 430751 461979 501382 550395 610218 681502 764566 857898 954933 1042830
56829 1042830 1106057 1132747 1119346 1071061 998694 914059 826624 742814 666965 601853 548577
56818 548577 506983 476588 456649 445620 441720 444403 454495 472682 498867 533522 578606 635898
56806 635898 704119 777417 845834 897295 921235 912801 874765 815434 744561 670510 599412 535144
$$ packed form
56888A22129J5881J8004K0506K3636K6183K5972K1775J4177M815m410j1643j5735
56876B61290j6962j6412j4668j1736q060m469j094K626O649J0156J3007J6263
56864B36590K0796K6246L1913L7899M4731N2156N8397O0070N3426L7137J4481
56853F73842q270k6175l7776m3458m3654l9400l2940k6213j9475j2257m854K189
56841C81559R093J6335K3764L1228L9403M9013N9823P1284Q3064R3332R7035Q7897
56829A042830O3227K6690j3401m8285p2367q4635q7435q3810p5849o5112n3276
56818E48577m1594l0395j9939j1029l900K683J0092J8187K6185L4655M5084N7292
56806F35898O8221P3298O8417N1461K3940q434l8036n9331p0873p4051p1098o4268
$$ plain form
56794 535144 479577 433166 395540 365777 342832 326216 315933 311496 311578 315278 323359 337647 359367
56781 359367 388426 423625 462334 499654 528841 543701 541218 522382 490945 451484 408120 364205
56769 364205 322342 284214 250485 221169 196138 175124 157439 142185 128844 117368 107719 99677
56757 99677 93130 88061 84092 80458 76659 72824 69264 65972 62778 59659 56711 54044 51829 50207
56743 50207 49049 48026 47010 46155 45579 45243 45185 45519 46251 47364 48986 51062 52977 54115 54709 55495 56517
56726 56517 57049 56839 56640 57150 58160 59178 60277 61787 63612 65349 66707 67442 67342 66695 66347 66786 67506
56709 67506 67714 67337 66917 66835 67125 67802 68875 70139 71333 72354 73105 73370 73200 73162 73802 74971 76019 76579
56691 76579 76841 77108 77342 77284 76977 77041 78161 80190 82090 83145 83905 85333 87340 88924 89641 89997 90308
$$ packed form
56794E35144n5567m6411l7626k9763k2945j6616j0283m437Q2L700Q081J4288K1720
56781C59367K9059L5199L8709L7320K9187J4860k483j8836l1437l9461m3364m3915
56769C64205m1863l8128l3729k9316k5031k1014j7685j5254j3341j1476r649q042
56757I9677o547n069l969l634l799l835l560l292l194l119k948k667k215j622
56743E0207j158j023j016q55n76l36n8L34P32J113J622K076J915J138N94P86J022
56726E6517N32k10j99N10J010J018J099J510J825J737J358P35j00o47l48M39P20
56709F7506K08l77m20q2K90O77J073J264J194J021P51K65j70l8O40J169J048N60
56691G6579K62K67K34n8l07O4J120K029J900J055P60J428K007J584P17L56L11
$$ plain form
56674 90308 90225 89702 89492 90087 90914 91261 91397 92093 93510 95151 96603 97807 98859 99890 100884 101378 100839
56657 100839 99597 98847 99347 100685 102128 103520 104859 105689 105637 105026 104357 103567 102424 101208 100427 100248 100700
56640 100700 101923 103644 104960 105293 105144 105221 105306 104761 103705 102895 102722 102992 103445 103773 103479 102427 101266
56623 101266 100640 100291 99684 99084 99205 100037 100829 101056 100661 99617 98115 96947 96813 97359 97675 97609 97710 98058
56605 98058 98108 97685 97185 96747 96146 95604 95768 96653 97456 97714 97875 98453 99284 99976 100436 100666 100694 100978 102225
56586 102225 104333 106064 106321 105423 104694 105020 106191 107432 108190 108432 108475 108677 109283 110509 112539 115282 118300
56569 118300 121209 124024 126955 130158 133950 138922 145348 152720 160399 168558 177929 188573 199322 208442
56555 208442 214557 217136 216652 214342 211478 208736 206313 204234 202224 199663 196276 192672 189683 187323
$$ packed form
56674I0308q3n23k10N95Q27L47J36O96J417J641J452J204J052J031R94M94n39
56657A00839j242p50N00J338J443J392J339Q30n2o11o69p90j143j216p81j79M52
56640A00700J223J721J316L33j49P7Q5n45j056q10j73K70M53L28k94j052j161
56623A01266o26l49o07o00J21Q32P92K27l95j044j502j168j34N46L16o6J01L48
56605I8058N0m23n00m38o01n42J64Q85Q03K58J61N78Q31O92M60K30K8K84J247
56586A02225K108J731K57q98p29L26J171J241P58K42M3K02O06J226K030K743L018
56569A18300K909K815K931L203L792M972O426P372P679Q159R371J0644J0749R120
56555B08442O115K579m84k310k864k742k423k079k010k561l387l604k989k360
$$ plain form
56541 187323 184937 182204 179411 176850 174564 172649 171261 170259 169260 168025 166459 164434 162010 159676
56527 159676 157896 156614 155638 155223 155614 156285 156337 155563 154513 153581 152691 151838 151245 150890 150394 149483 148182 146604
56509 146604 144889 143255 141787 140406 139327 139096 139723 140294 140111 139691 139833 140216 139924 138995 138352 138393 138706
56492 138706 139117 139873 140771 141193 141125 141230 141730 142125 142130 142025 141948 141739 141604 142027 142898 143594 144068 144880 145999 146615
56472 146615 146479 146484 147535 149605 152214 154920 157058 157928 157724 157500 157773 157938 157414 156519 155741 154983 154117 153572
56454 153572 153762 154472 155293 156137 156885 157160 156896 156635 156806 157228 157678 158398 159567 160766 161463 161699 161941 162580
56436 162580 163768 165398 167085 168535 169906 171354 172365 172271 171431 171004 171405 171841 171603 171006 170694 170832 171315
56419 171315 172075 172843 173277 173537 174076 174711 174780 174368 174400 175232 176169 176795 177672 179164 180583 181239 181487 181975 182584
$$ packed form
56541A87323k386k733k793k561k286j915j388j002r99j235j566k025k424k334
56527A59676j780j282r76m15L91O71N2p74j050r32q90q53n93l55m96r11j301j578
56509A46604j715j634j468j381j079k31O27N71j83m20J42L83k92r29o43M1L13
56492A38706M11P56Q98M22o8J05N00L95Nj05p7k09j35M23Q71O96M74Q12J119O16
56472A46615j36NJ051K070K609K706K138Q70k04k24K73J65n24q95p78p58q66n45
56454A53572J90P10Q21Q44P48K75k64k61J71M22M50P20J169J199O97K36K42O39
56436A62580J188J630J687J450J371J448J011r4q40m27M01M36k38n97l12J38M83
56419A71315P60P68M34K60N39O35O9m12L2Q32R37O26Q77J492J419O56K48M88O09
$$ plain form
56400 182584 182864 182910 183095 183412 183670 183953 184467 185352 186843 188983 191044 192076 192303 193005 194696 196464 197545
56383 197545 198364 199375 200075 200103 200320 201707 203919 205883 207237 208295 209224 210137 211406 213048 214296 214526
56367 214526 214140 213896 213991 214450 215633 217518 219172 219813 219883 220279 221124 222084 223237 224763 226355 227804 229567
56350 229567 231864 233839 234560 234389 234456 235249 236641 238730 241616 244726 247351 249583 251938 254501 257244
56335 257244 260666 265096 269738 273401 275968 278319 281115 284436 288267 292481 296637 300566 304773 309496
56321 309496 313835 316718 318315 319584 320779 321359 321044 320076 318697 317231 316383 316639 317690 319207 321673
56306 321673 325563 330228 334635 338770 343248 348029 352737 357882 364423 372168 379859 386857 393554 400134
56292 400134 406127 411485 417030 423391 430217 436809 443033 449449 456908 465950 476195 486538 496334 506073
$$ packed form
56400A82584K80M6J85L17K58K83N14Q85J491K140K061J032K27P02J691J768J081
56383A97545Q19J011P00K8K17J387K212J964J354J058R29R13J269J642J248K30
56367B14526l86k44R5M59J183J885J654O41P0L96Q45R60J153J526J592J449J763
56350B29567K297J975P21j71O7P93J392K089K886L110K625K232K355K563K743
56335B57244L422M430M642L663K567K351K796L321L831M214M156L929M207M723
56321C09496M339K883J597J269J195N80l15r68j379j466q48K56J051J517K466
56306C21673L890M665M407M135M478M781M708N145O541P745P691O998O697O580
56292D00134N993N358N545O361O826O592O224O416P459R042J0245J0343R796R739
$$ plain form
56278 506073 516465 527486 539009 551724 566353 582420 598860 615591 633495 653117 674465
56267 674465 697867 723864 752222 782121 813467 847271 884753 926819 974220 1027374 1086077
56256 1086077 1150315 1221285 1300843 1390102 1489417 1599453 1721112 1854380 1998277 2152048
56246 2152048 2315393 2487306 2665525 2847372 3030403 3211893 3388213 3554923 3707124
56237 3707124 3839878 3948944 4031257 4084513 4106745 4097037 4056533 3988144 3895338 3781576 3650451
56226 3650451 3505557 3350258 3188003 3022509 2857044 2693796 2534434 2380930 2235249
56217 2235249 2098603 1971480 1853923 1745315 1644524 1550878 1464454 1384972 1311350 1243042
56207 1243042 1180761 1124933 1074365 1027575 984530 945816 910908 878692 849145 823065 800517
$$ packed form
56278E06073J0392J1021J1523J2715J4629J6067J6440J6731J7904J9622K1348
56267F74465K3402K5997K8358K9899L1346L3804L7482M2066M7401N3154N8703
56256A086077O4238P0970P9558Q9259R9315J10036J21659J33268J43897J53771
56246B152048J63345J71913J78219J81847J83031J81490J76320J66710J52201
56237C707124J32754J09066Q2313N3256K2232r708m0504o8389r2806j13762j31125
56226C650451j44894j55299j62255j65494j65465j63248j59362j53504j45681
56217B235249j36646j27123j17557j08608j00791r3646q6424p9482p3622o8308
56207A243042o2281n5828n0568m6790m3045l8714l4908l2216k9547k6080k2548
$$ plain form
56196 800517 780695 762935 746786 731617 717306 704701 694285 685037 675778 666914 659479 653236
56184 653236 647153 641105 635634 630699 626148 622674 620723 619221 617113 615352 615452 616790 617513 617603 618690
56169 618690 621153 623741 626101 629393 634143 639504 644943 650778 656839 662508 668368 675936 685356 695078
56155 695078 704211 713572 724172 736307 750482 767561 787571 809785 834268 862032 893588 928857
56143 928857 968565 1014219 1066689 1126368 1194646 1273311 1362053 1457797 1556387 1653473 1744253
56132 1744253 1824695 1893608 1952307 2002488 2045858 2084990 2121821 2155060 2181099 2197650 2204767
56121 2204767 2202897 2192701 2176871 2159151 2140530 2118252 2088952 2050695 2001914 1941240 1869551
56110 1869551 1790370 1707523 1624053 1543415 1469197 1402841 1343572 1291123 1246504 1209741 1179105
$$ packed form
56196H00517j9822j7760j6149j5169j4311j2605j0416r248r259q864p435o243
56184F53236o083o048n471m935m551l474j951j502k108j761J00J338P23R0J087
56169F18690K463K588K360L292M750N361N439N835O061N669N860P568R420R722
56155F95078R133R361J0600J2135J4175J7079K0010K2214K4483K7764L1556L5269
56143I28857L9708M5654N2470N9679O8278P8665Q8742R5744R8590R7086R0780
56132A744253Q0442O8913N8699N0181M3370L9132L6831L3239K6039J6551P117
56121B204767j870j0196j5830j7720j8621k2278k9300l8257m8781o0674p1689
56110A869551p9181q2847q3470q0638p4218o6356n9269n2449m4619l6763l0636
$$ plain form
56099 1179105 1153303 1132468 1116485 1104286 1095198 1089078 1084932 1081465 1079130 1079435 1082212 1085910 1090427
56086 1090427 1096878 1104582 1111400 1117325 1124639 1134009 1143618 1152754 1162959 1174748 1186473 1197569 1209773
56073 1209773 1223943 1238656 1253184 1268883 1286433 1304534 1322500 1341252 1360695 1379176 1396664
56062 1396664 1415388 1436131 1457007 1477014 1497507 1518924 1539512 1558689 1578248 1598717 1618037
56051 1618037 1635499 1653531 1673742 1694584 1714682 1735149 1756891 1779046 1801807 1827296 1855900
56040 1855900 1885283 1914694 1946441 1981410 2017189 2052549 2089540 2128910 2167833 2204735 2242208
56029 2242208 2282452 2323892 2364999 2407352 2452198 2498158 2545110 2596035 2652066 2710044 2767948
56018 2767948 2828316 2893219 2960435 3027885 3097340 3170405 3245492 3322157 3403541 3490975 3581097
$$ packed form
56099A179105k5802k0835j5983j2199r088o120m146l467k335L05K777L698M517
56086A090427O451P704O818N925P314R370R609R136J0205J1789J1725J1096J2204
56073A209773J4170J4713J4528J5699J7550J8101J7966J8752J9443J8481J7488
56062A396664J8724K0743K0876K0007K0493K1417K0588J9177J9559K0469J9320
56051A618037J7462J8032K0211K0842K0098K0467K1742K2155K2761K5489K8604
56040A855900K9383K9411L1747L4969L5779L5360L6991L9370L8923L6902L7473
56029B242208M0244M1440M1107M2353M4846M5960M6952N0925N6031N7978N7904
56018B767948O0368O4903O7216O7450O9455P3065P5087P6665Q1384Q7434R0122
$$ plain form
56007 3581097 3671959 3766801 3868051 3973114 4080178 4192499 4312492 4437349 4565222 4699893
55997 4699893 4844392 4995963 5152516 5317912 5495443 5682444 5877072 6083864 6306523
55988 6306523 6542049 6788478 7051407 7335898 7639116 7958400 8299351 8668263 9064080
55979 9064080 9486119 9942065 10439818 10979438 11562029 12198144 12898201 13663991 14499930
55970 14499930 15423179 16452387 17597868 18875542 20319832 21971164 23865805 26056427
55962 26056427 28633384 31711883 35411169 39859106 45196270 51553157 59038991 67769715
55954 67769715 77883712 89518405 102827052 118077172 135719344 156351934 180692947
55947 180692947 209548287 243361433 281053218 318847681 350503847 369527694 372084202
$$ packed form
56007C581097R0862R4842J01250J05063J07064J12321J19993J24857J27873J34671
55997D699893J44499J51571J56553J65396J77531J87001J94628K06792K22659
55988F306523K35526K46429K62929K84491L03218L19284L40951L68912L95817
55979I064080M22039M55946M97753N39620N82591O36115P00057P65790Q35939
55970A4499930R23249J029208J145481J277674J444290J651332J894641K190622
55962B6056427K576957L078499L699286M447937N337164O356887P485834Q730724
55954F7769715J0113997J1634693J3308647J5250120J7642172K0632590K4341013
55947A80692947K8855340L3813146L7691785L7794463L1656166J9023847K556508
$$ plain form
55940 372084202 358523663 332632773 299554506 263933399 229062860 196861583 168213753
55933 168213753 143360064 122190003 104397330 89562095 77231069 66985463 58457739
55926 58457739 51321810 45301868 40187043 35817936 32061340 28807440 25977292 23511640
55918 23511640 21353813 19453135 17775569 16295971 14984477 13811659 12760372 11820258
55910 11820258 10975523 10208958 9512564 8883005 8310782 7784037 7298847 6855717 6449438
55901 6449438 6071710 5720464 5397660 5100697 4824272 4567885 4333589 4118857 3918996
55892 3918996 3733885 3565240 3410046 3263765 3127364 3004240 2892707 2788417 2691689 2605414
55882 2605414 2527578 2452553 2378284 2306072 2235072 2163285 2092567 2026456 1963993 1901175 1837455
$$ packed form
55940C72084202j3560539k5890890l3078267l5621107l4870539l2201277k8647830
55933A68213753k4853689k1170061j7792673j4835235j2331026j0245606q527724
55926E8457739p135929o019942n114825m369107l756596l253900k830148k465652
55918B3511640k157827j900678j677566j479598j311494j172818j051287r40114
55910A1820258q44735p66565o96394o29559n72223n26745m85190m43130m06279
55901F449438l77728l51246l22804k96963k76425k56387k34296k14732j99861
55892C918996j85111j68645j55194j46281j36401j23124j11533j04290r6728q6275
55882B605414p7836p5025p4269p2212p1000p1787p0718o6111o2463o2818o3720
$$ plain form
55871 1837455 1775497 1715732 1656592 1599204 1546589 1498767 1453324 1410079 1370740 1334756 1299846
55860 1299846 1265810 1233702 1202197 1169001 1135008 1103109 1073844 1046032 1020502 999060 980578
55849 980578 962059 942803 923956 904986 884389 862926 842417 822300 800993 779673 760901
55838 760901 744429 728076 711894 697673 685129 672410 659778 649105 640273 631672 623652 617809
55826 617809 613250 607220 599249 591305 584079 576423 568143 560048 551467 540979 529495 519526 511548 504074
55812 504074 497005 491787 488393 485232 482036 480028 479333 478995 479283 481225 484150 486568 489172 494026 501000
55797 501000 507912 513891 519484 523675 524114 520572 515122 508671 500224 489847 479422 470083 461617 454605
55783 454605 450147 446991 441861 433587 424421 416594 410046 404318 400215 398574 399472 403613 412533 426355
$$ packed form
55871A837455o1958n9765n9140n7388n2615m7822m5443m3245l9339l5984l4910
55860A299846l4036l2108l1505l3196l3993l1899k9265k7812k5530k1442j8482
55849I80578j8519j9256j8847j8970k0597k1463k0509k0117k1307k1320j8772
55838G60901j6472j6353j6182j4221j2544j2719j2632j0673q832q601q020n843
55826F17809m559o030p971p944p226p656q280q095q581j0488j1484r969p978p474
55812E04074p069n218l394l161l196k008o95l38K88J942K925K418K604M854O974
55797E01000O912N979N593M191M39l542n450o451q447j0377j0425r339q466p012
55783D54605m458l156n130q274r166p827o548n728m103j641Q98M141Q920J3822
$$ plain form
55769 426355 442616 457809 468865 473336 470174 460782 447793 432659 415852 398972 384401 372807
55757 372807 362945 354033 346401 339873 333656 328034 324058 321400 318449 314669 310824 306870 301832 296016
55743 296016 291090 287591 284458 281371 279306 278261 276611 273480 269868 266664 263356 259410 255353 251784
55729 251784 248701 246222 244544 242864 239893 235651 231295 227079 222258 217129 213230 211143 209940 209225
55715 209225 209860 212126 214930 217573 220735 225085 230219 235400 240076 243386 244590 244271 243769 243291 241902
55700 241902 239239 235677 230915 224272 216397 208906 202273 195974 190518 187077 185001 182179 178365 175749
55686 175749 175555 176372 176703 176909 177567 178068 178136 178880 181036 183734 186174 188932 192381 195279 196235 195460 193965
55669 193965 192109 189846 187448 185150 182893 180974 179943 179640 179452 179634 180918 182728 183566 183414 183791 185006
$$ packed form
55769D26355J6261J5193J1056M471l162r392j2989j5134j6807j6880j4571j1594
55757C72807r862q912p632o528o217n622l976k658k951l780l845l954n038n816
55743B96016m926l499l133l087k065j045j650l131l612l204l308l946m057l569
55729B51784l083k479j678j680k971m242m356m216m821n129l899k087j203p15
55715B09225O35K266K804K643L162M350N134N181M676L310J204l19n02m78j389
55700B41902k663l562m762o643p875p491o633o299n456l441k076k822l814k616
55686A75749j94Q17L31K06O58N01O8P44K156K698K440K758L449K898R56p75j495
55669A93965j856k263k398k298k257j919j031l03j88J82J284J810Q38j52L77J215
$$ plain form
55653 185006 185590 185211 185837 188761 192521 195171 196732 197854 197867 196087 193746 192653 192703 192259 190315 186989
55637 186989 182577 177414 172176 167342 162821 158703 155569 153428 151323 148723 146314 144679 143326 141802
55623 141802 140645 140263 139914 138724 136827 134702 132405 130286 129309 129744 130486 130516 130054 129507 128502 126855
55607 126855 125318 124336 123164 121226 119222 117792 116268 113944 111582 110295 109818 109158 108176 107294 106295 104655
55591 104655 102523 100374 98256 96274 95122 95190 95807 96280 96904 98049 99085 99301 99171 99584 100395 100789 100552
55574 100552 100086 99710 99725 100517 101830 102655 102652 102868 104197 106007 107237 107943 108670 109128 108684 107529 106256 104906
55556 104906 103441 102465 102401 102617 102413 102198 102616 103262 103425 103433 103967 104705 104928 104944 105560 106583 107163 107318 107810
55537 107810 108762 109631 110367 111425 112680 113445 113531 113372 113194 112871 112453 112026 111247 109801 108080 106652 105308
$$ packed form
55653A85006N84l79O26K924L760K650J561J122J3j780k341j093N0m44j944l326
55637A86989m412n163n238m834m521m118l134k141k105k600k409j635j353j524
55623A41802j157l82l49j190j897k125k297k119r77M35P42L0m62n47j005j647
55607A26855j537r82j172j938k004j430j524k324k362j287m77o60r82q82r99j640
55591A04655k132k149k118j982j152O8O17M73O24J145J036K16j30M13Q11L94k37
55574A00552m66l76J5P92J313Q25lK16J329J810J230P06P27M58m44j155j273j350
55556A04906j465r76o4K16k04k15M18O46J63QN34P38K23J6O16J023N80J55M92
55537A07810R52Q69P36J058J255P65Q6j59j78l23m18m27p79j446j721j428j344
$$ plain form
55520 105308 103418 100991 98699 97130 96596 97168 98182 98309 96949 95092 93936 93303 92332 91098 90298 89824
55504 89824 88967 87875 87584 88510 89911 90862 91018 90470 89556 88749 88181 87535 86887 87087 88583 90469 91547
55487 91547 91801 91873 91714 90852 89565 88601 88002 87304 86657 86641 87181 87743 88452 89911 92006 93894 95113 95763
55469 95763 95714 94686 93026 91434 89924 87975 85643 83549 81838 80152 78630 77943 78220 78861 79579 80714
55453 80714 82347 83871 84758 85136 85411 85782 86168 86273 85774 84856 84329 84688 85427 85794 85864 86161 86617 86697 86257
55434 86257 85533 84594 83609 83285 84153 85673 86857 87475 87794 87588 86500 85084 84330 84275 84111 83563 83168 83311
55416 83311 83980 85316 87268 88794 88577 86643 84292 82469 81210 80578 80869 81697 82051 81554 80717 79835 78692
55399 78692 77537 77188 77837 78747 79470 80311 81246 81480 80711 79893 80077 81156 82403 83597 85022 86752 88468
$$ packed form
55520A05308j890k427k292j569n34N72J014J27j360j857j156o33r71j234q00m74
55504H9824q57j092k91R26J401R51J56n48r14q07n68o46o48K00J496J886J078
55487I1547K54P2j59q62j287r64n99o98o47j6N40N62P09J459K095J888J219O50
55469I5763m9j028j660j592j510j949k332k094j711j686j522o87K77O41P18J135
55453H0714J633J524Q87L78K75L71L86J05m99r18n27L59P39L67P0K97M56Q0m40
55434H6257p24r39r85l24Q68J520J184O18L19k06j088j416p54n5j64n48l95J43
55416H3311O69J336J952J526k17j934k351j823j259o32K91Q28L54m97q37q82j143
55399G8692j155l49O49R10P23Q41R35K34p69q18J84J079J247J194J425J730J716
$$ plain form
55382 88468 89741 90230 89898 89194 88635 88158 87293 85991 84800 84192 84219 84760 85511 85832 85297 84430 84218 84873
55364 84873 85746 86362 86767 86873 86399 85624 85322 85680 86001 85697 84887 83864 82755 81920 81890 82535 82974 82643 81927
55345 81927 81528 81792 82782 84314 85635 85790 84645 83050 81827 81119 80872 81159 81781 82207 82265 82375 82839 83416
55327 83416 83791 83951 83930 83782 83918 84823 86215 87174 87396 87642 88555 89622 89837 89030 88070 87908 88620 89358 89223
55308 89223 88343 87822 88370 89320 89548 88961 88319 87901 87307 86479 85879 85576 85077 84213 83355 82616 81739 80925 80861
55289 80861 81683 82771 83803 85046 86297 86576 85478 83994 83308 83431 83578 83403 83223 83453 84254 85472 86578
55272 86578 86980 86619 85997 85559 85453 85804 86607 87339 87390 86960 86858 87321 87755 87766 87641 87629 87516 87164 86807 86575
55252 86575 86366 86320 86712 87334 87700 87911 88472 89309 89938 90580 91884 93443 93907 92910 91544 90562 89498 88178
$$ packed form
55382H8468J273M89l32p04n59m77q65j302j191o08K7N41P51L21n35q67k12O55
55364H4873Q73O16M05J06m74p75l02L58L21l04q10j023j109q35l0O45M39l31p16
55345H1927l99K64R90J532J321J55j145j595j223p08k47K87O22M26N8J10M64N77
55327H3416L75J60k1j48J36R05J392R59K22K46R13J067K15q07r60j62P12P38j35
55308H9223q80n21N48R50K28n87o42m18n94q28o00l03m99q64q58p39q77q14o4
55289H0861Q22J088J032J243J251K79j098j484o86J23J47j75j80K30Q01J218J106
55272H6578M02l61o22m38j06L51Q03P32N1m30j02M63M34J1j25j2j13l52l57k32
55252H6575k09m6L92O22L66K11N61Q37O29O42J304J559M64r97j366r82j064j320
$$ plain form
55234 88178 87555 88086 88537 87601 85745 84363 83955 84182 84868 85794 86195 85660 85017 85280 86211 86927 87421 88358
55216 88358 89750 90939 91666 92155 92372 92135 91830 92039 92491 92274 91136 89907 89494 90041 91088 92108 92881
55199 92881 93586 94462 95185 94990 93682 92131 91355 91542 92284 93223 94012 94203 93755 93229 93002 92782 92336 92022
55181 92022 91967 91444 89853 87791 86363 85883 85982 86459 87190 87706 87760 87894 88591 89286 89212 88831 89338 90967 92829
55162 92829 94287 95484 96497 96963 96748 96299 96190 96777 98150 99876 101031 101099 100580 100087 99270 97459 94979
55145 94979 92850 91481 90641 90405 90887 91227 90278 88469 87668 88822 90895 92529 93540 94177 94086 92981 91512
55128 91512 90547 90035 89432 88842 88943 89967 91408 92681 93573 94195 94910 96166 97953 99461 99740 98732 97364
55111 97364 96530 96254 96012 95712 96040 97708 100473 103218 105021 105812 105890 105266 103954 102603 102147 102776 103726
$$ packed form
55234H8178o23N31M51r36j856j382m08K27O86R26M01n35o43K63R31P16M94R37
55216H8358J392J189P27M89K17k37l05K09M52k17j138j229m13N47J047J020P73
55199I2881P05Q76P23j95j308j551p76J87P42R39P89J91m48n26k27k20m46l14
55181I2022n5n23j591k062j428m80R9M77P31N16N4J34O97O95p4l81N07J629J862
55162I2829J458J197J013M66k15m49j09N87J373J726J155O8n19m93q17j811k480
55145I4979k129j369q40k36M82L40r49j809q01J154K073J634J011O37r1j105j469
55128I1512r65n12o03n90J01J024J441J273Q92O22P15J256J787J508K79j008j368
55111I7364q34k76k42l00L28J668K765K745J803P91P8o24j312j351m56O29R50
$$ plain form
55094 103726 104194 104108 103880 103815 103993 104498 105505 107083 108932 110323 110574 109784 108855 108511 108532 108297 107858 107888 108661
55075 108661 109673 110384 110795 111056 110959 110207 108963 107816 107206 107078 107074 106933 106713 106652 106912 107479 108240 108965 109262
55056 109262 108830 107847 106809 105895 104821 103511 102528 102471 103213 104085 104634 104898 105111 105454 105946 106334 106251 105631
55038 105631 104777 103849 102707 101458 100626 100395 100234 99766 99489 99930 100589 100620 100214 100322 101088 101613 101399 101016
55020 101016 101029 101119 100760 100078 99484 98984 98437 98140 98546 99560 100601 101283 101710 102128 102601 103049 103400 103653 103906
55001 103906 104319 104969 105774 106618 107487 108402 109220 109652 109606 109468 109835 110830 111845 112171 111766 111157 110767 110704 111067
54982 111067 111849 112492 112217 111102 110279 110699 112143 113743 114926 115417 114927 113543 112073 111264 110881 110213 109308
54965 109308 108995 109713 110930 111808 111981 111630 111191 111068 111366 111920 112727 114103 116092 118035 119156 119345 118978
$$ packed form
55094A03726M68q6k28o5J78N05J007J578J849J391K51p90r29l44K1k35m39L0P73
55075A08661J012P11M11K61r7p52j244j147o10j28mj41k20o1K60N67P61P25K97
55056A09262m32r83j038r14j074j310r83n7P42Q72N49K64K13L43M92L88q3o20
55038A05631q54r28j142j249q32k31j61m68k77M41O59L1m06J08P66N25k14l83
55020A01016J3R0l59o82n94n00n47k97M06J014J041O82M27M18M73M48L51K53K53
55001A03906M13O50Q05Q44Q69R15Q18M32m6j38L67R95J015L26m05o09l90o3L63
54982A11067P82O43k75j115q23M20J444J600J183M91m90j384j470q09l83o68r05
54965A09308l13P18J217Q78J73l51m39j23K98N54Q07J376J989J943J121J89l67
$$ plain form
54948 118978 118293 117469 117010 117297 117880 117877 117084 116136 115596 115468 115584 115905 116317 116623 116817 117004 117116 117144 117559 118954
54928 118954 121257 123757 125970 128074 130570 133934 138503 144146 150013 155143 159409 163508 168030 172854
54914 172854 177286 180336 181069 179263 175704 171346 166342 160479 154268 148766 144353 140510 136876 133715
54900 133715 131199 129006 126939 125263 124147 123386 122948 123177 124153 125393 126488 127514 128550 129396 130125 131326
54884 131326 133328 135602 137420 138837 140623 143435 147347 151995 156925 161905 167020 172278 177160 180838
54870 180838 182811 182969 181177 177413 172323 166950 161684 156069 149895 143858 138807 134883 131818 129583
54856 129583 128232 127431 126605 125403 123750 121726 119655 118015 117012 116403 115929 115505 114867 113533 111516 109676
54840 109676 108882 109035 109309 109166 108772 108510 108509 108689 109025 109631 110547 111484 111926 111723 111446 111823 112851 113800 114088
$$ packed form
54948A18978o85q24m59K87N83lp93r48n40j28J16L21M12L06J94J87J12K8M15J395
54928A18954K303K500K213K104K496L364M569N643N867N130M266M099M522M824
54914A72854M432L050P33j806l559m358n004n863o211n502m413l843l634l161
54900A33715k516k193k067j676j116p61m38K29R76J240J095J026J036Q46P29J201
54884A31326K002K274J818J417J786K812L912M648M930M980N115N258M882L678
54870A80838J973J58j792l764n090n373n266n615o174o037n051l924l065k235
54856A29583j351q01q26j202j653k024k071j640j003o09m74m24o38j334k017j840
54840A09676p94J53K74j43l94k62jJ80L36O06R16R37M42k03k77L77J028R49K88
$$ plain form
54821 114088 113776 113197 112615 112299 112473 112941 113151 112856 112418 112304 112588 113149 114019 115316 117008 118861 120467
54804 120467 121385 121546 121443 121621 122084 122567 123114 123759 123839 122512 120042 117702 116276 115432 114807 114752 115489 116442
54786 116442 117082 117717 118713 119527 119370 118477 117895 118202 119173 120544 122407 124778 127326 129679 131746 133804
54770 133804 136505 140578 146158 152550 158962 165328 172020 178923 185222 190076 193150 194470 194037 191758
54756 191758 187719 182513 177138 172288 167778 163001 157945 153304 149510 146219 143022 140110 137842 136109
54742 136109 134635 133524 132987 132762 132343 131639 131009 130784 131137 132208 133872 135439 136148 136091 136272 137573 139875
54725 139875 142387 144723 147417 151244 156173 161324 166050 170594 175265 179347 181536 181386 179587 176767
54711 176767 172825 167691 162023 156681 152060 148327 145686 143923 142247 140206 138366 137445 137173 136637 135551
$$ packed form
54821A14088l12n79n82l16J74M68K10k95m38j14K84N61Q70J297J692J853J606
54804A20467R18J61j03J78M63M83N47O45Q0j327k470k340j426q44o25n5P37R53
54786A16442O40O35R96Q14j57q93n82L07R71J371J863K371K548K353K067K058
54770A33804K701M073N580O392O412O366O692O903O299M854L074J320m33k279
54756A91758m039n206n375m850m510m777n056m641l794l291l197k912k268j733
54742A36109j474j111n37k25m19p04o30k25L53J071J664J567P09n7J81J301K302
54725A39875K512K336K694L827M929N151M726M544M671M082K189j50j799k820
54711A76767l942n134n668n342m621l733k641j763j676k041j840r21k72n36j086
$$ plain form
54696 135551 134488 133976 133860 133547 132477 130467 128009 126140 125597 126087 126612 126384 125232 123450 121613 120328
54680 120328 119739 119373 118723 117852 117179 116987 117413 118547 120086 121189 121196 120402 119680 119519 119785 120182 120467 120354
54662 120354 119725 118871 118143 117467 116632 115921 115939 116827 118114 119362 120491 121454 122073 122413 122915 123862 124878 125245
54644 125245 124678 123644 122914 122860 123252 123671 123942 124062 123934 123505 123086 123105 123457 123432 122417 120501 118382 116924
54626 116924 116716 117654 118937 119829 120376 120988 121520 121479 121064 121099 121794 122439 122599 122716 123120 123371 123179 123082 123470
54607 123470 123741 123270 122532 122331 122481 122293 121912 122069 122761 123251 123328 123650 124737 126359 127933 128887 128738 127512
54589 127512 126084 125447 125633 125868 125658 125102 124308 123273 122358 122194 122997 124405 125894 126900 126822 125611 124221
54572 124221 123746 124149 124490 124257 123742 123222 122678 122386 122927 124409 126356 128468 130753 132773 133582 132778 131026
$$ packed form
54696A35551j063n12j16l13j070k010k458j869n43M90N25k28j152j782j837j285
54680A20328n89l66o50q71o73j92M26J134J539J103Pp94p22j61K66L97K85j13
54662A20354o29q54p28o76q35p11J8Q88J287J248J129R63O19L40N02R47J016L67
54644A25245n67j034p30n4L92M19K71J20j28m29m19J9L52k5j015j916k119j458
54626A16924k08R38J283Q92N47O12N32m1m15L5O95O45J60J17M04K51j92r7L88
54607A23470K71m71p38k01J50j88l81J57O92M90P7L22J087J622J574R54j49j226
54589A27512j428o37J86K35k10n56p94j035r15j64Q03J408J489J006p8j211j390
54572A24221m75M03L41k33n15n20n44k92N41J482J947K112K285K020Q09q04j752
$$ plain form
54555 131026 129291 128102 127720 128375 129936 131874 133755 135361 136233 135769 134070 132105 130737 130036 129811 130204
54539 130204 131323 132786 134070 135074 135992 136927 137863 138712 139111 138518 136839 134683 132740 131155 129798 128850
54523 128850 128723 129484 130605 131344 131308 130709 130093 129745 129409 128719 127735 126841 126236 125861 125761 126174 127215 128703
54505 128703 130271 131477 131998 131932 131771 131814 131869 131770 131814 132201 132416 131756 130266 128607 127252 126395 126312 126999 127726
54486 127726 127786 127575 128010 129029 129700 129774 129971 130516 130645 130064 129781 130741 132484 133996 135178 136656 138567
54469 138567 140412 141866 143007 143835 144133 143815 143103 142385 142034 142180 142536 142695 142664 142710 142671 142002 140715 139638
54451 139638 139354 139382 138870 137663 136293 135270 134809 134887 135199 135307 135183 135297 135904 136603 136946 137020 137079 136997 136534
54432 136534 135801 135028 134184 133262 132569 132315 132227 132109 132463 133938 136304 138562 140047 140966 141850 142900 143927
$$ packed form
54555A31026j735j189l82O55J561J938J881J606Q72m64j699j965j368p01k25L93
54539A30204J119J463J284J004R18R35R36Q49L99n93j679k156j943j585j357r48
54523A28850j27P61J121P39l6n99o16l48l36o90r84q94o05l75j00M13J041J488
54505A28703J568J206N21o6j61M3N5r9M4L87K15o60j490j659j355q57q3O87P27
54486A27726O0k11M35J019O71P4J97N45J29n81k83R60J743J512J182J478J911
54469A38567J845J454J141Q28K98l18p12p18l51J46L56J59l1M6l9o69j287j077
54451A39638k84K8n12j207j370j023m61P8L12J08j24J14O07O99L43P4N9q2m63
54432A36534p33p73q44r22o93k54q8j18L54J475K366K258J485R19Q84J050J027
$$ plain form
54415 143927 144617 144791 144554 144237 144103 144208 144578 145260 146049 146495 146438 146294 146515 146987 147290 147378 147667 148490 149674
54396 149674 150636 150874 150494 150272 150863 151887 152189 151238 149872 149347 149975 151004 151567 151373 150684 149982 149567 149282
54378 149282 148781 148180 148132 149027 150466 151840 153178 155022 157636 160713 163779 166617 169340 172231 175413
54363 175413 178607 181415 183937 186762 190215 193914 197212 199738 201290 201705 201150 200196 199153 197642 195143
54348 195143 191711 187752 183436 178789 174116 169838 166022 162526 159471 157187 155730 154818 154190 153764 153522
54333 153522 153462 153516 153344 152473 150955 149602 149173 149541 150065 150562 151380 152569 153561 153804 153404 152959 152994 153597 154449
54314 154449 155090 155244 154922 154295 153588 153069 152854 152713 152290 151599 151005 150668 150386 150087 150005 150128 149960 149150 148044
54295 148044 147262 147058 147343 147986 148732 149189 149266 149302 149509 149676 149731 150060 150786 151292 151059 150549 150572 151124 151601 151864
$$ packed form
54415A43927O90J74k37l17j34J05L70O82P89M46n7j44K21M72L03Q8K89Q23J184
54396A49674R62K38l80k22N91J024L02r51j366n25O28J029N63j94o89p02m15k85
54378A49282n01o01m8Q95J439J374J338J844K614L077L066K838K723K891L182
54363A75413L194K808K522K825L453L699L298K526J552M15n55r54j043j511k499
54348A95143l432l959m316m647m673m278l816l496l055k284j457r12o28m26k42
54333A53522o0N4j72q71j518j353m29L68N24M97Q18J189R92K43m00m45L5O03Q52
54314A54449O41J54l22o27p07n19k15j41m23o91n94l37k82k99q2J23j68q10j106
54295A48044p82k04K85O43P46M57P7L6K07J67N5L29P26N06k33n10K3N52M77K63
$$ plain form
54275 151864 152313 153065 153825 154526 155311 155898 155719 154793 153815 153235 152853 152461 152334 152818 153896 155416 157358 159665
54257 159665 162000 163837 164684 164399 163559 163284 164147 165371 165647 164738 163687 163393 163658 163778 163471 162848 161981
54240 161981 160958 160055 159508 159232 158977 158598 158097 157644 157652 158482 159893 161107 161677 162001 162691 163653 164151 163749
54222 163749 162856 162240 162200 162379 162353 162171 162147 162219 161867 160807 159459 158458 157875 157228 156186 154947 153949 153417
54204 153417 153227 153074 152831 152806 153468 154796 156204 157283 158208 159047 159143 157885 155876 154557 154597 155264 155556 155357
54186 155357 155277 155821 157018 158526 159819 160531 160777 160905 160854 160134 158597 156850 155643 155121 154988 155148 155811
54169 155811 157044 158491 159601 159977 159605 158879 158371 158363 158561 158362 157496 156358 155590 155347 155144 154574 153974 154037
54151 154037 154814 155609 155954 156235 157041 158268 159299 159729 159536 158808 157831 157257 157578 158475 159154 159307 159294 159444
$$ packed form
54275A51864M49P52P60P01P85N87j79r26r78n80l82l92j27M84J078J520J942K307
54257A59665K335J837Q47k85q40k75Q63J224K76r09j051k94K65J20l07o23q67
54240A61981j023r03n47k76k55l79n01m53QQ30J411J214N70L24O90R62M98m02
54222A63749q93o16m0J79k6j82k4P2l52j060j348j001n83o47j042j239r98n32
54204A53417j90j53k43k5O62J328J408J079R25Q39R6j258k009j319M0O67K92j99
54186A55357q0N44J197J508J293P12K46J28n1p20j537j747j207n22j33J60O63
54169A55811J233J447J110L76l72p26n08qJ98j99q66j138p68k43k03n70o00O3
54151A54037P77P95L45K81Q06J227J031M30j93p28r77n74L21Q97O79J53j3J50
$$ plain form
54133 159444 159716 160065 160580 161147 161482 161630 161938 162393 162507 162119 161816 162212 163208 164353 165571 167022 168431
54116 168431 169172 169052 168625 168541 168901 169431 170058 170966 172105 173063 173619 174175 175286 176902 178470 179690 180688
54099 180688 181374 181315 180577 180124 180845 182546 184436 186313 188629 191626 195108 198992 203405 208170 212770 216955
54083 216955 220835 224187 226150 225899 223440 219645 215668 212250 209295 206218 202953 200404 199420 199577 199617
54068 199617 198980 198140 197480 196739 195844 195400 195872 196850 197650 198139 198528 198851 199165 199836 201005 202093 202466 202376
54050 202376 202691 203847 205723 208480 212774 218867 225975 232851 238841 244159 249316 254532 259643 264358
54036 264358 268586 272531 276483 280422 283872 286256 287498 288191 289053 290302 291692 293032 294363 295592 296346
54021 296346 296427 296142 295922 295839 295739 295587 295303 294453 292544 289610 286225 282856 279478 275791 271616 267110 262685
$$ packed form
54133A59444K72L49N15N67L35J48L08M55J14l88l03L96R96J145J218J451J409
54116A68431P41j20m27q4L60N30O27R08J139R58N56N56J111J616J568J220R98
54099A80688O86n9p38m53P21J701J890J877K316K997L482L884M413M765M600M185
54083B16955L880L352J963k51k459l795l977l418k955l077l265k549r84J57M0
54068A99617o37q40o60p41q95m44M72R78Q00M89L89L23L14O71J169J088L73r0
54050B02376L15J156J876K757M294O093P108O876N990N318N157N216N111M715
54036B64358M228L945L952L939L450K384J242O93Q62J249J390J340J331J229P54
54021B96346Q1k85k20q3j00j52k84q50j909k934l385l369l378l687m175m506m425
$$ plain form
54004 262685 258563 254366 249494 244101 239226 235605 232811 230110 227663 226126 225415 224759 223864 223098 222511
53989 222511 221566 220036 218374 216915 215410 213695 212169 211155 210332 209173 207623 206045 204907 204658 205434
53974 205434 206593 207073 206544 205782 205633 206054 206457 206557 206489 206470 206771 207744 209479 211605 213594 215082 215853 215915
53956 215915 215777 216216 217621 219903 223082 227389 232590 237872 242783 247793 253631 260555 268592 277910 288439
53941 288439 299580 310636 321063 329973 336065 338712 338652 337015 334084 329693 324443 319730 316596 315122
53927 315122 314854 315326 316261 317666 319697 322197 324672 327013 329826 333620 338037 342453 346983 352221 358210
53912 358210 364339 370193 375922 381732 387453 392604 396583 398925 399716 399596 399076 398098 396546 394688 392584
53897 392584 389526 384874 379252 374074 369931 366092 361554 355931 349317 342034 334677 327815 321455 315221
$$ packed form
54004B62685m122m197m872n393m875l621k794k701k447j537p11o56q95p66n87
53989B22511r45j530j662j459j505j715j526j014q23j159j550j578j138k49P76
53974B05434J159M80n29p62j49M21M03J00o8j9L01R73J735K126J989J488P71O2
53956B15915j38M39J405K282L179M307N201N282M911N010N838O924Q037R318J0529
53941B88439J1141J1056J0427Q910O092K647o0j637k931m391n250m713l134j474
53927C15122k68M72R35J405K031K500K475K341K813L794M417M416M530N238N989
53912C58210O129N854N729N810N721N151L979K342P91j20n20r78j552j858k104
53897C92584l058m652n622n178m143l839m538n623o614p283p357o862o360o234
$$ plain form
53883 315221 309073 303325 297948 292513 286992 282042 278266 275600 273544 271533 269003 265652 261875 258488
53869 258488 255818 253455 251010 248517 245942 242919 239404 236037 233388 231229 229005 226722 224796 223337
53855 223337 222141 221293 221144 221593 221899 221442 220411 219483 218990 218607 217789 216353 214626 213163 212369 212231 212254
53838 212254 211746 210411 208772 207814 208058 209102 210213 211121 211967 212726 213153 213328 213767 214706 215585 215624 214843 214263
53820 214263 214959 217063 219772 222211 224133 225764 227250 228535 229718 231193 233325 236172 239537 243050
53806 243050 246165 248544 250661 253627 258002 263088 267847 272271 277288 283343 289706 295263 299493 302438
53792 302438 304205 304952 305144 305398 306040 306990 308016 308929 309550 309667 309144 308008 306331 304006 300698 296138
53776 296138 290510 284432 278510 272973 267783 262929 258426 254125 249789 245481 241729 239149 237832 237101
$$ packed form
53883C15221o148n748n377n435n521m950l776k666k056k011k530l351l777l387
53869B58488k670k363k445k493k575l023l515l367k649k159k224k283j926j459
53855B23337j196q48j49M49L06m57j031r28m93l83q18j436j727j463p94j38K3
53838B12254n08j335j639r58K44J044J111R08Q46P59M27J75M39R39Q79L9p81n80
53820B14263O96K104K709K439J922J631J486J285J183J475K132K847L365L513
53806B43050L115K379K117K966M375N086M759M424N017O055O363N557M230K945
53792C02438J767P47J92K54O42R50J026R13O21J17n23j136j677k325l308m560
53776B96138n628o078n922n537n190m854m503m301m336m308l752k580j317p31
$$ plain form
53762 237101 235944 233744 230645 227299 224314 221954 220080 218253 216081 213762 212101 211672 212029 212149 211637
53747 211637 211083 211208 212120 213493 214927 215902 215892 214952 213912 213642 214308 215557 217056 218511 219508 219819 219739
53730 219739 219808 220302 221214 222522 224160 225936 227745 229701 231862 234085 236325 238702 241009 242601 243207
53715 243207 243442 244046 244957 245695 246297 247143 248092 248578 248632 249070 250518 252735 255129 257482 260017 263087 267003
53698 267003 271900 277620 283779 289872 295198 298939 300707 300940 300387 299380 297952 296479 295618 295553 295755 295555
53682 295555 294643 293067 291118 289288 287945 287013 286223 285666 285726 286502 287613 288574 289076 288995 288483 287984 287786 287573
53664 287573 286793 285424 283997 282913 282134 281519 281070 280781 280600 280565 280744 281064 281428 281882 282434 282943 283512 284604
53646 284604 286329 287933 288633 288708 289118 290230 291688 293328 295357 297592 299453 300884 302419 304145 305398
$$ packed form
53762B37101j157k200l099l346k985k360j874j827k172k319j661m29L57J20n12
53747B11637n54J25R12J373J434R75j0r40j040k70O66J249J499J455R97L11q0
53730B19739O9M94R12J308J638J776J809J956K161K223K240K377K307J592O06
53715B43207K35O04R11P38O02Q46R49M86N4M38J448K217K394K353K535L070L916
53698B67003M897N720O159O093N326L741J768K33n53j007j428j473q61o5K02k00
53682B95555r12j576j949j830j343r32p90n57O0P76J111R61N02q1n12m99j98k13
53664B87573p80j369j427j084p79o15m49k89j81l5J79L20L64M54N52N09N69J092
53646B84604J725J604P00P5M10J112J458J640K029K235J861J431J535J726J253
$$ plain form
53631 305398 305872 306206 307081 308417 309937 311881 314561 317695 320806 323965 327621 331900 336485 341045 345480
53616 345480 349924 354713 360161 366177 372333 378384 384366 390104 395105 399185 402767 406317 409817 413048
53602 413048 415924 418250 419555 419553 418524 416952 415092 413091 411171 409399 407655 406073 405130 404949 404940 404487
53586 404487 403618 402580 401141 398874 395889 392738 389691 386611 383512 380813 378937 377914 377383 376818 375778
53571 375778 374160 372231 370335 368587 366932 365361 364030 363255 363357 364334 365706 366919 367866 368750 369513 369871
53555 369871 369918 370174 370842 371487 371743 371954 372793 374469 376565 378473 379822 380745 381841 383665 386214 389184
53539 389184 392653 396964 401939 406878 411539 416556 422483 428997 435417 441608 447958 454858 462631 471586
53525 471586 481740 492741 504357 516663 529474 542065 553935 565567 578030 592122 608073
$$ packed form
53631C05398M74L34Q75J336J520J944K680L134L111L159L656M279M585M560M435
53616C45480M444M789N448O016O156O051N982N738N001M080L582L550L500L231
53602D13048K876K326J305kj029j572j860k001j920j772j744j582r43j81rm53
53586D04487q69j038j439k267k985l151l047l080l099k699j876j023n31n65j040
53571C75778j618j929j896j748j655j571j331p75J02R77J372J213R47Q84P63L58
53555C69871M7K56O68O45K56K11Q39J676K096J908J349R23J096J824K549K970
53539C89184L469M311M975M939M661N017N927O514O420O191O350O900P773Q955
53525D71586J0154J1001J1616J2306J2811J2591J1870J1632J2463J4092J5951
$$ plain form
53514 608073 625681 644348 663466 683168 704249 726933 750208 772960 795250 817801 840616
53503 840616 862881 884041 904250 923858 943054 961884 980093 997009 1012208 1026251 1040270
53492 1040270 1054869 1069863 1084975 1100204 1115524 1130779 1146023 1161611 1177816 1194581 1211603
53481 1211603 1228393 1244373 1259143 1272651 1284912 1295812 1305302 1313441 1319963 1324219 1325943 1325662 1323866
53468 1323866 1320257 1314435 1306949 1298801 1290087 1279910 1267698 1253985 1239804 1225868 1212311 1198712
53456 1198712 1184288 1168518 1151640 1134231 1116530 1098609 1080874 1063717 1046770 1029292 1011273
53445 1011273 993571 977004 961964 948756 937489 927602 918450 910533 905205 902790 901842 900780 899529
53432 899529 898967 899432 900584 902383 905364 909993 916223 923722 932191 941550 952027 964018 977635 992510
$$ packed form
53514F08073J7608J8667J9118J9702K1081K2684K3275K2752K2290K2551K2815
53503H40616K2265K1160K0209J9608J9196J8830J8209J6916J5199J4043J4019
53492A040270J4599J4994J5112J5229J5320J5255J5244J5588J6205J6765J7022
53481A211603J6790J5980J4770J3508J2261J0900R490Q139O522M256J724k81j796
53468A323866l609n822p486q148q714j0177j2212j3713j4181j3936j3557j3599
53456A198712j4424j5770j6878j7409j7701j7921j7735j7157j6947j7478j8019
53445A011273j7702j6567j5040j3208j1267r887r152p917n328k415r48j062j251
53432H99529n62M65J152J799K981M629O230P499Q469R359J0477J1991J3617J4875
$$ plain form
53418 992510 1008212 1024711 1042280 1061048 1080818 1101230 1122061 1143486 1166103 1190531 1217016
53407 1217016 1245577 1276394 1309562 1344489 1380021 1415419 1450970 1487531 1525877 1566566 1609898
53396 1609898 1655585 1702729 1750520 1798768 1847559 1896638 1945478 1993828 2041824 2089575 2136746
53385 2136746 2182542 2226063 2266935 2305672 2343103 2379204 2412724 2442255 2467479 2489041 2507284
53374 2507284 2521596 2531145 2535952 2536864 2534368 2527675 2515200 2495957 2470332 2439448 2404170 2364946
53362 2364946 2322338 2277192 2230298 2182210 2133429 2084425 2035455 1986710 1938709 1892301 1848169
53351 1848169 1806569 1767423 1730259 1694107 1658007 1621815 1586091 1551040 1516118 1481057 1446744
53340 1446744 1414545 1384998 1357727 1332433 1309321 1288521 1269625 1252078 1235748 1220876 1207631
$$ packed form
53418I92510J5702J6499J7569J8768J9770K0412K0831K1425K2617K4428K6485
53407A217016K8561L0817L3168L4927L5532L5398L5551L6561L8346M0689M3332
53396A609898M5687M7144M7791M8248M8791M9079M8840M8350M7996M7751M7171
53385B136746M5796M3521M0872L8737L7431L6101L3520K9531K5224K1562J8243
53374B507284J4312R549M807R12k496o693j2475j9243k5625l0884l5278l9224
53362B364946m2608m5146m6894m8088m8781m9004m8970m8745m8001m6408m4132
53351A848169m1600l9146l7164l6152l6100l6192l5724l5051l4922l5061l4313
53340A446744l2199k9547k7271k5294k3112k0800j8896j7547j6330j4872j3245
$$ plain form
53329 1207631 1195892 1185337 1175559 1166165 1156860 1147460 1137746 1127362 1116036 1104022 1092272 1081961
53317 1081961 1073668 1066981 1060925 1054804 1048740 1043552 1040143 1038849 1039268 1040735 1042951 1046012 1049914 1054420
53303 1054420 1059568 1065967 1074247 1084406 1096039 1109037 1123623 1139802 1157274 1175930 1196032 1217688
53291 1217688 1240501 1263888 1287551 1311363 1334966 1357699 1378883 1398100 1415233 1430368 1443668
53280 1443668 1455300 1465310 1473420 1478949 1481202 1480072 1476150 1470114 1462229 1452488 1440951 1427635 1412301
53267 1412301 1394640 1374573 1352252 1328049 1302740 1277289 1252068 1226656 1200752 1174859 1149455
53256 1149455 1123927 1097234 1069484 1042008 1015821 990886 966964 944271 922852 902076 881303
53245 881303 860569 840091 819589 798720 777913 758152 739882 722601 705645 689115 673830
$$ packed form
53329A207631j1739j0555r778r394r305r400r714j0384j1326j2014j1750j0311
53317A081961q293o687o056o121o064n188l409j294M19J467K216L061L902M506
53303A054420N148O399Q280J0159J1633J2998J4586J6179J7472J8656K0102K1656
53291A217688K2813K3387K3663K3812K3603K2733K1184J9217J7133J5135J3300
53280A443668J1632J0010Q110N529K253j130l922o036p885r741j1537j3316j5334
53267A412301j7661k0067k2321k4203k5309k5451k5221k5412k5904k5893k5404
53256A149455k5528k6693k7750k7476k6187k4935k3922k2693k1419k0776k0773
53245H81303k0734k0478k0502k0869k0807j9761j8270j7281j6956j6530j5285
$$ plain form
53234 673830 660428 648704 638049 628402 620333 613961 608344 602421 596133 589967 583765 576883 569319
53221 569319 561586 553345 543310 530991 517622 504764 492726 480934 469189 457786 446919 436725
53209 436725 427600 419787 412942 406629 400956 396154 391870 387467 382692 377447 371268 363875 356066 349173
53195 349173 343539 338240 332452 326415 320854 316047 311794 307909 304352 301118 298267 295905 293979 292233
53181 292233 290463 288679 286894 284921 282524 279709 276781 274083 271719 269535 267420 265551 264263 263669
53167 263669 263556 263591 263442 262763 261436 259915 259006 259116 259896 260699 261053 260629 259261 257280 255437 254101 252854
53150 252854 251279 249797 249254 249879 251115 252317 253127 253246 252458 251021 249684 249112 249356 249931 250257 250129 249836
53133 249836 249755 249842 249773 249684 250308 252061 254394 256437 257951 259179 260057 260284 260050 260068 260792 262073 263615 265307
$$ packed form
53234F73830j3402j1724j0655r647q069o372n617n923o288o166o202o882p564
53221E69319p733q241j0035j2319j3369j2858j2038j1792j1745j1403j0867j0194
53209D36725r125p813o845o313n673m802m284m403m775n245o179p393p809o893
53195C49173n634n299n788o037n561m807m253l885l557l234k851k362j926j746
53181B92233j770j784j785j973k397k815k928k698k364k184k115j869j288n94
53167B63669j13L5j49o79j327j521r09J10P80Q03L54m24j368j981j843j336j247
53150B52854j575j482n43O25J236J202Q10J19p88j437j337n72K44N75L26j28k93
53133B49836q1Q7o9q9O24J753K333K043J514J228Q78K27k34J8P24J281J542J692
$$ plain form
53115 265307 267007 268432 269421 270013 270194 269888 269248 268572 267791 266370 263997 261129 258699 257323 256841 256500
53099 256500 255574 253967 252293 251298 251213 251674 252110 252039 251215 249762 248130 246754 245835 245516 245998 247180 248463
53082 248463 249284 249724 250226 250883 251387 251560 251474 251102 250306 249229 248242 247460 246659 245770 245109 245019 245460 246023 246165
53063 246165 245566 244555 244047 244638 245803 246380 245799 244443 242891 241383 240102 239350 239112 238889 238296 237561 237154
53046 237154 237203 237493 237850 238228 238577 238813 238893 238798 238506 237991 237248 236386 235801 236012 237080 238328 238981 238994 238942 239262
53026 239262 239984 241026 242231 243191 243591 243713 244072 244565 244627 244257 244132 244533 244910 244821 244560 244419 244050 243245 242749
53007 242749 243509 245348 247052 247654 247142 246091 245151 244839 245338 246397 247626 248742 249420 249318 248638 248299 249006
52990 249006 250426 251809 253131 254935 257247 259426 261089 262457 263649 264369 264557 264718 265264 266033 266786 267622
$$ packed form
53115B65307J700J425R89N92J81l06o40o76p81j421k373k868k430j376m82l41
53099B56500r26j607j674r95q5M61M36p1q24j453j632j376r19l19M82J182J283
53082B48463Q21M40N02O57N04J73q6l72p96j077r87p82q01q89o61r0M41N63J42
53063B46165n99j011n08N91J165N77n81j356j552j508j281p52k38k23n93p35m07
53046B37154M9K90L57L78L49K36Q0r5k92n15p43q62n85K11J068J248O53J3n2L20
53026B39262P22J042J205R60M00J22L59M93O2l70j25M01L77q9k61j41l69q05m96
53007B42749P60J839J704O02n12j051r40l12M99J059J229J116O78j02o80l39P07
52990B49006J420J383J322J804K312K179J663J368J192P20J88J61N46P69P53Q36
$$ plain form
52974 267622 268460 268589 267439 265572 264280 264172 264672 265009 265209 265881 267316 269108 270564 271271 271279 270934 270610
52957 270610 270536 270762 271187 271587 271608 270871 269226 266934 264542 262434 260535 258509 256272 254173 252650 251770
52941 251770 251230 250721 250164 249569 248891 248152 247631 247713 248443 249362 249934 250093 250149 250181 249805 248764 247533 247011 247642
52922 247642 249088 250733 252166 253116 253316 252738 251814 251141 250972 251062 250965 250470 249848 249692 250338 251383 252013 251838
52904 251838 251174 250418 249554 248505 247589 247238 247471 248032 248817 249721 250254 249866 248702 247575 247130 247427 248322 249727
52886 249727 251310 252494 253021 253181 253250 253099 252664 252335 252488 252929 253259 253489 253841 254259 254706 255738 258012 261243
52868 261243 264345 266775 269094 271921 275007 277760 280074 282053 283300 283214 281846 279873 277756 275454 272929
52853 272929 270336 267568 264157 259936 255450 251428 248125 245403 243200 241604 240595 239984 239554 239151 238721
$$ packed form
52974B67622Q38J29j150j867j292j08N00L37K00O72J435J792J456P07Ql45l24
52957B70610p4K26M25M00K1p37j645k292k392k108j899k026k237k099j523q80
52941B51770n40n09n57n95o78p39n21Q2P30R19N72J59N6L2l76j041j231n22O31
52922B47642J446J645J433R50K00n78r24o73j69R0r7m95o22j56O46J045O30j75
52904B51838o64p56q64j049r16l51K33N61P85R04N33l88j164j127m45K97Q95J405
52886B49727J583J184N27J60O9j51m35l29J53M41L30K30L52M18M47J032K274L231
52868B61243L102K430K319K827L086K753K314J979J247q6j368j973k117k302k525
52853B72929k593k768l411m221m486m022l303k722k203j596j009o11m30m03m30
$$ plain form
52838 238721 238338 238021 237524 236559 235386 234816 235393 236818 238419 239856 240982 241409 240821 239581 238400 237361
52822 237361 235935 234073 232654 232434 233023 233423 233267 233046 233251 233742 234007 233746 233152 232810 233326 234857 236981
52805 236981 239086 240721 241443 240699 238387 235475 233481 233061 233414 233267 232156 230508 228897 227656 227038 227187
52789 227187 227832 228371 228470 228365 228476 228964 229803 231032 232665 234421 235772 236275 235816 234708 233665 233393 233894
52772 233894 234332 233952 233060 232600 232803 232832 231958 230512 229233 228199 227032 225900 225552 226310 227709 229308 231230
52755 231230 233551 235660 236785 236908 236704 236705 236919 237253 237862 239015 240864 243305 245838 247676 248365 248345 248548
52738 248548 249382 250434 251256 251937 252671 253220 253232 252802 252282 251751 251166 250892 251449 252638 253449 253066 251583 249581
52720 249581 247434 245305 243429 241950 240652 239272 237959 237128 236985 237482 238597 240313 242288 243860 244501
$$ packed form
52838B38721l83l17m97r65j173n70N77J425J601J437J126M27n88j240j181j039
52822B37361j426j862j419k20N89M00j56k21K05M91K65k61n94l42N16J531K124
52805B36981K105J635P22p44k312k912j994m20L53j47j111j648j611j241o18J49
52789B27187O45N39R9j05J11M88Q39J229J633J756J351N03m59j108j043k72N01
52772B33894M38l80q92m60K03K9q74j446j279j034j167j132l48P58J399J599J922
52755B31230K321K109J125J23k04JK14L34O09J153J849K441K533J838O89k0K03
52738B48548Q34J052Q22O81P34N49J2m30n20n31n85k74N57J189Q11l83j483k002
52720B49581k147k129j876j479j298j380j313q31j43M97J115J716J975J572O41
$$ plain form
52705 244501 244237 243647 243494 244079 244785 244567 243110 241229 239805 238804 237869 237487 238556 240850 242808 243259
52689 243259 242623 242028 241891 241919 242048 242662 244001 245845 247765 249385 250489 251092 251344 251250 250713 249972 249638 250028
52671 250028 250763 251310 251626 251999 252499 252968 253256 253206 252746 252337 252897 254742 256944 258335 258881 259468 260568 261918
52653 261918 263390 265285 267537 269345 269936 269264 267754 265834 263930 262470 261533 260817 260131 259591 259241 258882
52637 258882 258451 258173 258092 257944 257747 258024 259030 260180 260757 260885 261288 262314 263784 265580 267650 269364 269611
52620 269611 268066 265963 264980 265451 266058 265397 263393 261025 259036 257471 256319 255968 256660 257946 259100 259906
52604 259906 260599 261232 261575 261681 262027 262887 263893 264456 264394 264022 263806 264046 264715 265485 266032 266389 266875 267686 268766
52585 268766 270026 271397 272644 273529 274250 275370 277104 278978 280386 281220 281744 282118 282294 282114 281279 279510
$$ packed form
52705B44501k64n90j53N85P06k18j457j881j424j001r35l82J069K294J958M51
52689B43259o36n95j37K8J29O14J339J844J920J620J104O03K52r4n37p41l34L90
52671B50028P35N47L16L73N00M69K88n0m60m09N60J845K202J391N46N87J100J350
52653B61918J472J895K252J808N91o72j510j920j904j460r37p16o86n40l50l59
52637B58882m31k78q1j48j97K77J006J150N77J28M03J026J470J796K070J714K47
52620B69611j545k103r83M71O07o61k004k368j989j565j152l51O92J286J154Q06
52604B59906O93O33L43J06L46Q60J006N63o2l72k16K40O69P70N47L57M86Q11J080
52585B68766J260J371J247Q85P21J120J734J874J408Q34N24L74J76j80q35j769
$$ plain form
52569 279510 276999 274460 272433 270787 269202 267878 267264 267269 267243 266755 265908 264890 263715 262518 261570 260751 259475
52552 259475 257634 256250 256552 258403 260203 260527 259500 258366 258122 258833 259969 260908 261286 261270 261462 262202 263033
52535 263033 263318 263285 263852 265283 266702 267289 267382 267881 269036 270436 271825 273237 274505 275384 276127 277269 278781
52518 278781 280037 280722 281231 282032 283197 284734 286872 289804 293510 297946 302939 307789 311567 313995 315508
52503 315508 316163 315154 311868 306966 301877 297519 293916 290758 287849 285159 282872 281236 280138 279101
52489 279101 278016 277499 278039 279034 279267 278198 276334 274431 272875 271862 271620 272239 273589 275510 277833 280166
52473 280166 282009 283234 284257 285559 287170 288730 289932 290851 291971 293938 297150 301394 305842 309512
52459 309512 311863 313000 313332 313029 311906 309830 307007 303708 299908 295533 291003 287127 284393 282640 281465
$$ packed form
52569B79510k511k539k027j646j585j324o14Nk6m88q47j018j175j197r48q19j276
52552B59475j841j384L02J851J800L24j027j134k44P11J136R39L78j6J92P40Q31
52535B63033K85l3N67J431J419N87R3M99J155J400J389J412J268Q79P43J142J512
52518B78781J256O85N09Q01J165J537K138K932L706M436M993M850L778K428J513
52503C15508O55j009l286m902n089m358l603l158k909k690k287j636j098j037
52489B79101j085n17N40R95K33j069j864j903j556j013k42O19J350J921K323K333
52473B80166J843J225J023J302J611J560J202R19J120J967L212M244M448L670
52459C09512K351J137L32l03j123k076k823l299l800m375m530l876k734j753j175
$$ plain form
52444 281465 280621 279938 279202 278352 277554 276967 276643 276707 277279 278090 278536 278313 277681 276957 276107 275070 274125 273573 273334
52425 273334 273193 273215 273617 274407 275379 276318 277056 277585 278294 279713 281806 283826 285229 286435 288355 291479 295819
52408 295819 301444 308603 317362 327429 338167 348576 357548 364461 369250 371698 371119 367277 361193 354371
52394 354371 347410 340006 332246 325174 319875 316470 314237 312429 310822 309656 309162 309130 309031 308626 308261 308482
52378 308482 309609 311766 314924 318614 322063 324981 327896 331348 335132 338780 342342 346114 349890 353053
52364 353053 355183 356022 355234 352869 349832 347208 345289 343870 343184 343701 345176 346791 348247 349911 351909
52349 351909 353884 355679 357444 358980 359880 360531 362017 364665 367488 369574 371324 373833 377637 382591 388446
52334 388446 394927 401604 408226 415087 422791 431836 442521 454847 468349 482439 497110 512870 529771
$$ packed form
52444B81465q44o83p36q50p98n87l24O4N72Q11M46k23o32p24q50j037r45n52k39
52425B73334j41K2M02P90R72R39P38N29P09J419K093K020J403J206J920L124M340
52408B95819N625P159Q759J0067J0738J0409Q972O913M789K448n79l842o084o822
52394C54371o961p404p760p072n299l405k233j808j607j166m94l2r9m05l65K21
52378C08482J127K157L158L690L449K918K915L452L784L648L562L772L776L163
52364C53053K130Q39p88k365l037k624j919j419o86N17J475J615J456J664J998
52349C51909J975J795J765J536R00O51J486K648K823K086J750K509L804M954N855
52334C88446O481O677O622O861P704R045J0685J2326J3502J4090J4671J5760J6901
$$ plain form
52321 529771 547012 563757 579855 595436 610387 624657 638710 653182 668328 684082 700358
52310 700358 717030 733920 751030 768399 785603 801956 817449 832817 848230 862713 875543
52299 875543 887539 900006 912747 924139 933034 939618 944261 946474 945451 941140 934356 926153 917427
52286 917427 908830 900668 892830 885026 877208 869833 863710 859436 856897 855414 854404 853733 853471 853773 855271
52271 855271 859112 865995 875214 885126 894572 903554 912638 922204 932420 943463 955431 968125 981181
52258 981181 994353 1007588 1020886 1034216 1047571 1060991 1074413 1087463 1099429 1109490 1116954 1121358
52246 1121358 1122556 1120897 1117099 1111577 1103995 1093879 1081679 1068786 1056312 1044189 1031653 1018275
52234 1018275 1004299 990255 976600 963572 951138 939155 927715 917161 907651 898994 891056 883987
$$ packed form
52321E29771J7241J6745J6098J5581J4951J4270J4053J4472J5146J5754J6276
52310G00358J6672J6890J7110J7369J7204J6353J5493J5368J5413J4483J2830
52299H75543J1996J2467J2741J1392Q895O584M643K213j023m311o784q203q726
52286I17427q597q162p838p804p818p375o123m274k539j483j010o71k62L02J498
52271H55271L841O883R219R912R446Q982R084R566J0216J1043J1968J2694J3056
52258I81181J3172J3235J3298J3330J3355J3420J3422J3050J1966J0061P464M404
52246A121358J198j659l798n522p582j0116j2200j2893j2474j2123j2536j3378
52234A018275j3976j4044j3655j3028j2434j1983j1440j0554r510q657p938p069
$$ plain form
52222 883987 877781 871959 866105 860501 855798 852217 849513 847654 846974 847517 848679 849841 851148 853318 856699
52207 856699 860779 864704 868023 870698 872590 873497 873859 874898 877493 881180 884866 888400 892778 898682 905502
52192 905502 912087 917891 923049 927803 932229 936185 939198 940774 941078 940815 940029 937581 932396 924822 916153
52177 916153 907194 898024 888878 880325 872569 865394 859001 854244 851731 851165 851792 853107 854918 857138 859831
52162 859831 863136 866911 870682 874180 877692 881572 885568 888876 890859 891569 891556 891312 890972 890641 890884 892597
52146 892597 896131 900694 904905 907906 909803 911175 912495 913963 915485 916745 917597 918461 920047 922660 926167
52131 926167 930760 937318 946638 958595 972497 988136 1006024 1026573 1049418 1073803 1099312 1125928
52119 1125928 1153491 1181401 1208906 1235417 1260514 1283877 1305428 1325336 1343720 1360429 1375245
$$ packed form
52222H83987o206n822n854n604m703l581k704j859o80N43J162J162J307K170L381
52207H56699M080L925L319K675J892R07L62J039K595L687L686L534M378N904O820
52192I05502O585N804N158M754M426L956L013J576L04k63p86k448n185p574q669
52177I16153q959r170r146q553p756p175o393m757k513n66O27J315J811K220K693
52162H59831L305L775L771L498L512L880L996L308J983P10j3k44l40l31K43J713
52146H92597L534M563M211L001J897J372J320J468J522J260Q52Q64J586K613L507
52131I26167M593O558R320J1957J3902J5639J7888K0549K2845K4385K5509K6616
52119A125928K7563K7910K7505K6511K5097K3363K1551J9908J8384J6709J4816
$$ plain form
52108 1375245 1388139 1399142 1408226 1415659 1422298 1429010 1435788 1441848 1446677 1450585 1454077 1457115 1459160
52095 1459160 1459492 1457199 1451329 1441519 1428337 1412710 1395160 1375838 1355048 1333422 1311768 1291031
52083 1291031 1272202 1255887 1242052 1230392 1220805 1213308 1207767 1203989 1201888 1201320 1202052 1204207 1208334
52070 1208334 1214557 1221979 1229581 1237498 1246700 1257453 1268845 1279988 1291042 1302759 1315553 1329355
52058 1329355 1343895 1358695 1373082 1386666 1399625 1412091 1423363 1432192 1437894 1440812 1441514 1439826
52046 1439826 1435005 1426710 1415409 1401787 1386182 1368920 1350842 1332939 1315464 1297953 1280252 1263057
52034 1263057 1247157 1232567 1218743 1205305 1192147 1179097 1165946 1152722 1139547 1126295 1112718
52023 1112718 1098840 1084967 1071353 1058180 1045741 1034305 1023804 1013937 1004643 996260 989194 983555
$$ packed form
52108A375245J2894J1003R084P433O639O712O778O060M829L908L492L038K045
52095A459160L32k293n870r810j3182j5627j7550j9322k0790k1626k1654k0737
52083A291031j8829j6315j3835j1660r587p497n541l778k101n68P32K155M127
52070A208334O223P422P602P917R202J0753J1392J1143J1054J1717J2794J3802
52058A329355J4540J4800J4387J3584J2959J2466J1272Q829N702K918P02j688
52046A439826m821q295j1301j3622j5605j7262j8078j7903j7475j7511j7701j7195
52034A263057j5900j4590j3824j3438j3158j3050j3151j3224j3175j3252j3577
52023A112718j3878j3873j3614j3173j2439j1436j0501r867r294q383p066n639
$$ plain form
52011 983555 978997 974790 970118 964522 957956 950419 941729 931762 920504 907741 893172 877222 861341
51998 861341 846997 834598 823745 814123 805564 797587 789607 781504 773364 764843 755456 745398 735311
51985 735311 725265 714637 703077 690860 678169 664789 650772 636669 622791 608867 594846
51974 594846 581551 570091 560974 554087 549142 545826 543960 543916 546546 552234 560193 569013 577716 586008
51960 586008 593757 600560 605718 608448 608341 605740 601446 595930 589160 581366 573496 566544 560799 556220
51946 556220 553244 552660 554754 559100 565282 573412 583756 596128 609916 624648 640287 656811 673498
51933 673498 688766 700934 709264 714266 717045 718415 718461 716750 712953 707371 700762 693537 685366 675827
51919 675827 665109 653571 640887 626340 610092 593445 577633 562918 549263 537337 528266 522558
$$ packed form
52011I83555m558m207m672n596o566p537q690r967j1258j2763j4569j5950j5881
51998H61341j4344j2399j0853r622q559p977p980q103q140q521r387j0058j0087
51985G35311j0046j0628j1560j2217j2691j3380j4017j4103j3878j3924j4021
51974E94846j3295j1460r117o887m945l316j866m4K630N688P959Q820Q703Q292
51960E86008P749O803N158K730j07k601m294n516o770p794p870o952n745m579
51946E56220k976n84K094M346O182Q130J0344J2372J3788J4732J5639J6524J6687
51933F73498J5268J2168Q330N002K779J370M6j711l797n582o609p225q171r539
51919F75827j0718j1538j2684j4547j6248j6647j5812j4715j3655j1926r071n708
$$ plain form
51907 522558 519693 518680 518717 519447 520947 523551 527554 532920 539047 544636 547965 547718 543678 536476 526830
51892 526830 515401 503102 490850 478932 467285 456556 448135 442765 439755 438032 437457 438612 441740
51879 441740 446548 452775 460368 469245 479297 490417 502129 513361 522981 530329 534946 536278 534289
51866 534289 530109 525333 520668 515739 510151 504214 498675 494296 491728 491271 492582 494969 498016 501639
51852 501639 505559 509111 511594 512419 510964 506821 500383 492747 484822 476799 468652 460720 453494 447107
51838 447107 441358 436157 431693 428222 425879 424682 424586 425435 426874 428361 429421 429953 430156 430026 429141 427187
51822 427187 424511 421786 419185 416366 413314 410692 409060 408171 407541 407472 408884 411982 415579 418096 419000
51807 419000 418907 418470 417666 416305 414715 413445 412527 411529 410372 409634 409841 410733 411518 411706 411430 410995 410316 408963
$$ packed form
51907E22558k865j013L7P30J500K604M003N366O127N589L329k47m040p202r646
51892E26830j1429j2299j2252j1918j1647j0729q421n370l010j723n75J155L128
51879D41740M808O227P593Q877J0052J1120J1712J1232R620P348M617J332j989
51866E34289m180m776m665m929n588n937n539m379k568m57J311K387L047L623
51852E01639L920L552K483Q25j455m143o438p636p925q023q147p932p226o387
51838D47107n749n201m464l471k343j197r6Q49J439J487J060N32K03j30q85j954
51822D27187k676k725k601k819l052k622j632q89o30o9J412L098L597K517R04
51807D19000r3m37q04j361j590j270r18r98j157p38K07Q92P85J88k76m35o79j353
$$ plain form
51789 408963 406757 404260 402444 401778 401858 402087 402467 403282 404258 404700 404489 404297 404588 405077 405609 406993 410267
51772 410267 415387 421291 427259 433721 441688 451738 463552 476102 488191 498934 507779 514099 517088
51759 517088 516280 511944 504781 495487 484816 473667 462621 451649 440723 430511 421944 415273 410049
51746 410049 405896 402736 400368 398595 397832 398890 401862 405797 409879 414418 420249 427489 435326 442804
51732 442804 449305 454428 457891 459761 460523 460759 460843 461019 461637 463133 465606 468393 470222 469999 467478 463204
51716 463204 458004 452747 448360 445534 444142 443224 441788 439582 437019 434542 432361 430722 430147 431070 433228
51701 433228 435519 436714 436400 435177 433925 433065 432568 432434 432854 433975 435748 437925 440029 441361 441351 439972
51685 439972 437645 434730 431340 427576 423681 419899 416459 413896 413056 414450 417559 420993 423485 424707
$$ packed form
51789D08963k206k497j816o66Q0K29L80Q15R76M42k11j92K91M89N32J384L274
51772D10267N120N904N968O462P967J0050J1814J2550J2089J0743Q845O320K989
51759E17088q08m336p163r294j0671j1149j1046j0972j0926j0212q567o671n224
51746D10049m153l160k368j773p63J058K972L935M082M539N831P240P837P478
51732D42804O501N123L463J870P62K36Q4J76O18J496K473K787J829k23k521m274
51716D63204n200n257m387k826j392r18j436k206k563k477k181j639n75R23K158
51701D33228K291J195l14j223j252q60m97j34M20J121J773K177K104J332j0j379
51685D39972k327k915l390l764l895l782l440k563q40J394L109L434K492J222
$$ plain form
51671 424707 425188 425564 426180 427413 430063 434977 442260 451178 460993 471420 481992 491359 497800 500477
51657 500477 499841 496924 492689 488088 484237 482139 482363 485016 489651 494981 498973 499719 496421 489514 480044
51642 480044 469103 457743 446973 437472 429285 422018 415422 409649 404875 400930 397635 395336 394635 395527
51628 395527 397335 399634 402672 406445 409910 411841 412277 412426 413094 413832 413637 411938 408719 404331 399550
51613 399550 395424 392579 390793 389451 388206 387038 385923 384783 383659 382715 382175 382382 383753 386471 390307
51598 390307 394947 400472 407405 416305 427223 439289 450690 459356 464050 464878 462705 458288 452148 445080
51584 445080 438328 433026 429572 427693 427135 428209 431633 437870 446674 457289 469024 481533 494681
51571 494681 508411 522893 538657 556298 575869 596577 617276 637424 657572 678850 702135
$$ packed form
51671D24707M81L76O16J233K650M914P283Q918R815J0427J0572R367O441K677
51657E00477o36k917m235m601l851k098K24K653M635N330L992P46l298o907r470
51642D80044j0941j1360j0770r501q187p267o596n773m774l945l295k299p01Q92
51628C95527J808K299L038L773L465J931M36J49O68P38j95j699l219m388m781
51613C99550m126k845j786j342j245j168j115j140j124r44n40K07J371K718L836
51598C90307M640N525O933Q900J0918J2066J1401Q666M694Q28k173m417o140p068
51584D45080o752n302l454j879n58J074L424O237Q804J0615J1735J2509J3148
51571D94681J3730J4482J5764J7641J9571K0708K0699K0148K0148K1278K3285
$$ plain form
51560 702135 727926 756882 789827 826857 866645 906845 944855 978056 1003924 1020771 1028395 1027487
51548 1027487 1018436 1001259 976593 945945 910684 871495 829311 786254 744963 707154 673312
51537 673312 643522 617906 596137 577201 560085 544609 531290 520456 511743 504535 498751 494913
51525 494913 493294 493097 492741 491021 487882 484051 480149 476293 472345 468142 463476 458175 452464 447114 442860
51510 442860 439585 436360 432538 428579 425376 422925 420231 416679 412840 409531 406640 403608 400679 398807
51496 398807 398236 398024 397250 396065 395109 394446 393649 392729 392395 393347 395568 398315 400571 401534 400955 399150 396711
51479 396711 394171 391893 390053 388622 387385 386072 384471 382496 380298 378262 376708 375554 374418 373039
51465 373039 371462 369861 368431 367425 367024 367057 367118 367006 366836 366693 366554 366627 367410 369146 371445 373732 375966
$$ packed form
51560G02135K5791K8956L2945L7030L9788M0200L8010L3201K5868J6847P624r08
51548A027487r051j7177k4666l0648l5261l9189m2184m3057m1291l7809l3842
51537F73312k9790k5616k1769j8936j7116j5476j3319j0834q713p208n784l838
51525D94913j619j97l56j720l139l831l902l856l948m203m666n301n711n350m254
51510D42860l275l225l822l959l203k451k694l552l839l309k891l032k929j872
51496C98807n71k12p74j185r56o63p97r20l34R52K221K747K256R63n79j805k439
51479C96711k540k278j840j431j237j313j601j975k198k036j554j154j136j379
51465C73039j577j601j430j006m01L3O1j12j70j43j39P3P83J736K299K287K234
$$ plain form
51448 375966 378743 382764 388328 395229 403086 411874 422053 433922 446772 458952 468794 475301 478088
51435 478088 477395 474505 471590 470354 470668 470786 468929 464578 458481 451807 445391 439576 434530 430445 427302
51420 427302 424670 422169 420083 419063 419135 419490 419426 418976 418399 417645 416808 416538 417308 418564 419300 419327 419297 419635
51402 419635 420190 420992 422546 425059 427982 430700 433322 436384 440128 444506 449691 456155 464174 473533 483858
51387 483858 495237 508527 525036 545769 570899 600029 632967 670063 711741 757945 808224
51376 808224 862235 919670 979281 1037885 1090742 1133473 1164004 1182607 1190134 1186601 1171679 1146077
51364 1146077 1111708 1070462 1023448 971710 917231 862676 810196 760767 714695 672449 634764
51353 634764 601997 573624 548598 526251 506658 490043 476014 463723 452651 442812 434090 425826
$$ packed form
51448C75966K777M021N564O901P857Q788J0179J1869J2850J2180R842O507K787
51435D78088o93k890k915j236L14J18j857m351o097o674o416n815n046m085l143
51420D27302k632k501k086j020P2L55o4m50n77p54q37k70P70J256P36K7l0L38
51402D19635N55Q02J554K513K923K718K622L062L744M378N185O464Q019R359J0325
51387D83858J1379J3290J6509K0733K5130K9130L2938L7096M1678M6204N0279
51376H08224N4011N7435N9611N8604N2857M2731L0531J8603P527l533j4922k5602
51364A146077l4369m1246m7014n1738n4479n4555n2480m9429m6072m2246l7685
51353F34764l2767k8373k5026k2347j9593j6615j4029j2291j1072r839q722q264
$$ plain form
51341 425826 417469 409439 402875 398461 395710 393523 391252 389049 387276 385809 384076 381721 379097 376953
51327 376953 375713 375213 375155 375577 376687 378422 380461 382661 385179 388075 391049 393733 396059 398156 400066
51312 400066 401782 403407 404965 406106 406290 405277 403236 400469 397394 394709 392981 391863 390275 387768
51298 387768 385255 383817 383077 381495 378255 374196 370728 368371 366666 365090 363568 362302 361503 361376 362158
51283 362158 364125 367502 372298 378171 384647 391465 398491 405212 410597 413705 414403 413371 411522 409541
51269 409541 407859 406783 406551 407315 409116 411851 415161 418357 420641 421611 421601 421230 420578 419097 416580 413794
51253 413794 411686 410115 407969 404501 400077 395569 391548 388218 385587 383346 380953 378239 375704 373899
51239 373899 372676 371398 369688 367699 365765 364154 363130 362929 363470 364209 364463 363977 363238 363102 364020 365628
$$ packed form
51341D25826q357q030o564m414k751k187k271k203j773j467j733k355k624k144
51327C76953j240n00n8M22J110J735K039K200K518K896K974K684K326K097J910
51312D00066J716J625J558J141J84j013k041k767l075k685j728j118j588k507
51298C87768k513j438p40j582l240m059l468k357j705j576j522j266p99j27P82
51283C62158J967L377M796N873O476O818P026O721N385L108O98j032j849j981
51269D09541j682j076k32P64J801K735L310L196K284R70j0l71o52j481k517k786
51253D13794k108j571k146l468m424m508m021l330k631k241k393k714k535j805
51239C73899j223j278j710j989j934j611j024k01N41P39K54m86p39j36R18J608
$$ plain form
51223 365628 367225 368529 369825 371472 373508 375646 377430 378483 378920 379389 380421 381800 383003 384139 385934
51208 385934 388746 392112 395356 398218 400779 403221 405744 408273 410212 411036 411152 411529 412368 412868 412504 411730
51192 411730 411017 410071 408538 406755 405165 403609 401914 400560 399958 399579 398690 397635 397515 398791 400902 403076
51176 403076 404822 405863 406327 406794 407453 407473 406006 403555 401493 400404 399903 399951 401179 403718 406755 409701
51160 409701 412895 416729 420798 424415 427315 429339 429958 428713 425829 422018 417926 414019 410610 407697
51146 407697 405008 402427 400051 397753 395151 392269 389756 388141 387228 386480 385627 384653 383590 382676 382395 382968
51130 382968 384046 385153 386217 387495 389270 391816 395270 399284 403192 406902 411207 416741 422850 427977
51116 427977 431115 432551 433317 434251 435555 436903 437976 438952 440411 442614 445079 447074 448301 448868 448829 448193
$$ packed form
51223C65628J597J304J296J647K036K138J784J053M37M69J032J379J203J136J795
51208C85934K812L366L244K862K561K442K523K529J939Q24J16L77Q39N00l64p74
51192D11730p13r46j533j783j590j556j695j354o02l79q89j055j20J276K111K174
51176D03076J746J041M64M67O59K0j467k451k062j089n01M8J228K539L037K946
51160D09701L194L834M069L617K900K024O19j245k884l811m092l907l409k913
51146D07697k689k581k376k298k602k882k513j615r13p48q53r74j063r14k81N73
51130C82968J078J107J064J278J775K546L454M014L908L710M305N534O109N127
51116D27977L138J436P66R34J304J348J073R76J459K203K465J995J227N67l9o36
$$ plain form
51100 448193 447325 446934 447483 448776 450165 451017 450937 449752 447559 444891 442674 441674 441838 442343 442454 442186 441963
51083 441963 441914 441873 441906 442314 443066 443684 443778 443377 442675 441918 441607 442314 444015 446060 448100 450721 454799 460487
51065 460487 467177 474297 481863 490428 500813 513784 529607 547707 566713 584805 600304 612447
51053 612447 621947 630663 640476 652381 666270 681093 695231 707312 716946 724352 729167 730147 726270
51040 726270 717680 705349 690498 674859 660865 650443 643481 637987 631905 624462 615873 606368 595926
51027 595926 584787 573922 564795 558486 554971 553307 552526 552266 552700 554238 557309 561957 567465 572813
51013 572813 577759 583055 589320 596265 603505 611616 621595 633448 646037 658323 670146 681665 692612
51000 692612 702351 710394 716647 721388 725073 727962 729876 730491 729875 728528 726896 725072 723009 720891 719259
$$ packed form
51100D48193q68l91N49J293J389Q52q0j185k193k668k217j000J64N05J11k68k23
51083D41963m9m1L3M08P52O18R4m01p02p57l11P07J701K045K040K621M078N688
51065D60487O690P120P566Q565J0385J2971J5823J8100J9006J8092J5499J2143
51053F12447R500Q716R813J1905J3889J4823J4138J2081R634P406M815R80l877
51040G26270q590j2331j4851j5639j3994j0422o962n494o082p443q589r505j0442
51027E95926j1139j0865r127o309l515j664p81k60M34J538L071M648N508N348
51013E72813M946N296O265O945P240Q111R979J1853J2589J2286J1823J1519J0947
51000F92612R739Q043O253M741L685K889J914O15o16j347j632j824k063k118j632
$$ plain form
50985 719259 718883 720449 724313 730668 739899 752357 767486 783602 799077 813673 828376 844153 861454
50972 861454 880848 903376 929919 960550 994791 1032336 1073366 1118345 1167554 1220685 1276843
50961 1276843 1335202 1395593 1458082 1521875 1585026 1645439 1701901 1753934 1800971 1842103 1876613
50950 1876613 1904386 1925649 1940487 1948876 1951219 1948646 1942602 1934201 1924193 1913381 1902447 1891077
50938 1891077 1877775 1861241 1841856 1821308 1800729 1779744 1757453 1733754 1709234 1684122 1657842
50927 1657842 1629598 1599042 1566267 1531353 1494079 1454108 1411422 1366650 1321002 1275890 1232452
50916 1232452 1191215 1152130 1115098 1080567 1049436 1022206 998308 976560 956244 937529 920799
50905 920799 905824 891674 877411 862843 848679 835900 824892 815263 806495 798559 791675 785743
$$ packed form
50985G19259l76J566L864O355R231J2458J5129J6116J5475J4596J4703J5777J7301
50972H61454J9394K2528K6543L0631L4241L7545M1030M4979M9209N3131N6158
50961A276843N8359O0391O2489O3793O3151O0413N6462N2033M7037M1132L4510
50950A876613K7773K1263J4838Q389K343k573o044q401j0008j0812j0934j1370
50938A891077j3302j6534j9385k0548k0579k0985k2291k3699k4520k5112k6280
50927A657842k8244l0556l2775l4914l7274l9971m2686m4772m5648m5112m3438
50916A232452m1237l9085l7032l4531l1131k7230k3898k1748k0316j8715j6730
50905I20799j4975j4150j4263j4568j4164j2779j1008r629q768p936o884n932
$$ plain form
50893 785743 780427 775767 772340 770634 770513 771370 772650 774095 775675 777427 779358 781501 784098 787622 792488
50878 792488 798766 806310 815033 824914 835804 847487 859904 873120 887159 902096 918232 935848
50866 935848 954841 974950 996354 1019715 1045610 1074366 1106529 1142952 1184074 1229512 1278837
50855 1278837 1332594 1392169 1458719 1532617 1613918 1702974 1800369 1906380 2020599 2142072 2269746
50844 2269746 2402867 2540933 2683152 2827863 2972334 3112956 3245639 3366390 3471974
50835 3471974 3560224 3629772 3679570 3708871 3717660 3706980 3678806 3635776 3581104 3518544 3452130
50824 3452130 3385685 3322448 3264951 3215006 3173538 3140304 3113753 3091261 3069691 3045978 3017493
50813 3017493 2982174 2938543 2885658 2823023 2750483 2668299 2577429 2479722 2377615 2273392 2168675
$$ packed form
50893G85743n316m660l427j706j21Q57J280J445J580J752J931K143K597L524M866
50878G92488O278P544Q723R881J0890J1683J2417J3216J4039J4937J6136J7616
50866I35848J8993K0109K1404K3361K5895K8756L2163L6423M1122M5438M9325
50855A278837N3757N9575O6550P3898Q1301Q9056R7395J06011J14219J21473J27674
50844B269746J33121J38066J42219J44711J44471J40622J32683J20751J05584
50835C471974Q8250O9548M9798K9301Q789j0680k8174m3030n4672o2560o6414
50824C452130o6445o3237n7497m9945m1468l3234k6551k2492k1570k3713k8485
50813C017493l5319m3631n2885o2635p2540q2184r0870r7707j02107j04223j04717
$$ plain form
50802 2168675 2064634 1962624 1864475 1772101 1686856 1609271 1539362 1477157 1422841 1376334 1336819
50791 1336819 1303006 1274020 1249835 1230650 1216051 1205093 1196964 1191141 1186949 1183543 1180430 1177551
50779 1177551 1174663 1171087 1166377 1160849 1155060 1148998 1142184 1134380 1125754 1116370 1105841 1093651 1079766
50766 1079766 1065007 1050805 1038258 1027184 1016319 1004693 992644 981314 971515 963453 957227 952977
50754 952977 950626 949966 951089 954321 959752 967292 977257 990405 1007172 1027199 1049929 1075459 1104612
50741 1104612 1138317 1177115 1221074 1269883 1322953 1379608 1439354 1502108 1568063 1637120 1708416
50730 1708416 1780674 1853117 1925706 1998204 2069375 2137661 2202482 2264323 2323454 2378990 2429144
50719 2429144 2471836 2504851 2525922 2533222 2525876 2504126 2469334 2423949 2371136 2314146 2255983 2199446
$$ packed form
50802B168675j04041j02010r8149r2374q5245p7585o9909o2205n4316m6507l9515
50791A336819l3813k8986k4185j9185j4599j0958q129n823m192l406l113k879
50779A177551k888l576m710n528n789o062o814p804q626r384j0529j2190j3885
50766A079766j4759j4202j2547j1074j0865j1626j2049j1330r799q062o226m250
50754I52977k351o60J123L232N431P540R965J3148J6767K0027K2730K5530K9153
50741A104612L3705L8798M3959M8809N3070N6655N9746O2754O5955O9057P1296
50730A708416P2258P2443P2589P2498P1171O8286O4821O1841N9131N5536N0154
50719B429144M2692L3015K1071P300p346k1750l4792m5385n2813n6990n8163n6537
$$ plain form
50707 2199446 2147012 2100488 2061003 2029287 2005466 1988495 1976334 1967061 1959463 1952276 1943270 1929698
50695 1929698 1909545 1882032 1847180 1805401 1757506 1704609 1647918 1588876 1529450 1471849 1417709
50684 1417709 1367789 1322560 1282824 1249490 1222888 1202533 1187537 1177162 1171098 1169415 1172250 1179391
50672 1179391 1190173 1203849 1219959 1238126 1257567 1277180 1296279 1314910 1333190 1350601 1366394
50661 1366394 1380524 1393706 1406550 1419173 1431788 1445114 1459762 1475595 1492116 1509292 1527608
50650 1527608 1547516 1569275 1593188 1619530 1648267 1679271 1712909 1750096 1791698 1838036 1888790
50639 1888790 1942962 1998899 2054817 2109506 2162434 2213227 2261369 2306467 2348552 2388132 2426187
50628 2426187 2463946 2501968 2538919 2571249 2594224 2603633 2597368 2576419 2544668 2507130 2467972 2430048
$$ packed form
50707B199446n2434m6524l9485l1716k3821j6971j2161r273p598p187r006j3572
50695A929698k0153k7513l4852m1779m7895n2897n6691n9042n9426n7601n4140
50684A417709m9920m5229l9736l3334k6602k0355j4996j0375o064j683K835P141
50672A179391J0782J3676J6110J8167J9441J9613J9099J8631J8280J7411J5793
50661A366394J4130J3182J2844J2623J2615J3326J4648J5833J6521J7176J8316
50650A527608J9908K1759K3913K6342K8737L1004L3638L7187M1602M6338N0754
50639A888790N4172N5937N5918N4689N2928N0793M8142M5098M2085L9580L8055
50628B426187L7759L8022L6951L2330K2975R409o265k0949l1751l7538l9158l7924
$$ plain form
50616 2430048 2395833 2367699 2346808 2332328 2322446 2316010 2312791 2312502 2314038 2315615 2315111 2310178 2298465
50603 2298465 2278112 2248180 2208763 2160769 2105475 2044177 1978287 1909666 1840436 1772170 1705480
50592 1705480 1640698 1578788 1521230 1468979 1421844 1378905 1339315 1302644 1268709 1237352 1208397
50581 1208397 1181655 1156950 1134244 1113837 1096420 1082687 1072788 1066244 1062483 1061321 1062844 1067066
50569 1067066 1073921 1083322 1094863 1107617 1120780 1134615 1150309 1168676 1189296 1211075 1233409 1256517
50557 1256517 1280811 1306189 1331917 1357169 1381697 1405818 1429621 1452372 1473210 1492352 1511090
50546 1511090 1530466 1550438 1570572 1591123 1613069 1637491 1665328 1697478 1734691 1777419 1825996
50535 1825996 1880823 1942145 2009818 2083569 2163336 2249071 2340451 2437103 2539009 2646233 2758238
$$ packed form
50616B430048l4215k8134k0891j4480r882o436l219k89J536J577n04m933j1713
50603B298465k0353k9932l9417m7994n5294o1298o5890o8621o9230o8266o6690
50592A705480o4782o1910n7558n2251m7135m2939l9590l6671l3935l1357k8955
50581A208397k6742k4705k2706k0407j7417j3733r899o544l761j162J523M222
50569A067066O855R401J1541J2754J3163J3835J5694J8367K0620K1779K2334K3108
50557A256517K4294K5378K5728K5252K4528K4121K3803K2751K0838J9142J8738
50546A511090J9376J9972K0134K0551K1946K4422K7837L2150L7213M2728M8577
50535A825996N4827O1322O7673P3751P9767Q5735R1380R6652J01906J07224J12005
$$ plain form
50524 2758238 2873756 2991279 3109310 3225995 3338844 3445170 3542753 3629880 3704717 3764910
50514 3764910 3808092 3832861 3839107 3827369 3798130 3751939 3690016 3614462 3528073 3434279 3337074
50503 3337074 3240451 3147817 3062192 2986673 2924009 2875605 2841556 2821837 2816850 2826494 2849257 2882539
50491 2882539 2923297 2967774 3010956 3046997 3070325 3076452 3062373 3026793 2969973 2893237 2798997
50480 2798997 2691296 2575428 2456117 2336224 2217573 2102399 1993151 1891233 1796940 1710619
50470 1710619 1633016 1564407 1504267 1452022 1407331 1369258 1335945 1305815 1278709 1255216 1235154
50459 1235154 1217362 1201051 1186826 1176130 1169859 1167764 1168998 1172938 1179381 1188237 1199371 1212786
50447 1212786 1228633 1246860 1266993 1288426 1310732 1333504 1355961 1376936 1395322 1410563 1422858
$$ packed form
50524B758238J15518J17523J18031J16685J12849J06326R7583Q7127P4837O0193
50514C764910M3182K4769O246j1738k9239m6191o1923p5554q6389r3794r7205
50503C337074r6623r2634q5625p5519o2664m8404l4049j9719m987R644K2763L3282
50491B882539M0758M4477M3182L6041K3328O127j4079l5580n6820p6736r4240
50480B798997j07701j15868j19311j19893j18651j15174j09248j01918r4293q6321
50470A710619p7603o8609o0140n2245m4691l8073l3313l0130k7106k3493k0062
50459A235154j7792j6311j4225j0696o271k095J234L940O443Q856J1134J3415
50447A212786J5847J8227K0133K1433K2306K2772K2457K0975J8386J5241J2295
$$ plain form
50436 1422858 1432934 1441434 1448441 1453693 1457268 1459719 1461543 1462888 1463877 1464819 1465850 1466824 1467861 1469642
50422 1469642 1472784 1477348 1483407 1491766 1503585 1519574 1540029 1565329 1595765 1631146 1671250 1716467
50410 1716467 1767153 1822315 1879703 1937332 1994304 2050106 2103906 2154911 2202688 2246607 2285296
50399 2285296 2317058 2340558 2354823 2358895 2351867 2333148 2302573 2260577 2208581 2148959 2084341 2016973
50387 2016973 1948792 1881807 1818102 1759603 1708022 1664829 1631041 1607017 1592501 1586793 1588927 1597879
50375 1597879 1612635 1631826 1653256 1674051 1691349 1702714 1706089 1699896 1683518 1657419 1622695 1580755
50363 1580755 1533457 1483065 1431658 1380692 1331210 1284087 1239806 1198272 1159216 1122661 1088804
50352 1088804 1057772 1029882 1005949 986821 972625 962789 956865 954888 956745 961413 967009 971464 973039
$$ packed form
50436A422858J0076Q500P007N252L575K451J824J345R89R42J031R74J037J781
50422A469642L142M564O059Q359J1819J5989K0455K5300L0436L5381M0104M5217
50410A716467N0686N5162N7388N7629N6972N5802N3800N1005M7777M3919L8689
50399B285296L1762K3500J4265M072p028j8719l0575m1996n1996n9622o4618o7368
50387B016973o8181o6985o3705n8499n1581m3193l3788k4024j4516n708K134Q952
50375A597879J4756J9191K1430K0795J7298J1365L375o193j6378k6099l4724m1940
50363A580755m7298n0392n1407n0966m9482m7123m4281m1534l9056l6555l3857
50352A088804l1032k7890k3933j9128j4196r836n924j977J857M668N596M455J575
$$ plain form
50339 973039 970569 963799 953690 942142 931070 921613 914137 908681 905146 903222 902560 903114 905059 908344
50325 908344 912639 917764 923845 930895 938644 946937 955842 965012 973330 979700 983941 986469 987365 986306
50311 986306 983288 979002 974553 971132 969630 970026 971423 973234 976058 980683 986620 992657 998790 1006491
50297 1006491 1016877 1029713 1044552 1061756 1081774 1104449 1129732 1157935 1187830 1214901 1232880
50286 1232880 1237462 1228267 1207792 1179623 1147600 1115323 1085392 1059052 1036661 1018247 1003656 992616
50274 992616 984827 979739 976280 973266 970257 967728 966262 965858 966066 966448 966697 966534 965832 964852 964296 965077
50258 965077 967890 972795 979233 986614 994909 1004539 1015775 1028421 1041989 1055852 1069287 1081755 1093343
50245 1093343 1104705 1116368 1128253 1140025 1151675 1163437 1175088 1185523 1193193 1196994 1196819 1193329
$$ packed form
50339I73039k470o770j0109j1548j1072r457p476n456l535j924o62N54J945L285
50325I08344M295N125O081P050P749Q293Q905R170Q318O370M241K528Q96j059
50311I86306l018m286m449l421j502L96J397J811K824M625N937O037O133P701
50297A006491J0386J2836J4839J7204K0018K2675K5283K8203K9895K7071J7979
50286A232880M582r195k0475k8169l2023l2277k9931k6340k2391j8414j4591j1040
50274I92616p789n088l459l014l009k529j466m04K08L82K49j63p02r80n56P81
50258I65077K813M905O438P381Q295R630J1236J2646J3568J3863J3435J2468J1588
50245A093343J1362J1663J1885J1772J1650J1762J1651J0435P670L801j75l490
$$ plain form
50233 1193329 1187222 1178696 1167533 1153686 1137824 1121345 1105858 1092598 1082150 1074470 1068801 1063484
50221 1063484 1056212 1044996 1029136 1009209 986267 961296 935323 909517 884851 861797 840548
50210 840548 821343 804400 789748 777407 767531 760029 754129 748691 743075 737441 732125 726984 721605
50197 721605 715967 710541 705651 700969 695903 690376 684993 680327 676272 672285 668058 663705 659426 655374
50183 655374 651861 649293 647668 646334 644496 641884 638812 635786 633221 631376 630328 629935 629940 630107 630283 630506
50167 630506 631148 632777 635664 639500 643715 647990 652325 656671 660765 664413 667813 671500 675998 681608
50153 681608 688465 696573 705621 714862 723486 731210 738345 745203 751694 757635 763204 768895 775312 783293
50139 783293 793875 807619 824230 843372 865671 892129 922471 954792 987138 1018883 1050337
$$ packed form
50233A193329o107q526j1163j3847j5862j6479j5487j3260j0448p680n669n317
50221A063484p272j1216j5860j9927k2942k4971k5973k5806k4666k3054k1249
50210H40548j9205j6943j4652j2341r876p502n900n438n616n634n316n141n379
50197G21605n638n426m890m682n066n527n383m666m055l987m227m353m279m052
50183F55374l513k568j625j334j838k612l072l026k565j845j048l93NJ67J76K23
50167F30506O42J629K887L836M215M275M335M346M094L648L400L687M498N610
50153F81608O857Q108R048R241Q624P724P135O858O491N941N569N691O417P981
50139G83293J0582J3744J6611J9142K2299K6458L0342L2321L2346L1745L1454
$$ plain form
50128 1050337 1081676 1112712 1143185 1172692 1200649 1226737 1251086 1273487 1292606 1306475 1313635
50117 1313635 1313532 1306106 1291684 1271266 1246453 1218916 1190027 1160716 1131313 1101718 1072282 1044482
50105 1044482 1020168 1000018 983093 967963 953793 940204 926630 912370 897137 881229 865179
50094 865179 849479 834648 821311 810036 801160 794763 790709 788545 787452 786610 785818 785620 786615 788757
50080 788757 791506 794444 797361 799859 801440 802101 802382 802648 802736 802535 802452 802923 803794 804540 804848 804642 803781 802138
50062 802138 799828 797032 793753 790025 786210 782818 780144 778214 776825 775461 773625 771544 770125 769826
50048 769826 770094 770415 771399 774034 778283 783356 789110 796196 804783 814111 823522 833064 842869 852793 862962
50033 862962 873828 885223 896176 906272 916452 927691 939416 950069 958901 966378 973060 979016
$$ packed form
50128A050337L1339L1036L0473K9507K7957K6088K4349K2401J9119J3869P160
50117A313635j03p426j4422k0418k4813k7537k8889k9311k9403k9595k9436k7800
50105A044482k4314k0150j6925j5130j4170j3589j3574j4260j5233j5908j6050
50094H65179j5700j4831j3337j1275q876o397m054k164j093q42p92j98R95K142
50080G88757K749K938K917K498J581O61K81K66Q8k01q3M71Q71P46L08k06q61j643
50062H02138k310k796l279l728l815l392k674j930j389j364j836k081j419k99
50048G69826K68L21R84K635M249N073N754P086Q587R328R411R542R805R924J0169
50033H62962J0866J1395J0953J0096J0180J1239J1725J0653Q832P477O682N956
$$ plain form
50021 979016 984405 989824 995847 1002751 1010840 1020392 1030993 1041404 1050513 1058186 1065017 1071611 1078405 1085673
50007 1085673 1093170 1100027 1105685 1110899 1117149 1124864 1132746 1139089 1143218 1145241 1144866 1141184 1133467 1121576
49993 1121576 1105652 1086162 1064369 1042101 1020491 999270 977552 954987 931793 908135 884099
49982 884099 860225 837484 816624 797779 780757 765396 751595 739255 728333 718807 710543 703235
49970 703235 696498 690058 683953 678602 674447 671451 669141 667197 665713 664767 664152 663857 664407 666300 669403
49955 669403 673434 678801 686408 696645 709036 722721 736678 749549 760021 767759 773547 778256 781964
49942 781964 784292 785139 784768 783388 780990 777467 772604 765968 757030 745578 732007 717211 702055 686995
49928 686995 672341 658857 647669 639255 632813 627042 621418 616412 612708 610679 610444 611839 614255 616976
$$ packed form
50021I79016N389N419O023O904Q089R552J0601J0411R109P673O831O594O794P268
50007A085673P497O857N658N214O250P715P882O343M129K023l75l682p717j1891
49993A121576j5924j9490k1793k2268k1610k1221k1718k2565k3194k3658k4036
49982H84099k3874k2741k0860j8845j7022j5361j3801j2340j0922r526q264p308
49970G03235o737o440o105n351m155k996k310j944j484r46o15k95N50J893L103
49955F69403M031N367P607J0237J2391J3685J3957J2871J0472P738N788M709L708
49942G81964K328Q47l71j380k398l523m863o636q938j1452j3571j4796j5156j5060
49928F86995j4654j3484j1188q414o442n771n624n006l704k029k35J395K416K721
$$ plain form
49914 616976 619820 623097 626970 631251 635805 640737 646166 652279 659596 668664 679328 690839 702741
49901 702741 715203 728354 741812 755038 767528 778465 786831 792334 795737 797787 798174 796000 790938
49888 790938 783361 773528 761307 746845 731210 716081 702682 690886 679459 667442 655255 644169
49876 644169 634769 626498 618708 611516 605388 600562 597315 596115 596904 598696 600610 603022 606981 612708
49862 612708 619378 626331 633808 642398 652370 663751 676521 690420 704814 719035 732708 745665
49850 745665 757648 768197 776727 782818 786583 788677 789698 789498 787282 782379 774820 765201 754224 742421
49836 742421 730207 718118 706929 697398 689723 683367 677571 672023 667003 663027 660493 659498 659827 661218
49822 661218 663782 668061 674494 682947 692889 703870 715563 727450 738759 748753 756996 763384 768136
$$ packed form
49914F16976K844L277L873M281M554M932N429O113P317R068J0664J1511J1902
49901G02741J2462J3151J3458J3226J2490J0937Q366N503L403K050L87k174n062
49888G90938p577r833j2221j4462j5635j5129j3399j1796j1427j2017j2187j1086
49876F44169r400q271p790p192o128m826l247j200P89J792J914K412L959N727
49862F12708O670O953P477Q590R972J1381J2770J3899J4394J4221J3673J2957
49850G45665J1983J0549Q530O091L765K094J021k00k216m903p559r619j0977j1803
49836G42421j2214j2089j1189r531p675o356n796n548n020l976k534r95L29J391
49822F61218K564M279O433Q453R942J0981J1693J1887J1309R994Q243O388M752
$$ plain form
49809 768136 771730 774697 777358 779563 780588 779371 775282 768752 760922 752655 744230 735966 728363 721208
$$ packed form
49809G68136L594K967K661K205J025j217m089o530p830q267q425q264p603p155
$$ [...]
##END NTUPLES=NMR SPECTRUM
##END=
