##TITLE=AC1679_CTIAH14387_8571323_GAQJE71pzE
##JCAMPDX= 6.0         $$ Bruker NMR JCAMP-DX V2.0
##DATA TYPE= NMR SPECTRUM
##DATA CLASS= NTUPLES
##ORIGIN= BRUKER
##OWNER= Administrator
$$ 1.72 TOPSPIN		Version 2.1
$$ 2014-04-11 22:44:23.269 -0700  Administrator@X
$$ Compression mode = diff/dup
##.OBSERVE FREQUENCY= 400.02188249412
##.OBSERVE NUCLEUS= ^1H
##.ACQUISITION MODE= SIMULTANEOUS (DQD)
##.ACQUISITION SCHEME= undefined
##.AVERAGES= 8
##.DIGITISER RES= 22
##SPECTROMETER/DATA SYSTEM= spect
##.PULSE SEQUENCE= zg30
##.SOLVENT NAME= COFFEE_meoh
##.SHIFT REFERENCE= INTERNAL, COFFEE_meoh, 1, 14.98509
##AUDIT TRAIL= $$ (NUMBER, WHEN, WHO, WHERE, PROCESS, VERSION, WHAT)
$$ ##TITLE= Audit trail, TOPSPIN		Version 2.1
$$ ##JCAMPDX= 5.01
$$ ##ORIGIN= Bruker BioSpin GmbH
$$ ##OWNER= Administrator
$$ $$ E:\/data/COFFEE/nmr/AC1679_CTIAH14387_8571323_GAQJE71pzE/10/pdata/1/auditp.txt
$$ ##AUDIT TRAIL=  $$ (NUMBER, WHEN, WHO, WHERE, PROCESS, VERSION, WHAT)
(   1,<2014-04-11 22:44:15.456 -0700>,<Administrator>,<X>,<go>,<TOPSPIN 2.1>,
      <created by zg
	started at 2014-04-11 22:43:09.347 -0700,
	POWCHK enabled, PULCHK disabled,
       configuration hash MD5:
       C8 4E 4E 5D D3 5C D8 9E 9F 52 82 E0 59 8A DE 15
       data hash MD5: 64K
       A4 7C F6 D4 A2 A1 80 F3 11 68 93 C5 74 9F 46 A3>)
(   2,<2014-04-11 22:44:18.503 -0700>,<Administrator>,<X>,<proc1d>,<TOPSPIN 2.1>,
      <Start of raw data processing
       efp LB = 0 FT_mod = 6 PKNL = 1 PHC0 = 0 PHC1 = 0 SI = 32K 
       data hash MD5: 32K
       06 48 62 E8 6F 0D 61 EB E5 1A D0 18 F2 D2 13 73>)
(   3,<2014-04-11 22:44:18.800 -0700>,<Administrator>,<X>,<proc1d>,<TOPSPIN 2.1>,
      <pk PHC0 = 95.31189 PHC1 = 0 
       data hash MD5: 32K
       8D 18 B0 B9 89 5B 4E 81 0F 61 5B 58 BB FE F2 4C>)
(   4,<2014-04-11 22:44:18.909 -0700>,<Administrator>,<X>,<proc1d>,<TOPSPIN 2.1>,
      <abs ABSG = 1 
       data hash MD5: 32K
       ED ED 89 4A 2E 10 AA 68 8C 39 D6 86 43 7D EF 8A>)
(   5,<2014-04-11 22:44:19.300 -0700>,<Administrator>,<X>,<proc1d>,<TOPSPIN 2.1>,
      <abs ABSG = 2 
       data hash MD5: 32K
       A7 73 B2 EA 91 50 82 AC 40 E0 65 69 3B 1F E1 C7>)
(   6,<2014-04-11 22:44:19.691 -0700>,<Administrator>,<X>,<proc1d>,<TOPSPIN 2.1>,
      <abs ABSG = 3 
       data hash MD5: 32K
       B4 9D 3E 38 0B 58 55 84 18 4F 87 DA 72 26 C1 7A>)
(   7,<2014-04-11 22:44:19.816 -0700>,<Administrator>,<X>,<proc1d>,<TOPSPIN 2.1>,
      <abs ABSG = 4 
       data hash MD5: 32K
       F4 46 BF CB FA 54 A6 0F CA 2A 91 07 CE 08 2C 25>)
(   8,<2014-04-11 22:44:19.862 -0700>,<Administrator>,<X>,<proc1d>,<TOPSPIN 2.1>,
      <abs ABSG = 5 
       data hash MD5: 32K
       98 12 4C 44 D3 ED 1E 44 B9 31 86 09 BD 85 42 EB>)
$$ ##END=
$$ 
$$ $$ hash MD5
$$ $$ CC 85 2C 6B BC B4 84 26 C1 5F 6F BB 8B 35 61 04
##$RELAX= 
##$RELAX= 
##$RELAX= 
##$RELAX= 
##$RELAX= 
##$RELAX= 
##$RELAX= 
$$ Bruker specific parameters
$$ --------------------------
##$DU= <E:\>
##$EXPNO= 10
##$NAME= <AC1679_CTIAH14387_8571323_GAQJE71pzE>
$$ [...]
150 150 150 150 150 150 150 150
##$TP07= 0
##$TPNAME0= <>
##$TPNAME1= <>
##$TPNAME2= <>
##$TPNAME3= <>
##$TPNAME4= <>
##$TPNAME5= <>
##$TPNAME6= <>
##$TPNAME7= <>
##$TPOAL= (0..7)
0.5 0.5 0.5 0.5 0.5 0.5 0.5 0.5
##$TPOFFS= (0..7)
0 0 0 0 0 0 0 0
##$TUNHIN= 0
##$TUNHOUT= 0
##$TUNXOUT= 0
##$USERA1= <user>
##$USERA2= <user>
##$USERA3= <user>
##$USERA4= <user>
##$USERA5= <user>
##$V9= 5
##$VALIST= <valist>
##$VCLIST= <CCCCCCCCCCCCCCC>
##$VD= 0
##$VDLIST= <DDDDDDDDDDDDDDD>
##$VPLIST= <PPPPPPPPPPPPPPP>
##$VTLIST= <TTTTTTTTTTTTTTT>
##$WBST= 1024
##$WBSW= 4
##$XGAIN= (0..3)
0 0 0 0
##$XL= 0
##$YL= 0
##$YMAX_a= 660080
##$YMIN_a= -560624
##$ZGOPTNS= <>
##$ZL1= 120
##$ZL2= 120
##$ZL3= 120
##$ZL4= 120
##$ABSF1= 14.98509
##$ABSF2= -5.573092
##$ABSG= 5
##$ABSL= 3
##$ALPHA= 0
##$AQORDER= 0
##$ASSFAC= 0
##$ASSFACI= 0
##$ASSFACX= 0
##$ASSWID= 0
##$AUNMP= <proc_prof1d_extract_pilot.lims>
##$AXLEFT= 0
##$AXNAME= <>
##$AXNUC= <1H>
##$AXRIGHT= 0
##$AXTYPE= 0
##$AXUNIT= <>
##$AZFE= 0.1
##$AZFW= 0.1
##$BCFW= 0
##$BC_mod= 0
##$BYTORDP= 0
##$COROFFS= 0
##$CY= 15
##$DATMOD= 1
##$DC= 0
##$DFILT= <>
##$DTYPP= 0
##$F1P= 0
##$F2P= 0
##$FCOR= 0.5
##$FTSIZE= 32768
##$FT_mod= 6
##$GAMMA= 0
##$GB= 0
##$INTBC= 1
##$INTSCL= 1
##$ISEN= 128
##$LB= 0
##$LEV0= 0
##$LPBIN= 0
##$MAXI= 10000
##$MC2= 0
##$MEAN= 0
##$ME_mod= 0
##$MI= 0
##$NCOEF= 0
##$NC_proc= -8
##$NLEV= 6
##$NOISF1= 0
##$NOISF2= 0
##$NSP= 0
##$NTH_PI= 0
##$NZP= 0
##$OFFSET= 14.98509
##$PC= 1
##$PHC0= 95.31189
##$PHC1= 0
##$PH_mod= 1
##$PKNL= yes
##$PPARMOD= 0
##$PPDIAG= 0
##$PPIPTYP= 0
##$PPMPNUM= 2147483647
##$PPRESOL= 1
##$PSCAL= 4
##$PSIGN= 0
##$PYNMP= <proc.py>
##$REVERSE= no
##$SF= 400.02
##$SI= 32768
##$SIGF1= 0
##$SIGF2= 0
##$SINO= 400
##$SIOLD= 32768
##$SPECTYP= <>
##$SREGLST= <1H.CDCl3>
##$SSB= 0
##$STSI= 32768
##$STSR= 0
##$SW_p= 8223.68421052631
##$SYMM= 0
##$S_DEV= 0
##$TDeff= 65536
##$TDoff= 0
##$TI= <>
##$TILT= no
##$TM1= 0
##$TM2= 0
##$TOPLEV= 0
##$USERP1= <user>
##$USERP2= <user>
##$USERP3= <user>
##$USERP4= <user>
##$USERP5= <user>
##$WDW= 1
##$XDIM= 32768
##$YMAX_p= 460225439
##$YMIN_p= -683641
##$CURPLOT= <Network HP LaserJet P1505>
##$CURPRIN= <$Network HP LaserJet P1505>
##$DFORMAT= <normdp>
##$LAYOUT= <+/1D_H.xwp>
##$LFORMAT= <normlp>
##$PFORMAT= <normpl>
##$SURQMSG= 1
$$ End of Bruker specific parameters
$$ ---------------------------------
##NTUPLES= NMR SPECTRUM
##VAR_NAME=  FREQUENCY,     SPECTRUM/REAL,   SPECTRUM/IMAG
##SYMBOL=    X,             R,               I
##VAR_TYPE=  INDEPENDENT,   DEPENDENT,       DEPENDENT
##VAR_FORM=  AFFN,          ASDF,            ASDF
##VAR_DIM=   32768,         32768,           32768
##UNITS=     HZ,            ARBITRARY UNITS, ARBITRARY UNITS
##FACTOR=    0.250966925370066, 1,           1
##FIRST=     8223.43324360094, 18007,        -115762
##LAST=      0,             -191921,         -19758
##MIN=       0,             -683641,         0
##MAX=       8223.43324360094, 460225439,    0
$$ Real data points
##PAGE= N=1
##DATA TABLE= (X++(R..R)), XYDATA
$$ [...]
19543e5799A7071J71915d7625m04163f7457B35313d29320a83329P1406B29365
19532E1211c32475a31274q0623h2958B64555c39348e024B60044a98574N2500d6032
19520B0892a05707C8552a62687f4938k37760Q7836c8036A01157e01284f9810l1894
19509a01704H1011a45652K1489j31295j3195E0823g9481j3683n0700D2190L02456
19498C44646k0732b21018Q3353m9650A6185g8561b4088l99405d2634I9994a43810
19486h6191b8596k47196A10669a47849A66990B3027Q1302K3472c8548q3035I5157
19474H3572a71978E2587A7797a24859K667l164c9706D19599g3428b3191E9665
19462a23714M8253o4252c9886O56A90322i9098B63877b00136B42404b71807a0847
$$ plain form
19543 -55799 17071 188986 -47625 -451788 -67457 235313 -429320 -183329 -111923 229365
19532 51211 -332475 -131274 -211897 -82958 264555 -339348 -5024 260044 -198574 -146074 -46032
19520 20892 -105707 38552 -162687 -64938 -302698 -214862 -38036 101157 -501284 -69810 -101704
19509 -101704 81011 -145652 -124163 -255458 -268653 50823 -79481 -93164 -143864 42190 344646
19498 344646 323914 -221018 -137665 -187315 16185 -78561 -24088 -423493 -42634 99994 -143810
19486 -86191 -28596 -275792 110669 -147849 166990 23027 104329 127801 -38548 -121583 95157
19474 83572 -171978 52587 17797 -124859 -122192 -125356 -39706 419599 -73428 -23191 59665
19462 -123714 -75461 -139713 -39886 -39230 190322 -99098 263877 -200136 242404 -271807 -10847
19450d0121B54055C137L04838b10509c7153n7825r6744a7984j21533c5090B38289
19438b26695A0244J37346a81785j38670N5774a05922H0322b09902B25007a29200
19427g4920B33740b7370C82549C9109K2524g3874A82119d13055B24749a26794
19416i5834a9996q2351J2774C4576b97596J11985A38586N1441N8341H1844O450
19405H8294P8259B8088b79944L330a0296l4919A38043n5026K5098a21462M8022
19394g3440A70625J53398c25773e0100b2857A66859a1253H4175R3284b38356a06467
19382g8107B55429b37374q2665o2701i5887k23568h1574j07928D6623b83586J13831
19371a69755A11124l4401L8228a75639A93887b0439l05231D5607N2994a62697
$$ plain form
19450 -40121 254055 3137 307975 -210509 -37153 -94978 -191722 -17984 -139517 -35090 238289
19438 -226695 10244 147590 -181785 -320455 -264681 -105922 80322 -209902 225007 -129200
19427 -74920 233740 -27370 382549 39109 61633 -73874 182119 -413055 224749 -126794
19416 -95834 -19996 -102347 -89573 34576 -297596 -185611 138586 190027 248368 81844 88294
19405 88294 166553 28088 -279944 -276614 -10296 -45215 138043 83017 108115 -121462 -73440
19394 -73440 170625 324023 -325773 -50100 -22857 166859 -11253 84175 177459 -238356 -106467
19382 -78107 255429 -237374 -320039 -382740 -95887 -319455 -81574 -189502 46623 -283586 -169755
19371 -169755 111124 76723 114951 -175639 193887 -20439 -325670 45607 98601 -162697
19360a11292c2239k05478J7337d6246j76146K7645A61167b06638C57821B9740
19349A53552k3696h3247j94935p0054G3552N1215a35430H5524a76849A02624J57021
19338B59645a08957m27623B05826e8147l5797F8804A8324J88545b21554J088a5115
19326B42857H4403J39195d02915J73578I0216J98903j6854b3368E8605a11461
19315E2328K2149f8047o9410B13078a60562C3574g1453F4132A3740h7080E271
19303b19728C5820b02180c9425A59030a74976h4471B25371b70167A70877J42778
19293C13655c8943A87840a00753A39818c28322J62905A54994b22066p6730b8737
19282b75882O0816c1408j25793K8919n4789C88242f9498j94828j08977m627I3104
$$ plain form
19360 -111292 -32239 -237717 -220380 -46246 -222392 -194747 161167 -206638 357821 29740
19349 153552 129856 -83247 -278182 -348236 73552 124767 -135430 85524 -176849 102624 259645
19338 259645 -108957 -536580 205826 -58147 -93944 68804 18324 206869 -221554 -220466 -15115
19326 242857 84403 223598 -402915 -229337 90216 289119 272265 -23368 58605 -111461
19315 52328 74477 -68047 -137457 213078 -160562 33574 -71453 64132 13740 -87080 5271
19303 -219728 35820 -202180 -39425 159030 -174976 -84471 225371 -270167 170877 313655
19293 313655 -38943 187840 -100753 139818 -328322 -165417 154994 -222066 -298796 -28737
19282 -275882 -215066 -31408 -157201 -128282 -183071 388242 -69498 -264326 -373303 -377930 93104
19270b8838j37183a7133D61657f5903j67021J03189l7090n9765G9270J5236a32705
19258a42357r4260D2277L2069K37299j44322J54512a02304f869G993J72351E6852
19246a60044A11743a27377k02327H95a49136F7920d38855f0369A69193J355F1263
19234B48305a03129A39597a81422b5234j4329F6008a49984l1527H9105k1089b38357
19222i6623A02719a27431J3772q5275N3391B30976f8758k26361g5663j11587A08765
19210H4553f0479F876b88240g3757I0893C060a93196A91473c60260J1502a26032
19198a15274c7567A77741b23071j73588J19935J06208H4642C2746J36734n7458
19188A12022c46499f2063m013j38094A3739a26625A48847a72643M1787L6767F8502
$$ plain form
19270 -28838 -166021 -17133 461657 -65903 -232924 -129735 -166825 -226590 79270 94506 -132705
19258 -142357 -236617 42277 74346 311645 167323 321835 -102304 -6869 7993 180344 56852
19246 -160044 111743 -127377 -329704 895 -149136 67920 -438855 -60369 169193 170548 61263
19234 248305 -103129 139597 -181422 -25234 -39563 66008 -149984 -181511 89105 68016 -238357
19222 -96623 102719 -127431 -113659 -198934 -145543 230976 -68758 -295119 -75663 -187250 108765
19210 84553 -60479 6876 -288240 -73757 90893 3060 -193196 191473 -360260 -348758 -126032
19198 -115274 -37567 177741 -223071 -396659 -276724 -170516 84642 32746 169480 112022
19188 112022 -346499 -62063 -66076 -204170 13739 -126625 148847 -172643 -130856 -94089 68502
19176f999l9617q2366A56199F981K2926a52518e3449C18339A18241J13442E3496
19164d83384F7093e66028i5958F76a41728k05539M4233J39868a660k16974A58893
19152a04021G9665a1899j45223k8487j8053E8362N7982J26504b14821g2427J0343
19141f2084B14244n3659b93775e7973B65937D6593b94238A64194c05275G2911
19130b96493B1396E601K06941g4197c1431L474m9064l6433j4192A1766a8152k5101
19118d3253a9465o3937j58248D8111d56190b12670L2102k17434a06597d7405B20066
19106A39199a86194C03731a22832K9626b2079C20759b40624N5802O9693A16467
19095g7168D600i9502j2173H5700d58B05b23656a02115A08833e4952r2423j22702
$$ plain form
19176 -6999 -46616 -128982 156199 6981 29907 -152518 -53449 318339 118241 231683 53496
19164 -483384 67093 -566028 -95958 676 -141728 -347267 -303034 -163166 -1660 -218634 158893
19152 -104021 79665 -11899 -157122 -185609 -203662 58362 116344 242848 -214821 -72427 -62084
19141 -62084 214244 160585 -293775 -57973 265937 46593 -294238 164194 -305275 72911
19130 -296493 21396 5601 212542 -74197 -31431 -27957 -77021 -113454 -127646 11766 -18152 -43253
19118 -43253 -19465 -83402 -241650 48111 -456190 -212670 -180568 -398002 -106597 -47405 220066
19106 139199 -186194 303731 -122832 -93206 -22079 320759 -240624 -184822 -115129 116467
19095 -77168 4600 -99502 -111675 85700 -458 205 -223656 -102115 108833 -54952 -147375 -270077
19083b70077C0613L25370b32571Q9330E5708A2086m696Q6123b02413d2865j75366
19072b18231I9557b60653E4261c03210b3865k11233C15896A47475P7345h3138
19061a13134c5167A32163f6628D78197b7222j53303C9081L3593h6722D5631M50269
19050D95900k17645n0383D1433b65026h6419A60388A7530a90115L8276j9000F8868
19038G7330a04706j31932Q6232g4008p3960j93559A5352f1565m7601B61321K9671
19027B90992r6760H5305k2622j5643N7784K89038B9615j2634p389J21208h1633
19015b94496c0861A9768J74403b04181f919n1594A79020c3302j78659I2762h0048
19003e9507A42970b9088k00324a04923F3796B6753K4875A2839a69028B2928a46840
$$ plain form
19083 -270077 30613 355983 -232571 -143241 55708 12086 7390 93513 -202413 -42865 -218231
19072 -218231 99557 -260653 54261 -303210 -23865 -235098 315896 147475 224820 -83138
19061 -113134 -35167 132163 -66628 478197 -27222 -180525 39081 72674 -86722 45631 495900
19050 495900 278255 227872 41433 -265026 -86419 160388 17530 -190115 -151839 -170839 68868
19038 77330 -104706 -236638 -150406 -74008 -147968 -341527 15352 -61565 -109166 261321 290992
19027 290992 194232 85305 62683 47040 104824 393862 29615 16981 9592 130800 -81633
19015 -294496 -30861 19768 194171 -204181 -6919 -58513 179020 -33302 -211961 92762 -80048
19003 -59507 142970 -29088 -229412 -104923 63796 26753 51628 12839 -169028 22928 -146840
18991C0477a53867N4199H0284c6161j04877H4949i8361k1660b1503l51754c9074
18979a93040O7370N8374E7858b06198O7228A22500c46089B70167j2317a36410
18968D7188L26622e7783D0459a80685g7761A68891b39495F9173a91853Q4683F5358
18956E8825f4802l6368J3154m08939A02811d7833k22292B06831b3014j6704j42844
18945a82562r9916J39822c4513p2657p3432n1750C2619d22682a66006d5045k24942
18934b69987A07743a39970A47013J3126b90377c5463j96524H6195G07J71717b12135
18922a06434d7195A04315e9679N855a503j8032n5907J7878B19714G6394a82047
18910d61073i4274E2474g1221C6225A0522J43089a08616A62367b33243k0030B2169
$$ plain form
18991 30477 -153867 -99668 80284 -36161 -141038 84949 -98361 -120021 -21503 -373257 -39074
18979 -193040 -125670 -67296 57858 -206198 -138970 122500 -346089 270167 257850 -136410
18968 47188 373810 -57783 40459 -180685 -77761 168891 -239495 69173 -191853 -107170 65358
18956 58825 -64802 -101170 -88016 -496955 102811 -47833 -270125 206831 -23014 -39718 -182562
18945 -182562 -282478 -142656 -34513 -107170 -180602 -232352 32619 -422682 -166006 -45045 -269987
18934 -269987 107743 -139970 147013 160139 -290377 -35463 -231987 86195 707 172424 -212135
18922 -106434 -47195 104315 -59679 -53824 -1503 -19535 -75442 -57564 219714 76394 -182047
18910 -461073 -94274 52474 -71221 36225 10522 153611 -108616 162367 -233243 -253273 22169
18898A0989a62090B45190F373J68c3693P117a2748j26683j64187a42932j6899
18887a59831e3908D000J37192b03760e2962k35036k5704H2249b84317f5372K4557
18876d0815k9864k06472A86702c17389h2826D4127G058R0316a94588l7429j751
18865b33768O7552F5824D227b98830a17907n3473A64659a44131j2837A11774a23881
18853a5432p1766A15705D0662a1400A18608K5481A223b42806A08188K9439C86
18841e498j9935j23294f1518H6795g6068A80359C2066A5497b87895b6437k6501
18830e2938l8006j29900P6744l1351F8373i2054A71526c35920B02643B0830K52842
18819B73672B2263b15171i998A05985b06575E2824L45239E6992R4740E1573J09484
$$ plain form
18898 10989 -162090 245190 6373 6541 -33693 -26576 -12748 -139431 -303618 -142932 -159831
18887 -159831 -53908 4000 141192 -203760 -52962 -287998 -313702 82249 -284317 -65372 -40815
18876 -40815 -70679 -277151 186702 -317389 -82826 44127 7058 97374 -194588 -232017 -233768
18865 -233768 -166216 65824 4227 -298830 -117907 -171380 164659 -144131 -156968 111774 -123881
18853 -15432 -87198 115705 40662 -11400 118608 144089 1223 -242806 108188 137627 386
18841 -5498 -25433 -148727 -61518 86795 -76068 180359 32066 15497 -287895 -26437 -52938
18830 -52938 -90944 -220844 -144100 -175451 68373 -92054 171526 -335920 202643 20830 273672
18819 273672 22263 -215171 -9998 105985 -206575 52824 398063 56992 151732 51573 161057
18808A61057a42070C52885A29910a40220a6672C00360c18720A93979b62637A55846
18797e9703E9671n843M5432g9886j27692g8354r2259A55358a39457k81826A75524
18785a75399j82416L2583B88727d6984D1838a05626H6314b45372k6955q8582n8803
18774d19712J38189J04256B80154b20887N8882j60741A27364b75531G7128b10190
18763g7108q8727J1688l3884M1571I6572j6339R7107h7512K1035b6574A33864
18751F3866a53671j97630c4501C46061A53762p2893j0098c1941j633k04921a04890
18739b24680j4498a9760j26347N380p5728E706d08558e2717n4685l31887G0886
18727D53648h5490c5177f571m4707j04492M3570b1779n6578c1394C73444b64258
$$ plain form
18808 161057 -142070 352885 129910 -140220 -16672 300360 -318720 193979 -262637 155846
18797 -59703 59671 53828 99260 -79886 -207578 -78354 -170613 155358 -139457 -421283 175524
18785 -175399 -357815 -325232 288727 -46984 41838 -105626 86314 -245372 -272327 -360909 -419712
18774 -419712 -281523 -177267 280154 -220887 -162005 -322746 127364 -275531 77128 -210190
18763 -77108 -165835 -154147 -188031 -146460 96572 80233 177340 -87512 -66477 -26574 133864
18751 63866 -153671 -351301 -34501 346061 153762 80869 70771 -31941 -33574 -238495 -104890
18739 -224680 -239178 -19760 -146107 -140727 -216455 5706 -408558 -52717 -107402 -439289 70886
18727 453648 -85490 -35177 -6571 -51278 -155770 -112200 -21779 -78357 -31394 373444 -264258
18715a79124d1462A66284p6375E888a84774j38111b3915f537j28738q4773p2894
18704b92942A81659k6379C0740a41006M5627A13471h2182p6052N9791B81993a88596
18692c91958e8662j141j2802n5686A22756i5191A02254A6614a69823c9000l05226
18681c44226m0372a67175A6238P07a79458j64860a28738j88678C7486J02545i8577
18669E8182J66703b28612l7456A42359p432o3374a1259A7070b6676j60190Q8279
18658i8587j61165J16247f8509m22548a527A09659M2379E6371K66453j25812f7790
18646I3978b98805j11307a17730h284D10620A0980K76400d19666J97007b9625
18635b9136A14282R8438f8827j0576r0119B9741A1837g0687l16298J01046L1415
$$ plain form
18715 -179124 -41462 166284 89909 5888 -184774 -322885 -23915 -6537 -135275 -220048 -292942
18704 -292942 181659 155280 30740 -141006 -95379 113471 -82182 -158234 -98443 281993 -188596
18692 -391958 -58662 -59803 -72605 -128291 122756 -95191 102254 16614 -169823 -39000 -344226
18681 -344226 -384598 -167175 16238 16945 -179458 -344318 -128738 -317416 37486 140031 -98577
18669 58182 224885 -228612 -266068 142359 134927 71553 -11259 17070 -26676 -186866 -98587
18658 -98587 -259752 -143505 -68509 -491057 -1527 109659 152038 56371 322824 197012 -67790
18646 93978 -298805 -410112 -117730 -8284 410620 10980 287380 -419666 -222659 -29625
18635 -29136 114282 212720 -68827 -79403 -169522 29741 11837 -70687 -386985 -285939 -254524
18624b54524K030A90636q5245B5508i7453J8042A71321g8796K8418r6165K9533
18613a17010a0813n9224B31626b4357l64201E90b31426H9877b93151m0185b5414
18601B17714a12493A26264a83024e4183C69474A17063a03557p1017O4731j96576
18591c06419e4734A87398a99643A70515Q8340r6539a41368L9073c4053o680E2701
18579b45427G726a681A67557E0330a90455I1321a86357Q4402q7560d5011j51370
18568a96381d7251k77584A1965b88529e2148A54204a93243h868A33263a67247
18557c06039A2403K11878I8991A0221b136l19433a22577j7386k28741g2782B93855
18545b00202i7568k18906a34080J9313B4442e5196A39581a33988L9283E2136e0872
$$ plain form
18624 -254524 -252494 190636 105391 25508 -97453 -79411 171321 -78796 -50378 -146543 -117010
18613 -117010 -10813 -70037 231626 -24357 -388558 590 -231426 89877 -293151 -333336 -25414
18601 217714 -112493 126264 -183024 -54183 369474 117063 -103557 -174574 -109843 -306419
18591 -306419 -54734 187398 -199643 170515 258855 162316 -141368 -102295 -34053 -40733 52701
18579 -245427 7726 -1681 167557 50330 -190455 91321 -186357 -101955 -189515 -45011 -196381
18568 -196381 -47251 -324835 11965 -288529 -52148 154204 -193243 -8868 133263 -167247
18557 -306039 12403 224281 98991 10221 -2136 -321569 -122577 -139963 -368704 -72782 293855
18545 -200202 -97568 -316474 -134080 -114767 24442 -55196 139581 -133988 -94705 52136 -50872
18533a62670D42140e8870o3805O1139k8608C71091a48891A24091a62955j87002
18523c49957b9637q1417j84231g8757B69023a77028j20889J18562I0017c83943
18512A08251c68790a77365n2551H3401a10123A38203b05940L9042k61967a01884
18501F3926J39958g0690j93292J8448O2172G1058b628r7157B49474p5139a03161
18489c33753O6422a05227r9380E4379b43146o5945A03566l8035a21198p3053l4838
18478b29089E981P1725J4112c63866b7659j07799I9443b4973A24957c9753l376
18467d3129A18029h7486O226k33418D2944K73208H6254b19046m745A56920o5232
18456I1688h4488G6356a05524C01994A26495b3974A74955B4274j0788c1287o2243
$$ plain form
18533 -162670 442140 -58870 -122675 -61536 -90144 371091 -148891 124091 -162955 -349957
18523 -349957 -29637 -111054 -295285 -78757 269023 -177028 -297917 -179355 90017 -383943
18512 108251 -368790 -177365 -229916 83401 -110123 138203 -205940 -166898 -428865 -101884
18501 63926 203884 -70690 -263982 -245534 -183362 71058 -2628 -99785 249474 174335 -103161
18489 -333753 -267331 -105227 -204607 54379 -243146 -309091 103566 65531 -121198 -194251 -229089
18478 -229089 5981 77706 91818 -363866 -27659 -135458 99443 -24973 124957 -39753 -43129
18467 -43129 118029 -87486 -81260 -314678 42944 316152 86254 -219046 -223791 156920 91688
18456 91688 -84488 76356 -105524 301994 126495 -23974 174955 24274 13486 -31287 -93530
18445i3530E6653J27753a40427l5344g8073g796A42053E4591b37608A8454a98057
18433b18276O2938A47392e0455E6939J6649b34610c2348o6310l4039p9974B37975
18421B48670a47312B3388J3924b42739d7768C56692b12666j42284h9032H8774
18410a99999i8383c9514A67585a81686A67462k8397d60621B34034E8523e493j82593
18399a88086r607K6481J0569N9868j12942C9726i7764q8210K0786A5813j51N2793
18387F8455b2379A76229h9353d3836r1603m0341M0276C547b3224E7764j1390J4713
18375F1087c1073k65852A87156b2444k35014A52816d305F4196K03183M146H02
18363b41256K6881g5117B55019B8006c06362i4684A57934e4802o2086N8200E5182
$$ plain form
18445 -93530 56653 184406 -140427 -175771 -78073 -7796 142053 54591 -237608 18454 -198057
18433 -218276 -155338 147392 -50455 56939 73588 -234610 -32348 -98658 -132697 -212671 237975
18421 248670 -147312 23388 37312 -242739 -47768 356692 -212666 -354950 -89032 88774
18410 -199999 -98383 -39514 167585 -181686 167462 139065 -460621 234034 58523 -5493 -188086
18399 -188086 -197693 -171212 -160643 -100775 -213717 39726 -97764 -185974 -165188 15813 15662 68455
18387 68455 -22379 176229 -89353 -43836 -135439 -175780 -135504 3547 -23224 57764 46374 61087
18375 61087 -31073 -296925 187156 -22444 -257458 152816 -4305 64196 267379 271525 802
18363 -241256 -214375 -75117 255019 28006 -306362 -94684 157934 -54802 -116888 -58688 55182
18351A91034G3438J36157D0743b16912g4433j6542A01847k6717i1755k36820A13550
18339B2396J45365o6024b56042G1730J87658a30380k8789N684A8987a41118F9696
18327d88795A66225a34817B05979a99227e8745J9439I4100b57237k6193B11180
18316d8692k01969E39J98246a8049L860j9377q1846k71386a06718B2125K9242
18305E1367b55068f4308G7314L9805a21456F5286b11144M9234B88311a7317M02
18294a6915k15061i3815A71640F155K76523k4308N2607d8019A9443g9134K5070
18283e4064j16320d6497H0578g4267k01892C55299A47626k9371a81128B68919
18272a35804k64660a37742k4853A11276a5837j33368r1996C0449K70349b72304
$$ plain form
18351 191034 73438 209595 40743 -216912 -74433 -90975 101847 75130 -91755 -328575 113550
18339 22396 167761 101737 -256042 71730 259388 -130380 -159169 -153485 18987 -141118 69696
18327 -488795 166225 -134817 205979 -199227 -58745 -39306 94100 -257237 -283430 211180
18316 -48692 -250661 539 198785 -18049 -14189 -33566 -115412 -386798 -106718 22125 51367
18305 51367 -255068 -64308 77314 117119 -121456 65286 -211144 -161910 288311 -17317 -16915
18294 -16915 -231976 -93815 171640 6155 282678 258370 310977 -48019 19443 -79134 -54064
18283 -54064 -170384 -46497 80578 -74267 -276159 355299 147626 118255 -181128 268919
18272 -135804 -400464 -137742 -162595 111276 -15837 -149205 -241201 30449 300798 -272304
18261a95629A0494P3109b8802a0499j1722I7410J81226D4663L10a75242d5361
18249F1696b27758j06722J2231A14941a49183j30921a702B29821A6153b86309
18238a34722p6227e658r0684j74252A06161d5351H4059b22013P8450R017K0882
18227a13664A54369a16497j39426A45931d5256l6396D1884O3430b10965F2837
18216B89563a26790j04106c5062j43900Q1725j480K0270r3178d1363k6992C0761
18204a3422D7501b55175A14575e4686A68617a4078m2506A595b59235N5559d294
18192c2275j1997l38629J43710j42199B16137c0380k09735A52575i4001H3054
18181I7948i7368o2534q3318k2534A68382h3695K7375B58489I6873J9800E4825
$$ plain form
18261 -195629 10494 83603 -28802 -10499 -22221 97410 278636 44663 44973 -175242 -45361
18249 61696 -227758 -334480 -322249 114941 -149183 -280104 -1702 229821 16153 -286309
18238 -134722 -210949 -5658 -96342 -270594 106161 -45351 84059 -222013 -143563 -134546 -113664
18227 -113664 154369 -116497 -255923 145931 -45256 -81652 41884 105314 -210965 62837
18216 289563 -126790 -230896 -35062 -178962 -97237 -98717 -78447 -171625 -41363 -68355 30761
18204 -13422 47501 -255175 114575 -54686 168617 -14078 -56584 1595 -259235 -203676 -4294
18192 -32275 -44272 -382901 -239191 -381390 216137 -30380 -240115 152575 -94001 83054
18181 97948 -97368 -159902 -243220 -265754 168382 -83695 -56320 258489 96873 116673 54825
18169A90733a07484A39688b71345b0650D1969b55022a15548B6982b99516J24323
18159a75193D4366a17806k77405A26234B7997P8840c5002F3832g9032A4954J56029
18148A70983J09400A15118d01391J02797a00875A2007a4151B34445A04937J31429
18138B36366a95035F1318e1813k9906K8690a6567q9803B38360a06728M2435H5490
18126E442a37757A05019A8563K0807A1201J78185k9130b93061B24057m5380c63277
18114a42725A41351a38054p5084a4870B6457a51788A01116D7587a04767G8750
18103a22580A69520h823k33779J01191o305q642k36875A4898J01147b5507C71230
18091h0070J7935l6309A21254E1796J77363a10373c6209j88979e1831A28527h1581
$$ plain form
18169 190733 -107484 139688 -271345 -20650 41969 -255022 -115548 26982 -299516 -175193
18159 -175193 44366 -117806 -395211 126234 27997 106837 -35002 63832 -79032 14954 170983
18148 170983 280383 115118 -401391 -298594 -100875 12007 -14151 234445 104937 236366
18138 236366 -195035 61318 -51813 -81719 -53029 -16567 -106370 238360 -106728 -64293 85490
18126 5442 -137757 105019 18563 39370 11201 189386 160256 -293061 224057 178677 -363277
18114 -142725 141351 -138054 -213138 -14870 26457 -151788 101116 47587 -104767 78750
18103 -122580 169520 -8823 -242602 -141411 -147716 -156358 -393233 14898 116045 -25507 371230
18091 -80070 -62135 -98444 121254 51796 229159 -110373 -36209 -225188 -51831 128527 -81581
18079B9251N9125r315J96003a33885d2663H8054b06570g0607j43680K5762A81208
18067B94482a51405G8038K09409a1478k39447E0014J0356d9602j1594A41876a49626
18055A27142M11496a07449r1485E0939a00213A22191J80126j31015c12211B3639
18044a57458A48422L6445a9444A18119a7310G0577b4565E3380a47392r340j34813
18033b91545B57685b94359i703j95268j9871E2519a7279A9776Q0045O734n1152
18022E5403g2316k29069b7868j11943q8621m4989R4934B99768c83153D04271D9014
18010a15591a3602p6843k00114a05227D0658f082q3025p5036F0764b05678k1650
17999b27328C172J37172B2021a34960A42953C9089A2845a35154C8183a49298O2878
$$ plain form
18079 29251 88376 79061 275064 -133885 -42663 88054 -206570 -70607 -214287 -188525 181208
18067 294482 -151405 78038 287447 -11478 -250925 50014 60370 -49602 -61196 141876 -149626
18055 127142 538638 -107449 -198934 50939 -100213 122191 302317 171302 -312211 23639
18044 -157458 148422 184867 -19444 118119 -17310 70577 -24565 53380 -147392 -156732 -291545
18033 -291545 257685 -294359 -9703 -204971 -224842 52519 -17279 19776 99821 106555 55403
18022 55403 -72316 -301385 -27868 -139811 -228432 -273421 -178487 299768 -383153 404271 49014
18010 -115591 -13602 -90445 -290559 -105227 40658 -6082 -89107 -164143 60764 -205678 -227328
17999 -227328 3172 140344 22021 -134960 142953 39089 12845 -135154 38183 -149298 -86420
17988h6420A8901B258P3448J96748c52575R4005A00544a09838c4815m1061q7045
17977a62921B56904b40660Q63a06024D7973J7086i7490f304E6600k7581e6009
17965a8166A1332J2660a73335M7130p9344P3090j98397o3899a85231r2059J9327
17954b57963B17630d7539F0329c2568C31831a14331A68085b99619C06777c5339
17943B84461b1519B05041b78136B3089h8692H1754f9713A90034g7659A18576b0796
17931H6699g4391A30199n6775k5107b55915i3780A8758M4198J07406E2602O08
17920E3210c2944j30314C38911A34755a54029A49664d01050A16820c04210b6247
17909i7242A75438d1735A24411b53132A71202a32203A28957B4896a34256c0678
$$ plain form
17988 -86420 18901 2258 75706 272454 -352575 -258570 100544 -109838 -34815 -75876 -162921
17977 -162921 256904 -240660 -239797 -106024 47973 65059 -97490 -6304 56600 29019 -56009
17965 -18166 11332 23992 -173335 -126205 -205549 -132459 -330856 -394755 -185231 -277290 -257963
17954 -257963 217630 -47539 60329 -32568 331831 -114331 168085 -299619 306777 -35339
17943 284461 -21519 205041 -278136 23089 -88692 81754 -69713 190034 -77659 118576 -20796
17931 86699 -74391 130199 73424 48317 -255915 -93780 18758 62956 170362 52602 53210
17920 53210 -32944 -163258 338911 134755 -154029 149664 -401050 116820 -304210 -26247
17909 -97242 175438 -41735 124411 -253132 171202 -132203 128957 24896 -134256 -30678
17898d4032l19750C3302M2444g2073q4192A85341b03952A35001a21675j3828B07499
17886A16216A7817b7979A10475C2169J67327a51357e6550q1926A04712F082b00662
17874b24740i9222q7849O2427d964k17222p4521B33458b8029F9492e6091G3398
17862a4886A26062k0096d0599B2046a44275f4685B21144P2234j40272b5288A82129
17850c7284B46692a54897J7653k1545A96614C0873A2028b59468J24867A94670
17839a52284B36846H0224J2412K69470c7204B54772r2856b80057a15164J0517
17829a04647f931H220a76130B00349b14986A7464e4402j09895A65021C0433M0255
17818G0688b07948A99382f3260r2379k9730O9380A90178o1555F3217a13291D5549
$$ plain form
17898 -44032 -363782 33302 75746 -72073 -156265 185341 -203952 135001 -121675 -135503 207499
17886 116216 17817 -27979 110475 32169 199496 -151357 -56550 -138476 104712 6082 -200662
17874 -224740 -99222 -187071 -124644 -4964 -222186 -296707 233458 -28029 69492 -56091 73398
17862 -14886 126062 105966 -40599 22046 -144275 -64685 221144 293378 153106 -25288 182129
17850 -37284 246692 -154897 -137244 -158789 196614 30873 12028 -259468 -134601 194670
17839 -152284 236846 80224 92636 362106 -37204 254772 161916 -280057 -115164 -104647
17829 -104647 -6931 8220 -176130 200349 -214986 17464 -54402 -164297 165021 30433 70688
17818 70688 -207948 199382 -63260 -155639 -185369 -115989 190178 128623 63217 -113291 45549
17806B83820J582D3969g426C474h4718A024a23850D69554b39124B01030a1011
17794a38925j06763A91130D593J59217h517r1555A57008a21933k638G7566M949
17783H2515A6106h075j53083F399c4781k3012j61329C6719a36632r3644Q1502
17772a48774A7575b5097A74517e1051B96M62510b62685J00980n5309o765n0077
17761b73856I6364m7173J58885a94867d2416E8721O6532d7196r3531I4375C950
17749b78005c0439H9611P6207c2195A77731a45932f1520j99207C2216a37318C7221
17737i2574j09717i5244Q219j5221L6285A90793J89808c23554A33c63847a19885
17725a20586e0783A28276b75796A41707J16803f4485j85204a12003A878J3350
$$ plain form
17806 283820 285402 43969 -7426 3474 -84718 1024 -123850 469554 -239124 201030 -11011
17794 -138925 -245688 191130 4593 163810 -8517 -100072 157008 -121933 -124571 77566 82515
17783 82515 16106 -8075 -161158 6399 -34781 -57793 -219122 36719 -136632 -230276 -148774
17772 -148774 17575 -25097 174517 -51051 296 462806 -262685 -161705 -217014 -223779 -273856
17761 -273856 96364 49191 208076 -194867 -42416 58721 125253 -47196 -140727 94375 3950
17749 -278005 -30439 89611 165818 -32195 177731 -145932 -61520 -260727 32216 -137318 37221
17737 -92574 -202291 -95244 -87025 -102246 -65961 190793 380601 -323554 133 -363847 -119885
17725 -120586 -50783 128276 -275796 141707 258510 -64485 -249689 -112003 1878 15228
17715A5228b43779j3072Q1611c1653n8934F8617J98085K3810c18522c5951j07341
17704a43292f045l3146j27100A69517a20557I0414b44635A12372a91737A83566
17693G4228A5654Q3941J36724c35684A38075i6236B89143A29430K29812j41187
17683B18055A08699J643J04557d5892C21546D8454K71837j52548k6853A120J39507
17672A40627M9554L2454l7682b6563n6793o2342a2008m1037J5382m0113B49766
17660F4632h1577L1170p0383H4032a10922E0622H338O7349c9613n0925E6718N9552
17648A16270J09861b09192j92684A45607K4628e83467D6268R0360a21729c523
17637b02634P4585B66198A01551m0870L07243A24553Q7598c56812h1991H6635
$$ plain form
17715 15228 -243779 -256851 -175240 -31653 -90587 68617 266702 290512 -318522 -35951 -143292
17704 -143292 -6045 -39191 -166291 169517 -120557 90414 -244635 112372 -191737 183566
17693 74228 15654 99595 236319 -335684 138075 -96236 289143 129430 359242 218055
17683 218055 108699 110342 214899 -45892 321546 48454 320291 167743 140890 1120 140627
17672 140627 190181 222635 184953 -26563 -83356 -145698 -12008 -53045 -37663 -77776 249766
17660 64632 -81577 -50407 -120790 84032 -110922 50622 8338 75687 -39613 -90538 56718 116270
17648 116270 226131 -209192 -401876 145607 170235 -583467 46268 136628 -121729 -3523
17637 -202634 -128049 266198 101551 60681 367924 124553 212151 -356812 -81991 86635
17626a66801l56701A9915J85431D8378b23184D9392b50100M7663B89103a14230
17615F1503K0469P0076i9224c2966B5344d8514D5306b8863j72196B03067g9949
17603a52979A86868P5651b45256g3346j3054p5044j2731B74926B3337J53906a35513
17591A97273H2161L05608B6492K73440a946B34496g7735F9251K43489D8293K07096
17580B55389F469K56149a32186B8064i6703b8916A61502K4229H0998a94467l3672
17569b28139B74877E796J8811a5960B09656A01742K28762E6609R741J5241J78866
17558B60457J70402G1259R8961K2746q3070f7642A35771g7719H8099h1248B12142
17546A22252D1646g4623K0131A23498O0940r998N0181e1736D1020L7803J73967
$$ plain form
17626 -166801 -523502 19915 205346 48378 -223184 49392 -250100 -202437 289103 -114230
17615 61503 81972 152048 -99224 -32966 25344 -48514 45306 -28863 -201059 203067 -79949
17603 -152979 186868 262519 -245256 -73346 -86400 -161444 -174175 274926 23337 177243 -135513
17591 197273 82161 387769 26492 299932 -1946 234496 -77735 69251 312740 48293 255389
17580 255389 6469 262618 -132186 28064 -96703 -28916 161502 185731 80998 -194467 -228139
17569 -228139 274877 5796 24607 -15960 209656 101742 330504 56609 66350 81591 260457
17558 260457 430859 71259 170220 192966 109896 -67642 135771 -77719 88099 -81248 212142
17546 122252 41646 -74623 -54492 123498 184438 174440 224621 -51736 41020 78823 252790
17535B52790F2745q852J10833f2390b9005k14679B69850e42F3189K36194I6208
17523H5447O1203C2857O2790J2422n1812L99449a76621C5797K15787a1946j91058
17512b03004G771h2237j2422r1741A91321M3693J69658b2953A83218h6333L5571
17501e0762B98798l2826A21859M2805F6358a22256H1392C4062K2381P0170m4502
17490H2111J52000N8562q8825m2857p7011L63704B10482k6468g2186a786k52648
17479b54434D69647c9216B47428j2237A4501L40295I430K53067A13870j8890L00776
17468C95756r7910j26178B8177b13303f9781A71813l2402J37066e4720A88603
17457B25982N433f6762A8271K43982m9711K71571A44404J02539K04587j29069
$$ plain form
17535 252790 62745 53893 164726 -62390 -29005 -243684 269850 -542 63189 299383 96208
17523 85447 146650 32857 95647 108069 56257 455706 -176621 35797 251584 -11946 -203004
17512 -203004 7771 -82237 -94659 -186400 191321 235014 404672 -22953 183218 -86333 -50762
17501 -50762 298798 265972 121859 164664 66358 -122256 81392 34062 56443 126613 82111
17490 82111 234111 292673 203848 160991 83980 447684 210482 184014 -72186 -1786 -254434
17479 -254434 469647 -39216 247428 235191 14501 354796 9430 262497 113870 94980 395756
17468 395756 297846 171668 28177 -213303 -69781 171813 139411 276477 -54720 188603
17457 225982 231415 -66762 18271 262253 212542 484113 144404 246943 451530 322461
17447C22461q7920J77696k00477j7998E6002K45205j2608q7917b20303A52212
17436D65132B08619m0771J16012I5662K90538I4344J46870a00537B73578B6473
17425I362L82616I4185P0352J08209Q9017p4475c89298B92491L5843g724B12637
17413g6975n0485B09622d8160D72104A65794N7117J28755o650c0550A72900F2063
17401B83307A28009b47043J14318D04798G6580K23425l0592G9654P998P3803b76914
17389C14406b6512C18751j30056O3159J85213B17422k7870K58473j11701E7550
17378C31419A20090L49754A30121K05722j65603P6931m5684c7845A78969q1694
17368I7275R8079k8322a8794C98409j55079A12106f391F8501L64068a37526A41254
$$ plain form
17447 322461 234541 412237 211760 193762 56002 301207 288599 200682 -220303 152212
17436 465132 208619 167848 283860 95662 386200 94344 241214 -100537 273578 26473
17425 9362 391978 94185 164537 272746 361763 287288 -389298 292491 328334 -7724 212637
17413 -76975 -127460 209622 -48160 472104 165794 222911 351666 345016 -30550 172900 62063
17401 283307 128009 -247043 -132725 404798 76580 300005 269413 79654 87652 161455 -276914
17389 314406 -26512 318751 188695 251854 437067 217422 189552 448025 336324 57550
17378 331419 120090 469844 130121 335843 170240 247171 201487 -37845 178969 97275
17368 97275 195354 167032 -18794 398409 243330 112106 -6391 68501 432569 -137526 141254
17356g6224C33810A10046J87580K9393q8899l2723K9772P5627K24318j80060m4865
17345C10189j05570N0658q1331K12231D775K5548c6210A60970B2960a89949C45073
17333B36431j7860B6682L04801l0972Q2725A61230A4564K20462Q070J73388o4122
17322C52362b039l560B2191f3830A61926l1816J81791J450j8532N5501O3458b90562
17309C15682A56568K51046j22761L78601B7689c6213C8984K13744p1186Q1080
17299B62622K30259I5892J51751b63636B26077F3570O100J33745j8369D6167Q1897
17288A28064n7244R5569A5676L65919j60670M05894B70012L04817a49062A82420
17277C44967b04678C76125j58359f0853H8850J20369j9391m4356N827J26654A26535
$$ plain form
17356 -76224 333810 110046 297626 327019 238120 205397 235169 310796 535114 355054 310189
17345 310189 204619 255277 173946 386177 4775 30323 -36210 160970 22960 -189949 345073
17333 236431 218571 26682 331483 300511 383236 161230 14564 235026 243096 416484 352362
17322 352362 -2039 -5599 22191 -63830 161926 130110 311901 313351 294819 350320 413778 -290562
17309 315682 156568 407614 284853 663454 27689 -36213 38984 252728 181542 262622
17299 262622 492881 95892 247643 -263636 226077 63570 69670 203415 185046 46167 128064
17288 128064 70820 166389 15676 381595 220925 626819 270012 574829 -149062 182420
17277 344967 -204678 376125 217766 -60853 88850 209219 189828 145472 151299 277953 126535
17265B96757j15593P613J7649P6793p0638N5696F5562h0502A33222c5229D23261
17253D37927A36527J52609Q3940A73695K44524r0968j11882G4301M38314A45730
17242A33687m4863e683B12205E3700M27620A97933F7792L4771J25991K71631j79335
17231C20850j17604K8993H0310Q6994K49185M7795b4913B24770g3891B82136j31120
17220A51016K81409A17509J48562J32949n5189P005M5391K6563e436B05867K5095
17209B30962j10621L11654A40946E2250J24144n1049R8441M5017C7514N20965
17199E58479B20224K52039j72970q8334K93434B11087E6114K53138A19216Q0209
17189A99425L6779A10695C1538M106M40822e7709C23610O491K71523K28831l78115
$$ plain form
17265 296757 181164 188777 206426 283219 212581 268277 65562 -80502 133222 -35229 423261
17253 437927 136527 289136 373076 173695 418219 327251 215369 74301 512615 145730
17242 133687 88824 -5683 212205 53700 481320 197933 67792 102563 228554 500185 320850
17231 320850 203246 232239 80310 167304 416489 464284 -24913 224770 -73891 282136 151016
17220 151016 432425 117509 266071 399020 343831 350836 396227 422790 -5436 205867 230962
17209 230962 120341 431995 140946 52250 176394 125345 223786 268803 37514 558479
17199 558479 220224 472263 299293 210959 504393 211087 56114 309252 119216 199425
17189 199425 236204 110695 31538 35644 476466 -57709 323610 330101 601624 830455 452340
17178D52340j93768J18623l7386K28792p5539i5117A70165Q6476q6501J46283
17168C16423L2718A3493J86268m3173K43087A31419N60156C18064m4215K82062
17158E55911k64078j16995K99657J50094B80455n9393L71239A89738K62272j1673
17148D40337A27825K84999j77749J11085A23765O6514p6380J16554L04823K2073
17138E57349J06887k02387p9404J95940A01949L46433j5095J50304B56995J3631
17128B70626J43503G2655K50372o2515J92800K19928A63799L52511I4179J6738
17118A10917K10897J15715L10479k44350j24674j10111j22789K65732q9835Q4143
17108D06124j19644K2573R9148j45237A11999L92500k0551j05163H2453L10347
$$ plain form
17178 452340 258572 377195 339809 568601 493062 -95117 170165 256641 170140 316423
17168 316423 349141 13493 199761 156588 399675 131419 691575 318064 273849 555911
17158 555911 291833 174838 474495 624589 280455 221062 592301 189738 452010 440337
17148 440337 127825 412824 235075 346160 123765 190279 113899 230453 535276 557349
17138 557349 664236 461849 382445 578385 101949 448382 433287 583591 256995 270626
17128 270626 414129 72655 323027 260512 453312 673240 163799 516310 94179 110917
17118 110917 321814 437529 748008 503658 378984 268873 146084 411816 321981 406124
17108 406124 286480 309053 408201 262964 111999 504499 483948 378785 82453 392800
17098C92800j49569L36278B89683J47080m8523p2301j24853J08260K97410B78303
17087F25829j08139A95541L97496p0751j42216K422R6898j15301L45356k33529
17077D75916J9358J9037j79461M6840J72963k0197j00205N8465J29195k84128
17067C37783J92575K28451j90703K44749k24058K14775l69388p3935j9534L6780
17057C77495J8288Q3513K98577k90672O5331j92502K44764j8207J88575l72741
17047D02421M63167C26911J07340K90181r2839Q5251j99144K34368l50992K54853
17037F55929J19750q7197k5439j74888r1043J57672j20100K16179k3777J31448
17027G58534N1773j70469l556j36785J67582N8204K3967K32763B45226L02977
$$ plain form
17098 392800 243231 579509 289683 436763 388240 315939 191086 299346 596756 278303
17087 625829 517690 195541 593037 522286 380070 382492 479390 364089 709445 475916
17077 475916 495274 514311 334850 381690 554653 534456 434251 492716 621911 337783
17067 337783 530358 758809 568106 812855 588797 803572 434184 360249 340715 377495
17057 377495 395783 479296 777873 487201 552532 360030 604794 586587 775162 402421
17047 402421 865588 326911 434251 724432 631593 716844 517700 752068 401076 655929
17037 655929 775679 688482 663043 488155 397112 554784 434684 650863 627086 758534
17027 758534 810307 639838 636282 499497 667079 725283 749250 982013 245226 548203
17017E48203J52053O0517n6761C10840K21256O00728m31302k11910J97981J18684
17007H06277J45011n1206k56498L25802j07982l29231L38880m00325K41386J09578
16997H21692R9951l5433k16146r2809L02969m1561k98507K64929M00326n41248
16987F64163J1078J63207R4064J83339l2841m25052J33664n5319q6289N52235
16977A202249j72689O4911l38017L27811j56029r9684j40491J78945N7393k06213
16967G18186K44027R9693k29184K03921J94306l67880o3968M78537J93497m28924
16957A042211k9964P3592J45835j33698q3013N41576l55997k55038k82753M31264
16947A094015j87209M15997m81079L17623K49016j37096J0313n8773j84298J01379
$$ plain form
17017 548203 700256 760773 704012 310840 532096 1132824 701522 489612 687593 806277
17007 806277 951288 900082 643584 969386 861404 532173 871053 470728 712114 821692
16997 821692 921643 886210 670064 577255 880224 838663 540156 805085 1205411 664163
16987 664163 675241 838448 932512 1115851 1083010 657958 791622 736303 650014 1202249
16977 1202249 1029560 1094471 756454 1084265 928236 828552 688061 867006 924399 718186
16967 718186 962213 1061906 832722 1036643 1230949 863069 799101 1277638 1471135 1042211
16957 1042211 1012247 1085839 1231674 1097976 1014963 1556539 1200542 945504 662751 1094015
16947 1094015 906806 1322803 841724 1159347 1408363 1271267 1281580 1222807 1038509 1139888
16937A139888j4014K41207o4846Q2096J16974l73926k7420L29168K09489k61968
16927A376648K25661k24264Q4952j13820K51108l53859J25664J4380L6763J49693
16917A572926K07662j53582l54336O10587l13310J78299k36757J49385K32518
16908A893392j63581J22672j44190K51706l22980J37200Q2305m48501N37770j52
16898A945641k10204K19657j77807j49542K86571M24157m02692R3590K39307l22174
16888A946504j69346M96434p5482j63614J78605j47004L46490J50552l67207J93873
16878B389805l25799M36402j7015M9392j60261K34218M4582j48681L1797P7498
16868B611938K59851l28079K05833o0459j8619J08178J59235J54462M9335M7545
$$ plain form
16937 1139888 1125874 1367081 1302235 1384331 1501305 1127379 1099959 1429127 1638616 1376648
16927 1376648 1602309 1378045 1462997 1349177 1600285 1246426 1372090 1386470 1423233 1572926
16917 1572926 1780588 1627006 1272670 1883257 1569947 1748246 1511489 1660874 1893392
16908 1893392 1729811 1852483 1708293 1959999 1637019 1774219 1856524 1408023 1945793 1945641
16898 1945641 1735437 1955094 1777287 1627745 1914316 2338473 1935781 2029371 2268678 1946504
16888 1946504 1777158 2273592 2198110 2034496 2213101 2066097 2412587 2563139 2195932 2389805
16878 2389805 2064006 2500408 2483393 2532785 2372524 2606742 2651324 2502643 2534440 2611938
16868 2611938 2871789 2543710 2749543 2689084 2670465 2778643 2937878 3092340 3141675 3189220
16858C189220l24157M46370q6991l69624N36357k92356k4498J52591K74561j14094
16848C387379K36176o9458K81295k83590J48502M12257k51900o4707K50772m2208
16838D004518J12983K53764k44524M46160m0140Q4617M17320n38470K13818K17095
16828D927141j70649p1658M37988m11231N52373J46690k99918M59410L72356j07879
16818E834623j01840L46705K9328q7566M78995r5753K50755m66587L84258P30808
16808G303726l18643K71017J27848M17078M2775L87092j38699M54486q3384L60259
16798H823555k83631N48164J86432K18028M57484J42852O679M91644L36398J41772
16788A1069377J68332M84936K53316N63138P38261j27750K28112N38958J86973
$$ plain form
16858 3189220 2865063 3311433 3224442 2854818 3391175 3098819 3074321 3226912 3501473 3387379
16848 3387379 3623555 3554097 3835392 3551802 3700304 4112561 3860661 3795954 4046726 4004518
16838 4004518 4117501 4371265 4126741 4572901 4532761 4617378 5034698 4496228 4710046 4927141
16828 4927141 4756492 4684834 5122822 4711591 5263964 5410654 5110736 5570146 5942502 5834623
16818 5834623 5732783 6079488 6108816 6021250 6500245 6404492 6655247 6188660 6572918 7303726
16808 7303726 6985083 7256100 7383948 7801026 7843801 8230893 8092194 8546680 8463296 8823555
16798 8823555 8539924 9088088 9274520 9492548 9950032 10092884 10099563 10591207 10927605 11069377
16788 11069377 11237709 11722645 11975961 12539099 13277360 13149610 13377722 13916680 14103653
16779A4103653O92900L84308M84296N89220K54429P72861M42079R11875L94444
16770A9030065M92246J044835M52856Q87905J016380Q32218P17938J147099O23357
16761B6244899J151893J236441J180852J267344J033179J724245J455750J601426
16753C6896029J665918J893622K040530K159601K421485J918794K528982L171081
16745E4696042K524918K920903L513532L474757L972105M073236M432292M719780
16737H4327565N064536N471385N563558O263881O245303O511374P066354P622715
16729A34136671P314741P438391P967562P368899P305808O804894O382785N300228
16721A90019979M396434L169907K645389N62841m5160k075674l168933m243677
$$ plain form
16779 14103653 14796553 15180861 15665157 16254377 16508806 17281667 17723746 18635621 19030065
16770 19030065 19522311 20567146 21020002 21907907 22924287 23756505 24474443 25621542 26244899
16761 26244899 27396792 28633233 29814085 31081429 32114608 33838853 35294603 36896029
16753 36896029 38561947 40455569 42496099 44655700 47077185 48995979 51524961 54696042
16745 54696042 57220960 60141863 63655395 67130152 71102257 75175493 79607785 84327565
16737 84327565 89392101 94863486 100427044 106690925 112936228 119447602 126513956 134136671
16729 134136671 141451412 148889803 156857365 164226264 171532072 178336966 184719751 190019979
16721 190019979 194416413 197586320 200231709 200794550 200749390 198673716 195504783 191261106
16713A91261106n645118o061563p025504p497750p411397q087655p647735q022410
16705A33861974p454958p673815o837601o899867o258366n923145n075954n545840
16697H2192428n007351m642283m057893l764309l616020l423818l138659l092057
16689E1450038k796143k953708j732284k374433k186238j808883j698899j726747
16681C4172703j249124k006158r29715j632427j223666p64063j591998p77980
16673B3997572j237037q33912j000232o82144m25604j162656l75668o10708r10940
16664A6758671m92092l44303q52502m78234n14884k61574p21016l34408l15145
16655A2444513l77883q6498o72499m52005m02349j79325l39110J24511o14968
$$ plain form
16713 191261106 185615988 179554425 172528921 165031171 157619774 149532119 141884384 133861974
16705 133861974 126407016 118733201 111895600 104995733 98737367 92814222 87738268 82192428
16697 82192428 77185077 72542794 68484901 64720592 61104572 57680754 54542095 51450038
16689 51450038 48653895 45700187 43967903 41593470 39407232 37598349 35899450 34172703
16681 34172703 32923579 30917421 29987706 28355279 27131613 26367550 24775552 23997572
16673 23997572 22760535 21926623 20926391 20244247 19818643 18655987 18280319 17669611 16758671
16664 16758671 16266579 15922276 15069774 14591540 14076656 13815082 13094066 12759658 12444513
16655 12444513 12066630 11980132 11307633 10855628 10453279 10273954 9934844 10059355 9444387
16646I444387m92723n6968l0340j79028o69447j3341k08598j90286m30149L5435
16636G208942K10068m43215k92533j86678J68001k56146j55691l94373n669q3152
16626E769554m16614J36832j25059j91201l03450N2538j78241j37703M1341O0191
16616D708188m6746m79378M79316m45476k04926j04093J03863m6602J24508l3120
16606D055534l32468J15525j87623l8351k74178j19576k41823R9184l1618j63756
16596B880850P6240J05914k36121J13372l37661J10451K25000k48853m6456p7610
16586B565126j24764Q1122j9787Q4259o7996J8272l78348m7830K74143K060o3841
16575B322416p7360j83157M3517k69181J03607j3481j38861M01725m94211j06734
$$ plain form
16646 9444387 8951664 8894696 8864356 8685328 8015881 8002540 7793942 7603656 7173507 7208942
16636 7208942 7419010 6975795 6683262 6496584 6664585 6408439 6252748 5858375 5852706 5769554
16626 5769554 5352940 5489772 5364713 5173512 4870062 4922600 4744359 4606656 4647997 4708188
16616 4708188 4661442 4182064 4661380 4215904 4010978 3906885 4010748 3964146 4088654 4055534
16606 4055534 3723066 3838591 3650968 3612617 3338439 3218863 2977040 3076224 3044606 2880850
16596 2880850 2957090 3063004 2826883 2940255 2602594 2713045 2938045 2689192 2642736 2565126
16586 2565126 2440362 2521484 2501697 2585956 2517960 2536232 2157884 2110054 2384197 2386257 2322416
16575 2322416 2245056 2061899 2105416 1836235 1939842 1926361 1787500 2189225 1695014 1588280
16565A588280J08351J73551j69917k9823O1176p0313L00147j39327j14078o746
16555A701301l13752N06652j10339n11796N2985J27291K92845n31010K03367M3623
16545A461167L56207k12853j18450K5116j79303k888m6957n7580J17347P9929
16535A421735k32878L7421L92768l02679k57147J84144K56272J15819n73148L42919
16525A385226l45371J28803J19577l21526J42531k88700Q0635L99790L7535k76243
16515A062257k32651K60562k07173n6792K33111k77839K83277k12802j26316L92430
16505A118064n3459k25694K9426K80593j1842k70272j70479J28548l30475K88691
16495G83101l5833P3509K31441E07822R9304B27857O05298L3578Q6072m08503
$$ plain form
16565 1588280 1696631 1870182 1700265 1670442 1731618 1661305 1961452 1822125 1708047 1701301
16555 1701301 1387549 1894201 1783862 1272066 1325051 1452342 1745187 1214177 1417544 1461167
16545 1461167 1817374 1604521 1486071 1511187 1331884 1328996 1282039 1224459 1341806 1421735
16535 1421735 1188857 1226278 1619046 1316367 1059220 1243364 1499636 1615455 1042307 1385226
16525 1385226 1039855 1168658 1288235 966709 1109240 820540 901175 1300965 1338500 1062257
16515 1062257 829606 1090168 882995 826203 1059314 781475 1064752 851950 725634 1118064
16505 1118064 1064605 838911 868337 1148930 1137088 866816 696337 824885 494410 783101
16495 783101 747268 820777 1052218 507822 607126 227857 833155 866733 952805 544302
16485E44302J19615q3987N1952K5612q1315K67440l33746K53290l15945m644L05140
16474G47714l63582M94159j56921j89005L0223J37123k73865K68405L8539k59880
16464D72910j982J12660K1097j99217K5553K89542n1521B85091J10345J49641
16454E45077M1834K84306k69286k22416L786L11522C39464J38700o9463M42600
16444H51301l96314L1855K47621j29253J27929j96974N847j3019M4358J28360
16434G01711j56541j28666o6530O7838l0838N4329A37167J67444B9615M48002
16424D77617O9544j42937j36295J45715o2974j41627a01736A46645j0995K28481
16414C64131J59962B52565j22989K33268j64816O9892J43452n7740C0180K46587
$$ plain form
16485 544302 663917 579930 631882 657494 576179 843619 509873 763163 447218 442574 747714
16474 747714 384132 878291 721370 532365 562588 699711 425846 694251 732790 472910
16464 472910 470928 583588 604685 405468 431021 720563 669042 285091 395436 545077
16454 545077 586911 871217 601931 379515 383301 694823 339464 478164 408701 851301
16444 851301 454987 486842 734463 605210 733139 536165 542012 528993 573351 701711
16434 701711 545170 416504 349974 417812 386974 441303 137167 304611 29615 477617
16424 477617 547161 404224 267929 413644 350670 209043 -101736 146645 135650 364131
16414 364131 524093 252565 129576 362844 198028 267920 411372 353632 30180 276767
16404B76767K5743q070j9383M0792K49912k70117J02866p5458o6939A17781J38903
16393B56684n5878L51941j47324j989j86400O8457L45390j35432r5251j11908
16383B88290c4398D9378K67901M5471j41608O5241m0810N2687M6336A31725Q4194
16372B15919L9978J84492j67650j2976l5123p5376K84141A65785a56119f3973
16361B05558q2755J30056j22501R4329D5429L45233d3520C26379N6084R9650k37823
16350B44290q2431K6686G1374e4413A50868c3379B15939q1274D7224M04977g4859
16338A14164a80000c8065C36978a9252A63998L41014j83108r1228o7790p2700
16328I0186J01440b0694H9492P1348R6522a3951H493h25D19134j71540m7604h9723
$$ plain form
16404 276767 302510 294440 275057 315849 565761 295644 398510 323052 256113 117781 256684
16393 256684 200806 552747 405423 403434 217034 285491 630881 495449 400198 288290
16383 288290 -34398 49378 317279 362750 221142 286383 245573 298260 344596 131725 215919
16372 215919 255897 440389 272739 259763 224640 149264 433405 165785 -156119 -63973
16361 205558 122803 252859 130358 224687 45429 390662 -43520 326379 382463 482113 244290
16350 244290 161859 188545 71374 -54413 150868 -33379 215939 134665 47224 452201 -74859
16338 114164 -180000 -38065 336978 -19252 163998 505012 321904 230676 162886 90186
16328 90186 191626 -20694 89492 160840 257362 -13951 8493 -825 419134 247594 199990 -89723
16315B09741F6010J37839a993l392A18564d2098B50179g099j05509A420J27312
16304A28732K6402g701j29604B6957a91586A37199J03571b57846D6522K28159
16294B74681B5654K24843C8168a2371j67486B79245a03315A78754K7514P8173
16284B84441a95611A17992Q1526q3693K6516J11875a67416g576B97339A6068J59099
16273A75167c8696I2504Q8623n9889a13007m2703E8855D733J2177N4867J29304
16262B01081a52144A91029r5366a2466e12I1647m4548J36522b3305j28180B04698
16250C38784i9974l3019k11576I9462L7581F0365J00330i5681M7783B14805e0277
16238b3806A87630a8854A74144a15414N0872A37374C6670a8033B38849f0533g42
$$ plain form
16315 209741 66010 203849 -1993 -5385 118564 -42098 250179 -7099 -112608 1420 128732
16304 128732 155134 -7701 -137305 26957 -191586 137199 240770 -257846 46522 274681
16294 274681 25654 250497 38168 -12371 -179857 279245 -103315 178754 206268 284441
16284 284441 -195611 117992 199518 115825 142341 254216 -167416 -7576 297339 16068 175167
16273 175167 -38696 92504 181127 121238 -113007 -155710 58855 4733 16910 71777 201081
16262 201081 -152144 191029 95663 -12466 -512 91647 47099 183621 -23305 -151485 204698
16250 338784 -99974 -132993 -344569 99462 137043 60365 160695 -95681 -47898 214805 -50277
16238 -23806 187630 -18854 174144 -115414 -64542 137374 36670 -18033 238849 -60533 -742
16226a15746o1260k3655h2634n447N967r0829A25646a32588B36399a18146A04649
16214B59154P8228a93352k8428f9658K9997I8124b18128B5825b15767n2077B58043
16202A86376O5678a1445r4699A45031b09348M5057j7753A7725K03678M8370o3692
16191B06081j716l8046a29376D8762J4654b70322F9679J36676k4416b89032a30449
16179B48152B4844f6820q6661j85691a55230f180m4859j33616j10698h4370j63622
16168b47992B6672j3333J37416b00576A77458c3353H5740d7017j14021C1438M351
16157C5789K006o88a73040C26436f5736l7437B28033a328q9123A15263i5201A56399
16144a5926j1135C6857K69582f1334B30040A6094K22759f0805j73935J08626A66551
$$ plain form
16226 -115746 -177006 -200661 -82634 -88081 -82114 -172943 125646 -132588 236399 -118146 104649
16214 259154 337382 -193352 -221780 -69658 -39661 98124 -218128 25825 -215767 -267844 258043
16202 186376 252054 -11445 -106144 145031 -209348 -164291 -182044 17725 221403 269773 206081
16191 206081 204365 166319 -129376 48762 63416 -270322 69679 206355 181939 -289032 -130449
16179 248152 24844 -66820 -153481 -339172 -155230 -6180 -51039 -184655 -295353 -84370 -247992
16168 -247992 26672 13339 150755 -200576 177458 -33353 85740 -47017 -161038 31438 35789
16157 35789 37795 37107 -173040 326436 -65736 -103173 228033 -1328 -90451 115263 -95201 156399
16144 -15926 -27061 36857 306439 -61334 230040 16094 238853 -60805 -234740 -126114 166551
16132a92841A34400k9523L0132J18799c68771d6793m48324I5409b268A40365k6623
16121A13742J0749n843c6279j36255A9791b67590F338c29055F1524B5008e4298
16109H7797j7104C5188a59428f6627A63217l89k8141m4413b94950C39297A27393
16097B69884M052d8187J0240A33728b07274H0579J52193b61190B68780b72699
16086A4972J97654I4617J32099g771l4226l12894O4544G5471j4914c046n8348
16075f1394n22946c94n67883G5367a85156P198D9775N8262a89407N9614B14171
16063c9401B29747b47137D7049R3428k4282g7647B03895D0655c13391O5937A41615
16051b58694M9105E7119Q9991a95647a3298A86588h3200k5581A39152d9324K3088
$$ plain form
16132 -192841 134400 104877 135009 253808 -368771 -46793 -495117 95409 -2268 140365 113742
16121 113742 124491 118648 -36279 -172534 19791 -267590 6338 -329055 61524 25008 -54298
16109 87797 70693 35188 -159428 -66627 163217 162828 134687 90274 -294950 339297 127393
16097 269884 273936 -48187 -37947 133728 -207274 80579 232772 -261190 268780 -272699
16086 14972 212626 94617 226716 -7771 -41997 -354891 -290347 75471 60557 -3046 -61394
16075 -61394 -584340 -394 -568277 75367 -185156 -177958 49775 108037 -189407 -129793 214171
16063 -39401 229747 -247137 47049 140477 116195 -77647 203895 40655 -313391 -247454 141615
16051 -258694 -209589 57119 147110 -195647 -13298 186588 -83200 -108781 139152 -49324 -26236
16040b6236B15077a0585B7856J03274L345J988d7608i473C59939a42645j56066
16029b98711A92634E6648k2110h9046j61573A2435d9981j309A65975C0357J29501
16018A59858b18051J934A95589C3471b0726k97657J37475A17214a34126L7287
16008i6839j23626a3866n5374k67906E9306c8577A39793E4206b30887E770a02242
15996b34190d0881q0494d9197j68527N1611f1534j39255L9605f0586G5304a01308
15984d8984A49343K73347J27286k53413A19828a33271A43417L72756a43873G0415
15973a70388k41325C86167b81707a4749k3054j51942M6209f7480r0046O1582A39
15961a07630Q78c6555j43098j80177J06431B10998J9789d0240j19418A37752O2853
$$ plain form
16040 -26236 215077 -10585 27856 131130 134475 136463 -47608 -9473 359939 -142645 -298711
16029 -298711 192634 56648 34538 -89046 -250619 12435 -49981 -51290 165975 30357 159858
16018 159858 -218051 -216117 195589 33471 -20726 -318383 -180908 117214 -134126 -96839
16008 -96839 -220465 -13866 -69240 -337146 59306 -38577 139793 54206 -230887 5770 -102242
15996 -234190 -40881 -121375 -49197 -217724 -166113 -61534 -200789 -161184 -60586 75304 -101308
15984 -48984 149343 422690 549976 296563 119828 -133271 143417 516173 -143873 70415
15973 -170388 -411713 386167 -281707 -14749 -37803 -189745 -143536 -67480 -157526 -95944 139
15961 -107630 -106752 -36555 -179653 -359830 -253399 210998 230787 -40240 -159658 137752 200605
15950B00605b20016O4518N4105m659A81792K0709k1588E9227i4180E5210g8393
15938A49646a2174D3929b36662l5088B11252l7938b98431l4973f4938j0643D53728
15926b49094d3522M204B70889a03549p6195I1729a372l9605k28071j57818a10897
15914A76422d0404k05141A06587A6844g230p2608k00854A64927a31381b9187C53776
15902b52011c2492k38121D7014f0110I7711a4803o2566C7740e2135E8746J79781
15891B38527G8261a56397j39821B7867L5164J82536A4540a37411k8596D7672J175
15880D8847R5058b30547a10714J765b7131D483a63891m2479K8469d3398k85929
15869c29327e4141H5359a11870l79569a46070B16025a88167n3123B44197a15246
$$ plain form
15950 200605 -220016 -155498 -101393 -106052 181792 202501 180913 59227 -94180 55210 -78393
15938 149646 -12174 43929 -236662 -271750 211252 173314 -298431 -333404 -64938 -75581 453728
15926 -249094 -43522 -39318 270889 -103549 -179744 91729 -1372 -40977 -269048 -426866 -110897
15914 176422 -40404 -245545 106587 16844 -7230 -79838 -280692 164927 -131381 -29187 353776
15902 -252011 -32492 -270613 47014 -60110 97711 -14803 -77369 37740 -52135 58746 238527
15891 238527 78261 -156397 -296218 27867 63031 245567 14540 -137411 -166007 47672 48847
15880 48847 143905 -230547 -110714 -108949 -27131 4483 -163891 -206370 -177901 -43398 -329327
15869 -329327 -54141 85359 -111870 -491439 -146070 216025 -188167 -241290 244197 -115246
15858A69129b00864D9396c0671q0722B08870c2885C64972J0921j54127a21688
15847A28004q443l7868g1502A88492a67646j08307b008B62543I405K51284A11632
15835A40445l189h0552C1372b57064B23594a15465k1255c9029k04869F2419a29453
15823d7962k62467A04069D6242L0586M5704a65636A01339M0421a1344l44758B84831
15811b11222C7100b83679f9633a9392o1264A17160N0456a74204B00945b41172
15800g6196G7286a24622I8275f4540C09123C3073J17991g8147C52081b34243A7960
15788E9153b09609A36845b60154A84766c96239J94525a8190j91670b4742k2571
15778d7313n9129A06450b0107A60627b71280c950j22710j9519L1847K9391j19158
$$ plain form
15858 169129 -200864 49396 -30671 -111393 208870 -32885 364972 375893 221766 -121688
15847 128004 119561 81693 -71502 188492 -167646 -275953 -2008 262543 9405 260689 111632
15835 140445 137256 -80552 31372 -257064 223594 -115465 -136720 -39029 -243898 62419 -129453
15823 -47962 -310429 104069 46242 76828 122532 -165636 101339 141760 -11344 -356102 284831
15811 -211222 37100 -283679 -69633 -19392 -80656 117160 167616 -174204 200945 -241172
15800 -76196 77286 -124622 98275 -64540 309123 33073 151064 -78147 352081 -234243 17960
15788 59153 -209609 136845 -260154 184766 -396239 -201714 -18190 -209860 -24742 -47313
15778 -47313 -106442 106450 -20107 160627 -271280 -3950 -126660 -146179 -114332 -84941 -204099
15767b04099h669F0231b02427A00243f1486j96940E267c8919C19025A11447B0013
15755C32521A0346L189a59766A03777N4692b13530P9205A27692b43736g9288l1516
15744a10804G0643f5026B58114a17828B1455J7788O642c7049C52810c76034a78530
15732c15259G5794b57792e5652A65005b71801j1602F5148b69909K5285c8400A82508
15720D2815b16052j11340A21064C4413j5543M9550a04710d2634F9159d4976A78182
15708H4080c07665a10701G8519o105Q9962a17121A54601N770a65852I4254g4795
15696a9362E5547c58884D2061J89178c9172I6467Q6951L79326A00994A6485a99179
15684a5156j09978q5399j4735j65480d5755k93029A3406J84682b76990A6953B373
$$ plain form
15767 -204099 -8669 60231 -202427 100243 -61486 -258426 5267 -38919 319025 111447 20013
15755 332521 10346 13535 -159766 103777 158469 -213530 -134325 127692 -243736 -79288 -110804
15744 -110804 70643 -65026 258114 -117828 21455 39243 45885 -37049 352810 -376034 -178530
15732 -315259 75794 -257792 -55652 165005 -271801 -283403 65148 -269909 -244624 -38400 182508
15720 42815 -216052 -327392 121064 34413 18870 68420 -104710 -42634 69159 -44976 178182
15708 84080 -307665 -110701 78519 72414 162376 -117121 154601 160371 -165852 94254 -74795
15696 -19362 55547 -358884 42061 231239 -39172 96467 183418 562744 100994 16485 -199179
15684 -15156 -125134 -210533 -225268 -390748 -45755 -338784 13406 198088 -276990 16953 2373
15672A21329j8898f3614C00486G5659J16057i5007c1383E5510A8498L71657a98039
15660b1425p8006c1872j07304o1855B61184j07981E6882P7880a52496c9336C06401
15648B20387a9943j33891B08899a07492L269F1742J27613l7519o8575g8447b0981
15636d04550K01280g8002A90205b63304a18050j2824c7276A07695N6662G5963
15625D7068h5393B2657g6949p8844D66499A18499n3721a99146h3180k3239B74883
15613c1397A1717R1514a43593G5086a44791M0129c1996C82318E1915k4492K2587
15602E0010a96293r281E9890j226B4677H352c31184i7834E7637j1400O1512b04107
15589b37258j78569J59277I502K29392b13023c3570l65260C16548a73322g8306
$$ plain form
15672 121329 102431 -63614 300486 75659 191716 -95007 -31383 55510 18498 390155 -198039
15660 -21425 -99431 -31872 -139176 -201031 261184 153203 56882 134762 -152496 -39336 306401
15648 220387 -19943 -153834 208899 -107492 -104223 61742 189355 151836 83261 -78447 -20981
15636 -404550 -203270 -78002 190205 -263304 -118050 -130874 -37276 107695 164357 75963
15625 47068 -85393 22657 -76949 -155793 466499 118499 64778 -199146 -83180 -106419 274883
15613 -31397 11717 103231 -143593 75086 -144791 -104662 -31996 382318 51915 27423 50010
15602 50010 -196293 -205574 59890 58664 24677 8352 -331184 -97834 57637 46237 107749 -204107
15589 -237258 -415827 -256550 9502 238894 -213023 -33570 -398830 316548 -173322 -78306
15578f4634b6627q8360D47166A22692b37307A50022f4416I3573a34256B63840
15567C44143j14252A06998a25137q0183a9623C5710L74530D3666b9142D1019q778
15556C2241Q201e818k96549A77280a02480j96990h5635j20095A12587a46577l77482
15545e24059a23643k7476B5678i8176D846J30842o4723k7302a50649B10104o3018
15534A47086e3053j20390A74040f3866D705a44340N2202c4637J1330A07458b32081
15522F7599b2339p1664A3355a23164C2168K55795J05681b92041b6263j32203M0954
15511a17512E1227i8935A32312n6451a04764m6073o0131j41418C96267A5074b51392
15499b73795G0280L6837a38196b6557j56355r8787B72065j15662K4832b12061
$$ plain form
15578 -64634 -26627 -114987 447166 122692 -237307 150022 -64416 93573 -134256 263840
15567 344143 229891 106998 -125137 -205320 -19623 35710 410240 43666 -29142 41019 32241
15556 32241 40442 -5818 -302367 177280 -102480 -299470 -85635 -205730 112587 -146577 -524059
15545 -524059 -123643 -151119 25678 -98176 4846 135688 70965 43663 -150649 210104 147086
15534 147086 -53053 -173443 174040 -63866 4705 -144340 -92138 -34637 -23307 107458 -232081
15522 67599 -22339 -94003 13355 -123164 32168 287963 393644 -292041 -26263 -158466 -117512
15511 -117512 51227 -98935 132312 75861 -104764 -150837 -210968 -352386 396267 15074 -251392
15499 -273795 70280 107117 -138196 -26557 -182912 -281699 272065 156403 181235 -212061
15488C56832a7218l09461F5779P9612J82219r5697c5049D3090J22115a9826k02411
15477b22237h2187J1426D0084L16773B7136b6229j22307b8197j58204e7169k13675
15466b70844d6442p0679o2191h9186G4078d34210a91096q561L8132o6755e1668
15454E5232J41347c94416B62313j26937i9628C7946c4937C9544a02369H2666J7164
15443I9830a46117N2359a4494G2549K14012a17898A1763O1120a54825A09648a77803
15431a15272C1017h394H9302a80681a1083B64844f1757F00K45626b09980C4328
15419A20218A3224N6181a44034B8537J76415b70252g3373j10188G4656C1530c32116
15407A30795n4903M7788a1411B34135a3223C25961a9096j35620e5791A78217Q8375
$$ plain form
15488 356832 -17218 -326679 65779 145391 327610 231913 -35049 43090 165205 -19826 -222237
15477 -222237 -82187 -70761 40084 356857 27136 -26229 -148536 -28197 -186401 -57169 -270844
15466 -270844 -46442 -117121 -179312 -89186 74078 -434210 -191096 -199657 -161525 -228280 -51668
15454 55232 196579 -394416 262313 135376 -99628 37946 -34937 39544 -102369 82666 99830
15443 99830 -146117 -93758 -14494 72549 286561 -117898 11763 72883 -154825 109648 -177803
15431 -115272 31017 -8394 89302 -180681 -11083 264844 -61757 600 246226 -209980 34328
15419 120218 13224 69405 -144034 28537 204952 -270252 -73373 -183561 74656 31530 -332116
15407 130795 75892 123680 -11411 234135 -13223 325961 -19096 -154716 -55791 178217 266592
15396B66592c4431D4316b93229M307B13959H9805b78970E6167P6440C8479b76700
15384A88175a67734G4948K22424m4572p7378A901f7105K9617A41112a1898A9321
15372A04311a4486j36671r3808A47283a7581m0195k10568Q5142f2519C7550k958
15361C4592g3815j5883K1318H6042N4558a70183A0024K71708A8218e354I3897
15349b25051c0973B77007B6105b5563B39326n2563a28424A08296b38748A83896
15338C22824a34465J2202a5843A41342d30A05130a59034g4749I6579a05680A4170
15326h9283j13341B15004g364q9087M6388B24242K5943b15663B05121n6469a23844
15314A95175J02424j47050b01993g9803j14303j88376A43384K85453b0757B51837
$$ plain form
15396 266592 -34431 44316 -293229 -288922 213959 89805 -278970 56167 132607 38479 -276700
15384 188175 -167734 74948 297372 252800 175422 1901 -67105 -37488 141112 -11898 19321
15372 104311 -14486 -151157 -244965 147283 -17581 -57776 -268344 -183202 -62519 37550 34592
15361 34592 -73815 -89698 -68380 86042 140600 -170183 10024 281732 18218 -5354 93897
15349 -225051 -30973 277007 26105 -25563 239326 186763 -128424 108296 -238748 183896
15338 322824 -134465 -122263 -15843 141342 -430 105130 -159034 -74749 96579 -105680 14170
15326 -89283 -202624 215004 -7364 -96451 -50063 224242 250185 -215663 205121 148652 -123844
15314 195175 297599 150549 -201993 -79803 -194106 -382482 143384 428837 -20757 251837
15303A93863e8298A18177f3468j28651e0620E439J9949J76661a45308H6592K24156
15292C10748j34791c06744B05370a03564k2397H1807R3670F0963R3210a9410B33078
15280B73831j03809d2265g960I2034k461J80667E2755L31644j14424K6710j0221
15269B86464A30319P9430E344L5523L45420j62406B1310b07149E0798b28686M8443
15258a80243j8025e9541A53188Q4605p0493j1284i6033C34342q441j22515L21957
15247E25343L91504N49981l6990l12082k1052C28996p4723I9631J17077q7931
15237A28777b13337A50967K22879H8293a35268A06074b1702m14677a9059B4950
15226e5102j25909A99161n9138a36555p4408b1466C82618A21404g2604B09169
$$ plain form
15303 193863 -58298 118177 -63468 -192119 -50620 5439 25388 202049 -145308 86592 310748
15292 310748 175957 -306744 205370 -103564 -125961 81807 175477 60963 154173 -19410 233078
15280 273831 170022 -42265 -7960 92034 89573 270240 52755 384399 269975 296685 286464
15269 286464 130319 209749 5344 40867 386287 223881 21310 -207149 50798 -228686 -180243
15258 -180243 -198268 -59541 153188 237793 167300 156016 -96033 334342 325901 203386 525343
15247 525343 916847 1466828 1429838 1117756 1096704 328996 254273 99631 216708 128777
15237 128777 -213337 150967 373846 88293 -135268 106074 -21702 -436379 -19059 24950
15226 -55102 -181011 199161 140023 -136555 -210963 -21466 382618 121404 -72604 209169
15215B97231F4316N99455j04903b66495A42127a3353A5732K9058a28481A26152
15204g1009F8140E235e7815j7519l7020A51773c4863I2699G204b75145C55615
15192A79305c9492p1964j08220j0730A82159j0036J17591L4707d5147D7578b0595
15180c07743C95797a81161a7004B14002C2635O0139J57121a12385A15443a8809
15169a4153A9749a1462I9306C4234K9868f7084C8762N3466J62476K4960R9519
15158C79183b62556a24298B70024C2004b41044h4975j1977j9441b209A56010k2355
15147A33655C8933a63783g7553B2140K93738D330K148J76975M418a07818A0222
15135B8980R5406e4291A2320i9010f376A22952M9445f7566C16031j31976r565
$$ plain form
15215 297231 64316 663771 558868 -266495 142127 -13353 15732 44790 -128481 126152
15204 -71009 68140 5235 -57815 -75334 -112354 151773 -34863 92699 7204 -275145 355615
15192 179305 -39492 -111456 -219676 -230406 182159 172123 289714 324421 -45147 47578 -20595
15180 -307743 395797 -181161 -17004 214002 32635 92774 249895 -112385 115443 -18809
15169 -14153 19749 -11462 99306 34234 64102 -67084 38762 92228 254704 279664 379183
15158 379183 -262556 -124298 270024 32004 -241044 -84975 -96952 -116393 -2209 156010 133655
15147 133655 38933 -163783 -77553 22140 315878 4330 6478 183453 187871 -107818 10222
15135 28980 124386 -54291 12320 -99010 -6376 122952 172397 -67566 316031 184055 174490
15124A74490J64077C7098J11609k8997J1076K41474L6879F4357J40161Q8679G5831
15112b85831G4604K03793p5532a9399F4995J23604a49853A77508R2259R9113E72
15100B07201L9595A20286a05749A48465i2214c2821j02449A40907l4144a57146
15089b0695H5126a9329E2121J0061K36553Q1326J05708d7166A18095A5077g8439
15077A66076J4464b8417b980n9195C27860l1714P9322A25761J37292A29129R8527
15066B27656J12934B2319J02472J56550D4482J84359G7952K13618l0272q98a52357
15054A05042F047M4503N3563M1742J09975k1125J87253B04747k0315J7851K5350
15043B27633n285L3551A16126K70985a48091O0400B70619K4715a87475A73946
$$ plain form
15124 174490 338567 37098 148707 119710 130786 372260 409139 64357 204518 293197 75831
15112 -285831 74604 278397 202865 -19399 64995 188599 -149853 177508 269767 368880 572
15100 207201 246796 120286 -105749 148465 -92214 -32821 -135270 140907 106763 -157146
15089 -20695 85126 -19329 52121 62182 298735 380061 485769 -47166 118095 15077 -78439
15077 166076 180540 -28417 -2980 -62175 327860 296146 375468 125761 263053 129129 227656
15066 227656 340590 22319 124791 281341 44482 228841 77952 291570 261298 260400 -152357
15054 105042 6047 50550 104113 145855 255830 234705 421958 204747 184432 202283 227633
15043 227633 222348 255899 116126 387111 -148091 -87691 270619 295334 -187475 173946
15032A38631D3027M66545B27169h4447G0337P3427D3819L11731Q886F9074M137
15021G3211J32587o2561b1991C08345A53723J26256p4949K14487D3761L62830
15011D06591j26108A38851L2158J7086P197I5370k2991L923L79354C1629B901
14999B94900G5435b3773i920B54981C4023L16514A30304J66718A27141M6291K91923
14988D65355A21415K51523o2990c4593C21597J13845a44236F58661B67394K568
14978B69962A09410O01470B14157k5603J64549j59560m6381a3082B5679M03544
14968D29223q8032j08694J03713K539j01132J06592A57396K09355j44301H8229
14957B23836J63716j57940h805B79441b24286a05903B06587r7815L53964F8237
$$ plain form
15032 138631 43027 509572 227169 -84447 70337 143764 43819 355550 364436 69074 73211
15021 73211 205798 143237 -21991 308345 153723 279979 205030 419517 43761 406591
15011 406591 280483 138851 171009 188095 195292 95370 72379 76302 455656 31629 2901
14999 294900 75435 -23773 -9920 254981 34023 350537 130304 297022 127141 173432 465355
14988 465355 121415 372938 309948 -34593 321597 435442 -144236 658661 267394 269962
14978 269962 109410 710880 214157 188554 353103 193543 147162 -13082 25679 429223
14968 429223 341191 232497 336210 338749 237617 344209 157396 366751 222450 88229
14957 223836 387552 229612 -8805 279441 -224286 -105903 206587 108772 462736 68237
14946B96188J40334j66318o8222J6894j9125l7575K7364p0859J20037j64L24228
14935E62782l6225B16125L55542h1620C26345j23816J29213j38094L52531A54053
14924B37294K50554q5058j99293J74295L6369O7096j26277D7857K27061J987L82574
14913F59479a74450D30093j16875p3844A18235N9593K9842A00177J4716J76726
14903B91619J2990l3717O281J09303M7084q1653J13319n062p9253L16548A31186
14891A94795O5991P6666j50383Q0769K53608l3039A68751j0806M01439A90544
14880C98081d0679B94256J73668j47403D8652K30325J4652F2209O56054B06642
14869H7848L89532r4410P6374j99277n5023J99320L73456C56771A59568K15540
$$ plain form
14946 296188 436522 270204 201982 218876 199751 162176 189540 118681 238718 238554 562782
14935 562782 526557 216125 571667 -81620 326345 202529 331742 193648 546179 154053
14924 237294 487848 402790 203497 377792 414161 481257 354980 47857 274918 276905 659479
14913 659479 -174450 430093 313218 239374 118235 177828 207670 100177 114893 291619
14903 291619 304609 270892 277173 386476 433560 351907 465226 460164 380911 697459 131186
14891 194795 260786 337452 187069 267838 521446 488407 168751 157945 559384 190544
14880 398081 -40679 294256 467924 320521 48652 278977 293629 62209 718263 206642
14869 87848 477380 382970 459344 260067 205044 404364 777820 356771 159568 375108
14859C75108j66187L47915k0950j81392L3798p7329A46362L96894A96619N5708
14849B52327A25096M48934j51581j0218J49314R2251k69468Q8142A02758K37382
14839C40140K60131j51128Q8165J69394k57643n1843K68122q9007j76495N7723
14829D57559j90400Q487j02701M53499o7567j35815J11527A87257J48405J38948
14819D74610r0931N7984j47529K63359B74637N77486B66738L06917k01530K95683
14809F67808J38246C65961q5631N50969C41395m308J33443J06800B35143J90461
14799D25604M3169M7757K38483j98942j49798Q4733K53179o6592j88719K13913
14789G02787k68417J45130J76095j40044o9598K6558R1374l16985L4926N2147
$$ plain form
14859 375108 208921 556836 535886 354494 388292 310963 146362 543256 196619 252327
14849 252327 125096 574030 422449 412231 561545 653796 384328 472470 102758 340140
14839 340140 600271 449143 537308 706702 449059 397216 665338 576331 399836 457559
14829 457559 267159 275646 172945 626444 558877 423062 534589 187257 335662 474610
14819 474610 383679 441663 294134 557493 274637 852123 266738 573655 372125 667808
14809 667808 806054 365961 280330 831299 341395 337087 470530 577330 235143 425604
14799 425604 468773 516530 755013 556071 406273 491006 744185 677593 488874 702787
14789 702787 434370 579500 755595 615551 545953 572511 663885 346900 381826 433973
14779D33973J49328q0613r7405J44712M446J51997J43487k01172j55985K94032
14769G86800k72276j00125Q3274j08245K15621j56719K84415o1143K87890l40031
14759F19461j21604K82696j97638K58455j28538K5812j28166K37012l30850M098
14749E20738N2179m3031K39977l30521M17550j5220j87986l1284J07602p8415
14739F51589R0275j09228n3830j49556L29075J2695O0677j292k8507M6997j252
14728H47643n6589J80653k99993O8909O29324m43594j47272J47387j03045o7976
14718G55447L23681l1954k85221J37634l31033K71138J70783k84154O2402J68435
14708I57158k24554M22268j80776J33012n24716J18275M1897J10562J01082k36009
$$ plain form
14779 433973 583301 502688 405283 549995 554441 706438 849925 648753 492768 786800
14769 786800 514524 414399 497673 389428 605049 448330 732745 671602 959492 619461
14759 619461 497857 780553 582915 841370 712832 738644 610478 847490 516640 520738
14749 520738 572917 529886 769863 439342 856892 841672 653686 622402 730004 651589
14739 651589 741864 632636 578806 429250 758325 771020 831697 830405 801898 848895 847643
14728 847643 791054 971707 671714 740623 1369947 926353 779081 926468 823423 755447
14718 755447 1079128 1047174 761953 899587 568554 839692 1010475 726321 788723 957158
14708 957158 732604 1154872 974096 1107108 582392 700667 742564 853126 954208 718199
14698G18199O5395j36104K29608O5575j44003J05530o8811M69780m91576O5395
14688H78988Q5737K1657j09317j22420L27997M596J54572m80776M55500p7642
14678A138892j47035J9181K12178l69920L19244k61241L8157L24069m4654r0834
14668A138037j19689k4175j24015K87547j14213o038k60436N64723k17765K34852
14658A358828j52999m43747O38274l04135J82731k66180l1220O7151L96542J54619
14648A599864m70486J31569j56291J61971k91657R3641J68659Q8585Q8503l03439
14638A110919N00019k04998j09612J91495r0802k19460K61385j04734J53859R4735
14628A582806j25381k55434K48519L09585n17916m9769K95415p4949m2562L86347
$$ plain form
14698 718199 783594 647490 877098 942673 798670 904200 835389 1305169 813593 878988
14688 878988 964725 986382 877065 754645 1082642 1087238 1241810 761034 1216534 1138892
14678 1138892 991857 1011038 1223216 853296 1172540 911299 949456 1273525 1228871 1138037
14668 1138037 1018348 994173 870158 1157705 1043492 1037454 777018 1341741 1123976 1358828
14658 1358828 1205829 762082 1400356 1096221 1278952 1012772 981552 1048703 1445245 1599864
14648 1599864 1129378 1260947 1104656 1266627 974970 1068611 1237270 1325855 1414358 1110919
14638 1110919 1610938 1405940 1296328 1487823 1397021 1177561 1438946 1334212 1488071 1582806
14628 1582806 1457425 1201991 1450510 1760095 1242179 1192410 1487825 1412876 1370314 1756661
14618A756661m13063M74462m14875J10289O5710L3337o2030m9649J69112K2737
14608A692691j31109j37851O25513o72870L06451M1234j13138q8632n0460J88144
14598A659973p5664J96409J25994r6439j23913J70364Q4129o8678K6717j98348
14588A700544J27399J15524J24311k9407j16763R3058j9178L4950K37429j72255
14578B095612J64106k04672K47257l20417J90817Q876l8162K80543O4504n0803
14568B437661K19891j90763l25213J81733L91408m91455M25774j04690K87561
14559B831907p8796K59979O8226K02856K10090j67248O43848K45893O75144J448241
14549F340140K549652M636356P566121J8359534O208207A9985937I950617m088368
$$ plain form
14618 1756661 1343598 1818060 1403185 1513474 1579184 1612521 1550491 1500842 1669954 1692691
14608 1692691 1561582 1423731 2049244 1376374 1682825 1724059 1610921 1522289 1471829 1659973
14598 1659973 1584309 1780718 1906712 1810273 1686360 1856724 1940853 1872175 1898892 1700544
14588 1700544 1827943 1943467 2067778 2038371 1921608 2014666 1995488 2030438 2267867 2095612
14578 2095612 2259718 2055046 2302303 1981886 2172703 2181579 2143417 2423960 2488464 2437661
14568 2437661 2657552 2466789 2141576 2323309 2714717 2223262 2649036 2544346 2831907
14559 2831907 2753111 3013090 3081316 3284172 3494262 3327014 3970862 4216755 4891899 6340140
14549 6340140 8889792 13526148 21092269 39451803 45660010 19985937 9950617 5862249
14541E862249j988405j020286n21770J6539k00373J42967l02369J89954l06024
14532A872482R2826J04865j42944K85151k00445L94854j4115k59604M03684p0666
14522B466088J40942j68561J34127o0107L96131m33186J65840k7206J76961j20400
14512B670629L18366j14879K2649J34378j62215j6311J84771q0722p8359J10473
14502B988780J4283m121J4271M90367l56759N71015k19710m44918N17438r3265
14492C477381k28612K88972q9728J57639J01729j28170j05985L39414j33213p0676
14482C608751L52823j29436L7245l28034M99768J62701l8469J62139k72922K88184
14472D342750l24234J29540N91616j31171n313J42364n1530k65607L89576j76207
$$ plain form
14541 5862249 3873844 2853558 2331788 2348327 2147954 2290921 1988552 2178506 1872482
14532 1872482 1965308 2070173 1927229 2212380 2011935 2406789 2392674 2133070 2536754 2466088
14522 2466088 2607030 2438469 2572596 2512489 2908620 2475434 2641274 2614068 2791029 2670629
14512 2670629 2988995 2874116 2896765 3031143 2868928 2852617 3037388 2956666 2878307 2988780
14502 2988780 3003063 2998942 3013213 3503580 3146821 3717836 3498126 3053208 3570646 3477381
14492 3477381 3248769 3537741 3448013 3605652 3707381 3579211 3473226 3812640 3679427 3608751
14482 3608751 3961574 3832138 3869383 3541349 4041117 4203818 4165349 4327488 4054566 4342750
14472 4342750 4018516 4148056 4739672 4608501 4603188 4745552 4694022 4428415 4817991 4641784
14462D641784J63675J12319N0131J0994q7972J23748O462K88083j32795o0846
14452E115583K52678R3361K49517k2548k27949Q4125J87605M18000m39731L33497
14442F044138R9079j23073R0429J68631M48798m20709M56665k79359J27765J42412
14432F754776O70607m91570L21301J30376j6149J27497M061K13859m11360N52341
14422G855739k45050N26137O9807l00451L83310M55477J81670l31867j9597L74457
14412H949632J20967K98597J50566l8785M46969k99432O79283k05942R8413J22308
14402A0322576K60369O1515L86622J98062J26771J07808K78171L54610j64409
14393A1932095J76610M24900J77453K18765l8846M08961K30018L0110O65458M4087
$$ plain form
14462 4641784 4805459 4917778 4967909 4978903 4890931 5014679 5021141 5309224 5176429 5115583
14452 5115583 5368261 5461622 5711139 5688591 5460642 5544767 5732372 6150372 5710641 6044138
14442 6044138 6143217 6020144 6110573 6279204 6728002 6307293 6763958 6484599 6612364 6754776
14432 6754776 7425383 6933813 7255114 7385490 7369341 7496838 7500899 7714758 7303398 7855739
14422 7855739 7610689 8136826 8206633 7906182 8289492 8744969 8926639 8594772 8575175 8949632
14412 8949632 9070599 9369196 9519762 9480977 9927946 9628514 10307797 10101855 10200268 10322576
14402 10322576 10582945 10644460 11031082 11229144 11355915 11463723 11741894 12096504 11932095
14393 11932095 12108705 12533605 12711058 12929823 12890977 13299938 13529956 13560066 14225524 14269611
14383A4269611M94655J1833K87562o8797M06133O97506J61091L61704j15240N41617
14373A7047675M39905K58676K70428O37773K75718r4790R46416J88898N29746
14364B0500445M68196N07569K19050O79434N16595J09962Q87157K11143M88786
14355B4588337Q76428M37210Q14510N24014P27753P09451O58902N95652R88352
14346C0920609P55484N38168Q57795J010350R33066R09665J137489R62529J030939
14337C9056094J027348J189142Q26585J310229J406881J439558J516434J518016
14329D9290287J330665J545193J705450J622943J975964J617939K038128K532978
14321F3659547J994094K174920L008219K335444K353384K687514L357571L005249
$$ plain form
14383 14269611 14764266 14776099 15063661 14994864 15400997 16098503 16259594 16621298 16506058 17047675
14373 17047675 17487580 17746256 18016684 18654457 18930175 18835385 19781801 19970699 20500445
14364 20500445 20968641 21476210 21695260 22374694 22891289 23001251 23888408 24099551 24588337
14355 24588337 25464765 25901975 26716485 27240499 27968252 28677703 29336605 29932257 30920609
14346 30920609 31676093 32214261 33072056 34082406 35015472 35925137 37062626 38025155 39056094
14337 39056094 40083442 41272584 42099169 43409398 44816279 46255837 47772271 49290287
14329 49290287 50620952 52166145 53871595 55494538 57470502 59088441 61126569 63659547
14321 63659547 65653641 67828561 70836780 73172224 75525608 78213122 81570693 84575942
14313H4575942L039308L563402L917188L517722M443474M102882M733068M839722
14305A16732708N077270N316151N996272O079789O392226O864786P146819P464012
14297A67070033Q194385Q898069Q774595R496205R455174J0735853J1036864J1123888
14289B44785066J2199382J2501539J3002040J3613879J4047785J4009232J4665515
14282C38824438J4709085J4562658J4775358J4174335J3573179J2968492J1982389
14275D35569934J0319425O622614J943512M60601J894879L117386K97088k532259
14267D57693180l859257m759728q680697j0253088j0847107j2397570j3956319
14260C92939414j3720090j5185641j4976340j5537974j5203441j5000935j4748537
$$ plain form
14313 84575942 87615250 91178652 95095840 98613562 103057036 107159918 111892986 116732708
14305 116732708 121809978 127126129 133122401 139202190 145594416 152459202 159606021 167070033
14297 167070033 175264418 184162487 192937082 202433287 211888461 222624314 233661178 244785066
14289 244785066 256984448 269485987 282488027 296101906 310149691 324158923 338824438
14282 338824438 353533523 368096181 382871539 397045874 410619053 423587545 435569934
14275 435569934 445889359 452511973 454455485 454916086 456810965 459928351 460225439 457693180
14267 457693180 453833923 449074195 440393498 430140410 419293303 406895733 392939414
14260 392939414 379219324 364033683 349057343 333519369 318315928 303314993 288566456
14253B88566456j2944073j3271836j2907004j1703622j1823875j1341434j0272775
14246B04301837r895171r037988q677889q350096p650943p427099o974453o403795
14238A39884403o018321n722155n459629n150328n493522m490825m387603l290254
14230I9871766m287988l643732l923480l139601k901022l452125k601509k764213
14222G3158096k629621k289850k655520j972849k288431j990277j864664j589352
14214E5877532j827605j106603k051444j715809j693358j027765j311810p50454
14206D4392684j412041j345517j102378j489741j081323n01034r28245j158422
14198C5373983j179212q77661o41710j015799j22182j059705o35625j062258n12821
$$ plain form
14253 288566456 275622383 262350547 249443543 237739921 225916046 214574612 204301837
14246 204301837 194406666 185368678 176690789 168340693 160689750 153262651 146288198 139884403
14238 139884403 133866082 128143927 122684298 117533970 112040448 107549623 103162020 99871766
14230 99871766 95583778 91940046 88016566 84876965 81975943 78523818 75922309 73158096
14222 73158096 70528475 68238625 65583105 63610256 61321825 59331548 57466884 55877532
14214 55877532 54049927 52943324 50891880 49176071 47482713 46454948 45143138 44392684
14206 44392684 42980643 41635126 40532748 39043007 37961684 37460650 36532405 35373983
14198 35373983 34194771 33317110 32675400 31659601 31537419 30477714 29842089 28779831 28267010
14189B8267010q92334q11118o09747l31659n41038l54478n60924q46392l29482
14180B2989838k67154n06992k14330o66181r80672j17517k99290m75009k30142
14171A9232551o92419k95631j40885l45519m52471j83270m39684k52859n09851
14162A5919962r707m12084k03781j66945n67679J27220m57441j51371l21279l82526
14152A3374369j72283k79201p3378j54592j84849J4639l22270l85077j80979P896
14142A1644275k63910l62934L16118n22126J00195l53026k20049J44566o6340
14133A0416769m79761J06352n01213j87753K06364l46602k16140j7855P0021q4957
14123H965225l98300K2256j91712o7238k94394j1670r3762J53910m21901J48399
$$ plain form
14189 28267010 27374676 26563558 25953811 25622152 25081114 24726636 24165712 23319320 22989838
14180 22989838 22722684 22215692 22001362 21335181 20354509 20236992 19937702 19462693 19232551
14171 19232551 18540132 18244501 18103616 17758097 17305626 17122356 16682672 16429813 15919962
14162 15919962 15910255 15498171 15294390 15127445 14559766 14686986 14229545 14078174 13756895 13374369
14152 13374369 13202086 12922885 12849507 12694915 12510066 12524705 12202435 11817358 11636379 11644275
14142 11644275 11380365 11017431 11333549 10811423 10911618 10558592 10338543 10483109 10416769
14133 10416769 9937008 10043360 9542147 9354394 9560758 9214156 8998016 8980161 9050182 8965225
14123 8965225 8566925 8589181 8397469 8330231 8035837 8024167 7930405 8084315 7662414 7810813
14113G810813j17245k88409L33928m02311k03035L5298n4781J51658k91485l22647
14103F651784K50563k83258J72411p482l38257j73526J90653m09475K48474k10230
14093F091657k54028p9200K85518l46793J21698k43392j24691K07203k30484p3604
14083E353884J25793J74614j63911j77813j51144j23167J29101N5648l87703j99428
14073D635874j09037K96088L5371k99471J78788J8474K483l92319J1023K4926
14063D402200k43889m9916L96231L5244k74474L20249j65309j62686K76047o16816
14053C916881n8710k39117J69273L27023j49483k52700j0094k63626o51K41324
14043C680120J05841J23794m72192j79991L03819r2781Q0162k29044N7691j18987
$$ plain form
14113 7810813 7693568 7405159 7739087 7336776 7133741 7169039 7114258 7265916 6974431 6651784
14103 6651784 6902347 6619089 6791500 6784018 6445761 6272235 6462888 6053413 6301887 6091657
14093 6091657 5837629 5758429 6043947 5697154 5818852 5575460 5450769 5657972 5427488 5353884
14083 5353884 5479677 5654291 5490380 5312567 5161423 5038256 5167357 5223005 4835302 4635874
14073 4635874 4526837 4822925 4858296 4558825 4737613 4756087 4758570 4366251 4377274 4402200
14063 4402200 4158311 4108395 4504626 4539870 4265396 4585645 4420336 4257650 4533697 3916881
14053 3916881 3858171 3619054 3788327 4115350 3965867 3713167 3703073 3439447 3438796 3680120
14043 3680120 3785961 3909755 3437563 3257572 3561391 3468610 3548772 3319728 3377419 3258432
14033C258432Q9083k8635K48778k96316j76638J36543R947J22449l38191o4176
14023B961276K75258n97117K23214N4279k10378L93801n73820N8794K05027L5584
14013B825918j91560l84920N06242m9183n5332j022K25635o30791M02892n09032
14003B138847M01738k71766J56027l19697M85163j58644l37144j21705J50443
13994B123262R9100k44598K41144J61611O43900J894388L257104O259545J6585602
13985C1021058J8485153k3002022j3001330n487877k007910j294448l52365n87544
13977C772715k48782n22097K32014k39174L31288n33317k04394K14835K12794
13968C015882n13248j2507K35439j99200o5409k23853K82742p4482Q1884m03362
$$ plain form
14033 3258432 3347515 3318880 3567658 3271342 3094704 3231247 3241194 3363643 3025452 2961276
14023 2961276 3236534 2639417 2862631 2916910 2706532 3100333 2526513 2585307 2790334 2825918
14013 2825918 2634358 2249438 2755680 2706497 2651165 2650143 2875778 2244987 2647879 2138847
14003 2138847 2540585 2268819 2424846 2105149 2590312 2431668 2094524 1972819 2123262
13994 2123262 2222362 1977764 2218908 2380519 3024419 4918807 8175911 14435456 31021058
13985 31021058 49506211 26504189 13502859 8014982 6007072 4712624 4360259 3772715
13977 3772715 3523933 3001836 3233850 2994676 3325964 2792647 2588253 2803088 3015882
13968 3015882 2502634 2490127 2725566 2526366 2460957 2237104 2519846 2445364 2527248 2123886
13958B123886P1204K86785k07203N305k1801j32259L3034K96217k87881l45145
13948A822142L74209l87526K56393r5981K03602k80208k2126R0794r8905J6844
13938A879238K12724k44141K94302m14341J66228k65691J36141K37714k2742K74291
13928B253723l96905k0616k72340l38159K4137M79137k06917J14059o0078j06077
13918A469964q0169L71867j59472k20376L84406l55241L8962J89913l01583J90734
13908A529005N9496L5670j24329O5276k31497K26744l27322J90233j72932J2900
13898A263244K74122n6941l591R8092J12368j42113J30488o0035k00250k8041
13888A387343k50161J93213q1698Q1920k31364Q2826m8808R0187K13717j10464
$$ plain form
13958 2123886 2195090 2481875 2274672 2279977 2258176 2125917 2158951 2455168 2167287 1822142
13948 1822142 2196351 1808825 2065218 1969237 2172839 1892631 1870505 1961299 1862394 1879238
13938 1879238 2091962 1847821 2142123 1727782 1894010 1628319 1764460 2002174 1979432 2253723
13928 2253723 1856818 1836202 1563862 1225703 1249840 1728977 1522060 1636119 1576041 1469964
13918 1469964 1389795 1761662 1602190 1381814 1766220 1410979 1449941 1639854 1338271 1529005
13908 1529005 1588501 1624171 1499842 1565118 1333621 1560365 1233043 1423276 1250344 1263244
13898 1263244 1537366 1480425 1476834 1574926 1687294 1545181 1675669 1615634 1415384 1387343
13888 1387343 1137182 1330395 1248697 1330617 1099253 1182079 1133271 1223458 1437175 1326711
13878A326711J20995J98477k28046K08888k70515k68043N83523k44507k63453
13869A164030o5105j46408j1380J06810m57818L25673K06110O5254K98711m18611
13859A067266k8919K3620M71737l74284k69862K48558j50503J22371J44031J76685
13849A430700l63120R409m908m737K3810K11845j97970N4446k37691q1196M20635
13838A261223k15827J09266k3754j81305k9401J88998j72349J79346P9012q5182
13828A110027p3335j6926j60363q1856q6003L69900K1455k60344j9055J02108
13818I05608r7835K38893J49991k06170j12206R4856L8955J26508k2827m65643
13808F50130J67979K14650r4747L95915k89780m26324Q8181J72367K01539l75895
$$ plain form
13878 1326711 1447706 1646183 1418137 1627025 1356510 1088467 1671990 1427483 1164030
13869 1164030 1098925 952517 941137 1047947 590129 915802 1121912 1187166 1485877 1067266
13859 1067266 1038347 1061967 1533704 1159420 889558 1138116 987613 1109984 1254015 1430700
13849 1430700 1067580 1076989 1072081 1067344 1091154 1302999 1105029 1159475 921784 840588 1261223
13838 1261223 1045396 1154662 1130908 949603 920202 1109200 936851 1116197 1195209 1110027
13828 1110027 1036692 1019766 859403 777547 691544 1061444 1082899 822555 803500 905608
13818 905608 807773 1046666 1196657 990487 878281 973137 1012092 1138600 1115773 650130
13808 650130 818109 1032759 938012 1333927 1044147 617823 706004 878371 1079910 704015
13798G04015Q262J65099P3497k88815K49106J80744N3306k74826o5139J88552
13788I93801J80193j19525m13555L13414l93462Q8962M44585D40717J54412n6042
13778E39087J43697O2981L7983J40205J8688j51781l51738K50772L7264R0376
13768H17534k28495L27294k18680m5073K8360K69386C72258N52734j77859j46156
13758F00977J77316N4262o284k30639L22344j92695j49928K3143q3394J07017
13748F22119j1684j64440J32324K19528L3528n1986L35257k44283D11437K08542
13738F19979l1555Q7452k2803J44744C20754K85753R2907j26629K02449k04475
13728E70759m7892m3667k14558O57718m01669K13108n5055k87920J79741K39189
$$ plain form
13798 704015 712277 877376 950873 662058 911164 1091908 1145214 870388 805249 993801
13788 993801 1173994 1054469 640914 954328 560866 649828 1094413 440717 595129 539087
13778 539087 682784 745765 783748 923953 942641 790860 439122 689894 727158 817534
13768 817534 589039 916333 697653 652580 680940 950326 372258 924992 747133 600977
13758 600977 778293 832555 826271 595632 917976 725281 575353 598496 515102 622119
13748 622119 610435 445995 578319 797847 831375 779389 1114646 870363 411437 619979
13738 619979 588424 675876 653073 797817 320754 606507 699414 572785 775234 570759
13728 570759 522867 479200 264642 922360 520691 733799 678744 390824 570565 809754
13718H09754j57178L96815C87241N95524l42003L36861B87069P7844L98009j12908
13708F50014j34687j56991L87009k30486j01059M1062R9007n3362m7536K62566
13698G15537J71278m30923q432K61869j36988J09106j46556L07563k92974r522
13688E39958n3123j16171M4851M5134m2204Q5224A45816L47102j0577j02704Q9309
13677D68946k5440J02355K54324C51385J04660K57317r1895O5771r023k98560
13667C79655m2796r753J53946N9352J10627B72294K66031k59538J49416j75194
13657B53009K51052k5037L3109A38202N22626m9853j8657k81474M16617M8521
13647G75982C73052m4706K03652O0845B07177o2269N38690k25461Q4608m2904
$$ plain form
13718 809754 652576 1049391 387241 982765 640762 977623 287069 364913 762922 650014
13708 650014 515327 358336 745345 514859 413800 454862 553869 500507 452971 715537
13698 715537 886815 455892 447460 709329 572341 681447 534891 842454 549480 539958
13688 539958 486835 370664 415515 460649 418445 503669 145816 492918 482341 379637 468946
13677 468946 443506 545861 800185 351385 456045 713362 621467 687238 678215 379655
13667 379655 336859 327106 481052 540404 651031 272294 538325 278787 428203 253009
13657 253009 504061 479024 512133 138202 660828 610975 592318 310844 727461 775982
13647 775982 373052 328346 531998 592843 207177 144908 683598 458137 542745 499841
13637D99841r7625K9066J91930K2005k18697O9864M9963j25832o6233J39094J20592
13626F13968B99734R1661q7954K3454J49744K30282L313o139l26863o5912P9449
13615C90769R7622j40982K24985n9095j39374n973o2509K86883E2304L62921L31617
13604G46842L2644k49206J90044l02472j68388J10847K46479k83494L79597j79465
13594E23428j90099k2695K1300R6488r9334A13623L59354k21801P7998L44135
13584F73309k37689M1026K9342A71335a1374D36849D7693L51400J09379k04852
13574C03620N3178J66426j15778L3221K2111O2915R8867G2483L92124L7952j53627
13563C48932n3073J14997A58381r558Q8361J17725j70985J06620J02555q8492
$$ plain form
13637 499841 402216 431282 623212 645217 426520 496384 546347 420515 354282 493376 613968
13626 613968 299734 391395 303441 326895 476639 706921 710234 704095 377232 311320 390769
13615 390769 488391 347409 572394 513299 373925 367952 305443 592326 52304 415225 746842
13604 746842 779486 530280 720324 417852 249464 360311 606790 323296 702893 523428
13594 523428 333329 310634 331934 428422 329088 113623 472977 251176 329174 673309
13584 673309 435620 476646 505988 171335 -11374 436849 47693 399093 508472 303620
13574 303620 356798 523224 407446 440667 462778 525693 624560 72483 464607 502559 348932
13563 348932 295859 410856 158381 148823 237184 354909 183924 290544 393099 304607
13553C04607l0068J00421K47509k95213J76752j24443L7495Q8994k5527B04903
13542E0525J57017j4779K42374j15715d6782D8028j8464K52674I8237K97809l3113
13531C62933J36493n7761D9191M29778o4474A71527k8782K36889p7647i1190C46420
13519E11179j3883H8843K93472m0761N6997j05737L742O2288o7596J39907N2205
13508D83360j83058l5160k4603K52158q2996K0196B02887K12064J30378j25423
13498D19906j83435b3732C98687j18677l2852J02659l9871j15123p4267M60882
13488E81438k44436r7936J81960p5141A31854j3569J70011j22371O1679K39289
13478D66893q3524A49493K03964F9000M13254K6787A14010K58050J34563J31398
$$ plain form
13553 304607 274539 374960 622469 327256 504008 379565 417060 506054 480527 204903
13542 50525 207542 192763 435137 319422 -46782 48028 29564 282238 98237 396046 362933
13531 362933 499426 441665 49191 478969 414495 171527 142745 379634 301987 -91190 346420
13519 511179 497296 88843 382315 341554 398551 292814 296556 358844 291248 431155 483360
13508 483360 300302 265142 240539 492697 409701 429897 202887 414951 545329 419906
13498 419906 236471 -23732 398687 280010 247158 349817 309946 194823 120556 581438
13488 581438 337002 239066 421026 345885 131854 118285 288296 165925 227604 466893
13478 466893 383369 149493 353457 69000 482254 509041 114010 372060 506623 638021
13468F38021o1030p9138k01255K4389P7734A37850Q2135K72470j47383j5046r583
13457C20443j25253R8095J32489k8633p3914j1432A47899Q7428J3988L39227k26342
13446C62200J94451j99646A42543Q1764j04140l9908O6091J84315G1284K9359
13436A00643J07784C4681K41805b0947H1488J89153r9661p7149L31283o1666j61337
13425B02111R8555j07758r702K9542b03006A59396o08a43482C82203j70609F7497
13413C85006F120f7274B31223a60086E0822L64147j57878G1665K37370C9349L39229
13402C78578a3075G4391K45065J31828j84268M1838n7143m8149b8708B70185A9101
13390a16422A6015K11866L1305B7028P1774K17307C7749K02960A6707O7370K51266
$$ plain form
13468 638021 576991 497853 296598 320987 398721 137850 219985 492455 345072 330026 320443
13457 320443 195190 293285 425774 397141 323227 311795 147899 235327 249315 588542 362200
13446 362200 556651 357005 142543 224307 120167 80259 146350 330665 71284 100643
13436 100643 208427 34681 276486 -20947 81488 270641 170980 93831 425114 363448 202111
13425 202111 300666 192908 183206 212748 -203006 159396 158788 -143482 382203 211594 67497
13413 385006 6120 -67274 231223 -160086 50822 414969 257091 71665 309035 39349 378578
13402 378578 -13075 74391 319456 451284 267016 308854 251711 203562 -28708 270185 19101
13390 -116422 16015 227881 259186 27028 98802 316109 37749 240709 16707 84077 335343
13379C35343o6212K65865B56265K1790J77524j33447J5371r6548c2229A18231
13368C80968A29298K7032a7108C27014k8674A39109L45335A69258J6113K23612
13358D08983e6833n3351B14880n8251Q3741A19295K17513j65721L84504J3158
13348E68749c3670n0350C16489J3686J02350j08223K69356A48410L76272B27927
13337B45923n9473r2918K06537A49803J27747r1082q3677O2564L76323m6498C9629
13325I0027J66400a72124B43960A2761g3856B77960H1139J210D965K29556K26620
13314D61141l4241j79504O3634j44466G8331K23588D7423M39275B16853K49532
13304D66385f1200A16853D489Q9914J80984a4112C28139A57844L05431a40052
$$ plain form
13379 335343 269131 534996 256265 278055 455579 322132 337503 240955 -32229 118231
13368 380968 129298 156330 -17108 327014 298340 139109 484444 169258 185371 408983
13358 408983 -56833 -110184 214880 156629 240370 119295 336808 171087 555591 568749
13348 568749 -33670 -84020 316489 330175 432525 324302 593658 148410 524682 227927
13337 245923 186450 93532 300069 149803 277550 186468 102791 165355 541678 495180 39629
13325 90027 256427 -172124 243960 12761 -73856 277960 81139 82349 4965 234521 461141
13314 461141 426900 247396 311030 166564 78331 301919 47423 486698 216853 466385
13304 466385 -61200 116853 4489 94403 275387 -14112 328139 157844 463275 -140052
13293C08141P7753H4322e2310A75912q3502j9622J92696D6966i4760m6593D36371
13281B41461F9967K3439a4554A57425n3068j8130K09930m8931K65601A890N2975
13270E4865J99067j21647n0334f6448E26849k13415E6375L3802H368K37193B7939
13258B46032b46156B63145r4661C7112Q1199J90628l1497a093j20931m4423B56826
13246C12281f7186B28719A00968K89466A78410G5697A8221J98638a19555A90094
13235A7406J39117K10162q9111k0621J08476a62419A63988j5551J72709a48129
13224C60232i0088j75232E8162Q4501J01272B6005J02061h889B41201A20042b0842
13212H8778J15302I2821N7483n0329K53683A47254K26480A05801i1016B71800
$$ plain form
13293 308141 385894 84322 -52310 175912 92410 72788 265484 46966 -94760 -141353 436371
13281 241461 69967 93406 -14554 157425 104357 86227 296157 247226 512827 1890 54865
13270 54865 253932 132285 81951 -66448 526849 313434 56375 90177 8368 245561 27939
13258 246032 -246156 263145 168484 37112 118311 308939 277442 -1093 -122024 -166447 256826
13246 312281 -67186 228719 100968 390434 178410 75697 18221 216859 -119555 190094
13235 17406 156523 366685 277574 256953 365429 -162419 163988 148437 321146 -148129
13224 360232 -90088 -265320 58162 142663 243935 26005 128066 -8889 241201 120042 -20842
13212 88778 204080 92821 150304 99975 353658 147254 373734 105801 -91016 271800
13201H3195A1518R073c0900j42100B87847O5206F5522h5545D16388k2914A77148
13189A75267h237E7192J02080c91613a10024m5598n2007D17104A80058E226J14621
13178A19847K4274L1300q3024K55543G1812J08513Q791C4385L75424r918j76998
13167B22893c6302B75299g1400F3326A7379L7720L42073j96234m6717J1917a39946
13155C16670F6021J70130R3306c39397B25792H1230K23549r2165J30690M4360
13145C87664d380j1915A14408a0851A4707b1498D9385c1577j87384a9134B20343
13133A29023h2986j7961A49586J25356c048A73943k5861O0780m9224p4346a32285
13121B83304j5433J11408a97410B15765M5586B0688L5717J88866q7900p3026Q5357
$$ plain form
13201 83195 11518 20591 -30900 -173000 287847 353053 65522 -85545 416388 393474 177148
13189 175267 -8237 57192 159272 -391613 -110024 -155622 -207629 417104 180058 5226 119847
13178 119847 144121 175421 92397 347940 71812 180325 189116 34385 409809 399891 222893
13167 222893 -36302 275299 -71400 63326 17379 55099 397172 200938 154221 166138 -139946
13155 316670 66021 236151 329457 -339397 225792 81230 304779 212614 343304 387664
13145 387664 -4380 -16295 114408 -10851 14707 -21498 49385 -31577 -218961 -19134 220343
13133 129023 -82986 -100947 149586 274942 -3048 173943 148082 208862 159638 85292 -132285
13121 283304 267871 379279 -197410 215765 261351 20688 56405 245271 157371 84345 169702
13110A69702n8513J00788o7235a1016A51309B1853J39859J12000b9382B21959
13099A65670A5803b391o6253J6372j85904B61515m5837c0123q8124A80842Q4255
13088B65097a313B04778m4356l9493K968A5396J58186J5455M6949B8820K7044
13077E5864K22841b7494B48374f2493D27092o1456j15605G6044J81060A9577M0365
13066E9942K94858J04731j94118c37762A50575J8529J37235O3372j30430r9233
13056A40048o441b4388A96188p0834M7221J80906C1820K25961j13066J53562h5030
13044A18756C2203a86068f1799n4875L6689B62327b21809C55479J2869A62769
13033b8469A59862J18910c9147A01843J52596N1629A34368b2881D00201A9554
$$ plain form
13110 169702 111189 211977 144742 -11016 151309 21853 161712 273712 -29382 221959
13099 165670 15803 -2391 -68644 -52272 -238176 261515 215678 -30123 -118247 180842 265097
13088 265097 -1313 204778 160422 120929 123897 15396 173582 189037 235986 28820 55864
13077 55864 278705 -27494 248374 -62493 427092 365636 250031 76044 257104 19577 59942
13066 59942 354800 459531 265413 -337762 150575 169104 306339 369711 239281 140048
13056 140048 133607 -24388 196188 125354 172575 353481 31820 257781 144715 298277 -85030
13044 118756 32203 -186068 -61799 -116674 -79985 262327 -221809 355479 368348 162769
13033 -28469 159862 278772 -39147 101843 254439 306068 134368 -22881 400201 19554
13022G1072a0464F1805K75987l4570b59709B15118P1319k5333G8629O6229e4989
13010a60015oB11070h5749D0541L02853A59300l7326J21710O4921B9947N3706
12999H3653a0831A61153e9981B56887n4296a85491q9597a15601A55518a20428
12988B38022f4997B16215R9442A17612c9955C04169A32716J4103K9511J4147f0231
12976A66435p664M881m6766j2956a0047B17710r7495a91379A39274e1710c198
12964d55485B0506K96357g9066A31593P8752p3934c0629B66157H7089k1329b66912
12952F7281Q6322b68076J01319G9037h8644j09408G7939K07040A35739a29577
12941E025J00992B027g8128H2693K8220a94689B39345a63758I7057a13614H0188
$$ plain form
13022 71072 -10464 61805 337792 303222 -259709 215118 286437 261104 78629 144858 -54989
13010 -160015 -160021 211070 -85749 40541 343394 159300 121974 243684 308605 29947 83653
12999 83653 -10831 161153 -59981 256887 202591 -185491 -275088 -115601 155518 -120428
12988 238022 -64997 216215 315657 117612 -39955 304169 132716 146819 176330 190477 -60231
12976 166435 158771 163652 116886 103930 -10047 217710 120215 -191379 139274 -51710 -3198
12964 -455485 20506 316863 -79066 131593 210345 136411 -30629 266157 87089 65760 -266912
12952 67281 153603 -268076 -166757 79037 -88644 -198052 77939 284979 135739 -129577
12941 5025 106017 2027 -78128 82693 110913 -194689 239345 -163758 97057 -113614 80188
12929B50204n3585J17943j19348l6722o1670J8791K83558A7085d4748B15153m1155
12918A73998H658b87719D3477c57494a23615D5436g616H6784J86842F9123b69338
12906B60088j1724A5063a93377A72844K3602d10115c2939E016J22877c00878d1748
12894C8362K434K15304b78481A59109g0083j6292j11261B13405F645M89a62257
12882b19212B4332J9793K97915E197J77109e5984c112j4613C14889Q85D910K85365
12870B90275o0862A2071P5524K44142l551f956n1437C41435h2242m9317k5546
12859a57105o1920e1782j30360G4282b99166B34489Q2740a03869q7299g3220C3869
12847a03638k8963C05136R125b88417f1302F217J16988J27119A0021Q5195A2507
$$ plain form
12929 250204 196619 314562 195214 158492 96822 115613 399171 17085 -44748 215153 173998
12918 173998 8658 -287719 43477 -357494 -123615 45436 -7616 86784 273626 69123 -269338
12906 260088 248364 15063 -193377 172844 196446 -410115 -32939 5016 127893 -300878 -41748
12894 38362 40796 256100 -278481 159109 -70083 -86375 -197636 213405 6645 7134 -162257
12882 -219212 24332 44125 342040 5197 182306 -55984 -3112 -17725 314889 315774 4910 290275
12870 290275 229413 12071 87595 331737 328186 -6956 -58393 341435 -82242 -131559 -157105
12859 -157105 -219025 -51782 -182142 74282 -299166 234489 317229 -103869 -191168 -73220 33869
12847 -103638 -132601 305136 314261 -288417 -61302 6217 123205 250324 10021 95216 12507
12835A88177C0812i5149o3594c460A52034l3059n7304e4176j5608A15102b89411
12823B08478G8021e3464C69714a37642G5102A9117M8462J1479J99665J9676e9878
12811e1188l29198C17658q9573o5038G169K98152A07342l5511J25141d1301F7938
12799a60010g4706F1461K54208A09478A0382g7220b6692B63649E1580b16000N5161
12788a60839g7379G3469m175b32226a3067p8202n8617a2293r5415k54844a74737
12776A06835k382b9104B57735k4673b3003C05340a66318A05592J06243a37288
12765I4691a13637B9955g8900B81515A40280E0422P9848c2014A5152a85479k5101
12754b10580C36862d4210q9282B15483r6432J2708J43540a45591B55410j00499
$$ plain form
12835 188177 30812 -95149 -158743 -3460 152034 118975 61671 -54176 -69784 115102 -289411
12823 208478 78021 -53464 369714 -137642 75102 19117 67579 79058 278723 298399 -59878
12811 -51188 -380386 317658 228085 163047 7169 305321 107342 71831 196972 -41301 67938
12799 -160010 -74706 61461 315669 109478 10382 -77220 -26692 263649 51580 -216000 -160839
12788 -160839 -77379 73469 69294 -232226 -13067 -91269 -149886 -12293 -107708 -362552 -174737
12776 106835 104453 -29104 257735 233062 -23003 305340 -166318 105592 211835 -137288
12765 94691 -113637 29955 -78900 281515 140280 50422 130270 -32014 15152 -185479 -210580
12754 -210580 336862 -44210 -133492 215483 119051 131759 275299 -145591 255410 154911
12744A54911B6940a88784A71441e63965a12503F5167e3439B8093J61942K22840
12734D12875A21553C5779J56166a17255A15439Q5926a70750M3758D3649J20746
12724A64395a17610D9949K17610K704K0848b79644a33165A4475L3947J42219b10386
12712A7906O8033J62368n0996G4821K03138a2260B326R1398L37564A18094D6083
12700C8271J39693K6116B9305J386K7641k5963c4373l30898b5456D1935N8359
12689A00294a21233M7296f114A12248l586L64476D6358b0590n1443A24644N25945
12678F50589k02766C0143O597J52346l0041m1480k7102a5523D31348A41878D7274
12666a34979H4970Q8613b96710B27693m490E2236J5447J71552h5802A76228K8791
$$ plain form
12744 154911 26940 -188784 171441 -563965 -112503 65167 -53439 28093 190035 412875
12734 412875 121553 35779 191945 -117255 115439 201365 -170750 -126992 43649 164395
12724 164395 -117610 49949 267559 270263 291111 -279644 -133165 14475 48422 190641 -210386
12712 17906 85939 248307 197311 74821 277959 -12260 2326 93724 431288 118094 46083
12700 38271 177964 204080 29305 30691 58332 32369 -34373 -365271 -25456 41935 100294
12689 100294 -121233 -73937 -6114 112248 108662 473138 46358 -20590 -72033 124644 650589
12678 650589 447823 30143 36740 189086 159045 117565 90463 -15523 431348 141878 47274
12666 -134979 84970 173583 -296710 227693 223203 52236 67683 239235 -85802 176228 205019
12655B05019K931j0967H9597J26932B0615J26470a08371B80724I5503n098a00306
12643F7135b7876B29548b2914k90161J29178C07708C2972R2468H620M43298b07080
12631D22363h3693C87499A1288a5681A06802b27736A20762a38287B58453q9226
12621A69227b5767j68952B0717d1469B78110j20342A5419K06660a18984B16831
12610B33707F4454K16828D9454J36767a38576J7660B09934a63182C94763A17521
12599C60025A26915n5976k2623a59762H2699D1080g3667L527j40217B01603J36260
12588C37863a28572A45278K11928J44354a54863f1096A9089L4689R1876C2571
12577b9922G7282b02878a1277j75425D6769c4905A57326J79431h7804A4468J9859
$$ plain form
12655 205019 207950 196983 89597 216529 20615 147085 -108371 280724 95503 90405 -100306
12643 67135 -27876 229548 -22914 -313075 -183897 307708 32972 125440 8620 451918 -207080
12631 422363 -83693 387499 11288 -15681 106802 -227736 120762 -138287 258453 169227
12621 169227 -25767 -194719 20717 -41469 278110 157768 15419 222079 -118984 216831
12610 233707 64454 281282 49454 186221 -138576 -120916 209934 -163182 394763 117521
12599 360025 126915 70939 48316 -159762 82699 41080 -73667 -70140 -210357 201603 337863
12588 337863 -128572 145278 357206 501560 -154863 -61096 19089 53778 145654 32571
12577 -29922 77282 -202878 -11277 -186702 46769 -34905 157326 336757 -87804 14468 34327
12566C4327K05971e5961I8238A5607a6490C22097H6755K25645a33160J5134C23485
12554I1264c02205A17804B4036i8324B0453F498N9986M7628j9556g8986G8689
12542c96958i5103A90969J14520A185b9980A75304b194B55498d66360e6150A48054
12530C3368A3195J25463a3864C68115A66523R5885c064A5922g9387D3698a79167
12518a84014j49071J24326R2858n5428A10539a65439D03971B6956J72964O7579
12508B67499a3708A73974i4057A70432n2022K2774K7185J41873g5962A29226K5301
12497A54527b41420C7746j1060L69729C9869Q5483k7096K3087E0450K86896c15923
12485a22930N1252j515k70043B08867h3985C2987a06681d6186D4628A8127R4755
$$ plain form
12566 34327 240298 -55961 98238 15607 -16490 322097 86755 312400 -133160 -118026 323485
12554 91264 -302205 117804 24036 -98324 20453 6498 66484 114112 94556 -78986 78689
12542 -396958 -95103 190969 305489 1185 -29980 175304 -2194 255498 -466360 -56150 148054
12530 33368 13195 138658 -13864 368115 166523 262408 -3064 15922 -79387 43698 -179167
12518 -184014 -333085 -208759 -115901 -171329 110539 -165439 403971 26956 199920 267499
12508 267499 -13708 173974 -94057 170432 118410 141184 168369 310242 -75962 129226 154527
12497 154527 -241420 37746 26686 396415 39869 125352 98256 121343 50450 337346 -315923
12485 -122930 -71678 -73193 -343236 208867 -83985 32987 -106681 -46186 44628 18127 112882
12474A12882O1939O7531h4859A71424J91279A23606g6715C9835O5644B2300b72442
12462c32196A0799c19318A91010J3644a59929C52261b56354b2326D4345a88444
12451A1532a37885A95927o5797a28577A35955L490B6954L3631g9305k18789g3598
12439B1723a8336h706I5874K45849k5591a85490f418C70674E7823J24592O2893
12428B45308p1142a22954j34353a06597K5895k2951L4077a5316H0814R8583d77096
12416b96776A30180b7448B3962e899F0711R6796a34038b5764p7400L4223L65A36789
12403F8240C2216a49341B52484G002a3433E9757N3556m0599b77404C8273a94081
12391c80543a6215B5132O4743O7228b36092E7488k173a5634n6070B9150Q7519
$$ plain form
12474 112882 174821 242352 -84859 171424 362703 123606 -76715 39835 105479 22300 -272442
12462 -332196 10799 -319318 191010 204654 -159929 352261 -256354 -22326 44345 -188444
12451 11532 -137885 195927 130130 -128577 135955 139445 26954 60585 -79305 -298094 -73598
12439 21723 -18336 -8706 95874 341723 316132 -185490 -6418 370674 57823 182415 245308
12428 245308 174166 -122954 -257307 -106597 -80702 -103653 -69576 -15316 80814 179397 -477096
12416 -296776 130180 -27448 23962 -5899 60711 157507 -134038 -25764 -103164 -68941 -68576 136789
12403 68240 32216 -149341 252484 7002 -13433 59757 113313 72714 -277404 38273 -194081
12391 -380543 -16215 25132 89875 157103 -236092 57488 55315 -15634 -71704 29150 116669
12380A16669h6689j92034D12106j42022b02381d8509a9717B930a1379A01237A9054
12368b10164J01038C26211j42969R3933l0340C8753J58264L39239b6587m4189
12358g0776p8266e5973k9885n2841b3027E9618k258K46288b66133P9360b2224
12346g929B45016b3901I148i9941H2324a63550n3784C76164d40614a31519Q365
12335a23154B9235J5130n106a15026k60450A78024i877I9377L072l5909J23481
12324A90021E3436B0665Q7168a75280b3127q3062n422A42159a66718I7971b13464
12312H9945P2736b05297A14426M0631b04397Q009b2039I5968R0770J37092c09921
12300E4361c5585F1579c32055Q1882a02960A04811b65622h1007B52761j03744
$$ plain form
12380 116669 -86689 -278723 412106 270084 -202381 -48509 -19717 2930 -11379 101237 19054
12368 -210164 -109126 326211 183242 277175 246835 38753 197017 536256 -26587 -70776
12358 -70776 -149042 -55973 -85858 -138699 -23027 59618 57360 303648 -266133 -186773 -22224
12346 -7929 245016 -23901 9148 -99941 82324 -163550 -217334 376164 -440614 -131519 -123154
12335 -123154 29235 44365 39259 -115026 -375476 178024 -9877 99377 102449 66540 190021
12324 190021 53436 20665 107833 -175280 -23127 -106189 -111611 142159 -166718 97971 -213464
12312 89945 162681 -205297 114426 155057 -204397 -196388 -22039 95968 186738 323830 -309921
12300 54361 -35585 61579 -332055 -250173 -102960 104811 -265622 -81007 252761 149017
12290A49017M3142p0626J60940J05014B1388l91e6459j35346B99483k4151K91554
12279E66886B0300a55384J2369C55957i1660C15195p5883N4268L214A44162P748
12268A51910c9682A11249D5785k828P0411f4195A47557j6110N5588a95564A32616
12256A09250a20486A07064a46329P0123e746A20705a08668A49610P1041j127a83301
12244B22397B6721O3921a54873E54613A6193K19399Q108B7660N394J33535p7019
12233H9570J33250Q4254b8531C36580p5463G2318b5677A56081k8147P1158r4407
12222A04685K75345A36409K08692j6624J96799j90014r7570b25160D99539a28139
12211A51222G0098c21214B12423b47865B42860A08727k5022L00720j19746Q2521
$$ plain form
12290 149017 192159 121533 282473 387487 21388 20997 -56459 -191805 299483 275332 566886
12279 566886 20300 -155384 -143015 355957 -91660 315195 239312 293580 296794 144162 151910
12268 151910 -39682 111249 45785 42957 113368 -64195 147557 131447 187035 -195564 132616
12256 109250 -120486 107064 -146329 -76206 -5746 120705 -108668 149610 220651 219524 -183301
12244 222397 26721 90642 -154873 554613 16193 235592 243700 27660 33054 166589 89570
12233 89570 222820 307074 -28531 336580 261117 72318 -25677 156081 127934 199092 104685
12222 104685 380030 136409 345101 328477 525276 335262 237692 -225160 499539 -128139
12211 151222 70098 -321214 212423 -247865 242860 108727 83705 384425 264679 347200
12201C47200I4867b08561B99297h2340A02580L25802a74223A66105E2392J49153
12191B01545O8842H2182h6258H4187i496n107C15474I8848J77381M9810A08833
12179A18761K28734c5013H236Q6651Q3424a25801A44701M0320g9277c7889H5792
12167D29272c8620B23079G0368R2113j3713p2298K11652a6829j65944C0250J30493
12156A60743m5968J7737c9514E6995a30333C52260I7399a77843B77907D7034f920
12144a90076D90422g5431k9952F5299K75504a4720q9651A56319g1278I2936J84825
12133B77761r9708K06509A67309n3506Q9076a16364B45972a41244q11d303n8013
12122f2316j33808A30661J14701J3716a26428A21180f7488l9897D636b17465C0976
$$ plain form
12201 347200 94867 -208561 299297 -82340 102580 428382 -174223 166105 52392 201545
12191 201545 270387 82182 -86258 84187 -9496 -14603 315474 98848 276229 326039 108833
12179 118761 347495 -35013 8236 94887 178311 -125801 144701 185021 -79277 -37889 85792
12167 429272 -38620 223079 70368 162481 148768 76470 288122 -16829 -182773 30250 160743
12156 160743 114775 132512 -39514 56995 -130333 352260 97399 -177843 277907 47034 -6920
12144 -190076 490422 -75431 -105383 65299 340803 -14720 -104371 156319 -71278 92936 277761
12133 277761 178053 384562 167309 113803 202879 -116364 245972 -141244 -142055 -4303 -62316
12122 -62316 -196124 130661 245362 259078 -126428 121180 -67488 -107385 4636 -217465 30976
12110G5200g4369j1008B41427A05003b20650B10328A00343b69056B11590a15583
12099a92287C0701K44913j16506a62836c3165m0748B26592a72561C6391O9506
12089A05897a06996F1246k1266L22818a52017a8997C6078K16266F2702J57633
12079B20335K22428P07955O97570H36384B73254d3558G9816r830L6939l9190e8948
12067h2918B11975e8814m0558C5645a10844A46173a11671b7158j26472k7894C31771
12055A18628b9101I1538a27123I4954N0730a06055k92235b4359i337A47697b3736
12043C3995N5214b023r7622C63445n0425A20517a26179A34539a62420F702J12369
12032A19071a68349k7989K2493D08696e4650j53275A14107b76858A19908b23774
$$ plain form
12110 75200 -74369 -85377 241427 105003 -220650 210328 100343 -269056 211590 -115583
12099 -192287 30701 275614 159108 -162836 -33165 -73913 226592 -172561 36391 105897
12089 105897 -106996 61246 39980 362798 -152017 -18997 36078 252344 62702 220335
12079 220335 442763 1150718 1848288 836384 273254 -43558 79816 69986 106925 67735 -58948
12067 -82918 211975 -58814 -99372 35645 -110844 146173 -111671 -27158 -153630 -181524 331771
12055 118628 -29101 91538 -127123 94954 145684 -106055 -398290 -24359 -9337 147697 -23736
12043 33995 89209 -2023 -99645 363445 313020 120517 -126179 134539 -162420 6702 119071
12032 119071 -168349 -196338 -173845 408696 -54650 -207925 114107 -276858 119908 -223774
12021f7776j72914p1163I9698J78552A27325M9812c0377A71031k8056O9742a53112
12009b0617k082C17353A6801J85610p7140b64332q5935c2495D2638R4222f2260
11997A73905J2582c15459a9243A59685E301K20593I3138g5116j71414E5118P7186
11986A32304l0754m098c7003k15869A30021c9977A03525J39D4941K7224f8397
11974A05258a30098B71129j28045N8539e1038e629j45910a709m2931j04313A22042
11962C9154N0790c8421r5814k86584f476l95545A04168h4751A50330a61657D8988
11950G6872J2876g0072k1247q4678A41803b4369H5778J12438L6659c48867B39303
11938C4857J47511C8978b23088i8950A25547O5010b3677N738j34725C1028P3342
$$ plain form
12021 -67776 -240690 -311853 99698 278250 127325 177137 -30377 171031 142975 212717 -153112
12009 -20617 -22699 317353 16801 202411 125271 -264332 -350267 -32495 42638 136860 -62260
11997 173905 186487 -315459 -19243 159685 5301 225894 93138 -75116 -246530 55118 132304
11986 132304 101550 97452 -37003 -252872 130021 -39977 103525 103664 44941 72165 -68397
11974 105258 -130098 271129 143084 201623 -51038 -5629 -151539 -1709 -44640 -148953 122042
11962 39154 89944 -38421 -134235 -420819 -6476 -402021 104168 -84751 150330 -161657 48988
11950 76872 89748 -70072 -91319 -175997 141803 -24369 85778 198216 234875 -348867 239303
11938 34857 182368 38978 -223088 -98950 125547 190557 -23677 -17939 -152664 31028 104370
11927A04370j9462c04057a47035O1558D4720P6014c34356J19962c8774k4848r0062
11916a53684j20944i3572A11653J35377h3727l3203r1196h0911p857A36863a00645
11904F4309K62127n2974a55629D7665J4457i3996L5723n9797k49268A54165c59366
11892a18141A00964b58158m5577F243b55704R8047B7841Q9799b7047H1851Q9067
11881A70918f1384F9228b81032D7215P9200j975a58758g1633B951a6259l058d345
11868c03958D092a44807F0869a9934B6092c45882C2619b57263A37476f0511C58896
11856a4174D0449a30594B57760a06767A19142a15898d4258p3337A9607R8822a68062
11844i9320c0036q078E8498K41490j02491g3740A5428c7892j31552L8481d4343
$$ plain form
11927 104370 84908 -304057 -147035 -85477 44720 120734 -334356 -214394 -38774 -63622 -153684
11916 -153684 -274628 -93572 111653 247030 -83727 -116930 -208126 -80911 -88768 136863 -100645
11904 64309 326436 273462 -155629 47665 62122 -93996 -58273 -118070 -367338 154165 -359366
11892 -118141 100964 -258158 -303735 6243 -255704 -157657 27841 117640 -27047 81851 170918
11881 170918 -61384 69228 -281032 47215 126415 124440 -158758 -71633 2951 -16259 -19317 -4345
11868 -303958 4092 -144807 60869 -19934 26092 -345882 32619 -257263 137476 -60511 358896
11856 -14174 40449 -130594 257760 -106767 119142 -115898 -44258 -117595 19607 118429 -168062
11844 -99320 -30036 -38114 58498 299988 197497 -73740 15428 -37892 -169444 -130963 -44343
11832g435j7285F0294b42510Q0996B8098c93685J07431d5232n6274k31398B09508
11820a64912L9870F2081O3118c865k31761a07378a9397D740a85053c935C3996
11808A66027e08690e8532j21179a284A05565a64050J6120K34r5472I6122K29112
11797C25234A49021a4813k2303m3874A41328o2701a00734E4375j1325h4556K9752
11786e4804j76400F5987b12576I4983J10277F2675R6882J89817b01306B6854a57217
11774A676O8416B0501E302a5432C49723A54180D4515A9968b63121f7434a1677
11762A11301J29072j02549B2954c3046j52854o819c2245A05755a56723k6903f6782
11750f2002a9158l96463A61859b5442j12275j23646J21010L0592k6814D3465a2726
$$ plain form
11832 -7435 -24720 60294 -242510 -161514 28098 -393685 -286254 -45232 -101506 -332904 209508
11820 -164912 -125042 62081 125199 -3865 -235626 -107378 -19397 4740 -185053 -3935 33996
11808 166027 -508690 -58532 -179711 -1284 105565 -164050 -147930 -147696 -243168 96122 325234
11797 325234 149021 -14813 -37116 -80990 141328 78627 -100734 54375 43050 -84556 -54804
11786 -54804 -231204 65987 -212576 94983 205260 62675 159557 349374 -201306 26854 -157217
11774 1676 70092 20501 5302 -15432 349723 154180 44515 19968 -263121 -67434 -11677
11762 111301 240373 137824 22954 -33046 -185900 -192719 -32245 105755 -156723 -183626 -66782
11750 -62002 -19158 -415621 161859 -25442 -137717 -261363 -140353 -109761 -136575 43465 -12726
11738A10048a09450B72236a2999A55941L07239A12335a82232F7592P8510J30812
11728B76914r3305M2646J0179A07258D3784a64895M0140B42227e7101C15037l1641
11717B83396G9454j2584J16523a02830J366A2676a32274B3686a6396F627N4679
11706F1306A6903Q1257J105J4754m1062K804d7141b1317A6151a12712A19428a35981
11693a3949k5516l8167p9375r3735f2063B67895G1063J44430P7238a1502j08296
11682a19798B08470L8231g4378D21916a23062j02568d4904P837j61091C5950O5938
11671A01888a37603D7166b61326J22976B73592B0125A71J3784J81552C5563a7248
11659I168a45881j07517a14791A11580K84709A12668J28518a80987E52140H3458
$$ plain form
11738 110048 -109450 272236 -12999 155941 463180 112335 -182232 67592 146102 276914
11728 276914 183609 226255 236434 107258 43784 -164895 -124755 242227 -57101 315037 283396
11717 283396 79454 66870 183393 -102830 -101464 12676 -132274 23686 -16396 6627 61306
11706 61306 16903 98160 99265 114019 72957 75761 -47141 -21317 16151 -112712 119428 -135981
11693 -13949 -39465 -77632 -157007 -250742 -62063 267895 71063 215493 292731 -11502 -119798
11682 -119798 208470 246701 -74378 421916 -123062 -225630 -44904 -37067 -198158 35950 101888
11671 101888 -137603 47166 -261326 -138350 273592 20125 171 13955 195507 35563 -17248
11659 9168 -145881 -253398 -114791 111580 396289 112668 241186 -180987 552140 83458
11648A8038J39147l4137b9262q1601A00096O0037J29951j10647b76054G459P5233
11637H2692M8326i3426i865H1744b26262A19468J32682b49729C37170E778L73614
11626C79392a13573a469A37834L4836a34164k27461B56070o0118b39401C6784
11615B34161G6033K49201D2143R2687b35486A63354h4258A39376J02647b30966
11604I8916L2579M8501c25360J15108E78548B8177K00603a82555N0363D7903b943
11592a2685A29215L8683M959c3674m6431D3977f2547A86341H6755K53672A41245
11580e3983B65264K56770A46241J979a02067j8509N237b6658l1878A02872C9000
11568a33002B34938J1348A13911J32645G8833a25304A11236J02833c1673E2681
$$ plain form
11648 18038 157185 123048 -29262 -110863 100096 160133 290084 179437 -276054 7459 82692
11637 82692 131018 -93426 -9865 81744 -226262 119468 252150 -249729 337170 5778 379392
11626 379392 -113573 -1469 137834 172670 -134164 -361625 256070 195952 -239401 36784
11615 234161 76033 325234 42143 134830 -235486 163354 -84258 139376 242023 -230966
11604 98916 131495 179996 -325360 -210252 578548 28177 228780 -182555 -132192 47903 -2943
11592 -12685 129215 167898 172857 -33674 -80105 43977 -62547 186341 86755 340427 141245
11580 -53983 265264 522034 146241 148220 -102067 -120576 -115339 -26658 -58536 102872 39000
11568 -133002 234938 246286 113911 246556 78833 -125304 111236 214069 -31673 52681
11557C88911a54269H9566h2360l68612B38331C7649K9572c7333E922a82575A69676
11545C74565A04163c7896C44563m7157A10607P9939a44270A7146J20668a53772
11534C63171A1645b76429A82811N3063J61774A89760G5487l3618J24361l3372
11524A32858N5352o4030J17569D8206J81083O4222a48906A67878b05604A02300
11513a53523E9851f4346C6618J04822c0103j46106d2149D17479n0375d4526A11843
11501i5016C6504j6604b28588B69428A32421a97232C32364h1661B30543d9086
11490G3772a11321G7805e4805A90837n8678K8882R6365k6490G1907J4255H883
11478G8449d2839I4839a6190A18984l1534N3926J83748N5777f2541C23793E3702
$$ plain form
11557 388911 -154269 89566 -82360 -450972 238331 37649 67221 -37333 5922 -182575 169676
11545 374565 104163 -37896 344563 297406 110607 190546 -144270 17146 137814 -153772
11534 363171 11645 -276429 182811 235874 397648 189760 75487 41869 166230 132858
11524 132858 188210 124180 241749 48206 229289 293511 -148906 167878 -205604 102300
11513 -153523 59851 -64346 36618 141440 -30103 -176209 -42149 417479 367104 -44526 111843
11501 -95016 36504 19900 -228588 269428 132421 -197232 332364 -81661 230543 -49086
11490 73772 -111321 77805 -54805 190837 132159 161041 257406 230916 71907 86162 8883
11478 78449 -42839 94839 -16190 118984 87450 141376 325124 380901 -62541 323793 53702
11466C36467J9217j7111A23196J2241M2289P42n287D2750J33858a27256d8186
11454B27408l9676l3085J338h11l1769f726A64732r156E1455A0711a6603B04188
11441a86366h776B56657o0853O5898b53865G4893a56608A73132e2247B08630a24280
11429H6064a44545A30319D7876j6445h3795N537P462B66645A16882a68429A14638
11417B07074g666G9171c49043B672J78481a42256a4625j76314B51505E1787a20769
11405a92065L4961l9927D41441A13124o802j6517J3279b4548j86258D8574K42282
11394B90856c65957r8940a30391e4973B5743i974j28884A723d2486A10994a30039
11382G6068J20838F302i8368G872J35962R6252J20311N5655A50489R5308f3381
$$ plain form
11466 336467 355684 338573 123196 135437 177726 178468 173181 42750 176608 -127256 -48186
11454 227408 187732 154647 155985 -811 -32580 -6726 164732 155576 51455 10711 -16603 204188
11441 -186366 -8776 256657 195804 261702 -253865 74893 -156608 173132 -52247 208630 -124280
11429 86064 -144545 130319 47876 31431 -83795 -78258 -70796 266645 116882 -168429 114638
11417 207074 -7666 79171 -349043 2672 181153 -142256 -14625 -190939 251505 51787 -120769
11405 -192065 -157104 -197031 441441 113124 106322 89805 103084 -24548 -210806 48574 290856
11394 290856 -365957 -464897 -130391 -54973 25743 -9974 -138858 1723 -42486 110994 -130039
11382 76068 196906 6302 -98368 7872 143834 240086 360397 416052 150489 245797 -63381
11370I9732R6887a1337n1675A9097c20179a07095d5332j96306H856a9845D0637
11358b63711N16i1550j74691A58595a25680B34863h721A12425K65119D5279B326
11346H1115M9076r997g0885K4269j83716o4044B82041o5110b2862l97851A57500
11334C3756A5720a75481j75260g3510A8195J44947a07999A78718a0028j73045
11324a83073g6459A90333H772h8131A65527o6165M9325b84435C44047j00083i7159
11312a36198a0342j61632j01760h8325j58705H6509M11314A9190K14588B0046
11301b11892B620i8766j07134A0820J04838b10937A70991o7541b19484d5096A05505
11289I1676P9957c18577a8987j04768R872k5073j9861B80236D0682a71928Q099
$$ plain form
11370 99732 196619 -11337 -63012 19097 -320179 -107095 -45332 -241638 8856 -19845 40637
11358 -263711 -263195 -91550 -266241 158595 -125680 234863 -8721 112425 377544 45279 2326
11346 81115 130191 120194 -70885 -46616 -230332 -294376 282041 216931 -22862 -420713 157500
11334 33756 15720 -175481 -350741 -73510 18195 163142 -107999 178718 -10028 -183073
11324 -183073 -76459 190333 8772 -88131 165527 99362 148687 -284435 344047 243964 -97159
11312 -136198 -10342 -171974 -273734 -88325 -247030 86509 497823 19190 233778 20046
11301 -211892 2620 -98766 -205900 10820 115658 -210937 170991 103450 -219484 -45096 105505
11289 91676 171633 -318577 -18987 -123755 -113883 -138956 -158817 280236 40682 -171928 -163829
11278a63829g8989k56100J05912g1071H6952K81058a15586G2864f7282a1930l68673
11267c80603P0137i0673o7534A69222b37671D06747d407j22808A46149J31657
11257B77806a64039k404A55580a11109D9882a25123B60493a97911N8750q9164
11247b28325c5906j4681j67981d5440f041j91527A03416b25763j45215a29036
11236B9991K33075a61772I1052n457M4679O0230A0986a09666C3030b9261h181
11224c18671K4686N4864C657d26914e3558N981j65842N7975q0022j933B11401
11212B95101a92255A92137a75127H9056N3435R1701g4651c4783j31441o4531Q6750
11201a44005d0257A75339a35788a4796D6878d0406j30696A07310a34465c4224
$$ plain form
11278 -163829 -78989 -335089 -229177 -71071 86952 368010 -115586 72864 -67282 -11930 -380603
11267 -380603 -310466 -90673 -158207 169222 -237671 406747 -4407 -127215 146149 277806
11257 277806 -164039 -166443 155580 -111109 49882 -125123 260493 -197911 -139161 -228325
11247 -228325 -35906 -50587 -218568 -45440 -6041 -197568 103416 -225763 -370978 -129036
11236 29991 263066 -161772 91052 85595 130274 190504 10986 -109666 33030 -29261 -8181
11224 -318671 -293985 -239121 3657 -426914 -53558 -47577 -213419 -155444 -235466 -237399 211401
11212 295101 -192255 192137 -175127 89056 142491 234192 -74651 -34783 -166224 -230755 -144005
11201 -144005 -40257 175339 -135788 -14796 46878 -40406 -171102 107310 -134465 -34224
11190A0175K00792K1067j10038A6412a63511A2036Q6004m5654J61699c65503i954
11178a83914F8411J53078f0709k06723h0246I9804J57857E5818b36401A20793
11167a71552J7107I5631h7626A81407N2012F5199a31528j68493a22939D42283
11156c35650c6235F6773P761a72809A58565A0223a39903a2704D6630J99078a24360
11144a15417b6760j18562A65473e0327G970K92313b06369c6483D4001a88657d3905
11132a3001j36880d9098D944a0860I6570K33767h8117B53661I5736J1724m3386
11121F4074a05199I649a24430C55852a0147A04404N4797c63430B35191B3793J60294
11110A84087J83339j32581I8186L6501J07R9606J6587C6000b8049C95694A38977
$$ plain form
11190 10175 210967 232034 121996 16412 -163511 12036 98040 52386 214085 -365503 -9954
11178 -183914 68411 221489 -60709 -267432 -80246 99804 257661 55818 -236401 120793
11167 -171552 -154445 95631 -87626 181407 233419 65199 -131528 -300021 -122939 442283
11156 -335650 -36235 66773 74534 -172809 158565 10223 -139903 -12704 46630 245708 -124360
11144 -115417 -26760 -145322 165473 -50327 7970 300283 -206369 -36483 44001 -188657 -43905
11132 -13001 -149881 -49098 4944 -10860 96570 330337 -88117 253661 95736 107460 64074
11121 64074 -105199 9649 -124430 355852 -10147 104404 159201 -363430 235191 23793 184087
11110 184087 367426 234845 98186 134687 134794 234400 250987 36000 -28049 395694 138977
11098B10316d40336b2923I041K12623M8565G2033c4368D4461P461J57546K7293
11087B36761J48789A22027J20652A6354O9671a34206C58458A78232J78449J8015
11077C74696K7719M315A95976Q0591k0641q2904J91341b06555C54893J22278K6160
11066E03331B13726P9373H91L83816O6781K8263p430A84328J89093K27256n0839
11055E49838j93809N50661j44071r9545Q4405j27015B47124N61517J0526Q8559
11045I07726j84790m455p0287k24276J71999k1265M33368j78737l40698K64264
11035G52849l5471q3600K56185k58757l4525J15618q4637j54182K8341L07258
11025H09079j57144K46723l00662N9935m2489M5908p0428k42640M76342j42893
$$ plain form
11098 210316 -440336 -22923 9041 221664 270229 72033 -34368 44461 51922 209468 236761
11087 236761 385550 122027 242679 16354 86025 -134206 358458 178232 356681 374696
11077 374696 402415 406730 195976 276567 255926 173022 364363 -206555 354893 477171 503331
11066 503331 213726 293099 891 384707 451488 479751 472321 184328 373421 600677 549838
11055 549838 356029 906690 762619 663074 747479 620464 247124 808641 819167 907726
11045 907726 722936 718481 648194 423918 595917 574652 1008020 829283 488585 752849
11035 752849 717378 633778 889963 631206 596681 712299 627662 473480 501821 809079
11025 809079 651935 898658 597996 657931 615442 661350 590922 348282 824624 681731
11015F81731k52451j23916K65282m7765J86096l02212K66833k32394p8608M59048
11005H21644C06087L94579k05405m0391M5419o0515K83510R3781k70837P4558
10995F20786J01796l25788L61274q8533J27077N5795J83577M9664l00605P0098
10985H55141J09234k3125L84855n99863M224M83693k5716J703K66825M10121k05082
10974A662010L60635N10737l13695N85443j01509J33738l58151J57352l72127
10965B264433l21661l91552J02320J63126l55654O2106J61707J20507j72588j82727
10955A450017O70794l40117q5222L5351n07956k29345L52784J39663m05903m94801
10945E85265j6159j21468L15443C41068j09237N747p0794N6169r9226J39887J03574
$$ plain form
11015 681731 429280 305364 570646 522881 708977 406765 673598 441204 362596 821644
11005 821644 306087 700666 495261 454870 500289 439774 723284 817065 546228 620786
10995 620786 722582 396794 758068 669535 796612 852407 1035984 1085648 785043 855141
10985 855141 964375 941250 1326105 726242 730466 1214159 1188443 1190146 1456971 1867092 1662010
10974 1662010 2022645 2533382 2219687 2805130 2703621 2837359 2479208 2636560 2264433
10965 2264433 1942772 1551220 1653540 1816666 1461012 1523118 1684825 1805332 1632744 1450017
10955 1450017 2120811 1780694 1695472 1730823 1222867 993522 1346306 1485969 1080066 585265
10945 585265 569106 447638 763081 341068 231831 237578 166784 222953 123727 263614 367188
10934C67188R4458A82697d1379O799A87871n9864J5769b30907B60093d8458p6438
10923a24896D45144a21631N1127j9977k16689a19251B68466A13934C3797a77170
10912B00088c28003B22751D0949c3305k5162B28719j4664L7909b09320C9922c4233
10900A15181D5977Q078k0626b63553F888J91798d6406r4719N3974m7523h687q7399
10888i6086j0173a2811j78416Q4414A7474a26712D05J64370j1455a84073p3347
10877b57420K4313A92888f780B4148g7370j0469A54092k7685D5162R0755J46824
10866B82741a50773A78672P7127b15803j06903G7589a22174n0988B15509a2135
10855d8452A26253b44217A4858d34309e1572j91313A90432E5948r913J50373b99654
$$ plain form
10934 367188 461646 182697 -41379 -34580 187871 128007 143776 -230907 260093 -48458 -124896
10923 -124896 445144 -121631 -70504 -90481 -307170 -119251 268466 113934 33797 -177170
10912 200088 -328003 222751 40949 -33305 -58467 228719 214055 251964 -209320 39922 -34233
10900 115181 45977 54055 33429 -263553 6888 198686 -46406 -141125 -87151 -134674 -8687 -96086
10888 -96086 -106259 -12811 -191227 -106813 17474 -126712 405 164775 153320 -184073 -257420
10877 -257420 -233107 192888 -6780 24148 -77370 -87839 154092 126407 45162 135917 282741
10866 282741 -150773 178672 255799 -215803 -322706 77589 -122174 -173162 215509 -12135
10855 -48452 126253 -244217 14858 -434309 -51572 -242885 190432 55948 46035 196408 -299654
10843a43633B5269g2723k1279c4668C1051N8851A2795a37805A19602a39205M908
10832a34297L9736j60372B35979H8914f7457A06223N4656O0929b9016B35769I914
10820B44527b80269Q2382G2733j2147b5365F5535h0197j02554f6389G0858b40302
10808a61240e5851l1347d2619C79232a46868O5586B1446i7906C8200L5710A8059
10796b28059D3930a82804A5447b34148Q0014A54629O489O8601j01723e7377I2747
10784e0664k66423g1418l69048d0028k08755I3283a97044B28513i6174A62470
10773b76061I3870b29268A29933k9178f8298L3385k4309k46284A87649c89852
10762b20152F1427i7813d7789l68268A04557K02405a31889o0416D1243c24144
$$ plain form
10843 -143633 25269 -72723 -94002 -34668 31051 89902 12795 -137805 119602 -139205 -134297
10832 -134297 -94561 -254933 235979 88914 -67457 106223 160879 221808 -29016 235769 9914
10820 244527 -280269 -197887 72733 60586 -25365 65535 -80197 -182751 -66389 70858 -240302
10808 -161240 -55851 -87198 -42619 379232 -146868 -81282 21446 -97906 38200 73910 18059
10796 -228059 43930 -182804 15447 -234148 -154134 154629 161118 229719 127996 -57377 92747
10784 -50664 -317087 -71418 -440466 -40028 -248783 93283 -197044 228513 -96174 162470
10773 -276061 93870 -229268 129933 100755 -68298 -34913 -59222 -305506 187649 -389852
10762 -220152 61427 -97813 -47789 -416057 104557 306962 -131889 -192305 41243 -324144
10751i7306d0058a2328k07947A09593b504A49846b61110J21000j42152B87572
10740B8199i7841k46560e083A04974K36907b49550D3418E067J15899A0385d25362
10728a05764K041F9026a84930M1355k16972h5428B80581g3306j07063f6928D10654
10716b00620g3595l5269a114j0569l72604a3495j24434H5465a92952C0452c7595
10704G1563a0226o0059C9506a62367L6219K7464j4572j2456A03253b98133E8890
10692b4786j6522D0312j2631k68g6079B34879a55829A45519b24374A50829F3669
10680a85763q9018A7800L1525h0392A73935L699h3672B38779a72225q2252R185
10669b45292a3063A74328a78363A28926a80465d198A78681J14843a29912k405
$$ plain form
10751 -97306 -40058 -12328 -220275 109593 -2504 149846 -261110 -140110 -282262 287572
10740 28199 -97841 -344401 -5083 104974 341881 -249550 43418 5067 120966 10385 -425362
10728 -105764 -103723 69026 -184930 -143575 -360547 -85428 280581 -73306 -180369 -66928 410654
10716 -200620 -73595 -108864 -1114 -11683 -384287 -13495 -137929 85465 -192952 30452 -37595
10704 71563 -10226 -70285 39506 -162367 -126148 -98684 -113256 -125712 103253 -298133 58890
10692 -24786 -41308 40312 27681 27413 -76079 234879 -155829 145519 -224374 150829 63669
10680 -185763 -274781 17800 49325 -80392 173935 177634 -83672 238779 -172225 -254477 -245292
10669 -245292 -13063 174328 -178363 128926 -180465 -4198 178681 293524 -129912 -132317
10659a32317j4984E6360i3961p5011B25532d878j4624C99927b05118B256a06802
10647C603P7467b70312j3388J24310A20384c52171k23986B53518C8226e2203A53430
10635a68083E1613b37045c8091A35803a85920j75211a14531j18787A78066A6658
10624E9792e3522l27502A0997b33456b3542A78651K5040q7879b87749a29876k6357
10613a56233c7214j80338F8481b20337i037r4088J2091b9726F5790K85734m0957
10602C10567c6782A74225Q1006h5399B8900J1575g9400j3249m03560A7132J05302
10591A22434M2858D992h1996i662j24228j01341A18901n387a57027K2578p4038
10580b08487H7615b11719j44879C52260H41c97145a03739l7648j59395J21083
$$ plain form
10659 -132317 -147301 56360 -93961 -168972 225532 -4878 -19502 399927 -205118 2256 -106802
10647 3603 81070 -270312 -283700 -159390 120384 -352171 -576157 253518 38226 -52203 153430
10635 -168083 51613 -237045 -38091 135803 -185920 -361131 -114531 -233318 178066 16658
10624 59792 -53522 -381024 10997 -233456 -23542 178651 203691 115812 -287749 -129876 -156233
10613 -156233 -37214 -217552 68481 -220337 -9037 -103125 -91034 -29726 65790 351524 310567
10602 310567 -36782 174225 255231 -85399 28900 40475 -79400 -92649 -496209 17132 122434
10591 122434 165292 4992 -81996 -9662 -133890 -235231 118901 113514 -157027 -134449 -208487
10580 -208487 87615 -211719 -356598 352260 841 -397145 -103739 -141387 -300782 -179699
10570a79699C9737a42986A3108b58509j01893a29232p3129n7233B71435j29040
10560A42395c7372B63382a91294I5853b0262j5756j36325C1270d8829m0344k4977
10549a14150B36711A8933b87385K2708a28882A06161a57389E6192j1454A2855
10538I1215J77523d9058J8224j5608A69217c92532G2121g1244c3824A873c13170
10526b64851K7172e5795B49094b55139g4652C66736D7900a79363A58232a02751
10515a72622A54078Q1404M2635A15639B7939J44825p63a24151C2673j2709K30942
10504B50906e50022B03896d3286c689j60829B35463a57507l96255a22244J3818
10494a08426B91241a9422B14059A02169B0630Q2666G792c8480A03244K90403A0857
$$ plain form
10570 -179699 39737 -142986 13108 -258509 -360402 -129232 -202361 -259594 271435 142395
10560 142395 -37372 263382 -191294 95853 -20262 -36018 -172343 31270 -48829 -89173 -114150
10549 -114150 236711 18933 -287385 -264677 -128882 106161 -157389 56192 44738 12855
10538 91215 268738 -49058 -30834 -46442 169217 -392532 72121 -71244 -33824 1873 -313170
10526 -264851 -237679 -55795 249094 -255139 -74652 366736 47900 -179363 158232 -102751
10515 -172622 154078 235482 278117 115639 27939 172764 172001 -124151 32673 19964 250906
10504 250906 -550022 203896 -43286 -3689 -164518 235463 -157507 -553762 -122244 -108426
10494 -108426 291241 -19422 214059 102169 20630 103296 7792 -38480 103244 393647 10857
10482a0387I429J66830J65094K22523K74010C48683L85652C19296a46691B94285
10471a65318b0507C7057J44724a26049C9130F856c35525A81942o0707e9951j17700
10460a77651c8889E30107H232P4669h2626j24427D3838d03179a0873C8466a35319
10448a64794j20620b8483A02929K02448a00900C90437j02925h7882m1023j82869
10438c11774C32755j30169g2822k3503L3434D0177d4856k8298j40501q548B02238
10426I2456k057O0255q282P3165B2484O3805a61801K0203B92427j44201l5345
10415A12881P3179P5877C3565d6396D17788A19836d49447a50833A03577A8206
10404H7914A3594J96449G348J10559k9346d8697C02080A0417g4209p005I2496
$$ plain form
10482 -10387 9429 176259 341353 563876 837886 348683 734335 319296 -146691 294285
10471 -165318 -20507 37057 181781 -126049 39130 6856 -335525 181942 121235 -59951 -177651
10460 -177651 -38889 530107 8232 82901 -82626 -207053 43838 -403179 -10873 38466 -135319
10448 -164794 -285414 -28483 102929 305377 -100900 390437 287512 -87882 -128905 -311774
10438 -311774 332755 202586 -72822 -96325 -62891 40177 -44856 -73154 -213655 -222203 202238
10426 92456 90399 150654 142372 215537 22484 86289 -161801 -141598 292427 148226 112881
10415 112881 186060 261937 33565 -46396 417788 119836 -449447 -150833 103577 18206
10404 87914 13594 210043 7348 117907 88561 -48697 302080 10417 -74209 -81214 92496
10392E472P7633m0370L2346K07124h5833C86208g0101A56234M613d2268r1326
10381a33594r636D8482L33432A02761d45468a4768A04494a73784B10522Q2558
10371B93080i6021F1178J57169H3699L67123I5463J83966M047j31377J46461m3325
10360B55235G4046K83762B9163f2566C83501b2126H03674C12616J88735F0452
10349D13264J71235k84294P7507J23882j54891k1296P3380j97651C1823N34607
10339E66430B54355a40917K1718B3153B377K0837K31669J752K48347n1096B1092
10327E20219A59812j5846l3274J69781K12615k46284o1957P2735L85434k46579
10317C96437B1220a63877A07327d4476I2045c08068J02918B07033d9803A25364
$$ plain form
10392 5472 83105 42735 75081 282205 -85833 386208 -70101 156234 160847 -42268 -133594
10381 -133594 -143230 48482 381914 102761 -445468 -14768 104494 -173784 210522 293080
10371 293080 -96021 61178 218347 83699 450822 95463 279429 283476 152099 298560 255235
10360 255235 74046 357808 29163 -62566 383501 -22126 803674 312616 501351 60452
10349 413264 584499 300205 377712 501594 346703 325407 398787 201136 31823 566430
10339 566430 254355 -140917 -119199 23153 2377 23214 254883 256635 504982 453886 21092
10327 520219 159812 143966 110692 280473 493088 246804 184847 257582 643016 396437
10317 396437 21220 -163877 107327 -44476 92045 -308068 -205150 207033 -49803 125364
10306A03765c10024n2877H2164a23952D620a48552F6335a07518k03743A11833
10295f5616k5220B47621H9451b32784K959B5269J99210b53360J19911L7961a213
10283C5079c6815I359b47400B8569j3016b01450D2131d06915f4084A93080f5861
10271i8849d7296m6879A7008d397m7905j09608J6203a0916B16390r9001a14305
10259B21892J16178o1234c3415E7320K89488C5616L16581b61764J26946n9433
10249a94251A05257J05016b75580J16689D6440i9758k7889j86528C1863E464a91907
10237C15026h1459C7325b33843L312A72125r550a12940A47041e4256l40613I5516
10225b1162A87384a47245A5137P3905P3902b2138D4161a68728f1747o001I883
$$ plain form
10306 103765 -310024 -362901 82164 -123952 4620 -148552 66335 -107518 -311261 111833
10295 -65616 -90836 247621 89451 -232784 -229825 25269 224479 -253360 -133449 -95488 -1213
10283 35079 -36815 9359 -247400 28569 15553 -201450 42131 -406915 -64084 193080 -65861
10271 -98849 -47296 -94175 17008 -4397 -52302 -161910 -145707 -10916 216390 117389 -114305
10259 221892 338070 276836 -33415 57320 346808 35616 352197 -261764 -134818 -194251
10249 -194251 105257 210273 -275580 -158891 46440 -99758 -127647 -314175 31863 5464 -191907
10237 315026 -81459 37325 -233843 -230531 172125 162575 -112940 147041 -54256 -394869 95516
10225 -21162 187384 -147245 15137 89042 162944 -22138 44161 -168728 -61747 -67748 9883
10213a52003e4628k43363A8529g1011A85254r2291b36365J3077A92255H925J12259
10202A21184b85507a7635j909D17126c54803i1337k67759i4952G2706c9735A40498
10190i8441k74807C0366g0000B93901i1031l39246F0501L24452a22002j87970
10180c09972g8263D3061A1353a86364d0322m97898H2324a57572M4625l08214A2118
10168G9222c24115a19023A5698L7586K34400j13271a02095L0285b7946j80437
10158b08383f6205A32337c94067a24928d6731A05953a3150n6420a6423p5479A05120
10146A66742a72724K6011n8121O8815F1325e761A7479J46855b2880n8215k38655
10135c19750R236G0908b08645g8968J5601H4234B5769H212L7484b29720e1906
$$ plain form
10213 -152003 -54628 -297991 18529 -71011 185254 92963 -236365 -223288 192255 8925 121184
10202 121184 -285507 -17635 -19544 417126 -354803 -91337 -359096 -94952 72706 -39735 140498
10190 -98441 -373248 30366 -70000 293901 -91031 -430277 60501 384953 -122002 -309972
10180 -309972 -78263 43061 11353 -186364 -40322 -538220 82324 -157572 -112947 -421161 12118
10168 79222 -324115 -119023 15698 53284 287684 174413 -102095 -71810 -27946 -208383
10158 -208383 -66205 132337 -394067 -124928 -46731 105953 -13150 -69570 -16423 -91902 105120
10146 166742 -172724 -146713 -204834 -136019 61325 -5761 17479 164334 -22880 -81095 -319750
10135 -319750 -310514 70908 -208645 -78968 -63367 84234 25769 8212 45696 -229720 -51906
10123b8856j31704B64571b00401A26602a45601j39081i826A59177g9482A40323
10112e2708m13754a8414F1588c05127a24463b9318R025m9418B12561E1455K19439
10101B70894i9661A57103a39010E796h5598j81775B28978a44478c823G8847g3525
10089a68198A1240b31715Q3694N0166A5371a91343M1564j27184A02916f986A38497
10077B22194i6667a84A32236C8099d4614j33741D6789M4113J24375d05178D3550
10065a31558h254A22616g1740j79305B16388c8810D8004a69492D3130q603g3557
10053F478h5112J4191B19415a21093J8193l1770e025l67723c4839l23252A08623
10041d9769A20447c8661A68622d076j66933B06166f5602C9504m895a92666O1449
$$ plain form
10123 -28856 -160560 264571 -200401 126602 -145601 -284682 -9826 159177 -79482 140323
10112 -52708 -466462 -18414 61588 -305127 -124463 -29318 -20293 -69711 212561 51455 270894
10101 270894 -99661 157103 -139010 5796 -85598 -267373 228978 -144478 -3823 78847 -73525
10089 -168198 11240 -231715 -148021 -97855 15371 -191343 -149779 -276963 102916 -6986 138497
10077 222194 -96667 -184 132236 38099 -44614 -178355 46789 90902 215277 -405178 43550
10065 -131558 -8254 122616 -71740 -251045 216388 -38810 48004 -169492 43130 34527 -73557
10053 6478 -85112 -70921 219415 -121093 -102900 -134670 -5025 -372748 -34839 -358091 108623
10041 -49769 120447 -38661 168622 -4076 -171009 206166 -65602 39504 34609 -192666 -131217
10030a31217k72348a35973a4747j78469A06687a19248A29039B7598J02742o463
10020A23877Q411B2238h1187n1171B15787d9361B99411c86729a8142F1288a17452
10008f5233k64165A01251g4226K570I0188h0017D26614A79981c13576f0400A49015
9996b20165g7643a2337n6604k04969h9833k53675A5167c10354G2192e2355A98204
9984a04961j5518q1460n4834C7598b14786B43765h6481F873b90252J18009m8586
9973b20829Q9984r0812C49181e56411b42361F8304c1820H017d96381A9557f695
9961A4841q0Q5186D8540e783A47791B5459a5938j63427d3636k5613B26969b69284
9948c9841k90915j9014I7251a94341B52419g6124q7076M1968e7148k21564e1829
$$ plain form
10030 -131217 -403565 -135973 -14747 -193216 106687 -119248 129039 27598 130340 123877
10020 123877 132288 22238 -81187 -132358 215787 -49361 299411 -386729 -18142 61288 -117452
10008 -65233 -329398 101251 -74226 -71656 90188 -80017 426614 179981 -313576 -60400 149015
9996 -220165 -77643 -12337 -68941 -273910 -89833 -343508 15167 -310354 72192 -52355 198204
9984 -104961 -120479 -201939 -256773 37598 -214786 243765 -86481 6873 -290252 -172243 -220829
9973 -220829 -130845 -221657 349181 -556411 -242361 68304 -31820 8017 -496381 19557 -6695
9961 14841 14761 99947 48540 -5783 147791 25459 -15938 -179365 -43636 -69249 226969 -269284
9948 -39841 -330756 -349770 97251 -194341 252419 -76124 -163200 -121232 -57148 -278712 -51829
9936a81531j85858a63610O1338j80896I9046J301Q729J91319a58773K8444A86083
9924b12941E5978b79548O0070i9705j09320B08272a23621j19116i1769C9269L030
9913D2299E772e9148I3644b32283A28077h3033H75b59673c9831k45190a02677
9901c88591e265k28373j99645C4738a02579j42228R4376o2104A71159b08809B83353
9889b63193O2465f4679j52997L9448Q8924K506j29427E2169A6718K27127j20577
9878A23268P6019k9133b49568J4784j64547J90448a00798j87859A93148b66809
9867A46168a35205f6938D8707d22979a87374p5389e9457j01204b6272k62962L457
9856b85777D11860B8320b75663j11797a42646j15626g8062j35573N7858A74025
$$ plain form
9936 -181531 -367389 -163610 -102272 -283168 99046 100347 109076 300395 -158773 -130329 186083
9924 -212941 55978 -279548 -219478 -99705 -209025 208272 -123621 -242737 -91769 39269 42299
9913 42299 5772 -59148 93644 -232283 128077 -83033 875 -259673 -39831 -285021 -102677
9901 -388591 -5265 -233638 -433283 34738 -102579 -244807 -150431 -212535 171159 -208809 283353
9889 -263193 -200728 -64679 -217676 -178228 -89304 -86798 -216225 52169 16718 243845 123268
9878 123268 199287 170154 -249568 -234784 -399331 -208883 -100798 -288657 193148 -266809
9867 146168 -135205 -66938 48707 -422979 -187374 -262763 -59457 -160661 -26272 -289234 -285777
9856 -285777 411860 28320 -275663 -387460 -142646 -258272 -78062 -213635 -155777 174025
9845G9806a40599d371j95841b3617l3846C13274a45221A36803i9548j44476g4236
9833e865B00690e9124r2634l3338C7897b7211j42917k87408e3001q8000j59880
9822c00881A0572c3378q5096A02340b704k95986J48901A45000J03269d61590A52406
9810a34785B30355i1755A4374e2367l512m4131n451j14207h778G977e8632B39642
9797b48821c522j06757B36607f2703l31236J33645j19529C00127G8311a42130
9786a02179b4936o1545m3324K7894J0021d4292M90g056j09139G1867d5463l09156
9774c54619d9535A30131b58937Q071C6000J24899J25485a19452A64595d0389k57912
9763b98301G0072c8266A25937G773N6760f0417B98492J3775b5221j58756j53745
$$ plain form
9845 79806 -140599 -4371 -200212 -23617 -57463 313274 -145221 136803 -99548 -244024 -74236
9833 -5865 200690 -59124 -151758 -185096 37897 -27211 -170128 -457536 -53001 -141001 -300881
9822 -300881 10572 -33378 -118474 102340 -2704 -298690 -149789 145000 248269 -461590 152406
9810 -134785 230355 -91755 14374 -52367 -55879 -100010 -105461 -219668 -8778 7977 -58632 239642
9797 -248821 -3522 -110279 236607 -62703 -393939 -260294 -379823 300127 78311 -142130
9786 -102179 -24936 -86481 -129805 -101911 -91890 -44292 -43802 -7056 -116195 71867 -45463 -354619
9774 -354619 -49535 130131 -258937 -250866 36000 160899 286384 -119452 164595 -40389 -298301
9763 -298301 70072 -38266 125937 7773 64533 -60417 298492 312267 -25221 -183977 -337722
9752c37722N7815a01864k5686n3000e847k61603i1810j66482A55933B4617M9046
9741G3663b87059E0298a87446j9057C5552L5914J01307d795p4190A81737b01203
9729A26384a48949j71742a57248j18434C9430a17439m7665B96905g472l44279
9719c51751A0939R1159O9928C9635i4105n4733b3014f302k86459O6568E0088M5241
9707I5329B8527a89959B4521d19573a17749J2601M2222j35984n6260C4661A1484
9695C24126a21217j2884C666a50717J648l3694B41062c7149m6777m35066h3453
9683A49862b6048B02878F5180d17029p278Q658e3586o4994B505K54657A01626
9671B42639a50B08437c10258a49648f2717A7956M7208J20079C6866e7941A83880
$$ plain form
9752 -337722 -279907 -101864 -127550 -180550 -5847 -267450 -91810 -258292 155933 24617 73663
9741 73663 -287059 50298 -187446 -206503 35552 71466 172773 -4795 -78985 181737 -201203
9729 126384 -148949 -320691 -157248 -275682 39430 -117439 -165104 296905 -7472 -351751
9719 -351751 10939 102098 172026 39635 -94105 -148838 -23014 -6302 -292761 -226193 50088 95329
9707 95329 28527 -189959 24521 -419573 -117749 -105148 -62926 -198910 -255170 34661 11484
9695 324126 -121217 -134101 3666 -150717 -149069 -182763 241062 -37149 -83926 -518992 -83453
9683 149862 -26048 202878 65180 -417029 -424307 -415649 -53586 -118580 2505 257162 101626
9671 242639 -150 208437 -310258 -149648 -62717 17956 65164 185243 36866 -57941 183880
9659C20006A59137a95901E8935c44033N2948R7440Q7094j05105b0108m9521A29934
9647c9989A35441a22065f0423j5854r6787O9373k72287a889j89641A26914R7667
9636B24581a01828L776r6235A20088a33015J7175C810a35548B29511a34803k6689
9625a61492g8885k54184p7592E9707a73832f8460l05493A15004D9213d8296A51870
9613c08575J42720Q1572A9238M0208A7269e3300p5104o5108B98366D4920J35057
9602A79977a6297A05772c0633j8047m8572J7236f471A8329h5152D2448J75354
9591B17802a60966A23512B8779c05423a45470N570j42370b8669j84973j81330
9581c94972A00683C1712i747B7686b05311B82653a06909A20814E3908a32158e8267
$$ plain form
9659 320006 159137 -195901 58935 -344033 -291085 -193645 -106551 -211656 -20108 -69629 129934
9647 -39989 135441 -122065 -60423 -76277 -173064 -103691 -375978 -1889 -191530 126914 224581
9636 224581 -101828 -98052 -194287 120088 -133015 -115840 3810 -135548 229511 -134803 -161492
9625 -161492 -78885 -333069 -410661 59707 -173832 -68460 -373953 115004 49213 -48296 151870
9613 -308575 -165855 -84283 19238 59446 17269 -53300 -128404 -193512 298366 44920 179977
9602 179977 -16297 105772 -30633 -48680 -97252 -80016 -6471 18329 -85152 42448 217802
9591 217802 -160966 123512 28779 -305423 -145470 -139900 -282270 -28669 -213642 -394972
9581 -394972 100683 31712 -9747 27686 -205311 282653 -106909 120814 53908 -132158 -58267
9569h2027o0459G8214c25376E3937R8712n5707K50870b93700c7802J1003E7765
9557b33082h4349b9954j58345Q4399E5543j3123b8933A9323c15518c6238D9560
9545a6743m11479a30632A09942P1630a99422M4131b3433k7617B1655J54202a31692
9533a76051Q7585p1441B36282I7832l4046I762a76904A28116a58662J438p7291
9522b34515h0833B67919f2170b5563D3557a69997H6160B4626d93545K24939P3655
9511a94951M9607k25162a79843b9502k10580J10529A10079K36881C0088c592A11794
9499a74784E8951b11561A21972C3080c16269D61855A45318B295R6597a42477f4134
9487A53901E2027c68727c2348j36410l2964j0634J00856A71681p6917h3506I288
$$ plain form
9569 -82027 -142486 78214 -325376 53937 152649 96942 347812 -293700 -37802 -26799 57765
9557 -233082 -84349 -29954 -188299 -103900 55543 42420 -28933 19323 -315518 -36238 49560
9545 -16743 -428222 -130632 109942 181572 -199422 -155291 -23433 -51050 21655 175857 -131692
9533 -176051 -88466 -159907 236282 97832 63786 9762 -176904 128116 -158662 -157224 -234515
9522 -234515 -80833 267919 -62170 -25563 43557 -169997 86160 24626 -493545 -268606 -194951
9511 -194951 -145344 -370506 -179843 -29502 -240082 -129553 110079 346960 30088 -3592 111794
9499 -174784 58951 -211561 121972 33080 -316269 461855 145318 2295 98892 -142477 -64134
9487 153901 52027 -368727 -32348 -168758 -201722 -212356 -111500 171681 94764 -83506 9288
9475C3032a12405j12788F0852J3051c48742a52411B06222e47276b9350k37973
9465b67323J9399D2450j844d09420a19594d5184j19329N5734A38644M1264g7689
9453I8607J05857f5616k3778L4872n70E0280J37992b68859G8388b16618q9879
9442c06497J08758A52690a28797j37923d549j83804g4314j43607M4721j4675O3998
9431a23877b6132q6855b9097j16901j68139a00304m1762I3111B0545a36458j7317
9420a53775J0288g0488q0170D4831R3581h4507j63482R3814p9922B1748e3363
9408a65436A75696F397a99232E7664A5090i5727F7704a23952I3988N1045d68180
9396A963a63909A13595L6820a03070k9096j6575j72429f881D7415b57925A58945
$$ plain form
9475 33032 -112405 -225193 60852 73903 -348742 -152411 206222 -547276 -29350 -267323
9465 -267323 -247924 42450 40606 -409420 -119594 -45184 -164513 -108779 138644 179908 -77689
9453 98607 204464 -65616 -89394 -54522 -55092 50280 188272 -268859 78388 -216618 -306497
9442 -306497 -197739 152690 -128797 -266720 -4549 -188353 -74314 -217921 -173200 -187875 -123877
9431 -123877 -26132 -112987 -29097 -145998 -314137 -100304 -142066 93111 20545 -136458 -153775
9420 -153775 -143487 -70488 -150658 44831 138412 -84507 -247989 -154175 -234097 21748 -53363
9408 -165436 175696 6397 -199232 57664 15090 -95727 67704 -123952 93988 145033 -468180
9396 1963 -163909 113595 150415 -103070 -132166 -148741 -321170 -6881 47415 -257925 158945
9384a94572O3r7082E8781c9851g236j12148p1140C6710O1088J34166E9558b60631
9371B87567H3459k2748E399a23519A09596R2429i270p531F9307d00912B77391
9359e6025j11241k00569C5630K74982E559b66695h667j61021A3360d31565H9618
9347b6684l2268k62019c4148k02909c4461G2669b39310j53045a3351j77525d6121
9335A195e8508b5632B05045a9516j28987A00690a6857B31847c16897F0058J18229
9324A78287a57510c6821j84406e6214I0986p899B5802h0117B16966a27064L9552
9313h7512G8842L2575n5309e91394a71525Q0366A34486R2606a18396e5838F6704
9301i9900H938b6014o5953r8991M2571j63064J49890c077A89338c8411k99742
$$ plain form
9384 -194572 -194509 -291591 58781 -39851 -7236 -119384 -190524 36710 97798 231964 59558 -260631
9371 287567 83459 60711 5399 -123519 109596 202025 -9270 -16801 69307 -400912 277391
9359 -56025 -167266 -367835 35630 310612 5559 -266695 -8667 -169688 13360 -431565 89618
9347 -26684 -58952 -320971 -34148 -237057 -34461 72669 -239310 -392355 -13351 -190876 -46121
9335 1195 -58508 -25632 205045 -19516 -148503 100690 -16857 231847 -316897 60058 178287
9324 178287 -157510 -36821 -221227 -56214 90986 83087 25802 -80117 216966 -127064 -87512
9313 -87512 78842 111417 56108 -591394 -171525 -91159 134486 227092 -118396 -55838 66704
9301 -99900 8938 -26014 -91967 -190958 -148387 -311451 -161561 -3077 189338 -38411 -338153
9290c38153A9010D932c32064A33961J00818a63514A45648c44358a27011a9709
9279H8689d1794q8641j90124h1192m19114a44292I2269h2194b9208k86918J52020
9268a64106f5995m4722p9910O4582d3507J9462D6869J17627J420G5062L3480M0460
9256A49002R4644c32989F1503K522c76036A87492r2862B8476a83894h7422j01686
9245a89108N3116d943j56064j086j52804L6897a37508j67549g4167l7112d9334
9233b0131m9308l8266e0548o4489q6507j4522H8954P5501b78516O0273d0807k6048
9221f6855q8464H1202P5132e8275A08285a7947F5991g8443J6654B45074a43240
9209b28043A01874A5160b97534h7489j1473A32781b87192B47079a25635p8149
$$ plain form
9290 -338153 19010 4932 -332064 133961 234779 -163514 145648 -344358 -127011 -19709
9279 88689 -41794 -130435 -320559 -81192 -500306 -144292 92269 -82194 -29208 -316126 -164106
9268 -164106 -65995 -110717 -190627 -126045 -43507 -24045 46869 164496 165916 75062 108542 149002
9256 149002 243646 -332989 61503 64025 -376036 187492 94630 28476 -183894 -87422 -189108
9245 -189108 -135992 -4943 -161007 -162093 -314897 -278000 -137508 -305057 -74167 -111279 -49334
9233 -20131 -69439 -107705 -50548 -115037 -201544 -216066 88954 164455 -278516 -218243 -40807 -66855
9221 -66855 -155319 81202 156334 -58275 108285 -17947 65991 -78443 -61789 245074 -143240
9209 -228043 101874 15160 -297534 -87489 -98962 132781 -287192 247079 -125635 -203784
9199b03784k08985A115g1998j6494l35830g3716L2225p5754d0163A30317a94672
9187b0572A2630f0459F9486b58239B1369N6406a67175F4710J18983d691j12026
9176a16717j23105F4206N3005d75406b3962k52145F4242h307G57a88637K1363
9165a67274c6716r2585e6349j98516N3912M6249c4978q9291k17508R8036B21453
9153B716K740K56539c78848A2921J83715a0484k93085B3456a90506g7370b5829
9141a24220K9494j00581i6116m34577b47423A43016a38005A09569a0934j11077
9131a22011A57715N1817c10639J53701k9396j84072h1538q9376B75045f0755a2682
9119a81813M1051q018D2288a25677m4257o4098A81547g4962k58580A5563d04436
$$ plain form
9199 -203784 -412769 1115 -71998 -88492 -424322 -73716 -41491 -117245 -40163 130317 -194672
9187 -20572 12630 -60459 69486 -258239 21369 77775 -167175 64710 183693 -4691 -116717
9176 -116717 -239822 64206 117211 -475406 -23962 -276107 64242 -8307 757 -188637 -167274
9165 -167274 -36716 -129301 -56349 -254865 -200953 -154704 -34978 -124269 -341777 -243741 221453
9153 2716 5456 261995 -378848 12921 196636 -10484 -303569 23456 -190506 -77370 -25829
9141 -124220 -94726 -195307 -96116 -530693 -247423 143016 -138005 109569 -10934 -122011
9131 -122011 157715 209532 -310639 -156938 -186334 -370406 -81538 -170914 275045 -60755 -12682
9119 -181813 -140762 -148780 42288 -125677 -169934 -234032 181547 -74962 -333542 15563 -404436
9107a00360H9792a5862l3478q0892q10D094Q778c32084G6982B5839a61058H8259
9094a66775k3169F7260a51240a1794k03174g3966a7468F3541f8872j36190j06209
9083c11271A4245J17071m8192B3913e8066k87750a20876r7473p035P2260A60878
9071B49322A09365g8900A69281a289A47659F82a0761l39547P3352N1623f0509
9059a97981J8635f3045k5860l26132B1093J24503a29839I4523c76972D38198d1690
9047i0733b8399B59185q3807n8006i3815c0434B3433c20300B93877M0777i0899
9035c51506A46561a33626B2030a94354h6775j47184F880J14149b60387a20168
9024A1365a4681n05007g5722j28407h1078A55405a17390I4896A6746c82849C14101
$$ plain form
9107 -100360 89792 -15862 -49340 -130232 -131042 4094 12872 -332084 76982 25839 -161058 88259
9094 -166775 -189944 67260 -151240 -11794 -214968 -73966 -17468 63541 -68872 -205062 -311271
9083 -311271 14245 131316 83124 23913 -58066 -345816 -120876 -218349 -225384 -153124 160878
9071 249322 109365 -78900 169281 -1289 147659 682 -10761 -350308 -276956 -225333 -60509
9059 -197981 -179346 -63045 -88905 -415037 21093 145596 -129839 94523 -376972 438198 -41690
9047 -90733 -28399 259185 175378 117372 -93815 -30434 23433 -320300 293877 334654 -90899
9035 -351506 146561 -133626 22030 -194354 -86775 -233959 6880 121029 -260387 -120168
9024 11365 -14681 -519688 -75722 -204129 -81078 155405 -117390 94896 16746 -382849 314101
9012C0725b16830j02916A72524i4424A64672C7752a08322G8975b7461j15039O0002
9001h2498k07560J40099k51466A60574a34904l7926a0216m8759C7209f6661A80958
8989f2854G9067a62507b764A74750A0774a36521B97543a29793E5872M8609a80135
8977D2331J34203b40700m2005J8184D6721a7153B8534a56611B56939c04780B3467
8965d3775E6213a95066d8851I3079c45320e5756b3587G1721L05798i4694j79416
8954b74110f7573k3894j52618p609b348k14923B39858C7765K012f1496A29360
8942C3775e356l97687a48295H6010M7850O481m4651P3213N2897A9511K42201c23897
8929c83098C09908C330M39312j36134h8782C89485J00698R92249M110674B706087
$$ plain form
9012 30725 -216830 -319746 172524 -94424 164672 37752 -108322 78975 -27461 -142500 -82498
9001 -82498 -290058 -149959 -401425 160574 -134904 -172830 -10216 -58975 37209 -66661 180958
8989 -62854 79067 -162507 -2764 174750 10774 -136521 297543 -129793 55872 104481 -180135
8977 42331 176534 -240700 -282705 -264521 46721 -17153 28534 -156611 256939 -304780 23467
8965 -43775 56213 -195066 -48851 93079 -345320 -55756 -23587 71721 377519 -94694 -274110
8954 -274110 -67573 -91467 -244085 -251694 -2348 -217271 239858 37765 39777 -61496 129360
8942 33775 -5356 -403043 -148295 86010 133860 140341 95690 168903 221800 19511 261712 -323897
8929 -383098 309908 3330 442642 306508 -88782 389485 490183 1482432 5593106 2706087
8918A029667l97479A52990f9741C06415j46716E2489e9774A44975b974B4474M8535
8907G3009a08768A84592a9080G0858l1592a00207k20928C04410C8416A4242a01061
8895d81188B29515a82125a4541k40200a17705a6285r1734A72355a31891B30832
8884d541G666C033a1230k24434N9684C5476N3147c0130C842b46819J6961D1289
8871i2421A14059a6343j13171C9793g958A24924b70766f4756b0991k37913f3280
$$ plain form
8918 1029667 632188 152990 -69741 306415 159699 52489 -59774 144975 -2974 24474 73009
8907 73009 -108768 184592 -19080 70858 39266 -100207 -321135 304410 38416 14242 -101061
8895 -481188 229515 -182125 -14541 -254741 -117705 -16285 -108019 172355 -131891 230832
8884 -4541 7666 3033 -11230 -235664 -175980 35476 88623 -30130 3842 -246819 -229858 41289
8871 -92421 114059 -16343 -129514 39793 -7958 124924 -270766 -64756 -20991 -258904 -63280
$$ [...]
##END NTUPLES=NMR SPECTRUM
##END=
