##TITLE=AC1679_CTIAH14387_8571323_GAQJE71pzE
##JCAMPDX= 6.0         $$ Bruker NMR JCAMP-DX V2.0
##DATA TYPE= NMR SPECTRUM
##DATA CLASS= NTUPLES
##ORIGIN= BRUKER
##OWNER= Administrator
$$ 1.72 TOPSPIN		Version 2.1
$$ 2014-04-11 22:57:22.614 -0700  Administrator@X
$$ Compression mode = diff/dup
##.OBSERVE FREQUENCY= 400.02188249412
##.OBSERVE NUCLEUS= ^1H
##.ACQUISITION MODE= SIMULTANEOUS (DQD)
##.ACQUISITION SCHEME= undefined
##.AVERAGES= 64
##.DIGITISER RES= 22
##SPECTROMETER/DATA SYSTEM= spect
##.PULSE SEQUENCE= noesygpps1d.comp
##.SOLVENT NAME= COFFEE_meoh
##.SHIFT REFERENCE= INTERNAL, COFFEE_meoh, 1, 14.96128
##AUDIT TRAIL= $$ (NUMBER, WHEN, WHO, WHERE, PROCESS, VERSION, WHAT)
$$ ##TITLE= Audit trail, TOPSPIN		Version 2.1
$$ ##JCAMPDX= 5.01
$$ ##ORIGIN= Bruker BioSpin GmbH
$$ ##OWNER= Administrator
$$ $$ E:\/data/COFFEE/nmr/AC1679_CTIAH14387_8571323_GAQJE71pzE/12/pdata/1/auditp.txt
$$ ##AUDIT TRAIL=  $$ (NUMBER, WHEN, WHO, WHERE, PROCESS, VERSION, WHAT)
(   1,<2014-04-11 22:57:17.067 -0700>,<Administrator>,<X>,<go>,<TOPSPIN 2.1>,
      <created by zg
	started at 2014-04-11 22:45:47.802 -0700,
	POWCHK enabled, PULCHK disabled,
       configuration hash MD5:
       C8 4E 4E 5D D3 5C D8 9E 9F 52 82 E0 59 8A DE 15
       data hash MD5: 64K
       2A B9 07 18 8C DD 8E FD 9C 1A 93 92 74 DF 82 A6>)
(   2,<2014-04-11 22:57:20.302 -0700>,<Administrator>,<X>,<proc1d>,<TOPSPIN 2.1>,
      <Start of raw data processing
       efp LB = 0.3 FT_mod = 6 PKNL = 1 PHC0 = 0 PHC1 = 0 SI = 128K 
       data hash MD5: 128K
       A9 57 56 F6 50 95 9A 99 BE 01 1C BB 54 BE 6B 51>)
(   3,<2014-04-11 22:57:21.458 -0700>,<Administrator>,<X>,<proc1d>,<TOPSPIN 2.1>,
      <pk PHC0 = -81.85913 PHC1 = 0 
       data hash MD5: 128K
       6D C0 FE 59 9B C0 C4 3E 22 DF 40 02 5E 24 DA 02>)
(   4,<2014-04-11 22:57:21.942 -0700>,<Administrator>,<X>,<proc1d>,<TOPSPIN 2.1>,
      <abs ABSG = 1 
       data hash MD5: 128K
       9F 99 FF 2B 7F CB A7 DC BD C4 CF AC 13 01 C2 E0>)
(   5,<2014-04-11 22:57:22.099 -0700>,<Administrator>,<X>,<proc1d>,<TOPSPIN 2.1>,
      <abs ABSG = 2 
       data hash MD5: 128K
       26 14 1C 72 83 4B 2B CB 28 E4 85 CE EA 6E 46 6F>)
(   6,<2014-04-11 22:57:22.192 -0700>,<Administrator>,<X>,<proc1d>,<TOPSPIN 2.1>,
      <abs ABSG = 3 
       data hash MD5: 128K
       25 EE A1 DB 3E CD 6F F8 55 02 4F 30 5E FC 6D E9>)
(   7,<2014-04-11 22:57:22.270 -0700>,<Administrator>,<X>,<proc1d>,<TOPSPIN 2.1>,
      <abs ABSG = 4 
       data hash MD5: 128K
       DD 5F 55 02 71 F6 80 66 3C 3D 8D 05 D7 E8 67 34>)
(   8,<2014-04-11 22:57:22.364 -0700>,<Administrator>,<X>,<proc1d>,<TOPSPIN 2.1>,
      <abs ABSG = 5 
       data hash MD5: 128K
       21 DE B4 58 35 A9 A8 04 8A 18 97 4D 01 58 1A C3>)
$$ ##END=
$$ 
$$ $$ hash MD5
$$ $$ 8F 8C 3B F6 F7 7C 96 3A 1E F1 D4 E2 66 FD 77 4F
##$RELAX= 
##$RELAX= 
##$RELAX= 
##$RELAX= 
##$RELAX= 
##$RELAX= 
##$RELAX= 
##$RELAX= 
$$ Bruker specific parameters
$$ --------------------------
##$DU= <E:\>
##$EXPNO= 12
$$ [...]
##$TP07= 0
##$TPNAME0= <>
##$TPNAME1= <>
##$TPNAME2= <>
##$TPNAME3= <>
##$TPNAME4= <>
##$TPNAME5= <>
##$TPNAME6= <>
##$TPNAME7= <>
##$TPOAL= (0..7)
0.5 0.5 0.5 0.5 0.5 0.5 0.5 0.5
##$TPOFFS= (0..7)
0 0 0 0 0 0 0 0
##$TUNHIN= 0
##$TUNHOUT= 0
##$TUNXOUT= 0
##$USERA1= <user>
##$USERA2= <user>
##$USERA3= <user>
##$USERA4= <user>
##$USERA5= <user>
##$V9= 5
##$VALIST= <valist>
##$VCLIST= <CCCCCCCCCCCCCCC>
##$VD= 0
##$VDLIST= <DDDDDDDDDDDDDDD>
##$VPLIST= <PPPPPPPPPPPPPPP>
##$VTLIST= <TTTTTTTTTTTTTTT>
##$WBST= 1024
##$WBSW= 4
##$XGAIN= (0..3)
0 0 0 0
##$XL= 0
##$YL= 0
##$YMAX_a= 6448492
##$YMIN_a= -13657893
##$ZGOPTNS= <>
##$ZL1= 120
##$ZL2= 120
##$ZL3= 120
##$ZL4= 120
##$ABSF1= 14.96128
##$ABSF2= -5.596902
##$ABSG= 5
##$ABSL= 3
##$ALPHA= 0
##$AQORDER= 0
##$ASSFAC= 0
##$ASSFACI= 0
##$ASSFACX= 0
##$ASSWID= 0
##$AUNMP= <proc_prof1d_extract.lims>
##$AXLEFT= 0
##$AXNAME= <>
##$AXNUC= <1H>
##$AXRIGHT= 0
##$AXTYPE= 0
##$AXUNIT= <>
##$AZFE= 0.1
##$AZFW= 0.1
##$BCFW= 0
##$BC_mod= 0
##$BYTORDP= 0
##$COROFFS= 0
##$CY= 15
##$DATMOD= 1
##$DC= 0
##$DFILT= <>
##$DTYPP= 0
##$F1P= 0
##$F2P= 0
##$FCOR= 0.5
##$FTSIZE= 131072
##$FT_mod= 6
##$GAMMA= 0
##$GB= 0
##$INTBC= 1
##$INTSCL= 1
##$ISEN= 128
##$LB= 0.3
##$LEV0= 0
##$LPBIN= 0
##$MAXI= 10000
##$MC2= 0
##$MEAN= 0
##$ME_mod= 0
##$MI= 0
##$NCOEF= 0
##$NC_proc= -2
##$NLEV= 6
##$NOISF1= 0
##$NOISF2= 0
##$NSP= 0
##$NTH_PI= 0
##$NZP= 0
##$OFFSET= 14.96128
##$PC= 1
##$PHC0= -81.85913
##$PHC1= 0
##$PH_mod= 1
##$PKNL= yes
##$PPARMOD= 0
##$PPDIAG= 0
##$PPIPTYP= 0
##$PPMPNUM= 2147483647
##$PPRESOL= 1
##$PSCAL= 4
##$PSIGN= 0
##$PYNMP= <proc.py>
##$REVERSE= no
##$SF= 400.020009523995
##$SI= 131072
##$SIGF1= 0
##$SIGF2= 0
##$SINO= 400
##$SIOLD= 131072
##$SPECTYP= <>
##$SREGLST= <1H.CDCl3>
##$SSB= 0
##$STSI= 131072
##$STSR= 0
##$SW_p= 8223.68421052631
##$SYMM= 0
##$S_DEV= 0
##$TDeff= 65536
##$TDoff= 0
##$TI= <>
##$TILT= no
##$TM1= 0
##$TM2= 0
##$TOPLEV= 0
##$USERP1= <user>
##$USERP2= <user>
##$USERP3= <user>
##$USERP4= <user>
##$USERP5= <user>
##$WDW= 1
##$XDIM= 131072
##$YMAX_p= 434627352
##$YMIN_p= -12560
##$CURPLOT= <Network HP LaserJet P1505>
##$CURPRIN= <$Network HP LaserJet P1505>
##$DFORMAT= <normdp>
##$LAYOUT= <+/1D_H.xwp>
##$LFORMAT= <normlp>
##$PFORMAT= <normpl>
##$SURQMSG= 1
$$ End of Bruker specific parameters
$$ ---------------------------------
##NTUPLES= NMR SPECTRUM
##VAR_NAME=  FREQUENCY,     SPECTRUM/REAL,   SPECTRUM/IMAG
##SYMBOL=    X,             R,               I
##VAR_TYPE=  INDEPENDENT,   DEPENDENT,       DEPENDENT
##VAR_FORM=  AFFN,          ASDF,            ASDF
##VAR_DIM=   131072,        131072,          131072
##UNITS=     HZ,            ARBITRARY UNITS, ARBITRARY UNITS
##FACTOR=    0.0627417313425164, 1,          1
##FIRST=     8223.62146879497, 1,            -58345
##LAST=      0,             790,             -58071
##MIN=       0,             -12560,          0
##MAX=       8223.62146879497, 434627352,    0
$$ Real data points
##PAGE= N=1
##DATA TABLE= (X++(R..R)), XYDATA
$$ [...]
61592D05751k058k578k730k483k155j708j033n94q55j414j653j783k253k629k205
$$ 405751 403693 401115 398385 395902 393747 392039 391006 390412 389557 388143 386490 384707 382454 379825 377620
61577C77620j309q14o64j78M99O26K86K43M59J64n39n99K60J074J153R03P95O90
$$ 377620 376311 375497 374833 374655 375154 375780 376066 376309 376768 376932 376393 375794 376054 377128 378281 379184 379979 380669
61559C80669N26O21R10Q96O33Q21J540J951J603J055Q02N28j1l47j14K10L8m84
$$ 380669 381195 381816 382726 383622 384255 385076 386616 388567 390170 391225 392027 392555 392544 392197 392083 392293 392331 391847
61541C91847q34p75k23Q66K049K457J851J075R94J462J861K135K654L337L536
$$ 391847 391013 390238 390015 390881 392930 395387 397238 398313 399307 400769 402630 404765 407419 410756 414292
61526D14292K770J258k73j192j520j893k709l493l486k733k019j650j147k17N71
$$ 414292 417062 418320 418047 416855 415335 413442 410733 407240 403754 401021 399002 397352 396205 395988 396559
61511C96559O21J53j84j20K35Q04J410J506O81o02j285q67K1L70k0l37K63J637
$$ 396559 397180 397333 397149 397029 397264 398068 399478 400984 401665 401063 399778 398911 398932 399302 399282 398945 399208 400845
61493D00845K826L149K816K447K324K348K431K595K836L028K906K139P65m27m85
$$ 400845 403671 406820 409636 412083 414407 416755 419186 421781 424617 427645 430551 432690 433455 433028 432543
61478D32543N23J474J649J609K125K869K955K281J502Q48p1j346k400k718k400
$$ 432543 433066 434540 436189 437798 439923 442792 445747 448028 449530 450378 450307 448961 446561 443843 441443
61463D41443j913j734k158l026l673l578k957k328j738r56j40K96M48Q09J432
$$ 441443 439530 437796 435638 432612 428939 425361 422404 420076 418338 417382 417242 417538 417986 418795 420227
61448D20227J814J733J633J939K465K678K324J624J011P67Q45J089J559K345L075
$$ 420227 422041 423774 425407 427346 429811 432489 434813 436437 437448 438215 439060 440149 441708 444053 447128
61433D47128L171K672K217K002J462L92m00j57P69J571K082K488K637K464K468
$$ 447128 450299 452971 455188 457190 458652 459044 458644 458487 459256 460827 462909 465397 468034 470498 472966
61418D72966K863K842J750M35J96Q23R58K48k61O8N06J91p30j577j980j911j457
$$ 472966 475829 478671 480421 480856 481052 481875 482833 483081 482820 482888 483394 483585 482855 481278 479298 477387 475930
61401D75930q54l01K83R66J402J264Q52P11Q16P94O59O90Q33Q99J030J314J348
$$ 475930 475076 474775 475058 476024 477426 478690 479542 480253 481069 481863 482522 483212 484045 484944 485974 487288 488636
61384D88636R18O30R80J389J155Q19J294K146K135J221N51N96P42O68O61N47j73
$$ 488636 489554 490184 491164 492553 493708 494527 495821 497967 500102 501323 501874 502470 503212 503880 504541 505088 504915
61367E04915j002q33J66N78j9m31M2N45L57J32N56J145J367J755K862M117M784
$$ 504915 503913 503080 503246 503824 503805 503374 503416 503961 504318 504450 505006 506151 507518 509273 512135 516252 521036
61350E21036N187N993O990P566P721P672O970N082K519N54m1M67J261J604J330
$$ 521036 526223 532216 539206 546772 554493 562165 569135 574217 576736 577290 577249 577716 578977 580581 581911
61335E81911J026J335J935J854R23J61L38R70J226J057P51K33n63j072o17P48
$$ 581911 582937 584272 586207 588061 588984 589145 589483 590453 591679 592736 593487 593720 593157 592085 591468 592216
61319E92216K311L427L882L995M536N983P724Q577Q341Q139Q947J0586J2429J4251
$$ 592216 594527 597954 601836 605831 610367 616350 624074 632651 640992 649131 658078 668664 681093 695344
61305F95344J5877J6760J6654J6055J5492J4724J3107J0347O672K707o06k638
$$ 695344 711221 727981 744635 760690 776182 790906 804013 814360 821032 823739 823133 820495
61293H20495l856n315p210q657r135r232r689j0486j1285j1868j1833j0728q936
$$ 820495 816639 811324 804114 795457 786322 777090 767401 756915 745630 733762 721929 711201 702265
61280G02265p528o813n972m566l313k742k200j065Q5M58M20Q17J599K104K177
$$ 702265 694737 687924 681952 677386 674073 671331 669131 668066 668151 668609 669029 669846 671445 673549 675726
61265F75726K174K152J979J882K201K869L698M787O135P248P604P132N916M070
$$ 675726 677900 680052 682031 683913 686114 688983 692681 697468 703603 710851 718455 725587 731503 735573
61251G35573K153R68N05j25j273k211k434k475k748k762k324k315l095l242j375
$$ 735573 737726 738694 739199 739074 737801 735590 733156 730681 727933 725171 722847 720532 717437 714195 712820
61236G12820J550L281L098K218J699J486J445K032L575N799Q139R952J0635J0218
$$ 712820 714370 717651 720749 722967 724666 726152 727597 729629 733204 739003 747142 757094 767729 777947
61222G77947R645R737J0163J0086R430Q735Q248Q077Q672J0104J1246J0956R733
$$ 777947 787592 797329 807492 817578 827008 835743 843991 852068 860740 870844 882090 893046 902779
61209I02779Q956Q661P595N494L806L611M144M201L971M627O601R116J1204J2612
$$ 902779 911735 920396 927991 933485 937291 940902 945046 949247 953218 957845 964446 973562 984766 997378
61195I97378J3721J4964J6352J7523J8173J8240J7520J5511J2051P881M125J327
$$ 997378 1011099 1026063 1042415 1059938 1078111 1096351 1113871 1129382 1141433 1149314 1153439 1154766
61183A154766n69j671k129k565l766n799p953r645j0959j2240j3516j4502j4933
$$ 1154766 1154197 1152526 1150397 1147832 1144066 1138267 1130314 1120669 1109710 1097470 1083954 1069452 1054519
61170A054519j4788j4349j4043j4110j4477j4945j5292j5219j4575j3696j3044
$$ 1054519 1039731 1025382 1011339 997229 982752 967807 952515 937296 922721 909025 895981
61159H95981j2440j1248r497q038p234o298m535k456q18P19L011N874Q180R284
$$ 895981 883541 872293 862796 854758 847524 841226 836691 834235 833417 834136 837147 843021 851201 860485
61145H60485R390Q610O683L851J151n35j228j408j294p18N40K498M827O966Q581
$$ 860485 869875 878485 885168 889019 890170 889635 888407 886999 885705 884987 885527 888025 892852 899818 908399
61130I08399R887J1317J2985J4646J6069J7330J8851K1160K4298K7446K9629L0916
$$ 908399 918286 929603 942588 957234 973303 990633 1009484 1030644 1054942 1082388 1112017 1142933
61118A142933L2337L4382L6219L6842L6365L5600L4941L4283L3658L3161L2502
$$ 1142933 1175270 1209652 1245871 1282713 1319078 1354678 1389619 1423902 1457560 1490721 1523223
61107A523223L1196K9149K6646K3940K1149J8268J4990J0927O291J870k005n923
$$ 1523223 1554419 1583568 1610214 1634154 1655303 1673571 1688561 1699488 1705779 1707649 1705644 1699721
61095A699721j0475j5397k0033k3964k6752k7907k7799k7887k9098l0538l0705
$$ 1699721 1689246 1673849 1653816 1629852 1603100 1575193 1547394 1519507 1490409 1459871 1429166
61084A429166k9500k8055k7028k6081k4832k3375k1855k0353j9121j8279j7383
$$ 1429166 1399666 1371611 1344583 1318502 1293670 1270295 1248440 1228087 1208966 1190687 1173304
61073A173304j5896j3984j2306j1196j0579j0378j0378j0000q886p476o464n929
$$ 1173304 1157408 1143424 1131118 1119922 1109343 1098965 1088587 1078587 1069701 1062225 1055761 1049832
61061A049832n500n030m544l911l125k536k175j373K32J953L070M101O003Q560
$$ 1049832 1044332 1039302 1034758 1030847 1027722 1025186 1023011 1021638 1021870 1023823 1026893 1030994 1036997 1045557
61047A045557J0635J1803J2682J3783J4975J6031J6828J7086J6750J6501J7081
$$ 1045557 1056192 1067995 1080677 1094460 1109435 1125466 1142294 1159380 1176130 1192631 1209712
61036A209712J8182J8842J8798J8652J8736J8714J8342J7825J7420J7264J7617
$$ 1209712 1227894 1246736 1265534 1284186 1302922 1321636 1339978 1357803 1375223 1392487 1410104
61025A410104J8630K0063K1863K4634K8627L2522L4400L4045L3332L4165L6954
$$ 1410104 1428734 1448797 1470660 1495294 1523921 1556443 1590843 1624888 1658220 1692385 1729339
61014A729339M1282M7078N4546O3556P3743Q5042R7723J12175J28987J49255J74456
$$ 1729339 1770621 1817699 1872245 1935801 2009544 2094586 2192309 2304484 2433471 2582726 2757182
61003B757182K05635K42628K84543L31368L84655M46175N16917N98729O96368
$$ 2757182 2962817 3205445 3489988 3821356 4206011 4652186 5169103 5767832 6464200
60994F464200Q16427R65126J148260J367911J607744J816257J914647J838718
$$ 6464200 7280627 8245753 9394013 10761924 12369668 14185925 16100572 17939290
60986A7939290J583372J207336P96474M26190J52103J2810J5651J13023K06739
$$ 17939290 19522662 20729998 21526472 21952662 22104765 22117575 22133226 22246249 22452988
60977B2452988J94815K6787k77717o54396j032282j354967j584695j703895j717744
$$ 22452988 22647803 22674590 22396873 21742477 20710195 19355228 17770533 16066638 14348894
60968A4348894j649905j529882j381892j222642j063955r13759p76030o52751
$$ 14348894 12698989 11169107 9787215 8564573 7500618 6586859 5810829 5158078
60960E158078n45967m56717l83225l22357k72436k32921k01989j76650j55154
$$ 5158078 4612111 4155394 3772169 3449812 3177376 2944455 2742466 2565816 2410662
60951B410662j37464j23189j10901r9676q9725q1119p3318o6256o0572n6409n3171
$$ 2410662 2273198 2150009 2039108 1939432 1849707 1768588 1695270 1629014 1568442 1512033 1458862
60940A458862n0673m9271m8641m7660m5864m3777m1597l8765l5253l2050k9850
$$ 1458862 1408189 1358918 1310277 1262617 1216753 1172976 1131379 1092614 1057361 1025311 995461
60929I95461k8121k5984k3255k0403j8119j6988j6770j6188j4355j2159j1037
$$ 995461 967340 941356 918101 897698 879579 862591 845821 829633 815278 803119 792082
60918G92082j0684r488p195n413n180n649n737n512n318m822l820k933k649k553
$$ 792082 781398 771910 764715 759302 754122 748473 742736 737224 731906 727084 723264 720331 717682 715129
60904G15129k076j377r20r66j692l028m204m453m290n044o846q349q658q296p845
$$ 715129 713053 711676 710756 709790 708098 705070 700866 696413 692123 687079 680233 671884 663226 654930 647085
60889F47085p007n629m450m031l916l550l158l117l322l674m327m976m860m002
$$ 647085 640078 634449 629999 625968 622052 618502 615344 612227 608905 605231 600904 595928 591068 587066
60875E87066l460l797m190l729k730k095k044k091j744p97N25J474J432P79N08
$$ 587066 583606 579809 575619 571890 569160 567065 565021 562930 561186 560389 560914 562388 563820 564599 565107
60860E65107R20J529K035K491K616K156J762K254L044K784J556P45P29M64l60
$$ 565107 566027 567556 569591 572082 574698 576854 578616 580870 583914 586698 588254 588999 589728 590192 589832
60845E89832p08k24J30K6L31R26J34k520n092o076o488p593q527q133p408p828
$$ 589832 589124 588900 589030 589056 589387 590313 590447 587927 582835 576759 570271 562678 554151 546018 538610 530782
60829E30782q536p620n324l651l295l155k696k617l070l075k173j200r91j367
$$ 530782 522246 514626 509302 505651 502356 499201 496505 493888 490818 487743 485570 484370 483379 482012
60815D82012j774k032k217k391k605k766k580k051j719j917k228k126j742j418
$$ 482012 480238 478206 475989 473598 470993 468227 465647 463596 461877 459960 457732 455606 453864 452446
60801D52446j019l19M18P64O94L56j66n03j29P31J098O47K32M32O00J07m62k95
$$ 452446 451427 451108 451526 452290 452984 453340 453174 452671 452542 453273 454371 455018 455250 455682 456282 456389 455927 455632
60783D55632K91N14L67K34n1p44j401j497j300j272j157n93mL2k68m12n35r13
$$ 455632 455923 456437 456804 457038 456987 456243 454842 453345 452045 450773 449616 449023 449019 449051 448783 448371 447836 446923
60765D46923j144p51k4N32J042J731K152J836J217J053J403J818K029J824R17
$$ 446923 445779 445028 445004 445536 446578 448309 450461 452297 453514 454567 455970 457788 459817 461641 462558
60750D62558m11j202j050o27m85k13N17J204J554K055K633K011l86l098m457m648
$$ 462558 462147 460945 459895 459268 458783 458570 459087 460291 461845 463900 466533 468544 468158 465060 460603 455955
60734D55955m654m398l483k678k841l212k531j172m13k49K75J037R91J37m08j49
$$ 455955 451301 446903 443420 440742 437901 434689 432158 430986 430573 430324 430599 431636 432627 432764 432356 432207
60718D32207L83P81R91P26p7n49k3O83M65j65j5O37O06M2J17P17N19o70j579j627
$$ 432207 432590 433371 434362 435088 435011 434462 434439 435122 435587 435422 435407 436044 436650 436692 436809 437526 438045 437375 435796 434169
60698D34169j557j693j374n06j8l40r08j458k317l122k830j451l05n3J36R84K040
$$ 434169 432612 430919 429545 429039 429021 428681 427773 426315 423998 420876 418046 416595 416290 416237 416373 417357 419397
60681D19397K797L521M378M860M624M024L334K472J721J660K050J997J440J306
$$ 419397 422194 425715 430093 434953 439577 443601 446935 449407 451128 452788 454838 456835 458275 459581
60667D59581J795J830P34p33j638k015k158j852j048m18m89r06j098j015p17n3
$$ 459581 461376 463206 463940 463207 461569 459554 457396 455544 454496 454078 453589 452683 451585 450570 449853 449800
60651D49800Q41J393J367J196J252J445J789K498L222L010J435q72l088m874n932
$$ 449800 450641 452034 453401 454597 455849 457294 459083 461581 464803 467813 469248 468376 465288 460414 454482
60636D54482n808m535k880j517o04k73p47j645j987j334k94M35Q98J379J702J511
$$ 454482 448674 444139 441259 439742 439138 438865 438118 436473 434486 433152 432858 433293 434191 435570 437272 438783
60620D38783Q96L95N25J356K259K276J147k38q99r37r98j068p25j88l5j03K10
$$ 438783 439679 440074 440599 441955 444214 446490 447637 447399 446500 445563 444565 443497 442772 442584 442549 442446 442656
60603D42656P25P09K02j06j90o30j257j232n82k34l38nJ003J784J977K401L408
$$ 442656 443381 444090 444292 444186 443996 443366 442109 440877 440295 440061 439723 439718 440721 442505 444482 446883 450291
60586D50291L986L338K169J502J279R84P04P31Q71R68J366K107K507K242K092
$$ 450291 454277 457615 459784 461286 462565 463549 464253 464984 465855 466823 468189 470296 472803 475045 477137
60571D77137K792L851M386M488M943O040P460Q984J0478J1540J1833J1642J1501
$$ 477137 479929 483780 488166 492654 497597 503637 511097 520081 530559 542099 553932 565574 577075
60558E77075J1455J1067J0020Q374O346M063J476j494m441o285o195m674l053
$$ 577075 588530 599597 609617 617991 624337 628400 629876 628382 623941 617656 611461 606787 603734
60545F03734k014j258n89k96j84P01K832N434P519R025J0449J1987J3683J5895
$$ 603734 601720 600462 599873 599577 599393 600094 602926 608360 615879 624904 635353 647340 661023 676918
60531F76918J8794K1661K3246K2898K1028J8514J5787J2528Q260L261j389m816
$$ 676918 695712 717373 740619 763517 784545 803059 818846 831374 839634 842895 841506 836690
60519H36690p121q862j0270j1422j2548j3503j3472j2053j0119q667p385n476
$$ 836690 829569 820707 810437 799015 786467 772964 759492 747439 737320 728653 721268 715792
60507G15792l352k072j377J25K827N748Q366J1251J4579J7641K0351K3728K8217
$$ 715792 712440 710368 708991 709116 711943 717691 726057 737308 751887 769528 789879 813607 841824
60494H41824L2822L6631L9960M3287M6232M8409N0113N1245N0559M7150M1853
$$ 841824 874646 911277 951237 994524 1040756 1089165 1139278 1190523 1241082 1288232 1330085
60483A330085L6224L0648K4278J6358O823l974j5349k6390l6460m5354n2666n7598
$$ 1330085 1366309 1396957 1421235 1437593 1444416 1440442 1425093 1398703 1362243 1316889 1264223 1206625
60471A206625n9774n9733n8269n5778n2445m8494m4022l9137l4429l0606k7470
$$ 1206625 1146851 1087118 1028849 973071 920626 872132 828110 788973 754544 723938 696468
60460F96468k4083k0194j6700j4455j3348j2786j2298j1442r998q495p754p636
$$ 696468 672385 652191 635491 621036 607688 594902 582604 571162 561164 552669 544915 537279
60448E37279p200o189n350n049m772m267l923l605k462n81M76k88j746k097j111
$$ 537279 530079 523890 518540 513491 508719 504452 500529 496924 494462 493881 494357 494069 492323 490226 489115
60433D89115PL15j47q88j532k062k755l528l436j750O18J925J929K039K874L249
$$ 489115 489122 489437 489290 488402 486870 484808 482053 478525 475089 473339 473957 475882 477811 479850 482724 485973
60417D85973K302R97N44O16K68l84o11k96K60J074K018K394J856J133J021J291
$$ 485973 488275 489272 489816 490432 490700 490316 489705 489409 489669 490743 492761 495155 497011 498144 499165 500456
60401E00456J299J020P63N85O06J133J898K047J481J189J653K040J755J586K293
$$ 500456 501755 502775 503538 504123 504729 505862 507760 509807 511288 512477 514130 516170 517925 519511 521804
60386E21804L146L095K468K292K614K733K455K044J484P82M75Q79J352J213P79
$$ 521804 524950 528045 530513 532805 535419 538152 540607 542651 544135 544917 545392 546271 547623 548836 549615
60371E49615P38J059J418J959K697K921K161J129P29Q13Q31J068K045L253L599
$$ 549615 550353 551412 552830 554789 557486 560407 562568 563697 564426 565239 566070 567138 569183 572436 576035
60356E76035K849J722R06O81J128J939K491K687L180M223N058N038M534M020L208
$$ 576035 578884 580606 581512 582193 583321 585260 587751 590438 593618 597841 602899 607937 612471 616491 619699
60341F19699J915Q16L48k13j566l108l898m070m181m057l391k801l005l568l611
$$ 619699 621614 622430 622778 622565 620999 617891 613993 609923 605742 601685 598294 595493 592488 588920 585309
60326E85309l179k850k620k263k069k234k132j315m58k42j55N06J252J419J639
$$ 585309 582130 579280 576660 574397 572328 570094 567962 566647 566189 565947 565792 566298 567550 568969 570608
60311E70608K929M911O441P405Q462R559J0082J0054R930R641R153R320J0783
$$ 570608 573537 578448 584889 592294 600756 610315 620397 630451 640381 650022 659175 668495 679278
60298F79278J2579J3230J2602J1396R451O207K266j184m109p201j0110j1764j2095
$$ 679278 691857 705087 717689 729085 738536 744743 747009 745825 741716 734515 724405 712641 700546
60285G00546j1899j1267r861q327p749p858p497o705o572p148p297o695o191o096
$$ 700546 688647 677380 667519 659192 651443 643585 636088 629383 622811 615663 608366 601671 595480 589384
60271E89384n794n256n229n627n318l938k471j721j487j521j909k237j754o90
$$ 589384 583590 578334 573105 567478 562160 558222 555751 554030 552543 551022 549113 546876 545122 544432
60257E44432j92o35j204j221p17L48K016L379L238J907R32Q75Q82O23R15J887
$$ 544432 544240 543605 542401 541180 540463 540811 542827 546206 549444 551351 552283 553158 554040 554663 555578 557465
60241E57465K309J444J33p08j275j805j747r09k25l70n77J58J618K970M045N149
$$ 557465 559774 561218 561351 560643 559368 557563 555816 554907 554682 554312 553735 553893 555511 558481 562526 567675
60225E67675O166O699O706O487O370O696P563Q416Q523Q075Q075Q916R864J0216
$$ 567675 573841 580540 587246 593733 600103 606799 614362 622778 631301 639376 647451 656367 666231 676447
60211F76447J0212J0417J0940J1529J1851J1538J0583R708R595R800R326Q163
$$ 676447 686659 697076 708016 719545 731396 742934 753517 763225 772820 782620 791946 800109
60199H00109P224O809O264N257M162K968J108j293l233m383n594p400r132j0064
$$ 800109 807333 814142 820406 825663 829825 832793 833901 832608 829375 824992 819398 811998 802866 792802
60185G92802j0390j0488j0288j0010j0325j1092j0970r174o748n233m877m937
$$ 792802 782412 771924 761636 751626 741301 730209 719239 710065 703317 698084 693207 688270
60173F88270n005n041m724l708k257r19J15Q17Q92J51j005j945k365k219j479
$$ 688270 683265 678224 673500 669792 667535 666616 666731 667548 668440 668591 667586 665641 663276 661057 659578
60158F59578m08L86N27K42p9k79k37J91P98J115J105J275J883K542K930L320M056
$$ 659578 659170 659556 660083 660325 660246 659967 659730 659921 660719 661834 662939 664214 666097 668639 671569 674889 678945
60141F78945M909N384N364N252N597O641P965Q746Q659Q367Q595R113R226Q928
$$ 678945 683854 689238 694602 699854 705451 712092 720057 728803 737462 745829 754424 763537 772763 781691
60127G81691Q668Q269P161N667M832M847M757M057L455L598M042M069L692L269
$$ 781691 790359 798628 805789 811456 816288 821135 825892 829949 833404 837002 841044 845113 848805 852074
60113H52074K788K151J635J462J331P54l67j874l601n277o546p323p873q343q539
$$ 852074 854862 857013 858648 860110 861441 862195 861828 859954 856353 851076 844530 837207 829334 820991 812452
60098H12452q252p536o686o091n972n984n427m146k843k134j830j629j781k284
$$ 812452 804200 796664 789978 783887 777915 771931 766504 762358 759515 757381 755551 753922 752141 749857
60084G49857k286j292k98m54j215j189l98j32q21j706k565m099o375q356r347
$$ 749857 747571 746279 745981 745527 744312 743123 742725 742593 741772 740066 737501 733402 727027 718671 709324
60069G09324r647r543q934q145p835p779p081n757m792m400l687k343j210p17
$$ 709324 699677 690134 681200 673055 665220 657441 650360 644603 639811 635411 631724 629381 628171 627454
60055F27454k05O20J021P38P69J895L501M689N424O016O451O853P611Q429Q369
$$ 627454 627249 627869 628890 629628 630397 632292 635793 640482 645906 651922 658373 665226 672837 681266 689635
60040F89635P365O582O707O940O387N218L830K048n6j644k308k778l685m595n149
$$ 689635 697000 703582 710289 717229 723616 728834 732664 734712 734656 733012 730704 727926 724241 719646 714497
60025G14497o105q207j0797j2553j3090j2994j2786j2539j2081j1056r337p564
$$ 714497 708392 700185 689388 676835 663745 650751 637965 625426 613345 602289 592952 585388
60013E85388o626o360n712m453l597l701l925l402k477j819j315o38k1L55R20
$$ 585388 578762 572402 566690 562237 558640 554939 551014 547612 545135 543316 542001 541363 541342 541697 542617
59998E42617J910K733K777K240J636J246J343K196L364L983M078M525N430N750
$$ 542617 544527 547260 550037 552277 553913 555159 556502 558698 562062 566045 570123 574648 580078 585828
59984E85828N023M098L559K778J353J00l63q02k068l733m951n631n796m935l140
$$ 585828 590851 594949 598508 601286 602639 602739 602376 601574 599506 595773 590822 585191 579395 574460 571320
59969E71320j827k054k997l189k455j497m95O44J418J389J148J510K239K616K698
$$ 571320 569493 567439 564442 561253 558798 557301 556806 557450 558868 560257 561405 562915 565154 567770 570468
59954E70468K948L163K846K229J942K027K043J853J581J202P71N70N52K55l34
$$ 570468 573416 576579 579425 581654 583596 585623 587666 589519 591100 592302 593073 593643 594195 594450 594116
59939E94116n51j67J49mj30O0M5k83M6J643L680N138N984O327N625L855K255J594
$$ 594116 593565 593398 593547 593543 593413 593473 593518 593235 593281 594924 598604 603742 609726 616053 621678 625533 627788 629382
59921F29382Q68r55k979l692l271k903k609j529J79J431K000K603L368L631L258
$$ 629382 630250 629295 626316 622624 619353 616450 613841 612312 612491 613922 615922 618525 621893 625524 628782
59906F28782K854K602K064J257Q09R44J093P00j76j090j551j249l20Q18K131L915
$$ 628782 631636 634238 636302 637559 638368 639312 640405 641105 640929 639839 638288 637039 636719 637537 639668 643583
59890F43583N854O845O327N072M115L636L443L757M705N726O191O132N889N621
$$ 643583 649437 656282 662609 667681 671796 675432 678875 682632 687337 693063 699254 705386 711275 716896
59876G16896N562N937O169N268L439K142J997J829N92j089k190k839l510l913
$$ 716896 722458 728395 734564 739832 743271 745413 747410 749239 749831 748742 746552 743713 740203 736290
59862G36290l769l627l796l599k719k092k241k076o54J030J543J160J002J109
$$ 736290 732521 728894 725098 721499 718780 716688 714447 712371 711717 712747 714290 715450 716452 717561
59848G17561J006J221K529M315N323N451N460N610N817O319O894O369M349K429
$$ 717561 718567 719788 722317 726632 731955 737406 742866 748476 754293 760612 767506 773875 778224 780653
59834G80653K180K960L341L558M686O295O930O348N274L550M77l441o827r196
$$ 780653 782833 785793 789134 792692 797378 803673 810603 816951 822225 825775 826252 822811 815984 806788
59820H06788j0883j1751j1583j1075j0859j0223q463o544n643m949l159j162q41
$$ 806788 795905 784154 772571 761496 750637 740414 731951 725407 719764 714815 711656 710494 709653
59807G09653j809j979r71l29m88k20P27R84L6r85j505k313l629m391m223m188
$$ 709653 707844 705865 704894 704565 704077 703857 704584 705568 705604 704619 703114 700801 697172 692781 688558 684370
59791F84370m915n570n427m892m357l540k531k172k778l631m096m158l710k578
$$ 684370 679455 673885 668458 663566 659209 655669 653138 650966 648188 644557 640461 636303 632593 630015
59777F30015j345q67q55l82L49K94l21J6J736L492M218M350M462M307L799L637
$$ 630015 628670 627803 626948 626566 626915 627209 626888 626904 628640 632132 636350 640700 645162 649469 653268 656905
59761F56905M295N382O405P247P733P780P943Q740R569R517R022R256J0123J0486
$$ 656905 661200 666582 672987 680234 687967 695747 703690 712430 721999 731516 740538 749794 759917 770403
59747G70403J0193J0095J0007Q682O073L708K411J396R5r07j297j706k357k614
$$ 770403 780596 790691 800698 809380 815453 819161 821572 822968 823063 822156 820859 819153 816796 814182
59733H14182k404k534l022k779j628r65j595k412k203j369q93p45l57K87Q37J156
$$ 814182 811778 809244 806222 803443 801815 800850 799255 796843 794640 793271 792378 791633 791276 791563 792400 793556
59717G93556J102N37n1J65J119J796J763J705K125K556K471K130K125K827M278
$$ 793556 794658 795195 795144 795309 796428 798224 799987 801692 803817 806373 808844 810974 813099 815926 820204
59702H20204N920O626O014N350N881O765O223M445L430L982M833N016N008N076
$$ 820204 826124 832750 838764 844114 849995 856760 862983 867428 870858 874840 879673 884689 889697 894773
59688H94773M378K509L39j404k950m311m792m271l697l724m139m919o391q002
$$ 894773 899151 901660 901999 900595 897645 893334 888542 884271 880574 876850 872711 867792 861401 853399
59674H53399q494p773p147p277p464p277p233p314o571m868l339k574j887r35
$$ 853399 844905 837132 829985 822708 815244 807967 800734 793420 786849 781981 778642 776068 774181 773246
59660G73246l18L4J160L095M351M276M019M376M495L869L579M313M865M018K386
$$ 773246 772928 772962 774122 777217 781568 785844 789863 794239 798734 802603 806182 810495 815360 819378 821764
59645H21764R74o07l025n634p473q760r978j0574r900q619p850p651p374o763
$$ 821764 822738 822131 819106 813472 805999 797239 787261 776687 766787 758168 750318 742667 735293 728530
59631G28530n782m247k527j721k333l558m576n537o599p152o834o270n993n616
$$ 728530 722748 718501 715974 714253 711920 708362 703786 698249 691650 684498 677664 671394 665401 659785
59617F59785m838m133l788l342k669k374k518k203j118o9O96K038L971M849L788
$$ 659785 654947 650814 647026 643684 641015 638641 636123 633920 632802 632733 633429 635467 639438 644287 648075
59602F48075K255J895K169J658M81j88j38j04l88o87p74m98K69J010P70l45r83
$$ 648075 650330 652225 654394 656052 656533 656345 656207 656103 655715 655028 654254 653756 654025 655035 655805 655460 654477
59585F54477n60j31o05j404j829k292l090l394k712k050k341k858k552j751j283
$$ 654477 653917 653786 653181 651777 649948 647656 644566 641172 638460 636410 634069 631211 628659 626908 625625
59570F25625r57k98K10k9n38o21n32o41n05J12L52l66j115r28m22o30j141q25
$$ 625625 624668 624370 624580 624551 624013 623392 622860 622219 621714 621826 622178 621812 620697 619769 619347 618717 617576 616751
59552F16751L37J496K281K727K612K033J877K586L272L130K873L603N108O505
$$ 616751 617088 618584 620865 623592 626204 628237 630114 632700 635972 639102 641975 645578 650686 657191
59538F57191P763R425J1560J3991J6857J9733K1018J9319J4958R337L610j274
$$ 657191 664954 674379 685939 699930 716787 736520 757538 776857 791815 801152 804762 803488
59526H03488m286n122m568l391j743j72K06p60j914k760m177o330p754p762p842
$$ 803488 799202 794080 789512 786121 784378 784206 784412 783652 781738 778978 774801 768471 760717 752955 745113
59511G45113r098j0108r258p573p024p389p051o001n690o413o899o277m818l019
$$ 745113 736015 725907 716649 709076 702052 694663 687612 681611 675921 669508 662609 656332 651514 648495
59497F48495j332l74j95J65J274K188J912J076R02J407J841K132K607L178L770
$$ 648495 647163 646789 646594 646759 648033 650221 652133 653209 654111 655518 657359 659491 662098 665276 669046
59482F69046M661N412M875L258K584L740M868M350L506M210N560N447M087L367
$$ 669046 673707 679119 683994 687252 689836 693576 698444 702794 706300 710510 716070 721517 725604 728971
59468G28971L612L567K964K594K341J431L06J43Q51J488K195L731N558O408O372
$$ 728971 732583 736150 739114 741708 744049 745480 745786 745929 746780 748268 750463 754194 759752 766160 772532
59453G72532O540P020P176P201P568P491O016M030L066K633J019j676l679m461
$$ 772532 779072 786092 793268 800469 808037 815528 821544 825574 828640 831273 832292 830616 826937 822476
59439H22476n253o564p427p286o632n654m035k147q62j26O87J319J162Q86J709
$$ 822476 817223 810659 803232 795946 789314 783660 779625 777478 776616 776490 777177 778496 779658 780544 782253
59424G82253L360M722O067Q611J2037J4663J6000J7016J7901J7788J6868J6563
$$ 782253 785613 790335 796402 805013 817050 831713 847713 864729 882630 900418 917286 933849
59412I33849J7252J7885J8327J9895K2697K4172K1336J3619L068p129j4101j6606
$$ 933849 951101 968986 987313 1007208 1029905 1054077 1075413 1089032 1092100 1084971 1070870 1054264
59400A054264j5566j2782r058m174J741P656J1942J2482P650j543j1133j7650
$$ 1054264 1038698 1025916 1016858 1012684 1014425 1022081 1034023 1046505 1054155 1052612 1041479 1023829
59388A023829k1008k2779k3038k1116j8119j5993j4576j2191q869o374n208m078
$$ 1023829 1002821 980042 957004 935888 917769 901776 887200 875009 866140 859766 854558 850480
59376H50480k428j130n68j71m8q94k091k090q05M03J203K531M337N343N377N677
$$ 850480 848052 846922 846354 846183 846135 845241 843150 841060 840255 840658 841861 844392 848729 854072 859449 865126
59360H65126O538O873O549O949Q642J0481J1625J2536J3522J4166J4645J5760
$$ 865126 871664 878537 885086 892035 900677 911158 922783 935319 948841 963007 977652 993412
59348I93412J7228J7761J7202J6739J6660J5911J4207J2571J1280R287O194K910
$$ 993412 1010640 1028401 1045603 1062342 1079002 1094913 1109120 1121691 1132971 1142258 1148452 1151362
59336A151362j69l704p692j1088j3695j6461j9367k1024k0974k0500k0478k0252
$$ 1151362 1151193 1147489 1139797 1128709 1115014 1098553 1079186 1058162 1037188 1016688 996210 975958
59324I75958j9354j8444j7875j6975j5484j4043j2761j0997q971p882p928q017
$$ 975958 956604 938160 920285 903310 887826 873783 861022 850025 841054 833172 825244 817227
59312H17227p802q057q705q545p402o478o089n245l975l626m127l555j356N03
$$ 817227 809425 801368 792663 784118 776716 770238 764149 758904 754929 751303 747176 743621 742265 742768
59298G42768R04J510L789O489P970Q946J0800J2856J3427J2365J0589Q129M548
$$ 742768 743672 745182 748971 755460 763430 772376 783176 796032 809459 821824 832413 840542 845090
59285H45090N49k525m368n547o186n938m825l210j219J208M102P518J1120J3701
$$ 845090 845639 843114 838746 833199 827013 821075 816250 813040 811821 813029 817131 824649 835769 849470
59271H49470J4217J3413J3211J4168J4922J4373J2916J1087Q606N447K450J26
$$ 849470 863687 877100 890311 904479 919401 933774 946690 957777 966383 971830 974280 974406
59259I74406j943l924n247n793o266o957p376p405p467p210n718l390j931j941
$$ 974406 972463 968539 963292 957499 951233 944276 936900 929495 922028 914818 909100 905710 903779 901838
59245I01838k114j376k15P18J662K721L332L395L493L530K648R11n88j700l427
$$ 901838 899724 898348 898133 898851 900513 903234 906566 909961 913454 916984 919632 920543 919955 918255 914828
59230I14828n747p227p398p559q521r519j0072j0865j1912j1971j0832j0122j0639
$$ 914828 909081 901854 894456 886897 878376 868857 858785 847920 836008 824037 813205 803083 792444
59217G92444j0826r279o904n279m471l872l626l814l599k500j309p21k88L60O57
$$ 792444 781618 772339 765435 760156 755685 751813 748187 744373 740774 738274 736965 736244 735956 736316 736973
59202G36973L81M38J419K670L535M144M381L627K248J657K210K674K450K401K834
$$ 736973 737354 737792 739211 741881 745416 749560 753941 757568 759816 761473 763683 766357 768807 771208 774042
59187G74042K701J679J008J310J583J267J209J531Q80r80k073j219M1M8m28n2
$$ 774042 776743 778422 779430 780740 782323 783590 784799 786330 787210 786230 784157 782938 782979 783027 782599 782547
59171G82547O58N84R4J21N53J009J811K842L035K183J622J837J314r06l458m969
$$ 782547 783205 783789 783883 784004 784557 785566 787377 790219 793254 795437 797059 798896 800210 799304 795846 790877
59155G90877o199q164r973j0392r957r792r780r548r691j0427j0526r259p826
$$ 790877 784678 776514 766541 756149 746192 736400 726620 717072 707381 696954 686428 677169 669343
59142F69343p398p239o347n290m872m575l853l324l182k240j46J358J082L90Q14
$$ 669343 661945 654706 648359 643069 638197 633622 629769 626445 623263 621023 620877 622235 623317 623707 624521
59127F24521J624J660J682K746M050M582N220P010Q938R577R551J0165J1035J1195
$$ 624521 626145 627805 629487 632233 636283 640865 646085 653095 662033 671610 681161 691326 702361 713556
59113G13556J1119J1615J2017J1525J0893J0815J0183Q013N586M586M521M085
$$ 713556 724675 736290 748307 759832 770725 781540 791723 799736 805322 809908 814429 818514
59101H18514L453L109J998o82l369m195l839m022m593m417l772l478l000j778
$$ 818514 821967 825076 827074 826392 823023 818828 814989 810967 806374 801957 798185 794707 791707 789929
59087G89929r73j605k354j747r38j777l596m720n588p390q973q385o515n940o908
$$ 789929 788956 787351 784997 783250 782312 780535 776939 772219 766631 759241 750268 741883 735368 729428 722520
59072G22520p429o812o072n435m328l395l701m331l514j712q87j188j068l81n36
$$ 722520 715091 708279 702207 696772 692444 689049 685348 681017 677503 675791 674904 673716 672648 672267 671731
59057F71731j683k417k275k178k360k181j764j763j676n84Q50J227Q55J065J583
$$ 671731 670048 667631 665356 663178 660818 658637 656873 655110 653434 652850 653700 654927 655782 656847 658430
59042F58430R74o04j475j162p88q57p05j64K20N08J234K138K574K832L557M562
$$ 658430 659404 658800 657325 656163 655375 654518 653813 653649 653869 654377 655611 657749 660323 663155 666712 671274
59026F71274N535P008R093J0586J0956J1659J3467J4308J2215Q760O693N663L475
$$ 671274 676809 683817 692910 703496 714452 726111 739578 753886 766101 774861 781554 787217 790692
59013G90692K81j819k488l139l875l696l196l761m511l292m50J595K316L399N287
$$ 790692 790973 789154 786666 783527 779652 775956 772760 768999 764488 761196 760746 762341 764657 768056 773343
58998G73343O592P004P647Q342P592N523L993L575L058K147J850K049J442J08
$$ 773343 779935 786939 794586 802928 810520 816043 820036 823611 826669 828816 830666 832715 834157 834265
58984H34265m87j96k68o32J63K179L857M758N936P514Q462Q909J0073J1810J2764
$$ 834265 833778 833582 833314 832682 832845 835024 838881 843639 849575 857089 865551 874460 884533 896343 909107
58969I09107J2979J3742J4850J4837J3868J3685J4540J4912J4278J3354J1723
$$ 909107 922086 935828 950678 965515 979383 993068 1007608 1022520 1036798 1050152 1061875
58958A061875Q172L474j55k536n470r151j1819j3185j4908j7193j8178j7397j6695
$$ 1061875 1070047 1073521 1073366 1070830 1065360 1056209 1044390 1031205 1016297 999104 980926 963529 946834
58945I46834j6911j6662j5216j3707j2634j0990q722p279o886n966m003k370j563
$$ 946834 929923 913261 898045 884338 871704 860714 851992 844713 837827 831861 827858 825488 823925
58932H23925m36J075J345O2q52l64K09j79p56r14j263j877j804j074q47j026k66
$$ 823925 823489 824564 825909 825971 825119 824755 824964 824785 824029 823115 821852 819975 818171 817097 816250 815224 814958
58915H14958J217J596P46P08K107L053K549K128K988M257N205O582Q589J0072
$$ 814958 816175 817771 818517 819225 821332 824385 826934 829062 832050 836307 841512 848094 856683 866755
58901H66755J0788J2061J4246J5938J6628J7567J9127J9906J9406J8930J9000
$$ 866755 877543 889604 903850 919788 936416 953983 973110 993016 1012422 1031352 1050352
58890A050352J8541J7576J7849J9687K0995K0549J9569J8838J7084J3685J0214
$$ 1050352 1068893 1086469 1104318 1124005 1145000 1165549 1185118 1203956 1221040 1234725 1244939
58879A244939P744N115J411k237m792p006r569j1731j3043j4283j5508j5365j3512
$$ 1244939 1252683 1257798 1259209 1256972 1252180 1245174 1235605 1223874 1210831 1196548 1181040 1165675 1152163
58866A152163j1564j0555r689q537q077q519q558p844p836r138j0467j1182j2247
$$ 1152163 1140599 1130044 1120355 1111818 1103741 1095222 1086664 1078820 1070984 1061846 1051379 1040197 1027950
58853A027950j3680j3761j2029j0398j0050r855r077q963j0188j1308j1250j0936
$$ 1027950 1014270 1000509 988480 978082 968032 958177 949100 940137 929949 918641 907391 896455
58841H96455j1121j1110j0749j1187j2344j2298j0498q937q824q741p513o167
$$ 896455 885334 874224 863475 852288 839944 827646 817148 808211 799387 790646 783133 776966
58829G76966n526m565k751j424j210n76J468L625M709N347O003N833M874M689
$$ 776966 771440 766875 764124 762700 761490 760914 762382 766007 770716 776063 782066 787899 792773 797462
58815G97462N548N596M188L196L626L903K979K135K157J718K29q34j055k335n166
$$ 797462 803010 808606 812794 815990 819616 823519 826498 828633 830790 832508 832737 831903 830848 828513 823347
58800H23347o977o296n325o114p285p012o203o240o280n403m823n443n715m345
$$ 823347 816370 810074 804749 798635 791350 784338 778135 771895 765615 760212 755389 749946 744231 739886
58786G39886k664k027j362M74K387L310M141N339N379L819L045M516O067N448
$$ 739886 737222 735195 733833 734307 736694 740004 744145 749484 754863 758682 761727 766243 772310 777758
58772G77758L634K110k04m316q280j0009j0544j1622j2379j1400r684q646p442
$$ 777758 781392 783502 783298 778982 770702 760693 750149 738527 726148 714748 705064 696418 688976
58759F88976n112l092k677k363n63J274J231L27L83P05m9q22q8J142J273J205
$$ 688976 683864 680772 678095 675732 675169 676443 677674 678001 678384 679089 679040 678218 678130 679272 680545 681750
58743F81750K540M521N643O442P865Q800Q010O698O431O422N525M833N532O290
$$ 681750 684290 688811 694454 700896 708761 717561 725571 732269 738700 745122 750647 755480 761012 767302
58729G67302N609M751N422O609O606O117O466O747N749M672N016N751N467N282
$$ 767302 772911 777662 783084 789693 796299 802416 808882 815629 821378 826050 831066 836817 842284 847566
58715H47566O626Q236Q303P563P324O551L975R71p20k089m683p488r013j0252
$$ 847566 854192 862428 870731 878294 885618 892169 896144 897115 896395 894306 889623 882135 873122 862870
58701H62870j2519j4647j5432j6419j8959k0984k0214j8110j7106j6326j3847
$$ 862870 850351 835704 820272 803853 784894 763910 743696 725586 708480 692154 678307
58690F78307j0811r347q581o733n045n591p108p068o033n961o098m638k664k286
$$ 678307 667496 658149 649568 642835 637790 632199 625091 618023 611990 606029 599931 595293 592629 590343
58676E90343k618j604q3M9j16J441L413L404K670M084O940Q403Q821J0794J4025
$$ 590343 587725 586121 586038 586087 585971 587412 590825 594229 596899 600983 607923 616326 625147 635941 649966
58661F49966J5639J4856J3049J0027M641j708o296r098j1707j3405j2367r764
$$ 649966 665605 680461 693510 703537 708178 706470 700174 691076 679369 665964 653597 643833
58649F43833q438q403p680o494o511o897n492k960j659j357k26J025L83j088n63
$$ 643833 635395 626992 619312 612818 606307 599410 593918 590958 589299 587942 587716 588741 589124 588036 587473
58634E87473J649K833K663K925L276J864n31j352p65j031k100k012r73p10n92
$$ 587473 589122 591955 594618 597543 600819 602683 602152 600800 600035 599004 596904 594892 593919 593209 592617
58619E92617J188L447L607K661L816O777Q178P320O698P047O507M780L635L301
$$ 592617 593805 597252 600859 603520 607336 614113 622291 629611 636309 643356 649863 654643 658278 661579
58605F61579K445J530K107L190K497P46M51J171M48j296j495m50p43k137j874
$$ 661579 664024 665554 667661 670851 673348 674094 674545 675716 676164 674868 673373 672923 672180 670043 668169
58590F68169K04J735K720N330R064J1011J1066J1971J4092J4975J4191J3866J4206
$$ 668169 668373 670108 672828 678158 687222 698233 709299 721270 735362 750337 764528 778394 792600
58577G92600J3164J0805R466R403Q735P681Q383J0520J1761J2446J5156J9700
$$ 792600 805764 816569 826035 835438 844173 851854 860237 870757 882518 894964 910120 929820
58565I29820K3267K5482K8634L2943L6234L8164L9952M0219L6058K8158K0028
$$ 929820 953087 978569 1007203 1040146 1076380 1114544 1154496 1194715 1230773 1258931 1278959
58554A278959J2492L866m856j0380j2473j3695j4112j1699p625n462n297m386
$$ 1278959 1291451 1295317 1290461 1280081 1267608 1253913 1239801 1228102 1220477 1215015 1209718 1205332
58542A205332l411o043j2232j7974k1970k6382l0896l2494l1565l1712l2745l0478
$$ 1205332 1201921 1195878 1183646 1165672 1143702 1117320 1086424 1053930 1022365 990653 957908 927430
58530I27430k4448j9325j7328j5637j2680j0690j0383r219o676n485o068n487
$$ 927430 902982 883657 866329 850692 838012 827322 816939 807720 801044 795559 789491 784004
58518G84004l265k448l608l656j931j410k615k521p72p19k761l124q95K06j168
$$ 784004 780739 778291 774683 771027 769096 767686 765071 762550 761778 761059 758298 755174 754279 754485 753317
58503G53317j839o83o84k386k098R59K480O44o99Q40K376K024K520N290P097O056
$$ 753317 751478 750795 750111 747725 745627 746586 749066 749710 749011 749851 752227 754251 756771 762061 769158 775214
58487G75214N287P245R784J0966J2486J5374J7558J8424K0592K4576K6961K6233
$$ 775214 780501 787746 797530 808496 820982 836356 853914 872338 892930 917506 944467 970700
58475I70700K4964K3974K0191J2675M975r07o988j3516j6986j6492j5829j6567
$$ 970700 995664 1019638 1039829 1052504 1057479 1056572 1049584 1036068 1019082 1002590 986761 970194
58463I70194j5332j0631n994l544p47L574O521P326R635J4581J8125J8350J8474
$$ 970194 954862 944231 938237 934693 933946 937520 944041 951367 961002 975583 993708 1012058 1030532
58450A030532J9492J7026R198O67n117j0686j7632k2062k1512j9749k0018j9780
$$ 1030532 1050024 1067050 1076248 1076915 1071798 1061112 1043480 1021418 999906 980157 960139 940359
58438I40359j6598j3062j1376r156m905j724j359o52K196M021L290L746P394J0517
$$ 940359 923761 910699 899323 890167 885262 883538 882179 881527 883723 887744 891034 894780 902174 912691
58424I12691J0675J0962J3036J2975Q575L832J567j388o981j1149j1177j0764
$$ 912691 923366 934328 947364 960339 968914 972746 974313 972925 965944 954795 943618 932854
58412I32854j2671j3515j0983r011j0376j1351r139p392q656q832n064j797k751
$$ 932854 920183 906668 895685 886674 876298 864947 855808 848416 839760 830928 825864 824067 821316
58399H21316m055j797P73P2q29J282L064J236p44P38K709J849Q96K423L051L35
$$ 821316 817261 815464 816237 816309 815480 816762 819826 821062 820318 821056 823765 825614 826510 828933 831984 832319
58383H32319j491R00L662L526M317Q919J2468J0826Q276R361J0661Q455O756R571
$$ 832319 830828 831728 835390 838916 843233 852152 864620 875446 883722 893083 903744 912199 918955 928526
58369I28526J2694J1704J0658J4162J8063J7057J4542J5842J8351J7490J5802
$$ 928526 941220 952924 963582 977744 995807 1012864 1027406 1043248 1061599 1079089 1094891
58358A094891J7037J7714J3669Q571P027N802Q40l828l371j525l352n449k863
$$ 1094891 1111928 1129642 1143311 1151882 1158909 1164711 1165551 1161723 1158352 1156827 1153475 1148026 1145163
58345A145163J112J534J331M597P460N556L515O861J1584J1986J1690J6083K1109
$$ 1145163 1146275 1147809 1149140 1153737 1161197 1166753 1170268 1177129 1188713 1200699 1212389 1228472 1249581
58332A249581K0604J7881J8878K0591J7542J2894J1892J1163N870M58P29K404
$$ 1249581 1270185 1288066 1306944 1327535 1345077 1357971 1369863 1381026 1386896 1387354 1388083 1390487
58320A390487o62m203j668K838K294O9K751O908O154M226P655J2500J1896R702
$$ 1390487 1389825 1385622 1383954 1386792 1389086 1389155 1391906 1398814 1404968 1409194 1416849 1429349 1441245 1450947
58306A450947J2884J7492J6238J2849J4578J7722J5251J1483J4119J8909J7655
$$ 1450947 1463831 1481323 1497561 1510410 1524988 1542710 1557961 1569444 1583563 1602472 1620127
58295A620127J4132J6355K0403J8230J4193J7062K2695K1824J8103K0841K6666
$$ 1620127 1634259 1650614 1671017 1689247 1703440 1720502 1743197 1765021 1783124 1803965 1830631
58284A830631K6276K2833K5421L0757K9821K6299K9703L6533L7161L5043L9821
$$ 1830631 1856907 1879740 1905161 1935918 1965739 1992038 2021741 2058274 2095435 2130478 2170299
58273B170299M7878M9286M7519N2248N9351N8469N3671N5620O0400N7626N2281
$$ 2170299 2218177 2267463 2314982 2367230 2426581 2485050 2538721 2594341 2654741 2712367 2764648
58262B764648N6016O4085O4072O0069O4163P1335O8031N8641N7744O2818O1101
$$ 2764648 2820664 2884749 2948821 3008890 3073053 3144388 3212419 3271060 3328804 3391622 3452723
58251C452723N6534O2388P3738P5594P2211P9308R3378R8432R7258J05312J19499
$$ 3452723 3509257 3571645 3645383 3720977 3793188 3872496 3965874 4064306 4161564 4266876 4386375
58240D386375J24379J23565J32786J47873J52745J52741J65577J85901J94770
$$ 4386375 4510754 4634319 4767105 4914978 5067723 5220464 5386041 5571942 5766712
58231E766712J97361K13608K38541K51498K57642K78809L10157L29479L42562
$$ 5766712 5964073 6177681 6416222 6667720 6925362 7204171 7514328 7843807 8186369
58222H186369L73375M16216M45769M67835N09369N65345O09388O49843P17854
$$ 8186369 8559744 8975960 9421729 9889564 10398933 10964278 11573666 12223509 12941363
58213A2941363Q07153Q87059R67949J088120J243442J401395J577724J822509
$$ 12941363 13748516 14635575 15603524 16691644 17935086 19336481 20914205 22736714
58205B2736714K138490K497864K930727L499732M191089M935020N731681O643528
$$ 22736714 24875204 27373068 30303795 33803527 37994616 42929636 48661317 55304845
58197E5304845P669909Q764310R977014J1432328J3167308J5170592J7579343
$$ 55304845 62974754 71739064 81716078 93148406 106315714 121486306 139065649
58190A39065649K0626533K4412125K8998705L4583689M0794341M5362502M4240658
$$ 139065649 159692182 184104307 213103012 247686701 288481042 333843544 378084202
58183C78084202L4314274J6516702m105310k1715230l3085722l8199832l8637087
$$ 378084202 412398476 428915178 424809868 403094638 370008916 331809084 293171997
58176B93171997l6093332l1996115k7509854k3386249j9914660j7130784j4988701
$$ 293171997 257078665 225082550 197572696 174186447 154271787 137141003 122152302
58169A22152302j3354771j2030656j0873915r830831q853595p886048o937164
$$ 122152302 108797531 96766875 85892960 76062129 67208534 59322486 52385322
58162E2385322o071157n308751m613724l976818l431068k978473k578191k216182
$$ 52385322 46314165 41005414 36391690 32414872 28983804 26005331 23427140 21210958
58154B1210958j917609j682800j475993j285639j134841j024185r21812q18433
$$ 21210958 19293349 17610549 16134556 14848917 13714076 12689891 11768079 10949646
58146A0949646p37692o83582o29149n65979n15858m84239m48579m02025l64777
$$ 10949646 10211954 9528372 8899223 8333244 7817386 7333147 6884568 6482543 6117766
58137F117766l42778l16616k80490k52730k38856k21889j97660j83200j81866
$$ 6117766 5774988 5458372 5177882 4925152 4686296 4464407 4266747 4083547 3901681
58128C901681j75292j58276j47683j48577j44547j29980j20028j19893j15093
$$ 3901681 3726389 3568113 3420430 3271853 3127306 2997326 2877298 2757405 2642312
58119B642312j01003r2222r3653r0958p8749p0681p2471p1478o2094n5890n7642
$$ 2642312 2541309 2449087 2355434 2264476 2185727 2115046 2042575 1971097 1909003 1853113 1795471
58108A795471n6042m7052m2507m6737m7897m1115l7633m2307m3982l7033l1187
$$ 1795471 1739429 1692377 1649870 1603133 1555236 1514121 1476488 1434181 1390199 1353166 1321979
58097A321979l1463k8991k0316j5634j9201k0940j5915j3251j7517j9745j5201
$$ 1321979 1290516 1261525 1241209 1225575 1206374 1185434 1169519 1156268 1138751 1119006 1103805
58086A103805j2188j5018j5830j1247r934j5602j9210j6081j4374j8753k1692
$$ 1103805 1091617 1076599 1060769 1049522 1039588 1023986 1004776 988695 974321 955568 933876
58075I33876j8783j7013k0096k0957j6375j3945j7010j7609j1968q255j1248j3745
$$ 933876 915093 898080 877984 857027 840652 826707 809697 792088 780120 771865 760617 746872
58063G46872j0800q428j0481j0797o177l626o997r555p265o366j0345j2500r067
$$ 746872 736072 727644 717163 706366 700189 696563 689566 680011 672746 666380 656035 643535 634468
58050F34468o834r976j1926q195m896o578p707m190j600l945n705l019j516n097
$$ 634468 627634 617658 605732 597537 592641 586063 578356 574166 572566 568621 562916 559897 558381 553284
58036E53284p973n820l909o297p713m336k006n320q789p204n024p097r499p958
$$ 553284 545311 539491 535582 529285 521572 517236 515230 509910 501121 493917 488893 481796 472297 464339
58022D64339o252q043r197o226l743n641p412m923k403l896n241k353N91q86l282
$$ 464339 458087 450044 440847 434621 430878 425237 417825 412902 410499 406603 401362 399009 399600 398714 395432
58007C95432k419j271k998l847o17K311R26q47J130L253J536m61J366L704K505
$$ 395432 393013 391742 388744 384897 384280 386591 387517 386670 387800 391053 392589 392128 393494 397198 399703
57992C99703Q58K621M706L245J161K230L704K030j77K31M19k388m575k786p34
$$ 399703 400561 403182 407888 411133 412294 414524 418228 420258 420081 420312 420731 418343 413768 410982 410248
57977D10248k417m666l477j603k685l863j580J079J90j479p1J774K48j960p64
$$ 410248 407831 403165 399688 398085 395400 391537 389957 391036 391226 389747 389676 391450 391698 389738 388974
57962C88974J619J171n00k39J11j899l396j540J89j968m794l900j732k501m143
$$ 388974 390593 391764 391264 391025 391136 389237 385841 384301 384490 382522 377728 373828 372096 369595 365452
57947C65452k821o83j429k573k7L727L893J983K532M713M873M174O040Q986R353
$$ 365452 362631 361948 360519 357946 357919 361646 365539 367522 370054 374767 379640 383814 389854 398840 408193
57932D08193Q425R707J1770J0772P559N551M141P97k854l667l227n048p927q494
$$ 408193 416618 426325 438095 448867 456426 461977 466118 466915 464061 460394 457167 452119 444192 435698
57918D35698p823r181j1517j1506r816r286r096o816l937l415l929k476k96l94
$$ 435698 427875 418694 407177 395671 385855 376569 367473 360657 356720 353305 349376 346900 346604 346210
57904C46210j597r69J76j234l840m128k800k940l935l112j364j296j781r2K481
$$ 346210 344613 343644 343820 342586 338746 334618 331818 328878 324943 321831 320467 319171 317390 317298 319779
57889C19779K879K101L147N188N444M797N748O871N195K240J752L153L106J814
$$ 319779 322658 324759 327906 333094 338538 343335 349083 355954 361149 363389 365141 368294 371400 373214
57875C73214J888K647J441p56q84M72N04j50J138L343L371J965K336M127M343
$$ 373214 375102 377749 379190 378434 377550 378022 378526 378376 379514 382857 386228 388193 390529 394656 398999
57860C98999L193L376M641M459L193L261M160L619K470L151M567L794J687J406
$$ 398999 402192 405568 410209 414668 417861 421122 425282 428901 431371 434522 439089 442883 444570 445976
57846D45976K500J898k38j105p24j498l118l251k400k962m313l937k399k192k716
$$ 445976 448476 450374 450136 449031 448307 446809 443691 440440 438040 435078 430765 426828 424429 422237 419521
57831D19521j609J88l7j370q77O94M02q89J56K968L938K906K901M007L429J254
$$ 419521 417912 418100 418063 416693 415816 416510 416912 416023 416179 419147 423085 425991 428892 432899 436328 437582
57815D37582L52P98M5j655j710p01j678m213m928l879m410o711p484o306o356
$$ 437582 437934 438732 438777 437122 435412 434711 433033 428820 423892 420013 415603 408892 401408 395102 388746
57800C88746q240q944p591o753p248p013n806n685o214m593j243J74r70j293L99
$$ 388746 380506 371562 363971 357218 349970 342957 337151 331466 325252 320659 319416 319590 318620 317327 317726
57785C17726J423P29O85K132K783J938J929L562M730M779N583P249P422N810M851
$$ 317726 319149 319878 320563 322695 325478 327416 329345 332907 337637 342416 347999 355248 362670 368480 373331
57770C73331M906L594P97o10o9m57k645l927l243l069m527n342m365l587l957
$$ 373331 378237 381831 382628 382018 381949 381492 378847 374920 371677 368608 364081 358739 354374 350787 346830
57755C46830l582j791p21j180j095L44J198Q77J563L892N361M617L454L072K375
$$ 346830 343248 341457 340736 339556 338461 338805 340003 340880 342443 346335 351696 356313 359767 362839 365214
57740C65214J337J895L960M642L010J666K090K449J556Q87J087M66j342k184j352
$$ 365214 366551 368446 372406 377048 380058 381724 383814 386263 387819 388706 389793 390259 388917 386733 385381
57725C85381r27j687j727n69m36j893k430j133n12j832k865k243j858k848l299
$$ 385381 384454 382767 381040 380471 380035 378142 375712 374579 374067 372235 369370 367127 365269 362421 359122
57710C59122k191j599k693l345k120q69j095j368o50m94j646k010m58Q37K31o37
$$ 359122 356931 355332 352639 349294 347174 346305 345210 343842 343192 342698 341052 339042 338584 339421 339652 339015
57694C39015j71M17M4J00J497K507J914J252J761K113J344Q43J497J914J450J813
$$ 339015 338844 339261 339305 339405 340902 343409 345323 346575 348336 350449 351793 352636 354133 356047 357497 359310
57678C59310L659N007M965N675Q471J1568J3652J6274K0491K4757K8450L3972
$$ 359310 362969 367976 372941 378616 387087 398655 412307 428581 449072 473829 502279 536251
57666E36251M2723N2341O0049O5039O5184N5752L4988Q011j7859l8833n3550o0415
$$ 536251 578974 631315 691364 756403 821587 877339 912327 920338 902479 863646 810096 749681
57654G49681n9755n5583n1513m7140m1057l4532k9337k4802k0053j6396j4597
$$ 749681 689926 634343 582830 535690 494633 460101 430764 405962 385909 369513 354916
57643C54916j2652r195o231n550n327l511j622j811k853k563j655j744j895n87
$$ 354916 342264 333069 326838 321288 315961 312450 310828 309017 306164 303601 301946 300202 298307 297720
57629B97720J052J305R52J201Q42j319l405l254k099k156k701j880m41j65m85
$$ 297720 298772 300077 301029 302230 303072 301753 298348 295094 292995 290839 288138 286258 285817 285652 285167
57614B85167JL89p99k460k736k335k885l632k947j523r99r40j66N36Jo35J38J275
$$ 285167 285168 285557 284758 282298 279562 277227 274342 270710 267763 266240 265241 264301 264135 264671 264672 264037 264175 265450
57596B65450J026N2k29m81j710k600j794r03j888l305k622o31Pq40j368j408j968
$$ 265450 266476 266528 266299 265818 264108 261508 259714 258811 256923 253618 250996 250365 250372 249532 248164 246756 244788
57579B44788k427j638p14j392k788k947k327k514k893j984p72j188k410k255j121
$$ 244788 242361 240723 240009 238617 235829 232882 230555 228041 225148 223164 222392 221204 218794 216539 215418
57564B15418j009j665j339m76r01k083j891n44j31p17m75O18P62j59m08L55Q26
$$ 215418 214409 212744 211405 210929 210028 207945 206054 205510 205379 204662 204187 204805 205567 205408 205000 205355 206181
57547B06181R71K081L924M768M271L600K927J507p5m40P1J21RQ67J822J037q61
$$ 206181 207152 209233 213157 217925 222196 225796 228723 230230 230155 229715 229786 229907 229916 230783 232605 233642 232781
57530B32781j521p50n33j417j957j742j820k020q93J350K678K413J953K000J669
$$ 232781 231260 230510 229977 228560 226603 224861 223041 221021 220128 221478 224156 226569 228522 230522 232191
57515B32191P39L59R54J537J523J471J701J836J748J552R98K23K63J316J717M36
$$ 232191 232930 233289 234243 235780 237303 238774 240475 242311 244059 245611 246609 246832 247095 248411 250128 250564
57499B50564p89q6J340J179k17r58j151k085k978k053r7M29n88j127p20o29p80
$$ 250564 249775 249689 251029 252208 251991 251033 249882 247797 244819 242766 242669 243098 242510 241383 240663 240034 239254
57482B39254K2J088N31j144j484j46P99N87M63O07j73j517j676r21j398l166l772
$$ 239254 239276 240364 240895 239751 238267 238121 238920 239507 239970 240577 240404 238887 237211 236290 234892 231726 227954
57465B27954k374r69q03p32M5O35P14J246K129J928O68J64Q34J002R5k99N72J353
$$ 227954 225580 224611 223808 223076 223121 223756 224470 225716 227845 229773 230441 230605 231439 232441 232536 232237 232809 234162
57447B34162J201J068J394J144P5m51J13N90M15N70J430J950J716J616J867J647
$$ 234162 235363 236431 237825 238969 239044 238593 238706 239296 239711 240281 241711 243661 245377 246993 248860 250507
57431B50507J117J447K362K263J223J190K595L511K886J944J560R60r7m31K83
$$ 250507 251624 253071 255433 257696 258919 260109 262704 266215 269101 271045 272605 273565 273468 273037 273320
57416B73320Q05P36J159K118K116R63M55J292K023J943K294L445L754K541J492
$$ 273320 274125 274861 276020 278138 280254 281217 281672 282964 284987 286930 289224 292669 296423 298964 300456
57401C00456J683J790P32l59l70k7m9L16J378J914J416J279K297L168K963K880
$$ 300456 302139 303929 304661 304302 303932 303905 303856 304172 305550 307464 308880 310159 312456 315624 318587 321467
57385C21467L929N030N071M878N442N996N538M605M002L416K611K365K853K864
$$ 321467 325396 330426 335497 340375 345817 351813 357351 361956 365958 369374 371985 374350 377203 380067
57371C80067J812Q82Q70P83j58r29n74R1J17P0O51J234J210J259K004K740K767
$$ 380067 381879 382761 383631 384414 384256 383327 382753 382844 382961 383031 383682 384916 386126 387385 389389 392129 394896
57354C94896K584K709K728K468K584L146L289L016L504M841N459M726L898L598
$$ 394896 397480 400189 402917 405385 407969 411115 414404 417420 420924 425765 431224 435950 439848 443446
57340D43446K703R99L80J819L442L457K854L220L883L415K364K222K961L510L720
$$ 443446 446149 447148 447528 449347 452789 456246 459100 462320 466203 469618 471982 474204 477165 480675 484395
57325D84395M036M167L704L244L582M507N455O334O927O571N352M423M417M796
$$ 484395 488431 492598 496302 499546 503128 507635 513090 519424 526351 532922 538274 542697 547114 551910
57311E51910N245O127P095P052O172O024O962P484O880O316O433O184N202M856
$$ 551910 557155 563282 570377 577429 583601 589625 596587 604071 610951 617267 623700 629884 635086 639942
57297F39942N777O655O785P338Q740R337Q276P215P425P750P283P475R398J1293
$$ 639942 645719 652374 659159 666497 675237 684574 692850 700065 707490 715240 722523 729998 739396 750689
57283G50689J1290J0379J0334J0714J0472J0535J2094J4038J4735J4884J6028
$$ 750689 761979 772358 782692 793406 803878 814413 826507 840545 855280 870164 886192
57272H86192J7619J8155J7954J8318J8986J8842J8211J8159J8446J8144J7532
$$ 886192 903811 921966 939920 958238 977224 996066 1014277 1032436 1050882 1069026 1086558
57261A086558J7400J7472J7275J7499J8676J9741J9616J9074J9242J9626J9459
$$ 1086558 1103958 1121430 1138705 1156204 1174880 1194621 1214237 1233311 1252553 1272179 1291638
57250A291638J9552K0771K2041K1926K1031K0852K1398K1858K2358K3177K3520
$$ 1291638 1311190 1331961 1354002 1375928 1396959 1417811 1439209 1461067 1483425 1506602 1530122
57239A530122K2986K2889K4233K5810K6290K6633K8287L0486L1646L2036L2793
$$ 1530122 1553108 1575997 1600230 1626040 1652330 1678963 1707250 1737736 1769382 1801418 1834211
57228A834211L3604L3677L3642L4245L4471L3281L1903L2041L3151L3870L4605
$$ 1834211 1867815 1901492 1935134 1969379 2003850 2037131 2069034 2101075 2134226 2168096 2202701
57217B202701L6264L7875L8200L8333L9898M2009M2978M3739M6418N0493N3597
$$ 2202701 2238965 2276840 2315040 2353373 2393271 2435280 2478258 2521997 2568415 2618908 2672505
57206B672505N5345N7286N9604O1062O1738O2880O4280O4651O4334O4887O6280
$$ 2672505 2727850 2785136 2844740 2905802 2967540 3030420 3094700 3159351 3223685 3288572 3354852
57195C354852O7164O7589O8720P0211P0552O9843O9527O9589O8617O6629O5162
$$ 3354852 3422016 3489605 3558325 3628536 3699088 3768931 3838458 3908047 3976664 4043293 4108455
57184D108455O4668O4215O3765O4297O5697O6743O7161O7495O7265O5564O3132
$$ 4108455 4173123 4237338 4301103 4365400 4431097 4497840 4565001 4632496 4699761 4765325 4828457
57173D828457O1586O0896N9925N8897N8820N8842N6897N2765M7974M2966L6967
$$ 4828457 4890043 4950939 5010864 5069761 5128581 5187423 5244320 5297085 5345059 5388025 5424992
57162E424992L0557K5578K2505K0298J8741J8427J8639J7985J7122J8152K1200
$$ 5424992 5455549 5481127 5503632 5523930 5542671 5561098 5579737 5597722 5614844 5632996 5654196
57151E654196K4140K5804K6967K8142K8984L0020L2414L5794L8652M0903M3544
$$ 5654196 5678336 5704140 5731107 5759249 5788233 5818253 5850667 5886461 5925113 5966016 6009560
57140F009560M5873M5684M2425L7537L1678K4309J6210R637N490K762J060J162
$$ 6009560 6055433 6101117 6143542 6181079 6212757 6237066 6253276 6262913 6268403 6271165 6272225 6273387
57128F273387K903N041P594J1827J7722K3937L0364L8134M6927N4976O1901O8925
$$ 6273387 6276290 6281331 6288925 6300752 6318474 6342411 6372775 6410909 6457836 6512812 6574713 6643638
57116F643638P6101Q2247Q7866R5338J05888J19165J36116J59377J90418K29218
$$ 6643638 6719739 6801986 6889852 6985190 7091078 7210243 7346359 7505736 7696154 7925372
57106G925372K76964L36040M07150M90046N88091P09045Q60480J047231J273472
$$ 7925372 8202336 8538376 8945526 9435572 10023663 10732708 11593188 12640419 13913891
57097A3913891J543214J856999K211153K601820L027252L485841L976680M505012
$$ 13913891 15457105 17314104 19525257 22127077 25154329 28640170 32616850 37121862
57089C7121862N082026N708015O344634O900150P254006P321520P113065O722162
$$ 37121862 42203888 47911903 54256537 61156687 68410693 75732213 82845278 89567440
57081H9567440O232047N624162M789508L639782K204945O24432r38734k365294
$$ 89567440 95799487 101423649 106213157 109852939 112057884 112682316 111743582 109378288
57073A09378288l587269m572133n320129n863948o249036o504684o632692o620270
$$ 109378288 105791019 101218886 95898757 90034809 83785773 77281089 70648397 64028127
57065F4028127o460258o162277n751956n263723m733309m193006l669229l180933
$$ 64028127 57567869 51405592 45653636 40389913 35656604 31463598 27794369 24613436
57057B4613436k739399k350167k015294j733701j500623j308585j149369j015198
$$ 24613436 21874037 19523870 17508576 15774875 14274252 12965667 11816298 10801100
57049A0801100q99371p97360p07287o28724n61351n04750m58199m19731l86426
$$ 10801100 9901729 9104369 8397082 7768358 7207007 6702257 6244058 5824327 5437901
57040E437901l56364l29426l05601k83818k63256k44280k27112k10793j94578
$$ 5437901 5081537 4752111 4446510 4162692 3899436 3655156 3428044 3217251 3022673
57031C022673j78974j64339j49833j34881j20220j06127r1186p4428n7097m0235
$$ 3022673 2843699 2679360 2529527 2394646 2274426 2168299 2077113 2002685 1945588 1905353
57021A905353k1803R46K6067M5953N2500M2627J9256j1510m3583p2447r5067j09526
$$ 1905353 1883550 1884496 1910563 1956516 2009016 2051643 2070899 2059389 2015806 1943359 1848292 1738766
57009A738766j15495j14663j09571j01862r2338q2233p2982o4691n6400m8086
$$ 1738766 1623271 1508608 1399037 1297175 1204837 1122604 1049622 984931 928531 880445
56999H80445m0858l4948k9249k3340j8236j4554j1535q574o169m582l061j056
$$ 880445 839587 804639 775390 752050 733814 719260 707725 699151 692982 688400 685339 684283
56987F84283J128L475O594J0447J4049J6590J7208J3888N104p060j7813k4504
$$ 684283 685411 688886 695480 705927 719976 736566 753774 767662 772766 765706 747893 723389
56975G23389k8320l0756l1240k9350k6453k3546j9876j5258j1394r185o952l123
$$ 723389 695069 664313 633073 603723 577270 553724 533848 518590 507196 498011 491059 487936
56963D87936J460N543R594J4193J8535K2451K7507L3711L7083L3153K1668O042
$$ 487936 489396 494939 504533 518726 537261 559712 587219 620930 658013 691166 712834 718876
56951G18876j0103k3845l2554l5428l4581l2518k9563k5274k0677j6998j3587
$$ 718876 708773 684928 652374 616946 582365 549847 520284 495010 474333 457335 443748
56940D43748r318m742q93K779P237J1914J5953K0209K6076L3263M0116M4603M3605
$$ 443748 434430 429688 428795 431574 438811 450725 466678 486887 512963 546226 586342 630945 674550
56927F74550L3646J4908o898k5056l7062m3764m5728m3374l8967l5091l1805k7789
$$ 674550 708196 723104 716206 691150 654088 610324 564596 521222 482255 447164 415359 387570
56915C87570k3375j9954j7450j4944j2897j2221j2017j0766q903p818p199n924
$$ 387570 364195 344241 326791 311847 298950 286729 274712 263946 255043 247225 240026 234102
56903B34102m553m287m298k899o84L08OJ74J274K203K884M453O934R173J1064
$$ 234102 229549 225262 220964 218065 217381 217689 217695 217869 219143 221346 224230 228683 235617 244790 255854
56888B55854J3633J7018K0425K3698K6605K7014K2366J3109K618o215j2417j5602
$$ 255854 269487 286505 306930 330628 357233 384247 406613 419722 422340 416125 403708 388106
56876C88106j5720j4095j2359j0250o481j631K080L956N601Q425J2360J7154K2846
$$ 388106 372386 358291 345932 335682 329201 327570 329650 333606 339207 347632 359992 377146 399992
56863C99992K8736L3794L8601M5152N4000O2388O5312N8147L9513J3232j3101
$$ 399992 428728 462522 501123 546275 600275 662663 727975 786122 825635 838867 825766
56852H25766l2999m4584m9057m7723m2078l4886k8327k1906j4265o021J348Q163
$$ 825766 792767 748183 699126 651403 609325 574439 546112 524206 509941 503920 505268 513431
56840E13431J5556K2986K9487L6401M6022N8373P2090Q7050J02043J10262J01831
$$ 513431 528987 551973 581460 617861 663883 722256 794346 881396 983439 1093701 1195532
56829A195532P2741K9290j6782n5315q0629r1712r1768q5787p7028o6515n5307
$$ 1195532 1268273 1297563 1280781 1225466 1144837 1053125 961357 875570 798542 732027 676720
56818F76720m4982l5755k6471j6873p999o0Q071J6963K6091L5550M6469N9117
$$ 676720 631738 595983 569512 552639 544640 544580 552651 569614 595705 631255 677724 736841
56806G36841P1452P9174P6426N8328K5888j1979m3969o4304p4014p6101p2628
$$ 736841 808293 887467 963893 1022221 1048109 1036130 992161 927857 853843 777742 705114
56795G05114o5835n8198n0336m1359l1681k3213j6594j0635m680P98N994J1703
$$ 705114 639279 581081 530745 489386 457705 434492 417898 407263 402583 403381 409375 421078
56783D21078J7488K2378K7282L3711L9760M0195L1534J5128m737k3483l7147m3852
$$ 421078 438566 460944 488226 521937 561697 601892 633426 648554 643817 620334 583187 539335
56771E39335m5307m4775m3213l9489l3955k8867k5181k1850j8561j6247j4520
$$ 539335 494028 449253 406040 366551 332596 303729 278548 256698 238137 221890 207370
56760B07370j1731q135n974n726n269l559k102j940k116k110k827m113m202k838
$$ 207370 195639 187504 181530 175804 170535 166976 164874 162934 160818 158708 155881 151768 147566 144728
56746A44728k075k735k907j372K49L28l27n23p26j467j888j488j298j854j991
$$ 144728 142653 139918 137011 135639 135888 136216 135889 135366 134640 133173 131285 129797 128499 126645 124654
56731A24654r56K07O44J061J881K090J130Q9k48n25j008o33Q73K034J924J561
$$ 124654 123698 123905 124549 125610 127491 129581 130711 130800 130552 130027 129019 128386 129259 131293 133217 134778
56715A34778J897K346K372K507K742K011K79p93l99K45K46L83J118J473J079J089
$$ 134778 136675 139021 141393 143900 146642 148653 148932 148139 147740 147985 148231 148614 149732 151205 152284 153373
56699A53373J856J924O28m99k49M54N35N39J009J188O16K08M97O95N26Q62J650
$$ 153373 155229 157153 157781 157282 157033 157487 158022 158561 159570 160758 161374 161582 162079 162774 163300 164162 165812
56682A65812J391j11r00K2J064Q21J06j19m17j035q76K25N47n84j409q51m76j463
$$ 165812 167203 167092 166192 166214 167278 168099 168205 168086 167669 166634 165758 165983 166530 165946 164537 163686 163210 161747
56664A61747k219j147M88P44J6l54n74j315j808j154o9N39J174K227K625J707
$$ 161747 159528 158381 158869 159613 159629 159275 158701 157386 155578 154424 154355 154894 156068 158295 160920 162627
56648A62627Q21J175J793J303K17l15m15n43k54N55Q12J11l19J88M63j81n14J93
$$ 162627 163448 164623 166416 167719 167936 167621 167206 166663 166409 166964 167776 167887 167568 167756 168219 168038 167524 167717
56630A67717N50m33j395j063n36j126j960j767j177j251j461j075p64j044r34
$$ 167717 168267 167834 166439 165376 164840 163714 161754 159987 158810 157559 156098 155023 154259 153215 152281
56615A52281O1N75k10q53k25L54m62j589j599j181j352j229J17J511J631J342
$$ 152281 152342 152917 152707 151854 151629 151983 151521 149932 148333 147152 145800 144571 144688 146199 147830 149172
56599A49172J846K352J796R96R18O71n81j580j048N4M42P21J469J409j47j250
$$ 149172 151018 153370 155166 156162 157080 157751 157170 155590 154542 154596 155038 155759 157228 158637 158490 157240
56583A57240l41R16O06O9J401L426L570K101J198J112N51k09J96J416J918J690
$$ 157240 156899 157815 158421 158490 159891 163317 166887 168988 170186 171298 171849 171640 171836 173252 175170 176860
56567A76860J893K576L026L557M733N845O149O500P857R521J0714J2187J4116
$$ 176860 178753 181329 184355 187912 192645 198490 204639 211139 218996 228517 239231 251418 265534
56554B65534J4329J1092N982J609j799n061p300p338o223n653n326m380l719m217
$$ 265534 279863 290955 296937 298546 296747 291686 284386 277048 270825 265172 259846 255466 251747 247530
56540B47530m469l207k059k938m449m092k400j602j671j076j12j41o53k63L93
$$ 247530 243061 239854 237795 234857 230408 226316 223916 222314 220643 219567 219455 219314 218661 218398 218791
56525B18791r2r43m78P04Q45J91J23L28k45q50k74N40R4q69r97j141k490l603
$$ 218791 218699 217756 217278 217982 218827 219018 219141 219469 219224 218374 218100 218640 218734 217865 216868 215727 213237 209634
56507B09634k646r59r05j789j505o76j290k557k145n00J4o57o43R8J92J17J235
$$ 209634 206988 206029 205124 203335 201830 201154 199864 197307 195162 194662 194676 194019 193376 193474 193666 193783 195018
56490A95018K441J575n74j359o79n16q82j39J266J280P6k90L90N15l4j35k41j382
$$ 195018 197459 199034 198460 197101 196422 195906 195024 194885 196151 197431 197507 197217 197607 198122 198088 197953 197712 196330
56472A96330k233q75J312J391k52o59P78K012K373K866L032J561m63q18r9m78
$$ 196330 194097 193222 194534 195925 195673 195014 195792 197804 200177 203043 206075 207636 207173 206355 206256 205778
56456B05778j356m52J475J533j11n27P40J229L05r1M68M01k30K64J494J464N88
$$ 205778 204422 203970 205445 206978 206867 206340 207080 208309 208614 208523 208991 209392 209162 209426 210920 212384 212972
56439B12972J005K113J278j138k161j527j829l191k792k44J478J239J104J780
$$ 212972 213977 216090 217368 216230 214069 212542 210713 207522 204730 204486 205964 207203 208307 210087
56425B10087J408j51m21J109J956J225J030K206K787J896J118J029K93r20o13
$$ 210087 211495 211344 210923 212032 213988 215213 216243 218449 221236 223132 224250 225279 225572 224652 224039
56410B24039J078J621M95j68J83j28r41j31J782J697n37j427J86J305L50l35Q08
$$ 224039 225117 226738 227233 227065 227248 227120 226179 226048 227830 229527 228990 227563 227749 229054 229404 229069 229877
56393B29877J904J599J360J968J780L26l11O50J260P12P76J966K264J060M57J245
$$ 229877 231781 233380 234740 236708 238488 238814 238503 239153 240413 241125 241901 243867 246131 247191 247648 248893
56377B48893J541O99N71J568J577J54l96O21J033J60J41J558K118J156J008K374
$$ 248893 250434 251133 251704 253272 254849 255003 254607 255228 256261 256421 256562 258120 260238 261394 262402 264776
56361B64776K820J394L55O98N10o70m62J656K841J935J358K283K497J038J86Q68
$$ 264776 267596 268990 269345 270043 270553 269883 269421 271077 273918 275853 277211 279494 281991 283029 283215 284083
56345B84083Q23o05o47J726L580L183K696L445L367J603P73K039K657J213N23
$$ 284083 284906 284301 283654 285380 288960 292143 294839 298284 301651 303254 304027 306066 308723 309936 310459
56330C10459K482M576M527L974M650N134M390M242N539N935M220K692K704K198
$$ 310459 312941 317517 322044 326018 330668 335802 340192 344434 349973 355908 360128 362820 365524 367722
56316C67722J63r37J69J047K75O3J465J903K63m81J303K739J899J375L167M923
$$ 367722 367885 366948 367117 368164 368439 368502 369967 371870 372133 371652 372955 375694 377593 378968 382135 387058
56300C87058M771M948P045Q487P456O495P501P954O005M493N754P174O159N025
$$ 387058 391829 396777 403822 412309 419765 426260 433761 441715 447720 452213 457967 465141 471300 476325
56286D76325O594R120R957J0173J1418J2246J1522J1404J3109J3909J2193J1041
$$ 476325 482919 492039 501996 512169 523587 535833 547355 558759 571868 585777 597970 609011
56274F09011J2927J5367J5847J6353J8818K0858K0546K0734K3958K7625K8987
$$ 609011 621938 637305 653152 669505 688323 709181 729727 750461 774419 802044 831031
56263H31031L0346L4523L9516M2678M5873N1576N8057O3423P0090Q0261R1137
$$ 831031 861377 895900 935416 978094 1023967 1075543 1133600 1197023 1267113 1347374 1438511
56252A438511R9796J08588J20617J34048J46060J58227J72544J86287J96313K04522
$$ 1438511 1538307 1646895 1767512 1901560 2047620 2205847 2378391 2564678 2760991 2965513
56242B965513K13496K20645K22150K18944K13250K03153J86128J64190J39946
$$ 2965513 3179009 3399654 3621804 3840748 4053998 4257151 4443279 4607469 4747415
56233D747415J11362P6193L7901J469l3110o7616r9685j25879j47118j65491j79228
$$ 4747415 4858777 4934970 4972871 4974340 4941230 4873614 4773929 4648050 4500932 4335441 4156213
56222D156213j86435j90077j93572j95108j91872j85972j80483j73652j63033
$$ 4156213 3969778 3779701 3586129 3391021 3199149 3013177 2832694 2659042 2496009
56213B496009j51377j42293j34024j23637j13358j06319j00062r0903q1006p4423
$$ 2496009 2344632 2202339 2068315 1944678 1831320 1725001 1624939 1534036 1453030 1378607
56203A378607o9809o3687n7298n3442n0139m4316l8255l5537l4054k9926k4866
$$ 1378607 1308798 1245111 1187813 1134371 1084232 1039916 1001661 966124 932070 902144 877278
56192H77278k2692k2060j9613j6901j6976j7591j5009j1262j0408j0908r019o386
$$ 877278 854586 832526 812913 796012 779036 761445 746436 735174 724766 713858 704839 698453
56180F98453o814q651p845n517n178n594l687j276j606k574p19J668R39k69K304
$$ 698453 691639 682988 675143 669626 664448 658854 655167 653891 652285 649711 648992 650660 651599 651330 653634
56165F53634O060N936L685M308O739O641N201O519R294R684R350J2072J5614J5578
$$ 653634 659694 665630 669315 673623 680362 687003 692204 698723 708017 717701 727051 739123 754737 770315
56151G70315J4224J6581K1001K2531K2464K5465L0339L2938L5127M1532N0454
$$ 770315 784539 801120 822121 844652 867116 892581 922920 955858 990985 1032517 1082971
56140A082971N7273O3724P4259Q6542R5318J02284J11908J20722J21348J14375
$$ 1082971 1140244 1203968 1278227 1364769 1460087 1562371 1674279 1795001 1916349 2030724
56130B030724J05822R5964Q1588O6395N7693N4665N0620M4434L9112L1965J7880
$$ 2030724 2136546 2232510 2314098 2380493 2438186 2492851 2543471 2587905 2627017 2658982 2676862
56119B676862L70j2097j8904k5644l2460l5635l8224m6988o0546p2271q2520r5981
$$ 2676862 2677232 2665135 2646231 2620587 2588127 2552492 2514268 2467280 2406734 2334463 2251943 2155962
56107B155962j09341j14446j11788j08339j04036r3453p8950o8573o2286n3465
$$ 2155962 2046621 1932175 1820387 1712048 1608012 1514559 1435609 1367036 1304750 1251285
56097A251285m2677l6376l3454k6936j7966j4063j4481j1524n542m108o828n693
$$ 1251285 1208608 1172232 1138778 1111842 1093876 1079813 1065332 1053808 1048266 1044158 1037330 1031637
56085A031637l92J455o57M77N274O817M952O382J0637J0707P456Q500J2972J2842
$$ 1031637 1031245 1032700 1032043 1032520 1037794 1044611 1049563 1055945 1066582 1077289 1084745 1093245 1106217 1119059
56071A119059Q996J0129J5719J6582J2534J2671J7615J8559J4807J4882J9091
$$ 1119059 1128055 1138184 1153903 1170485 1183019 1195690 1213305 1231864 1246671 1261553 1280644
56060A280644J8527J2830J1354J5014J4796R909R355J3676J3571Q605Q656J4545
$$ 1280644 1299171 1312001 1323355 1338369 1353165 1363074 1372429 1386105 1399676 1408281 1416937 1431482
56048A431482J6168J2266J2830J9248K1574J8280J9093K5325K7305K4142K5698
$$ 1431482 1447650 1459916 1472746 1491994 1513568 1531848 1550941 1576266 1603571 1627713 1653411
56037A653411L2191L2869K7775K9221L8448M3071M1004M3916N3207N6246N0877
$$ 1653411 1685602 1718471 1746246 1775467 1813915 1856986 1897990 1941906 1995113 2051359 2102236
56026B102236M9615N4751N3927M5515M3273N0110N2696M8003M9074N8297O1777
$$ 2102236 2151851 2206602 2260529 2306044 2349317 2399427 2452123 2500126 2549200 2607497 2669274
56015B669274N6888N7941O7659P1245O6059O8015Q0542Q7217Q3753Q6418R9555
$$ 2669274 2726162 2784103 2851762 2923007 2989066 3057081 3137623 3224840 3308593 3395011 3494566
56004C494566J06452J02435J04629J18214J26153J23470J27713J43794J53521
$$ 3494566 3601018 3703453 3808082 3926296 4052449 4175919 4303632 4447426 4600947
55995D600947J52154J59033J79288J92710J93896K04138K29403K47553K52289
$$ 4600947 4753101 4912134 5091422 5284132 5478028 5682166 5911569 6159122 6411411
55986F411411K66933K98547L23266L34292L57284L99560M33610M51313M82561
$$ 6411411 6678344 6976891 7300157 7634449 7991733 8391293 8824903 9276216 9758777
55977I758777N38178N88988O25312O79616P64373Q48436R23030J026647J174576
$$ 9758777 10296955 10885943 11511255 12190871 12955244 13803680 14726710 15753357 16927933
55968A6927933J333047J496292J715022K013682K361234K762290L284605L948185
$$ 16927933 18260980 19757272 21472294 23485976 25847210 28609500 31894105 35842290
55960C5842290M685561N465877O351750P375893Q486899R689902J1103380J2796453
$$ 35842290 40527851 45993728 52345478 59721371 68208270 77898172 89001552 101798005
55952A01798005J4736056J6997351J9834530K3434749K7859502L3297787L9705825
$$ 101798005 116534061 133531412 153365942 176800691 204660193 237957980 277663805
55945B77663805M5458600M6728472L9526292K3245826K004357j7947947l2173493
$$ 277663805 323122405 369850877 409377169 432622995 434627352 416679405 384505912
55938C84505912l9698914m1837866m0416782l7004779l2807689k8554115k4498109
$$ 384505912 344806998 302969132 262552350 225547571 192739882 164185767 139687658
55931A39687658k0715710j7335222j4451259j2016021r949035q246563o900233
$$ 139687658 118971948 101636726 87185467 75169446 65220411 56973848 50073615
55924E0073615n818129m911439m172814l602036l137117k722328k370045k096569
$$ 50073615 44255486 39344047 35171233 31569197 28432080 25709752 23339707 21243138
55916B1243138j863624j636432j436925j288311j163386j034441r21067q43603
$$ 21243138 19379514 17743082 16306157 15017846 13854460 12820019 11898952 11055349
55908A1055349p78185p00336o27660n79544n37289m82071m32037m05267l83552
$$ 11055349 10277164 9576828 8949168 8369624 7832335 7350264 6918227 6512960 6129408
55899F129408l47584l12414k94960k80293k52191k24982k14221k06064j85305
$$ 6129408 5781824 5469410 5174450 4894157 4641966 4416984 4202763 3996699 3811394
55890C811394j64899j59194j55570j40030j24407j21674j19835j06106r2439r1827
$$ 3811394 3646495 3487301 3331731 3191701 3067294 2945620 2825785 2719679 2627240 2535413
55880B535413r2828q2076o9461o7249o6176n5538m5809m8479n3670m9923m6410
$$ 2535413 2442585 2360509 2291048 2223799 2157623 2102085 2056276 2007797 1954127 1904204 1857794
55869A857794n3742o1996n9393n4304n7605o1100n4478m6340m7570n0176m3054
$$ 1857794 1804052 1742056 1682663 1628359 1570754 1509654 1455176 1408836 1361266 1311090 1268036
55858A268036l3145l1062l0917k3841j6833j8837k2304j7469j1481j4706k1105
$$ 1268036 1234891 1203829 1172912 1149071 1132238 1113401 1091097 1073628 1062147 1047441 1026336
55847A026336k0494j7706k1586k6960k5165k1059k2631k4819k0210j4799j6787
$$ 1026336 1005842 988136 966550 939590 914425 893366 870735 845916 825706 810907 794120
55836G94120k0539j7573j2839j4339j7119j3343q094r504j2931j0336n894p090
$$ 794120 773581 756008 743169 728830 711711 698368 690274 680770 667839 657503 651609 644519
55824F44519r693o594k585n406j0661j0255p436r179j1915r028m592n538q003
$$ 644519 634826 628232 625647 620241 609580 599325 591889 582710 570795 561767 557175 551637 543634
55811E43634n146p78j642l829m42M737M716K914N946J0085Q455M708O004R022
$$ 543634 538488 537710 536068 532239 531797 536534 541250 544164 550110 560195 568650 573358 579362 588384
55797E88384O363N37j605k169o939j2770j3302j1583j4175j8246j7005j2686j1666
$$ 588384 594747 595284 593679 591510 584571 571801 558499 546916 532741 514495 497490 484804 473138
55784D73138j1967q010k593j834l238r45K181r0m729m528j155r98k412O62O424
$$ 473138 461171 453161 450568 448734 445496 444551 446732 446642 441913 437385 436230 435232 432820 433482 439906
55769D39906Q725R043J2925J7978J7160J1008N333J01q241j6669j9221j7840j8697
$$ 439906 448631 457674 470599 488577 505737 516745 522078 522179 513938 497269 478048 460208 441511
55756D41511k0654j8183j2777j0482j0792q634m893m399n997m960k747m131p251
$$ 441511 420857 402674 389897 379415 368623 359989 355096 350697 344700 339740 336993 332862 325611
55743C25611o772m282n233q078p011l143k407m313l343Q6M48k432l652k748l401
$$ 325611 318839 314557 309324 301246 294235 291092 288685 284372 281029 281115 281563 279131 275479 272731 269330
55728B69330m970l738j225k097n138n395l579m218o245m858j185n88k692k500
$$ 269330 264360 260622 259397 257300 252162 246767 243188 238970 232725 227867 226682 226094 223402 220902
55714B20902j34j8j559j10L604M475K732L409O615P329M643K515J644q69m218
$$ 220902 220768 220750 219191 219081 222685 227160 229892 233301 239916 247245 251888 254403 256047 255178 250960
55699B50960m743l556n052q321q436n587m565n743n055k420j705k696j530J261
$$ 250960 246217 242661 237609 229288 220852 215265 210700 204957 199902 197482 195777 193081 191551 192812
55685A92812J513k29M25K971K823M90J094M683N901L641K353L161K331n99j664
$$ 192812 194325 194096 194521 197492 200315 200805 201899 206582 212483 216124 218477 221638 223969 223370 221706
55670B21706m47j001l764m501k399j397k339j616J222K181N13J89K337L516K731
$$ 221706 221259 220258 216494 211993 209594 208197 205858 204242 205464 207645 208158 208347 210684 214200 216931
55655B16931L053M934N045L007K308L349K579l50j630o69j300m343o010n154n109
$$ 216931 219984 224918 229963 232970 235278 238627 241206 240856 239226 238557 237257 232914 226904 221750 216641
55640B16641o760o728m152k629l582m144l227l390n048n169l205k284l061k588
$$ 216641 209881 203153 199001 196372 192790 188646 185419 182029 176981 171812 168607 166323 163262 160674
55626A60674n32j35j803k120n31n23k738l494j741q90k153k506j023p02k207k287
$$ 160674 160142 160007 158204 156084 155553 155030 152292 148798 147057 146167 144014 141508 140485 139783 137576 135289
55610A35289l59j29k622l962k375j027j586j312R88K143N40r61n95n72j970k302
$$ 135289 134930 134801 132179 128217 125842 124815 123229 121917 122905 125048 125588 124627 124032 123460 121490 119188
55594A19188p31j59j642k181m93M42q25j386M51J962J141mJ13j41j489j639J27
$$ 119188 118457 118298 116656 114475 113982 114424 113599 112213 112664 114626 115767 115763 115876 115735 114246 112607 112734
55577A12734J060p1p76J90N50o25p91R83J818L28p82J50Q85P7L5K050L603K930
$$ 112734 113794 113723 112947 113137 113687 113062 112271 113254 115072 115400 114618 114768 115653 115730 115765 117815 121418 124348
55559A24348J904J830Q92j645l179k255j091j247j104J41M32q84j222M73J556
$$ 124348 126252 128082 128974 127329 124150 121895 120804 119557 118453 118594 119026 118142 116920 117393 118949
55544A18949N49k32P48J567J077J203K679K987J002p22o67p94k060k125r1J147
$$ 118949 119498 119266 120014 121581 122658 123861 126540 129527 130529 129807 129140 128346 126286 124161 124070 125217
55528A25217j48j736j972k489l880l636j147J69j325k468j083J73r22j998q96
$$ 125217 125069 123333 121361 118872 114992 111356 110209 110378 109053 106585 105502 105675 104753 102755 101859
55513A01859J48j010k138r19N58k72j759j339k1K24K84J383J897L55j456j583
$$ 101859 102007 100997 98859 97940 98498 98226 96467 95128 95107 95331 95615 96998 98895 99250 97794 96211
55497I6211j191j633j533J10J222K66p26J65J278P92J82J103J993J164N1K15K84
$$ 96211 95020 93387 91854 91964 93186 93452 92726 92891 94169 94961 95143 96246 98239 99403 99454 99669 99953
55480I9953r15j448J36J539M97j262j205j74K4J93J434K117P08j047j069m59q97
$$ 99953 99038 97590 97726 99265 99762 98500 97295 97121 97145 97338 98772 100889 101597 100550 99481 99022 98125
55463I8125j262j51R12J42j130r67l04p73j478j008l17o71j038k43O42N69O96
$$ 98125 96863 96712 97624 97766 96636 95669 95365 94592 93114 92106 91789 91118 90080 89837 90479 91048 91744
55446I1744J758K103Q00k27L60Q45l6m42R08J835N57r63o23J77l14q12l3K74j140
$$ 91744 93502 95605 96405 96178 96538 97383 97347 96905 97813 99648 100205 99242 98619 98796 98482 97670 97637 97911 96771
55427I6771j959l42J314N02q80j98J104N30o63j71P54r0j265k64J644J660M19
$$ 96771 94812 94470 95784 96286 95406 95208 96312 96842 96179 96008 96762 96672 95407 95143 96787 98447 98866
55410I8866L17Q96K30r37o99J47k13q01K29J636J090n76j030o43j145j836j051
$$ 98866 99183 100079 100309 99372 98673 98820 98607 97806 98035 99671 100761 100185 99155 98512 97367 95531 94480
55393I4480K48K06k48O30J575M07j708k107j129q63j015oJ312J135M44J233K432
$$ 94480 94728 94934 94686 95316 96891 97298 95590 93483 92354 91491 90476 90470 91782 92917 93361 94594 97026
55376I7026J692j50m46N70N71n09q62n36r25j502q16K44j09j038n96M69J68p92
$$ 97026 98718 98568 98122 98692 99263 98754 97892 97356 96431 94929 94113 94357 94248 93210 92614 93083 93251 92459
55358I2459m12O00K02q06j61J425J414J21k4Q83N56j006j484m48K81J65K96N67
$$ 92459 92047 92647 92849 92043 91882 93307 94721 94842 94818 95701 96257 95251 93767 93319 93600 93765 94061 94628
55340I4628J1o34j6Q74L18o10J97J719J373k27l04J031J153j95p33j18k35j111
$$ 94628 94639 94005 93989 94863 95181 94571 94768 96487 97860 97633 97329 98360 99513 99318 98585 98467 98232 97121
55322I7121p62O93R61j50l64P76J216L65l2M81K81q94j241l35O3o86j128o43l15
$$ 97121 96359 97052 98013 97863 97499 98275 99491 99856 99824 100305 100586 99692 98451 98116 98179 97493 96365 95722 95407
55303I5407l70K47J304J183j85j062q69o92p49r0J004J139M13K69O91L37o52q04
$$ 95407 95037 95284 96588 97771 97586 96524 95655 94963 94214 94124 95128 96267 96680 96949 97640 97977 97325 96521
55285I6521r6J77J00Q05J748J391L36N77J802J767K46o44j92J68j07l3K89l18
$$ 96521 96425 96602 96702 97507 99255 100646 100982 101559 103361 105128 105374 104730 104538 104706 104599 104566 104855 104537
55267A04537j375j163Q2M78K5M12J379Q36j094j821n50O64P32R06J608J342j98
$$ 104537 103162 101999 102081 102559 102584 102996 104375 105211 104117 102296 101746 102410 103142 104048 105656 106998 106800
55250A06800j140n60J95K65M93J065P48o13j475j287j263j791j686o26J44J72
$$ 106800 105660 105100 105295 105560 106053 107118 107866 107253 105778 104491 103228 101437 99751 99125 99269 99441
55234I9441L99R69Q16j26p08p63j079j235j49J260R41p36j358n33k95j178j302
$$ 99441 99840 100809 101625 101499 100791 100028 98949 97714 97565 98825 99766 99030 97672 97139 96844 95666 94364
55217I4364lR69P21N18R88J033M40N64J490J419j44j346j011j22N04J330K139
$$ 94364 94361 95330 96051 96569 97557 98590 99030 99594 101084 102503 102359 101013 100002 99880 100384 101714 103853
55200A03853J722L32k25L60L87o79j301p26r7K9L99Q54J77j261j602p24l95p99
$$ 103853 105575 105907 105682 106042 106429 105750 104449 103723 103626 103655 104054 104908 105085 103824 102222 101498 101103 100304
55182A00304j76J503K023Q74K43J016J296J24p19q8O16M00M27J258J429L32m01
$$ 100304 100128 101631 103654 104528 104771 105787 107083 107207 106488 106400 107016 107416 107843 109101 110530 110862 110461
55165A10461J5Q2q51r45Q31K638K768K102J831J350J32p73q05j054j867j784l73
$$ 110461 110476 110558 109707 108762 109593 112231 114999 117101 118932 120282 120414 119641 118836 117782 115915 114131 113758
55148A13758N22j13p66l57k60j503k554j863l29N80J002J341R79o7l90L98P25
$$ 113758 114280 114167 113401 113044 112784 111281 108727 106864 106535 107115 108117 109458 110437 110370 109980 110378 111103
55131A11103j67q85n87m10q41m61J082J701L27j056p26Q8j39n67j89n1j003j634
$$ 111103 110936 110051 109464 109054 108213 107752 108834 110535 110862 109806 109080 109168 109029 108462 108273 108222 107219 105585
55113A05585q51j14p41j271p0J647J925J299J279J504R28K59O81J518J505J040
$$ 105585 104734 104620 103879 102608 102538 104185 106110 107409 108688 110192 111120 111379 112060 113578 115083 116123
55097A16123J045J005J81n99l56J94M5k21K20P24N70N53J394K096J680J001J126
$$ 116123 117168 118173 118354 117755 117399 117593 117638 117417 117637 118361 118931 119484 120878 122974 124654 125655 126781
55080A26781J414R74M55O79R70N22k5N8K59K22O77J570J404j22j001j86M46o62
$$ 126781 128195 129169 129624 130303 131273 131795 131770 131828 132087 132309 132986 134556 135960 135838 134837 134651 135097 134435
55062A34435j952j467j23K20j26p9k79j578k724k231r80n02l10O02J279M87p12
$$ 134435 132483 131016 130893 131113 130987 130908 130629 129051 126327 124096 123116 122614 122304 122906 124185 124672 123960
55045A23960p80n57j522k648j952m7P92K09k86j41J2K43R36J299N37l22O4R63
$$ 123960 123180 122623 121101 118453 116501 116454 117246 117455 117169 117028 117040 117283 118219 119518 120055 119733 119797 120760
55027A20760R65N51R08J266J92j478j707o41j67o63p69j09K79Q5L6K45K31K81
$$ 120760 121725 122276 123184 124450 124642 123164 121457 120816 120649 119986 119217 119108 119387 119472 119508 119753 119984 120265
55009A20265R26J499J010m9n36n92q94r25L0R63M73p57r59n1P41J295K197K687
$$ 120265 121191 122690 123700 123651 123115 122523 121629 120704 120734 121697 122170 121413 120454 120403 121144 122439 124636 127323
54991A27323J524m22r53J92J128Q42K18J3j22l67l40m9J11L22Q49J040K52p53
$$ 127323 128847 128425 127472 127664 128792 129634 129852 129865 129743 129376 129036 128987 129098 129420 130269 131309 131561 130808
54973A30808q66m91o64r93m24N42M88m03n22N99J757K094J959J735J348J001J032
$$ 130808 129942 129451 128787 127794 127370 127912 128400 127997 127475 128074 129831 131925 133884 135619 136967 137968 139000
54956A39000J145Q21K32k02n64p66o3J492K237J012r34j710j447j440j751j548
$$ 139000 140145 140966 141198 140996 140432 139666 139603 141095 143332 144344 143410 141700 140253 138813 137062 135514
54940A35514r76o95l24P02J622J495J052J474K179J923J143J053J279O90p5N64
$$ 135514 134538 133843 133519 134221 135843 137338 138390 139864 142043 143966 145109 146162 147441 148131 148056 148620
54924A48620K408L911M821O029P240P301O515O161N971M572K251P44K18r73l308
$$ 148620 151028 154939 159760 165789 173029 180330 186845 193006 198977 203549 205800 206544 206762 205789 202481
54909B02481n253n828n828o017o014n511m895m268l370k633k745l159k642j276
$$ 202481 197228 191400 185572 179555 173541 168030 163135 158867 155497 152864 150119 146960 144318 143042
54895A43042l23j29J11O45Q72P96J119J812K154K086K100K017J475J263K465M499
$$ 143042 142719 142590 142701 143346 144218 145014 146133 147945 150099 152185 154285 156302 157777 159040 161505 166004
54879A66004N728N811N791O110O211N827N091L709J638om69j024l187n970p146
$$ 166004 171732 177543 183334 189444 195655 201482 206573 210282 211920 211914 211445 210421 207234 201264 194118
54864A94118o643o252o441o094n147m851n258n021l892l080k871k231j037l93
$$ 194118 187475 181223 174782 168688 163541 158690 153432 148411 144519 141439 138568 136337 135300 134907
54850A34907m73k62K79J0j055j532j121j041j611j687j020q17j310j089L31J481
$$ 134907 134434 134172 134451 134461 133406 131874 130753 129712 128101 126414 125394 124577 123267 122178 122509 123990
54834A23990J376R52J096J169N07k31l52k21k66j63J72J77k17k58K98Q14J001
$$ 123990 125366 126318 127414 128583 129090 128859 128507 128286 128020 127857 128029 128206 127989 127731 128029 128843 129844
54817A29844J204J219M23p33r70k20K33p7k22J74K74k48n36j58K30L26O37J103
$$ 129844 131048 132267 132690 131957 130987 130767 131000 130923 130701 130875 131149 130901 130365 130207 130437 130763 131400 132503
54799A32503R22K09R7P19Q56J40k18M97J341J465J311J336J052K15m61n44o14
$$ 132503 133425 133634 133731 134450 135306 135446 135228 135725 137066 138531 139842 141178 142230 142445 141984 141440 140826
54782A40826j079j420j162m94M72J846L116L419K857K342K114J803J892L334N656
$$ 140826 139747 138327 137165 136671 137143 138989 142105 145524 148381 150723 152837 154640 156532 159866 165522
54767A65522P192P444P441P634P274O165N104M259K928J220J6r54k886n421o585
$$ 165522 172714 180158 187599 195233 202507 208672 213776 218035 220963 222183 222199 221245 218359 212938 206353
54752B06353n840m937n049n289m897m675n114n145l956k341j177k74M06J77p99
$$ 206353 200513 195576 190527 185238 180341 175666 170552 165407 161451 159110 157933 157659 158065 158242 157443
54737A57443j140m12J05l08o36k05Q0k53K3J708L587M352M489M936N421N513N781
$$ 157443 156303 155891 155996 155688 155052 154847 154927 154674 154697 156405 159992 164344 168833 173769 179190 184703 190484
54720A90484O459O386M765K667J404N62r08k858m461n536o133n846m704l782l795
$$ 190484 196943 203329 208094 210761 212165 212727 211819 208961 204500 198964 192831 186985 182281 178499 174704
54705A74704m085l876l467l298k965k134j293p58o2Q12R14p1j006j019p37q35
$$ 174704 170619 166743 163276 159978 157013 154879 153586 152828 152766 153578 154492 154421 153415 152396 151659 150824
54689A50824q12k60P2m23j032j006q19j014j054m38J42m0n69p92r18j219j282
$$ 150824 150012 149752 149824 149401 148369 147363 146544 145530 144476 144038 144180 144140 143571 142779 141861 140642 139360
54672A39360r04o51p26n39p9k56j074j170n6Q26M52j57P1M44J76J27J113K017
$$ 139360 138456 137805 137079 136540 136461 136205 135131 133961 133905 134731 135183 135026 135097 135541 135717 135844 136957 138974
54654A38974J525M42K84P06K98q45j391r84m34r5L49Q57J047R86Q51L98l47n97
$$ 138974 140499 140941 141225 141931 142229 141384 139993 139009 138575 138480 138829 139686 140733 141719 142570 142968 142621 142024
54636A42024J2O08M51J45L75M96k91j336j502r48n50l08K79R12R35N35K98J10
$$ 142024 142036 142644 143095 143240 143615 144111 143820 142484 140982 140034 139484 139176 139455 140367 141302 141837 142135 142245
54618A42245l81p79n35O3M99R43J576J770R68k11p86o55k13M34J030Q95N2l21
$$ 142245 141864 141085 140550 140613 141112 142055 143631 145401 146369 146158 145372 144717 144504 144938 145968 146863 146915 146594
54600A46594L69J030N92k97n24l32m72n76kN71N2j134j599j103o34o73p06l49
$$ 146594 146963 147993 148585 148288 147764 147432 146960 146384 146382 146953 147005 145871 144272 143169 142535 141862 141156 140807
54582A40807J89N73N70J4p24q19r1N65N30L59O48R81Q48O07O00L47m38r80o66
$$ 140807 140996 141569 142139 142153 141429 140610 140519 141084 141614 141973 142621 143602 144450 145057 145657 146004 145566 144586 143920
54563A43920j02R1M97J652K629K227P68m66r48r52o32j50J5j81q8M19N35Q8J74
$$ 143920 143818 143909 144406 146058 148687 150914 151682 151216 150268 149316 148684 148534 148549 148368 148280 148699 149234 149322 149496
54544A49496J241J998J490Q00J175J899J631O71J34o9o07j118r48o30r51j360
$$ 149496 150737 152735 154225 155025 156200 158099 159730 160401 160535 160466 159859 158741 157793 157163 156212 154852
54528A54852r78k74j64l13l8J18n54j252r51m03q80j760j519m06J01p8K20R65
$$ 154852 153874 153600 153436 153123 153085 153203 152649 151397 150446 150043 149163 147403 145884 145478 145579 145501 145721 146686
54510A46686R91L28K81J056J339M68o82j290j425j168l40O82J185J272J600K030
$$ 146686 147677 148005 148286 149342 150681 151149 150467 149177 147752 146584 146244 146926 148111 149383 150983 153013
54494A53013J723N59o38j222j079k08J037J774J589J221J257R94j96j371j344
$$ 153013 154736 155295 154657 153435 152356 152148 153185 154959 156548 157769 159026 160020 159824 158453 157109
54479A57109o05l63n24k95J5k62m26O21K198K738K308K222K567K322J568J398
$$ 157109 156504 156141 155617 155322 155337 155075 154649 155270 157468 160206 162514 164736 167303 169625 171193 172591
54463A72591J716J346L38l5L82L73l74p79m90m65j040j252o50k9L7q6k05n99r32
$$ 172591 174307 175653 175991 175956 176338 176711 176337 175558 175068 174603 173563 172311 171661 171632 171669 171583 171378 170779 169847
54444A69847n22J25k84j522j795m50R46R87K62k0J33J1n10j041j340j284q12k20
$$ 169847 169325 169450 169166 167644 165849 165399 166345 167332 167594 167574 167707 167718 167208 166167 164827 163543 162731 162511
54426A62511Q3J74L58M37M7m23k80L24O27N08M80O96R63J427K101K119P26j262
$$ 162511 162594 162768 163126 163563 163610 163187 162907 163231 163858 164366 164846 165542 166505 167932 170033 172152 172878 171616
54408A71616k291k005j174j48J122J980J641O70L28O32O79M80Q02J386J203L93
$$ 171616 169325 167320 166146 165998 167120 169100 170741 171411 171739 172371 173050 173530 174332 175718 176921 177314
54392A77314J24N47O97M79P70J484J467N92O3K58J67n99j027n14K14N60R15J494
$$ 177314 177438 177985 178682 179161 179931 181415 182882 183474 183537 183795 183962 183363 182336 181822 182036 182596 183511 185005
54374A85005J774J619J605J796J600J106J194J902K219J861J754K393L110L351
$$ 185005 186779 188398 190003 191799 193399 194505 195699 197601 199820 201681 203435 205828 208938 212289
54360B12289L269K788J538J05l24J01j42j610l028l331k968k656k323j926j966
$$ 212289 215558 218346 219884 219989 219665 219766 219624 218014 214986 211655 208687 206031 203708 201782 199816
54345A99816k484k763k479k053j574p32J3l30j541k211j857j411j285p02N35J298
$$ 199816 197332 194569 192090 190037 188463 187731 187744 187414 185873 183662 181805 180394 179109 178407 178942 180240
54329A80240R79N24P97J310J359J184J191J126O35k47j462k803l357k381p67j71
$$ 180240 181219 181743 182540 183850 185209 186393 187584 188710 189345 189098 187636 184833 181476 179095 178328 178157
54313A78157o37p17M9O17N54N72O72j07j551k042j221p21j372j810r51J64K74
$$ 178157 177520 176803 176852 177469 178023 178595 179267 179160 177609 175567 174346 173625 172253 170443 169492 169656 169930
54296A69930j55k24j55l01j21N87Q50J17o72o43k21J09P44J672J908J275J086
$$ 169930 169775 169551 169396 169095 168974 169561 170411 170528 169856 169213 168992 169101 169845 171517 173425 174700 175786
54279A75786J907K365J465L20J28J07p73j650j182J54R65J050R43M72m39o66O03
$$ 175786 177693 180058 181523 181843 181971 182078 181305 179655 178473 178627 179592 180642 181585 182057 181618 180952 181555
54262A81555K104K056Q27L19J136K132K290J678P52l8j81L17O32K26l14l21j03
$$ 181555 183659 185715 186542 186861 187997 190129 192419 194097 194849 194811 194630 194947 195579 195805 195491 195170 195067
54245A95067r0J10P54J002J36j061j372q72m02q7M14P89M90j72m83m52n47p67
$$ 195067 194977 195087 195841 196843 196979 195918 194546 193674 193272 193185 193599 194388 194878 194706 194223 193771 193224 192457
54227A92457q54q69q40m13L77P58L72l4J85O18Q31J238J966J963N16j308k011
$$ 192457 191603 190734 189894 189481 189858 190616 190988 190954 191139 191757 192588 193826 195792 197755 198271 196963 194952
54210A94952j622j173r83p62o18p40o94j82J76j01l30J82P46L26p45j329j197
$$ 194952 193330 192157 191174 190412 189794 189054 188360 188178 188354 188253 187923 188105 188851 189177 188432 187103 185906
54193A85906q72m30K85P93N26r7l02j45r1O3O97J411J550J299J248J397J425J307
$$ 185906 185034 184604 184889 185682 186208 186111 185809 185664 185573 185636 186333 187744 189294 190593 191841 193238 194663 195970
54175A95970Q88l30k010k617j393K00K97q86j752j674j234p79k41J15J22L79J258
$$ 195970 196858 196528 194518 191901 190508 190708 191005 190119 188367 186693 185459 184680 184439 184554 184676 185055 186313
54158A86313J838J155r4n45k48k20m46n5P99R80K47l97m12l42o40j043j293j412
$$ 186313 188151 189306 189212 188667 188419 188199 187753 187698 188497 189477 189724 189327 188915 188573 187933 186890 185597 184185
54140A84185j182l28P24J155Q74N06M20M77O22R13J106R33O08M51L76K96N31J175
$$ 184185 183003 182675 183399 184554 185428 185934 186354 186831 187453 188366 189472 190405 191013 191464 191840 192136 192667 193842
54122A93842J682J764J992K673K961K140R59N88R31J266J781L092M729N611N693
$$ 193842 195524 197288 199280 201953 204914 207054 208013 208601 209532 210798 212579 215671 220400 226011 231704
54107B31704N755N847N254L846K241O77j040k669l651m059m460m922n043m723
$$ 231704 237459 243306 248560 252406 254647 255324 254284 251615 247964 243905 239445 234523 229480 224757
54093B24757m180l462k703k375k490k234j262o11j160k031j788o16J45R4n2Q3
$$ 224757 220577 217115 214412 212037 209547 207313 206051 205440 204280 202249 200461 199845 199990 200084 200032 200115
54077B00115L59J021K263L203K854J886J869K857L297K386J050K77j07o03j079
$$ 200115 200474 201495 203758 206961 209815 211701 213570 216427 219724 222110 223160 223437 223330 222727 221648
54062B21648j093n02M30J009N38p11j361o19N23P12J96R5M31L95J26N59J644K338
$$ 221648 220555 220053 220483 221492 222030 221319 219958 219339 219862 220574 220770 220865 221296 221691 221817 222376 224020 226358
54044B26358K345K442K973L375L385L473L955M654N527O573P232O933O187O001
$$ 226358 228703 231145 234118 237493 240878 244351 248306 252960 258487 265060 272292 279225 285412 291413
54030B91413O433O736O685O604O332N455M376L827L463K406R85M72R97J198K57
$$ 291413 297846 304582 311267 317871 324203 329658 334034 337861 341324 343730 344715 345187 346184 347382 347639
54015C47639j053j664j425p94l23o11j818l162l759l856m295n061n444n371n323
$$ 347639 346586 344922 343497 342703 342380 341769 339951 336789 333030 329174 324879 319818 314374 309003 303680
54000C03680n192m509l640l376l527l287k774k687k645j592J12Q13K6r28j203
$$ 303680 298488 293979 290339 286963 283436 280149 277375 274688 272043 270451 270563 271376 271402 270474 269271
53985B69271j565k678l750l744k785j609n39L67R57J198J193Q44K42K03J398L151
$$ 269271 267706 265028 261278 257534 254749 253140 252601 252968 253925 255123 256316 257160 257402 257605 259003 262154
53969B62154M262M816N813P081P226N866M261L287K237L18j971l617m321m344
$$ 262154 266416 271232 277045 284126 291352 297218 301479 304766 307003 307321 305350 301733 297412 293068
53955B93068m010l769l925m066l522k474j669j128k90O72J001Q63J283K399L210
$$ 293068 289058 285289 281364 277298 273776 271302 269633 268505 268215 268887 269888 270751 272034 274433 277643
53940B77643L321L446L893M046L736L657L876L450K206J459K102L209L457K842
$$ 277643 280964 284410 288303 292349 296085 299742 303618 307068 309274 310733 312835 316044 319501 322343
53926C22343K213K024K375L417M919O100O536O616O721O655O304O030O079O247
$$ 322343 324556 326580 328955 332372 337291 343391 349927 356543 363264 369919 376223 382253 388332 394579
53912C94579O468O967P661Q085Q086P889P530O942O433O126N213K981K83j346
$$ 394579 401047 408014 415675 423760 431846 439735 447265 454207 460640 466766 471979 474960 475243 473897
53898D73897j915k677l794m027k986j913j768k240l078m676o681p739p470p208
$$ 473897 471982 469305 465511 461484 458498 456585 454817 452577 449499 444823 438142 430403 422933 415725
53884D15725p971r038r303q774p885o731n697n570o216o352n412m388m073l899
$$ 415725 407754 398716 389413 380639 372754 366023 360326 354756 348540 342188 336776 332388 328315 324416
53870C24416l350l127l842m741m832m286l770l347k912k750k891k778k268j990
$$ 324416 321066 317939 314097 309356 304524 300238 296468 293121 290209 287459 284568 281790 279522 277532
53856B77532k154k134j830k089l042l455k648j696j690k098j968j542j444j328
$$ 277532 275378 273244 271414 269325 266283 262828 260180 258484 256794 254696 252728 251186 249742 248414
53842B48414o52J59M32L88N08O20N37O32R25O89j28k28J093K473K313J009O8j36
$$ 248414 247762 247921 248353 248741 249249 249869 250406 251038 251963 252652 252524 252296 253389 255862 258175 259184 259252 259116
53824B59116k73n02m37j82r1M3N36J004R90Q22R60J146J078J140J597J838J444
$$ 259116 258843 258341 257904 257722 257631 257674 258210 259214 260204 261026 261986 263132 264210 265350 266947 268785 270229
53807B70229J088J478K258K914L743M801N114M295L779M820O343O535N718N586
$$ 270229 271317 272795 275053 277967 281710 286511 291625 295920 299699 304519 310862 317397 323115 328701
53793C28701O248O188N049M229M500M884M413L447K686K139J589J075M49o54k033
$$ 328701 334949 341137 346186 350415 354915 359799 364212 367659 370345 372484 374073 375148 375597 374943 372910
53778C72910k929l075l077l484m227n009n596n645m976m171m185n104n920n755
$$ 372910 369981 366906 363829 360345 356118 351109 345513 339868 334892 330721 326536 321432 315512 309757
53764C09757m817l963l634l541l129k283j579j695k491l023k690j963j596j598
$$ 309757 304940 300977 297343 293802 290673 288390 286811 285116 282625 279602 276912 274949 273353 271755
53750B71755j453j042p34p33q65r15q27o23l82k71l62n42o67o35l94j41k82q14
$$ 271755 270302 269260 268526 267793 266928 266013 265186 264563 264181 263910 263548 263006 262339 261704 261310 261169 260887 260073
53732B60073r63j05J213J911J865J838K058J907J102J17o66j153q67O10K441L114
$$ 260073 259110 259005 260218 262129 263994 265832 267890 269797 270899 271016 270350 269197 268330 268940 271381 274495
53716B74495K534K084K425K683K358K286K907L206K403J269P61N79K16J59Q98
$$ 274495 277029 279113 281538 284221 286579 288865 291772 294978 297381 298650 299411 299990 300206 300365 301263
53701C01263J862K486L289M781O265O810O482N683M375K874K217K606K703J642
$$ 301263 303125 305611 308900 313681 319946 326756 333238 338921 343296 346170 348387 350993 353696 355338
53687C55338M47K73N19J87k35J19O68L93k54k38J25j53q70j190j340j974k474
$$ 355338 355785 356058 356577 356764 356529 356648 357316 357709 357455 357217 357342 357189 356319 355129 353789 351815 349341
53670C49341j718j38P08L26m42r94j334j249n70N0n1m10l21j24l07k23O61J168
$$ 349341 347623 347485 348193 348519 348077 347083 345749 344500 343930 343980 343929 343519 343198 343074 342767 342544 343205 344373
53652C44373Jj802k137j060m78q95q67J97R70N29k28j42P13J733K626L163L163
$$ 344373 344374 342572 340435 339375 338897 338002 337135 337332 338302 338831 338603 338461 339174 340907 343533 346696 349859
53635C49859L083L484L870L173J572N38R26K100L076L475L327K939K917L393L510
$$ 349859 352942 356426 360296 363469 365041 365579 366505 368605 371681 375156 378483 381422 384339 387732 391242
53620C91242K697J911K343L417L686L181L125L568L325K274J674J994K309K240
$$ 391242 393939 395850 398193 401610 405296 408477 411602 415170 418495 420769 422443 424437 426746 428986
53606D28986K616L645M199L700L160L516M235M368L827K965J903R04M49M96M50
$$ 428986 431602 435247 439446 443146 446306 449822 454057 458425 462252 465217 467120 468024 468473 468969 469419
53591D69419K20K84N55K41q08j756k034j938j706j215p66j001j686j817j268j093
$$ 469419 469639 469923 470478 470719 469911 468155 466121 464183 462477 461262 460496 459495 457809 455992 454724 453631
53575D53631j815k637k881k954l313l592l416l048k686k035j138o71p99o89K32
$$ 453631 451816 449179 446298 443344 440031 436439 433023 429975 427289 425254 424116 423445 422646 421957 422189
53560D22189J357J820J593J118N45j18o68j018j340j579j350n84K89R41J452J858
$$ 422189 423546 425366 426959 428077 428622 428504 427836 426818 425478 423899 422549 421965 422254 423195 424647 426505
53544D26505K012J942J864J853J957K398L084L354K899K477K843L515L677L700
$$ 426505 428517 430459 432323 434176 436133 438531 441615 444969 447868 450345 453188 456703 460380 464080
53530D64080M470N664O221O236O757P908Q817R307J0037J1009J1545J1850J2813
$$ 464080 468550 474214 480435 486671 493428 501336 510153 519460 529497 540506 552051 563901 576714
53517E76714J4194J4753J4401J4425J5264J5949J6183J7046J8976K0859K1931
$$ 576714 590908 605661 620062 634487 649751 665700 681883 698929 717905 738764 760695
53506G60695K2870K4212K5250K5457K5404K5428K4829K3362K2020K1441K0959
$$ 760695 783565 807777 833027 858484 883888 909316 934145 957507 979527 1000968 1021927
53495A021927K0124J9705K0116K0313J9445J8281J7843J7805J7469J7133J7286
$$ 1021927 1042051 1061756 1081872 1102185 1121630 1139911 1157754 1175559 1193028 1210161 1227447
53484A227447J7502J7368J7490J8346J9077J8716J7726J7147J6946J6440J5609
$$ 1227447 1244949 1262317 1279807 1298153 1317230 1335946 1353672 1370819 1387765 1404205 1419814
53473A419814J4832J3932J2504J0727Q918O920M720K929J753K60k415n746q610
$$ 1419814 1434646 1448578 1461082 1471809 1480727 1487647 1492367 1495296 1497049 1497309 1494894 1489148 1480538
53460A480538j0650j2112j3044j3572j4199j4984j5178j4528j4096j4856j6299
$$ 1480538 1469888 1457776 1444732 1431160 1416961 1401977 1386799 1372271 1358175 1343319 1327020
53449A327020j7446j8368j9540k0490k0399j9500j8701j8172j7437j6459j5620
$$ 1327020 1309574 1291206 1271666 1251176 1230777 1211277 1192576 1174404 1156967 1140508 1124888
53438A124888j4843j3691j2045j0008p556m967l029k040j183K67J734K246J996
$$ 1124888 1110045 1096354 1084309 1074301 1066745 1061778 1058749 1056709 1055526 1055793 1057527 1059773 1061769
53425A061769K004K663L616M725O186P884R463J0855J2168J3342J4482J6006J7915
$$ 1061769 1063773 1066436 1070052 1074777 1080963 1088847 1098310 1109165 1121333 1134675 1149157 1165163 1183078
53412A183078J9487K0376K1335K3043K4848K5702K5808K6324K7760K9547L1021
$$ 1183078 1202565 1222941 1244276 1267319 1292167 1317869 1343677 1370001 1397761 1427308 1458329
53401A458329L2023L2794L3874L5810L8376M0527M1791M3080M5398M8294N0541
$$ 1458329 1490352 1523146 1557020 1592830 1631206 1671733 1713524 1756604 1802002 1850296 1900837
53390A900837N1797N2675N3498N3969N3923N3551N2943N2039N0984M9968M8937
$$ 1900837 1952634 2005309 2058807 2112776 2166699 2220250 2273193 2325232 2376216 2426184 2475121
53379B475121M7792M6550M4978M2532L9082L5163L1079K6501K1385J6487J2280
$$ 2475121 2522913 2569463 2614441 2656973 2696055 2731218 2762297 2788798 2810183 2826670 2838950
53368B838950Q219L773o34m668r206j5263k2324k8853l4094l8372m1970m4820
$$ 2838950 2847169 2850942 2850308 2845640 2836434 2821171 2798847 2769994 2735900 2697528 2655558 2610738
53356B610738m7019m8827n0287n1425n2487n3292n2937n0991m8413m6442m5029
$$ 2610738 2563719 2514892 2464605 2413180 2360693 2307401 2254464 2203473 2155060 2108618 2063589
53345B063589m3366m1427l9911l9034l8412l7886l7493l6858l5552l3855l2242
$$ 2063589 2020223 1978796 1938885 1899851 1861439 1823553 1786060 1749202 1713650 1679795 1647553
53334A647553l0455k7980k5237k3222k2082k0959j9151j6666j3840j1184r479
$$ 1647553 1617098 1589118 1563881 1540659 1518577 1497618 1478467 1461801 1447961 1436777 1427298
53323A427298r103r533j0195j1486j3875j6380j7174j5819j3734j2299j1483j0667
$$ 1427298 1418195 1408662 1398467 1386981 1373106 1356726 1339552 1323733 1309999 1297700 1286217 1275550
53311A275550r822r290r022q571p546n804l473j005R60K042K347K400K849M044
$$ 1275550 1265728 1256438 1247416 1238845 1231299 1225495 1222022 1221017 1221977 1224019 1226366 1228766 1231615 1235659
53297A235659N728P403R012J0937J3238J5413J7080J8374J9484K0442K1521K3150
$$ 1235659 1241387 1248790 1257802 1268739 1281977 1297390 1314470 1332844 1352328 1372770 1394291 1417441
53285A417441K5028K6128K5945K4961K3558K1423J8606J6144J4792J3936J2512
$$ 1417441 1442469 1468597 1494542 1519503 1543061 1564484 1583090 1599234 1614026 1627962 1640474
53274A640474J0240P332L846J96k669m546o532r401j2264j4039j5270j7163j9592
$$ 1640474 1650714 1658046 1661892 1662088 1659419 1654873 1648341 1638940 1626676 1612637 1597367 1580204 1560612
53261A560612k1537k2939k4556k6349k7451k7674k7750k8147k8683k9147k9418
$$ 1560612 1539075 1516136 1491580 1465231 1437780 1410106 1382356 1354209 1325526 1296379 1266961
53250A266961k9161k8304k7449k6943k6184k4742k3482k3291k3529k3107k2452
$$ 1266961 1237800 1209496 1182047 1155104 1128920 1104178 1080696 1057405 1033876 1010769 988317
53239I88317k2685k3373k2967k1285j9677j8678j7357j5366j3780j3340j3275
$$ 988317 965632 942259 919292 898007 878330 859652 842295 826929 813149 799809 786534
53228G86534j2629j1517j0456r453q331p255o442o019o295p423q774r502r765
$$ 786534 773905 762388 751932 742479 734148 726893 720451 714432 708137 700714 691940 682438 672673
53215F72673j0431j1655j2784j3606j4471j5111j4674j3191j1750j0912j0126
$$ 672673 662242 650587 637803 624197 609726 594615 579941 566750 555000 544088 533962
53204E33962r145q688r054r279q497p192o341o107o148o529p475q657r416r504
$$ 533962 524817 516129 507075 497796 489299 482107 475766 469659 463511 456982 449507 440850 431434 421930
53190D21930r126q523p902p455p177o824o241n534m896m470m341m349m104l555
$$ 421930 412804 404281 396379 388924 381747 374923 368682 363148 358252 353782 349441 345092 340988 337433
53176C37433l210l353l409k785j971j865k322k337j617r19p90r39j024j120j173
$$ 337433 334223 330870 327461 324676 322705 320840 318518 316181 314564 313645 312855 311916 310892 309772 308599
53161C08599q57k75p3n09j062j183r86r37j251j731j920j485p84o04j025j059
$$ 308599 307742 307467 307394 306885 305823 304640 303654 302717 301466 299735 297815 296330 295546 294942 293917 292858
53145B92858j22Q51P33j2j42L03J86o66j203r68o84p21m50L86R54N72l36j012
$$ 292858 292736 293587 294320 294308 294166 294469 294655 293989 292786 291818 291134 290413 289963 290349 291303 291875 291539 290527
53127B90527j162o72N38J883K330J714J079J257J908K282K178J825J598K058L423
$$ 290527 289365 288693 289231 291114 293444 295158 296237 297494 299402 301684 303862 305687 307285 309343 312766
53112C12766M780M810L489K160J579J084Q7q05r24q07j349k402l047k945k633
$$ 312766 317546 322356 325845 328005 329584 330668 330755 329950 329026 328219 326870 324468 321421 318476 315843
53097C15843k707l197l597l367k509j653j298j125o48j77l68j014j244q30l11
$$ 315843 313136 309939 306342 302975 300466 298813 297515 296390 295742 295565 295197 294183 292939 292109 291798
53082B91798P4N07O73k8j269j981j888j647j298j34J501J938N15j183j394l69
$$ 291798 291872 292379 293052 293024 291755 289774 287886 286239 284941 284807 286308 288246 288761 287578 286184 285815
53066B85815M81O14M17M3o97j687k561l075k961j995o46N9j75m81j73L22M38N02
$$ 285815 286296 286910 287327 287370 286673 284986 282425 279350 276389 274394 273748 273807 273632 273151 272978 273300 273738 274240
53048B74240J018J637J702J232O92K64m8j18m0j83m74l24L01N61J26o5P54J845
$$ 274240 275258 276895 278597 279829 280521 280785 280737 280619 280579 280396 279922 279598 279899 280460 280586 280521 281275 283120
53030B83120K012J299O30K85j23n21l34M39J002P56r9r80j504j547j152l97O55
$$ 283120 285132 286431 287061 287346 287223 286702 286368 286807 287809 288565 288466 287486 285982 284435 283283 282886 283541
53013B83541J751K322J928Q85N7r5K50Q47J555J997J825J383J245J121K59j012
$$ 283541 285292 287614 289542 290427 290484 290389 290639 291486 293041 295038 296863 298246 299491 300612 300871 299859
52997B99859j347l53P51R28O27O24P71P22Q58J509K170K367K443K675K516J639
$$ 299859 298512 298159 298910 299838 300465 301089 301860 302582 303440 304949 307119 309486 311929 314604 317120 318759
52981C18759Q10O59M70o16j951k229j442o64l21L1M63N21K12N0J07O8J07P84J989
$$ 318759 319569 320228 320698 320082 318131 315902 314460 313796 313475 313506 313969 314490 314702 314752 314859 314927 315034 315818 317807
52962C17807K877K963K509J859J023R1o46j083j313j287r16m92n15j052j668j965
$$ 317807 320684 323647 326156 328015 329038 329129 328483 327400 326087 324800 323884 323392 322877 321825 320157 318192
52946C18192j894j688j653j865j936j421n88k35n49p98n81n02j002j349o90M66
$$ 318192 316298 314610 312957 311092 309156 307735 307147 306912 306363 305565 304984 304482 303480 302131 301441 301907
52930C01907Q57K14n70q21p09n89n91q42j362j669j169rJ025J480J541J350P12
$$ 301907 302764 302978 302408 301587 300878 300289 299698 298856 297494 295825 294656 294647 295672 297152 298693 300043 300755
52913C00755l30j141j096k98N11P32M36J16K2m1k21k72l7M7m19r54p54J1L52k2
$$ 300755 300425 299284 298188 297890 298401 299133 299569 299685 299707 299666 299445 299173 299136 299183 298764 297810 297056 297067 297419 297397
52893B97397l14k4L53L98M82R10J293J376J569J910J494p8j629j810r63m08m44
$$ 297397 297083 297059 297412 297810 298292 299202 300495 301871 303440 305350 306844 306766 305137 303327 302364 301956 301512
52876C01512k42N52J358J764K042K480K942L244L380L310K983K595K400K301J977
$$ 301512 301270 301822 303180 304944 306986 309466 312408 315652 319032 322342 325325 327920 330320 332621 334598
52861C34598J275K89p65j552j793j659j651j924k157k199k296k559k837l257m067
$$ 334598 335873 336162 335397 333845 332052 330393 328742 326818 324661 322462 320166 317607 314770 311513 307446
52846C07446m805m546l310k252j972j749j003l28l45n61l35K7J19L21Q35P66n57
$$ 307446 302641 298095 294785 292533 290561 288812 287809 287481 287136 286575 286240 286267 286386 286707 287542 288308 287751
52829B87751k141k512j678o65J31Q84J247Q09J86K76P06M21m96r83p69n92p41
$$ 287751 285610 283098 281420 280755 280886 281770 283017 283826 284012 284288 284994 285415 284919 283936 283167 282575 281834
52812B81834o03J42J056J704K018J847J147M60L47M18j30j181j902k047k096k216
$$ 281834 281231 281373 282429 284133 286151 287998 289145 289605 289952 290370 290240 289059 287157 285110 283014 280798
52796B80798k117j856j733j552r41k41q1k28M2O11O89K83K04O00P36L95K92P50
$$ 280798 278681 276825 275092 273540 272599 272358 272277 272049 272091 272702 273391 273674 273878 274478 275214 275609 275901 276651
52778B76651J086P53K19J66N49Q19O66K24j47j75o0k77p99r66n99m53q98j003
$$ 276651 277737 278490 278709 278875 279424 280243 280909 281133 280986 280811 280751 280474 279675 278709 278110 277657 276759 275756
52760B75756J2J205J179L11J88J171K070K091J619J116O65N73J017J139O3j301
$$ 275756 275768 276973 278152 278463 278651 279822 281892 283983 285602 286718 287383 287956 288973 290112 290175 288874
52744B88874j195K56J126P11M30J180J826J388P83J120J770J664J261J639K456
$$ 288874 287679 287935 289061 289772 290202 291382 293208 294596 295379 296499 298269 299933 301194 302833 305289
52729C05289K395J224kn53o92p89p96o57o01q19j202j453j299p67l14l65o91p13
$$ 305289 307684 308908 308906 308353 307661 306872 306076 305419 304818 303999 302797 301344 300045 299278 298964 298599 297908 297195
52711B97195m18l71p19q86m76J35M00K13k95r31j211o00P05J782J977J425M89
$$ 297195 296777 296406 295687 294801 294325 294460 294860 295073 294778 293847 292636 292036 292741 294523 296500 297925 298414
52694B98414n64j225r20J00Q21P50N14Q20J466J766J386L94r22j989k176j495
$$ 298414 297850 296625 295705 295805 296626 297376 297890 298710 300176 301942 303328 303722 302800 300811 298635 297140
52678B97140n85P0M51N48L13J41N71J293J291K69q41j126p09j51L71Q80J181J178
$$ 297140 296555 296625 297076 297624 297937 298078 298649 299942 301233 301502 300661 299535 298826 298675 299046 299926 301107 302285
52660C02285J057R72R34J082J457J565R86L30N82J489J829J473J681K868L540
$$ 302285 303342 304314 305248 306330 307787 309352 310338 310668 311250 312739 314568 316041 317722 320590 324130
52645C24130K449N03o13p79j106j982k709k700k011r11J87O51K78k09m7M95O32
$$ 324130 326579 327082 326469 325690 324584 322602 319893 317193 315182 314271 314458 315109 315387 315178 315131 315626 316258
52628C16258L23K66P87J445J714J449P64p7o59p70o50o06n78m19l72q42j740k431
$$ 316258 316581 316847 317634 319079 320793 322242 323006 322929 322270 321500 320850 320244 319666 319247 318875 318033 316293 313862
52610C13862k335j381l3J007J321J093Q08O65N26L12R3j32k77M4R33J579J048
$$ 313862 311527 310146 310113 311120 312441 313534 314342 315007 315533 315845 315938 315806 315529 315573 316506 318085 319133
52593C19133l24j152q26j52R4K24P98J504J635J152O90Q56J817L188M093L883
$$ 319133 318809 317657 316831 316679 316773 316997 317795 319299 320934 322086 322776 323632 325449 328637 332730 336613
52577C36613K852J778P43o45j961k106j123n80j365k294j857l74N91L35n71j440
$$ 336613 339465 341243 341986 341341 339380 337274 336151 335571 334206 331912 330055 329681 330272 330607 330036 328596
52561C28596k025k204j992j694j437r15j11K63k90j220j734j820j723j089L06
$$ 328596 326571 324367 322375 320681 319244 318329 318218 318481 318191 316971 315237 313417 311694 310605 310911
52546C10911J521J387K56l16L63J409J868J883K004K192J991J242J97q05j470
$$ 310911 312432 313819 314075 313759 314122 315531 317399 319282 321286 323478 325469 326711 326908 326103 324633
52531C24633j507p60N67J838K300J722P44L29P48J400J639J409R68M85J33R6K41
$$ 324633 323126 322366 322933 324771 327071 328793 329537 329866 330614 332014 333653 335062 336030 336515 336648 336744 336985
52514C36985K48L00J017K467L855M608N082N619N604M263K000P5r23j547k475
$$ 336985 337233 337533 338550 341017 344872 349480 354562 360181 365785 370048 372048 372123 371200 369653 367178
52499C67178l644m525m824m723m612m639m557m065l213k273j320l35L73L50l51
$$ 367178 363534 359009 354185 349462 344850 340211 335654 331589 328376 326103 324783 324448 324821 325171 324820
52484C24820j146j552j357m06J091K147J876Q67O01J366J894J433R11J375K406
$$ 324820 323674 322122 320765 320359 321450 323597 325473 326340 326941 328307 330201 331634 332545 333920 336326
52469C36326K983K999K989L039L010L187L804M383M410M102L770L017J478k07
$$ 336326 339309 342308 345297 348336 351346 354533 358337 362720 367130 371232 375002 378019 379497 379290
52455C79290j150j579k378l649m633m905m726m379l920l495l167k569j456l63
$$ 379290 378140 376561 374183 370534 365901 360996 356270 351891 347971 344476 341309 338740 337284 336921
52441C36921l7m25q46j014j124j176r64o77p97j353j852j918j593j012k60M71
$$ 336921 336884 336459 335613 334599 333475 332299 331335 330658 329861 328508 326656 324738 323145 322133 321873 322344
52425C22344R40J021O61l5o03n35k4K18N8J89Q72J305R43N88J323K927M236M676
$$ 322344 323284 324305 324966 324931 324328 323793 323769 323987 324045 324234 325106 326411 327354 327942 329265 332192 336428 341104
52407C41104M585M439M600N468P038Q592R495R916J0109R494P363M121Q78j882
$$ 341104 345689 350128 354728 360196 367234 375826 385321 395237 405346 414840 422203 426324 427202 425320
52393D25320m364o513p899q414q294p621o487n327m396l268j622j36L54J57L23
$$ 425320 420956 414443 406544 398130 389836 382215 375728 370401 366005 362737 361115 360979 361333 361490 361813
52378C61813J177K167K891L325L350K971K807L388M253M648M826N470O122N483
$$ 361813 362990 365157 368048 371373 374723 377694 380501 383889 388142 392790 397616 403086 409208 414691
52364D14691L268O32j346k537l020k681j830j182r09n00K22P39P67O74P48P91
$$ 414691 417959 418591 417245 414708 411688 409007 407177 405995 405086 404586 404808 405547 406314 406988 407736 408527
52348D08527P13P90J064J169J000R56J301J833K321K786L196L441L656M063M523
$$ 408527 409240 410030 411094 412263 413263 414219 415520 417353 419674 422460 425656 429097 432753 436816 441339
52333D41339M721M779N142N919O900Q055R381J0477J1028J1493J2490J3674J4130
$$ 441339 446060 450839 455981 461900 468800 476855 486236 496713 507741 519234 531724 545398 559528
52320E59528J3827J3622J3820J3773J3140J2555J2726J3646J4986J6468J7670
$$ 559528 573355 586977 600797 614570 627710 640265 652991 666637 681623 698091 715761
52309G15761J8162J8274J8901K0288K1646K2323K2655K3276K4104K4567K4428
$$ 715761 733923 752197 771098 791386 813032 835355 858010 881286 905390 929957 954385
52298I54385K4019K3756K3569K2763K0607J7299J4043J1656R609O970L942J603
$$ 954385 978404 1002160 1025729 1048492 1069099 1086398 1100441 1112097 1121706 1128676 1132618 1134221
52286A134221L59l49j004j642k456l764n225o058o166o157o176n701m717m004
$$ 1134221 1134580 1134231 1133227 1131585 1129129 1125365 1120140 1114082 1107916 1101759 1095583 1089882 1085165 1081161
52272A081161l926l831l085j918p91L00J443K399L022L611M482N653P121Q954
$$ 1081161 1077235 1073404 1070319 1068401 1067610 1067910 1069353 1071752 1074774 1078385 1082867 1088520 1095641 1104595
52258A104595J0904J2539J3894J5380J6975J8225J9089J9995K0848K0877J9721
$$ 1104595 1115499 1128038 1141932 1157312 1174287 1192512 1211601 1231596 1252444 1273321 1293042
52247A293042J7850J5611J2754R339O277M304K991J392p65l020m911o312p401
$$ 1293042 1310892 1326503 1339257 1348596 1354873 1359177 1362168 1363560 1362795 1359775 1354864 1348552 1341151
52234A341151q625j0411j2586j4394j5247j5264j5028j5120j5778j6602j6707
$$ 1341151 1332526 1322115 1309529 1295135 1279888 1264624 1249596 1234476 1218698 1202096 1185389
52223A185389j5710j4460j4119j4726j5360j5508j5351j4786j3312j1081r070
$$ 1185389 1169679 1155219 1141100 1126374 1111014 1095506 1080155 1065369 1052057 1040976 1031906
52212A031906p846o968n888m670l517k450j636j243q44J78J486K042J758J761
$$ 1031906 1024060 1017092 1011204 1006534 1003017 1000567 998931 997688 996844 997022 998508 1000550 1002308 1004069
52198A004069K690L878M638N258O082O797P318Q308R913J0883R951P372M329J516
$$ 1004069 1006759 1010637 1015275 1020533 1026615 1033412 1040730 1049038 1058951 1069834 1079785 1087157 1091486 1093002
52184A093002q23k272k781l275m711o799q464r277r627r784r659r262q748q066
$$ 1093002 1092179 1089907 1087126 1083851 1079140 1072341 1063877 1054600 1044973 1035189 1025530 1016268 1007520 999454
52170I99454p144o178n311m250k744j070L17J394K384L325M190N020N592N449
$$ 999454 992310 986132 980821 976571 973827 972757 973074 974468 976852 980177 984367 989387 994979 1000428
52156A000428M608L701L020K110Q28J2K71Q48O80Ko9P23J555J925K199K687L094
$$ 1000428 1005036 1008737 1011757 1013867 1014695 1014707 1014978 1015826 1016506 1016508 1016439 1017162 1018717 1020642 1022841 1025528 1028622
52139A028622L115K895K619K221J731J451J614K148K981M186N684P152Q419R798
$$ 1028622 1031737 1034632 1037251 1039472 1041203 1042654 1044268 1046416 1049397 1053583 1059267 1066419 1074838 1084636
52125A084636J1805J4522J7370J9561K0840K1722K2919K4531K5952K6462K5747
$$ 1084636 1096441 1110963 1128333 1147894 1168734 1190456 1213375 1237906 1263858 1290320 1316067
52114A316067K4079K2328K1547K2031K2761K2366K0626J8592J7235J6646J6613
$$ 1316067 1340146 1362474 1384021 1406052 1428813 1451179 1471805 1490397 1507632 1524278 1540891
52103A540891J7208J8390J9615K0246K0006J8904J7093J5005J2996J0645P010
$$ 1540891 1558099 1576489 1596104 1616350 1636356 1655260 1672353 1687358 1700354 1710999 1718009
52092A718009J901l573q027j0935j2619j3682j4765j6282j8009j9278j9759j9675
$$ 1718009 1719910 1716337 1708310 1697375 1684756 1671074 1656309 1640027 1622018 1602740 1582981 1563306
52080A563306j9205j8330j7390j7001j7102j6832j5711j4248j2971j1572r527
$$ 1563306 1544101 1525771 1508381 1491380 1474278 1457446 1441735 1427487 1414516 1402944 1393417
52069A393417p055m854l291k113o08K035N850R479J1310J1493J1926J3823J6384
$$ 1393417 1386362 1381508 1378217 1376104 1375496 1377531 1383381 1392860 1404170 1415663 1427589 1441412 1457796
52056A457796J8361J9807K1352K2621K2550K0809J8050J5102J2543J0612Q856
$$ 1457796 1476157 1495964 1517316 1539937 1562487 1583296 1601346 1616448 1628991 1639603 1648459
52045A648459O407L134l6k487m815p607j0141j1352j1479j1662j2301j2911j3313
$$ 1648459 1654866 1658000 1657964 1655477 1650662 1643055 1632914 1621562 1610083 1598421 1586120 1573209 1559896
52032A559896j3875j4650j5215j5409j5524j5794j6278j7110j8296j9448k0185
$$ 1559896 1546021 1531371 1516156 1500747 1485223 1469429 1453151 1436041 1417745 1398297 1378112
52021A378112k0584k0793k0578j9797j8887j8271j7694j6840j6019j5519j4757
$$ 1378112 1357528 1336735 1316157 1296360 1277473 1259202 1241508 1224668 1208649 1193130 1178373
52010A178373j3045j0843r330q940r216r855j0875j1947j2548j2897j3781j5243
$$ 1178373 1165328 1154485 1145155 1136215 1126999 1117144 1106269 1094322 1081774 1068877 1055096 1039853
51998A039853j6228j5696j3601j0727q123o690o683p505q368r146j0263j1913
$$ 1039853 1023625 1007929 994328 983601 975478 968788 962105 954600 946232 937086 926823 914910
51986I14910j3883j5923j7757j8896j9102j8786j8503j8225j7668j6999j6514
$$ 914910 901027 885104 867347 848451 829349 810563 792060 773835 756167 739168 722654
51975G22654j5892j4620j2932j1494j0154p980m708j346J077K684M285O156P768
$$ 722654 706762 692142 679210 667716 657562 649582 644874 643528 644605 647289 651574 657730 665498
51962F65498Q446Q082P144O126N024L436J177j416l807n565o279n696m190k604
$$ 665498 673944 682026 689170 695296 700320 703756 704933 703517 699710 694145 687866 682170 677980 675376
51948F75376j290K64K566N369Q211J1074J4048J6891J9475K2082K4609K5975K5121
$$ 675376 674086 674350 676916 682285 690496 701570 715618 732509 751984 774066 798675 824650 849771
51935H49771K2194J8057J3121P444J548l843q664j3168j6925j9109j9747j9928
$$ 849771 871965 890022 903143 910587 912135 908292 899628 886460 869535 850426 830679 810751
51923H10751k0624k1902k3248k4056k3829k2504k0604j8679j6748j4696j2838
$$ 810751 790127 768225 744977 720921 697092 674588 653984 635305 618557 603861 591023
51912E91023j1476j0203q334n809l083l89K176M156N119N398N693O047N952N273
$$ 591023 579547 569344 561010 555201 552118 551729 553905 558061 563180 568578 574271 580318 586270 591543
51898E91543M307K959P20k467n903q803j0813j1926j2413j2686j2798j2198j0456
$$ 591543 595850 598809 599529 597062 591159 582356 571543 559617 547204 534518 521720 509522 499066
51885D99066q004n629l530j442O13K316L625M786N966P282Q875J0442J1237J1087
$$ 499066 491062 485433 481903 480461 481074 483390 487015 491801 497767 505049 513924 524366 535603 546690
51871E46690J0761J0624R713P052L371L43j443k633l636m221m362m216l410j529
$$ 546690 557451 568075 577788 584840 588211 588554 587111 584478 580842 576621 572259 568043 564633 563104
51857E63104P43K105K317K304K574K649K166J337J81j730m380p004q939j0048
$$ 563104 563847 565952 568269 570573 573147 575796 577962 579299 579480 577750 573370 566366 557427 547379
51843E47379j0319r851r257r217r513r307q327p000n504l743k101j091l28J040
$$ 547379 537060 527209 517952 508735 499222 489915 481588 474588 469084 465341 463240 462149 461821 462861
51829D62861K757L568L025J986J057j09j585k478k218j501j264j488j608j427
$$ 462861 465618 469186 472211 474197 475254 475145 473560 471082 468864 467363 466099 464611 463003 461576
51815D61576j074o09j16L18Q90J795K465J947K45j417k057j909j646j428j074
$$ 461576 460502 459893 459777 460095 460985 462780 465245 467192 467437 466020 463963 462054 460408 458980 457906
51800D57906n31K10J161K045K438K411K444K654K631K115J251K29p18j107p27
$$ 457906 457375 457585 458746 460791 463229 465640 468084 470738 473369 475484 476735 476964 476246 475139 474412
51785D74412j52N5L53J351K309J850J74r49n87L74R52J364K074K872L582M564
$$ 474412 474260 474315 474668 476019 478328 480178 480352 479403 478816 479190 480142 481506 483580 486452 490034 494598
51769D94598N933P169Q005Q717R173Q708P349N939M580K212j547n340p671q565
$$ 494598 500531 507700 515705 524422 533595 542303 549652 555591 560171 562383 560836 555496 547825 539260
51755E39260q896r071r111r119q922q108o947o330o302n833m609l698l680l455
$$ 539260 530364 521293 512182 503063 494141 486033 479086 472756 466454 460621 456012 452314 448634 445179
51741D45179k018j70Q04J088J687K740L703M526N383N878N681N293N131M562K997
$$ 445179 443161 442991 443795 444883 446570 449310 453013 457539 462922 468800 474481 479774 484905 489467 492464
51726D92464J202L34K97L34N23J426K615L005K318J084m94k446m114m600l970
$$ 492464 493666 494000 494297 494631 495154 496580 499195 502200 504518 505602 505108 502662 498548 493948 489978
51711D89978l003j983q28p9n00j764k664k622j978r73N21K212L405L804L498K334
$$ 489978 486975 484992 484164 484085 483585 481821 479157 476535 474557 473584 474105 476317 479722 483526 487024 489358
51695D89358K81j718k399j718o97J31J070J990K024Q47o99j721k173k295k081
$$ 489358 489639 487921 485522 483804 483107 483238 484308 486298 488322 489169 488470 486749 484576 482281 480200
51680D80200j626j383j507j531j045k45M47Q99J116J058P69L95j7m07l32P81K852
$$ 480200 478574 477191 475684 474153 473108 472863 473310 474209 475325 476383 477152 477547 477530 477123 476791 477572 480424
51663D80424N050O615P457P863P962P571O332M039J098j431k640k555j789o35
$$ 480424 485474 492089 499546 507409 515371 522942 529274 533313 534411 532980 530340 527785 525996 525361
51649E25361J019L024M836O029O479O047M564K203n25l201n627p559q737r188
$$ 525361 526380 529404 534240 540269 546748 552795 557359 559562 559037 555836 550209 542650 533913 524725
51635E24725r204r050q853q647q236p315o051n245n370n731n188l535j616j81
$$ 524725 515521 506471 497618 488971 480735 473420 467369 462124 456754 451023 445835 442300 440684 440503
51621D40503O77J003O63k33j208j939k522l033l249k994k462k003j831j943k125
$$ 440503 441180 442183 442846 442613 441405 439466 436944 433911 430662 427668 425206 423203 421372 419429 417304
51606D17304k048j587r81m00M21J741L104L696L472L359M142N620P138Q619J0515
$$ 417304 415256 413669 412688 412288 412709 414450 417554 421250 424722 428081 432223 437843 444981 453600 464115
51591D64115J2873J4758J4885J2651Q584L819n89l904n649n826n092m252l425
$$ 464115 476988 491746 506631 519282 527866 531685 531096 527192 521543 515717 510625 506373 502948
51578E02948k061J22K690N132P476R900J2149J3755J4698J5413J6308J7504J8884
$$ 502948 500887 501009 503699 508831 516307 526207 538356 552111 566809 582222 598530 616034 634918
51565F34918K0116K0792K0801K0580K0829K2105K4610K8075L1767L4858L6901
$$ 634918 655034 675826 696627 717207 738036 760141 784751 812826 844593 879451 916352
51554I16352L7669L6695L3436K7982K1025J3081M291m806j3043j9546k4410k8176
$$ 916352 954021 990716 1024152 1052134 1073159 1086240 1090531 1085725 1072682 1053136 1028726 1000550
51542A000550l1076l3035l3916l3532l1977l0031k8578k7426k5545k2743k0156
$$ 1000550 969474 936439 902523 868991 837014 806983 778405 750979 725434 702691 682535
51531F82535j8643j7691j6490j5181j4239j3536j2891j2672j2906j2572j0890
$$ 682535 663892 646201 629711 614530 600291 586755 573864 561192 548286 535714 524824
51520E24824q676p228o439n284l786l079l558m256m235l604k933k533k461k535
$$ 524824 516148 508920 502481 497197 493411 490332 486774 482518 478283 474679 471746 469213 466752 464217
51506D64217k272j461p59r89j839k076j119L11J278J636J751J801J725J505J281
$$ 464217 461945 460484 459725 458736 456897 454821 453702 454013 455291 456927 458678 460479 462204 463709 464990
51491D64990J252J492J775J710J252P43L90Q3j22nR8o38k207l364l265k659k656
$$ 464990 466242 467734 469509 471219 472471 473214 473604 473687 473565 473560 473658 473020 470813 467449 464184 461525 458869
51474D58869l060l086k999l667m843n322m707l811l295l040k866k810k603j897
$$ 458869 455809 452723 449724 446057 441214 435892 431185 427374 424079 421039 418173 415363 412760 410863
51460D10863j101r78j380j344o08P2L05O78J683K910L750M116M141L955M040M997
$$ 410863 409762 408784 407404 406060 405452 405524 405829 406507 408190 411100 414850 418966 423107 427062 431102 436099
51444D36099O649Q094R003J0155J2165J4383J5502J4907J2934J0199P112L940
$$ 436099 442748 450842 459845 470000 482165 496548 512050 526957 539891 550090 557202 561142
51432E61142J047j025j934k194l053n223p926r777j0394j0480j0523j0242r320
$$ 561142 562189 561164 559230 557036 553983 548760 540834 531057 520663 510183 499660 489418 480098
51419D80098p924o342m753l407k511j897j344j075j313j515q58N25J591J756J424
$$ 480098 472174 465832 461079 457672 455161 453264 451920 450845 449532 448017 447159 447684 449275 451031 452455
51404D52455J143R84R73J317J986K675L376M414N768O905P427P489P449P641Q360
$$ 452455 453598 454582 455555 456872 458858 461533 464909 469323 475091 481996 489423 496912 504361 512002 520362
51389E20362R599J0861J1790J2853J4772J7496K0370K3219K6441L0194L4231L8445
$$ 520362 529961 540822 552612 565465 580237 597733 618103 641322 667763 697957 732188 770633
51377G70633M2823M6911N0137N2501N4125N4287N1761M6071L7534K6407J3121
$$ 770633 813456 860367 910504 963005 1017130 1071417 1123178 1169249 1206783 1233190 1246311
51366A246311q32j3529k4362l3991m2545m9075n2976n4732n4930n3580n0821m7237
$$ 1246311 1245479 1231950 1207588 1173597 1131052 1081977 1029001 974269 919339 865759 814938 767701
51354G67701m3134l8429l3564k9466k6299k3219j9730j6294j3334j0712q513p235
$$ 767701 724567 686138 652574 623108 596809 573590 553860 537566 524232 513520 505007 497772
51342D97772o683n829m295k984k622k700k478k135k216k734l420m105m430l945
$$ 497772 491089 485260 480965 477981 475359 472659 470181 468046 465830 463096 459676 455571 451141 447196
51328D47196l010k662l154l505l045k372k201k255k033j756j736j566p72L57J288
$$ 447196 444186 441524 438370 434865 431820 429448 427247 424992 422959 421203 419467 417901 417129 417486 418774
51313D18774J946K389K492K436K843L834M679M793M280L174J206j144k528k441
$$ 418774 420720 423109 425601 428037 430880 434714 439393 444186 448466 451640 452846 451702 449174 446733
51299D46733j946j987k118j759j513k113l040l390l263l074k423r29N47R42P03
$$ 446733 444787 442800 440682 438923 437410 435297 432257 428867 425604 422530 420107 419178 419725 420667 421370
51284D21370J040J984K549K554K959M392O470Q401R357Q531N936K931R94J50n35
$$ 421370 422410 424394 426943 429497 432456 436848 443318 451719 461076 469607 475543 478474 479468 479618 479083
51269D79083j271j506j292j353j761j632m15J387K917L632L261J840m3j652k779
$$ 479083 477812 476306 475014 473661 471900 470268 469853 471240 474157 477789 481050 482890 482847 481195 478416
51254D78416l538l817l502l020k882k906k664k412k599k785k101q04k44j019k148
$$ 478416 474878 471061 467559 464539 461657 458751 456087 453675 451076 448291 446190 445386 445142 444123 441975
51239D41975k409j720p93j43R4m0l25m33l17k58m20o39p70q68r16p72n52o69j256
$$ 441975 439566 437846 437053 436910 437004 436964 436639 436206 435889 435631 435211 434572 433802 432934 432018 431246 430694 430025 428769
51220D28769j710j234K05J600J864J049L59O94J570J941J757J900K677L372L506
$$ 428769 427059 425825 426030 427630 429494 430543 430902 431596 433166 435107 436864 438764 441441 444813 448319
51205D48319L518L735L703L172K901L592M712N184M699L569J943R5j112j157r15
$$ 448319 451837 455572 459275 462447 465348 468940 473652 478836 483535 487104 489047 489142 488030 486873 485958
51190D85958j647l136l878l116j684p93p31r28p63p9O40P03N3o03p70q05j135
$$ 485958 484311 481175 477297 474181 472497 471704 470973 470045 469282 469203 469843 470546 470599 469996 469226 468421 467286
51173D67286j440j301r96r27q33m99o24j786l073l031j780p78n72j90R85K145
$$ 467286 465846 464545 463549 462622 461789 461290 460666 458880 455807 452776 450996 450218 449646 449456 450441 452586
51157D52586K358J909J577J432J032L43k12l48j87j0P7K26N70Q11M20m93j047
$$ 452586 454944 456853 458430 459862 460894 461237 461025 460677 460490 460480 460557 460783 461353 462164 462584 462091 461044
51140D61044q01m40o21q15k69M72L16m67n73J34L32m83j019k23J022J281P20P07
$$ 461044 460243 459803 459182 458367 458098 458570 458886 458419 457846 457980 458312 457829 456810 456587 457609 458890 459610 460317
51122D60317J753K945L298K846K347K422L008L462L220K513K146K427K701K266
$$ 460317 462070 465015 468313 471159 473506 475928 478936 482398 485618 488131 490277 492704 495405 497671
51108D97671J409J020J355J705J360N27J4K43Q71J400J794K270K684K555J720
$$ 497671 499080 500100 501455 503160 504520 505047 505061 505304 506175 507575 509369 511639 514323 516878 518598
51093E18598N90l50r31j108q46l52m1l0q9j41l64n77k26P05J387J229O44L38L98
$$ 518598 519188 518838 517907 516799 515953 515601 515560 515530 515441 515300 514936 514359 514133 514838 516225 517454 518098 518436 518834
51074E18834O17J050J626J903J840K144L138M010M072M030M992O815Q582J0173
$$ 518834 519451 520501 522127 524030 525870 528014 531152 535162 539234 543264 548256 555071 563653 573826
51060E73826J2104J4204J5811J7057J8691K0601K1620K0793J7929J3273P737L255
$$ 573826 585930 600134 615945 633002 651693 672294 693914 714707 732636 745909 753646 756901
51048G56901J414J762K514K840L100L166K217L87j104j996l531o368r349j1050
$$ 756901 758315 760077 762591 765431 768531 771697 773914 774301 773197 771201 767670 761302 751953 740903
51034G40903j1275j0266p876m600k240k226l933n689o833p807q759r102q249o084
$$ 740903 729628 719362 711486 706886 704646 702420 698487 692798 685965 678158 669399 660297 652048 645964
51020F45964k960K57K586L912N162O960Q720R604R839J0172J0552J0228Q978P358
$$ 645964 643004 643261 645847 649759 654921 661881 670601 680205 690044 700216 710768 720996 729974 737332
51006G37332N757L988J982J88r54j621k344l302m170m601m698m707m451l511k063
$$ 737332 743089 747077 749059 749247 748293 746672 744328 741026 736856 732255 727557 722850 718399 714888 712825
50991G12825r41m60K51K068M490O347P563R123J1408J3656J5360J7037J9252K1665
$$ 712825 711884 711424 711675 713743 718233 724580 732143 741266 752674 766330 781690 798727 817979 839644
50977H39644K3612K4945K5849K6380K6609K6778K7037K7489K8557L0802L4248
$$ 839644 863256 888201 914050 940430 967039 993817 1020854 1048343 1076900 1107702 1141950
50966A141950L8454M3198M8423N3645N8348O2892O7951P2950P6353P7765P8365
$$ 1141950 1180404 1223602 1272025 1325670 1384018 1446910 1514861 1587811 1664164 1741929 1820294
50955A820294P8802P7969P4700O9420O3187N6146M8043L9313L0589K1786J2776
$$ 1820294 1899096 1977065 2051765 2121185 2184372 2240518 2288561 2327874 2358463 2380249 2393025
50944B393025M272l018r376j5160j9528k1553k2150k3444k6165k8986l0581l1114
$$ 2393025 2397297 2394279 2384903 2369743 2350215 2328662 2306512 2283068 2256903 2227917 2197336 2166222
50932B166222l1432l1737l1721l1339l0985l1107l1921l3329l5049l6952l9175
$$ 2166222 2134790 2103053 2071332 2039993 2009008 1977901 1945980 1912651 1877602 1840650 1801475
50921A801475m1701m4123m6064m7498m8364m8334m7424m6354m5576m4373m1777
$$ 1801475 1759774 1715651 1669587 1622089 1573725 1525391 1477967 1431613 1386037 1341664 1299887
50910A299887l8179l5098l3272l1850k9739k6986k4437k2509k0851j9007j7015
$$ 1299887 1261708 1226610 1193338 1161488 1131749 1104763 1080326 1057817 1036966 1017959 1000944
50899A000944j5354j4393j3878j3046j1384r239p470o439n643m438k933j863j575
$$ 1000944 985590 971197 957319 944273 932889 923650 916180 909741 904098 899660 896727 894864 893289
50886H93289j479p81M65J539K225L157M709O206O873P045P648Q882J0299J1824
$$ 893289 891810 891029 891494 893033 895258 898415 903124 909330 916203 923248 930896 939778 950077 961901
50872I61901J3649J5267J5835J5666J6165J7952K0129K1797K3232K4958K6813
$$ 961901 975550 990817 1006652 1022318 1038483 1056435 1076564 1098361 1121593 1146551 1173364
50861A173364K8596L0771L3679L6948M0386M4720N0522N7206O4062P1532Q0382
$$ 1173364 1201960 1232731 1266410 1303358 1343744 1388464 1438986 1496192 1560254 1631786 1712168
50850A712168R0139R9619J08706J18387J29070J39873J49696J58164J65427J71664
$$ 1712168 1802307 1901926 2010632 2129019 2258089 2397962 2547658 2705822 2871249 3042913
50840C042913J76811J80315J81107J78235J71384J60535J45553J26596J04435
$$ 3042913 3219724 3400039 3581146 3759381 3930765 4091300 4236853 4363449 4467884
50831D467884P9841N3235K5640p59k4111m4561o3189p9499r1254r6901r7095r3560
$$ 4467884 4547725 4600960 4626600 4625841 4601730 4557169 4493980 4414481 4323227 4226326 4129231 4035671
50819D035671q7477p9489p0431o1426n3630m8096m5566m6139m9441n5095o2614
$$ 4035671 3948194 3868705 3798274 3736848 3683218 3635122 3589556 3543417 3493976 3438881 3376267
50808C376267p1062p9523q7910r6605j05173j12188j16581j18537j18764j17438
$$ 3376267 3305205 3225682 3137772 3041167 2935994 2823806 2707225 2588688 2469924 2352486
50798B352486j14322j09422j03088r5723q7711p9423p1045o2573n4188m6381l9589
$$ 2352486 2238164 2128742 2025654 1929931 1842220 1762797 1691752 1629179 1574991 1528610 1489021
50787A489021l3839k8828k4245j9905j5824j2219r316p139n595m653m314m457
$$ 1489021 1455182 1426354 1402109 1382204 1366380 1354161 1344845 1337706 1332111 1327458 1323144 1318687
50775A318687m963n756o604p040o893o651o930p746q696r697j0930j2193j2920
$$ 1318687 1313724 1307968 1301364 1294324 1287431 1280780 1273850 1266104 1257408 1247711 1236781 1224588 1211668
50762A211668j2940j2710j2613j2527j2202j1605j0647r076o911m656k730r08
$$ 1211668 1198728 1186018 1173405 1160878 1148676 1137071 1126424 1117348 1110437 1105781 1103051 1102143
50750A102143J365M293P636J1141J4708J8180K1364K4335K7428L0784L4131L7287
$$ 1102143 1103508 1107801 1115437 1126578 1141286 1159466 1180830 1205165 1232593 1263377 1297508 1334795
50738A334795M0679M4914M9827N4505N8570O2864O8333P4557Q0181Q4587Q8269
$$ 1334795 1375474 1420388 1470215 1524720 1583290 1646154 1714487 1789044 1869225 1953812 2042081
50727B042081R1491R3553R3895R3106R2147R0985Q8703Q4589P8587P0875O1591
$$ 2042081 2133572 2227125 2321020 2414126 2506273 2597258 2685961 2770550 2849137 2920012 2981603
50716B981603N0798L8205K3149N449j3685l2104m8085o0949p0450p6173p7792
$$ 2981603 3032401 3070606 3093755 3099204 3085519 3053415 3005330 2944381 2873931 2797758 2719966
50705B719966p5632p0661o4000n6476m8562m0618l3077k6396k1064j7755j7204
$$ 2719966 2644334 2573673 2509673 2453197 2404635 2364017 2330940 2304544 2283480 2265725 2248521
50694B248521j9482k3699k8875l4960m2292n0250n7301o2496o5982o7859o7599
$$ 2248521 2229039 2205340 2176465 2141505 2099213 2048963 1991662 1929166 1863184 1795325 1727726
50683A727726o5068o1189n6801n1729m5702l9417l3772k8617k3277j7812j2777
$$ 1727726 1662658 1601469 1544668 1492939 1447237 1407820 1374048 1345431 1322154 1304342 1291565
50672A291565q090l203J794O214R832J3071J6144J8714K0399K1005K0401J8810
$$ 1291565 1283475 1280272 1282066 1288280 1298112 1311183 1327327 1346041 1366440 1387445 1407846 1426656
50660A426656J7090J6044J5583J5226J5123J5802J7086J8237J9080K0110K1359
$$ 1426656 1443746 1459790 1475373 1490599 1505722 1521524 1538610 1556847 1575927 1596037 1617396
50649A617396K2180K2375K2777K4293K6922K9990L2850L5186L7137L9318M2332
$$ 1617396 1639576 1661951 1684728 1709021 1735943 1765933 1798783 1833969 1871106 1910424 1952756
50638A952756M6102M9951N3401N6392N8774O0116O0191N9263N7666N5449N2595
$$ 1952756 1998858 2048809 2102210 2158602 2217376 2277492 2337683 2396946 2454612 2510061 2562656
50627B562656M9440M6818M5704M6210M6661M4101L6386K3785Q441p111k0558k9891
$$ 2562656 2612096 2658914 2704618 2750828 2797489 2841590 2877976 2901761 2910202 2903091 2882533 2852642
50615B852642l4254l4575l2512k8813k3477j7213j1568p515m765k758j520j394
$$ 2852642 2818388 2783813 2751301 2722488 2699011 2681798 2670230 2662715 2657950 2655192 2653672 2652278
50603B652278k685n806j1132j8435k6915l5878m4892n3432o1016o7631p3302p7368
$$ 2652278 2649593 2643787 2632655 2614220 2587305 2551427 2506535 2453103 2392087 2324456 2251154 2173786
50591B173786p9013p8492p7005p5222p2810o9454o5482o1241n6785n2354m8312
$$ 2173786 2094773 2016281 1939276 1864054 1791244 1721790 1656308 1595067 1538282 1485928 1437616
50580A437616m4339l9643l4262k9296k5401k1958j8167j4104j0163o276k385J056
$$ 1437616 1393277 1353634 1319372 1290076 1264675 1242717 1224550 1210446 1200283 1194007 1191622 1192678
50568A192678L806O475R669J2924J5247J6442J7256J8413J9939K1383K2232K2296
$$ 1192678 1196484 1202959 1212628 1225552 1240799 1257241 1274497 1292910 1312849 1334232 1356464 1378760
50556A378760K1899K1608K1699K2144K3111K4868K7063K8730K9335K9294K9098
$$ 1378760 1400659 1422267 1443966 1466110 1489221 1514089 1541152 1569882 1599217 1628511 1657609
50545A657609K8604K7606K6546K6057K6209K6735K7633K9128L1316L4302L8371
$$ 1657609 1686213 1713819 1740365 1766422 1792631 1819366 1846999 1876127 1907443 1941745 1980116
50534A980116M3569M9360N5138O0787O6406P1860P7013Q2169Q7784R3927J00353
$$ 1980116 2023685 2073045 2128183 2188970 2255376 2327236 2404249 2486418 2574202 2668129 2768482
50523B768482J06879J13243J18788J22757J24842J25202J23927J20716J15003
$$ 2768482 2875361 2988604 3107392 3230149 3354991 3480193 3604120 3724836 3839839
50514C839839J06316R4654Q0610O4924M7930K9674J0534q758k7613m5587o1820
$$ 3839839 3946155 4040809 4121419 4186343 4234273 4263947 4274481 4265723 4238110 4192523 4130703
50503D130703p5283q5789r3899r9358j00518r6109q7027p5426o2484m8072l2414
$$ 4130703 4055420 3969631 3875732 3776374 3675856 3579747 3492720 3417294 3354810 3306738 3274324
50492C274324j6841k600J0200K1826L1608L7922L9287L5111K5502J0915p791k9143
$$ 3274324 3257483 3254883 3265083 3286909 3318517 3356439 3395726 3430837 3456339 3467254 3459463 3430320
50480C430320n1204p2088r0294j04806j15123j21435j24506j25134j23780j20785
$$ 3430320 3379116 3307028 3216734 3111928 2996805 2875370 2750864 2625730 2501950 2381165
50470B381165j16537j11136j04269r5926q7121p9096p1907o4533n6570m9020m2974
$$ 2381165 2264628 2153492 2049223 1953297 1866176 1787080 1715173 1650640 1594070 1545050 1502076
50459A502076l8132l3227k7561k1509j5700j0276n020J40M894Q790J1710J4147
$$ 1502076 1463944 1430717 1403156 1381647 1365947 1355671 1350651 1350791 1355685 1364475 1376185 1390332
50447A390332J6852K0125K3624K6941L0114L3408L6713L9292M0070L8179L3525
$$ 1390332 1407184 1427309 1450933 1477874 1507988 1541396 1578109 1617401 1657471 1695650 1729175
50436A729175K6890J9475J2255N822N36l452o259q101r144r691j0188j0651j0412
$$ 1729175 1756065 1775540 1787795 1793617 1794153 1790701 1784442 1776341 1767197 1757506 1747318 1736667 1726255
50423A726255q974o914n297m224k713n1L458P245J1315J5963K1142K6485L1669
$$ 1726255 1717281 1710367 1705070 1700846 1698133 1698082 1701540 1708785 1720100 1736063 1757205 1783690 1815359
50410A815359L6567M1347M6380N1719N6618O0079O1887O2584O2408O0925N7925
$$ 1815359 1851926 1893273 1939653 1991372 2047990 2108069 2169956 2232540 2294948 2355873 2413798
50399B413798N3939M9557M4686L8882L1894K3592J3807K650r277k1303l3087m4420
$$ 2413798 2467737 2517294 2561980 2600862 2632756 2656348 2670155 2672805 2663528 2642225 2609138 2564718
50387B564718n4898o3855p0474p4019p4380p2296o8565o3172n5842m7259l8787
$$ 2564718 2509820 2445965 2375491 2301472 2227092 2154796 2086231 2023059 1967217 1919958 1881171
50376A881171l0782k2179j2297k207O291J2406J6411J8409J7876J4397Q351P64
$$ 1881171 1850389 1828210 1815913 1813706 1819997 1832403 1848814 1867223 1885099 1899496 1907847 1908611
50364A908611p348j5480k3519l1008l6835m0083m1038m0777l9808l7840l4985
$$ 1908611 1901263 1885783 1862264 1831256 1794421 1754338 1713300 1672523 1632715 1594875 1559890
50353A559890l2452l1698l3292l6775m1056m4783m6849m6835m4833m1078l6169
$$ 1559890 1527438 1495740 1462448 1425673 1384617 1339834 1292985 1246150 1201317 1160239 1124070
50342A124070l1243k7080k3199j8755j4070j0274p556n009k217K94K319M303O089
$$ 1124070 1092827 1065747 1042548 1023793 1009723 999449 991893 986884 984667 984961 987280 991583 997672
50329I97672O801O408O098O458O701O353O246O977P800Q093Q604J0019J1519J2109
$$ 997672 1004473 1010881 1016979 1023437 1030138 1036491 1042737 1049714 1057514 1065607 1074211 1084230 1095749 1107858
50315A107858J2281J2935J3577J3108J1683J0274R067P808P153P995R871J1538
$$ 1107858 1120139 1133074 1146651 1159759 1171442 1181716 1190783 1198591 1205744 1213739 1223610 1235148
50303A235148J2969J5208J8447K1802K5105K9393L5379M2565M9909N5858N7381
$$ 1235148 1248117 1263325 1281772 1303574 1328679 1358072 1393451 1436016 1485925 1541783 1599164
50292A599164N0640L4056J0564j3783l3412m5851n1851n3708n3303n1345m8067
$$ 1599164 1649804 1683860 1694424 1680641 1647229 1601378 1549527 1495819 1442516 1391171 1343104
50281A343104m4011l9756l5383l0758k6070k1605j7373j3405r979p083m212j243
$$ 1343104 1299093 1259337 1223954 1193196 1167126 1145521 1128148 1114743 1104764 1097681 1093469 1092226
50269A092226J165K741M375O806R306J0737J1371J2341J3834J5078J5815J6405
$$ 1092226 1093391 1096132 1100507 1107313 1116619 1127356 1138727 1151068 1164902 1179980 1195795 1212200
50257A212200J6647J5953J4624J3709J3481J3195J2410J1378J0081Q082N476K832
$$ 1212200 1228847 1244800 1259424 1273133 1286614 1299809 1312219 1323597 1333678 1341760 1347236 1350068
50245A350068M3l601p909j1540j3591j4425j4553j3841j2179r951p355m198r59
$$ 1350068 1350111 1346510 1338601 1327061 1313470 1299045 1284492 1270651 1258472 1248521 1241166 1236968 1236009
50232A236009Q56K9l194p621j2186j6160j8998k0523k0918k0329j8967j7512j6682
$$ 1236009 1236865 1236894 1233700 1226079 1213893 1197733 1178735 1158212 1137294 1116965 1097998 1080486 1063804
50219A063804j6292j5561j4433j3677j3513j3089j1821j0294r328q906q628q416
$$ 1063804 1047512 1031951 1017518 1003841 990328 977239 965418 955124 945796 936890 928262 919846
50207I19846q224p702o794o164o326o793o719o055n517n601o154o755p068o863
$$ 919846 911622 903920 897126 890962 884636 877843 871124 865069 859552 853951 847797 841042 833974 827111
50193H27111o000m613l295k920l849n186n361l970k468k360l196l368k517j791
$$ 827111 821111 816498 813203 810283 806434 801248 795887 791917 789449 787089 783893 780525 778008 776217
50179G76217j779j670q58q5k13q48j023n61k2K22K06J07J84O70J351J686J574
$$ 776217 774438 772768 771910 771825 771612 770764 769741 769180 769158 769380 769586 769693 769877 770547 771898 773584 775158
50162G75158J535J858K252K568L168M162N055N636O602Q588J1155J3393J5103
$$ 775158 776693 778551 780803 783371 786539 790701 795756 801392 807994 816582 827737 841130 856233
50149H56233J6742J8554K0446K2450K4681K6866K8392K8880K8410K7306K5897
$$ 856233 872975 891529 911975 934425 959106 985972 1014364 1043244 1071654 1098960 1124857
50138A124857K4428K3052K1922K1238K0947K0608J9926J9212J8680J7448J4014
$$ 1124857 1149285 1172337 1194259 1215497 1236444 1257052 1276978 1296190 1314870 1332318 1346332
50127A346332P878N7q081j5666k2022k6458k8910l0086l0503l0032k8624k6691
$$ 1346332 1354210 1354267 1346186 1330520 1308498 1282040 1253130 1223044 1192541 1162509 1133885 1107194
50115A107194k4339k1146j7227j3777j1824j1109j0869j0982j1503j1777j1033
$$ 1107194 1082855 1061709 1044482 1030705 1018881 1007772 996903 985921 974418 962641 951608
50104I51608r521q175p372o867o644o835o954o227m820l890m101m817n083m826
$$ 951608 942087 933912 926540 919673 913029 906194 899240 893013 888193 884303 880202 875385 870302 865476
50090H65476m642m750m737m241l495k948k629k187j571j231j363j274j07J869
$$ 865476 860834 856084 851347 847106 843611 840663 838034 835847 834276 833045 831682 830408 830301 832170
50076H32170L350L580L243L474M407N187N177M667M427M865N669O209O244O113
$$ 832170 835520 839100 842343 845817 850224 855411 860588 865255 869682 874547 880216 886425 892669 898782
50062H98782O155O133N515M169K519J109L31K72M46l4j436k858l295k981k829
$$ 898782 904937 911070 916585 920754 923273 924382 924713 924985 925431 925397 923961 921103 917808 914827 911998
50047I11998k904k509j599q42j77J315L684N585O208O554P939J0071J1689J2420
$$ 911998 909094 906585 904986 904144 903967 905282 908966 914551 920759 927313 935252 945323 957012 969432
50033I69432J3032J4235J6069J8234K0263K1688K2606K3787K5644K7388K7812
$$ 969432 982464 996699 1012768 1031002 1051265 1072953 1095559 1119346 1144990 1172378 1200190
50022A200190K6664K4669K2528K0386J8175J5969J4050J2757J1989J0795P970
$$ 1200190 1226854 1251523 1274051 1294437 1312612 1328581 1342631 1355388 1367377 1378172 1386142
50011A386142L337k019o989j1395j5529j9499k3385k7252l0525l2108l1704l0293
$$ 1386142 1389479 1387460 1380471 1369076 1353547 1334048 1310663 1283411 1252886 1220778 1189074 1158781
49999A158781k8681k6370k2654j8168j4359j1867j0273r093q154p230o133n166
$$ 1158781 1130100 1103730 1081076 1062908 1048549 1036682 1026409 1017316 1009162 1001932 995799 990633
49987I90633m833n301o476q353j0802j3343j5469j6895j7251j6246j4502j3336
$$ 990633 985800 980499 974023 965670 954868 941525 926056 909161 891910 875664 861162 847826
49975H47826j3073j2433j0385p730n893m943m066l267l223l785m032l671l180
$$ 847826 834753 822320 811935 804205 798312 793369 789303 786036 782813 779028 774996 771325 768145
49962G68145k683j868j012q26j181j075QJ653L518N721Q056R836J0810J1312J1412
$$ 768145 765462 763594 762582 761756 760575 759500 759508 761161 764679 770400 778456 788292 799102 810414 821826
49947H21826J0706R233P621O154M530K782J506Q58K01q23j751k288k933m174n695
$$ 821826 832532 841765 849386 855540 860070 862852 864358 865216 865417 864594 862843 860555 857622 853448 847753
49932H47753p082q596j0570j2495j3460j3251j2484j1718j0944r813q071n858
$$ 847753 840671 832075 821505 809010 795550 782299 769815 758097 747153 737340 729269 723411
49920G23411l721k170j156k34P18J370J633K006K858L783M119L902L875M603N876
$$ 723411 719690 717520 716364 716130 716848 718218 719851 721857 724715 728498 732617 736519 740394 744997 750873
49905G50873P098Q039R032J0490J2261J3646J4000J3188J1504R463P763O986O952
$$ 750873 757971 766010 775042 785532 797793 811439 825439 838627 850131 859594 867357 874343 881295
$$ [...]
##END NTUPLES=NMR SPECTRUM
##END=
