##TITLE=AC1680_CTIAH14388_8571411_XUIS1vgSpy
##JCAMPDX= 6.0         $$ Bruker NMR JCAMP-DX V2.0
##DATA TYPE= NMR SPECTRUM
##DATA CLASS= NTUPLES
##ORIGIN= BRUKER
##OWNER= Administrator
$$ 1.72 TOPSPIN		Version 2.1
$$ 2015-08-08 01:17:29.797 -0700  Administrator@X
$$ Compression mode = diff/dup
##.OBSERVE FREQUENCY= 400.02188249412
##.OBSERVE NUCLEUS= ^1H
##.ACQUISITION MODE= SIMULTANEOUS (DQD)
##.ACQUISITION SCHEME= undefined
##.AVERAGES= 8
##.DIGITISER RES= 22
##SPECTROMETER/DATA SYSTEM= spect
##.PULSE SEQUENCE= zg30
##.SOLVENT NAME= COFFEE_meoh
##.SHIFT REFERENCE= INTERNAL, COFFEE_meoh, 1, 14.98509
##AUDIT TRAIL= $$ (NUMBER, WHEN, WHO, WHERE, PROCESS, VERSION, WHAT)
$$ ##TITLE= Audit trail, TOPSPIN		Version 2.1
$$ ##JCAMPDX= 5.01
$$ ##ORIGIN= Bruker BioSpin GmbH
$$ ##OWNER= Administrator
$$ $$ E:\/data/COFFEE/nmr/AC1680_CTIAH14388_8571411_XUIS1vgSpy/20/pdata/1/auditp.txt
$$ ##AUDIT TRAIL=  $$ (NUMBER, WHEN, WHO, WHERE, PROCESS, VERSION, WHAT)
(   1,<2015-08-08 01:17:22.297 -0700>,<Administrator>,<X>,<go>,<TOPSPIN 2.1>,
      <created by zg
	started at 2015-08-08 01:16:15.953 -0700,
	POWCHK enabled, PULCHK disabled,
       configuration hash MD5:
       21 0F 79 D6 B3 7B B4 F6 88 20 88 DB 03 48 BD 9F
       data hash MD5: 64K
       7D 37 4A 01 9C F4 93 0E BC 17 F7 AB F3 A2 3B 6A>)
(   2,<2015-08-08 01:17:25.594 -0700>,<Administrator>,<X>,<proc1d>,<TOPSPIN 2.1>,
      <Start of raw data processing
       efp LB = 0 FT_mod = 6 PKNL = 1 PHC0 = 0 PHC1 = 0 SI = 32K 
       data hash MD5: 32K
       0C 72 8D C7 F9 C6 B2 3A 67 13 4D EF 5E 63 55 8B>)
(   3,<2015-08-08 01:17:25.891 -0700>,<Administrator>,<X>,<proc1d>,<TOPSPIN 2.1>,
      <pk PHC0 = 94.10339 PHC1 = 0 
       data hash MD5: 32K
       4B 00 0B 33 80 4B E2 06 69 53 3A F8 D6 A6 BF 8A>)
(   4,<2015-08-08 01:17:26.000 -0700>,<Administrator>,<X>,<proc1d>,<TOPSPIN 2.1>,
      <abs ABSG = 1 
       data hash MD5: 32K
       BC CB 2A 26 8D 48 21 E2 FD 57 73 08 FC FA 04 A3>)
(   5,<2015-08-08 01:17:26.109 -0700>,<Administrator>,<X>,<proc1d>,<TOPSPIN 2.1>,
      <abs ABSG = 2 
       data hash MD5: 32K
       35 3E 65 BD 7A 27 53 D6 13 97 4E FA 74 BA 7F 5C>)
(   6,<2015-08-08 01:17:26.156 -0700>,<Administrator>,<X>,<proc1d>,<TOPSPIN 2.1>,
      <abs ABSG = 3 
       data hash MD5: 32K
       62 EF F5 E1 1E 19 8A 1C 0C 21 EA E6 4E A1 10 6F>)
(   7,<2015-08-08 01:17:26.219 -0700>,<Administrator>,<X>,<proc1d>,<TOPSPIN 2.1>,
      <abs ABSG = 4 
       data hash MD5: 32K
       79 FC 55 39 CB 03 2D AD 9C AA 8C C5 52 99 F3 F2>)
(   8,<2015-08-08 01:17:26.281 -0700>,<Administrator>,<X>,<proc1d>,<TOPSPIN 2.1>,
      <abs ABSG = 5 
       data hash MD5: 32K
       4E 63 2C 31 8E F7 57 8A AA 54 44 F2 53 A4 41 54>)
$$ ##END=
$$ 
$$ $$ hash MD5
$$ $$ 8D 0C 60 DD 4B 06 8C C8 E2 26 FF BC 01 CC 25 D3
##$RELAX= 
##$RELAX= 
##$RELAX= 
##$RELAX= 
##$RELAX= 
##$RELAX= 
##$RELAX= 
$$ Bruker specific parameters
$$ --------------------------
##$DU= <E:\>
##$EXPNO= 20
##$NAME= <AC1680_CTIAH14388_8571411_XUIS1vgSpy>
$$ [...]
150 150 150 150 150 150 150 150
##$TP07= 0
##$TPNAME0= <>
##$TPNAME1= <>
##$TPNAME2= <>
##$TPNAME3= <>
##$TPNAME4= <>
##$TPNAME5= <>
##$TPNAME6= <>
##$TPNAME7= <>
##$TPOAL= (0..7)
0.5 0.5 0.5 0.5 0.5 0.5 0.5 0.5
##$TPOFFS= (0..7)
0 0 0 0 0 0 0 0
##$TUNHIN= 0
##$TUNHOUT= 0
##$TUNXOUT= 0
##$USERA1= <user>
##$USERA2= <user>
##$USERA3= <user>
##$USERA4= <user>
##$USERA5= <user>
##$V9= 5
##$VALIST= <valist>
##$VCLIST= <CCCCCCCCCCCCCCC>
##$VD= 0
##$VDLIST= <DDDDDDDDDDDDDDD>
##$VPLIST= <PPPPPPPPPPPPPPP>
##$VTLIST= <TTTTTTTTTTTTTTT>
##$WBST= 2048
##$WBSW= 25
##$XGAIN= (0..3)
0 0 0 0
##$XL= 0
##$YL= 0
##$YMAX_a= 565510
##$YMIN_a= -478056
##$ZGOPTNS= <>
##$ZL1= 120
##$ZL2= 120
##$ZL3= 120
##$ZL4= 120
##$ABSF1= 14.98509
##$ABSF2= -5.573092
##$ABSG= 5
##$ABSL= 3
##$ALPHA= 0
##$AQORDER= 0
##$ASSFAC= 0
##$ASSFACI= 0
##$ASSFACX= 0
##$ASSWID= 0
##$AUNMP= <proc_prof1d_extract_pilot.lims>
##$AXLEFT= 0
##$AXNAME= <>
##$AXNUC= <1H>
##$AXRIGHT= 0
##$AXTYPE= 0
##$AXUNIT= <>
##$AZFE= 0.1
##$AZFW= 0.1
##$BCFW= 0
##$BC_mod= 0
##$BYTORDP= 0
##$COROFFS= 0
##$CY= 15
##$DATMOD= 1
##$DC= 0
##$DFILT= <>
##$DTYPP= 0
##$F1P= 0
##$F2P= 0
##$FCOR= 0.5
##$FTSIZE= 32768
##$FT_mod= 6
##$GAMMA= 0
##$GB= 0
##$INTBC= 1
##$INTSCL= 1
##$ISEN= 128
##$LB= 0
##$LEV0= 0
##$LPBIN= 0
##$MAXI= 10000
##$MC2= 0
##$MEAN= 0
##$ME_mod= 0
##$MI= 0
##$NCOEF= 0
##$NC_proc= -8
##$NLEV= 6
##$NOISF1= 0
##$NOISF2= 0
##$NSP= 0
##$NTH_PI= 0
##$NZP= 0
##$OFFSET= 14.98509
##$PC= 1
##$PHC0= 94.10339
##$PHC1= 0
##$PH_mod= 1
##$PKNL= yes
##$PPARMOD= 0
##$PPDIAG= 0
##$PPIPTYP= 0
##$PPMPNUM= 2147483647
##$PPRESOL= 1
##$PSCAL= 4
##$PSIGN= 0
##$PYNMP= <proc.py>
##$REVERSE= no
##$SF= 400.02
##$SI= 32768
##$SIGF1= 0
##$SIGF2= 0
##$SINO= 400
##$SIOLD= 32768
##$SPECTYP= <>
##$SREGLST= <1H.CDCl3>
##$SSB= 0
##$STSI= 32768
##$STSR= 0
##$SW_p= 8223.68421052631
##$SYMM= 0
##$S_DEV= 0
##$TDeff= 65536
##$TDoff= 0
##$TI= <>
##$TILT= no
##$TM1= 0
##$TM2= 0
##$TOPLEV= 0
##$USERP1= <user>
##$USERP2= <user>
##$USERP3= <user>
##$USERP4= <user>
##$USERP5= <user>
##$WDW= 1
##$XDIM= 32768
##$YMAX_p= 412247135
##$YMIN_p= -660987
##$CURPLOT= <Network HP LaserJet P1505>
##$CURPRIN= <$Network HP LaserJet P1505>
##$DFORMAT= <normdp>
##$LAYOUT= <+/1D_H.xwp>
##$LFORMAT= <normlp>
##$PFORMAT= <normpl>
##$SURQMSG= 1
$$ End of Bruker specific parameters
$$ ---------------------------------
##NTUPLES= NMR SPECTRUM
##VAR_NAME=  FREQUENCY,     SPECTRUM/REAL,   SPECTRUM/IMAG
##SYMBOL=    X,             R,               I
##VAR_TYPE=  INDEPENDENT,   DEPENDENT,       DEPENDENT
##VAR_FORM=  AFFN,          ASDF,            ASDF
##VAR_DIM=   32768,         32768,           32768
##UNITS=     HZ,            ARBITRARY UNITS, ARBITRARY UNITS
##FACTOR=    0.250966925370066, 1,           1
##FIRST=     8223.43324360094, 69206,        -80222
##LAST=      0,             144489,          -180622
##MIN=       0,             -660987,         0
##MAX=       8223.43324360094, 412247135,    0
$$ Real data points
##PAGE= N=1
##DATA TABLE= (X++(R..R)), XYDATA
$$ [...]
$$ plain form
19540 -275283 144174 -92663 30503 104234 -54102 -104019 -9476 86301 11655 -124337 53541
19528 -147326 11019 -65086 29487 -248971 -4129 -284892 201528 64769 -213120 28208 -171082
19516 -112978 -214818 -69191 -61132 -37816 -187051 -201377 -85884 -41397 226236 -52203 266802
19504 -155810 -195947 59963 69110 59770 -210228 -103405 -64898 -111705 -10792 4765 177022
19493 177022 104016 57260 -363493 67060 -161191 119865 4642 -363474 1263 315575 -130108
19481 222545 -186365 129293 6973 139809 108168 27868 -4272 -71027 -50043 202858 -271938
19469 -403312 -398017 -38452 183204 -123474 -504203 76460 -23062 -311947 -152088 -128955 88867
19457 24691 200642 -6177 -51265 -137090 263165 141255 -174295 -104817 -297124 -210173 -308475
$$ packed form
19540b75283A44174i2663C0503P3731e4102m9917i476H6301A1655a24337E3541
19528a47326A1019f5086B9487b48971d129k80763B01528F4769b13120B8208a71082
19516a12978j01840f9191Q059K3316j49235j4326h5884d1397B26236e2203B66802
19504a55810m0137E9963R147r340b10228a03405L8507m6807a0792D765J72257
19493A77022p3006m6756c63493F7060a61191A19865D642c63474A263L14312a30108
19481B22545a86365A29293F973J32836l1641B7868d272o6755K0984B02858b71938
19469d03312N295c8452A83204a23474l80729G6460b3062k88885a52088K3133H8867
19457B4691J75951f177m5088q5825B63165j21910a74295O9478j92307Q6951r8302
$$ plain form
19446 -308475 163303 153642 -326721 237432 -236863 -187289 307915 -187798 19396 -190482
19435 -61177 -35411 56736 -411701 102319 -77340 -178620 -44370 122848 -89511 -54134 228312
19423 -132001 81394 131496 120092 68757 -6983 184645 -356002 -17499 -15482 -260587 283901
19411 10354 -1868 3580 -105733 -183616 79611 -38305 86041 -10527 -174469 43792 9610 105668
19399 105668 -79169 -248877 -45618 -169911 129227 -374688 -184650 -69093 113140 -281520
19388 94429 17035 -319838 -242490 10342 50204 2306 -132814 -171740 -211342 -107272 173714
19376 66641 160559 -215803 -217298 -238150 135628 24608 84961 -230081 190848 199416 184462
19365 184462 -7053 -156693 32833 -317413 -261038 -7183 73985 -119126 -95770 -428579 21292
$$ packed form
19446c08475A63303r661c26721B37432b36863M9574C07915a87798A9396a90482
19435f1177K5766E6736d11701A02319g7340j01280d4370A22848h9511L5377B28312
19423a32001H1394N0102j1404n1335f983A84645c56002a7499K017k45105B83901
19411A0354a868C580a05733p7883G9611c8305H6041a0527j63942D3792I610R6058
19399A05668g9169j69708d5618j24293A29227c74688a84650f9093A13140b81520
19388I4429A7035c19838P7348A0342L9862B306a32814l8926l9602J04070A73714
19376F6641R3918b15803j495k0852A35628B4608O0353b30081A90848Q568j4954
19365A84462g053j49640C2833c17413N6375g183G3985a19126K3356l32809B1292
$$ plain form
19353 -66622 -178829 -161462 -238232 -6176 37449 245450 2252 -226111 -69458 67638 -147838
19341 -140002 -62616 -152043 -155437 -323559 -92639 -111501 -124122 -267013 175719 51049 150540
19330 150540 166313 -19108 210318 -52198 -67259 162537 -465594 88401 362565 49438 -145160
19318 -119242 -42212 -39768 -49704 -58762 -390880 -82967 -252061 20657 -11844 -136268 -124418
19307 -124418 -30121 225341 -363357 -244342 -352223 -39132 -260812 257374 -367451 37098
19296 143169 -38691 -997 -79346 -379106 172205 -161848 -63662 329105 34824 40671 108542
19285 108542 -127412 -154017 -30768 -16841 18799 -50997 -167825 -77937 -269370 60444 -110220
19273 -173722 -55207 54502 -153416 -297342 227747 -144682 -70970 -73457 -29219 -82532 23874
$$ packed form
19353f6622j12207J7367p6770f176C7449K08001B252b26111f9458F7638a47838
19341a40002f2616q9427l394j68122i2639j8862j2621j42891A75719E1049R9491
19330A50540J5773a9108B10318e2198j5061A62537d65594H8401K74164D9438a45160
19318a19242d2212K444r936r058l32118h2967j69094B0657a1844j24424J1850
19307a24418c0121B25341c63357J19015j07881c9132k21680B57374c67451C7098
19296A43169c8691i97p8349k99760A72205a61848f3662C29105C4824N847O7871
19285A08542a27412k6605c0768J3927A8799e0997j16828g7937j91433F0444a10220
19273a73722e5207E4502a53416j43926B27747a44682g0970k487b9219n3313B3874
$$ plain form
19261 -69400 28871 -199687 -50408 -229919 -31027 247271 -317445 229232 365424 -61418
19250 -89347 53519 6156 -195684 -69126 20580 -227810 -273972 182882 -141757 96766 -42520
19238 -660987 -96133 26312 -13856 -31302 17921 -16330 188321 -7546 -327658 -134769 -378597
19227 -378597 -231519 -105326 -125935 22006 -207783 -234097 -89390 29550 292782 265736 196854
19216 196854 33291 -230519 55576 -75032 -35935 -173090 199045 -39754 -61215 -70715 -100643
19205 -100643 117541 -82233 109747 -306639 297530 -227531 -253046 -141508 -206351 182536
19194 101689 -173500 -352395 -18674 -222080 -15712 -133439 123874 76576 -38919 -412055
19184 -412055 -128141 -289776 188454 68536 179430 327244 -296458 -89472 -10596 -161450
$$ packed form
19261f9400B8871a99687e0408j79511c1027B47271c17445B29232J36192f1418
19250h9347E3519F156a95684f9126B0580b27810m6162A82882a41757I6766d2520
19238f60987i6133B6312a3856j7446A7921a6330A88321g546l20112a34769k43828
19227c78597J47078a05326k0609B2006b07783k6314h9390B9550K63232k7046o8882
19216A96854C3291b30519E5576g5032c5935j37155A99045c9754k1461r500k9928
19205a00643A17541h2233A09747c06639B97530b27531k5515J11538o4843A82536
19194A01689a73500j78895a8674k03406a5712j17727A23874m7298c8919l73136
19184d12055a28141j61635A88454F8536J10894J47814b96458h9472a0596j50854
$$ plain form
19174 -161450 50724 -209008 -210052 53604 -310677 128772 34529 -189139 -593994 -56489 -262002
19163 -262002 -71005 -192224 127916 -341824 98053 -173821 -37387 114031 -128528 -128570 93265
19151 -290614 -261792 -254295 14606 -111450 -14960 28035 -114242 -106555 173918 -244705 157506
19139 -92194 -74536 230980 -294106 147119 -75797 181202 -135029 -26355 -88806 15779 -162921
19127 -280394 109047 -78322 -240871 27480 -30457 -56440 -86208 -315698 -190242 -39467 -24968
19116 -24968 48957 -302748 -97342 -80002 38497 89268 -146834 -243270 -213727 -11127 -343028
19105 -343028 -232304 -298904 326620 13908 -62814 20777 -118421 -206543 192094 -271536
19094 104547 33037 -378248 -378441 -381869 217422 -100061 259664 -112840 108276 -22380 33478
$$ packed form
19174a61450E0724b09008j044E3604c10677A28772C4529a89139m04855e6489k05513
19163b62002g1005j21219A27916c41824I8053a73821c7387A14031a28528m2I3265
19151b90614K8822P497A4606a11450a4960B8035a14242P687A73918b44705A57506
19139i2194J7658B30980b94106A47119g5797A81202a35029b6355o2451A5779a62921
19127b80394A09047g8322j62549B7480c0457k5983k9768k29490J25456c9467J4499
19116b4968D8957c02748i7342J7340C8497N0771a46834r6436K9543a1127l31901
19105c43028J10724o6600C26620A3908f2814B0777a18421q8122A92094b71536
19094A04547C3037c78248j93l428B17422a00061B59664a12840A08276b2380C3478
$$ plain form
19082 -243637 16427 207284 97677 -207846 -155441 -264318 229193 -58848 -13224 -61696 235638
19070 -207891 -101794 72226 -108513 -132286 -287094 -44680 -125476 116404 41642 -130542
19059 9317 76807 35991 -172177 -307193 30757 37956 30255 -226238 -152312 280794 -43723
19047 -110482 130116 109484 98315 -205471 -15100 35229 -39874 -368158 -225569 -165485 173386
19035 -134329 34670 -228880 -68330 -151194 196725 -105675 -48787 -106091 -23256 -49066 200431
19023 49260 -144602 -91618 -270130 -184760 123051 -31372 -64220 -218264 154984 -4893 -179606
19012 -179606 -3056 91268 -245730 -133021 -232178 26235 302942 20243 135603 -107896 -261701
19001 -261701 -173034 -40557 -145447 -75044 -64123 65268 -47979 30125 81130 -398077 378575
$$ packed form
19082b43637A6427J90857I7677b07846N2405j08877B29193e8848a3224m8472B35638
19070b07891a01794G2226a08513k3773j54808d4680q0796A16404D1642a30542
19059I317O7490C5991a72177j35016C0757P199p701b26238P3926B80794d3723
19047a10482A30116k0632j1169b05471a5100C5229c9874l28284J42589O0084A73386
19035a34329C4670b28880f8330q2864A96725a05675d8787n7304b3256k5810B00431
19023D9260a44602N2984j78512Q5370A23051c1372l2848j54044A54984d893j74713
19012a79606c056I1268b45730J12709r9157B6235K76707B0243J15360a07896j53805
19001b61701Q8667d0557j04890P0403J0921F5268d7979C0125N1005c98077C78575
$$ plain form
18989 -244692 -275640 -10593 -30559 -236561 -319730 -301881 16754 -109428 30404 88214 56335
18978 56335 -73944 -78978 218174 -24244 -80479 -183774 393185 -405074 199654 254186 -67661
18966 -15986 127487 181382 2271 -301858 -96112 -187374 24371 128174 -207711 -218731 53563
18954 -64151 65816 164701 45780 161132 12679 -236942 363655 175319 -9110 100609 -14626
18942 -83586 -80534 -94502 58408 252470 -40442 127211 49318 -417183 52945 -111073 -33948
18930 497523 336635 -192437 -30635 -118464 -298330 -150318 -124152 43180 -386616 -216846
18920 -216846 -232984 61181 270492 -128570 -173999 -2050 -284453 -54829 -148948 2709 92714
18909 92714 -189736 -6176 233980 -90647 101606 60522 118794 17800 -186146 -83849 -22092
$$ packed form
18989b44692l0948a0593j9966k06002q3169J7849A6754a09428C0404N7810l1879
18978E6335g3944n034B18174b4244n6235j03295C93185d05074A99654N4532f7661
18966a5986A27487N3895B271c01858i6112r1262B4371J03803b07711j1020E3563
18954f4151F5816R8885D5780J15352A2679b36942C63655A75319i110A00609a4626
18942h3586L052j3968E8408J94062d0442A27211D9318d17183E2945a11073c3948
18930D97523j60888a92437c0635q7829j79866J48012K6166D3180c86616J69770
18920b16846j6138F1181K09311a28570m5429b050k82403e4829r4119B709R0005
18909I2714a89736f176B33980i0647A01606m1084N8272A7800a86146h3849b2092
$$ plain form
18897 -61503 -98293 -155249 -24483 -58007 -178048 144428 -13784 -226846 -232911 239698 235647
18886 235647 -65873 -242742 -20478 -254109 60713 -135746 -179977 -172917 -463829 158261 232044
18875 232044 -125680 -196725 118734 181492 -97685 -269399 -431723 -98847 93148 -122466
18864 -307906 -149643 -30682 -153091 -12673 154968 38634 139282 -242866 -314199 82976
18853 146296 -232982 -67431 405463 -82938 -99100 373049 -149043 18573 45274 148819
18843 148819 390810 -68289 -11034 -3857 -93079 -145914 220920 -319145 -173060 105884 -304996
18831 -91235 169513 151348 -83073 -180873 43589 -189263 -138338 -159223 130432 222780 18890
18819 242863 37582 6574 76612 287763 72521 128266 339569 25473 149010 -20122 38535
$$ packed form
18897f1503l6790n6956b4483l3524j20041A44428a3784k13062o065B39698m051
18886B35647f5873j76869b0478k33631F0713a35746m4231P060k90912A58261P3783
18875B32044a25680p1045A18734O2758i7685j71714j62324i8847I3148a22466
18864c07906a49643c0682j22409a2673A54968C8634J00648b42866p1333H2976
18853A46296b32982f7431D05463h2938j6162C73049a49043A8573K6701J03545
18843A48819K41991f8289a1034c857q9222n2835B20920c19145J46085A05884c04996
18831i1235A69513j8165h3073r7800D3589a89263N0925k0885A30432R2348A8890
18819B42863C7582F574P0038K11151G2521N5745K11303B5473J23537b0122C8535
$$ plain form
18807 -81017 67996 57227 -61777 -180880 11445 74135 -225746 60112 24588 -168942 -103406
18796 -103406 -116601 90015 -182289 -221513 -525 157376 -408994 -133817 70090 -31096 26064
18784 -192548 -46030 21356 -264960 -260222 214895 -131092 -186912 83333 -172327 89263 -72435
18772 -84141 -206013 92418 -247945 -201287 58867 -166809 24049 208609 -136100 -258555
18762 -258555 358 -127712 140931 -372635 -11279 154396 3363 -33762 -12589 -55740 -187962
18751 -187962 -318860 58662 -187211 -27670 -214645 17836 60506 111202 -195434 -70765 -425985
18740 -425985 -346008 39140 -259557 -57535 -30506 -106036 75281 163966 -95729 -289405 -182649
18729 -182649 -104637 -173505 -258887 -227510 -216233 208371 62332 66191 198932 121126 -205710
$$ packed form
18807h1017F7996j0769f1777j19103A1445O2690b25746F0112B4588a68942O5536
18796a03406j3195I0015a82289l9224e25A57376d08994a33817G0090c1096B6064
18784a92548d6030B1356b64960M738B14895a31092n5820H3333a72327H9263g2435
18772h4141j21872I2418b47945M6658E8867a66809B4049J84560a36100j22455
18762b58555C58a27712A40931c72635a1279A54396C363c3762a2589m3151j32222
18751a87962j30898E8662a87211b7670j86975A7836M2670N0696a95434g0765l55220
18740d25985P9977C9140b59557e7535K7029p5530G5281Q8685i5729j93676J06756
18729a82649P8012o8868q5382L1377J1277B08371F2332L859J32741p7806b05710
$$ plain form
18717 -212810 -110343 -224806 85078 -257938 -206942 -24802 141168 -300891 -294616 -29932 180920
18705 -234460 -90825 -95499 -132461 -451256 -93114 69349 -221517 199975 164609 263254 243141
18694 243141 66871 -2590 -184055 -70932 29824 -15039 333197 -60511 80032 209513 -29667
18682 -285664 -226715 119661 134153 -39958 -113945 -46453 -236135 -28867 -460540 40148 38451
18671 38451 -303573 48163 72490 -93829 -351732 61572 34591 983 -28057 -20211 184732 36425
18658 -99317 -68256 -162812 -157247 -9993 31772 -13959 -15898 39897 -288666 -102756 -7304 -314114
18646 -314114 144080 -291269 -60885 -165898 -192557 78433 158935 -38183 -109169 287804 51935
18634 -267491 -67621 -184163 122057 142450 143636 -256364 37004 -39843 -100769 110670 -24627
$$ packed form
18717b12810J02467j14463H5078b57938N0996b4802A41168c00891O275b9932A80920
18705b34460i0825m674l6962l18795i3114F9349b21517A99975l5366R8645k0113
18694B43141F6871b590j81465g0932B9824a5039C33197f0511H0032J29481b9667
18682b85664N8949A19661J4492c9958p3987d6453j89682b8867m31673D0148j697
18671C8451c03573D8163K4327i3829k57903F1572k6981I83b8057P846A84732C6425
18658i9317L1061r4556N565i993C1772a3959j939C9897b88666a02756g304l06810
18646c14114A44080b91269f0885j05013k6659G8433Q0502c8183p0986B87804E1935
18634b67491f7621j16542A22057K0393J186b56364C7004c9843o0926A10670b4627
$$ plain form
18622 -21686 4960 -119671 -194858 -43990 -209675 174390 -49932 -380907 -292360 53037 105924
18611 105924 149428 94306 -282412 -1697 638 -99856 -187589 27017 -393604 -168370 -179076
18600 -179076 -4538 -251171 312035 -31230 -125576 155305 57257 -112746 -220485 -408431
18590 -408431 -44333 -77027 -137405 -27888 97764 -51263 -65152 -129400 132064 -185962 -60719
18578 169984 -226385 427692 -129221 -225117 99528 162562 68598 -258742 117878 33341
18567 -101242 -40292 -17812 117567 67118 -328892 -115006 36212 -231715 -295345 -30746 80242
18555 -159963 224744 -26415 -68780 -141563 -106228 174538 -226772 300059 -45019 220621
18544 -191535 -87856 -113393 25643 -37368 266331 -20582 -143802 257150 251860 -26568 -124018
$$ packed form
18622b1686D960a19671p5187d3990j65685A74390d9932l30975Q8547E3037N2887
18611A05924M3504n5122b82412a697F38i9856q7733B7017c93604a68370j0706
18600a79076d538k46633C12035c1230r4346A55305E7257a12746j07739j87946
18590d08431d4333l2694o0378b7888I7764e1263j3889o4248A32064a85962f0719
18578A69984b26385D27692a29221r5896I9528O3034F8598b58742A17878C3341
18567a01242d0292a7812A17567n0449c28892a15006C6212b31715o3630c0746H0242
18555a59963B24744b6415m2365p2783L5335A74538b26772C00059d5019B20621
18544a91535h7856k5537B5643c7368B66331b0582j23220B57150n290b6568r7450
$$ plain form
18533 -124018 257029 -47194 163884 151847 52321 224996 -65530 -247753 -71870 31306 -98790
18521 -36926 106868 -246832 -157956 -129402 -259304 147355 -65644 37409 324794 22578 103193
18510 103193 16887 -399569 -200267 -336145 -122462 148030 12162 23065 34047 132216
18500 132216 -258279 -10588 51353 107782 86039 184492 -8663 -272738 65368 25206 -106691
18488 31718 -171223 70892 72165 327387 -81416 -183527 -87875 -96632 -211399 -142352 -71114
18476 134837 -17122 -95681 229085 -79107 3258 -129139 168584 -128338 229104 -72278 -275252
18465 -275252 -174139 56479 -139769 -126092 -388912 91328 -188501 -24197 186035 -205984
18454 -157642 -140835 -78912 -33112 109723 45345 -174744 146311 -242120 -244401 -101236 -160293
$$ packed form
18533a24018B57029d7194A63884j2037E2321J72675f5530j82223g1870C1306i8790
18521c6926A06868b46832Q8876K8554j29902A47355f5644C7409K87385B2578Q0615
18510A03193A6887c99569J99302j35878a22462A48030A2162J0903J0982R8169
18500A32216b58279a0588E1353N6429k1743R8453h663k64075F5368B5206a06691
18488C1718a71223G0892J273K55222h1416j02111h7875q757j14767O9047g1114
18476A34837a7122p8559B29085g9107C258a29139A68584a28338B29104g2278k02974
18465b75252J01113E6479a39769J3677k62820I1328a88501b4197A86035b05984
18454a57642J6807O1923c3112A09723D5345a74744A46311b42120k281a01236n9057
$$ plain form
18443 -160293 -174119 -6205 -15469 -30356 -30851 36339 13553 -211125 103964 152563 8811 -63042
18430 10839 -125001 137724 -40672 -342755 7083 -353067 150890 -253882 -57196 104488
18419 2642 156308 -435404 -160973 -90068 -132560 219537 39244 -333927 -385556 135654 370736
18408 370736 126186 -134145 59147 109851 -23061 -71781 76998 208163 -50844 74167 -88361
18396 70363 -78986 -330803 -63321 -186797 116883 -164560 -201425 35023 -95742 -119278 -143829
18385 -143829 -96497 269863 -179979 35710 211816 -199 202270 -210374 70945 -258514 -72005
18373 147204 -277431 134139 24764 82168 -403103 186503 280868 377527 -9266 -253545 -36607
18361 -40409 -100481 100518 5285 -46849 -235520 -25128 -431223 272418 61921 -289169 58474
$$ packed form
18443a60293j3826f205r264j4887m95C6339A3553b11125A03964M8599H811f3042
18430A0839a25001A37724d0672l02083G083c53067A50890b53882e7196A04488
18419B642J53666d35404a60973P0905m2492B19537C9244c33927n1629A35654K35082
18408C70736A26186a34145E9147N0704b3061m8720G6998J31165e0844G4167h8361
18396G0363g8986k51817f3321j23476A16883a64560l6865C5023i5742k3536k4551
18385a43829M7332B69863a79979C5710J76106a99B02270b10374G0945b58514g2005
18373A47204b77431A34139B4764N7404d03103A86503R4365R6659i266k44279c6607
18361d0409o0072A00518E285d6849j88671b5128m06095B72418F1921b89169E8474
$$ plain form
18349 -191838 -181334 -76306 59008 -140012 -20352 31750 -319260 -92074 31263 20692 323375
18338 323375 -186690 322402 111988 -127106 -170598 -151050 159370 176682 70619 -250989
18327 -142579 -123510 -196075 -197323 -324022 24091 -24714 84259 132059 58534 -412410 36196
18315 -342745 -186090 425001 -73470 -130169 -88342 126611 -105197 -387753 -248397 -277783
18305 -277783 61647 -7999 23140 -160912 76619 -244811 -84162 -283361 -447550 -1006 -178912
18294 -178912 -100417 -344781 -190339 -80520 51276 52819 -253300 -68463 23993 -6643 -17078
18283 -17078 44356 -140819 -19030 -305678 33435 155318 156887 -1526 56905 64871 135716 99882
18271 99882 -56436 346326 -180134 -61247 -203885 97732 -102112 -428354 -216544 24706
$$ packed form
18349a91838J0504g6306E9008a40012b0352C1750c19260i2074C1263j0571L02683
18338C23375a86690C22402A11988a27106m3492J9548A59370J7312G0619b50989
18327a42579J9069p2565j248j26699B4091b4714H4259M7800E8534d12410C6196
18315c42745J56655D25001g3470n6699M1827A26611a05197k82556J39356k9386
18305b77783F1647g999B3140a60912G6619b44811h4162j99199j64189a006j77906
18294a78912P8495k44364J54442h0520E1276J543b53300f8463B3993f643j0435
18283a7078D4356a40819a9030k86648C3435J21883J569a526E6905P966P0845l5834
18271I9882e6436C46326a80134f1247j42638I7732a02112l26242K11810B4706
$$ plain form
18260 -103539 70253 -45009 203966 -2126 25572 -117742 47583 22609 242200 -73323 183112
18248 173761 -99114 15395 33 -157284 101378 348919 -231195 -240844 83035 138937 -51276
18236 -53740 -112974 148344 158504 114610 136506 -127408 67993 146395 25172 222345 -171507
18224 -9294 -102291 -15175 3596 57906 159814 4660 -75593 -49039 36371 -62511 -36381 -158300
18212 -158300 -59723 -105962 -75318 -91011 -310399 -261670 -155495 251666 108700 -237237
18201 -171048 80491 -58097 13974 133137 -478712 -82619 -112254 -79121 126289 -143054 -233602
18190 -233602 29617 -132868 166961 -54941 -106586 5499 -40890 -98312 70078 -28993 30988
18178 34914 -48937 310945 -304949 154904 -9969 -188556 -186252 145518 -12453 111662 -49373
$$ packed form
18260a03539G0253d5009B03966b126B5572a17742D7583B2609K19591g3323A83112
18248A73761i9114A5395C3a57284A01378K47541b31195r649H3035N5902e1276
18236e3740n9234A48344J0160m3894K1896a27408F7993P8402B5172J97173a71507
18224i294r2997a5175C596N4310J01908D660g5593K6554C6371f2511K6130j21919
18212a58300e9723m6239L0644j5693k19388M8729J06175B51666A08700b37237
18201a71048H0491e8097A3974J19163d78712h2619k9635L3133A26289a43054r0548
18190b33602B9617a32868A66961e4941n1645E499d0890n7422G0078b8993C0988
18178C4914d8937C10945c04949A54904i969j78587K304A45518a2453A11662d9373
$$ plain form
18166 62411 -112915 133564 -36372 80099 -321466 58002 51929 -18051 97919 -196288 -30726
18154 -99209 -191274 -156663 -293700 -82436 -31102 48480 -117866 -19882 -128977 -139282 175447
18142 -230066 -78578 -215830 65858 -53962 -211831 84640 -18699 123273 74024 215172 -80838
18130 77139 -342231 -220981 866 -173741 -274193 -27554 28726 -22016 195220 -58445 95295
18118 195301 51608 185968 -68564 -75222 91985 -128192 47757 -139931 6414 -98354 -84600
18107 -84600 153773 -202307 -210039 -225637 -163874 -306704 -327077 -144381 218797 -309940 -414033
18096 -414033 -121082 67641 -1651 164199 -393551 -172480 88369 7932 -177073 -235032 -25372
18084 -41245 240964 110676 -17542 93738 -275638 33532 -200039 36335 -96949 -207931 86240
$$ packed form
18166F2411a12915A33564c6372H0099c21466E8002o073a8051I7919a96288c0726
18154i9209r2065L4611j37037h2436c1102D8480a17866a9882j09095j0305A75447
18142b30066g8578j37252F5858e3962j57869H4640a8699A23273m9249J41148h0838
18130G7139c42231J21250H66a73741j00452b7554B8726b2016A95220e8445I5295
18118A95301E1608J34360f8564o658I1985a28192D7757a39931F414i8354J3754
18107h4600A53773b02307p732j5598O1763j42830k0373a44381B18797c09940j04093
18096d14033a21082F7641a651A64199c93551a72480H8369G932a77073n7959b5372
18084d1245B40964A10676a7542I3738b75638C3532b00039C6335i6949j10982H6240
$$ plain form
18072 228911 223837 22427 -93525 37990 -113618 -8718 -130177 240715 -60199 115324 -373066
18060 -98435 -200295 43192 84074 -66445 -88024 -51073 -243356 -138409 -92062 -144572 -45097
18048 -112934 -10056 -184113 118768 -35725 32585 -92392 -102647 6640 -70584 -340179 34924
18036 -77464 5759 -271745 -100931 192384 81452 -88795 63424 169489 222095 137717 203226
18025 203226 77897 -287823 30853 -135033 -224990 -36442 306263 -192760 281219 212424
18015 212424 59995 -187097 -76487 -426782 -194167 -111238 -265286 153110 -62640 -107261
18005 -107261 -579414 -70387 128094 -144476 -27961 168717 297589 80827 179645 94107
17995 94107 48095 -78766 131988 86167 321263 76431 127898 -175804 218494 -9328 -134009
$$ packed form
18072B28911n074B2427i3525C7990a13618h718j21459B40715f0199A15324c73066
18060i8435j01860D3192M0882f6445k1579L6951j92283J04947M6347n2510d5097
18048a12934a0056j74057A18768c5725C2585i2392j0255F640g0584k69595C4924
18036g7464E759b71745a00931A92384H1452h8795F3424J06065N2606q4378O5509
18025B03226G7897b87823C0853a35033q9957c6442C06263a92760B81219o8795
18015B12424E9995a87097g6487l50295a94167Q2929j54048A53110f2640m4621
18005a07261m72153g0387A28094a44476b7961A68717J28872H0827R8818q5538
17995I4107m6012g8766A31988m5821K35096G6431N1467a75804B18494i328j24681
$$ plain form
17984 -134009 -108115 -96151 167620 150091 156005 -415348 8065 44069 158847 144236 -92391
17972 -265439 -81617 -94760 200661 38795 106805 431737 48632 108880 -21537 127284 4428
17960 -129121 274991 -140936 201396 -32439 -45178 -188850 27488 -116691 96499 -41440
17949 177512 -241 -91125 -193176 139084 179384 27486 -88228 264459 -43033 -22875 13287
17937 -222853 -186289 277195 48469 242769 -180445 192743 -14075 -10950 256547 -140237
17926 310858 -125797 -189127 -58378 169777 40859 -187144 78661 80430 -112696 -161553 -360160
17915 -360160 -73552 145640 -186718 -234739 230007 -76933 221412 329294 2602 -103067
17904 -341329 -46866 177575 -46091 -198888 -322921 -112184 -235484 91238 -209980 -18498
$$ packed form
17984a34009K5894J1964A67620j7529N914d15348H065L6004J14778j4611i2391
17972b65439h1617j3143B00661C8795O8010L24932D8632O0248b1537A27284D428
17960a29121B74991a40936B01396c2439j2739j43672B7488a16691I6499d1440
17949A77512b41r0884j02051A39084M0300B7486h8228B64459d3033K0158A3287
17937b22853L6564B77195D8469J94300a80445A92743a4075L125B56547a40237
17926C10858a25797o3330e8378A69777D0859a87144G8661J769a12696m8857j98607
17915c60160g3552A45640a86718m8021B30007g6933B21412J07882B602a03067
17904c41329d6866A77575d6091j52797j24033a12184j23300I1238b09980a8498
$$ plain form
17893 126690 48932 -273799 -102375 -42865 164860 35901 -231122 47437 -271556 -146214
17883 -146214 73657 545036 -195556 -123892 -90748 -24449 -3013 -223982 177203 116284 -276535
17871 -139211 11125 -177043 114931 -50006 59666 9306 299544 -125488 66239 -135351 55928
17859 -33563 206748 79904 -269316 -82653 -155947 48856 -167674 16789 -306565 -209599 -243163
17848 -243163 -67853 -168741 -9102 -86875 220634 180418 111285 211799 -9621 -159850 -137043
17837 -137043 64365 -135207 -182920 291137 -11153 166255 -29657 -187500 -123881 218910
17826 -146328 10281 -100377 -43866 -86319 -334385 -108251 -28881 84064 12940 -141624 -120906
17815 -120906 211437 -228524 -6547 -291477 57077 14576 -34131 -21833 -164808 -150593 28953
$$ packed form
17893A26690D8932b73799a02375d2865A64860C5901b31122D7437b71556J25342
17883a46214G3657M71379a95556P1664L3144b4449c013k20969A77203o0919b76535
17871a39211A1125a77043A14931e0006E9666I306K90238a25488F6239a35351E5928
17859c3563B06748G9904b69316h2653p3294D8856a67674A6789c06565R6966l3564
17848b43163f7853j00888i102p7773B20634m0216o9133J00514i621j50229K2807
17837a37043F4365a35207m7713B91137a1153A66255b9657j57843O3619B18910
17826a46328A0281a00377d3866m2453k48066a08251b8881H4064A2940a41624K0718
17815a20906B11437b28524f547k84930E7077A4576c4131J2298j42975J4215B8953
$$ plain form
17803 -379675 -247825 -558323 -4985 71202 160885 -260418 108982 -124331 28476 345908
17793 345908 -180593 -212052 8520 342417 71097 -57766 17633 -156416 133029 205158 -156263
17781 -30044 124506 44073 142688 -112427 168962 175487 308590 41865 -181637 -172945 33425
17769 95783 -53694 -101088 71080 300677 60265 303618 -117146 224414 140323 204078 119762
17758 119762 -50879 90426 -38279 99462 275301 -12838 -197762 111562 73075 -166270 78967
17746 -364261 166700 -114678 41032 -114351 -168325 -317356 48730 43131 -6125 -114016 111929
17734 120338 151412 -22959 30486 247753 319849 -8106 292696 -26182 43000 132524 188094
17723 188094 118144 -176165 -38067 -42630 -139935 57588 -81232 151366 -51560 -206377 49232
$$ packed form
17803c79675J31850l10498d985G1202Q9683b60418A08982a24331B8476L17432
17793C45908a80593l1459H520L33897G1097e7766A7633a56416A33029P2129a56263
17781c0044A24506D4073R8615a12427A68962O525J33103D1865a81637Q692C3425
17769I5783e3694m7394G1080K29597F0265K43353a17146B24414q4091O3755q4316
17758A19762e0879I0426c8279I9462J75839a2838j84924A11562l8487a66270G8967
17746c64261A66700a14678D1032a14351n3974j49031D8730n599f125j07891A11929
17734A20338L1074b2959C0486K17267P2096h106B92696b6182D3000Q9524N5570
17723A88094o9950a76165c8067m563r7305E7588h1232A51366e1560j54817D9232
$$ plain form
17711 109125 -53221 -41180 -15852 240838 -78090 -56366 133442 57482 -32214 -27203 73524
17699 -29111 -24133 191240 301758 155993 126339 -92889 7699 90972 -69673 49834 45450 243323
17687 243323 -80367 -308370 -439682 186885 -289610 102140 -343134 275991 -66687 82239
17676 -212950 145713 -7324 -42519 -207179 -26363 -329621 -52091 46111 -92450 105147 -2468
17664 -85061 161193 157046 114131 19771 25343 156131 115456 137155 260911 177511 393032
17653 393032 169862 334881 -11677 -156917 18407 97743 -224195 50248 92178 -73569 173549
17641 135171 4445 -170342 -62625 209144 121337 -145067 -189158 -333713 70462 126437 125895
17630 125895 102775 -5475 -21560 -187594 -1384 -131751 241724 121637 363558 -71406 60045
$$ packed form
17711A09125e3221J2041a5852B40838g8090K1724A33442E7482c2214N011G3524
17699b9111M978A91240J10518j45765k9654i2889G699Q3273f9673D9834m384J97873
17687B43323h0367k28003j31312A86885b89610A02140c43134B75991f6687H2239
17676b12950A45713g324l5195j64660b6363l03258e2091D6111i2450A05147b468
17664h5061A61193m147m2915A9771N572J30788m0675K1699J23756q3400K15521
17653C93032A69862J65019a1677j45240A8407P9336b24195E0248M1930g3569A73549
17641A35171D445a70342f2625B09144q7807a45067m4091j44555G0462N5975n42
17630A25895k3120e475j6085j66034a384j30367B41724j20087K41921g1406F0045
$$ plain form
17618 -17765 104302 183949 -150173 115005 -50210 -185473 -68906 55876 -209113 32881 105656
17607 105656 134296 152025 194883 -108507 -25729 -101234 -10884 157181 79640 85069 -114575
17595 136395 73748 -132813 -171254 63202 281891 15857 495589 139209 -50343 141068
17584 118150 24208 49692 -71631 167915 -268279 50966 10914 67997 -109749 -110621 -129955
17573 -129955 100231 550567 230342 -24366 27264 -59751 14352 20641 -227044 80208 -87433
17561 -8448 381710 -91768 206186 -112897 82855 -73801 -119675 101461 44376 69349 -97284
17549 -231815 -100743 -107710 80531 -28741 161176 -21135 -357129 299852 -74550 189106 105085
17538 105085 154410 -25619 -76405 206266 210876 34200 176983 232002 110804 52042 28066
$$ packed form
17618a7765A04302P9647a50173A15005e0210j35263f8906E5876b09113C2881P2775
17607A05656K8640J7729M2858a08507b5729p5505a0884A57181p7541N429a14575
17595A36395o2647a32813l8441F3202K18689A5857M79732A39209e0343A41068
17584A18150B4208K5484g1631A67915b68279E0966A0914N7083a09749q72j9334
17573a29955A00231M50336B30342b4366B7264e9751A4352O289b27044H0208h7433
17561h448C81710i1768B06186a12897H2855g3801m5874A01461D4376K4973i7284
17549b31815a00743o967H0531b8741A61176b1135l35994B99852g4550A89106q4021
17538A05085M9325b5619n0786B06266M610C4200J42783N5019A10804E2042k3976
$$ plain form
17527 28066 196968 -9850 -62722 102948 -140090 -13049 353801 111224 -91262 218880 -51695
17515 93834 46931 -179770 -93784 -62350 176619 408824 -189267 -68825 289226 -71694 204092
17503 65024 94208 163010 266414 -57346 324650 78893 -19026 64974 -238252 -153956 134660
17491 52234 -112743 -119764 224859 212772 320902 32520 102006 120532 -147034 -175781 112791
17479 -61899 177817 -8853 274234 -259101 166464 292228 134765 90679 128973 -119063
17468 199188 50400 -43373 -65922 206478 58668 165830 145574 130533 55252 105087 88905
17457 88905 356037 155139 158410 159910 118597 334133 -186474 8564 386667 233930 272010
17446 272010 483880 352455 258827 -89594 322189 -42320 324537 417281 280944 -10465
$$ packed form
17527B8066J68902i850n2872A02948a40090a3049C53801A11224i1262B18880e1695
17515I3834m6903a79770Q5986L1434A76619K32205a89267f8825B89226g1694B04092
17503F5024K9184O8802J03404e7346C24650G8893a9026F4974b38252Q4296A34660
17491E2234a12743p021B24859j2087J08130C2520O9486J8526a47034k8747A12791
17479f1899A77817h853B74234b59101A66464J25764A34765m4086L8294a19063
17468A99188E0400d3373k2549B06478E8668J07162k0256j5041E5252M9835j6182
17457H8905K67132A55139L271J500m1313K15536a86474H564L78103j52737L8080
17446B72010K11870j31425r3628h9594C22189d2320C24537R2744j36337a0465
$$ plain form
17435 134756 132196 303773 239639 275800 -28741 -125919 9146 85308 127607 273664 385982
17424 385982 182496 73710 480830 -87833 521334 242460 46748 103863 437930 96394
17413 204572 128806 255596 266853 403888 268226 156868 616651 503792 202999 236952
17403 236952 157593 -62990 147035 -50836 -122988 104930 346175 12189 -125351 -85188 107031
17391 297619 152989 302251 75463 -157621 282715 196493 278418 325093 328712 187582 245659
17380 245659 113414 8484 188650 203365 -14127 76930 194229 -154124 142833 99027 116992
17369 116992 42651 200264 21518 210819 -58354 253349 307235 7072 389332 207783 -199666
17357 241683 124372 -23416 235394 142961 304250 137834 447651 196353 84347 27255
$$ packed form
17435A34756k560J71577o4134L6161b8741r7178I146P6162M2299J46057J12318
17424C85982A82496G3710M07120h7833E21334B42460D6748N7115L34067I6394
17413B04572p5766J26790J1257J37035j35662j11358M59783j12859B02999L3953
17403B36952p9359f2990A47035e0836p2152A04930K41245A2189a25351M0163A07031
17391B97619j44630J49262G5463a57621B82715q6222Q1925M6675L619j41130N8077
17380B45659A13414H484J80166J4715a4127G6930J17299a54124A42833m3806J7965
17369A16992D2651J57613B1518J89301e8354B53349N3886G072L82260j81549a99666
17357B41683j17311b3416B35394r2433J61289A37834L09817A96353H4347B7255
$$ plain form
17346 380557 330725 82916 241196 5292 310781 212453 274381 126619 -69719 198642 640621
17335 640621 300348 79331 273795 -144686 31702 -100112 -40401 220861 62162 224548
17325 224548 -135036 57699 -14212 734038 44946 -16583 2059 235345 -214787 79774 -8792
17313 98720 344502 -66685 130827 101921 -4461 337426 163285 281758 74615 407705 304234
17302 304234 293527 -192526 313456 208242 185453 274152 63298 309837 31926 173360
17292 173360 335842 133207 -60278 503144 397461 92473 2714 394641 232341 102900
17281 -42042 -92873 10834 146666 353829 365435 489716 35416 235422 261047 84716 23901
17269 21349 369931 196466 199172 342967 295708 311724 33026 333376 74362 68122 -134699
$$ packed form
17346C80557m9832H2916J58280E292L05489r8328O1928A26619f9719A98642M41979
17335F40621C00348G9331J94464a44686C1702a00112d0401B20861F2162J62386
17325B24548a35036E7699a4212G34038D4946a6583B059K33286b14787G9774h792
17313I8720K45782f6685A30827k8906d461C37426A63285J18473G4615L33090j03471
17302C04234j0707a92526C13456j05214k2789Q8699F3298K46539C1926J41434
17292A73360J62482A33207f0278E03144j05683I2473B714L91927j62300A02900
17281d2042n0831A0834J35832K07163J1606J24281C5416K00006K5625H4716B3901
17269B1349L48582j73465K706J43795m7259J6016C3026L00350G4362o240a34699
$$ plain form
17257 77265 -6504 353380 245275 85130 -8214 224286 -39728 473751 271877 144284 310254
17246 310254 267291 -213764 230766 379549 24368 -2610 208929 -11272 534972 -29703 424698
17234 377063 291086 132283 182214 378241 235117 335340 -260 147511 157238 133171 422793
17223 422793 385558 118736 560467 166858 479149 240164 506072 479433 131006 178427
17213 178427 149023 166315 -31185 186597 219705 298867 76413 596 512919 457595 193193
17201 -82796 400017 253411 74614 59839 440688 -41658 119971 301870 14188 187913
17191 187913 399257 134964 408078 488051 51263 202517 308820 384920 394463 435433 265236
17180 265236 192431 210361 139918 332897 423064 350905 535426 366554 383220 237988 245409
$$ packed form
17257G7265f504C53380j08105H5130h214B24286c9728D73751k01874j27593J65970
17246C10254m2963b13764B30766J48783B4368b610B08929a1272E34972b9703D24698
17234C77063q5977A32283M9931J96027j43124J00223b60A47511R727k4067K89622
17223D22793l7235A18736M41731A66858L12291k38985K65908k6639A31006M7421
17213A78427k9404J7292c1185A86597L3108P9162G6413E96N12323n5324A93193
17201h2796D00017j46606G4614j4775L80849d1658A19971J81899A4188J73725
17191A87913K11344A34964K73114P9973E1263J51254J06303P6100R543M0970j70197
17180B65236p2805J7930p0443J92979R0167p2159J84521j68872J6666j45232P421
$$ plain form
17169 245409 345115 154398 297779 249823 194160 254312 208486 456054 222209 284469 309342
17158 309342 367531 382655 328807 -76067 207672 -35744 293177 149949 443890 678437
17148 678437 134965 291818 442984 208456 352078 524755 291599 353909 454418 166936
17137 425576 586818 394028 393039 267897 247052 311943 125152 218728 429646 122667 288266
17126 288266 199903 597732 660375 274090 235512 481685 329958 530197 580301 209530
17115 592813 310006 205124 411608 538563 715015 463481 449592 379366 159151 303664
17105 303664 402417 564192 535492 261262 237572 286778 716058 473715 529436 387650
17095 387650 99717 364119 48473 650551 345443 188779 576681 620893 613490 344761
$$ packed form
17169B45409R9706A54398J43381m7956n5663O0152m5826K47568B22209O2260K4873
17158C09342N8189J5124n3848g6067B07672c5744B93177j43228K93941K34547
17148F78437A34965J56853J51166B08456J43622J72677k33156O2310J00509A66936
17137D25576J61242j92790r89j25142k0845O4891A25152R3576K10918A22667J65599
17126B88266q8363L97829O2643B74090l8578K46173j51727K00239N0104B09530
17115E92813k82807j04882K06484J26955J76452k51534j3889p0226A59151J44513
17105C03664R8753J61775k8700B61262k3690M9206M29280k42343N5721j41786
17095C87650I9717K64402D8473O02078l05108j56664L87902M4212p403k68729
$$ plain form
17085 344761 692344 456215 625835 460134 401722 490300 682998 408870 667747 774909
17075 774909 806938 713926 449594 511787 589557 372027 637359 415837 399481 616192
17065 616192 960109 492491 455291 263167 687820 625637 255511 59241 602090 506673
17055 506673 615410 777750 612584 494381 778821 260744 912281 536461 576917 740910
17045 740910 800608 612094 805788 397299 694590 579806 723588 934934 384919 550408
17035 550408 340016 346419 985352 725532 735404 821793 674027 960966 819850 493894
17025 493894 786465 508407 780811 691821 576751 1003256 563806 884475 1011698 922601
17015 922601 786421 663057 758136 1051547 707039 1100597 765814 829820 838383 907675
$$ packed form
17085C44761L47583k36129J69620j65701n8412Q8578J92698k74128K58877J07162
17075G74909L2029r3012k64332O2193P7770k17530K65332k21522j6356K16711
17065F16192L43917m67618l7200j92124M24653o2183B55511E9241N42849r5417
17055E06673J08737J62340j65166j18203K84440B60744O51537l75820M0456J63993
17045G40910N9698j88514J93694C97299K97291j14784J43782K11346C84919J65489
17035E50408k10392O403O38933k59820R872Q6389j47766K86939j41116l25956
17025D93894K92571k78058K72404q8990j15070M26505m39450L20669J27223q9097
17015I22601j36180j23364R5079K93411l44508L93558l34783O4006Q563O9292
$$ plain form
17005 907675 742925 652240 1142113 759887 829910 533323 922619 815620 513489 937822
16995 937822 690719 635531 931571 1187550 801237 756594 968402 764468 992205 1066088
16985 1066088 1198373 817385 851312 872123 746185 813023 850219 890605 841520 1006612
16975 1006612 690169 912491 1001052 999380 1425448 901351 909995 1072823 904946 1067155
16965 1067155 1106369 1120599 1195076 1146047 1303392 1210637 1108668 1231268 1310444 1140674
16955 1140674 1218264 1310428 847557 1496560 1271739 1301986 1221343 1362480 1251095 1265110
16945 1265110 1333688 1434732 1199373 1103683 1416374 1479535 1372660 1319322 1661701 1466331
16935 1466331 1378475 1467631 1485632 1232216 1587937 1359180 1364145 1446863 1239076 1387348
$$ packed form
17005I07675j64750r0685M89873l82226P0023k96587L89296j06999l02131M24333
16995I37822k47103n5188K96040K55979l86313m4643K11808k03934K27737P3883
16985A066088J32285l80988L3927K0811j25938O6838L7196M0386m9085J65092
16975A006612l16443K22322Q8561j672M26068n24097Q644J62828j67877J62209
16965A067155L9214J4230P4477m9029J57345r2755j01969J22600P9176j69770
16955A140674P7590R2164m62871O49003k24821L0247q0643J41137j11385J4015
16945A265110O8578J01044k35359r5690L12691O3161j06875n3338L42379j95370
16935A466331q7856Q9156J8001k53416L55721k28757M965Q2718k07787J48272
$$ plain form
16925 1387348 1520968 1507287 1439871 1680313 1553734 1572406 1645510 1760128 1766406 1648352
16915 1648352 1969825 1659161 1732765 1703212 1746808 1765351 1725480 2062229 2000571 1966177 2027474
16904 2027474 1978669 1983048 1674264 1836113 2081192 1990566 2102127 2047036 2381912 2148120
16894 2148120 1749758 2131903 2299769 2032347 2349590 2476936 2261221 2274758 2314102 2274948
16884 2274948 2085238 2731812 2342017 2161068 2664416 2433597 2497213 2610192 2637128 2489512
16874 2489512 2540627 2768459 2824215 2865211 3001112 2975595 2894675 2972912 2999596 3470514 2846597
16863 2846597 3059294 3259310 3417644 2928077 2954742 3280844 3171753 3375466 3434839 3489217
16853 3489217 3586992 3571886 3469516 3469295 3704335 3786449 3678452 3607859 3671492 4005969 4033709
$$ packed form
16925A387348J33620j3681o7416K40442j26579J8672P3104J14618O278j18054
16915A648352L21473l10664P3604k9553M3596J8543l9871L36749o1658l4394O1297
16904B027474m8805M379l08784J61849K45079r0626J11561n5091L34876k33792
16894B148120l98362L82145J67866k67422L17243J27346k15715J3537L9344l9154
16884B274948j89710O46574l89795j80949N03348k30819O3616J12979K6936j47616
16874B489512N1115K27832N5756M0996J35901k5517q0920P8237K6684M70918o23917
16863B846597K12697K00016J58334m89567K6665L26102j09091K03713N9373N4378
16853C489217R7775j5106j02370k21K35040Q2114j07997p0593O3633L34477K7740
$$ plain form
16842 4033709 4310021 4165415 4243728 4373474 4311308 4313575 4562469 4223371 4775775 4813970
16832 4813970 4846447 4768010 4810646 5004924 5420070 5410588 5246793 5192506 5509451 5299584
16822 5299584 5726766 5586917 5831590 6071832 5964961 6091970 6034128 6413248 6501303 6779792
16812 6779792 6730532 6813257 7071518 7062809 7383977 7549174 7416864 7832271 8207593 8209507
16802 8209507 8200160 8061830 8705038 8848026 8836693 9442212 9200761 9729741 9741006 10195529
16792 10195529 10296841 10756345 10916942 11027938 11308212 11802766 11767043 12305570 12840520
16783 12840520 13082952 13009651 13522989 13822458 14144452 14702246 15296169 15754295 16163841
16774 16163841 16547712 16782974 17360002 18164123 18352461 19171327 19753479 20403730 20915537
$$ packed form
16842D033709K76312j44606P8313J29746o2166K267K48894l39098N52404L8195
16832D813970L2477p8437M2636J94278M15146r482j63795n4287L16945k09867
16822E299584M27182j39849K44673K40242j06871J27009n7842L79120Q8055K78489
16812F779792m9260Q2725K58261q709L21168J65197j32310M15407L75322J914
16802H209507r347j38330O43208J42988j1333O05519k41451N28980J1265M54523
16792A0195529J01312M59504J60597J10996K80274M94554l5723N38527N34950
16783A2840520K42432p3301N13338K99469L21994N57794N93923M58126M09546
16774A6163841L83871K35262N77028Q04121J88338Q18866N82152O50251N11807
$$ plain form
16765 20915537 21418202 22213867 23089150 23959466 24494052 25278441 26592918 27549755 28451906
16756 28451906 29127936 30657511 31651370 33133516 34344616 35680556 37228804 38486265
16748 38486265 40428466 41744884 43564073 45109644 47154744 49716296 51796760 53925357
16740 53925357 56338229 58962098 61617414 64605638 67417585 70680910 73681465 77199954
16732 77199954 80748170 84591035 88480877 92063632 96058073 100137706 104309269 108531749
16724 108531749 112648320 116500215 120170698 123872460 127462907 129750822 133053359 135106635
16716 135106635 136713821 137702826 138562721 138469519 138071747 136731366 135227696 132806404 130452379
16707 130452379 127355905 123936328 120415543 116655996 112444113 108568399 103690360 99638827
$$ packed form
16765B0915537N02665P95665Q75283Q70316N34586P84389J314477R56837R02151
16756B8451906O76030J529575R93859J482146J211100J335940J548248J257461
16748C8486265J942201J316418J819189J545571K045100K561552K080464K128597
16740E3925357K412872K623869K655316K988224K811947L263325L000555L518489
16732G7199954L548216L842865L889842L582755L994441M079633M171563M222480
16724A08531749M116571L851895L670483L701762L590447K287915L302537K053276
16716A35106635J607186R89005Q59895r3202l97772j340381j503670k421292k354025
16707A30452379l096474l419577l520785l759547m211883l875714m878039m051533
$$ plain form
16699 99638827 95390729 91410980 87441552 83344270 79544074 75697581 72457584 69048734
16691 69048734 65839730 62495575 59943789 57199671 54434349 51779647 49645626 47044521
16683 47044521 45359589 43112815 41444998 39403309 37718310 36347446 34800726 33322349
16675 33322349 31724182 30886100 29625048 28382488 27223232 26093704 25108108 24153833
16667 24153833 23459593 22757741 21697841 20936320 19948752 19915714 19104552 18065797 17531533
16658 17531533 17282865 16462125 16078025 15443218 15043376 14937573 14241492 14056421 13661118
16649 13661118 13075246 12750391 12418204 11868788 11786789 11030320 11232886 10551738 10549366 9820131
16639 9820131 10115660 9635471 9472144 9315732 8778540 9014203 8300493 8330063 7884925 7975682
$$ packed form
16699I9638827m248098l979749l969428m097282l800196l846493l239997l408850
16691F9048734l209004l344155k551786k744118k765322k654702k134021k601105
16683D7044521j684932k246774j667817k041689j684999j370864j546720j478377
16675C3322349j598167q38082j261052j242560j159256j129528r85596r54275
16667B4153833o94240p01852j059900p61521r87568l3038q11162j038755n34264
16658A7531533k48668q20740l84100o34807l99842j05803o96081j85071l95303
16649A3661118n85872l24855l32187n49416q1999p56469K02566o81148k372p29235
16639I820131K95529m80189j63327j56412n37192K35663p13710K9570m45138R0757
$$ plain form
16629 7975682 7559439 7620775 7407299 7422562 6876604 7120978 7018034 6932667 6386189 6524412
16619 6524412 6002534 5961416 5980729 5764417 5604644 5584106 5565066 5616614 5403511 5340352
16609 5340352 4961187 4802717 4806959 4914726 4901090 4499655 4408046 4124492 4462879 4265529
16599 4265529 4102312 4372246 4116342 3931263 3731177 3839524 3853129 3491250 3487781 3552731
16589 3552731 3453024 3260070 3508313 3376759 3207430 2944270 2981570 2829644 2862338 3364958
16579 3364958 2996385 2850251 2781048 3005340 3082400 2473800 2889030 2258732 2654356 2513320
16569 2513320 2479508 2717659 2381530 2432259 2587976 2447481 2207366 2058329 2291367 2316389
16559 2316389 2363332 2081327 2115397 2442777 2455867 2206766 2259895 1953887 1902927 2085255
$$ packed form
16629G975682m16243O1336k13476J5263n45958K44374j02944q5367n46478J38223
16619F524412n21878m1118J9313k16312j59773k0538j9040N1548k13103o3159
16609E340352l79165j58470M242J07767j3636m01435r1609k83554L38387j97350
16599D265529j63217K69934k55904j85079k00086J08347J3605l61879l469O4950
16589C552731r9707j92954K48243j31554j69329k63160L7300j51926L2694N02620
16579C364958l68573j46134o9203K24292P7060o08600M15230o30298L95624j41036
16569B513320l3812K38151l36129N0729J55717j40495k40115j49037K33038K5022
16559B316389M6943k82005L4070L27380J3090k49101N3129l06008n0960J82328
$$ plain form
16549 2085255 1825947 1966058 1866181 1768396 1516230 1857503 1812328 1816115 1674465 1799390
16539 1799390 1679540 1594812 1597042 1924597 1750660 1660340 1548456 1270621 1779086 1667526
16529 1667526 1583385 1382552 1518310 1471339 1357292 1365801 1462536 1247464 1367237 1485874
16519 1485874 1144282 1251811 1179416 998188 1025293 1348317 1222042 1138026 1023748 1200110
16509 1200110 1018014 1351826 1131253 910267 1321932 1220886 1216025 1100161 1202460 1104446
16499 1104446 955320 915055 1010296 1382887 960901 912300 985498 1078013 1025819 808171
16489 808171 666177 880690 1406995 1228439 677815 497059 1121845 1005312 1230964 1005719
16479 1005719 735922 1095733 1101615 725081 655249 678967 1057785 789700 844625 1058997
$$ packed form
16549B085255k59308J40111r9877r7785k52166L41273m5175L787j41650J24925
16539A799390j19850q4728K230L27555j73937r0320j11884k77835N08465j11560
16529A667526q4141k00833J35758m6971j14047Q509R6735k15072J19773J18637
16519A485874l41592J07529p2395j81228K7105L23024j26275q4016j14278J76362
16509A200110j82096L33812k20573k20986M11665j01046m861j15864J02299r8014
16499A104446j49126m0265R5241L72591m21986m8601P3198R2515n2194k17648
16489H08171j41994K14513N26305j78556n50624j80756O24786j16533K25652k25245
16479A005719k69797L59811N882l76534o9832K3718L78818k68085N4925K14372
$$ plain form
16469 1058997 858810 713029 866801 590850 640721 925006 934923 698882 821462 669092
16459 669092 717059 948693 500730 621023 575821 818238 482837 799541 424468 743877
16449 743877 876023 512126 805439 549873 637917 489529 679844 659080 283369 492520
16439 492520 432273 438011 391420 725500 288147 427900 369042 451824 980264 379198 562203
16428 562203 353151 565700 734054 489845 816683 615193 548781 481745 414830 609843
16418 609843 234210 289051 267296 430950 533893 513528 306730 558541 449838 484401
16408 484401 229448 499174 578484 451505 254469 479895 343772 154488 619937 234686
16397 282341 641984 495272 421614 526913 272569 362206 183563 223906 510087 345930
$$ packed form
16469A058997k00187j45781J53772k75951M9871K84285R917k36041J22580j52370
16459F69092M7967K31634m47963J20293m5202K42417l35401L16704l75073L19409
16449G43877J32146l63897K93313k55566Q8044j48388J90315k0764B83369K09151
16439D92520o0247N738m6591L34080B88147J39753n8858Q2782N28440C79198J83005
16428E62203k09052K12549J68354k44209L26838k01490o6412o7036o6915J95013
16418F09843B34210N4841k1755J63654J02943k0365k06798K51811j08703L4563
16408D84401B29448K69726P9310j26979j97036K25426j36123A54488M65449B34686
16397B82341L59643j46712p3658J05299k54344Q9637j78643M0343K86181j64157
$$ plain form
16387 345930 497090 265815 474308 344593 442649 548533 474894 415640 527690 700347
16377 700347 235114 554998 276947 696321 243477 312362 144962 139100 461526 245422
16367 245422 -116082 166402 597238 247572 342234 218958 532894 404706 349022 215100
16357 215100 287849 172620 417594 421810 662633 375837 255106 327091 128915 139718
16347 139718 194700 188516 232618 51035 339793 186322 314828 317973 433536 333187 121612
16335 251245 509808 370140 206366 211577 155841 226997 46217 345527 183121 41658 325771
16324 325771 -180667 93638 439584 83202 346945 378513 152697 218652 185668 313579
16314 313579 -53269 329673 296879 316698 9466 493346 34844 359051 68946 -103326 -866
$$ packed form
16387C45930J51160k31275K08493j29715R8056J05884p3639n9254J12050J72657
16377G00347B35114L19884B76947M19374B43477O8885A44962n862L22426k16104
16367B45422a16082A66402M30836B47572R4662j23276L13936j28188n5684j33922
16357B15100P2749j15229K44974M216K40823k86796j20731P1985A28915J0803
16347A39718N4982o184M4102E1035K88758j53471J28506L145J15563j00349A21612
16335B51245K58563j39668j63774N211n5736P1156D6217K99310j62406D1658K84113
16324C25771a80667I3638L45946H3202K63743L1568A52697O5955l2984J27911
16314C13579e3269C29673l2794J9819I466M83880C4844L24207F8946a03326h66
$$ plain form
16302 2329 25872 242004 296611 191660 170711 254868 -105482 537540 413864 113460 148696
16291 148696 191361 198526 150068 51326 391680 173975 275227 280488 79465 178281 135184
16280 135184 153175 89789 -54554 431053 163449 -29865 398107 171656 -12809 206541
16269 240131 57578 -110679 334006 249600 192194 330217 371630 330575 137338 -57915 106318
16257 104934 117291 307298 -22983 -14166 227978 125919 125672 181258 326318 310445 79304
16245 233087 61131 25459 264653 64391 -31330 244651 45231 -29715 115807 113874 403660
16234 403660 109511 -20785 352397 -56573 129631 -181751 237631 -18289 202880 86162
16223 62728 -31835 -65339 153843 210654 -152210 95312 286558 160356 162498 175820 4395
$$ packed form
16302B329K3543K16132N4607j04951k0949Q4157a05482E37540j23676A13460L5236
16291A48696M2665P165m8458E1326L40354A73975J01252N261G9465R8816m3097
16280A35184J7991o3386e4554D31053A63449b9865C98107A71656a2809B06541
16269B40131E7578a10679C34006q4406n7406J38023M1413m1055A37338e7915A06318
16257A04934J2357J90007b2983Q817B27978j02059k47N5586J45060j5873G9304
16245B33087F1131B5459K39194F4391c1330B44651D5231b9715A15807j933K89786
16234D03660A09511b0785C52397e6573A29631a81751B37631a8289B02880H6162
16223F2728c1835l3504A53843N6811a52210I5312J91246j26202K142J3322D395
$$ plain form
16211 -10479 29731 112027 -66463 57044 -56375 -31989 -112215 458589 33547 -88083 -51362
16200 -51362 -73583 -40780 42661 -77266 67384 97717 -158061 174305 92414 141188 64688
16188 136672 -96483 -3663 326267 316429 -55101 -4905 242360 85712 400582 201507 2598
16176 57484 -149126 250942 244834 103175 74153 -84599 89891 332169 344688 235359 -90751
16164 172188 18249 -204751 360551 -57172 -311132 -187251 227445 235479 98439 110308 211173
16153 211173 270028 -138639 118896 179152 -103129 -185473 46046 -113077 301385 63870
16142 197093 -172173 75609 -3364 146266 207067 51204 -278474 283076 -51505 258416 -143670
16130 56870 -157328 175474 38596 30919 -104920 194213 81673 61180 -252450 190356 -120267
$$ packed form
16211a0479B9731Q2296f6463E7044e6375K4386q0226D58589C3547h8083L6721
16200e1362k2221L2803D2661g7266F7384L0333a58061A74305q1891M8774F4688
16188A36672i6483c663C26267r838e5101d905B42360H5712L14870j99075B598
16176E7484a49126B50942o108A03175k9022h4599H9891K42278J2519j09329i0751
16164A72188A8249b04751C60551e7172k53960J23881B27445Q034I8439J1869J00865
16153B11173N8855a38639A18896O0256a03129q2344D6046a13077C01385F3870
16142A97093a72173G5609c364A46266O0801E1204b78474B83076e1505B58416a43670
16130E6870a57328A75474C8596p677a04920A94213H1673k0493b52450A90356a20267
$$ plain form
16118 -231998 269973 -128301 4537 1049 432175 -79134 -77973 -152291 55740 168135 302423
16107 302423 -127114 -120038 -98545 107215 46495 203079 374814 207564 19930 -105907
16096 88509 -218887 43518 98366 -208205 -61816 133210 -105365 121716 262480 -158347
16085 81696 -107882 -22900 -152090 -1813 280913 -23935 86759 -275603 82425 -94369 74848
16073 -223411 269782 -219272 -290239 120251 9645 -119794 45776 -10380 -91446 -100286 -79825
16062 -79825 210971 -601876 -194621 152940 108517 289074 -43092 124371 -39397 85408
16051 233440 228383 238665 78383 222777 -77015 -105239 -122273 -112495 395244 -29359 -140208
16040 -140208 21188 79897 23889 30611 67300 -107720 -204992 -142388 -198080 86082 178102
$$ packed form
16118b31998B69973a28301D537A049M31126g9134J161p4318E5740J12395J34288
16107C02423a27114P076K1493A07215D6495J56584J71735j67250A9930a05907
16096H8509b18887D3518N4848b08205f1816A33210a05365A21716J40764a58347
16085H1696a07882b2900j29190a813B80913b3935H6759b75603H2425i4369G4848
16073b23411B69782b19272p0967A20251I645a19794D5776a0380q1066q840K0461
16062g9825B10971f01876a94621A52940m4423J80557d3092A24371c9397H5408
16051B33440n057J0282G8383J44394g7015k8224j7034R778C95244b9359j10849
16040a40208B1188N8709B3889O722L6689a07720r7272O2604n5692H6082R2020
$$ plain form
16029 178102 -14401 37498 -210230 83662 -139795 -141806 153969 -206675 -209389 -61151 70558
16017 36250 226477 -102748 53521 14617 133438 217280 -97415 -53106 227057 -98827 -54789
16006 -54789 33235 -25125 198744 28991 171854 43632 -72804 -306826 31389 -127879 -161305
15995 -161305 -193520 -407849 -101038 -119859 70854 184764 111043 114200 181650 339707 237592
15984 237592 549007 542408 306804 254613 235709 113300 -50275 138921 -88045 -387954 -247727
15973 -247727 -282186 31623 80583 131272 -20790 342233 26931 252370 90882 121255 291238
15962 291238 -156748 -67348 218127 -158540 104360 127201 -170341 -401829 226346 347062
15952 347062 -123045 89231 170757 -393527 -323847 50518 -190001 131338 -86238 -461483
$$ packed form
16029A78102a4401C7498b10230H3662a39795k011A53969b06675k714f1151G0558
16017C6250J90227a02748E3521A4617J18821Q3842i7415M4309B27057i8827M4038
16006e4789C3235b5125A98744B8991J42863D3632g2804k34022C1389a27879l3426
15995a61305l2215k14329a01038j8821G0854J13910p3721L157O7450J58057j02115
15984B37592L11415o599k35604n2191j8904A13300e0275A38921h8045k99909J40227
15973b47727l4459C1623M8960N0689b0790C42233B6931K25439I0882L0373J69983
15962B91238a56748f7348B18127a58540A04360K2841a70341k31488B26346J20716
15952C47062a23045H9231Q1526c93527O9680E0518a90001A31338h6238l75245
$$ plain form
15942 -461483 -14938 -61349 -21265 93103 -130041 31592 -202215 -25149 53604 16408 106464
15931 106464 -42630 84245 -277332 -334405 -129819 -93950 140387 -15391 -93906 387595 192185
15919 -212381 -109580 -195780 236372 -124357 -103606 228164 -222233 -390423 -52700 1985
15908 104813 -226675 -85518 -475504 -102566 -51367 -128495 -246907 22489 177358 242197
15898 242197 -35513 -151425 -3829 -160673 -181294 246295 141216 88605 -67515 122214 -290650
15886 -296922 -323438 -387892 38051 106806 -317398 -299586 -72384 -286939 -98102 86929 -143332
15874 100072 -235633 120045 -59038 -165459 142995 138261 -237498 -13429 -132718 245605
15863 227252 -65964 -114832 -61749 229604 119747 190026 -24362 -229805 119592 259610
$$ packed form
15942d61483a4938m6411b1265I3103a30041C1592b02215b5149E3604A6408R0056
15931A06464d2630H4245b77332n7073a29819L5869A40387a5391p8515C87595A92185
15919b12381J02801q6200B36372a24357K0751B28164b22233j68190e2700A985
15908A04813b26675h5518l89986a02566N1199p7128j18412B2489J54869O4839
15898B42197c5513j15912c829j56844k0621B46295j05079n2611f7515A22214b90650
15886b96922k6516o4454C8051O8755c17398J7812g2384k14555i8102H6929a43332
15874A00072b35633A20045e9038j06421A42995m734b37498a3429j19289B45605
15863B27252f5964m8868N3083B29604j09857P0279b4362k05443A19592J40018
$$ plain form
15853 259610 224468 72343 345620 -157417 -273616 -23412 -7524 -81566 57834 -289838 -174999
15842 -174999 -194076 -295803 95309 143889 111640 223943 -153136 -87893 -30770 -189104 -248108
15831 -248108 -83718 6548 264718 -293420 -129324 93387 -69767 111360 57836 -273178 -133137
15819 -181385 -139002 282516 -19600 76808 126189 -92944 43860 165957 100252 292300 -334222
15807 -150851 -24142 66515 -66049 -177261 182752 164007 -85523 6823 66240 -201411 -250767
15796 -250767 -197300 -171958 85433 -19199 -2597 21561 139696 368175 161318 142627 141556
15785 141556 -166494 196260 -207079 -16939 -313707 -182599 -41985 86943 74879 -81642
15774 -37786 -174531 313499 -15012 301157 139363 -91866 -175334 -347744 -58423 -278195
$$ packed form
15853B59610l5142G2343K73277a57417j16199b3412g524p4042E7834b89838J14839
15842a74999j9077j01727I5309M8580l2249J12303a53136O5243c0770j58334n9004
15831b48108h3718F548K58170b93420a29324I3387f9767A11360n3524b73178a33137
15819a81385M2383B82516a9600G6808M9381i2944D3860J22097o5705J92048c34222
15807a50851b4142F6515f6049j11212A82752j8745h5523F823N9417b01411m9356
15796b50767N3467K5342H5433a9199b597B1561J18135K28479A61318j8691j071
15785A41556a66494A96260b07079a6939k96768J31108d1985H6943j2064h1642
15774c7786j36745C13499a5012C01157A39363i1866q3468j72410e8423k19772
$$ plain form
15764 -278195 123835 -47180 -50752 -142893 -47984 -177537 -321594 -135315 -31375 170383 -101489
15752 -269867 -73959 68932 -45482 106057 75527 53439 -99542 156796 230021 319276 73757
15740 -79689 119122 306595 73162 3387 -177764 323033 106279 36545 27647 -174934 234931
15728 13117 19224 -20138 -99315 -242446 -319968 -260643 -97978 88066 26943 84178 -236368
15716 22449 280333 334402 14865 173254 -360245 -21278 -222532 81650 290900 -159291
15705 -250891 -9483 40865 72730 -38238 -100301 89285 53580 -274680 30699 367899 370704
15694 370704 1311 -7161 570830 -169933 110700 -127881 -59417 -341595 -177663 -85027 -280015
15683 -280015 111763 -43498 -264026 29112 -144110 12411 -174843 -288837 -135202 333832
$$ packed form
15764b78195A23835d7180l572r2141d7984j29553j44057a35315c1375A70383a01489
15752b69867g3959F8932d5482A06057l0530k2088i9542A56796P3225Q9255G3757
15740g9689A19122J87473G3162C387a77764C23033A06279C6545q898a74934B34931
15728A3117O107b0138p9177j43131p7522N9325i7978H8066B6943N7235b36368
15716B2449K57884N4069A4865J58389c60245b1278k01254H1650K09250a59291
15705b50891i483D0865L1865c8238o2063H9285l5705b74680C0699L37200K805
15694C70704A311g161E70830a69933A10700a27881e9417k82178J63932h5027j94988
15683b80015A11763d3498k20528B9112a44110A2411a74843j13994a35202C33832
$$ plain form
15672 91293 -50984 4835 205731 160802 175642 -212938 -23055 -110087 126825 -321466 -56496
15660 -73266 114302 -246106 77856 120234 -9752 -133396 -115688 -128320 51469 22764 -6324
15648 -68079 24635 162155 70204 -158578 -119361 23327 115265 217943 40623 -123414 -91939
15637 -91939 52692 165968 -200904 207122 186307 219516 78262 -102687 63199 81763 -216037
15625 102108 499238 -147958 146774 -119247 2098 -288497 -67080 15396 242620 -57198
15614 -163261 -107666 51749 32346 -34202 198314 -50521 -176213 -200050 -124985 -179233 -225201
15603 -225201 261677 74526 64055 -254536 189081 -57808 182458 -142670 -13510 -42306
15593 -42306 -73454 81791 -155026 -100338 -7614 -143384 -52200 -145795 -71379 -16640 -26938
$$ packed form
15672I1293e0984D835K00896m4929J4840b12938b3055q7032A26825c21466e6496
15660g3266A14302b46106G7856M2378i752j23644J7708j2632E1469B2764f324
15648f8079B4635J37520G0204a58578L9217B3327R1938J02678D0623a23414L1475
15637i1939E2692J13276b00904B07122k0815L3209G8262a02687F3199J8564b16037
15625A02108L97130a47958A46774a19247B098b88497f7080A5396K27224e7198
15614a63261N5595E1749j9403c4202A98314e0521j25692k3837P5065n4248m5968
15603b25201B61677G4526j0471b54536A89081e7808A82458a42670a3510k8796
15593d2306l1148H1791a55026N4688g614j35770e2200r3595g1379a6640j0298
$$ plain form
15582 -26938 317860 -186110 -170916 14712 -6897 -38019 -25394 -107015 38060 19027 -42263
15570 -95489 -162398 41899 189578 -440663 278295 45647 -13796 6721 -203195 59130 -297742
15558 -170357 -131161 -76106 -112862 -124099 -146501 -416154 -202331 91872 -45097 -262764 7747
15546 -180633 143152 -154504 -162144 118611 -21256 -177194 161081 -56710 219436 -115886
15535 1111 -61290 268448 49255 227060 -123689 160879 38977 -4814 -86906 -100882 -226239
15524 -226239 423724 -229117 -5418 -281532 -12338 -178425 -152856 41470 243992 3623 120650
15513 120650 139666 -72956 -303953 -55506 12487 32390 62140 64949 86058 -98063 -297331
15502 -297331 -24523 44427 -27024 -225797 119965 -3044 -150164 46771 -45210 -96266 152217
$$ packed form
15582b6938C17860a86110J5194A4712f897l1122J2625q1621C8060A9027d2263
15570i5489o6909D1899J47679d40663B78295D5647a3796F721b03195E9130b97742
15558a70357L9196N5055l6756j1237k2402k69653b02331I1872d5097k17667G747
15546a80633A43152a54504p640A18611b1256j55938A61081e6710B19436a15886
15535A111f1290B68448D9255J77805a23689A60879C8977d814q2092j3976j25357
15524b26239D23724b29117e418k76114a2338j66087K5569D1470K02522C623J17027
15513A20650J9016g2956k30997e5506A2487J9903K9750K809K1109i8063j99268
15502b97331b4523D4427b7024j98773A19965c044j47120D6771d5210n1056A52217
$$ plain form
15490 -54093 -142116 11654 106969 -238193 145290 -393566 311797 206899 208481 -199393 -110971
15479 -110971 194394 -57947 -2405 29829 -116365 139380 -176308 323855 -7880 34076 -187679
15467 67631 177605 -278648 -96288 76462 216714 -6825 64034 -4352 256103 52520 -190455
15455 -25419 63099 -150239 -71422 214676 -84386 149137 -470787 328653 -121211 263354
15444 -67662 -104359 -4141 39369 -179950 312285 138677 -432697 -66563 88500 317 -235726
15432 303702 7581 40682 -170642 276427 212562 66358 79981 82643 73617 -56811 109686
15420 -303095 -95561 77655 85697 -170414 136576 -58196 263804 -241998 252457 -136866
15409 -31490 75348 -314896 -335239 20768 124723 -22076 144493 48546 -18142 -104999 146499
$$ packed form
15490e4093q8023A1654R5315b38193A45290c93566C11797j04898J582a99393Q8422
15479a10971A94394e7947b405B9829a16365A39380a76308C23855g880C4076a87679
15467F7631J09974b78648i6288G6462J40252f825F4034d352B56103E2520a90455
15455b5419F3099a50239g1422B14676h4386A49137d70787C28653a21211B63354
15444f7662l6697d141C9369a79950C12285A38677d32697f6563H8500C17b35726
15432C03702G581L3101a70642B76427o3865F6358J3623K662r026e6811A09686
15420c03095i5561G7655Q042a70414A36576e8196B63804b41998B52457a36866
15409c1490G5348c14896k0343B0768J03955b2076A44493D8546a8142q6857A46499
$$ plain form
15397 -179825 -244466 -366038 -60456 124787 -222069 484923 -160612 -365198 265835 -17204
15386 -35454 -74424 280453 -139529 -15712 68932 -141803 -253222 215117 -184132 -8225 -54315
15375 -54315 -175733 -136877 75703 -180579 102476 -90771 -166094 -73214 -43198 67034 154684
15364 154684 191985 51811 -130051 170610 -263307 42840 -134121 -65806 19754 -129092
15353 124392 -28328 9108 75021 265935 214033 -167916 -126970 102897 32147 10851 296165
15342 296165 -156320 1512 140258 56888 22087 176390 443066 163401 44789 -170149
15331 170952 76867 74533 -182903 -85377 200920 116660 -9063 274530 38374 -42140 -213236
15320 -213236 74530 -295627 170260 -385722 19521 287008 53079 254841 73939 -77471
$$ packed form
15397a79825o4641j21572f0456A24787b22069D84923a60612k04586B65835a7204
15386c5454l8970B80453a39529a5712F8932a41803j11419B15117a84132h225m6090
15375e4315j21418L8856G5703a80579A02476i0771p5323g3214L0016F7034Q7650
15364A54684L7301E1811a30051A70610b63307D2840a34121f5806A9754a29092
15353A24392b8328I108O5913J90914n1902a67916M0946A02897C2147A0851K85314
15342B96165a56320A512J38746E6888B2087J54303K66676A63401D4789a70149
15331A70952G6867k334a82903h5377B00920q4260i063B74530C8374d2140j71096
15320b13236G4530b95627A70260c85722A9521K67487E3079K01762G3939g7471
$$ plain form
15309 180270 369783 -209282 96957 339543 895 79422 -102670 334014 -45235 -74771 132552
15297 74121 4649 -151651 72743 -199951 214877 30948 54270 -254098 185648 -92038 -11953
15285 -87091 242309 336095 263617 365424 -161101 118040 227176 249180 147804 -266864
15274 171095 -85962 281402 44947 -163816 41430 85837 -152448 108054 -135947 56710
15263 181013 107855 96548 15969 -70471 11261 563033 57168 -13277 428742 -161802 265079
15251 332342 317993 330720 957798 931427 1112054 1174182 565594 -25028 -33973 -247700 34689
15239 110489 -83602 222663 253586 242032 118274 174707 7819 26058 -365594 151836 -21600
15227 -26217 291113 319915 218096 -77889 -5723 407198 -6560 2874 -151433 84076 24400
$$ packed form
15309A80270J89513b09282I6957K42586H95P8527a02670C34014d5235k9536A32552
15297G4121D649a51651G2743a99951B14877C0948K3322b54098A85648i2038a1953
15285h7091B42309R3786p2478J01807a61101A18040J09136K2004j01376b66864
15274A71095h5962B81402D4947a63816D1430M4407a52448A08054a35947E6710
15263A81013p3158j1307A5969g0471A1261N51772E7168a3277D28742a61802B65079
15251C32342j4349J2727O27078k6371J80627O2128E65594b5028q945k13727C4689
15239A10489h3602B22663L0923j1554A18274N6433G819J8239c65594A51836b1600
15227b6217B91113K8802j01819g7889e723D07198f560B874a51433H4076B4400
$$ plain form
15215 72950 43457 8630 209129 -18213 168073 -164754 -21771 177458 114380 -68626 -124332
15204 -124332 108730 -197446 -169971 -124277 183756 -107159 215776 -259141 205331 14658
15193 -68469 51178 211467 -65289 -32257 23782 133541 -283374 -295259 160956 -150077 -21368
15181 -116862 186126 -3040 -102879 -92637 21856 6847 -158319 -78468 -172899 129400 121210
15170 121210 -224472 -33243 279450 3001 -218385 -178383 281765 -90367 -65283 -77614 -57988
15159 -57988 -69585 74891 35926 16885 183340 -13439 207644 -56798 -294918 210710 125720
15148 125720 116769 -147313 221381 231330 350579 81521 362476 90687 -49558 -106017 442252
15136 112276 151722 252891 132953 111107 -31842 -55942 -331461 167768 225313 -28071 263316
$$ packed form
15215G2950k9493H630K00499a8213A68073a64754b1771A77458o3078f8626n5706
15204a24332A08730a97446K7475M5694A83756a07159B15776b59141B05331A4658
15193f8469E1178J60289f5289c2257B3782J09759b83374j1885A60956a50077b1368
15181a16862A86126c040r9839J0242B1856F847a58319g8468r4431A29400q190
15170A21210b24472c3243B79450C001b18385M0002B81765i0367K5084j2331J9626
15159e7988j1597G4891C5926A6885J66455a3439B07644e6798k38120B10710q4990
15148A25720q951a47313B21381R949J19249H1521K80955I0687d9558n6459D42252
15136A12276L9446J01169j19938k1846c1842k4100k75519A67768N7545b8071B63316
$$ plain form
15124 174670 253870 -172529 -152634 -110362 118750 -109280 375861 94608 172154 133445 108379
15113 108379 91014 93913 71141 61141 144865 229306 24275 -188669 230654 -46377 -228726
15102 -228726 -82476 -101673 -62169 100635 112330 -38973 155960 330794 39454 41737 254442
15091 254442 324039 294847 328422 380835 -51949 409542 154072 263123 160384 102762 -463399
15079 139851 67865 366848 -14047 396739 302811 1312 258055 158717 104346 227684 320049
15068 320049 -68992 501181 366995 35419 136782 213347 77412 -23562 241107 262765 673160
15057 673160 145427 -127323 41931 53765 300302 421343 -78003 387602 180390 232745
15047 232745 -174101 438429 346142 -31408 324718 71847 221672 66949 -8106 -147008 317012
$$ packed form
15124A74670P9200a72529J9895M2272A18750a09280C75861I4608P7546l8709k5066
15113A08379j7365K899k2772j0000Q3724Q4441B4275a88669B30654d6377j82349
15102b28726h2476j9197L9504A00635J1695c8973A55960J74834C9454K283K12705
15091B54442O9597k9192L3575N2413e1949D09542A54072J09051j02739n7622d63399
15079A39851F7865K98983a4047C96739r3928A312K56743r9338n4371J23338R2365
15068C20049f8992E01181j34186C5419J01363P6565G7412b3562B41107K1658M10395
15057F73160A45427a27323D1931J1834K46537J21041g8003C87602A80390N2355
15047B32745a74101D38429r2287c1408C24718G1847J49825F6949h106j38902C17012
$$ plain form
15035 -51553 236247 449940 190155 161238 8186 79246 237726 192468 182160 231279 278450
15024 278450 457150 536455 466863 293878 294375 476338 255656 -97714 248341 426557 158051
15012 121815 55632 113556 408163 354101 92469 -175537 141737 267911 129416 -36036
15001 197198 216676 55568 378454 329342 -14413 -189452 170863 508561 108595 392800
14991 392800 355696 120845 -101302 254591 -166858 330136 251704 379559 142204 304278
14981 304278 278549 128278 369588 128521 -114366 156512 331999 115454 274997 214135
14971 214135 27223 183698 154501 377079 315566 382952 58096 271484 233882 295866 318302
14960 318302 238384 450098 468673 469924 175311 -102411 300059 313925 220754 521204 46426
$$ packed form
15035e1553B36247K13693A90155k8917H186P1060J58480m5258j0308M9119M7171
15024B78450J78700P9305o9592j72985M97J81963k20682i7714B48341J78216A58051
15012A21815E5632N7924K94607n4062I2469a75537A41737J26174A29416c6036
15001A97198J9478E5568L22886m9112a4413j75039A70863L37698A08595K84205
14991C92800l7104A20845a01302B54591a66858C30136p8432J27855A42204J62074
14981C04278k5729A28278K41310A28521a14366A56512J75487A15454J59543o0862
14971B14135B7223J56475k9197K22578o1513O7386E8096K13388l7602O1984K2436
14960C18302p9918K11714J8575J251A75311a02411C00059J3866r3171L00450D6426
$$ plain form
14948 -31261 -274283 58351 189679 125718 261063 161448 230237 96934 111960 778536 35178
14936 109840 258606 77578 450964 -209886 460352 579926 236211 240564 116878 -299991
14925 288219 493924 374279 51087 -248728 323862 325207 443438 3162 9789 237783 284801
14914 284801 415000 -95059 52812 33336 349436 304782 448555 534522 125910 286111
14904 286111 481044 200566 516870 186329 254848 163646 146558 173386 443173 343157
14894 343157 332786 203712 362177 375725 279015 169262 65359 245565 334523 234841 94548
14882 229039 349465 472857 378673 -56197 262807 277018 66640 180403 104600 309220
14872 309220 164054 -10171 540777 -44018 432987 264289 66733 368033 205064 91758
$$ packed form
14948c1261k43022E8351J31328o3961J35345r9615O8789I6934J5026O66576C5178
14936A09840J48766G7578L73386b09886D60352J19574B36211M353A16878b99991
14925B88219K05705j19645E1087b48728C23862J345J18231C162O627K27994M7018
14914B84801J30199i5059E2812j9476L16100m4654J43773Q5967A25910J60201
14904B86111J94933B00566L16304A86329O8519r1202j7088K6828K69787j00016
14894C43157j0371j29074J58465J3548r6710j09753F5359J80206Q8958r9682I4548
14882B29039J20426J23392r4184e6197B62807J4211F6640J13763p5803K04620
14872C09220j45166a0171E40777d4018D32987j68698F6733L01300j62969I1758
$$ plain form
14861 390284 90147 655745 280806 679514 486360 278839 334115 267032 718384 294439
14850 355924 321887 590147 350249 591046 410330 178286 189753 120543 168133 329994
14840 329994 502091 391975 538231 478587 -125595 268530 432334 271453 250638 305375
14830 305375 552051 332346 512354 396307 688322 323628 344065 475430 509512 403613
14820 403613 332412 348336 408996 244430 752938 356444 300431 450531 593537 134608
14809 387409 566401 75916 351382 290981 818936 317415 495465 394124 479223 398710
14799 398710 161218 304376 -76673 339125 366338 502382 569899 451438 482362 552666
14789 552666 -28683 552276 508916 540202 736908 594338 665205 178868 188909 392995
$$ packed form
14861C90284I0147N65598B80806L98708j93154k07521N5276o7083M51352B94439
14850C55924l4037K68260k39898K40797j80716A78286J1467o9210M7590J61861
14840C29994J72097j10116J46256n9644a25595B68530J63804j60881k0815N4737
14830C05375K46676k19705J80008j16047K92015C23628K0437J31365L4082j05899
14820D03613p1201J5924O0660j64566N08508C56444n6013J50100J43006A34608
14809C87409J78992G5916K75466o0401N27955C17415J78050j01341Q5099q0513
14799C98710A61218J43158g6673C39125K7213J36044O7517j18461L0924P0304
14789E52666b8683E52276m3360L1286J96706j42570P0867A78868J0041K04086
$$ plain form
14779 392995 572822 476238 370709 213526 368290 540575 629771 349414 675481 798905
14769 798905 460488 431150 413804 622148 543435 493629 239300 656743 607669 403635
14759 403635 863843 644351 414228 448460 750831 664286 546007 311847 766788 662128
14749 662128 396975 680464 790597 482083 661961 718205 688327 669859 313860 593788
14739 593788 695546 670037 667054 475899 603806 541882 697148 375500 758821 760776 602090
14728 602090 824537 751199 1032331 743139 646375 541464 685819 492218 456103 375128
14718 375128 795581 383020 627708 443147 743073 650632 744388 947948 843475 977150
14708 977150 837782 653504 796316 820598 728728 494177 645981 728756 934258 748022
$$ packed form
14779C92995J79827r6584j05529j57183J54764J72285Q9196k80357L26067J23424
14769G98905l38417k9338j7346K08344p8713m9806B39300M17443m9074k04034
14759D03635M60208k19492k30123L4232L02371q6545j18279k34160M54941j04660
14749F62128k65153K83489J10133l08514J79878N6244k9878j8468C13860K79928
14739E93788J01758k5509k983j91155J27907o1924J55266l21648L83321J955j58686
14728F02090K22447p3338K81132k89192r6764j04911J44355j93601l6115q0975
14718C75128M20453C83020K44688j84561K99926r2441R3756K03560j04473J33675
14708I77150j39368j84278J42812K4282r1870k34551J51804Q2775K05502j86236
$$ plain form
14698 748022 630210 807708 873427 634364 618141 335832 652017 958859 860850 947494
14688 947494 692098 963659 387635 927719 710337 448826 1094252 892291 646876 1002150
14678 1002150 758171 586250 752499 950262 634268 912933 618927 1222849 411839
14668 784316 578833 1190259 1176754 1052491 943982 740302 832500 1019093 1170207 736757
14658 736757 739592 1036656 1148766 1080876 939750 985972 817774 870086 949037 1037679 900076
14647 900076 1269946 1115397 836915 764099 1119180 1062609 708349 878737 880301 1033061
14637 1033061 1205207 379759 1209820 1139802 917082 1308775 1300439 1134412 993362 1217447
14627 1217447 940386 1286322 1429494 931490 1199239 1642626 1181355 1167898 1332233 1344567
$$ packed form
14698G48022j17812J77498O5719k39063j6223k82309L16185L06842r8009Q6644
14688I47494k55396K71561C87635N40084k17382k61511O45426k01961k45415L55274
14678A002150k43979j71921J66249J97763l15994K78665k94006O03922D11839
14668G84316k05483O11426j3505j24263j08509k03680R2198J86593J51114m33450
14658G36757K835K97064J12110o7890j41126M6222j68198N2312P8951Q8642j37603
14647I00076L69870j54549k78482p2816L55081n6571l54260J70388J564J52760
14637A033061J72146C79759Q30061p0018k22720L91693q336j66027j41050K24085
14627A217447k77061L45936J43172m98004K67749M43387m61271j3457J64335J2334
$$ plain form
14617 1344567 1003171 1235430 941827 1297130 1162530 1390513 1344040 1324172 1508466 1109103
14607 1109103 1454646 1453666 983863 1499511 1404900 1095560 1542877 1124213 1146068 1282529
14597 1282529 1266449 1514923 1464654 1231820 1537299 1226127 1414431 1348787 1492810 1692473
14587 1692473 1367086 1555058 1470715 1343966 1505508 1800176 1640956 1877270 1392460 1887067
14577 1887067 1975877 1714099 2048551 1815218 1683301 1801314 1837107 2041639 1657745 2126251
14567 2126251 1771638 2149303 2084487 1993583 2144789 2157280 2057777 2224288 2016097 2568706
14557 2568706 2498467 2700363 3247048 2965608 3117056 3662419 4307317 5325529 7371860
14548 7371860 11455412 20033193 37256194 37397864 17565516 6332120 3277690 2154023
$$ packed form
14617A344567l41396K32259k93603L55303j34600K27983m6473j9868J84294l99363
14607A109103L45543r80m69803N15648r4611l09340M47317m18664K1855J36461
14597A282529j6080K48474n0269k32834L05479l11172J88304o5644J44023J99663
14587A692473l25387J87972q4343j26749J61542K94668j59220K36314m84810M94607
14577A887067Q8810k61778L34452k33333j31917J18013L5793K04532l83894M68506
14567B126251l54613L77665o4816r0904J51206J2491r9503J66511k08191N52609
14557B568706p0239K01896N46685k81440J51448N45363O44898J018212K046331
14548G371860M083552Q577781J7223001J41670A7565516F332120l054430j123667
$$ plain form
14540 2154023 1959605 1728648 1477535 1746628 1841709 1417628 1814990 1687536 1517001 1460260
14530 1460260 1843062 1938844 2200489 1789457 2020790 1862688 2129851 2056397 2201366 1790391
14520 1790391 2271317 2192472 2142962 2159279 2175981 2072267 2443264 2482303 2209468 2293102
14510 2293102 2714472 2234201 2648519 2263064 2413061 2639293 2517853 2597283 2419996 2629176
14500 2629176 2439498 2819733 2752755 2641226 2863321 2879364 2672419 2687893 2616935 3293479
14490 3293479 2854202 3017752 2863198 3039775 3119983 3136559 3188205 2965157 3576587 3189384
14480 3189384 3079271 3453628 3536643 3270672 3431847 3520629 3701367 3379623 3463238 3750334
14470 3750334 3875640 3677973 3851477 3665445 3439342 4013330 4106795 3876826 4305404 3886807
$$ packed form
14540B154023j94418k30957k51113K69093R5081m24081L97362j27454j70535n6741
14530A460260L82802R5782K61645m11032K31333j58102K67163p3454J44969m10975
14520A790391M80926p8845m9510J6317J6702j03714L70997L9039k72835Q3634
14510B293102M21370m80271M14318l85455J49997K26232j21440P9430j77287K09180
14500B629176j89678L80235o6978j11529K22095J6043k06945J5474p0958O76544
14490C293479m39277J63550j54554J76577Q0208J6576N1646k23048O11430l87203
14480C189384j10113L74357Q3015k65971J61175Q8782J80738l21744Q3615K87096
14470C750334J25306j97667J73504j86032k26103N73988R3465k29969M28578m18597
$$ plain form
14460 3886807 4170242 4187653 4123430 4279041 4295509 4313165 4552025 4724868 4537928 4758148
14450 4758148 4502699 4974541 4719181 4798056 4728561 4957848 4913684 5209996 5093195 5109431
14440 5109431 5271119 5069592 5715557 5324064 5694254 5820580 5485510 6026027 6121292 5647865
14430 5647865 5671892 5899408 6157031 6155879 6093366 6469341 6452864 6427044 6376513 6681179 6454628
14419 6454628 6887869 7038862 7263747 6942498 7480591 7420996 7538043 7376229 7848435 7865914
14409 7865914 7915360 8023750 7787425 8301883 8366889 8576938 8555863 8443337 8919163 9078195
14399 9078195 9166503 9227606 9736670 9914211 9659327 10002178 10233464 10637453 10398075 10724912
14389 10724912 10734764 11087580 11364894 11344770 11733680 11703444 12449374 12145912 12563227 12673631
$$ packed form
14460C886807K83435J7411o4223J55611J6468J7656K38860J72843j86940K20220
14450D758148k55449M71842k55360P8875o9495K29287m4164K96312j16801J6236
14440E109431J61688k01527O45965l91493L70190J26326l35070N40517R5265m73427
14430E647865K4027K27516K57623j152o2513L75975j6477k5820n0531L04666k26551
14419F454628M33241J50993K24885l21249N38093n9595J17047j61814M72206J7479
14409G865914M9446J08390k36325N14458O5006K10049k1075j12526M75826J59032
14399I078195Q8308O1103N09064J77541k54884L42851K31286M03989k39378L26837
14389A0724912R852L52816K77314k0124L88910l0236P45930l03462M17315J10404
$$ plain form
14379 12673631 13193519 13493705 13420746 13538608 13740208 14038162 14708012 14476553 15364794
14370 15364794 15639021 15644218 15843951 16107017 16611472 16963153 16992988 17508268 18311948 18460673
14360 18460673 18725363 19493063 19853878 20536814 20873605 21330160 21591895 22272236 22663537
14351 22663537 23056332 23486170 24558892 24989959 25504427 25830842 26929334 27821215 28297495
14342 28297495 29208752 29543661 30698336 31556596 32552050 33036297 34239901 34946618 36208908
14333 36208908 37387118 38411119 39593912 40649977 42078443 43398463 44676254 46211884
14325 46211884 47627858 49457538 51197077 53093963 54939215 56604818 58463550 60540293
14317 60540293 62675887 65386211 67520095 70140780 72703675 76060583 78846174 82038035
$$ packed form
14379A2673631N19888L00186p2959J17862K01600K97954O69850k31459Q88241
14370A5364794K74227N197J99733K63066N04455L51681K9835N15280Q03680J48725
14360A8460673K64690P67700L60815O82936L36791M56555K61735O80341L91301
14351B2663537L92795M29838J072722M31067N14468L26415J098492Q91881M76280
14342B8297495R11257L34909J154675Q58260R95454M84247J203604P06717J262290
14333C6208908J178210J024001J182793J056065J428466J320020J277791J535630
14325D6211884J415974J829680J739539J896886J845252J665603J858732K076743
14317F0540293K135594K710324K133884K620685K562895L356908K785591L191861
$$ plain form
14309 82038035 85400179 89044509 92740839 96871228 100993603 105591825 110441699 115323647
14301 115323647 121117212 126460718 132396311 139018757 145660099 153170192 160936542 169125117
14293 169125117 177629656 186488293 196333164 206338030 217052479 228289936 240063509
14286 240063509 252209417 264851194 277658552 291421497 304592730 318800129 332766803
14279 332766803 346882597 360537264 373500006 385822944 396967102 405737392 408695650
14272 408695650 409478348 410635358 411941390 410865577 412247135 409866606 405345363 397032511
14264 397032511 387251481 375456309 362093102 348373775 333949315 319050246 304062052
14257 304062052 289145615 275170128 261622169 248532680 235677888 223652014 211910042
$$ packed form
14309H2038035L362144L644330L696330M130389M122375M598222M849874M881948
14301A15323647N793565N343506N935593O622446O641342P510093P766350Q188575
14293A69125117Q504539Q858637R844871J0004866J0714449J1237457J1773573
14286B40063509J2145908J2641777J2807358J3762945J3171233J4207399J3966674
14279C32766803J4115794J3654667J2962742J2322938J1144158Q770290K958258
14272D08695650P82698J157010J306032j075813J381558k380529m521243q312852
14264C97032511r781030j1795172j3363207j3719327j4424460j4899069j4988194
14257C04062052j4916437j3975487j3547959j3089489j2854792j2025874j1741972
$$ plain form
14250 211910042 200815216 190913443 180725551 171797250 162919470 155221655 147248964 140166329
14242 140166329 133543298 126949340 121132779 115323014 110283917 105802613 100908690 96303268
14234 96303268 92152820 88204547 84945264 81535118 78461199 74870334 71876614 69069268
14226 69069268 66517079 63907991 61390585 59459855 57178616 55328147 53506276 51849124
14218 51849124 49867703 48180074 46792738 44985572 43726737 42797718 41271609 39919080
14210 39919080 38423266 37610507 36454559 36096949 35024692 33683589 32607750 31557685
14202 31557685 30868273 30310333 29693201 28725759 28081572 27088072 26227330 25805903 25257807
14193 25257807 24590775 23919664 23392931 22871594 22221626 21760079 21540470 20697797 20227644
$$ packed form
14250B11910042j1094826r901773j0187892q928301q877780p697815p972691p082635
14242A40166329o623031o593958n816561n809765n039097m481304m893923m605422
14234I6303268m150448l948273l259283l410146l073919l590865k993720k807346
14226F9069268k552189k609088k517406j930730k281239j850469j821871j657152
14218E1849124j981421j687629j387336j807166j258835r29019j526109j352529
14210C9919080j495814q12759j155948l57610j072257j341103j075839j050065
14202C1557685o89412n57940o17132r67442o44187r93500q60742m21427n48096
14193B5257807o67032o71111n26733n21337o49968m61547k19609q42673m70153
$$ plain form
14184 20227644 19468449 19296344 19056264 18353952 17769828 17942833 17461780 16816606 16483946
14175 16483946 16240672 16294958 15539833 15275733 14974909 14683764 14587246 14197662 13947094 13535880
14165 13535880 13675168 13256294 12760255 12767785 12585916 11873826 11788669 11942271 11779203 11318417
14155 11318417 11255277 10652700 10884169 10800877 10554570 10565068 10205923 10041055 9853926 9667384
14145 9667384 9720288 9427907 9048141 9057693 8695021 9168929 8693070 8682135 8889206 8236995
14135 8236995 8056343 8397443 8323779 7772339 7564291 7775495 7737773 7322977 6964743 7096463
14125 7096463 7189721 6702518 6779483 6625326 7090308 6858006 6479731 6324291 6343859 6449018
14115 6449018 6114911 6343178 6219742 5591156 5498900 5659331 5771002 5511923 5839310 5770631
$$ packed form
14184B0227644p59195j72105k40080p02312n84124J73005m81053o45174l32660
14175A6483946k43274N4286p55125k64100l00824k91145r6518l89584k50568m11214
14165A3535880J39288m18874m96039P530j81869p12090q5157J53602j63068m60786
14155A1318417o3140o02577K31469q3292k46307J0498l59145j64868j87129j86542
14145I667384N2904k92381l79766R552l62672M73908m75859j0935K07071o52211
14135H236995j80652L41100p3664n51440k08048K11204l7722m14796l58234J31720
14125G096463R3258m87203P6965j54157M64982k32302l78275j55440J9568J05159
14115F449018l34107K28267j23436o28586r2256J60431J11671k59079L27387o8679
$$ plain form
14105 5770631 5400805 5736686 5420152 5224544 5326961 5313950 5105936 4936361 5255831 5356606
14095 5356606 4852747 4893356 4618181 4553352 4863148 4804374 4535735 4357622 4462739 4332838
14085 4332838 4336135 4494753 4244251 4541102 4437218 4001259 4322353 4092281 3864842 4136738
14075 4136738 3549592 3798306 3607883 4052731 3794896 3716907 3541009 3588603 3763486 3784938
14065 3784938 3428237 3607488 3471235 3623378 3847124 3490740 3605458 3767291 3399812
14056 3399812 3772527 3263349 3186308 3317497 3135249 2968513 3117900 2982679 2850172 2693475
14046 2693475 2810728 3048008 2730125 3115112 2815502 2852242 2821948 2556967 3090124 2633342
14036 2633342 2627875 2877571 2879848 2844737 2505517 2321867 2640537 2533989 2589757 2293225
$$ packed form
14105E770631l69826L35881l16534j95608J02417j3011k08014j69575L19470J00775
14095E356606n03859M0609k75175o4829L09796n8774k68639j78113J05117j29901
14085D332838L297J58618k50502K96851j03884m35959L21094k30072k27439K71896
14075D136738n87146K48714j90423M44848k57835p7989j75898M7594J74883K1452
14065C784938l56701J79251j36253J52143K23746l56384J14718J61833l67479
14056C399812L72715n09178p7041J31189j82248j66736J49387j35221j32507j56697
14046B693475J17253K37280l17883L84987k99610L6740l0294k64981N33157m56782
14036B633342n467K49696K277l5111l39220j83650L18670j06548N5768k96532
$$ plain form
14026 2293225 2312823 2316322 2253170 2362811 2726420 2263770 2627367 2280837 1913069 2337374
14016 2337374 2356763 2415425 1969241 2252113 2315699 2180818 1942304 2070060 2239625 1938672
14006 1938672 2128632 2021810 1754793 1983402 1752798 2137649 1957510 1968918 1548232 1818821
13996 1818821 1661908 1635100 1822990 1802656 1660917 2016821 2322339 3629408 6740067
13987 6740067 12744499 29750820 38349787 23952078 11201970 6373337 4480042 3767098
13979 3767098 3258496 2884935 2830609 2892117 2182088 2430063 2325466 2357326 2174512 2072301
13969 2072301 1781844 1751170 2002634 1916958 2048397 2045417 1784808 1672762 1719590 1717214 1862454
13958 1862454 1990347 1692412 1688737 1476802 1471417 1776974 1523053 1834315 1743795 1771785
$$ packed form
14026B293225J9598L499o3152J09641L63609m62650L63597l46530l67768M24305
14016B337374J9389N8662m46184K82872O3586j34881k38514J27756J69565l00953
14006A938672J89960j06822k67017K28609k30604L84851j80139J1408m20686K70589
13996A818821j56913k6808J87890k0334j41739L55904L05518J307069L110659
13987F740067O004432J7006321Q598967j4397709A1201970m828633j893295p12944
13979C767098n08602l73561n4326O1508p10029K47975j04597L1860j82814j02211
13969B072301k90457l0674K51464q5676J31439k980k60609j12046M6828k376J45240
13958A862454J27893k97935l675k11935n385L05557k53921L11262r0520K7990
$$ plain form
13948 1771785 1522795 1605856 1512456 1467351 1520504 1612568 1495335 1808336 1716159 1313425
13938 1313425 1678823 1445045 1591379 1472861 1370221 1452000 1528120 1194814 1238034 1301468
13928 1301468 1232534 1321423 1340029 1526649 1537298 1308952 1351700 1325458 1328278 1612911 1353628
13917 1353628 1589746 1276619 1307286 1264984 1497488 1337366 1653960 1017817 1184627 905232
13907 905232 1321095 1261316 1089588 1075846 1360710 1056710 1024246 1141759 1047154 977481
13897 977481 1177326 1127538 1107798 1182201 1216841 926586 1114636 1118755 1208313 1182427 1207702
13886 1207702 946006 1112740 1117524 613597 1021003 1116122 913567 881406 1040963 872303
13876 872303 1138594 714237 1115355 1013175 1233368 1077958 889668 807304 899418 987625
$$ packed form
13948A771785k48990Q3061r3400m5105N3153R2064j17233L13001r2177m02734
13938A313425L65398k33778J46334j18518j02640Q1779P6120l33306M3220O3434
13928A301468o8934Q8889J8606J86620J0649k28346M2748k6242K820K84633k59283
13917A353628K36118l13127L0667m2302K32504j60122L16594o36143J66810k79395
13907I05232M15863n9779j71728j3742K84864l04000l2464J17513r4605o9673
13897I77481J99845m9788j9740P4403L4640k90255J88050M119Q9558k5886K5275
13886A207702k61696J66734M784n03927M07406R5119k02555l2161J59557j68660
13876H72303K66291m24357M01118j02180K20193j55410j88290q2364R2114Q8207
$$ plain form
13866 987625 1096599 804071 1166221 778833 1265275 987880 1054104 1023603 711281 1169123
13856 1169123 950574 830947 797975 1022529 1003838 924239 913263 550113 1282268 1147734
13846 1147734 803838 837992 567337 594966 856221 913288 575383 927211 867100 540250
13836 540250 648612 649988 952687 887572 795605 986754 858804 789136 649991 617927 574478
13825 574478 856936 950439 806325 719743 871701 766565 914220 1062344 766504 799181
13815 799181 579680 751484 750118 769073 933450 570234 620404 594189 601159 753383 613856
13804 613856 739525 529296 782390 779976 511240 600860 985127 785761 560192 853295
13794 853295 639256 645904 549218 795453 829124 533406 696145 801900 387215 562335
$$ packed form
13866I87625J08974k92528L62150l87388M86442k77395O6224l0501l12322M57842
13856A169123k18549j19627l2972K24554j8691p9599j0976l63150P32155j34534
13846A147734l43896L4154k70655K7629K61255N7067l37905L51828o0111l26850
13836E40250J08362J376L02699o5115r1967J91149j27950o9668j39145l2064m3449
13825E74478K82458R3503j44114q6582J51958j05136J47655J48124k95840L2677
13815G99181k19501J71804j366J8955J64377l63216N0170k6215O970J52224j39527
13804F13856J25669k10229K53094k414k68736Q9620L84267j99366k25569K93103
13794H53295k14039O648r6686K46235L3671k95718J62739J05755C87215J75120
$$ plain form
13784 562335 546860 220027 660954 650454 640421 707725 777074 749920 313959 760417 565911
13773 565911 405535 546642 487553 659578 683902 597619 566894 638668 669877 422000 739021
13762 739021 990696 590937 542570 711760 309735 526602 637808 702778 405908 665723
13752 665723 395148 501189 528900 765600 213699 509881 379129 659421 308206 736064
13742 736064 327531 428273 417812 573530 646230 632556 653489 558202 536340 584772 404524
13731 404524 308949 718839 603576 459019 629052 935134 638328 398037 828569 257993
13720 269706 770769 262122 363851 328741 514641 439091 296856 517797 652620 669368
13710 669368 417554 624309 351919 257881 382658 508366 252872 620833 484841 754230
$$ packed form
13784E62335j5475B20027M40927j0500j0033O7304O9349k7154C13959M46458j94506
13773E65911j60376J41107n9089J72025K4324q6283l0725P1774L1209k47877L17021
13762G39021K51675l99759m8367J69190C09735K16867J11206O4970k96870K59815
13752F65723k70575J06041K7711K36700B13699K96182j30752K80292C08206M27858
13742G36064C27531J00742j0461J55718P2700j3674K0933r5287k1862M8432j80248
13731D04524r5575M09890j15263j44557J70033L06082k96806k40291M30532B57993
13720B69706N01063B62122J01729l5110J85900p5550j42235K20941J34823J6748
13710F69368k51814K06755k72390r4038J24777J25708B52872L67961j35992K69389
$$ plain form
13700 754230 102919 250703 402270 333046 321281 892163 417205 739250 299610 602392
13690 602392 397041 334020 313511 356029 369881 317232 423913 372261 503195 486803 481464
13679 481464 436188 655075 446599 681972 369484 478809 444752 220395 495145 360207
13669 360207 301971 176584 511837 315355 277967 390597 325759 308696 158171 604185
13659 604185 527535 364231 413701 426949 468949 539168 391689 268271 277281 538178 667791
13648 667791 457844 384356 163443 344587 479927 473427 518988 351892 422707 454334 178824
13636 617572 607149 275415 579914 406870 125653 282724 -145903 357775 203112 477897
13626 477897 364148 451081 97597 289136 567671 541690 168781 417380 287234 249902
$$ packed form
13700G54230A02919J47784J51567o9224j1765N70882D17205L22045B99610L02782
13690F02392k05351o3021k0509M2518J3852n2649J06681n1652J30934j6392n339
13679D81464m5276K18887k08476K35373l12488J09325l4057B20395K74750j34938
13669C60207n8236j25387L35253j96482l7388J12630o4838j7063j50525M46014
13659F04185p6650j63304M9470J3248M2000P0219j47479j23418R010K60897J29613
13648F67791k09947p3488A63443J81144J35340o500M5561j67096P0815L1627A78824
13636F17572j0423B75415L04499j73044A25653J57071a45903C57775j54663K74785
13626D77897j13749Q6933I7597J91539K78535k5981A68781K48599j30146l7332
$$ plain form
13616 249902 183116 62279 298735 326937 352532 173028 571030 423406 285703 225455
13606 225455 411559 393882 218897 8422 640015 467890 175400 465628 127117 470384
13596 470384 327785 276573 257680 179050 602539 231116 524081 68308 308897 193575
13586 193575 542715 49325 416411 13723 82743 387526 359644 474644 169712 191277
13576 191277 240432 378401 378626 558568 -31863 184385 409155 110037 128577 300674 386764
13565 386764 191295 599529 146806 186503 -39059 266578 312102 326386 428481 160593
13554 183234 205922 -2125 227512 235923 29827 299216 476041 -46310 -30474 322120 381764
13543 381764 -156178 113240 10801 66783 199238 278222 116971 256804 127610 452674
$$ packed form
13616B49902o6786F2279K36456K8202K5595A73028L98002j47624j37703o0248
13606B25455J86104j7677j74985H422O31593j72125A75400K90228A27117L43267
13596D70384j42599n1212j8893p8630M23489B31116K92965F8308K40589j15322
13586A93575L49140D9325L67086A3723O9020L04783k7882J15000A69712K1565
13576A91277M9155J37969K25J79942c1863A84385K24770A10037J8540J72097Q6090
13565C86764A91295M08234A46806L9697c9059B66578M5524J4284J02095A60593
13554A83234K2688b125B27512Q411B9827K69389J76825d6310J5836C22120N9644
13543C81764a56178A13240A0801N5982J32455P8984A16971J39833A27610L25064
$$ plain form
13533 452674 340543 15276 405658 347586 219455 332485 305307 231913 49558 381093
13523 381093 1536 397411 539706 192622 135649 414474 -73958 85675 394848 -90966 119851
13511 142434 381315 204001 429489 143490 162750 385053 373735 84716 51594 292310
13501 292310 106074 473070 232341 405833 -13688 260509 302331 63053 216879 161400
13491 161400 84865 93335 183225 204701 242658 263782 291339 307102 308282 159668 141320 62309
13478 180076 183835 477209 170418 164383 -77283 286796 124840 210722 4365 218406 262336
13467 262336 248472 -138965 170177 -46803 -104101 197053 -39569 141683 167296 312153
13457 312153 99434 245923 475776 -50091 176324 367950 265224 469325 141333 445567
$$ packed form
13533D52674j12131A5276L90382n8072j28131J13030k7178p3394D9558L31535
13523C81093A536L95875J42295A92622n6973K78825g3958H5675L09173i0966A19851
13511A42434K38881j77314K25488A43490J9260K22303j1318H4716l3122K40716
13501B92310A06074L66996B32341J73492a3688B60509M1822F3053J53826n5479
13491A61400p6535Q470Q9890K1476L7957K1124K7557J5763J180j48614j8348F2309
13478A80076L759K93374A70418o035g7283B86796A24840Q5882D365K14041M3930
13467B62336j3864a38965A70177d6803n7298A97053c9569A41683K5613J44857
13457C12153I9434J46489K29853e0091A76324J91626j02726K04101A41333L04234
$$ plain form
13447 445567 27927 76139 117005 136029 202546 410451 230763 107344 212882 466450
13437 466450 43267 -67912 15664 197358 -39471 72379 314730 199256 19525 -141219 247762
13425 202124 70346 30936 18511 246438 205976 94719 229530 136968 329835 108946 200498
13414 200498 122140 290453 429034 7990 -2042 28137 69924 359099 159200 -23416 217175
13402 -60897 303935 420223 312447 225750 376118 2511 201436 175832 224254 126044 262746
13391 262746 306175 -154250 27535 396337 194633 -8049 114561 12020 256947 405459
13381 405459 329569 486169 187318 197386 124775 -34636 397675 136038 171781 43868 189658
13370 189658 252624 327839 -165788 500055 259084 -198877 444255 359993 446716 243264
$$ packed form
13447D45567B7927M8212M0866J9024O6517K07905j79688A07344J05538K53568
13437D66450D3267f7912A5664J81694c9471G2379K42351j15474A9525a41219B47762
13425B02124G0346C0936j2425K27927m0462I4719J34811r2562J92867A08946R1552
13414B00498p8358J68313J38581G990b042B8137M1787K89175A59200b3416B17175
13402f0897C03935J16288j07776q6697J50368B511J98925k5604M8422r8210J36702
13391B62746M3429a54250B7535L68802A94633h049A14561A2020K44927J48512
13381D05459p5890J56600A87318J0068p2611c4636C97675A36038L5743D3868J45790
13370A89658O2966P5215a65788E00055k40971a98877D44255q4262Q6723k03452
$$ plain form
13360 243264 182925 305140 247940 272100 41070 478303 356627 75547 -103 158349 145199
13349 145199 362171 122072 202981 61942 289054 96096 -47941 40291 238051 -7700 169113
13337 111098 228077 301384 182757 204164 61157 24811 141305 32981 -31663 183539 -73633
13325 99280 319983 -92897 220195 338183 -21794 229008 -1014 425207 108220 237536
13315 237536 226932 213149 -84873 330382 245271 134880 263335 204323 55211 281740 -191295
13303 -59537 24336 -40807 9957 -31973 18959 -121603 262948 101419 -137907 119644 223414
13292 223414 166645 -41123 70241 376152 -120318 387764 351977 39466 36573 197777 -226217
13280 196634 211119 -34367 123824 65 129610 104771 131927 121599 15951 -83082 -26039 129378
$$ packed form
13360B43264o0339J22215n7200K4160D1070M37233j21676G5547a03A58349j3150
13349A45199K16972A22072Q0909F1942K27112I6096d7941D0291J97760g700A69113
13337A11098J16979P3307j18627K1407F1157B4811J16494C2981c1663A83539g3633
13325I9280K20703i2897B20195J17988b1794B29008a014D25207A08220J29316
13315B37536j0604j3783h4873C30382q5111j10391J28455n9012E5211K26529a91295
13303e9537B4336d0807I957c1973A8959a21603B62948A01419a37907A19644J03770
13292B23414n6769d1123G0241L05911a20318C87764l5787C9466k893J61204b26217
13280A96634J4485c4367A23824F5J29545k4839K7156j0328A5951h3082b6039A29378
$$ plain form
13267 69540 -105723 345751 399920 17539 53723 203131 163806 58469 114701 259184 418920
13256 418920 264298 101519 5315 -360809 102532 -18940 360669 -6142 378576 -10154 147013
13244 -49530 28796 -193666 -29122 125744 -92816 160450 123429 455675 182395 363535
13234 363535 85962 -126983 76636 27618 -115353 255158 47684 -86254 90244 68502 -121505
13222 224996 -30843 16523 43590 232306 133005 176356 439189 154737 36789 168310 -156503
13210 103089 98839 119162 301891 60178 32903 -76787 -11218 -116276 -112614 448137 7459
13198 224432 -51119 -79929 -118398 -58587 346481 41951 2736 254221 -77464 122949 91822
13187 91822 181714 97620 -133715 339477 23788 204745 252675 -164039 194926 -60262 -52125
$$ packed form
13267F9540a05723C45751N4169A7539L6184J49408l9325E8469N6232J44483J59736
13256D18920j54622A01519E315c60809A02532a8940C60669f142C78576a0154A47013
13244d9530B8796a93666b9122A25744i2816A60450l7021L32246A82395J81140
13234C63535H5962a26983G6636B7618a15353B55158D7684h6254I0244k1742a21505
13222B24996c0843A6523K7067J88716r9301M3351K62833A54737C6789J31521a56503
13210A03089m250K0323J82729F0178k7275g6787a1218j05058L662D48137G459
13198B24432e1119k8810l8469e8587C46481D1951B736K51485g7464A22949l1127
13187I1822Q9892q4094a33715C39477B3788J80957M7930a64039A94926f0262Q137
$$ plain form
13176 -52125 241013 91780 376001 -147055 -160649 190522 155899 -121971 305474 57500
13165 75646 36975 -61447 297455 114324 -78401 271691 397726 427224 147197 276020
13155 276020 418603 315534 -72339 222809 -27156 255577 253139 241659 -26093 205898 341091
13144 341091 14052 48522 11506 21890 228555 -71968 -103945 105880 -55358 -193437 344087
13132 178869 -200188 -50625 123991 134496 534899 154223 -58244 -155589 84642 -23556 90652
13120 53933 -38062 121346 -65369 -43317 -124659 -57512 125411 -51419 128043 158742 279871
13109 279871 -68040 -58450 25330 36070 240985 306633 13751 148058 -11729 17269 104199
13098 104199 -131667 189409 -80854 -222451 77445 125682 74500 242526 159954 19025 60498
$$ packed form
13176e2125B41013I1780K84221a47055j3594A90522l4623a21971C05474E7500
13165G5646C6975f1447B97455A14324g8401B71691J26035K9498A47197J28823
13155B76020J42583j03069g2339B22809b7156B55577k438j1480b6093B05898J35193
13144C41091A4052L4470A1506J0384K06665g1968l1977A05880e5358j38079C44087
13132A78869b00188e0625A23991J0505M00403A54223e8244r7345H4642b3556I0652
13120E3933c8062A21346f5369K2052q1342e7512A25411e1419A28043L0699J21129
13109B79871f8040R590B5330J0740K04915O5648A3751J34307a1729A7269Q6930
13098A04199a31667A89409h0854j41597G7445M8237n1182J68026q2572A9025M1473
$$ plain form
13087 60498 251808 314015 -112192 -4081 -315845 34852 241772 -78262 -73703 -133973 296742
13075 -308125 125680 225260 317427 -220159 -185438 -282497 170603 49771 112454 131152 -367107
13063 100842 189930 46539 68408 233988 167089 218463 241879 41826 259541 262248 276171
13052 276171 329250 -31349 22225 -114177 -137358 14620 10531 190549 -81659 -271512 409090
13040 -202490 234712 141474 299678 -26018 22451 181786 265149 211110 -3034 -270235 146706
13028 -164411 19349 350369 335214 151645 149163 83364 85386 30529 276091 117319 9747
13016 -158109 61586 74057 293013 49432 -191715 429663 102542 53775 128126 84789 135668
13005 135668 124829 118314 35045 131042 -126313 -131067 173094 23123 6870 184333 75025
$$ packed form
13087F0498J91310O2207a12192d081l11764C4852K06920g8262M559o0270B96742
13075c08125A25680R9580R2167b20159L4721r7059A70603D9771O2683J8698c67107
13063A00842Q9088D6539K1869J65580o6899N1374K3416D1826K17715K707J3923
13052B76171N3079c1349B2225a14177k3181A4620m089J80018h1659j89853D09090
13040b02490B34712r3238J58204b6018B2451J59335Q3363n4039c034k67201A46706
13028a64411A9349L31020j5155A51645k482o5799K022C0529K45562A17319I747
13016a58109F1586J2471K18956D9432a91715D29663A02542m8767P4351m3337N0879
13005A35668j0839o515C5045R5997a26313m754A73094B3123F870J77463G5025
$$ plain form
12993 -84973 180412 -50887 254908 227049 123428 -167589 -95110 142513 -75142 30115 270707
12982 270707 -14228 13001 16230 -22600 263438 -161500 211716 137626 207227 217542 -56419
12970 131770 106721 213835 -21955 -113408 333706 292861 9048 213684 176940 -85171 274465
12958 -296324 215450 -18747 -229301 19987 13878 -314313 62411 375343 332098 -145339 -21305
12946 140340 -60535 330069 -68726 -231212 99637 -73189 97640 222486 87070 183571 -330178
12934 -35579 298091 57498 238974 209959 -271229 204642 167862 -10774 385283 111745
12923 -67554 -2999 536101 235335 -34681 350835 -239808 16942 27528 63071 149759 69113
12911 -65601 96486 -149593 187501 149565 95236 -111458 -5621 -338401 184356 -15536 -44943
$$ packed form
12993h4973A80412e0887B54908k7859j03621a67589P2479A42513g5142C0115K40592
12982B70707a4228A3001L229b2600B63438a61500B11716p4090O9601J0315e6419
12970A31770k5049J07114b1955r1453C33706m0845I048K04636l6744h5171B74465
12958b96324B15450a8747k10554A9987o109c14313F2411L12932m3245a45339b1305
12946A40340f0535C30069f8726j62486I9637g3189I7640J24846H7070R6501c30178
12934c5579B98091E7498J81476k9015b71229B04642l6780a0774C85283A11745
12923f7554b999E36101B35335c4681C50835b39808A6942J0586L5543Q6688F9113
12911f5601I6486a49593A87501l7936n4329a11458e621l32780A84356a5536k9407
$$ plain form
12900 -44943 -44581 120010 -159218 -26448 110593 366121 54029 21444 198063 94800 147352
12889 147352 25530 -65625 -75625 -85851 -51021 -133140 -213689 302736 188046 -46794 -405534
12878 -405534 -3361 156124 118470 147516 -26282 -3107 48964 230223 -208274 33119 -184893
12866 -10465 98909 64808 148027 99291 43974 -51780 -191014 66074 -76163 129703 -69574
12854 -102435 97494 -127082 76722 -151182 -7149 -238046 24330 -60190 99667 139812 146832
12843 146832 -64554 462460 12878 -328942 6970 -331899 318341 -19711 -116519 88473 224269
12832 224269 -107563 -26401 -70271 165507 -83871 -43562 128332 -39938 -166168 -6441 -80570
12821 -80570 -25200 -116250 180904 339974 -112160 -158590 -58592 22227 142963 41590 -12299
$$ packed form
12900d4943L62A20010a59218b6448A10593K55528E4029B1444J76619I4800N2552
12889A47352B5530f5625j0000j0226L4830q2119q0549C02736j14690d6794l58740
12878d05534c361A56124l7654K9046b6282c107D8964J81259b08274C3119a84893
12866a0465I8909l4101Q3219m8736D3974e1780j39234F6074g6163A29703f9574
12854a02435I7494a27082G6722a51182g149k30897B4330f0190I9667M0145P020
12843A46832f4554D62460A2878c28942F970c31899C18341a9711r6808H8473J35796
12832B24269a07563b6401m3870A65507h3871M0309A28332c9938j26230f441p4129
12821h0570b5200r1050A80904J59070a12160m6430e8592B2227J20736D1590a2299
$$ plain form
12809 181721 378390 111512 54950 78500 241651 67722 -204118 -179924 375164 -57141
12798 225651 69440 204942 95585 54356 78538 4364 -59672 -371750 146467 150180 -3112
12786 31091 216357 164619 197505 -111624 160495 66150 209758 9428 -283374 -182198 -5745
12774 -114497 -223589 -296025 268859 -91300 -49128 -70881 117354 371769 72731 -305988
12763 108353 -179577 167342 192243 27044 -203045 -83905 195982 145923 -32483 189655
12752 -765 -152867 230113 379299 -102278 181446 211458 196659 146302 133914 108237 102990
12741 102990 95946 93215 -24138 41492 -173911 -118842 -48690 58153 -49612 168357 -376210
12729 9988 -90428 -66444 -65755 -58139 -53561 -8450 -330777 429902 22660 -444049 -100025 -124857
$$ packed form
12809A81721J96669A11512E4950K3550J63151F7722b04118K4194C75164e7141
12798B25651F9440J35502I5585m1229K4182D364e9672l12078A46467L713c112
12786C1091J85266n1738L2886a11624A60495F6150J43608I428b83374J01176e745
12774a14497j09092p2436B68859i1300M2172k1753A17354K54415G2731c05988
12763A08353a79577A67342K4901B7044b03045h3905A95982n0059c2483A89655
12752g65j52102B30113J49186a02278A81446L0012j4799n0357j2388k5677n247
12741A02990p044k731b4138D1492a73911N5069d8690E8153d9612A68357c76210
12729I988i0428K3984O89P616M578h450l22327D29902B2660d44049a00025k4832
$$ plain form
12717 -124857 -68816 217351 -139436 -108219 11808 77989 192123 -77530 401264 419005 -279294
12705 225351 -102362 4614 -113368 -177094 191595 60443 60406 557233 97638 198169 -104756
12693 -266200 -136421 -148158 -333133 -223018 -9623 -127644 180746 -59103 37841 54311 47338
12682 47338 -108602 177209 194497 94055 390219 108739 306405 16442 350069 213071
12672 213071 227496 121635 -129467 -94985 -150473 3829 -298227 -104402 -19668 98948 -156232
12660 137033 1916 330102 -102656 104023 492541 10536 109409 53845 113500 283732 195707
12649 195707 -47859 66804 -39513 -95296 -60399 153975 -35457 437690 85009 275441 419015
12638 419015 125316 263975 -145174 355835 27686 31208 53738 -262791 -112206 275357
$$ packed form
12717a24857N6041B17351a39436L1217A1808O6181J14134g7530D01264J7741b79294
12705B25351a02362D614a13368o3726A91595F0443l7M96827I7638J00531a04756
12693b66200J29779j1737j84975J10115i623j18021A80746e9103C7841J6470o973
12682D7338a08602A77209J7288I4055K96164A08739J97666A6442L33627j36998
12672B13071J4425j05861a29467L4482n5488C829b98227a04402a9668I8948a56232
12660A37033A916L28186a02656A04023L88518A0536R8873E3845N9655J70232q8025
12649A95707d7859F6804c9513n5783L4897A53975c5457D37690H5009J90432J43574
12638D19015A25316J38659a45174C55835B7686L522K2530b62791a12206B75357
$$ plain form
12627 109087 70640 -55038 -126043 -111239 50152 -60930 -54741 83358 211887 172568 -42231
12615 137711 -71685 114423 22419 -149276 202803 94517 249746 198181 -232517 19537
12604 -132683 -323365 -77246 367673 -136525 349664 95491 280107 135338 76824 92765
12594 92765 94548 -142731 5852 -167748 117875 -66696 92569 -110808 -32745 -280392 -25573
12582 23400 59185 122556 -79546 -21633 -139980 -153784 97339 -78498 -37807 -93742 189981
12570 101126 72961 -109539 277460 -104744 -139743 -44535 -95842 157542 -50735 -85179 89196
12558 -233756 99831 432654 292281 107978 79744 -103821 160564 150680 13112 -350611
12547 416158 19684 -9185 -82531 -1126 -24410 91812 117748 -13593 275167 360334 29020 136086
$$ packed form
12627A09087l8447e5038p1005J4804E0152f0930O189H3358J28529l9319d2231
12615A37711g1685A14423B2419a49276B02803I4517J55229n1565b32517A9537
12604a32683j90682g7246C67673a36525C49664I5491J84616A35338n8514J5941
12594I2765J783a42731E852a67748A17875f6696I2569a10808c2745k47647b5573
12582B3400L5785O3371g9546b1633j18347j3804I7339g8498c7807n5935A89981
12570A01126k8165a09539B77460a04744l4999d4535n1307A57542e0735l4444H9196
12558b33756I9831L32823j40373A07978k8234a03821A60564r884A3112c50611
12547D16158A9684i185p3346a126k3284I1812K5936a3593B75167Q5167B9020J07066
$$ plain form
12535 136086 -44315 211768 -94916 78658 -33938 87329 136474 50383 -48141 140405 2837
12523 153077 55624 -28964 6239 -72579 -138818 -193395 141619 116457 -141907 364169 73975
12511 -253394 189719 135081 -203763 300645 -125763 82161 -143628 142022 -139389 199480
12500 -16284 432500 53210 -58905 104719 -39397 -205225 36502 205525 -69958 269980 21817
12488 170982 93383 111161 245667 -92061 -16811 140910 -152847 -155383 -105740 193201 -106024
12476 104605 173310 -134487 -89527 -174402 -159115 192843 11041 -19223 -30312 4477 -157561
12464 303330 29069 -210311 -3520 141170 88717 37954 -86497 94666 60828 -459774 -230554
12453 -230554 117670 2826 18926 79601 -8420 315328 235165 28544 -166812 -5453 50878
$$ packed form
12535A36086d4315B11768i4916G8658c3938H7329M9145E0383d8141A40405B837
12523A53077E5624b8964F239g2579o6239n4577A41619k5162a41907C64169G3975
12511b53394A89719n4638b03763C00645a25763H2161a43628A42022a39389A99480
12500a6284D32500E3210e8905A04719c9397j65828C6502J69023f9958B69980B1817
12488A70982p7599J7778J34506i2061a6811A40910a52847k536M9643A93201a06024
12476A04605O8705a34487M4960q4875J5287A92843A1041a9223j1089D477a57561
12464C03330B9069b10311c520A41170n2453C7954h6497I4666l3838d59774K29220
12453b30554A17670B826J6100O0675h420C15328q0163B8544a66812e453E0878
$$ plain form
12441 115486 -264767 -13963 -69375 -256726 283064 -270705 163843 334106 247016 -177902
12430 -221733 -17849 -37602 186005 -37552 -57859 -216127 16358 -17983 60445 -80511 -158699
12419 -158699 -187202 -65212 43667 -92104 147561 -192515 -139648 67861 225009 149921 -43093
12407 175723 -201599 7802 108495 130771 -230504 -291406 33936 -151298 -421913 -208585
12396 -294986 19400 200221 -189872 -169194 56250 -95781 -62708 72050 -11519 132883 -21377
12384 241599 202381 -4489 -81560 13514 92730 -112951 28755 134374 197099 140671 76904
12373 76904 -207989 -109397 97179 -266475 -102909 175932 97205 16074 -171771 292548
12362 105882 -66288 280815 374355 30320 -162836 -21721 -97809 162820 -55626 155959 121868
$$ packed form
12441A15486b64767a3963n5412j87351B83064b70705A63843J70263q7090a77902
12430b21733a7849j9753A86005c7552k0307j58268A6358a7983F0445h0511p8188
12419a58699k8503f5212D3667i2104A47561a92515N2867F7861J57148p5088d3093
12407A75723b01599G802J00693K2276b30504o0902C3936a51298k70615b08585
12396b94986A9400J80821a89872K0678E6250i5781L3073G2050a1519A32883b1377
12384B41599l9218d489p7071A3514P9216a12951B8755J05619O2725n6428o3767
12373G6904b07989R8592I7179b66475a02909A75932p8727A6074a71771B92548
12362A05882f6288B80815R3540C0320a62836b1721p6088A62820e5626A55959l4091
$$ plain form
12351 121868 -11020 -142083 -112369 328363 -289328 -230730 -21871 -30877 209782 -174010 79173
12339 -82447 109372 -133192 -91790 -34016 -194618 88750 -23764 100387 80472 127073 -274852
12327 -136678 15395 133223 -360628 -19541 72995 138287 -105935 104600 142878 -250936
12316 -270605 125485 -59029 -132949 -207682 -128841 12304 43317 -235757 29333 -66714 69186
12304 105271 -462108 260682 -88342 469551 292344 179396 50553 102566 -94047 -214476
12294 -214476 -170205 168000 281773 72717 -215901 -74332 179108 -67750 327805 333130 -182621
12282 -223708 141285 219075 24317 -105636 173913 164332 4019 135534 27571 -61648 -71989
12271 -71989 277874 -16539 -192527 -220252 146906 -180429 -304405 -212752 37891 -46939 26309
$$ packed form
12351A21868a1020j31063K9714C28363b89328N8598b1871r006B09782a74010G9173
12339h2447A09372a33192M1402c4016j60602H8750b3764A00387j9915M6601b74852
12327a36678A5395J17828c60628a9541G2995O5292a05935A04600L8278b50936
12316b70605A25485e9029p3920p4733P8841A2304L1013b35757B9333f6714F9186
12304A05271d62108B60682h8342D69551j77207j12948E0553N2013i4047j20429
12294b14476M4271A68000J13773G2717b15901g4332A79108f7750C27805N325a82621
12282b23708A41285P7790B4317a05636A73913r581D019J31515B7571f1648j0341
12271g1989B77874a6539j75988k7725A46906a80429j23976R1653C7891d6939B6309
$$ plain form
12259 102754 63700 -358335 295766 -4474 -93017 110015 -249788 -472641 332100 59004
12248 177277 -145776 14985 419315 20714 84253 -144129 86492 -69109 -152574 -207817 224125
12236 137723 33030 -47783 141783 -26111 -102998 74569 -34863 60011 234826 172115 104973
12225 104973 150640 216486 -82309 30056 31593 50467 185653 323111 241149 -71925 486161
12213 151592 70342 233823 182563 152706 303335 30350 84309 -231386 107689 91619 229685
12202 229685 15755 -252267 50015 89640 472547 243510 130362 82345 351436 281674
12192 281674 8427 351063 243617 140440 789 -244030 297580 364479 -85574 207807 54642
12180 349514 106804 236972 223415 260859 90946 92568 128550 179016 9002 202710 148246
$$ packed form
12259A02754l9054c58335B95766d474q8543A10015b49788k22853C32100E9004
12248A77277a45776A4985M04330B0714O3539a44129H6492f9109q3465n5243B24125
12236A37723C3030d7783A41783b6111p6887G4569c4863F0011J74815o2711o7142
12225A04973M5667O5846h2309C0056J537J8874J35186J37458q1962g1925D86161
12213A51592G0342J63481n1260k9857J50629C0350N3959b31386A07689j6070J38066
12202B29685A5755b52267E0015L9625L82907k29037j13148m8017K69091o9762
12192B81674H427L42636j07446j03177G89b44030B97580O6899h5574B07807E4642
12180C49514A06804J30168j3557L7444I0946J622L5982N0466I002J93708n4464
$$ plain form
12169 148246 -35757 215772 52260 430921 41448 96671 17260 82702 -269724 151351 339212
12158 339212 -123731 134839 -71651 155324 195322 -27080 327050 250478 -43553 -50999 205227
12146 97934 275490 187775 49100 -79699 -41576 335032 -142058 99304 -101203 27040 115015
12135 115015 394883 -197648 -154331 -42977 -8805 18559 -6314 -197120 -176825 67769 -66193
12123 52259 25928 93614 210044 4145 -249768 303938 -35547 296803 268578 -9733 -131587
12112 -131587 10183 327147 73587 -38961 -44519 16906 6697 167168 -193822 -168227 -73806
12100 28642 158921 -314902 -272407 142590 114537 -37056 82428 415201 -197552 -77595 -25307
12088 68097 87754 -138329 271332 352524 995057 1046750 916042 125508 197426 337248
$$ packed form
12169A48246c5757B15772E2260L78661D1448N5223A7260O5442b69724A51351J87861
12158C39212a23731A34839g1651A55324L9998b7080C27050p6572d3553p446B05227
12146I7934J77556q7715D9100g9699L8123C35032a42058I9304a01203B7040Q7975
12135A15015K79868a97648M3317d2977h805A8559f314j90806K0295F7769f6193
12123E2259B5928O7686J16430D145b49768C03938c5547B96803k8225i733j21854
12112a31587A0183L16964G3587c8961n558A6906F697J60471a93822K5595g3806
12100B8642J30279c14902M2495A42590k8053c7056H2428L32773a97552g7595b5307
12088F8097J9657a38329B71332Q1192O42533N1693j30708A25508P1918J39822
$$ plain form
12078 337248 135777 -635 55949 26172 -33921 86230 -483543 271828 -48894 46512 -79159
12066 -145400 4036 -115040 -273443 -178316 73459 -96975 61418 -78517 -200863 44279 24994
12055 24994 -166605 -238926 -59396 10868 -83632 -117364 128147 19851 -42414 101418 211808
12044 211808 151734 -473880 -43378 179424 -192458 47934 124861 57933 15669 105733 -108754
12032 -74622 52401 -89604 203116 113090 186899 230151 -146831 -184578 -3380 61174 22808
12020 106234 101652 32263 -196011 167565 135181 142016 -217643 -53585 143477 38260 212960
12009 212960 -106255 -36537 420402 -6091 -117825 -221927 -107152 -242757 -212881 80289
11998 -332923 -164973 42615 25912 97114 483823 77673 -29902 -44475 151555 43145 50073
$$ packed form
12078C37248A35777f35E5949B6172c3921H6230d83543B71828d8894D6512g9159
12066a45400D036a15040j58403R5127G3459i6975F1418g8517j22346D4279j9285
12055B4994a66605p2321e9396A0868h3632l3732A28147A9851d2414A01418J10390
12044B11808o0074d73880d3378A79424a92458D7934P6927E7933A5669R0064a08754
12032g4622E2401h9604B03116r0026P3809M3252a46831l7747c380F1174B2808
12020A06234m582C2263a96011A67565l2384O835b17643e3585A43477C8260J74700
12009B12960a06255c6537D20402f091j11734j04102a07152j35605K9876H0289
11998c32923a64973D2615j6703P1202L86709G7673b9902j4573A51555D3145O928
$$ plain form
11987 50073 -53585 -383930 321428 -136601 -126299 206863 -375282 81677 -187364 -210130
11977 -210130 330282 -105500 110325 -312184 -252122 43810 7459 -911 -59289 6461 -157465
11965 -35488 -117031 23516 -71010 -168710 66593 31201 -58751 2685 -294904 -4711 -236831 -167847
11953 -167847 -45268 -336995 12364 7094 -15411 -34196 14830 -204049 180414 89140 49316
11942 49316 413836 -347136 121232 -276648 -264191 98564 -2092 41362 63911 120944 62570
11931 62570 139533 -109641 -199782 -40364 72985 -221521 -79086 97492 293667 246153 103214
11919 80799 -251279 74893 -17376 -50910 112400 43390 125616 -369929 -90492 -406923 224303
11907 114302 -14238 129869 -59958 46771 -44126 86382 -201554 -46372 94707 -130965 80546
$$ packed form
11987E0073e3585l30345C21428a36601J0302B06863c75282H1677a87364k2766
11977b10130C30282a05500A10325c12184O0062D3810G459i11n8378F461a57465
11965c5488q1543B3516g1010r7700F6593C1201e8751B685b94904d711k32120O8984
11953a67847d5268k91727A2364n270a5411j8785A4830b04049A80414H9140l9824
11942D9316L64520c47136A21232b76648J2457I8564b092D1362K2549N7033n8374
11931F2570P6963a09641r0141d0364G2985b21521g9086I7492J96175m7514A03214
11919H0799b51279G4893a7376l3534A12400D3390Q2226c69929i0492l16431B24303
11907A14302a4238A29869e9958D6771d4126H6382b01554d6372I4707a30965H0546
$$ plain form
11895 74340 -253924 -109761 -200473 -417379 172697 -184315 12960 -222152 226791 -170383
11884 -96832 -269903 260853 -7221 184803 -80633 -86002 156708 -18234 -62009 -38810 -242031
11873 -242031 -110504 128694 131978 -227153 65794 86121 -166300 25578 86422 -86881 36956
11861 -66371 255228 239424 260495 -278273 322201 86667 -87455 -84249 378543 -86713 -127042
11850 -127042 -52939 455957 -327073 33844 811 -63830 -174464 -59178 -205488 -93112 122402
11838 -50220 -12905 -37761 60650 -140583 140810 79207 196477 88046 -238518 -29801 -27122
11827 -27122 -26681 27102 -134653 -101071 -2132 -176710 -256134 146787 -21030 63615 120991 -208130
11814 -32161 -307269 -124160 -201605 -142234 -200744 -304692 -275575 -167955 146516 11859 -89270
$$ packed form
11895G4340b53924a09761r0712k16906A72697a84315A2960b22152B26791a70383
11884i6832j73071B60853g221A84803h0633n369A56708a8234m3775K3199k03221
11873b42031a10504A28694L284b27153F5794K0327a66300B5578O0844h6881C6956
11861f6371B55228j5804K1071b78273C22201H6667h7455L206C78543h6713m0329
11850a27042e2939D55957c27073C3844H11f3830j10634e9178j46310i3112A22402
11838e0220a2905k4856F0650a40583A40810o1603J17270H8046b38518b9801K679
11827b7122M41B7102a34653L3582b132j74578p9424A46787b1030F3615N7376b08130
11814c2161k75108a24160p7445N9371n8510j03948K9117J07620A46516A1859h9270
$$ plain form
11802 212094 22687 -287282 -141821 262022 -219759 218492 87930 192889 87419 102656
11792 102656 114982 35224 182690 225197 120836 -78608 -307527 35179 -248109 -44841 -65447
11781 -65447 111935 45998 -130740 15832 -153026 73779 287023 -133370 147482 -35088
11770 109939 116525 9895 -169022 -171961 -172273 -179561 -203557 124200 -424668 -26705 18555 -54231
11757 210353 -72739 -537037 -68838 115151 -53436 46224 154977 120076 -49268 -107203 5696
11745 -44140 -64242 -90501 -6505 -163837 64082 -127884 261908 27858 181447 -214672 33239
11733 12622 -115432 58724 73623 -48916 -111829 -319972 203910 182523 -51181 -63805 138696
11721 14996 96339 19806 134170 -73162 -48690 281594 202073 -38465 -221343 36951 -134927
$$ packed form
11802B12094B2687b87282a41821B62022b19759B18492H7930J04959H7419J5237
11792A02656J2326C5224J47466M2507j04361g8608k28919C5179b48109d4841k0606
11781f5447A11935D5998a30740A5832a53026G3779K13244a33370A47482c5088
11770A09939O586I895a69022k939l12p288k3996A24200d24668b6705A8555e4231
11757B10353g2739m64298f8838A15151e3436D6224J08753l4901d9268n7935E696
11745d4140k0102k6259f505j57332F4082a27884B61908B7858J53589b14672C3239
11733A2622a15432E8724J4899d8916o2913k08143B03910k1387e1181j2624A38696
11721A4996Q1343A9806J14364g3162K4472B81594p9521c8465j82878C6951a34927
$$ plain form
11709 112309 203955 -19184 -88582 -108483 210523 -3694 -337096 -174547 52089 118186 291271
11698 291271 395424 106290 150191 -118132 92345 106270 64950 -138533 -35439 -149962
11688 -149962 43895 -111810 89637 -167401 -301627 -116416 4101 565384 -31294 -219886
11678 -219886 -119525 63250 -19505 75701 3518 -9781 84012 76518 69288 187272 -31854 124193
11665 -15486 -210151 -115140 197337 409607 -278787 -213549 102210 382265 124775 -116838
11654 187674 -13163 223372 -170489 27788 309965 -42447 -5300 113755 -185532 -85683 -18860
11642 -17368 -16875 -112574 61342 -162763 104673 130929 364406 15540 255876 -146741 25709
11630 253268 231403 128025 125943 162104 -21606 229166 132802 102607 49588 -156078 123742
$$ packed form
11709A12309R1646a9184o9398j9901B10523c694l33402J62549E2089O6097J73085
11698B91271J04153A06290M3901a18132I2345J3925m1320a38533c5439j14523
11688a49962D3895a11810H9637a67401j34226a16416D101N61283c1294j88592
11678b19886J00361F3250a9505G5701C518i781H4012p494p230J17984c1854A24193
11665a5486j94665R5011A97337K12270b78787O5238A02210K80055A24775a16838
11654A87674a3163B23372a70489B7788K82177d2447e300A13755a85532h5683a8860
11642a7368M93r5699F1342a62763A04673K6256K33477A5540K40336a46741B5709
11630B53268k1865j03378k082L6161b1606B29166r6364l0195D9588a56078A23742
$$ plain form
11618 -379554 -8708 12969 167418 -144712 -71950 130167 -253899 -182926 14917 -109392 66230
11606 -9802 -43928 467668 -210927 104806 11870 249674 -144062 -138129 2743 -88932 69147
11594 -211123 276605 73161 -122894 -38782 322872 148673 77225 112614 256557 -200695
11583 -246626 159255 -170797 123182 -39031 -352278 -77295 155971 -188699 -150090 65534
11572 229942 101605 45895 127897 186894 -211557 241288 -160361 -15835 45405 137292 123039
11561 123039 68046 143298 128944 -260947 -87840 149596 -44317 -134320 290066 -60030 84896
11549 98922 -230674 71506 -309705 -156578 81526 70121 213875 -229737 -230125 298706 7052
11537 22427 -316318 263143 159276 -69511 -29334 274997 270861 202648 30478 82253 332799
$$ packed form
11618c79554h708A2969J54449a44712g1950A30167b53899P0973A4917a09392F6230
11606i802l4126D67668b10927A04806A1870K37804a44062N933B743h8932F9147
11594b11123B76605G3161a22894c8782C22872A48673p1448L5389J43943b00695
11583b46626A59255a70797A23182c9031l13247g7295A55971a88699L8609F5534
11572B29942A01605D5895Q2002N8997b11557B41288a60361a5835D5405R1887j4253
11561A23039n4993P5252j4354b60947h7840A49596d4317r0003B90066f0030H4896
11549I8922b30674G1506c09705J53127H1526j1405J43754b29737l88B98706G052
11537B2427c16318B63143j03867f9511b9334B74997m136o8213C0478N1775K50546
$$ plain form
11526 332799 7019 27129 -20302 -439385 -70782 147942 -18458 164230 252734 19675 204470
11515 204470 18542 47355 729 269754 316824 252467 259935 -77959 155818 270734 -158979
11503 16149 -5582 146237 111874 218107 -30399 79217 102632 428871 28558 -56976 108850
11491 3957 12758 219060 193467 358454 302750 257254 22466 57738 -41355 334122 -9269 102975
11478 -350963 -116408 211840 -153791 168553 -186575 150463 9246 65603 75367 -44947 160650
11466 308681 4218 294398 -35565 155431 291855 332205 266240 110802 138999 270114 53985
11454 39995 -50082 186128 -289055 -7112 59858 41986 246567 -26177 -272775 462918 292391
11443 292391 200907 -21173 26886 -75809 -74342 133950 25596 1655 3314 -66091 32941 222900
$$ packed form
11526C32799G019K0110b0302m19083g0782A47942a8458A64230Q8504A9675J84795
11515B04470A8542K8813G29K69025M7070o4357P468g7959A55818J14916a58979
11503A6149e582A46237l4363J06233c0399G9217K3415L26239B8558e6976A08850
11491C957Q801K06302k5593J64987n5704m5496B2466L5272d1355C34122i269A02975
11478c50963a16408B11840a53791A68553a86575A50463I246N6357R764d4947A60650
11466C08681D218K90180c5565A55431J36424M0350o5965A10802K8197J31115E3985
11454C9995e0082A86128b89055g112E9858j7872K04581b6177k46598D62918j70527
11443B92391r1484b1173B6886g5809J467A33950B5596A655J659f6091C2941J89959
$$ plain form
11431 222900 19435 121216 -24952 31688 4421 -56588 -27408 47891 -386788 238671 193343
11420 193343 -10314 -276760 -179630 -333573 131081 -98257 -114372 -188157 7197 -21673 345542
11408 -197648 286922 37672 160031 -189292 -105841 -36208 297957 -118139 -41135 236547
11397 -240503 -371651 113423 -264201 30899 -198959 -12250 229680 378490 167895 -6008
11386 -33865 -224154 324683 -372821 -96310 132898 -112935 -37018 26461 -81173 -22494 -66904
11375 -66904 -265549 90987 -165083 70053 -170463 169227 -109396 -109867 148089 -328524 -225496
11364 -225496 223914 -162774 -127919 215734 -232462 -103739 -125091 -35151 49511 -47885
11353 112509 305143 -163310 35344 -83491 107696 176090 -204753 -73215 220898 175732
$$ packed form
11431B22900A9435J01781b4952C1688D421e6588b7408D7891c86788B38671m5328
11420A93343a0314k66446R7130j53943A31081i8257j6115p3785G197b1673C45542
11408a97648B86922C7672J22359a89292Q3451c6208B97957a18139d1135B36547
11397b40503j31148A13423b64201C0899a98959a2250B29680J48810A67895f008
11386c3865j90289C24683c72821i6310A32898a12935c7018B6461h1173b2494m4410
11375f6904j98645I0987a65083G0053a70463A69227a09396m71A48089c28524J03028
11364b25496B23914a62774L4855B15734b32462a03739k1352c5151D9511d7885
11353A12509J92634a63310C5344h3491A07696O8394b04753g3215B20898m5166
$$ plain form
11343 175732 -185391 141 -302065 100156 -109499 -47764 -120877 -103734 146993 -167115 201260
11331 -238597 -242829 242086 437183 -373140 -340811 -118153 -100449 -46993 112011 -299591
11320 -92483 412769 -330242 -146780 152484 143420 196898 373726 -266700 -108685 -302460
11310 -302460 47589 -41558 97763 -119379 272631 179916 -156276 150493 343474 41790
11299 -233244 -126377 140012 -63410 11567 193000 96577 -242680 23531 -179072 118628
11288 96718 -6650 79815 -245240 317538 -377984 146863 -3575 -106523 -6202 -38173 77494
11276 -115708 104813 -93392 -118154 -409963 87074 -214136 117861 -49475 -237066 -122612
11266 -122612 -191330 -366143 74409 200263 66012 -216182 268437 -110708 296078 -48886
$$ packed form
11343A75732a85391A41c02065A00156a09499d7764p3113J7143A46993a67115B01260
11331b38597m232B42086J95097c73140L2329a18153J7704d6993A12011b99591
11320i2483D12769c30242a46780A52484r064N3478J76828b66700a08685j93775
11310c02460D7589d1558I7763a19379B72631r2715a56276A50493J92981D1790
11299b33244J06867A40012f3410A1567J81433r6423b42680B3531a79072A18628
11288I6718f650G9815b45240C17538c77984A46863c575j02948f202l1971G7494
11276a15708A04813i3392k4762k91809H7074b14136A17861d9475j87591J14454
11266a22612o8718j74813G4409J25854F6012b16182B68437a10708B96078d8886
$$ plain form
11255 -170113 172862 81744 89552 12503 154925 154678 -51691 157172 -85451 -364096 291931
11243 80621 -319257 38071 -112098 -2000 -81672 -48291 133039 14811 -74054 -390963 -46814
11231 -30060 81017 184096 -149324 -33596 -112850 74148 223215 37499 -28942 -44473 -179442
11220 -179442 9947 -12556 40222 -170529 43421 -548013 -203908 -101953 145334 -236989
11209 -106120 -178615 24453 -61054 -107567 -104303 -159865 -248178 -274318 18663 -20144 -245857
11198 -245857 -76816 203691 97333 -46028 -109455 -55748 -228411 17287 -80494 8658 6129
11187 6129 274576 -189979 177561 -221841 171494 131697 69289 -46738 -65334 52306 1815
11175 -75396 -66549 -176941 149673 118960 -83779 4886 -36061 -83203 48605 -198779 96749
$$ packed form
11255a70113A72862H1744P808A2503J42422k47e1691A57172h5451k78645B91931
11243H0621c19257C8071a12098b000p9672L3381A33039A4811g4054l16909d6814
11231c0060H1017J03079a49324c3596p9254G4148J49067C7499b8942j5531j34969
11220a79442I947a2556D0222a70529D3421e48013b03908a01953A45334b36989
11209a06120p2495B4453f1054m6513L264n5562q8313k6140A8663b0144k25713
11198b45857g6816B03691I7333d6028o3427N3707j72663A7287h0494H658k529
11187F129K68447a89979A77561b21841A71494l9797o2408d6738j8596E2306A815
11175g5396Q847j10392A49673l0713h3779D886c6061m7142D8605a98779I6749
$$ plain form
11163 -93450 68024 -70251 97766 124927 -107027 -17957 150641 -40825 -45295 -333495 135370
11151 67100 -22838 -38891 69476 -16984 -28465 -43918 134659 -164944 157922 -137139 -152555
11140 -152555 -414361 -119572 -31967 102663 -88310 167098 -91569 -114294 -259020 -130534
11130 -130534 363754 142102 -83431 6106 -238575 139052 205292 119151 160619 -176286 117579
11118 37307 -96518 167071 28400 193640 -14850 347706 -161145 -14252 203678 -78853 16663
11106 18345 138115 314913 31639 122229 -29409 395625 67773 -33844 -19504 272641 58094
11094 249158 115388 -106445 385384 382219 -325314 339993 -41100 178988 90431 55627
11084 55627 155806 506021 279929 48805 102627 177945 287023 -91058 29448 427524 59583
$$ packed form
11163i3450F8024g0251I7766K7161a07027a7957A50641d0825m470k88200A35370
11151F7100b2838j6053F9476a6984j1481j5453A34659a64944A57922a37139j5416
11140a52555k61806a19572c1967A02663h8310A67098i1569k2725j44726J28486
11130a30534C63754A42102h3431F106b38575A39052O6240q6141M1468a76286A17579
11118C7307i6518A67071B8400J65240a4850C47706a61145a4252B03678g8853A6663
11106A8345J19770J76798C1639R0590b9409C95625F7773c3844J4340B72641E8094
11094B49158A15388a06445C85384l165c25314C39993d1100A78988q8557l4804
11084E5627J00179L50215k26092D8805N3822P5318J09078i1058B9448L98076E9583
$$ plain form
11072 -73247 -603 467286 225151 -159311 98834 445766 255087 61894 249291 134575 236499
11061 236499 482794 417773 337044 366418 435274 352142 538106 243703 346993 595012
11051 595012 657186 579123 276866 486190 601017 429095 594063 -3729 260428 709881
11041 709881 269790 425321 304380 651639 552864 366931 442457 706872 420713 439757
11031 439757 686414 534858 495505 479941 756766 459524 316411 618322 512324 186035
11020 338608 472328 204906 335962 454210 433509 516461 506978 752101 372062 435170
11010 435170 579113 766598 376867 311886 253700 559836 604828 69743 469096 582757
11000 582757 500529 515672 690259 222908 390942 401036 454241 572633 232416 77059
$$ packed form
11072g3247f03D67286B25151a59311I8834L46932j90679F1894J87397j14716J01924
11061B36499K46295o5021q0729K9374O8856q3132J85964B43703J03290K48019
11051E95012O2174p8063B76866K09324J14827j71922J64968c729B60428M49453
11041G09881B69790J55531j20941L47259r8775j85933P5526K64415k86159J9044
11031D39757K46657j51556l9353j5564K76825k97242j43113L01911j05998A86035
11020C38608J33720B04906J31056J18248k0701Q2952r483K45123C72062O3108
11010D35170J43943J87485C76867o4981n8186L06136M4992F9743L99353J13661
11000E82757q2228J5143J74587B22908J68034J0094N3205J18392B32416G7059
$$ plain form
10989 236395 416962 684859 382071 626096 641885 870549 690046 499012 838994 580327
10979 580327 759807 1008242 1063939 958995 1201523 1023955 1290567 1413896 1818774 2062081
10969 2062081 1612518 2021460 1673964 1758175 1481014 1339620 1176414 1423024 1286595 1041443
10959 1041443 1329286 1478291 1121739 1444918 1278172 1555623 1211593 1106833 822049
10950 822049 1047853 859283 490509 210395 574291 316718 68933 352168 87911 -26319
10939 349751 72228 -34023 -32824 281185 -15443 -96199 354633 208138 -73402 220481 72439
10927 28346 88647 -175570 -90283 -111178 -63194 -170564 119830 39287 2770 256627 251150
10916 251150 -199826 -61112 4461 -7864 -30157 -22168 -103266 14927 239411 259971 241806 -322904
$$ packed form
10989B36395J80567K67897l02788K44025J5789K28664j80503j91034L39982k58667
10979E80327J79480K48435N5697j04944K42528j77568K66612J23329M04878K43307
10969B062081m49563M08942l47496Q4211k77161j41394j63206K46610j36429k45152
10959A041443K87843J49005l56552L23179j66746K77451l44030j04760k84784
10950H22049K25804j88570l68774B10395L63896k57573F8933K83235H7911b6319
10939C49751G2228c4023J199B81185a5443q0756C54633j46495g3402B20481G2439
10927B8346O0301a75570Q5287k0895M7984j07370A19830C9287B770K53857n477
10916B51150a99826f1112D461g864k2293P989q1098A4927K24484K0560j8165c22904
$$ plain form
10903 -33788 289829 46201 -124479 223016 -186639 -10503 239545 150489 -4281 -21883 -1625
10891 -156173 -58894 160178 -208938 -27607 202908 60685 -90977 -144889 -244117 -228759 -114609
10880 -114609 -475055 55115 -96012 -192607 268124 95718 65317 -226283 -92245 146637 -123425
10868 -166577 -36414 238071 -61767 64567 354953 151926 260228 -291700 -192178 36308
10857 -7022 -112500 99032 286071 -468931 -131852 -307394 -134990 -56510 -101900 -30849 139776
10845 286892 -293372 269977 -91745 226607 13331 32579 15885 -63423 144080 -74360 -66735
10834 -66735 155273 78615 81462 -102658 -221389 -40044 -49643 140541 -47963 316100 257508
10823 257508 43606 204924 91608 78948 194027 -395914 -166392 147599 -103592 216187
$$ packed form
10903c3788B89829D6201a24479B23016a86639a0503B39545q9056d281j7602a625
10891a56173e8894A60178b08938b7607B02908F0685i0977n3912r9228J5358J14150
10880a14609l60446E5115i6012r6595B68124I5718l0401b26283i2245A46637a23425
10868a66577c6414B38071f1767F4567K90386A51926J08302b91700R9522C6308
10857g022j05478I9032J87039d68931a31852j75542a34990e6510m5390c0849A39776
10845B86892b93372B69977i1745B26607A3331J9248A5885f3423A44080g4360P625
10834f6735A55273p6658K847a02658j18731d0044r599A40541d7963C16100n8592
10823B57508D3606J61318I1608j2660J15079c95914a66392A47599a03592B16187
$$ plain form
10812 159409 -192152 -6039 -141234 341227 -78768 77512 144857 -373135 -362299 -52339 111149
10800 -1545 176028 123006 -145328 103262 196476 -139284 -81644 180584 -20461 -20673 -49567
10789 -49567 229902 550 9110 203720 -152336 390100 -291024 -53893 152319 40701 -151354
10777 -60235 -88157 -321062 34475 113109 275958 309305 118356 -85765 75294 -21463 -31923
10766 -31923 -10404 -60470 -160975 -208520 71125 -68963 -411448 -90807 -249887 87059 33272
10754 -94134 -124445 302783 -169333 -273299 8689 -67734 64744 67716 -48320 -119321 33281
10742 50690 -247296 47546 184018 -246295 -160527 -150986 -210301 -51682 -208417 -33504 56585
10730 20418 -88366 24628 -48206 -383535 73709 -147832 -54758 -46456 -190126 126644 40983
$$ packed form
10812A59409a92152f039j35195C41227g8768G7512O7345c73135J0836e2339A11149
10800a545A76028n3022a45328A03262R3214a39284N7640A80584b0461k12k8894
10789d9567B29902E50Q560J94610a52336C90100b91024e3893A52319D0701a51354
10777f0235k7922k32905C4475P8634J62849L3347A18356h5765G5294b1463j0460
10766c1923a0404n0066j00505m7545G1125f8963l42485i0807j59080H7059C3272
10754i4134l0311C02783a69333j03966H689f7734F4744K972d8320p1001C3281
10742E0690b47296D7546J36472b46295Q5768R541n9315e1682j56735c3504E6585
10730B0418h8366B4628d8206l35329G3709a47832e4758Q302j43670A26644D0983
$$ plain form
10718 -338166 -36222 -250807 -13782 -89778 -179469 58724 -111942 41710 129557 -96740 -311305
10707 -311305 -82043 -418446 -367579 64490 256857 -111570 -188346 -110123 180632 -25488 -74551
10696 -74551 -176819 -131210 -117945 -217318 -203539 -47729 2158 91832 11911 94106 8689 -68860
10683 -42961 -91763 146642 129280 113843 34999 -89108 15187 79734 102160 104230 -118511
10671 44249 139523 -168857 -72338 -137219 255165 38136 -220830 -432889 -109096 -247099
10661 -247099 83564 -23532 -64383 -79626 -62120 -276609 -577425 -102665 -125318 -149902 186975
10649 140990 -143234 2750 -53086 -111703 75558 126754 -161345 -59446 -79830 -103006 21419
10637 -42568 -202202 -267681 -197505 28471 164426 -14642 -247067 -404091 -28669 -62149 -14023
$$ packed form
10718c38166c6222k14585a3782p5996q9691E8724a11942D1710Q7847i6740k14565
10707c11305h2043l36403N0867F4490J92367a11570p6776P8223A80632b5488m9063
10696g4551j02268M5609J3265r9373J3779d7729B158Q9674A1911Q2195H689f8860
10683d2961m8802A46642j7362j5437C4999h9108A5187O4547K2426K070a18511
10671D4249R5274a68857g2338o4881B55165C8136b20830k12059a09096j38003
10661b47099H3564b3532m0851j5243J7506k14489l00816a02665k2653k4584A86975
10649A40990a43234B750e3086n8617G5558N1196a61345e9446k0384k3176B1419
10637d2568j59634o5479P0176B8471J35955a4642k32425j57024b8669l3480a4023
$$ plain form
10625 16081 71696 -202316 -197498 -21612 -26247 -74773 -222465 -168849 -368104 -74836 -8277 -98400
10613 -98400 -233559 60451 -97719 50168 -387355 -186572 -261214 -110174 143116 -248084
10602 169398 83064 -179832 163968 137937 -26213 -95298 86889 -224334 -33708 -227641 249543
10590 81593 25869 93517 -64458 -36181 -102600 -629818 -140047 -341177 46505 28237 151705
10579 151705 14745 159491 -233938 -240401 -114575 4964 -159812 -66697 -50635 215217 -90051
10567 191408 -205940 218867 82232 -260698 -110111 223483 33776 -43017 36527 -86098
10556 178562 -63232 -300170 -183033 126619 118347 213325 -69043 -41458 71159 -28263 -152858
10545 -152858 -116410 -71292 169280 142940 -39960 -117639 156790 -7238 134718 -51868 -23951
$$ packed form
10625A6081N5615b02316M818b1612m635m8526j47692N3616j99255g4836h277r0123
10613i8400j35159F0451i7719E0168c87355a86572p4642a10174A43116b48084
10602A69398H3064a79832A63968k6031b6213o9085H6889b24334c3708j93933B49543
10590H1593B5869O7648f4458K8277o6419n27218a40047k01130D6505j8268J23468
10579A51705A4745J44746b33938o463a14575D964a59812f6697J6062B15217i0051
10567A91408b05940B18867H2232b60698a10111B23483C3776d3017C6527h6098
10556A78562f3232k36938J17137A26619q272R4978f9043K7585G1159b8263j24595
10545a52858L6448M5118A69280k6340c9960p7679A56790g238A34718e1868b3951
$$ plain form
10533 195323 37984 49825 180385 128835 123162 -183543 -200429 28815 160134 -30571 -216903
10522 -216903 81579 -188518 -144464 -9337 27041 57344 -59807 14113 -170346 33074 115860
10511 115860 -190727 6597 217240 -94712 88660 -566 -89943 -46418 -39635 98732 206865 18673
10498 124351 -159614 -214724 42764 132941 -204862 -90416 -436668 -169385 122114 -41206
10487 -122289 124922 -307342 -196887 -72281 6950 33800 13576 -331123 -8712 539649 251448
10475 7308 206456 -172595 146745 110740 79976 -122124 39844 -83492 2840 -294803 -294605
10464 -294605 7276 173939 -57763 -207397 -313939 -216594 57471 48469 -39729 -47085 -412593
10453 -412593 71853 79762 -155352 -16372 -109989 -54730 -202318 -281345 -31735 -130587 83327
$$ packed form
10533A95323C7984J1841J30560n1550n673a83543j6886B8815J31319c0571j86332
10522b16903H1579a88518M4054i337B7041L0303e9807A4113a70346C3074Q2786
10511A15860a90727F597K10643i4712H8660e66q9377M3525O783I8732J08133A8673
10498A24351a59614n5110D2764R0177b04862i0416l46252a69385A22114d1206
10487a22289A24922c07342J10455g2281F950K6850A3576c31123h712E39649B51448
10475G308J99148a72595A46745l6005l0764a22124C9844h3492B840b94803J98
10464b94605G276J66663e7763j49634j06542R7345E7471r002c9729p356l65508
10453d12593G1853P909a55352a6372r3617e4730j47588p9027c1735r8852H3327
$$ plain form
10441 -34936 -265790 -107824 133637 -175725 -292922 -30786 17442 -101442 389162 155331
10430 -59418 217242 -11314 106324 176256 -10812 133549 243203 -314696 127251 187496
10420 187496 -154347 -245551 -149903 -182431 -45343 -180544 -11526 290485 64387 138028 -102577
10408 59417 88043 167549 88574 -75927 -65083 -26396 -381348 -113316 -164678 237932 4401
10396 277603 47493 71957 232750 164506 48710 -55292 -38484 -20375 533145 104949 -137236
10384 -12007 113509 -183342 -296919 158701 33850 15661 197694 -263426 211458 51711
10373 275579 99361 206903 -43778 -102730 77250 272194 358409 260407 411079 -77639 433275
10361 579086 176337 207361 117188 370115 105952 97289 -83063 9167 150257 53053 453496
$$ packed form
10441c4936k30854a07824A33637a75725j17197c0786A7442a01442C89162A55331
10430e9418B17242a1314A06324O9932a0812A33549J09654c14696A27251O0245
10420A87496a54347r1204R5648l2528d5343j35201a1526B90485F4387P3641a02577
10408E9417K8626P9506p8975g5927J0844b6396l54952a13316n1362B37932D401
10396B77603D7493K4464J60793o8244D8710e5292J6808J8109E33145A04949a37236
10384a2007A13509a83342j13577A58701C3850A5661J82033b63426B11458E1711
10373B75579I9361J07542d3778n8952G7250J94944Q6215r8002J50672g7639D33275
10361E79086A76337L1024r0173K52927A05952q663h3063I167J41090E3053M00443
$$ plain form
10350 453496 319008 330574 269881 129838 457898 377880 381122 334907 54010 334251 208786
10339 208786 237948 254496 234532 145583 302056 126684 -248127 -130626 84299 78513 403506
10328 403506 16254 119189 -53142 332414 86474 197881 -26718 63340 81165 63219 349250
10317 349250 198118 107730 -38059 151508 -28840 494715 -18461 61525 52195 403249 -12924
10305 29048 24073 3359 64350 -46897 -92019 39591 56842 77966 51908 -167624 -320276 -98478
10292 362710 -60948 -189256 -21081 52615 -33524 -281827 1639 -56379 -194484 86077 -270399
10280 -71438 31490 -368973 -335995 -58336 -97676 -319503 -89457 -46087 -33834 -151773 -279947
10269 -279947 -148532 176868 314122 82549 32134 295921 54220 -39321 49514 -110100
$$ packed form
10350D53496j34488J1566o0693A29838L28060q0018L242m6215E4010K80241j25465
10339B08786K9162J6548j9964q8949J56473A26684b48127J17501H4299n786L24993
10328D03506A6254J02935e3142C32414H6474J11407b6718F3340J7825j7946K86031
10317C49250j51132r0388c8059A51508b8840D94715a8461F1525r330L51054a2924
10305B9048m975C359O0991d6897m5122C9591J7251K1124k6058a67624j52652i8478
10292C62710f0948j28308b1081E2615c3524k48303A639e6379j38105H6077b70399
10280g1438C1490c68973L2978e8336l9340k21827h9457M3370J2253j17939j28174
10269b79947J31415A76868J37254H2549C2134K63787E4220c9321D9514a10100
$$ plain form
10258 269874 -36482 -71052 449481 101630 151763 128274 99752 -131307 223347 -147067
10247 -82719 -185042 -16754 -80801 -89975 -15210 -308074 -252011 2819 -553938 86129 172172
10236 172172 241260 154920 -7678 110474 -169185 131968 81917 289924 -43057 -141977 213151
10224 -95776 -148750 358749 -129105 248722 -60324 -197049 -431520 -415332 -345755 274487
10213 188185 113263 -123321 -86051 -148437 -192263 45018 -214909 -263765 -226988 -67914 127992
10201 -60735 236018 119239 -80285 -312234 -51823 -81253 65483 176904 -473736 130414
10190 -85665 -133849 -263132 62917 34588 -70897 -33119 -124437 127699 -93041 -144200 -152939
10179 -152939 187632 106112 40570 -91556 248 -202162 95538 -210502 -83057 -297655 -52655
$$ packed form
10258B69874c6482l4570D49481A01630N0133k3489k8522a31307B23347a47067
10247h2719j02323a6754o4047r174a5210k92864N6063B819e53938H6129Q6043
10236A72172O9088q6340g678A10474a69185A31968n0051K08007d3057r8920B13151
10224i5776n2974C58749a29105B48722f0324j36725k34471J6188O9577B74487
10213A88185p4922a23321L7270o2386m3826D5018b14909m8856L6777f7914A27992
10201f0735B36018j16779h0285k31949e1823k9430F5483J11421d73736A30414
10190h5665m8184j29283F2917k8329g0897c3119r1318A27699i3041n1159q739
10179a52939A87632q1520D0570i1556B48b02162I5538b10502h3057k14598e2655
$$ plain form
10167 -27990 -14256 -129419 -87767 -252913 -115760 153363 -451100 58876 -122020 52249
10156 -92015 -33448 -598134 -66647 11690 -187859 3152 165326 72240 -424058 107887 -524859
10144 -204503 -268806 -81338 91217 -98494 333302 -25141 -211093 224298 65064 -157564 -50075
10132 90457 -35911 -51682 -42668 -50494 -7203 -204923 -145557 58662 82224 87929 -240197 -64356
10119 -291586 75582 427387 -116862 -26553 -125580 80914 -195610 -206999 87294 -237826 -127085
10108 -127085 -9729 -363854 -292684 -33745 -188059 225011 129678 4644 -46998 -16513 -206002
10097 -206002 -318246 77232 113111 23890 -81621 82543 304301 -243248 -414799 -207146
10086 -205939 -12472 45998 -10122 205416 467644 -40316 -194724 158947 -97292 16419 -84155
$$ packed form
10167b7990J3734j15163M1652j65146a15760A53363d51100E8876a22020E2249
10156i2015c3448n64686f6647A1690a87859C152J62174G2240d24058A07887e24859
10144b04503o4303h1338I1217i8494C33302b5141j85952B24298F5064a57564e0075
10132I0457c5911j5771R014p826g203j97720N9366E8662K3562N705b40197f4356
10119b91586G5582L51805a16862b6553r9027H0914a95610j1389H7294b37826J10741
10108a27085i729l54125P1170c3745j54314B25011r5333D644d6998a6513j89489
10097b06002j12244G7232L5879B3890h1621H2543K21758b43248j71551b07146
10086b05939a2472D5998a0122B05416K62228d0316j54408A58947i7292A6419h4155
$$ plain form
10074 -29098 173148 -103914 121995 344973 -19490 156358 -65798 -118401 108690 -170545
10063 -181920 36193 -211471 -51744 -73732 282292 82882 -393750 -196190 31907 -33840 62713
10051 141646 -38257 -221511 -94055 -31616 -126280 -130461 333546 369949 -249255 85612 -91049
10039 -6836 -174466 24696 -157188 -220869 -237009 -199880 -44813 -122648 -27401 -63540 62413
10027 -354726 -142804 -277042 58298 -284881 14950 -435824 -305731 78369 118626 -78702
10016 515936 -113406 -72585 295616 -888 -235324 -64243 9078 -38362 -122642 -313777 -143563
10004 -137198 -606654 -115235 36910 52939 -38525 -70920 -64735 -201572 74315 -92399 -144165
9993 -144165 -148528 -640 -155045 -69098 43224 -269456 -71702 -20009 -232377 40431 -217479
$$ packed form
10074b9098A73148a03914A21995K22978a9490A56358f5798n2603A08690a70545
10063a81920C6193b11471e1744k1988B82292H2882c93750a96190C1907c3840F2713
10051A41646c8257j83254i4055c1616r4664m181C33546L6403b49255H5612i1049
10039f836j67630B4696a57188o3681j6140L7129d4813p7835b7401l6139F2413
10027c54726a42804j34238E8298b84881A4950d35824J30093G8369M0257g8702
10016E15936a13406M0821B95616h88k34436f4243I078c8362q4280j91135a43563
10004a37198m69456a15235C6910J6029c8525l2395O185j36837G4315i2399n1766
9993a44165m363f40j54405f9098D3224b69456g1702b0009k12368D0431b17479
$$ plain form
9981 11743 -235351 -306751 -178067 11716 -34132 -280268 85682 -330091 -231187 -297138 -150949
9970 -150949 -328499 -37522 11443 -249714 -460378 -7792 211318 35473 -27616 123361 72453
9959 72453 139416 -91508 -146481 194028 257302 -415903 -115144 -79164 -206685 160564 9601
9947 -69206 -71285 151484 -379345 166797 -83828 42123 -84703 -318020 -33840 -152600 27510
9935 -318735 -245465 -187605 204691 288892 -83388 -277809 25350 159721 9845 -237143 -62115
9923 11425 1383 -316551 -58919 62440 -62678 -5291 156699 89676 -7965 -132249 280924 14290
9910 146226 -482622 2853 120508 -4419 93931 -221186 -117401 286445 -67265 173556 -21983
9898 -23947 65685 -78668 -69468 -305748 92239 -1719 19541 -54160 -44535 -4321 -61830 -131016
$$ packed form
9981A1743b35351p1400J28684A1716c4132k46136H5682c30091R8904o5951J46189
9970a50949j77550c7522A1443b49714k10664g792B11318C5473b7616A23361n0908
9959G2453O6963i1508n4973A94028O3274d15903a15144L5980j27521A60564I601
9947f9206k079A51484c79345A66797h3828D2123h4703k33317c3840j18760B7510
9935c18735P3270N7860B04691Q4201h3388j94421B5350J34371I845b37143f2115
9923A1425A383c16551e8919F2440f2678e291A56699o7023g965j24284B80924A4290
9910A46226d82622B853J17655d419I3931b21186J03785B86445f7265A73556b1983
9898b3947F5685g8668R200k36280I2239a719A9541e4160R625d321n7509o9186
$$ plain form
9886 -131016 392474 -27831 -31329 -102037 61246 -195436 -4554 17876 -218797 -49092 -70959
9875 -70959 95339 -363607 126517 -10721 -52223 -61383 -206313 199424 -6444 -40394 23019
9863 263884 479629 -275074 -126531 -184763 69858 -118889 -58925 149175 -50131 -66400 -138312
9852 -138312 -31870 -235475 62900 28570 -6511 -340034 -55910 -429966 -613866 -46423 40602
9840 -112946 9314 -79701 160797 -94062 191783 -336510 118714 -44705 -112120 96390 -40613
9828 -120572 -155096 249973 88297 227421 -194732 -165358 -180450 263386 -304275 -346160 -163425
9816 -151729 -184423 -186147 -5499 110954 -25635 -203617 -125874 67867 -12197 -244810 -234352
9805 -234352 162573 -154188 -11945 -137076 -42490 -103623 -39241 -81908 251187 -248265 -123580
$$ packed form
9886a31016C92474b7831l498p0708F1246a95436d554A7876b18797d9092k1867
9875g0959I5339c63607A26517a0721m1502r160j44930A99424f444l3950B3019
9863B63884K15745b75074a26531n8232F9858a18889e8925A49175e0131j6269p1912
9852a38312c1870k03605F2900B8570f511l33523e5910l74056j83900d6423D0602
9840a12946I314g9701A60797i4062A91783c36510A18714d4705o7415I6390d0613
9828a20572l4524B49973H8297J39124a94732K9374j5092B63386c04275m1885a63425
9816a51729l2694j724e499A10954b5635j77982P7743F7867a2197k32613J0458
9805b34352A62573a54188a1945j25131d2490o1133c9241m2667B51187b48265a23580
$$ plain form
9793 -117954 -182289 -74994 96677 -214006 -20385 -275197 -308271 -100418 -341743 -1994 -204183
9782 -204183 250159 82719 112235 -25451 47148 -5718 -161886 -309606 28357 -75585 -60729
9771 -60729 -231618 -110947 -414119 -101378 -53357 -41977 -301831 -100855 -105502 -283530 -132265
9759 -325044 -24129 7878 13816 -155816 -187955 -232648 304501 -84876 82639 37651 -11826 -192436
9747 -192436 128214 -211553 48042 -146889 -137382 170974 43036 -174007 -108658 16106 5878
9735 -237136 85709 -258574 250563 85097 -271448 -243493 -33996 99552 173459 91480 -79468
9723 180547 -262557 67551 98348 -142801 -119075 -33757 -105649 -251124 153278 51636 -181834
9711 -213035 3115 20498 -6607 251184 106951 -46368 -113812 115998 192196 -149097 -115749
$$ packed form
9793a17954o4335g4994I6677b14006b0385k54812l3074a00418k41325a994k02189
9782b04183B50159H2719K9516b5451D7148e718j56168j47720B8357g5585J4856
9771f0729j70889a10947l03172a01378M8021J1380k59854a00855m647j78028a32265
9759c25044b4129G878N938a55816l2139m4693C04501h4876H2639C7651a1826j80610
9747a92436A28214b11553D8042a46889R507A70974D3036a74007O5349A6106E878
9735b37136H5709b58574B50563H5097b71448K7955c3996I9552P3907q1979g9468
9723A80547b62557F7551L0797a42801K3726c3757p1892j45475A53278E1636a81834
9711b13035C115J7383f607B51184A06951d6368o7444A15998P6198a49097L3348
$$ plain form
9700 -115749 -178610 53133 -222871 65742 -220581 283105 -173805 -159331 -53884 -72768 96957
9688 -272616 -146886 93085 64091 -236489 3407 -1352 -29626 -13553 -70477 204607 -107620
9676 287805 176723 -187636 9750 -177004 414494 -327515 412350 92634 -5049 76196 88055
9665 88055 199135 110147 -256638 -6032 -152583 171663 76080 -194668 -14380 12413 -284034
9653 83471 151768 134047 -226487 -163364 -184058 -182339 -180127 353473 -321507 -237243 46876 -15838
9640 -405212 37819 -105794 -251487 57015 154888 -17213 220935 -7497 226528 -245098 329008
9628 14285 -124094 -166208 -193336 39213 -17455 71952 -32060 -5659 55198 -97649 -223180 -73162
9615 211958 22784 -103288 16266 -47603 117769 -104950 -278283 68503 -10747 26737 -117992
$$ packed form
9700a15749o2861E3133b22871F5742b20581B83105a73805J4474e3884j8884I6957
9688b72616J25730I3085k8994b36489C407a352k8274a3553n6924B04607a07620
9676B87805j11082a87636I750a77004D14494c27515D12350I2634e049G6196J1859
9665H8055J11080q8988b56638f032j46551A71663G6080a94668a4380A2413b84034
9653H3471O8297j7721b26487O3123k0694J719K212C53473c21507Q4264D6876a5838
9640d05212C7819a05794j45693E7015R7873a7213B20935g497B26528b45098C29008
9628A4285a24094m2114k7128C9213a7455G1952c2060e659E5198i7649j25531g3162
9615B11958B2784a03288A6266d7603A17769a04950j73333F8503a0747B6737a17992
$$ plain form
9603 -57218 374837 -77767 -168011 -255707 -128757 -32149 -103548 282079 -205091 -129795 -303345
9592 -303345 -198761 -262160 78701 -210641 -241139 -75534 151549 137574 172592 269669 -99966
9580 -234909 111446 57073 -458656 -295589 -2689 183670 -99959 -32932 -139085 -186349 167143
9568 -130718 41585 -165372 139648 169099 -104512 -135423 -267881 -106253 -104428 52841 -240929
9556 20021 -115336 75448 -173809 -261798 72558 -14961 -134972 -226253 -81308 -320071 5419
9544 109955 -230342 -370977 253900 -200099 -131207 21405 134879 -22671 -124093 -165409
9534 -165409 -5803 121051 -109197 31719 -334626 -108159 -254220 -21498 68469 -26236 -305392
9523 -305392 -346013 -76427 14816 -153607 -3281 -184458 -57832 29131 127438 -367447 310589
$$ packed form
9603e7218C74837g7767r0244q7696J26950c2149p1399B82079b05091P5296j73550
9592c03345J04584o3399G8701b10641l0498g5534A51549j3975L5018R7077i9966
9580b34909A11446n4373d58656J63067b689A83670i9959c2932j06153m7264A67143
9568a30718D1585a65372A39648K9451a04512l0911j32458a06253J825E2841b40929
9556B0021a15336G5448a73809q7989G2558a4961j20011r1281h1308k38763E419
9544A09955b30342j40635B53900b00099O8892B1405J13474b2671j01422m1316
9534a65409e803A21051a09197C1719c34626a08159j46061b1498F8469b6236k79156
9523c05392m0621g6427A4816a53607c281j81177e7832B9131R8307c67447C10589
$$ plain form
9511 -196346 -198412 179627 -166959 -345390 24138 8551 33329 -163382 -171196 -45471 -218086
9500 -218086 -19825 -250073 -64686 130320 -87562 287937 -131995 -169810 -140818 -402573 73195
9488 -435170 -43501 -191328 -148085 -57347 -25540 -124068 75854 118640 -157472 18527 114400
9477 114400 362370 -80466 -238214 -158934 59134 67011 -100472 8719 152491 53994 -129821
9465 -103735 -23082 212066 -91465 -154839 39313 277424 -5477 -54469 -85995 171977 58765
9453 -114632 -288775 94110 -184023 77772 162624 49268 -14949 -276229 -213068 -43482 229051
9441 111665 -89010 129427 81374 -25465 -62440 167990 190805 -390294 48609 249042 53431
9429 -162404 -167868 -280366 -123232 84570 65154 -75049 43578 -283051 2367 -253665 96982
$$ packed form
9511a96346k066A79627a66959j78431B4138H551K4778a63382p814d5471j72615
9500b18086a9825k30248f4686A30320h7562B87937a31995l7815K8992k61755G3195
9488d35170d3501j47827M3243e7347b5540r8528G5854M2786a57472A8527R5873
9477A14400K47970h0466j57748P9280E9134P877a00472H719J43772E3994a29821
9465a03735b3082B12066i1465o3374C9313K38111e477m8992l1526A71977E8765
9453a14632j74143I4110a84023G7772Q4852D9268a4949k61280O3161d3482B29051
9441A11665h9010A29427m8053b5465l6975A67990K2815c90294D8609K00433E3431
9429a62404n464j12498a23232H4570j9416g5049D3578b83051B367b53665I6982
$$ plain form
9417 490645 -120184 -955 163670 63614 -19918 -95909 5869 1942 -64966 -157411 146209 -282339
9404 25896 108482 -196724 218113 -70951 -150516 3037 -53101 -210343 -186519 -70416 -128349
9393 -128349 -141422 138480 -220341 -125461 -70733 -5480 -151483 -20520 169903 128139 10486
9381 -232681 18259 -7304 121777 -60641 128969 -75655 -246649 -173342 -138426 -333878 -249577
9370 -249577 -282769 -80299 -112767 42017 145100 39257 -341544 -3434 -115992 143504 -227999
9358 23849 412508 -244817 325439 -255179 -79111 -208789 -108988 -208069 311259 -200256
9347 -100324 -235970 91754 219347 -60131 85839 142409 10629 -52419 -286094 22851 -79281
9335 -119504 -92810 83130 243035 -152513 -116223 -55409 -136779 -290019 -76568 284657 -236709
$$ packed form
9417D90645a20184i55A63670F3614a9918p5991E869A942f4966r2445A46209b82339
9404B5896Q2586a96724B18113g0951p9565C037e3101j57242K3824g0416n7933
9393a28349j3073A38480b20341R4880N4728e480j46003b0520A69903m1764A0486
9381b32681A8259g304A21777f0641A28969g5655j70994P3307L4916j95452Q4301
9370b49577l3192h0299l2468D2017J03083C9257c41544c434j12558A43504b27999
9358B3849L88659b44817C25439b55179g9111j29678R9801r9081C11259b00256
9347a00324j35646I1754J27593f0131H5839N6570A0629e2419k33675B2851g9281
9335a19504K6694H3130J59905a52513L6290e5409q1370j53240g6568B84657b36709
$$ plain form
9323 -219230 7988 -463309 57362 35907 138073 -158284 120467 -117856 -370584 125005
9312 -143851 58774 -107935 76037 -345361 147144 209933 44886 305463 -117716 197761
9301 -137058 -69051 -132461 -576410 10807 -128907 109493 33755 124946 -84570 -57420 104963
9289 133770 -103494 23877 -220617 -105929 -153442 -318151 -54457 10668 11171 -240156 -289324
9278 -289324 190939 49572 51133 14887 -64266 61503 -63586 177362 -515 -65203 66475 36739
9266 36739 -284272 -43533 363188 8507 -198494 34650 -111088 -28202 41394 14140 -175743
9254 372067 -388074 36870 171467 175341 -50222 -127181 -132321 -245366 -183116 -98580 -169963
9243 -169963 -138641 34865 -325878 -62404 46424 -235617 27462 -136105 105464 30567 155503
$$ packed form
9323b19230G988d63309E7362k1455J02166a58284A20467a17856k52728A25005
9312a43851E8774a07935G6037c45361A47144O2789D4886K60577a17716A97761
9301a37058O8007o3410m43949A0807a28907A09493C3755R1191h4570K7150A04963
9289A33770a03494B3877b20617a05929m7513j64709e4457A0668N03b40156m9168
9278b89324A90939D9572J561A4887f4266F1503f3586A77362e15o4688F6475k9736
9266C6739b84272d3533C63188H507a98494C4650a11088b8202D1394A4140a75743
9254C72067c88074C6870J34597L874e0222p6959n140j13045O2250Q4536p1383
9243a69963L1322C4865c25878f2404D6424b35617B7462a36105A05464C0567J24936
$$ plain form
9232 155503 -258890 -256958 254065 -295223 83781 -437558 -122624 -198476 4056 22114 9188
9220 148224 -8830 -174676 415136 43749 181074 -240619 53862 77736 -241255 117442 71395
9209 71395 119377 129847 30610 -74059 33820 -92992 -192521 -286569 221658 54625 -601 -448870
9197 -448870 -41462 52170 -34399 -61290 93673 -391408 -128902 -91062 -87864 166315 22636
9185 -208633 104187 198954 -42184 -306111 -78671 -290592 -452221 22188 -129732 -118271 -311512
9174 -311512 91383 -266164 -282341 -287617 -66417 -382613 158112 10545 3452 -289570 -156114
9163 -156114 90405 -53639 149565 -109155 -135029 -252669 -221275 52508 -372922 -51846 -288999
9152 -288999 -276717 -83036 281951 -134437 182202 -211169 -318887 -293276 -94470 14602 86890
$$ packed form
9232A55503b58890J932B54065b95223H3781d37558a22624p5852D056J8058I188
9220A48224h830j65846D15136D3749J37325b40619E3862K3874b41255A17442m6047
9209G1395M7982J0470C0610g4059C3820i2992r9529r4048B21658E4625f01m48269
9197d48870d1462E2170c4399k6891I3673c91408a28902L7840L198A66315B2636
9185b08633A04187R4767d2184k63927g8671k11921j61629B2188a29732J1461j93241
9174c11512I1383b66164j6177n276f6417l16196A58112A0545C452b89570J33456
9163a56114I0405e3639A49565a09155k5874j17640L1394E2508c72922e1846k37153
9152b88999J2282h3036B81951a34437A82202b11169j07718K5611i4470A4602P2288
$$ plain form
9141 86890 -215868 120367 -152853 -321585 194337 -128548 295805 110666 55380 -21498
9130 -128388 -163958 154763 18318 67946 113735 -21971 -82137 -290345 134139 -67084 -256874
9119 -256874 -5413 2890 -11180 116114 -140723 -200279 -181678 -47252 -304882 256273 -175342
9107 -240435 -49225 115868 -30336 -98256 -165232 -913 -384693 82595 65837 -322951 167166
9095 88266 -25851 -24054 245932 -206395 -9092 89019 -197406 63027 -37023 -229126 -207376
9084 -207376 -279823 87608 -228928 129720 38366 1663 -48459 -268694 -186843 148877 -90214
9072 -96312 -87532 206414 -375837 156504 -165787 87705 -289892 30592 213569 307514 102693
9060 -228246 -14005 41694 -198899 -23901 -51909 -145010 250227 -210778 -283035 -132058 128344
$$ packed form
9141H6890b15868A20367a52853j68732A94337a28548B95805A10666n5286b1498
9130a28388l5570A54763A8318M9628M5789b1971o0166k08208A34139f7084j89790
9119b56874e413B890a1180A16114a40723n9556J8601d7252k57630B56273a75342
9107b40435d9225A15868c0336o7920o6976i13l83780H2595j6758c22951A67166
9095H8266b5851J797B45932b06395i092H9019a97406F3027c7023j92103K1750
9084b07376p2447H7608b28928A29720C8366A663d8459k20235Q1851A48877i0214
9072i6312Q780B06414c75837A56504a65787H7705b89892C0592J82977R3945A02693
9060b28246a4005D1694a98899b3901k8008r3101B50227b10778p2257a32058A28344
$$ plain form
9048 -376805 -237335 -159968 -199900 -183772 -69669 -154904 -76065 -206696 -277530 -137013 75689
9036 -304076 -38400 149275 -44371 104612 172834 -60564 -288546 31160 -15535 43402 -78595
9024 -484265 -13492 -16389 170698 -352030 36622 -62901 -28557 -215681 29456 -131599 123856
9012 -68318 -40867 -153155 132008 196265 285732 -378915 17832 349752 75902 6818 -132220
9000 -388826 176568 -80419 69016 -151053 29165 36461 -144921 -254291 -336173 -125282 -246132
8989 -246132 -36411 -52385 20053 -26233 -23285 -2766 -39164 -43174 -23488 59366 125609 -138550
8976 -25991 -524619 203849 -109355 -216361 -113780 -291289 -203644 -213130 149431 -162613
8965 6472 -45335 137195 -262784 121332 -3460 -110739 28414 -189643 -387851 -23401 -65745
$$ packed form
9048c76805J39470P7367l9932J6128f9669q5235g6065j30631p0834a37013G5689
9036c04076c8400A49275d4371A04612O8222f0564k27982C1160a5535D3402g8595
9024d84265a3492k897A70698c52030C6622f2901b8557j87124B9456a31599A23856
9012f8318K7451j12288A32008O4257Q9467c78915A7832L31920G5902F818a32220
9000c88826A76568h0419F9016a51053B9165P296a44921j09370q1882a25282j20850
8989b46132c6411j5974B0053b6233K948b766l6398m010J9686E9366O6243a38550
8976b5991m98628B03849a09355j07006J02581j77509Q7645r486A49431a62613
8965F472d5335A37195b62784A21332c460j07279B8414a89643j98208b3401m2344
$$ plain form
8954 -65745 307746 207937 29331 -330697 100275 133011 -39780 109859 -16135 192532 29354
8942 62416 -123149 -292518 261558 -389204 -191162 -309587 -184600 -185130 100625 -165828
8931 -23455 269494 -95062 253160 -207905 44445 230049 -396934 -154538 -47224 82849 -112394
8919 226720 115935 190690 -316068 -174568 251502 -198017 -18804 -136981 -83914 -106142
8909 -106142 -252430 327354 -16645 -272229 -282911 54540 -86138 55729 16329 -152265 -206
8897 206816 -153282 -102437 -11916 65169 -181600 125140 201257 -259258 138370 -122494
8886 -168789 78482 162449 186612 -29779 -66629 -156773 55019 252540 -41246 201291 -68240
8874 -122069 -979 -174905 130748 -154955 113942 -61843 188074 496400 -97905 -143047 181532
$$ packed form
8954f5745C07746r9809B9331c30697A00275L2736c9780A09859a6135A92532B9354
8942F2416a23149j69369B61558c89204a91162j18425J24987n30A00625a65828
8931b3455B69494i5062B53160b07905D4445J85604c96934a54538d7224H2849a12394
8919B26720j10785P4755c16068J41500B51502a98017a8804j18177N3067k2228
8909a06142j46288C27354a6645k55584j0682E4540h6138E5729A6329a52265b06
8897B06816a53282N0845a1916F5169a81600A25140P6117b59258A38370a22494
8886a68789G8482Q3967K4163b9779l6850r0144E5019J97521d1246B01291f8240
8874a22069i79j73926A30748a54955A13942f1843A88074L08326i7905m5142A81532
$$ plain form
8862 -57921 -9169 -208475 -53432 50018 122990 -91383 13781 -175990 708 -127029 -66402 42295
8849 -262255 6952 -120493 -39951 -95258 -397054 -205342 -144200 -174152 -89834 137976 -288520
8837 13235 -7778 110889 180825 -242692 -132307 49378 -146469 99186 -282077 -276776 87480
8825 -257421 27775 -407450 -98552 302199 -106322 285232 -27203 115307 -314786 -81762
$$ packed form
8862e7921i169j99306e3432E0018P2972i1383A3781a75990G08a27029O0627D2295
8849b62255F952a20493c9951n5307l01796J91712O1142k9952Q4318A37976b88520
8837A3235g778A10889O9936b42692J10385D9378a46469I9186b82077N301H7480
8825b57421B7775d07450i8552C02199a06322B85232b7203A15307c14786h1762
$$ [...]
##END NTUPLES=NMR SPECTRUM
##END=
