##TITLE=AC1680_CTIAH14388_8571411_XUIS1vgSpy
##JCAMPDX= 6.0         $$ Bruker NMR JCAMP-DX V2.0
##DATA TYPE= NMR SPECTRUM
##DATA CLASS= NTUPLES
##ORIGIN= BRUKER
##OWNER= Administrator
$$ 1.72 TOPSPIN		Version 2.1
$$ 2015-08-08 01:30:34.188 -0700  Administrator@X
$$ Compression mode = diff/dup
##.OBSERVE FREQUENCY= 400.02188249412
##.OBSERVE NUCLEUS= ^1H
##.ACQUISITION MODE= SIMULTANEOUS (DQD)
##.ACQUISITION SCHEME= undefined
##.AVERAGES= 64
##.DIGITISER RES= 22
##SPECTROMETER/DATA SYSTEM= spect
##.PULSE SEQUENCE= noesygpps1d.comp
##.SOLVENT NAME= COFFEE_meoh
##.SHIFT REFERENCE= INTERNAL, COFFEE_meoh, 1, 14.96175
##AUDIT TRAIL= $$ (NUMBER, WHEN, WHO, WHERE, PROCESS, VERSION, WHAT)
$$ ##TITLE= Audit trail, TOPSPIN		Version 2.1
$$ ##JCAMPDX= 5.01
$$ ##ORIGIN= Bruker BioSpin GmbH
$$ ##OWNER= Administrator
$$ $$ E:\/data/COFFEE/nmr/AC1680_CTIAH14388_8571411_XUIS1vgSpy/22/pdata/1/auditp.txt
$$ ##AUDIT TRAIL=  $$ (NUMBER, WHEN, WHO, WHERE, PROCESS, VERSION, WHAT)
(   1,<2015-08-08 01:30:28.625 -0700>,<Administrator>,<X>,<go>,<TOPSPIN 2.1>,
      <created by zg
	started at 2015-08-08 01:18:59.266 -0700,
	POWCHK enabled, PULCHK disabled,
       configuration hash MD5:
       21 0F 79 D6 B3 7B B4 F6 88 20 88 DB 03 48 BD 9F
       data hash MD5: 64K
       2F 39 7E D1 32 36 BB 94 6B 0D FF 57 05 93 6D D9>)
(   2,<2015-08-08 01:30:32.063 -0700>,<Administrator>,<X>,<proc1d>,<TOPSPIN 2.1>,
      <Start of raw data processing
       efp LB = 0.3 FT_mod = 6 PKNL = 1 PHC0 = 0 PHC1 = 0 SI = 128K 
       data hash MD5: 128K
       67 D1 B8 A3 25 08 1C 1D F7 29 F3 FE 04 60 88 A7>)
(   3,<2015-08-08 01:30:32.969 -0700>,<Administrator>,<X>,<proc1d>,<TOPSPIN 2.1>,
      <pk PHC0 = -84.16626 PHC1 = 0 
       data hash MD5: 128K
       69 19 D6 50 C8 2A D5 1A F9 9E 6E D8 74 CB F7 C3>)
(   4,<2015-08-08 01:30:33.359 -0700>,<Administrator>,<X>,<proc1d>,<TOPSPIN 2.1>,
      <abs ABSG = 1 
       data hash MD5: 128K
       43 F5 3B 63 27 2C 0A 91 AB 0C 54 B4 46 56 CE 4F>)
(   5,<2015-08-08 01:30:33.453 -0700>,<Administrator>,<X>,<proc1d>,<TOPSPIN 2.1>,
      <abs ABSG = 2 
       data hash MD5: 128K
       35 D9 57 CF E3 1D 5B C0 08 33 D5 67 75 CA 27 13>)
(   6,<2015-08-08 01:30:33.531 -0700>,<Administrator>,<X>,<proc1d>,<TOPSPIN 2.1>,
      <abs ABSG = 3 
       data hash MD5: 128K
       E7 FD 33 AC 93 08 A0 89 73 75 E9 DB 1F 16 72 FA>)
(   7,<2015-08-08 01:30:33.609 -0700>,<Administrator>,<X>,<proc1d>,<TOPSPIN 2.1>,
      <abs ABSG = 4 
       data hash MD5: 128K
       34 62 40 E6 00 52 5E 33 78 B8 EB 39 8F A9 4F 7C>)
(   8,<2015-08-08 01:30:33.734 -0700>,<Administrator>,<X>,<proc1d>,<TOPSPIN 2.1>,
      <abs ABSG = 5 
       data hash MD5: 128K
       3A 37 DF 88 B4 C9 DC 7A 01 EC B6 F5 5F E1 48 1B>)
$$ ##END=
$$ 
$$ $$ hash MD5
$$ $$ CF D2 A8 61 5F 2F 3A 58 CD 1C 74 7A BA 1C B6 AC
##$RELAX= 
##$RELAX= 
##$RELAX= 
##$RELAX= 
##$RELAX= 
##$RELAX= 
##$RELAX= 
##$RELAX= 
$$ Bruker specific parameters
$$ --------------------------
##$DU= <E:\>
##$EXPNO= 22
$$ [...]
##$TP07= 0
##$TPNAME0= <>
##$TPNAME1= <>
##$TPNAME2= <>
##$TPNAME3= <>
##$TPNAME4= <>
##$TPNAME5= <>
##$TPNAME6= <>
##$TPNAME7= <>
##$TPOAL= (0..7)
0.5 0.5 0.5 0.5 0.5 0.5 0.5 0.5
##$TPOFFS= (0..7)
0 0 0 0 0 0 0 0
##$TUNHIN= 0
##$TUNHOUT= 0
##$TUNXOUT= 0
##$USERA1= <user>
##$USERA2= <user>
##$USERA3= <user>
##$USERA4= <user>
##$USERA5= <user>
##$V9= 5
##$VALIST= <valist>
##$VCLIST= <CCCCCCCCCCCCCCC>
##$VD= 0
##$VDLIST= <DDDDDDDDDDDDDDD>
##$VPLIST= <PPPPPPPPPPPPPPP>
##$VTLIST= <TTTTTTTTTTTTTTT>
##$WBST= 2048
##$WBSW= 25
##$XGAIN= (0..3)
0 0 0 0
##$XL= 0
##$YL= 0
##$YMAX_a= 6023548
##$YMIN_a= -12010978
##$ZGOPTNS= <>
##$ZL1= 120
##$ZL2= 120
##$ZL3= 120
##$ZL4= 120
##$ABSF1= 14.96175
##$ABSF2= -5.596432
##$ABSG= 5
##$ABSL= 3
##$ALPHA= 0
##$AQORDER= 0
##$ASSFAC= 0
##$ASSFACI= 0
##$ASSFACX= 0
##$ASSWID= 0
##$AUNMP= <proc_prof1d_extract.lims>
##$AXLEFT= 0
##$AXNAME= <>
##$AXNUC= <1H>
##$AXRIGHT= 0
##$AXTYPE= 0
##$AXUNIT= <>
##$AZFE= 0.1
##$AZFW= 0.1
##$BCFW= 0
##$BC_mod= 0
##$BYTORDP= 0
##$COROFFS= 0
##$CY= 15
##$DATMOD= 1
##$DC= 0
##$DFILT= <>
##$DTYPP= 0
##$F1P= 0
##$F2P= 0
##$FCOR= 0.5
##$FTSIZE= 131072
##$FT_mod= 6
##$GAMMA= 0
##$GB= 0
##$INTBC= 1
##$INTSCL= 1
##$ISEN= 128
##$LB= 0.3
##$LEV0= 0
##$LPBIN= 0
##$MAXI= 10000
##$MC2= 0
##$MEAN= 0
##$ME_mod= 0
##$MI= 0
##$NCOEF= 0
##$NC_proc= -2
##$NLEV= 6
##$NOISF1= 0
##$NOISF2= 0
##$NSP= 0
##$NTH_PI= 0
##$NZP= 0
##$OFFSET= 14.96175
##$PC= 1
##$PHC0= -84.16626
##$PHC1= 0
##$PH_mod= 1
##$PKNL= yes
##$PPARMOD= 0
##$PPDIAG= 0
##$PPIPTYP= 0
##$PPMPNUM= 2147483647
##$PPRESOL= 1
##$PSCAL= 4
##$PSIGN= 0
##$PYNMP= <proc.py>
##$REVERSE= no
##$SF= 400.02000933773
##$SI= 131072
##$SIGF1= 0
##$SIGF2= 0
##$SINO= 400
##$SIOLD= 131072
##$SPECTYP= <>
##$SREGLST= <1H.CDCl3>
##$SSB= 0
##$STSI= 131072
##$STSR= 0
##$SW_p= 8223.68421052631
##$SYMM= 0
##$S_DEV= 0
##$TDeff= 65536
##$TDoff= 0
##$TI= <>
##$TILT= no
##$TM1= 0
##$TM2= 0
##$TOPLEV= 0
##$USERP1= <user>
##$USERP2= <user>
##$USERP3= <user>
##$USERP4= <user>
##$USERP5= <user>
##$WDW= 1
##$XDIM= 131072
##$YMAX_p= 397870592
##$YMIN_p= -10560
##$CURPLOT= <Network HP LaserJet P1505>
##$CURPRIN= <$Network HP LaserJet P1505>
##$DFORMAT= <normdp>
##$LAYOUT= <+/1D_H.xwp>
##$LFORMAT= <normlp>
##$PFORMAT= <normpl>
##$SURQMSG= 1
$$ End of Bruker specific parameters
$$ ---------------------------------
##NTUPLES= NMR SPECTRUM
##VAR_NAME=  FREQUENCY,     SPECTRUM/REAL,   SPECTRUM/IMAG
##SYMBOL=    X,             R,               I
##VAR_TYPE=  INDEPENDENT,   DEPENDENT,       DEPENDENT
##VAR_FORM=  AFFN,          ASDF,            ASDF
##VAR_DIM=   131072,        131072,          131072
##UNITS=     HZ,            ARBITRARY UNITS, ARBITRARY UNITS
##FACTOR=    0.0627417313425164, 1,          1
##FIRST=     8223.62146879497, 2576,         -48923
##LAST=      0,             3697,            -48896
##MIN=       0,             -10560,          0
##MAX=       8223.62146879497, 397870592,    0
$$ Real data points
##PAGE= N=1
##DATA TABLE= (X++(R..R)), XYDATA
$$ [...]
63952B898725K67282K85631L01898L15523L25280L29939L28924L22164L09523
63943E684889K90634K65194K33209J95038J51560J04316N5193N633m3788r2725
63933F849153j40053j83830k22346k54927k81504l01755l15187l21879l22648
63924D505024l18371l09566k96822k81173k63698k44903k24930k04265j83880
63915B177416j64623j46697j29914j14293j00232q8140p7999o9318o1503n4230
63905A170467m7581m1916l7551l4411l1916k9416k6777k4400k2571k1054j9577
63894H33297j8344j7615j7003j5801j3947j2036j0296q262n717l214j177Q56L496
63881G14237O485R163J1555J4164J6960J9441K1537K3581K5394K6381K6674K7162
$$ y = [2898725, 3166007, 3451638, 3753536, 4069059, 4394339, 4724278, 5053202, 5375366, 5684889, 5975523, 6240717, 6473926, 6668964, 6820524, 6924840, 6980033, 6985666, 6941878, 6849153, 6709100, 6525270, 6302924, 6047997, 5766493, 5464738, 5149551, 4827672, 4505024, 4186653, 3877087, 3580265, 3299092, 3035394, 2790491, 2565561, 2361296, 2177416, 2012793, 1866096, 1736182, 1621889, 1521657, 1433517, 1355518, 1286200, 1224697, 1170467, 1122886, 1080970, 1043419, 1009008, 977092, 947676, 920899, 896499, 873928, 852874, 833297, 814953, 797338, 780335, 764534, 750587, 738551, 728255, 719993, 714276, 711062, 709885, 710741, 714237, 720722, 729885, 741440, 755604, 772564, 792005, 813542, 837123, 862517, 888898, 915572, 942734]
63869I42734K8054K8314K7116K5007K3023K1312J9390J7157J4793J2010Q308L917
63857A171135k89l793o814r779j2950j6512k0411k4100k7003k9248l1469l3823
63845I54944l5673l6424l6204l5631l5143l4583l3305l0799k7471k4599k3099
63834F02013k2577k1988k0920j9624j8105j6116j3926j2209j1044r862q561p713
63822D19368p483p221o662o584p595q922r284q480p329o390n545m673l971l605
63808C25624l576l908m521m926m576l565k580k137k142k192k045j740j499j501
63794B84716j640j630j440j435j809k194k143j805j676j788j643r53q8L62J88
63779B65022l51q65j119j085q73o29m59l50j42L14Q58J043O86K11J48M26N44L60
$$ y = [942734, 970788, 999102, 1026218, 1051225, 1074248, 1095560, 1114950, 1132107, 1146900, 1158910, 1167218, 1171135, 1170846, 1167053, 1160239, 1150460, 1137510, 1120998, 1100587, 1076487, 1049484, 1020236, 988767, 954944, 919271, 882847, 846643, 811012, 775869, 741286, 707981, 677182, 649711, 625112, 602013, 579436, 557448, 536528, 516904, 498799, 482683, 468757, 456548, 445504, 435642, 427081, 419368, 411885, 404664, 398002, 391418, 383823, 374901, 365617, 357137, 349808, 343418, 337873, 333200, 329229, 325624, 322048, 318140, 313619, 308693, 304117, 300552, 297972, 295835, 293693, 291501, 289456, 287716, 286217, 284716, 283076, 281446, 280006, 278571, 276762, 274568, 272425, 270620, 268944, 267156, 265513, 264560, 264472, 264834, 265022, 264671, 263806, 262687, 261602, 260729, 260100, 259641, 259291, 259149, 259463, 260321, 261364, 262050, 262261, 262409, 262835, 263379, 263739]
63761B63739J68J09J20L82J133J936J954J212P60J188J781J666J051O38N41N25
63745B78903P07J182J443J089O89J043J956K594K781K963L092K662J798J314J551
63730C05767K004K248K391K513K391K042J794J713J514J162Q66M75k57q32l87
63715C25404Q49J473P62l23n77j29J16K9L12J348K688L604L720L191K599K446
63699C47512K547K203J224K87l3j26o97j646k253k274k179k262k193j642r21o17
63683C36930p66q27m55j8q7n60p00p9Q93J558J714J472Q28j35r32j167j147j464
63665C35058k091k478k404k118j773j386j241j639k192k134j365n08P4N07O69
63650C14979K09n16n09N07J728K595L430M335M577L817K952K883L316L712M484
$$ y = [263739, 263907, 264016, 264136, 264518, 265651, 267587, 269541, 270753, 271513, 272701, 274482, 276148, 277199, 277837, 278378, 278903, 279610, 280792, 282235, 283324, 284013, 285056, 287012, 289606, 292387, 295350, 298442, 301104, 302902, 304216, 305767, 307771, 310019, 312410, 314923, 317314, 319356, 321150, 322863, 324377, 325539, 326405, 326880, 326623, 325791, 325404, 326253, 327726, 328488, 328165, 327588, 327459, 327575, 327604, 327916, 329264, 331952, 335556, 339276, 342467, 345066, 347512, 350059, 352262, 353486, 353773, 353740, 353614, 352917, 351271, 349018, 346744, 344565, 342303, 340110, 338468, 337547, 336930, 336164, 335337, 334882, 334864, 334777, 334217, 333517, 333438, 334331, 335889, 337603, 339075, 339903, 339768, 338836, 337669, 336522, 335058, 332967, 330489, 328085, 325967, 324194, 322808, 321567, 319928, 317736, 315602, 314237, 313729, 313803, 314310, 314979, 315188, 314672, 314163, 314670, 316398, 318993, 322423, 326758, 331335, 335152, 338104, 340987, 344303, 348015, 352499]
63635C52499O109P773Q304Q060Q533J0195J2040J3264J4200J5341J6490J7360
63623D90168J8026J8434J8065J6687J4892J3511J2730J2098J1033R119O274K901
63611F43938k98k823m500n208m904m059l609m135n260o146o480o783p799r695
63597E72239j1879j3498j4060j3619j2522j1239j0319j0065j0065r392p542m997
63585D43042k673j105l56k71l82J14J736M076O075O924O512N372M483M725O097
63570D84369P658Q660R360J0296J1279J1860J2417J3761J5749J7265J7769J7882
63558F38325J8137J7954J6446J3592J0047O222K147j946n462p874r085r407r289
63545F79807q927q118o761n457n140n995p222q143r024j0359j1860j2756j2933
$$ y = [352499, 358608, 366381, 374685, 382745, 391278, 401473, 413513, 426777, 440977, 456318, 472808, 490168, 508194, 526628, 544693, 561380, 576272, 589783, 602513, 614611, 625644, 634763, 641037, 643938, 643640, 640817, 636317, 631109, 626205, 622146, 618537, 614402, 609142, 602996, 596516, 589733, 581934, 572239, 560360, 546862, 532802, 519183, 506661, 495422, 485103, 475038, 464973, 455581, 448039, 443042, 440369, 439264, 438908, 438637, 438255, 438369, 440105, 444181, 450256, 457180, 463692, 469064, 473547, 478272, 484369, 492027, 500687, 510047, 520343, 531622, 543482, 555899, 569660, 585409, 602674, 620443, 638325, 656462, 674416, 690862, 704454, 714501, 720723, 722870, 720924, 715462, 707588, 698503, 689096, 679807, 670880, 662762, 656001, 650544, 645404, 639409, 632187, 624044, 615020, 604661, 592801, 580045, 567112]
63532E67112j3103j3763j4494j4534j3705j2564j1790j1647j1851j1802j0998
63521D26861r502q071p574q052q440p581n590l846l389l711l511k466j540j554
63507C52034k185k679k926l270l581l275k205r70j85J65M35P62J051J321J683
63492C36175K063K221K090J931K027K335K576K615K643K940L489L897L723K917
63478C73642J803O57n37j781k723k919k484k036j864j555p57L0J6o52q35K00J868
63461C60073L060L479L741M371N178N752O167O944Q394J0241J1937J3226J4310
63448D56873J5488J6767J7794J8081J7301J5567J3473J1597R882P798N353L532
63436F09506L333M621O404Q083R887J2068J4322J6102J7085J7160J6313J4726
$$ y = [567112, 554009, 540246, 525752, 511218, 497513, 484949, 473159, 461512, 449661, 437859, 426861, 417359, 409288, 401714, 393662, 385222, 377641, 372051, 368205, 364816, 361105, 357594, 355128, 353588, 352034, 349849, 347170, 344244, 340974, 337393, 334118, 331913, 330943, 330758, 330923, 331358, 332120, 333171, 334492, 336175, 338238, 340459, 342549, 344480, 346507, 348842, 351418, 354033, 356676, 359616, 363105, 367002, 370725, 373642, 375445, 376102, 375565, 373784, 371061, 368142, 365658, 363622, 361758, 360203, 359446, 359476, 359492, 358840, 358005, 358205, 360073, 363133, 366612, 370353, 374724, 379902, 385654, 391821, 398765, 407159, 417400, 429337, 442563, 456873, 472361, 489128, 506922, 525003, 542304, 557871, 571344, 582941, 592823, 600621, 605974, 609506, 612839, 617460, 623864, 631947, 641834, 653902, 668224, 684326, 701411, 718571, 734884, 749610]
63424G49610J2661J0199P338M339J559j032l643n964p272p411p061o830o661o477
63410G33355o772q083j0294j2835j5271j7341j8782j9502j9680j9378j8466j7084
63398E49867j5759j4719j3578j2035j0397r003p666o121m561l218j885l67J073
63385D51631K250L572N330P000P955Q452R147R997J0576J1145J2413J4306J5892
63372E69666J6677J7166J7947J8870J9365J9054J7901J6136J4079J1738Q739N050
63360G52388J483j031k545l835n234o354o797o619o074n621n963p444r507j1318
63346F75529j2777j4247j5553j6162j6118j5935j5563j4499j2833j1167r472p186
63334E14017m621l032k921l424l878m853o891r244j0782j1394j1607j1482j0851
$$ y = [749610, 762271, 772470, 779808, 784147, 785706, 784674, 781031, 775067, 767795, 760384, 753323, 746493, 739832, 733355, 726583, 718500, 708206, 695371, 680100, 662759, 643977, 624475, 604795, 585417, 566951, 549867, 534108, 519389, 505811, 493776, 483379, 474376, 466710, 460589, 456028, 452810, 450925, 450558, 451631, 453881, 457453, 462783, 469783, 477738, 486190, 495337, 505334, 515910, 527055, 539468, 553774, 569666, 586343, 603509, 621456, 640326, 659691, 678745, 696646, 712782, 726861, 738599, 747338, 752388, 753871, 752840, 750295, 746460, 741226, 734872, 728075, 721456, 715382, 709761, 703798, 696354, 686847, 675529, 662752, 648505, 632952, 616790, 600672, 584737, 569174, 554675, 541842, 530675, 521203, 514017, 509396, 506364, 503443, 500019, 496141, 491288, 484397, 475153, 464371, 452977, 441370, 429888, 419037]
63321D19037j0068r551q920p559n820m742m598m531l777k549j542j074r83r84
63307C52339q91o23k01K53N52N29J75k50m77n26n98o96o81o43q31j134j092n68
63289C44637l0N8k76p33j158j432j338p96l4O47J056J036N61M1P9P35J374J497
63271C45924J354J496K034K624K933K909K691K414K046J487R81J104J976K796
63257C74769K767K266K338L170L985M386M755N185N133M549M270M718N159N002
63243D32452M926N887P680R365J0541J1426J2170J2946J4168J5802J6910J6813
63231E71086J6247J6380J7063J7094J6122J5220J5403J6445J7334J7331J6454
63220G52179J5447J5251J6038J6788J6357J4844J3328J2389J1465R718O862L157
$$ y = [419037, 408969, 399418, 390498, 382939, 377119, 372377, 367779, 363248, 359471, 356922, 355380, 354306, 353323, 352339, 351448, 350825, 350624, 350877, 351429, 351958, 352133, 351883, 351406, 350880, 350282, 349586, 348905, 348262, 347431, 346297, 345205, 344637, 344607, 344665, 344389, 343656, 342498, 341066, 339728, 338932, 338898, 339545, 340601, 341637, 342198, 342239, 342318, 343053, 344427, 345924, 347278, 348774, 350808, 353432, 356365, 359274, 361965, 364379, 366425, 367912, 368893, 369997, 371973, 374769, 377536, 379802, 382140, 385310, 389295, 393681, 398436, 403621, 408754, 413303, 417573, 422291, 427450, 432452, 437378, 443265, 450945, 460310, 470851, 482277, 494447, 507393, 521561, 537363, 554273, 571086, 587333, 603713, 620776, 637870, 653992, 669212, 684615, 701060, 718394, 735725, 752179, 767626, 782877, 798915, 815703, 832060, 846904, 860232, 872621, 884086, 893804, 900666, 903823]
63208I03823r08m790q190j1206j3910j5957j7074j7648j8232j8627j8103j6474
63196G42704j4281j1941r433o808m349k030N06L275N801P823R642J1516J3254
63183G45679J4623J5730J6769J7688J8358J8771J8948J8917J8842J8888J8957
63172I42170J8812J8421J7802J6685J4823J2605J0675Q870O180K069k695o885
63160A059532j0108j2953j6121j9763k3412k6326k8021k8634k8677k8430k7714
63149H09373k6250k4068k1525j9220j7629j6591j5273j3095j0562q630p433o296
63137F22801m952l869l214k420j249m13n22j017r44l43Mj23j70J90O28Q47R59
63120F06193R68N54k46p16k45Q07J524J472R16J89o31j375j697j564j424j563
$$ y = [903823, 902915, 898125, 889935, 878729, 864819, 848862, 831788, 814140, 795908, 777281, 759178, 742704, 728423, 716482, 707049, 700241, 695892, 693862, 694368, 697643, 703444, 711267, 720909, 732425, 745679, 760302, 776032, 792801, 810489, 828847, 847618, 866566, 885483, 904325, 923213, 942170, 960982, 979403, 997205, 1013890, 1028713, 1041318, 1051993, 1060863, 1067043, 1069112, 1066417, 1059532, 1049424, 1036471, 1020350, 1000587, 977175, 950849, 922828, 894194, 865517, 837087, 809373, 783123, 759055, 737530, 718310, 700681, 684090, 668817, 655722, 645160, 636530, 629097, 622801, 617849, 613980, 610766, 608346, 607097, 606684, 606162, 605145, 604201, 603858, 603862, 603739, 603569, 603759, 604387, 605234, 606193, 607161, 607715, 607469, 606753, 606508, 607315, 608839, 610311, 611227, 611416, 610785, 609410, 607713, 606149, 604725, 603162]
63104F03162j629j188m94k00l68l92L7M73M68K94M56R02J192J212J239J440J766
63087F08370K243K880L332L136K388J764J731K048K305K607L417M834O293P073
63073F54421P038O794O983P582Q090Q463R358J1161J3188J4404J4759J5198J6377
63060G93816J7967J9417K0844K2680K4872K6882K8474K9951L1542L2946L3835
63049A083226L4531L5686L7227L8202L8044L7485L7516L7839L7267L5682L4437
63038A487142L4482L5067L4976L4179L3281L2097K9861K6538K2744J8532J3343
63027A802242P134N64o071j3059k0261k6856l2349l6958m0676m2845m3178m2316
63015A505371m0868l8665l5506l1892k8284k4314j9449j3955q444k955K720Q223
$$ y = [603162, 601533, 600345, 599851, 599651, 599283, 598891, 598928, 599401, 599869, 600163, 600619, 601521, 602713, 603925, 605164, 606604, 608370, 610613, 613493, 616825, 619961, 622349, 624113, 625844, 627892, 630197, 632804, 636221, 641055, 647348, 654421, 661459, 668253, 675236, 682818, 690908, 699371, 708729, 719890, 733078, 747482, 762241, 777439, 793816, 811783, 831200, 852044, 874724, 899596, 926478, 954952, 984903, 1016445, 1049391, 1083226, 1117757, 1153443, 1190670, 1228872, 1266916, 1304401, 1341917, 1379756, 1417023, 1452705, 1487142, 1521624, 1556691, 1591667, 1625846, 1659127, 1691224, 1721085, 1747623, 1770367, 1788899, 1802242, 1809376, 1809940, 1803869, 1790810, 1770549, 1743693, 1711344, 1674386, 1633710, 1590865, 1547687, 1505371, 1464503, 1425838, 1390332, 1358440, 1330156, 1305842, 1286393, 1272438, 1263994, 1261039, 1263759, 1271982]
63003A271982J2992J7176K1332K5373K8693L1242L3620L5997L7775L8481L8326
62992A592989L7706L6796L5886L5357L4928L3578L0726K7015K3327J9543J4891
62981A922742R188K881l904j1491j9656k7417l4239m0721m7453n3720n8152o0417
62969A577641o1366o1585o0733n8627n6021n3640n1063m7486m3236l9621l7205
62958A007058l5130l2431k9352k6766k4807k2714k0005j7230j5332j4553j4187
62947G54551j3453j2338j1432j1019j0656r795q527p402o663o073n417m768m128
62934F42880l204j891p08l72r82j841k172j834j271r34r67j369k198l349m359
62919F15429m735m527m258m229m198l850l290k758k225j569j044j156k067l311
$$ y = [1271982, 1284974, 1302150, 1323482, 1348855, 1377548, 1408790, 1442410, 1478407, 1516182, 1554663, 1592989, 1630695, 1667491, 1703377, 1738734, 1773662, 1807240, 1837966, 1864981, 1888308, 1907851, 1922742, 1931930, 1934811, 1930907, 1919416, 1899760, 1872343, 1838104, 1797383, 1749930, 1696210, 1638058, 1577641, 1516275, 1454690, 1393957, 1335330, 1279309, 1225669, 1174606, 1127120, 1083884, 1044263, 1007058, 971928, 939497, 910145, 883379, 858572, 835858, 815853, 798623, 783291, 768738, 754551, 741098, 728760, 717328, 706309, 695653, 685858, 677331, 669929, 663266, 657193, 651776, 647008, 642880, 639676, 637785, 637077, 636705, 635723, 633882, 631710, 629876, 628605, 627671, 626704, 625335, 623137, 619788, 615429, 610694, 606167, 601909, 597680, 593482, 589632, 586342, 583584, 581359, 579790, 578746, 577590, 575523, 572212]
62905E72212m080l831k798j885j720j792j062L99J163L01j208j715r93j93q2l98
62889E52318p81j191j375r13j48mo27j057p61m56q51j360j026j30J04q22k019
62872E38901k240j068Q38K322K617J970J241Q32L72l21o72k22M72N93K75K60N35
62855E46705K97o27j278q55J31N67J72l17k83J0r1o90j180r94k41N07R23J091
62837E43847J060O62o5n68l12N03J153J171P17J98n9J64R12J868K504K594K355
62820E58704K014J468O34o3K8R98K161K765K642K110J503J107J266K081L052L558
62804E86028L705M262N566P047Q105Q915R958J1215J2376J3516J4927J6547J8195
62791G20362K0188K2971K6227K9099L1369L3676L6393L9034M1146M3085M5504
$$ y = [572212, 568132, 564301, 561503, 559618, 557898, 556106, 555044, 555443, 556606, 556907, 555699, 553984, 552991, 552798, 552716, 552318, 551537, 550346, 548971, 548058, 547910, 547906, 547279, 546222, 545461, 545005, 544154, 542794, 541768, 541638, 541742, 540920, 538901, 536661, 535593, 536431, 538753, 541370, 543340, 544581, 545413, 545785, 545464, 544792, 544570, 545042, 545635, 545910, 546170, 546705, 547002, 546375, 545097, 544242, 544373, 544940, 545112, 544795, 544512, 544522, 544431, 543741, 542561, 541567, 541326, 541833, 542756, 543847, 544907, 545569, 545504, 544936, 544624, 545127, 546280, 547451, 548168, 548366, 548307, 548471, 549383, 551251, 553755, 556349, 558704, 560718, 562186, 562820, 562757, 562785, 563783, 565944, 568709, 571351, 573461, 574964, 576071, 577337, 579418, 582470, 586028, 589733, 593995, 599561, 606608, 614713, 623628, 633586, 644801, 657177, 670693, 685620, 702167, 720362, 740550, 763521, 789748, 818847, 850216, 883892, 920285, 959319, 1000465, 1043550, 1089054]
62780A089054M8464N1466N4036N5883N6723N6274N4319N0692M5399L8802L1372
62769A632484K3193J4147M551m839j3631k2056l0259l7821m4254m9461n3468n6092
62757A362494n7238n7122n6000n4069n1804m9816m8045m5665m2206l8237l4527
62746H27765l1105k7707k4631k2356k0622j8634j6135j3629j1586r951q500p265
62734F15644o422o018n781n189l869k108o82M5N71J565K999M272N018N447O088
62719F11580P403R383J1393J2712J3458J4530J6464J8793K0892K2861K5127K7719
62707H12315L0552L3935L8054M2320M6047M9528N3637N8464O3091O6634O8806
62696A363383O9431O8275O5494O1647N6953N0941M3106L3570K2966J1876N37j1062
$$ y = [1089054, 1137518, 1188984, 1243020, 1298903, 1355626, 1411900, 1466219, 1516911, 1562310, 1601112, 1632484, 1655677, 1669824, 1674375, 1669536, 1655905, 1633849, 1603590, 1565769, 1521515, 1472054, 1418586, 1362494, 1305256, 1248134, 1192134, 1138065, 1086261, 1036445, 988400, 942735, 900529, 862292, 827765, 796660, 768953, 744322, 721966, 701344, 682710, 666575, 652946, 641360, 631409, 622909, 615644, 609222, 603204, 597423, 592234, 588365, 586257, 585575, 585620, 586191, 587756, 590755, 595027, 600045, 605492, 611580, 618983, 628366, 639759, 652471, 665929, 680459, 696923, 715716, 736608, 759469, 784596, 812315, 842867, 876802, 914856, 957176, 1003223, 1052751, 1106388, 1164852, 1227943, 1294577, 1363383, 1432814, 1501089, 1566583, 1628230, 1685183, 1736124, 1779230, 1812800, 1835766, 1847642, 1848179, 1837117]
62684A837117k2797l3986m3551n0896n6440o0941o4480o6508o6784o5698o3769
62673A241267o1256n8312n5075n1551m7761m3966m0432l7027l3458k9870k6851
62662G55708k4724k3114k1275j8795j6023j3830j2749j2241j1256r594q166p640
62650E76301p508p046o462o242n997n078l943l657m138m139l178k228k114k293
62636E12278j900j067m41j12K05L40j34j090j908k225k180j924j418p39k23j08
62620D97354k18j31L82J133J777K220K667L250L895M649N725O965P692P612P508
62605E52480Q378J0114J1784J3121J4801J7161J9499K1122K2332K3810K5548K6946
62593G67096K7683K7921K7806K7146K5601K2925J9110J4484R571M786L14l771
$$ y = [1837117, 1814320, 1780334, 1736783, 1685887, 1629447, 1568506, 1504026, 1437518, 1370734, 1305036, 1241267, 1180011, 1121699, 1066624, 1015073, 967312, 923346, 882914, 845887, 812429, 782559, 755708, 730984, 707870, 686595, 667800, 651777, 637947, 625198, 612957, 601701, 592107, 583941, 576301, 568793, 561747, 555285, 549043, 543046, 537968, 534025, 530368, 526230, 522091, 518913, 516685, 514571, 512278, 510378, 509311, 508870, 508758, 508963, 509303, 509169, 508079, 506171, 503946, 501766, 499842, 498424, 497685, 497462, 497354, 497136, 497005, 497387, 498520, 500297, 502517, 505184, 508434, 512329, 516978, 522703, 529668, 537360, 544972, 552480, 560858, 570972, 582756, 595877, 610678, 627839, 647338, 668460, 690792, 714602, 740150, 767096, 794779, 822700, 850506, 877652, 903253, 926178, 945288, 959772, 969343, 974129, 974443, 970672]
62581I70672p516j1172j4944j8589k1600k3821k5548k6848k7282k6494k4825k3022
62569G19011k1543k0327j9119j7748j6198j4541j2862j1259r907q935q182p250
62557E51140o069n065m558m256l756l239l055k990k559j897j592j641j369n43
62543E08551K19L51L0k67l16LQ16J939K926L666M486N515O488P322Q273R340J0222
62526E69564J1086J2596J4869J7177J9113K1232K4014K6970K9529L2053L5055
62515H13258L7994L9823M0479M0797M1084M0726L9194L6684L3547K9794K5350
62504A218730K0329J4903R269L807j050n189q796j1953j4555j6587j8151j9318
62492A171439k0177k1014k2142k3544k4907k5970k6688k7149k7572k8208k9037
$$ y = [970672, 963156, 951984, 937040, 918451, 896851, 873030, 847482, 820634, 793352, 766858, 742033, 719011, 697468, 677141, 658022, 640274, 624076, 609535, 596673, 585414, 575507, 566572, 558390, 551140, 545071, 540006, 535448, 531192, 527436, 524197, 521142, 518152, 515593, 513696, 512104, 510463, 509094, 508551, 508770, 509121, 509151, 508884, 508568, 508571, 509387, 511326, 514252, 517918, 522404, 527919, 534407, 541729, 550002, 559342, 569564, 580650, 593246, 608115, 625292, 644405, 665637, 689651, 716621, 746150, 778203, 813258, 851252, 891075, 931554, 972351, 1013435, 1054161, 1093355, 1130039, 1163586, 1193380, 1218730, 1239059, 1253962, 1263231, 1267038, 1265988, 1260799, 1252003, 1240050, 1225495, 1208908, 1190757, 1171439, 1151262, 1130248, 1108106, 1084562, 1059655, 1033685, 1006997, 979848, 952276, 924068, 895031]
62481H95031k9649k9636k8983k7874k6360k4445k2319k0224j8250j6458j4986
62470F35847j3779j2516j1060r675q479p099n325l725k939k611j775k70J031J512
62456E59137J662K285L466M772O006P224Q176Q344P653O771O442O640O649N942
62442F41169M694L361K036N36j057k411l464m460n430o078o342o576o959p162
62428F01857o915o456o057n467m297k649r43O41K100L317M213M999N790O307O353
62413F02793O315O613P025P138P201P703Q318Q107O817N156L747K547J446O10
62399F81536l1q94j970k592k421k098k425l367m264m600m167k996j671j203j914
62384F44923k759k441r60O36J775K817M025N005N536O196P667R829J2042J4046
$$ y = [895031, 865382, 835746, 806763, 778889, 752529, 728084, 705765, 685541, 667291, 650833, 635847, 622068, 609552, 598492, 588817, 580338, 573239, 567914, 564189, 561250, 558639, 556864, 556594, 557625, 559137, 560799, 563084, 566550, 571322, 577328, 584552, 592728, 601072, 608725, 615496, 621938, 628578, 635227, 641169, 645863, 649224, 651260, 651796, 650739, 648328, 644864, 640404, 634974, 628896, 622554, 615978, 609019, 601857, 594942, 588486, 582429, 576962, 572665, 570016, 569073, 569714, 571814, 575131, 579344, 584343, 590133, 596440, 602793, 609108, 615721, 622746, 629884, 637085, 644788, 653106, 661213, 668030, 673186, 676933, 679480, 680926, 681536, 681505, 680611, 678641, 676049, 673628, 671530, 669105, 665738, 661474, 656874, 652707, 649711, 648040, 646837, 644923, 642164, 639723, 638763, 639399, 641174, 643991, 648016, 653021, 658557, 664753, 672420, 682249, 694291, 708337]
62370G08337J6083J8374K0891K3551K6228K8630L0450L1698L2542L2860L2293
62359A001937L0717K8340K5234K1256J6615J2116Q451N488K625l68l303o177r261
62346A133670j2510j5392j7534j9106k0348k1100k1163k0857k0765k0989k1050
62335I22856k0536j9555j8454j7419j6527j5946j5887j6283j6738j6839j6458
62324G32214j5724j4789j3763j2762j1869j0970r855q530p304o423n711m749l377
62311F06388j828n33J70K36M8J70Q15J667K352K839L162L062K423J794J898K668
62295F27331L312L311K855K280J737J485J914K886L678L806L588L554L825M324
62281F69886N136O276P484Q596R738J0858J1555J1803J2379J4038J6584J9260
$$ y = [708337, 724420, 742794, 763685, 787236, 813464, 842094, 872544, 904242, 936784, 969644, 1001937, 1032654, 1060994, 1086228, 1107484, 1124099, 1136215, 1144666, 1150154, 1152779, 1152411, 1149108, 1142931, 1133670, 1121160, 1105768, 1088234, 1069128, 1048780, 1027680, 1006517, 985660, 964895, 943906, 922856, 902320, 882765, 864311, 846892, 830365, 814419, 798532, 782249, 765511, 748672, 732214, 716490, 701701, 687938, 675176, 663307, 652337, 642482, 633952, 626648, 620225, 614514, 609765, 606388, 604560, 604027, 604197, 604433, 604481, 604651, 605466, 607133, 609485, 612324, 615486, 618548, 620971, 622765, 624663, 627331, 630643, 633954, 636809, 639089, 640826, 642311, 644225, 647111, 650789, 654595, 658183, 661737, 665562, 669886, 675022, 681298, 688782, 697378, 707116, 717974, 729529, 741332, 753711, 767749, 784333, 803593]
62269H03593K1781K4379K7052K9396L1162L2496L3646L4748L5794L6475L6146
62258A146668L4317L1132K7110K2573J7636J2524P458K335l021q407j3347j7600
62246A259378k1258k4521k7679l1007l4290l6569l6938l5483l3116l0633k8367
62235I19517k6475k4918k3231k0923j8180j5695j3810j2370j1290j0671j0224
62224G31730r309p810o393n594n141m492l632k882k279j550o75K2K89K91M06P94
62208F83775J205J265J070J275K379L975N035M987M269L774M016M914O023O775
62194G34737O763O133N598N766O405O546N508L781K641K838L787M283L904L352
62180H02042L521M600O203P945R673J1418J3392J5689J7846J9085J9188J8704
$$ y = [803593, 825374, 849753, 876805, 906201, 937363, 969859, 1003505, 1038253, 1074047, 1110522, 1146668, 1180985, 1212117, 1239227, 1261800, 1279436, 1291960, 1299418, 1301753, 1298732, 1290325, 1276978, 1259378, 1238120, 1213599, 1185920, 1154913, 1120623, 1084054, 1047116, 1011633, 978517, 947884, 919517, 893042, 868124, 844893, 823970, 805790, 790095, 776285, 763915, 752625, 741954, 731730, 722421, 714611, 708218, 702624, 697483, 692991, 689359, 686477, 684198, 682648, 681973, 681995, 682284, 682575, 682981, 683775, 684980, 686245, 687315, 688590, 690969, 694944, 699979, 704966, 709235, 713009, 717025, 721939, 727962, 734737, 741500, 747633, 753231, 758997, 765402, 771948, 777456, 781237, 783878, 786716, 790503, 794786, 798690, 802042, 805563, 810163, 816366, 824311, 833984, 845402, 858794, 874483, 892329, 911414, 930602, 949306]
62168I49306J8016J6744J4556J1920R398O709L287n02l634n778p595r650j1868
62155I90909j4058j6205j8021j8967j8983j8685j8584j8582j8359j7774j6657
62144G96034j4795j2357r924p908o352n352n190n801o652p352p929q363q349p781
62130F81929o964o091m893l200j320L86J956L567N128O391P182P322O670N427
62116G03490M082K881J723N66m73j483k617l571l929m125n156p045q516q762q570
62101F58495q921r266q355o175l980k601j699o53P27K369M102N561O544P397Q522
62086F52067R630J0180J0395J1069J2367J3628J4429J5080J5904J6828J7890J9353
62074H18820K0994K1983K1911K1306K0681J9636J7508J4451J1246Q289N333K110
$$ y = [949306, 967322, 984066, 998622, 1010542, 1019940, 1026649, 1029936, 1029434, 1025800, 1020022, 1012427, 1002777, 990909, 976851, 960646, 942625, 923658, 904675, 885990, 867406, 848824, 830465, 812691, 796034, 781239, 768882, 758958, 751050, 744698, 739346, 734156, 728355, 721703, 714351, 706422, 698059, 689710, 681929, 674965, 668874, 663981, 660781, 659461, 659847, 661803, 665370, 670498, 676889, 684071, 691393, 698063, 703490, 707572, 710453, 712176, 712742, 712269, 710786, 708169, 704598, 700669, 696544, 691388, 684343, 675827, 667065, 658495, 649574, 640308, 631953, 625778, 621798, 619197, 617498, 616845, 617572, 619941, 624043, 629604, 636148, 643545, 652067, 661697, 671877, 682272, 693341, 705708, 719336, 733765, 748845, 764749, 781577, 799467, 818820, 839814, 861797, 883708, 905014, 925695, 945331, 962839, 977290, 988536, 996825, 1002158, 1004268]
62062A004268j311m690p801j0461j2664j4543j6040j6917j7305j7854j8883j9718
62050H46081j9471j8292j7218j6782j6462j5635j4461j3488j2884j2425j2011
62039F76952j1799j1925j2324j2766j2934j2656j2091j1555j1036j0210r058q077
62027E40521p652p531p315p099p132p107o426n150l962l153k273j087k11l49j238
62012D72836j903j764j057k74L12O56Q57J138J644K125K165J738J280J056P53
61997D81562n1j243k293k945l429l983m516m944n463o108o302n506m199l498l612
61982D23470l471k366j187j214k193k709k164j339r70q56p20q21j252j484j158
61967C99566o10j17O02J547J981J551J126J583K454K804K896L714N192O227O407
$$ y = [1004268, 1002957, 998267, 990466, 980005, 967341, 952798, 936758, 919841, 902536, 884682, 865799, 846081, 826610, 808318, 791100, 774318, 757856, 742221, 727760, 714272, 701388, 688963, 676952, 665153, 653228, 640904, 628138, 615204, 602548, 590457, 578902, 567866, 557656, 548598, 540521, 532869, 525338, 518023, 510924, 503792, 496685, 490259, 485109, 481147, 477994, 475721, 474634, 474423, 474074, 472836, 470933, 469169, 468112, 467838, 468150, 468806, 469663, 470801, 472445, 474570, 476735, 478473, 479753, 480809, 481562, 481511, 480268, 477975, 475030, 471601, 467618, 463102, 458158, 452695, 446587, 440285, 434779, 430580, 427082, 423470, 419999, 417633, 416446, 415232, 413039, 410330, 408166, 406827, 405857, 405001, 404281, 403460, 402208, 400724, 399566, 398956, 398839, 399441, 400988, 402969, 404520, 405646, 407229, 409683, 412487, 415383, 419097, 424289, 430516, 436923]
61952D36923O487P082P941Q846J0105J1767J3139J3619J3447J3238J3306J3670
61940E69570J4215J4568J4306J3465J2504J1621J0600R405Q236O985N269L237
61928F93981J627P64J51o50j359j578j460j359j218o57P09L140O450R595J1308
61913G19444J1405J0892J0484R822Q446O743N207L555J317j217l364m983o323
61900G71428p312p728p758p759p730p616p792q468r003q677p924p820q425q655
61886F58761p949p094o906o952o284m896l664l089k754k111j203l32N38J671L051
61871F10787M394N665P083Q514R370R442R446J0216J1615J2898J3902J5145J6804
61858G45281J8407J9773K1319K3106K4356K4466K3954K3647K3419K2386K0123
$$ y = [436923, 443410, 450492, 458433, 467279, 477384, 489151, 502290, 515909, 529356, 542594, 555900, 569570, 583785, 598353, 612659, 626124, 638628, 650249, 660849, 670254, 678490, 685475, 690744, 693981, 695608, 696372, 696523, 695873, 694514, 692936, 691476, 690117, 688899, 688242, 688951, 692091, 698541, 708136, 719444, 730849, 741741, 752225, 762047, 770493, 777236, 782443, 785998, 787315, 786098, 782734, 777751, 771428, 764116, 756388, 748630, 740871, 733141, 725525, 717733, 709265, 700262, 691585, 683661, 675841, 667416, 658761, 650812, 643718, 636812, 629860, 623576, 618680, 615016, 611927, 609173, 607062, 605859, 605527, 606065, 607736, 610787, 615181, 620846, 627929, 636443, 645813, 655255, 664701, 674917, 686532, 699430, 713332, 728477, 745281, 763688, 783461, 804780, 827886, 852242, 876708, 900662, 924309, 947728, 970114, 990237]
61847I90237J7077J3891J0859P950N059K208k94k016k909l322l296k366l33K116
61833A034861M023N104N683N958N862N321M257K437k58l591p201j0829j4104j6557
61819A020966j8180j9528k0859k1665k1511k0823k0246j9666j8606j7173j5839
61808H06870j4571j3018j1345j0090r228q226o946n831n116m580m125l915l883
61795G05996l701l351l105k914k408j670j316j674k344k737k594j923j002m75
61781F74782q82j844k291j684n48L15O98R17J399K434L815M615L969K319J183
61766F89197J360K023J980J224N68K70k15j203k330l140l696m375n343o376p089
61751F62855p294p162o976o794o452n894n250m595l907l352l264l621l815l263
$$ y = [990237, 1007314, 1021205, 1032064, 1040014, 1045073, 1047281, 1046987, 1044971, 1042062, 1038740, 1035444, 1033078, 1032745, 1034861, 1038884, 1043988, 1049671, 1055629, 1061491, 1066812, 1071069, 1073506, 1073248, 1069657, 1062456, 1051627, 1037523, 1020966, 1002786, 983258, 962399, 940734, 919223, 898400, 878154, 858488, 839882, 822709, 806870, 792299, 779281, 767936, 757846, 748618, 740392, 733446, 727615, 722499, 717919, 713794, 709879, 705996, 702295, 698944, 695839, 692925, 690517, 688847, 687531, 685857, 683513, 680776, 678182, 676259, 675257, 674782, 673900, 672056, 669765, 668081, 667533, 667848, 668546, 669463, 670862, 673296, 677111, 681726, 685695, 688014, 689197, 690557, 692580, 694560, 695784, 696352, 696622, 696407, 695204, 692874, 689734, 686038, 681663, 676320, 669944, 662855, 655561, 648399, 641423, 634629, 628177, 622283, 617033, 612438, 608531, 605179, 601915, 598294, 594479, 591216]
61737E91216k178j430j689k835m134m757m234k741j199p15j553k617k463r90L16
61722E57997K22n88m61P81J464L87j477k386k107j873k476l480m190m444m401
61707E32968m241m267m658n121n271n222n230m902l720k238j740k455l144k820
61693D77939k000j651j795j869j790j834j887j664j400j597k181k562k461k144
61679D51104j946j930j995j938j577j080r70j428j917j924j747j938k244j833
61665D26637n40Q88J766K044J799J054K88L62J344K101J714Q32P97J772K627K665
61649D48150K491K818L221K738J279j97q99j020j306k108l021l329k775j863j361
61634D42818j457j697j728j693j701j424p76m79j208k409k833k187j364r55n80
$$ y = [591216, 589038, 587608, 585919, 583084, 578950, 574193, 569959, 567218, 566019, 565304, 563751, 561134, 558671, 557681, 557997, 558219, 557631, 557170, 557951, 559415, 559802, 558325, 555939, 553832, 551959, 549483, 546003, 541813, 537369, 532968, 528727, 524460, 519802, 514681, 509410, 504188, 498958, 494056, 490336, 488098, 486358, 483903, 480759, 477939, 475939, 474288, 472493, 470624, 468834, 467000, 465113, 463449, 462049, 460452, 458271, 455709, 453248, 451104, 449158, 447228, 445233, 443295, 441718, 440638, 439668, 438240, 436323, 434399, 432652, 430714, 428470, 426637, 426097, 426985, 428751, 430795, 432594, 433648, 433936, 434298, 435642, 437743, 439457, 440289, 441086, 442858, 445485, 448150, 450641, 453459, 456680, 459418, 460697, 460500, 459601, 458581, 457275, 455167, 452146, 448817, 446042, 444179, 442818, 441361, 439664, 437936, 436243, 434542, 433118, 432342, 431863, 430655, 428246, 425413, 423226, 421862, 420907, 420327]
61619D20327OK08l98j161j299j107j358j959k129j695j315j447j818j921j534
61604D01400p95k02l55j217j885j680j123j158j702j862j426j111j264j337q78
61589C83405k06K41M74N59L33j20l63k71k05k23J06P68R60K74n24n74j75j29l08
61570C84022M9Q70J117L51n04l98M72J109J172J288J889K387J904N61n33n84M9
61553C95221N36O13N27L73J04J8N25J433K071K227K349K662K762K420K192K670
61537D18703L508L745K982J738P30J65j90n57r44j251j460j596j640j583j608
61522D20742j906k224j966j113n76j110k064j981m36J448K350K046J104K0r37
61507D13397j501j494r59r6Q05J298J127O81O88J339K140K729L271L841M029L571
$$ y = [420327, 420333, 420541, 420143, 418982, 417683, 416576, 415218, 413259, 411130, 409435, 408120, 406673, 404855, 402934, 401400, 400605, 400403, 400048, 398831, 396946, 395266, 394143, 392985, 391283, 389421, 387995, 386884, 385620, 384283, 383405, 383199, 383440, 383914, 384473, 384806, 384686, 384323, 384052, 383847, 383624, 383730, 384498, 385458, 385732, 385208, 384634, 384459, 384330, 384022, 384071, 384941, 386058, 386409, 385905, 385507, 385979, 387088, 388260, 389548, 391437, 393824, 395728, 396289, 395756, 395172, 395221, 395757, 396370, 396897, 397270, 397374, 397392, 397917, 399350, 401421, 403648, 405997, 408659, 411421, 413841, 416033, 418703, 422211, 425956, 428938, 430676, 431406, 431571, 431381, 430824, 429880, 428629, 427169, 425573, 423933, 422350, 420742, 418836, 416612, 414646, 413533, 412957, 411847, 409783, 407802, 407366, 408814, 411164, 413210, 414314, 414334, 413397, 411896, 410402, 409443, 409347, 410152, 411450, 412577, 413258, 413946, 415285, 417425, 420154, 423425, 427266, 431295, 434866]
61491D34866K846K426K354K259J858J100J23p02j009q66o61m56Q2R96J858K383
61475D49457K678K651J910O04l52m20j42k04m15k63J12L13N64J252J925J736P87
61458D62193R2J54M05L33L13R22J867K232J608O38L28R82J924K330K218K319K977
61441D83835L637L647L155K755K581K289J802J509J635J876J802J379R44P75P75
61426E14396N81j0p30j136j175j260j669k168k340k051j474q73n02m90o82q07
61410D97610q34q99r23p34n19o26q90p33j52J86P2J35O41P88j7r42p88K31P92
61391D92398L56k57j38P42J858K662K644J692N45K70J041J966K315K331K581L112
61375E16118L612L974M240M263L859L208K806K998L718M663N586O365O934P233
$$ y = [434866, 437712, 440138, 442492, 444751, 446609, 447709, 447832, 447130, 446121, 445255, 444594, 444138, 444220, 445216, 447074, 449457, 452135, 454786, 456696, 457300, 456948, 456528, 456386, 456182, 455767, 455504, 455616, 455929, 456493, 457745, 459670, 461406, 462193, 462285, 462439, 462844, 463177, 463490, 464412, 466279, 468511, 470119, 470757, 471085, 472067, 473991, 476321, 478539, 480858, 483835, 487472, 491119, 494274, 497029, 499610, 501899, 503701, 505210, 506845, 508721, 510523, 511902, 512846, 513621, 514396, 514977, 514967, 514237, 513101, 511926, 510666, 508997, 506829, 504489, 502438, 500964, 500091, 499589, 499099, 498417, 497610, 496776, 495877, 494954, 494220, 493701, 493075, 492185, 491452, 491300, 491486, 491558, 491693, 492334, 493122, 493105, 492163, 491375, 491606, 492398, 492754, 492497, 492359, 493101, 494959, 497621, 500265, 501957, 502502, 502772, 503813, 505779, 508094, 510425, 513006, 516118, 519730, 523704, 527944, 532207, 536066, 539274, 542080, 545078, 548796, 553459, 559045, 565410, 572344, 579577]
61361E79577P332P512Q013Q632Q752P981O588N173M033L050K103J303P89M15j49
61346F51104j028j900k395k709l401m408m784l941k721k441l097l445k791j686
61332F10357p04K55J110J272Q53J056K461L866L947L290L485M785O043O677P340
61317F56093Q592J0126J1556J2934J4136J4579J3935J2553J0933R258P584N996
61305G88275M438K814J320K23n36j078j150o26k24q20k073k643j951q47l28l37
61289G84457l35k46l02l54P1J143K470L449L766L718L948M659N331N577N868O787
61273H30007P848Q029P439P377Q499R892J0432J0132R559Q606O779M296K020M57
61259I31372o43j686k721l587m202m665n091n386n142m017k216l12J414L081M592
$$ y = [579577, 586909, 594421, 602434, 611066, 619818, 627799, 634387, 639560, 643593, 646643, 648746, 650049, 650838, 651253, 651104, 650076, 648176, 645781, 643072, 639671, 635263, 630479, 626538, 623817, 621376, 618279, 614834, 612043, 610357, 609653, 609908, 611018, 612290, 613143, 614199, 616660, 620526, 624473, 627763, 631248, 636033, 642076, 648753, 656093, 664685, 674811, 686367, 699301, 713437, 728016, 741951, 754504, 765437, 774695, 782279, 788275, 792713, 795527, 796847, 797070, 796534, 795456, 794306, 793680, 793456, 792636, 790563, 787920, 785969, 785122, 784794, 784457, 784122, 783876, 783574, 783220, 783291, 784434, 786904, 790353, 794119, 797837, 801785, 806444, 811775, 817352, 823220, 830007, 837855, 845884, 853323, 860700, 869199, 879091, 889523, 899655, 909214, 917820, 924599, 928895, 930915, 931372, 930729, 929043, 926322, 922735, 918533, 913868, 908777, 903391, 898249, 894232, 892016, 891704, 893118, 896199, 900791]
61244I00791N408N300M864M891N455O024O307O524O880P236P431P684Q345R327
61230I92467R998R796Q915Q151Q088Q562R043R266R382R650J0177J0814J1194
61217A115503J1095J0805J0801J0975J0733J0091J0007J1070J2475J3127J3239
61206A239921J3869J5108J5856J5479J4639J4135J3793J2873J0955Q071M568J134
61194A380401j537l479n394p657r836j1441j2571j3523j4301j4923j5727j6932
61182A253080j8244j9314k0220k1128k1784k1792k1191k0349j9511j8730j8100
61171A032717j7641j7028j5784j3779j1393r204p551o344n184l780k270j056l63
61158I21340o6N7P0j70q79k092l452m514n350o447p718q197p249n588m356l491
$$ y = [900791, 906199, 911499, 916363, 921254, 926709, 932733, 939040, 945564, 952444, 959680, 967111, 974795, 983140, 992467, 1002465, 1012261, 1021176, 1029327, 1037415, 1045977, 1055020, 1064286, 1073668, 1083318, 1093495, 1104309, 1115503, 1126598, 1137403, 1148204, 1159179, 1169912, 1180003, 1190010, 1201080, 1213555, 1226682, 1239921, 1253790, 1268898, 1284754, 1300233, 1314872, 1329007, 1342800, 1355673, 1366628, 1374699, 1379267, 1380401, 1378864, 1375385, 1369991, 1362334, 1352498, 1341057, 1328486, 1314963, 1300662, 1285739, 1270012, 1253080, 1234836, 1215522, 1195302, 1174174, 1152390, 1130598, 1109407, 1089058, 1069547, 1050817, 1032717, 1015076, 998048, 982264, 968485, 957092, 947888, 940337, 933993, 928809, 925029, 922759, 921703, 921340, 921274, 921331, 921401, 921231, 920352, 918260, 914808, 910294, 904944, 898497, 890779, 882582, 875333, 869745, 865389, 861898]
61142H61898j962M86K904M482N453O385P447Q620R889J0853J0917J0285J0066
61129I47723J0922J2213J2895J2692J1970J1052J0196R700R480Q930P709O315
61117A071797N414M935M306L271K013P13o06k038l877o386r242j1601j3086j4298
61103A031315j5867j7402j7977j7356j6222j5264j4527j3684j2631j1667j1202
61092H67516j1225j1175j0540r485q519p620o341m794l817l822m244m339l956
61079G77639l135j733L9J367J788J837K186K702L043L555M706O062O760O835P199
61064H20850Q415J0157J1778J2791J2968J2640J2731J3814J5264J6022J6049J6139
61052I79618J6499J6428J5547J4477J3974J4086J4456J4865J5139J5092J4844
$$ y = [861898, 859936, 860422, 863326, 867808, 873261, 879646, 887093, 895713, 905602, 916455, 927372, 937657, 947723, 958645, 970858, 983753, 996445, 1008415, 1019467, 1029663, 1039363, 1048843, 1057773, 1065482, 1071797, 1077211, 1082146, 1086452, 1089723, 1091736, 1092449, 1091843, 1089805, 1085928, 1079542, 1070300, 1058699, 1045613, 1031315, 1015448, 998046, 980069, 962713, 946491, 931227, 916700, 903016, 890385, 878718, 867516, 856291, 845116, 834576, 825091, 816572, 808952, 802611, 797817, 794000, 790178, 785934, 781595, 777639, 774504, 772771, 772810, 774177, 775965, 777802, 779988, 782690, 785733, 789288, 793994, 800056, 806816, 813651, 820850, 829265, 839422, 851200, 863991, 876959, 889599, 902330, 916144, 931408, 947430, 963479, 979618, 996117, 1012545, 1028092, 1042569, 1056543, 1070629, 1085085, 1099950, 1115089, 1130181, 1145025]
61041A145025J4816J5189J5781J6599J7929J9733K1554K3353K5714K8875L2156
61030A376724L4897L7434M0442M3830M7093N0514N5135O1507O9243P7946Q7899
61019A982664R9623J13500J30123J50461J75241K04642K38880K78557L24123L75797
61009D073611M34808N04041N86902O86883Q09521R61827J143175J333445J494110
61000A2028323J588345J603196J550794J447884J298124J097240Q52814N93335
60992B2060055L55427J63308K0281q4689j67938k49135l52758n03990p16764r81238
60982A9542559j260222j499542j649495j686483j621263j488149j324314j155301
60974G857790r93946q46306p15381o01459n03050m18979l48882k91873k45999
$$ y = [1145025, 1159841, 1175030, 1190811, 1207410, 1225339, 1245072, 1266626, 1289979, 1315693, 1344568, 1376724, 1411621, 1449055, 1489497, 1533327, 1580420, 1630934, 1686069, 1747576, 1816819, 1894765, 1982664, 2082287, 2195787, 2325910, 2476371, 2651612, 2856254, 3095134, 3373691, 3697814, 4073611, 4508419, 5012460, 5599362, 6286245, 7095766, 8057593, 9200768, 10534213, 12028323, 13616668, 15219864, 16770658, 18218542, 19516666, 20613906, 21466720, 22060055, 22415482, 22578790, 22599071, 22514382, 22346444, 22097309, 21744551, 21240561, 20523797, 19542559, 18282337, 16782795, 15133300, 13446817, 11825554, 10337405, 9013091, 7857790, 6863844, 6017538, 5302157, 4700698, 4197648, 3778669, 3429787, 3137914, 2891915]
60965B891915k09170j79710j56005j36524j20347j06963r5615q5601p6979p0077
60955A654924o4478n9420n4954n1584m8914m6005m3006m1096m0506l9983l8541
60944A126437l6498l4354l1953k9305k7059k5445k3832k1857j9927j8121j5849
60933H42237j3268j1692j1670j1910j1133r858r151q723p643o056m782l834k767
60920G29750j887j779k050j901j566j896k742l117k827k644k924l301l763m765
60906F92588o067o673o298n911o394p435q174q264p861p091o007m837l969l691
60892F03916l877l925l285k219j665j980k380k051j281q58q31o73k68L9J10m3
60876E78729o87j918l000l082k377j856j818j638r21m7M87O27N26L65M01O52O56
$$ y = [2891915, 2682745, 2503035, 2347030, 2210506, 2090159, 1983196, 1887581, 1801980, 1725001, 1654924, 1590446, 1531026, 1476072, 1424488, 1375574, 1329569, 1286563, 1245467, 1204961, 1164978, 1126437, 1089939, 1055585, 1023632, 994327, 967268, 941823, 917991, 896134, 876207, 858086, 842237, 828969, 817277, 805607, 793697, 782564, 772706, 763555, 754832, 747189, 741133, 736351, 732517, 729750, 727863, 726084, 724034, 722133, 720567, 718671, 715929, 712812, 709985, 707341, 704417, 701116, 697353, 692588, 686521, 679848, 673550, 667639, 661245, 653810, 645636, 637372, 629511, 622420, 616413, 611576, 607607, 603916, 600039, 596114, 592829, 590610, 588945, 586965, 584585, 582534, 581253, 580395, 579564, 578891, 578623, 578662, 578772, 578729, 578042, 576124, 573124, 570042, 567665, 565809, 563991, 562353, 561432, 561385, 561872, 562499, 563025, 563390, 563791, 564443, 565099]
60859E65099Q8n48n53k12m83j544k408k200j189l49l42j071j851k119k157k909
60843E45252m723o636p454p063o173n220m316l766l717l608k861j939j707k062
60829D84007k139j771j561j628j438r48p98j108j184p35l98o45j060j168j191
60814D66235j464j735j587j127q26r31j238j265o70K31N36k10j284j645j257q84
60798D50879q42p93o22n89o25l49J62M15L00P2l37j127j838j818j376j409j863
60781D38240j765r28l39n29p99n34j81k58m23k43L9J36L37P96J010P36O80J447
60763D37422K381K351J349N04O36J419J990K025K009K578L563L965L198J962J306
60748D68658J137N83m59j224j527k099l148l884l914m006m811n729n846n191m345
$$ y = [565099, 565187, 564639, 564086, 563874, 563391, 561847, 559439, 557239, 556050, 555701, 555359, 554288, 552437, 550318, 548161, 545252, 540529, 533893, 526439, 519376, 513203, 507983, 503667, 499901, 496184, 492576, 489715, 487776, 486069, 484007, 481868, 480097, 478536, 476908, 475470, 474522, 473724, 472616, 471432, 470697, 470299, 469654, 468594, 467426, 466235, 464771, 463036, 461449, 460322, 459496, 458565, 457327, 456062, 455392, 455623, 456159, 455949, 454665, 453020, 451763, 450879, 450037, 449244, 448622, 448033, 447408, 447059, 447221, 447636, 447936, 448008, 447671, 446544, 444706, 442888, 441512, 440103, 438240, 436475, 435547, 435208, 434679, 433880, 433346, 433165, 432907, 432484, 432241, 432280, 432416, 432753, 433549, 434559, 435295, 435975, 437422, 439803, 442154, 443503, 444007, 444643, 446062, 448052, 450077, 452086, 454664, 458227, 462192, 465390, 467352, 468658, 469795, 470378, 469919, 468695, 467168, 465069, 461921, 458037, 454123, 450117, 445306, 439577, 433731, 428540, 424195]
60733D24195l457k459j678j484j690j838j732j340o66r0j83p90r96m66l3m81j405
60716D03407j926j822j300l97O47J049M51l50m40j43l95j141j406q46k11j52l26
60699C94699j6Q47J664J911J678J499J699K087K370K634L074L467L464L272L397
60684D27746L745L741L391L358L774L865L166K317K134K511K716K204Q19j176
60670D64311k942l630l413l272l507l358k437j462j013o52k7K26l13p19L1J427
60654D39250K177K062J834J762J441P96J72l92j068j575j598j565k075k680k360
60639D36181j132j32J6j02J19L63J08l79l99K08Q98J170J111J104J196R55J71
60622D41456o14o82j17L94O55J071J604J536O72j67l95n32j091j545j263p32p20
$$ y = [424195, 420738, 418279, 416601, 415117, 413427, 411589, 409857, 408517, 407851, 407761, 407578, 406788, 405792, 405326, 405293, 404812, 403407, 401481, 399659, 398359, 397962, 398609, 399658, 400109, 399759, 399319, 399176, 398781, 397640, 396234, 395388, 395177, 395025, 394699, 394683, 395530, 397194, 399105, 400783, 402282, 403981, 406068, 408438, 411072, 414146, 417613, 421077, 424349, 427746, 431491, 435232, 438623, 441981, 445755, 449620, 452786, 455103, 457237, 459748, 462464, 464668, 465487, 464311, 461369, 457739, 454326, 451054, 447547, 444189, 441752, 440290, 439277, 438625, 438598, 438824, 438511, 437792, 437823, 439250, 441427, 443489, 445323, 447085, 448526, 449322, 449494, 449102, 448034, 446459, 444861, 443296, 441221, 438541, 436181, 435049, 434917, 434933, 434831, 434950, 435313, 435421, 435042, 434643, 434851, 435749, 436919, 438030, 439134, 440330, 441285, 441456, 440842, 440160, 440043, 440437, 441092, 442163, 443767, 445303, 445975, 445808, 445413, 444881, 443790, 442245, 440982, 440250, 439530]
60605D39530q45j99J024J637J162L39j2J97O76J121J283J348K002L453M591M129
60589D61436K433J204J254J636J249L38j24J72P23J041J092J058J100J375K043
60574D78030L090M154M660M390L891L952M705N581O222O835P475P635O951N813
60560E53384M865M272L824L238K162M42j259j862j265n88n45n09K31J262J999
60545E69651K871M514O504Q072R447J1270J3260J4701J5815J7306J8889J9639
60533G11939J9590J9539J9395J8050J5051J1065O620J678l292p138r396j0776
60521G92325j1879j2335j1746j0559r529q804q036o894n228l159j103O92K559
60508G06304M821P121R029J1101J4286J8412K2357K5693K9122L3038L6827L9855
$$ y = [439530, 438685, 438486, 439510, 441147, 442309, 442648, 442636, 442833, 443509, 444630, 445913, 447261, 449263, 452716, 457307, 461436, 463869, 465073, 466327, 467963, 469212, 469550, 469426, 469598, 470321, 471362, 472454, 473512, 474612, 475987, 478030, 481120, 485274, 489934, 494324, 498215, 502167, 506872, 512453, 518675, 525510, 532985, 540620, 547571, 553384, 558249, 562521, 566345, 569583, 571745, 572187, 570928, 569066, 567801, 567213, 566668, 566159, 566390, 567652, 569651, 572522, 577036, 583540, 591612, 601059, 612329, 625589, 640290, 656105, 673411, 692300, 711939, 731529, 751068, 770463, 788513, 803564, 814629, 821249, 822927, 819635, 812497, 803101, 792325, 780446, 768111, 756365, 745806, 736277, 727473, 719437, 712543, 707315, 704156, 703053, 703745, 706304, 711125, 718246, 727275, 738376, 752662, 771074, 793431, 819124, 848246, 881284, 918111, 957966]
60496I57966M2152M3827M4676M4653M3834M1670L7276L0780K3352J5589P002k493
60484A330284j1819k0159k8002l5838m2789m7542m9997n0955n0789m9440m7268
60473H95686m4848m2096l8509l4181k9805k5830k2331j9572j7861j6783j5311
60462E88559j2969j0389q502p557p123o718o130n345m436l566k901k462k120j764
60448E06577j403j077o86j99P9k47j025j523j361j049j234j684j623q88j80j38
60432D92339o29j005p88mQ08J024O04K46N67J332J868J967J911J854J738J680
60416E05512J840J972J719J232R22P36L12k02k10L71R04R10N85L65M54Q87J529
60399E19838J948J843J618J995L028L995M280L816K823J749J415K329L811M529
$$ y = [957966, 1000118, 1043945, 1088621, 1133274, 1177108, 1218778, 1256054, 1286834, 1310186, 1325775, 1332777, 1330284, 1318465, 1298306, 1270304, 1234466, 1191677, 1144135, 1094138, 1043183, 992394, 942954, 895686, 850838, 808742, 770233, 736052, 706247, 680417, 658086, 638514, 620653, 603870, 588559, 575590, 565201, 556699, 549142, 542019, 535301, 529171, 523826, 519390, 515824, 512923, 510461, 508341, 506577, 505174, 504097, 503411, 503212, 503291, 503044, 502019, 500496, 499135, 498086, 496852, 495168, 493545, 492657, 492477, 492339, 491710, 490705, 489917, 489913, 490721, 491745, 492349, 492595, 493162, 494494, 496362, 498329, 500240, 502094, 503832, 505512, 507352, 509324, 511043, 512275, 513197, 513933, 514245, 514043, 513833, 514204, 515108, 516018, 516603, 516968, 517422, 518309, 519838, 521786, 523629, 525247, 527242, 530270, 534265, 538545, 542361, 545184, 546933, 548348, 550677, 554488, 559017]
60385E59017M125L529L531L846L911L794L853M074M177L962L222J846K87n64k91
60370F02319O37J600K439L111L322K945K501K710L747N122O217O805P206P887
60356F58568Q733Q962Q104O711N558M409K412l67k783m129m931n937p069p823
60342F70418q047p864p274o355n481m979m723m321l538k444j409r05j033j278
60328F10767j040k91O19J580K636L556M104M539N243O033O475O627O725O385M962
60313F68920K647L16j531k888l514l187k516k345k434j822n38L81O21R37J497
60298F54544J316p8j770k880l726m861o003o719p228p759p980p684p272o982o417
60283E78501n397m395l578k434r19Mk36q60r56p79r11j009l93P47J670K109K224
$$ y = [559017, 563142, 566671, 570202, 574048, 577959, 581753, 585606, 589680, 593857, 597819, 601041, 602887, 603174, 602610, 602319, 602956, 604556, 606995, 610106, 613428, 616373, 618874, 621584, 625331, 630453, 636670, 643475, 650681, 658568, 667301, 676263, 684367, 691078, 696636, 701045, 703457, 703090, 700307, 696178, 691247, 685310, 678241, 670418, 662371, 654507, 647233, 640878, 635397, 630418, 625695, 621374, 617836, 615392, 613983, 613078, 612045, 610767, 609727, 609436, 610055, 611635, 614271, 617827, 621931, 626470, 631713, 637746, 644221, 650848, 657573, 663958, 668920, 671567, 671883, 670352, 667464, 663950, 660763, 658247, 655902, 653468, 651646, 651108, 651489, 652110, 653047, 654544, 655860, 655782, 654012, 651132, 647406, 642545, 636542, 629823, 622595, 614836, 606856, 599172, 591900, 584918, 578501, 573104, 568709, 565131, 562697, 561778, 561782, 561546, 560686, 559730, 558951, 558040, 557031, 556638, 557385, 559055, 561164, 563388]
60266E63388K066J799J875K368K701K615K616K849K461J000m67p40k48l19j200
60251E82764k006k244k288k452k609k640k547k197j444l78R09K391L658M032L608
60236E76557L438M106M926N163N247N881O807P344P520P692P756P607P758Q450
60222F66252Q852Q189P021O309N890N139M427M543N057M780L556K244J202J33
60208G33594p97j138j358k444m244n578o090o527p069o864n696m674m608m817
60194F71690m286l145k245j963k079k264k157j415j46J024J616J708J574J326
60180F59238J085J020J049Q84N23L39N82J108J581J686J246N01J16M64J091J283
60164F73796R09K64m52r77o66P55K451L377L654M149M862M919M128L446L569M041
$$ y = [563388, 565454, 567253, 569128, 571496, 574197, 576812, 579428, 582277, 584738, 585738, 585271, 584531, 584283, 583964, 582764, 580758, 578514, 576226, 573774, 571165, 568525, 565978, 563781, 562337, 561959, 562868, 565259, 568917, 572949, 576557, 579995, 584101, 589027, 594190, 599437, 605318, 612125, 619469, 626989, 634681, 642437, 650044, 657802, 666252, 675104, 683293, 690314, 696623, 702513, 707652, 712079, 716622, 721679, 726459, 730015, 732259, 733461, 733594, 732797, 731659, 730301, 727857, 723613, 718035, 711945, 705418, 698349, 691485, 685789, 681115, 676507, 671690, 667404, 664259, 662014, 660051, 657972, 655708, 653551, 652136, 651990, 653014, 654630, 656338, 657912, 659238, 660323, 661343, 662392, 663276, 663799, 664138, 664720, 665828, 667409, 669095, 670341, 670842, 670958, 671422, 672513, 673796, 674705, 674969, 674517, 673540, 672874, 673629, 676080, 679457, 683111, 687260, 692122, 697041, 701169, 704615, 708184, 712225]
60148G12225M093L623K991K557K643L306L934L748K947K575L071L658L530K877
60134G57778K251J654Q13o5m95m72n54j252k447l444l598l071k802l399m295m535
60118G32067m110l826l961l996l715l606l852l819l159k585k794l226k777j447
60104F85194l63j44p3P68K059K582J809O39K54O79R10L55l98n04OL61L7q06j679
60085F91686k209k292k112j984k088k480l380m904o467p012o229n033m353m026
60071F37117l376k372j524j013p00n63m86Q3J399K666K927K490K573L558M575
60056F47354M835M553M282M117L857L369K518J153n77k248l592m618n320n639
60042F54044n700n695n637n512n548n882o166n967n422n026m903m805m704m875
$$ y = [712225, 716318, 719941, 722932, 725489, 728132, 731438, 735372, 739120, 742067, 744642, 747713, 751371, 754901, 757778, 760029, 761683, 762496, 762431, 761936, 761464, 760910, 759658, 757211, 753767, 750169, 747098, 744296, 740897, 736602, 732067, 727957, 724131, 720170, 716174, 712459, 708853, 705001, 701182, 698023, 695438, 692644, 689418, 686641, 685194, 684831, 684687, 684614, 685382, 687441, 690023, 691832, 692471, 692725, 693404, 694314, 694669, 694271, 693767, 693773, 694134, 694171, 693365, 691686, 689477, 687185, 685073, 683089, 681001, 678521, 675141, 670237, 663770, 656758, 650529, 645496, 641143, 637117, 633741, 631369, 629845, 628832, 628132, 627569, 627083, 627166, 628565, 631231, 634158, 636648, 639221, 642779, 647354, 652189, 656742, 661024, 665141, 668998, 672367, 674885, 676038, 675461, 673213, 669621, 665003, 659683, 654044, 648344, 642649, 637012, 631500, 625952, 620070, 613904, 607937, 602515, 597489, 592586, 587781, 583077, 578202]
60028E78202n433o134o566o339n333m020l141k781k260j292n37m92o79n60m96
60013E32139q65j048m08M04L92j09j4O91J158J370K064L129L606L310K983K738
59997E51540J869M54l39nN48M46j85j072k318l543l752k797j850j794k084j881
59981E33237j380j180j222j107q87r01j209j603j737j101M41K038K637K489K822
59966E31337L810M192L355K403K418K834K549J645R18M56j83r14j253j173j053
59951E51341j016r57q64o67j83M45P90R48J593K758L468L190K799L257M077M103
59935E75082L231K307J671Q89k49j377k186k719l037l067k849k489j974j336p57
59920E61140k53M54J414K144K225J893J764K234L354M777N659N242L944L216L839
$$ y = [578202, 572769, 566635, 560069, 553730, 548397, 544377, 541236, 538455, 536195, 534903, 534366, 533874, 533195, 532635, 532139, 531274, 530226, 529818, 530222, 530614, 530505, 530491, 531182, 532340, 533710, 535774, 538903, 542509, 545819, 548802, 551540, 553409, 553863, 553524, 553519, 554067, 554513, 554328, 553256, 550938, 547395, 543643, 540846, 538996, 537202, 535118, 533237, 531857, 530677, 529455, 528348, 527461, 526560, 525351, 523748, 522011, 520910, 521351, 523389, 526026, 528515, 531337, 535147, 539339, 542694, 545097, 547515, 550349, 552898, 554543, 555461, 555917, 555734, 554820, 553567, 552394, 551341, 550325, 549368, 548504, 547837, 547654, 548099, 548889, 549837, 551430, 554188, 557656, 560846, 563645, 566902, 570979, 575082, 578313, 580620, 582291, 583180, 582931, 581554, 579368, 576649, 573612, 570545, 567696, 565207, 563233, 561897, 561140, 560887, 561341, 562755, 564899, 567124, 569017, 570781, 573015, 576369, 581146, 586805, 592047, 595991, 599207, 603046]
59905F03046M916N038L856K013K00j065j246l36P54J021M91J0J43Q15J700K532
59889F23888L213L982N130O250O323M990L256K334K300K427K281J782P02r49k407
59874F65502k852k494k189k181k010j535j193j206j267j178j101j080q92o04o05
59859F43115q65o42O00K321L495L999M865O875R213J0071Q679O318M924N082N823
59844G13873O111N817N315M877M667M721M718M242L363K464J410m01l051n845
59830G52281q186r929j0735j0077q354p056p000p189o254m349k783k233k320k601
59816F63215k942k986k262r83l6J12j9K77R36J284R77M20J70J11m84j950l621
59799F52219m518m474m089l750l276k529j761j218r12q86j217j652j798j713j800
$$ y = [603046, 607962, 613000, 616856, 618869, 619069, 618004, 616758, 616422, 617176, 618197, 618688, 618698, 618841, 619656, 621356, 623888, 627101, 631083, 636213, 642463, 648786, 653776, 657032, 659366, 661666, 664093, 666374, 668156, 668858, 667909, 665502, 662650, 660156, 657967, 655786, 653776, 652241, 651048, 649842, 648575, 647397, 646296, 645216, 644324, 643720, 643115, 642250, 641608, 642208, 644529, 648024, 652023, 656888, 663763, 672976, 683047, 691726, 698044, 702968, 708050, 713873, 719984, 725801, 731116, 735993, 740660, 745381, 750099, 754341, 757704, 760168, 761578, 761177, 758126, 752281, 744095, 734166, 723431, 713354, 705000, 697944, 690944, 683755, 677501, 673152, 670369, 668136, 665816, 663215, 660273, 657287, 655025, 654042, 654006, 654118, 654099, 654376, 655312, 656596, 657573, 657993, 658163, 658274, 657790, 655840, 652219, 647701, 643227, 639138, 635388, 632112, 629583, 627822, 626604, 625692, 624806, 623589, 621937, 620139, 618426, 616626]
59784F16626k018j868j195l40N45J611K625L070L082L427M229M666M261L637L562
59769F45920M053M824N782O574O530N662M934N003N421N559N512N503N274M719
59755G21270M356M443M465M103L878M075L968L064K252K547L371L298K070P09
59741G67869o9n00r00j198j318j370j360j230j047p46n6R24J454R97On80k97O83
59723G61262J877K632K515J937J752K047K107J866K266L638M850M955M553M585
59709H02842M780M476M037M188M657M737M588M693M685L952K932K470K359J773
59695H57169Q10K11o8o60j382j455j073j317k441l512l925m161m747n479n986
59680H21984o297o584o863p082p088o596n633m691m028l235j995o73M46J741L290
$$ y = [616626, 614608, 612740, 611545, 611205, 611750, 613361, 615986, 619056, 622138, 625565, 629794, 634460, 638721, 642358, 645920, 649973, 654797, 660579, 667153, 673683, 679345, 684279, 689282, 694703, 700262, 705774, 711277, 716551, 721270, 725626, 730069, 734534, 738637, 742515, 746590, 750558, 753622, 755874, 758421, 761792, 765090, 767160, 767869, 767800, 767300, 766400, 765202, 763884, 762514, 761154, 759924, 758877, 758131, 758075, 758999, 760453, 761450, 761456, 760876, 760579, 761262, 763139, 765771, 768286, 770223, 771975, 774022, 776129, 777995, 780261, 783899, 788749, 793704, 798257, 802842, 807622, 812098, 816135, 820323, 824980, 829717, 834305, 838998, 843683, 847635, 850567, 853037, 855396, 857169, 857979, 858190, 858122, 857462, 856080, 854625, 853552, 852235, 849794, 846282, 842357, 838196, 833449, 827970, 821984, 815687, 809103, 802240, 795158, 788070, 781474, 775841, 771150, 767122, 763887, 761892, 761219, 761665, 763406, 766696]
59665G66696M215L985L485L582L544K380R40Q55J853K082R23m65j413k608m287
59650G85767n429n409n001m986n030m689m328m399m645m718m751m853m786m585
59636G18158m701n244n810o374p414q850r701r322q238p291o648o037n328m476
59622F22724l474k639k451k759k782k125j278q03n72j03P19J597K202K516K813
59607F13585L217L246K248N60m59j46M79K19n12n34J03K88k79p50o01j53L51R75
59589F21837J394J115M95L99Q32J012Q09Q70J228J136M87J32M37P12M91J98J03
59572F33687k15r44j546j654j516j244o02J40K01l92n78J66R99J041O25N61R54
59555F29683J376J644J924K517L753N580P255Q180Q977J0696J3003J4331J4040
$$ y = [766696, 770911, 774896, 778381, 781963, 785507, 787887, 788827, 789682, 791535, 793617, 794540, 794075, 792662, 790054, 785767, 780338, 774929, 769928, 764942, 759912, 755223, 750895, 746496, 741851, 737133, 732382, 727529, 722743, 718158, 713457, 708213, 702403, 696029, 688615, 679765, 670064, 660742, 652504, 645213, 638565, 632528, 627200, 622724, 619250, 616611, 614160, 611401, 608619, 606494, 605216, 604413, 603841, 603738, 604457, 606054, 608256, 610772, 613585, 616802, 620048, 622296, 622856, 622397, 622251, 622730, 622949, 622437, 621903, 622006, 622294, 622015, 621265, 620664, 620511, 620862, 621837, 623231, 624346, 624841, 625240, 626072, 627084, 627893, 628763, 629991, 631127, 631614, 631746, 632183, 632895, 633386, 633584, 633687, 633472, 632528, 630982, 629328, 627812, 626568, 625966, 626106, 626307, 625915, 625337, 625503, 626502, 627543, 628168, 628729, 629683, 631059, 632703, 634627, 637144, 640897, 646477, 653732, 661912, 670889, 681585, 694588, 708919, 722959]
59542G22959J3124J2365J1092Q429M641N51l342o457p798o988n037l360k476k127
59528G35576j972j760j424j438k407m008n102n241n247n811o452o481o156o177
59514F75900o552o688o235n290m094k855j700o91j04m03j385j775o26J171J908
59499F40581J397R76J199J200N81L32J139K192K520K315K124J870J477J490K193
59484F63586K975L387L894M797N300M602L248K468K684L358L870L925L618L462
59470G15174L922M631M818M597M907N908O608O544O520O995P028N764L928K800
59456G90144K554K560K549K479J935O48q31j799k258k561k758k840l031l245k953
59441G80593k083j315j014o41K42J274K156L201M481N327N444N535O195P116Q017
$$ y = [722959, 736083, 748448, 759540, 767969, 772610, 773161, 769819, 763362, 755564, 748576, 743539, 740179, 737703, 735576, 733604, 731844, 730420, 728982, 726575, 722567, 717465, 712224, 706977, 701166, 694714, 688233, 682077, 675900, 669348, 662660, 656425, 651135, 647041, 644186, 642486, 641795, 641691, 641288, 639903, 638128, 637502, 638673, 640581, 641978, 642954, 644153, 645353, 645934, 646266, 647405, 649597, 652117, 654432, 656556, 658426, 659903, 661393, 663586, 666561, 669948, 673842, 678639, 683939, 688541, 691789, 694257, 696941, 700299, 704169, 708094, 711712, 715174, 719096, 723727, 728545, 733142, 738049, 743957, 750565, 757109, 763629, 770624, 777652, 783416, 787344, 790144, 792698, 795258, 797807, 800286, 802221, 802869, 802038, 800239, 797981, 795420, 792662, 789822, 786791, 783546, 780593, 778510, 777195, 776181, 775540, 775782, 777056, 779212, 782413, 786894, 792221, 797665, 803200, 809395, 816511, 824528]
59426H24528R282J0956J2207J2613J2888J3466J3618J2881J2045J1512J0029O450
59414I62475J695k536n913q681r836q160m547j324O11K169L707M078K344j060
59400I35022n244r729j3905j6669j7252j5954j3776j1633r951q585p164n755m916
59387G94489m807m761m164l272k641k251j821j452j326j208q71n62m92l34K00
59372G64727Q25J215J498J800J971K257L332N165O765P686Q724J0358J1679J1907
59358H39909J1819J2443J3395J3810J3984J4570J4867J3653J1230R075P666O073
59346I82494L625O44k369n171p433r011j0412j2086j3544j4041j3748j3327j2731
59333H72890j1542j0124r335r297r428r403r152q338o875n605n364n715n625m989
$$ y = [824528, 833810, 844766, 856973, 869586, 882474, 895940, 909558, 922439, 934484, 945996, 956025, 962475, 964170, 961634, 955721, 947040, 937204, 929044, 924497, 923173, 923784, 925953, 929660, 933738, 936082, 935022, 929778, 920049, 906144, 889475, 872223, 856269, 842493, 830860, 820909, 812324, 805160, 799405, 794489, 789682, 784921, 780757, 777485, 774844, 772593, 770772, 769320, 767994, 766786, 765915, 765353, 764861, 764527, 764727, 765552, 766767, 768265, 770065, 772036, 774293, 777625, 782790, 789555, 797241, 805965, 816323, 828002, 839909, 851728, 864171, 877566, 891376, 905360, 919930, 934797, 948450, 959680, 968755, 976421, 982494, 986119, 986763, 984394, 979223, 971790, 962779, 952367, 940281, 926737, 912696, 898948, 885621, 872890, 861348, 851224, 841889, 832592, 823164, 813761, 804609, 796271, 789396, 783791, 778427, 772712, 767087, 762098]
59319G62098m416l942l150k258j829j625r21K22J134J771K727M143N643P158Q844
59304G75599J0392J1321J1664J1515J0452Q336O056M231J929j849n927p997p634
59291H28088o593o148n833m931l569j980m4J932L192L654M093M887N552N727N682
59276H33709N659N518N213M865M365L627L063K987K821J914Q18N67Q95M32j319
59261H75134l394m837n672o250o721p222p699p580o485n109m490m545m377l754
59247G96999l161k648j933j398j718k549l008l288m378o127p162o971o684p362
59233G38612q740r973j0552j0217r040p813p333p227o531n420n041n580n866n190
59219F34089m212l692l502l270k945k385j469p45r34j610j551n68K73M46O77J436
$$ y = [762098, 757682, 753740, 750590, 748332, 746503, 744878, 743957, 744179, 745313, 747084, 749811, 753954, 759597, 766755, 775599, 785991, 797312, 808976, 820491, 830943, 839279, 845335, 849566, 851495, 849646, 843719, 835722, 828088, 821495, 815347, 809514, 804583, 801014, 799034, 798990, 800922, 804114, 807768, 811861, 816748, 822300, 828027, 833709, 839368, 844886, 850099, 854964, 859329, 862956, 866019, 869006, 871827, 873741, 874559, 875126, 876021, 876453, 875134, 871740, 866903, 861231, 854981, 848260, 841038, 833339, 825759, 819274, 814165, 809675, 805130, 800753, 796999, 793838, 791190, 789257, 787859, 786141, 783592, 780584, 777296, 772918, 766791, 759629, 752658, 745974, 738612, 729872, 719899, 709347, 699130, 690090, 682277, 674944, 667717, 661186, 655766, 650725, 645145, 639279, 634089, 629877, 626185, 622683, 619413, 616468, 614083, 612614, 611869, 610935, 609325, 607774, 607206, 607479, 607925, 608602, 610038]
59203F10038K059J901J329J005J080J443J951K157J729J217J418J992J928J377
59189F32624J630K994M148M100L447L121L085K886K465J897J220R16J608K942
59175F69083L772L738L511L357K678J394M20K52K01l48j094j668k249k777k738
59160F77532k264k327l296m314m657m626m545m126l443l362m216m999m744l827
59146F22786l197l114l276l450l341k604j513r43j153j321p07M66J619K532L082
59131F05866L126K957L198L908M584N090N774O605P166P584Q362R374J0150J1070
59117F94814J2836J4804J5486J4863J4391J4464J3804J1991J0504J0230R739P388
59105H45314L634M5k759m923o273o662o574o410o014n605n972o962p061n517l610
$$ y = [610038, 612097, 613998, 615327, 616332, 617412, 618855, 620806, 622963, 624692, 625909, 627327, 629319, 631247, 632624, 634254, 637248, 641396, 645496, 648943, 652064, 655149, 658035, 660500, 662397, 663617, 664533, 666141, 669083, 672855, 676593, 680104, 683461, 686139, 687533, 687953, 688205, 688406, 688058, 686964, 685296, 683047, 680270, 677532, 675268, 672941, 669645, 665331, 660674, 656048, 651503, 647377, 643934, 640572, 636356, 631357, 626613, 622786, 619589, 616475, 613199, 609749, 606408, 603804, 602291, 601348, 600195, 598874, 598167, 598633, 600252, 602784, 605866, 608992, 611949, 615147, 619055, 623639, 628729, 634503, 641108, 648274, 655858, 664220, 673594, 683744, 694814, 707650, 722454, 737940, 752803, 767194, 781658, 795462, 807453, 817957, 828187, 837926, 845314, 848948, 848993, 846234, 841311, 835038, 828376, 821802, 815392, 809378, 803773, 797801, 790839, 783778, 778261, 774651]
59090G74651k793k771k592k428k942l830m304m298m080l533k818k806l744m410
59076G27302l848k940l016l781l958l293k548k097j829j924k495k858k328j333
59062F89054p71o93n55k89j34Q2N63Q80O73M56Q63J515J589J034L69k74j003j510
59044F91849j467j170r96o34L59J681K740L535M365N084N461N782O448P279P840
59029G38156Q050P906P169N841M423L239K093R60J90l51j347k661l003j798k62
59014G68605K48M2K69J202K451M000N860P324P775P695P896Q253Q145P625P206
58999H44596O949O537N822M697L056J462R03J278J166j9q89j56J359K197K661
58984H81619M081O424Q392R471J0278J1027J1217J0822J0507J0590J0802J1012
$$ y = [774651, 771858, 769087, 766495, 764067, 761125, 757295, 752991, 748693, 744613, 741080, 738262, 735456, 731712, 727302, 723454, 720514, 717498, 713717, 709759, 706466, 703918, 701821, 699992, 698068, 695573, 692715, 690387, 689054, 688283, 687590, 687035, 686746, 686612, 686694, 687257, 688137, 688810, 689266, 690129, 691644, 693233, 694267, 694636, 694362, 693359, 691849, 690382, 689212, 688216, 687582, 687941, 689622, 692362, 695897, 700262, 705346, 710807, 716589, 723037, 730316, 738156, 746206, 754112, 761281, 767122, 771545, 774784, 776877, 777837, 778027, 777676, 776329, 773668, 770665, 768867, 768605, 768853, 768895, 769164, 770366, 772817, 776817, 782677, 790001, 797776, 805471, 813367, 821620, 829765, 837390, 844596, 851545, 858082, 863904, 868601, 871657, 873119, 874022, 875300, 876466, 876447, 875558, 875402, 876761, 878958, 881619, 885700, 892124, 900516, 909987, 920265, 931292, 942509, 953331, 963838, 974428, 985230, 996242]
58972I96242J1238J1045R933Q281P007O337N689M650L390K180J125K55o36k034
58958A064702m130o501q657j0490j1903j2655j2974j3481j4026j3524j1640r675
58946I35046q868q688p777n952m157l032k484k329k495k808l106l270k859j462
58932H75759K93J028L43o58j088j283j580j392m10N54R11J319K430L751M768N942
58916H90687P489Q504Q492Q494R327J0072R826R626J0760J2324J2490J1400J0831
58903A020322J1425J2174J2381J2425J2682J3098J3784J4848J5913J6654J7395
58892A173101J8235J8292J6883J4654J2471R974O539K699o36l562o438q684r741
58879A243787j0346j1364j2236j2069j1387j1225j1335j0934j0444j0702j1264
$$ y = [996242, 1007480, 1018525, 1028458, 1036739, 1043746, 1050083, 1055772, 1060422, 1063812, 1065992, 1067117, 1067372, 1066736, 1064702, 1060572, 1054071, 1045414, 1034924, 1023021, 1010366, 997392, 983911, 969885, 956361, 944721, 935046, 926178, 917490, 909713, 903761, 899604, 896572, 894088, 891759, 889264, 886456, 883350, 880080, 877221, 875759, 876052, 877080, 877423, 876765, 875677, 874394, 872814, 871422, 871012, 871566, 872477, 873796, 876226, 879977, 884745, 890687, 898176, 906680, 915172, 923666, 932993, 943065, 952891, 962517, 973277, 985601, 998091, 1009491, 1020322, 1031747, 1043921, 1056302, 1068727, 1081409, 1094507, 1108291, 1123139, 1139052, 1155706, 1173101, 1191336, 1209628, 1226511, 1241165, 1253636, 1263610, 1270149, 1272848, 1272212, 1268650, 1262212, 1253528, 1243787, 1233441, 1222077, 1209841, 1197772, 1186385, 1175160, 1163825, 1152891, 1142447, 1131745, 1120481]
58868A120481j1192j0815j1044j1649j1961j2422j3649j4770j4688j4150j4556
58857I79585j5436j5369j4741j5099j6217j6283j4889j3474j2746j1887j0549
58846H22895r486q849p793o099m551l446k331j284q70p59l3J176J883K048K512
58831G85013L254L376K845K505K392J656K32r92j630j960j810r15j45o58j970
58816G91193k609k458k643l330l602l405l597m083l886l196l348m539n509n665
58802G39323n714n952n835n440n504n758n051l351j883j001J61J729K660K657
58788G01041K658L032L025K473K310K867L256K984K644K677K748K707K727K389
58774G39538J024r07k267l052m220n776o655o500n941n176l957k893k981l857
$$ y = [1120481, 1109289, 1098474, 1087430, 1075781, 1063820, 1051398, 1037749, 1022979, 1008291, 994141, 979585, 964149, 948780, 934039, 918940, 902723, 886440, 871551, 858077, 845331, 833444, 822895, 813409, 804560, 796767, 790668, 786117, 782671, 780340, 779056, 778186, 777427, 777394, 778570, 780453, 782501, 785013, 788267, 791643, 794488, 796993, 799385, 801041, 801273, 800281, 798651, 796691, 794881, 793966, 793821, 793163, 791193, 788584, 786126, 783483, 780153, 776551, 773146, 769549, 765466, 761580, 758384, 755036, 750497, 744988, 739323, 733609, 727657, 721822, 716382, 710878, 705120, 700069, 696718, 694835, 693834, 693995, 695724, 698384, 701041, 703699, 706731, 709756, 712229, 714539, 717406, 720662, 723646, 726290, 728967, 731715, 734422, 737149, 739538, 740562, 739655, 737388, 734336, 730116, 724340, 717685, 711185, 705244, 700068, 696111, 693218, 690237, 686380]
58760F86380m207l777l268k529r15R03J586J436J865K836L176L196M456O869Q643
58745G06650R254R913J0881J1063J0581J0984J2379J3038J2506J2348J3108J3224
58733H45929J1837J0021Q372N998K886O35k36j199k773l273j815r5K62j69m09
58718H75971q89j999k905l200l837n281o660p722r492j2018j3699j4041j4708
58705G79520j6521j7801j7145j5558j4326j3025j1258j0173j0427j0620r461p791
58693F25414o796o044m822l663l003k118p86j79o93q39L27J635K165K996M926
58678F08520O597O818O821Q185J0219J1360J1550J1440J0788R441Q328P758O358
58665G24183L326J13j785l013m654o185o958p794r207r763q334o317n510n378
$$ y = [686380, 682173, 678396, 675128, 672599, 671684, 672587, 674173, 675609, 677474, 680310, 683486, 686682, 691138, 698007, 706650, 715904, 725817, 736698, 747761, 758342, 769326, 781705, 794743, 807249, 819597, 832705, 845929, 857766, 867787, 876159, 882157, 885043, 885678, 885442, 884243, 881470, 878197, 876382, 876287, 876549, 876380, 875971, 875082, 873083, 870178, 866978, 863141, 857860, 851200, 843478, 833986, 821968, 808269, 794228, 779520, 762999, 745198, 728053, 712495, 698169, 685144, 673886, 663713, 653286, 642666, 633205, 625414, 618618, 612574, 607752, 604089, 601086, 598968, 598182, 598003, 597310, 596471, 596798, 598433, 600598, 603594, 608520, 615117, 621935, 628756, 636941, 647160, 658520, 670070, 681510, 692298, 701739, 710067, 717825, 724183, 727509, 727622, 725837, 722824, 718170, 711985, 705027, 697233, 688026, 678263, 669929, 663612, 658102, 652724]
58651F52724m533l340k822k432j229RL4n83o33n83j589l116l674l123k416j772
58635F20922q92j77j29k58rJ53j54j75O47J568K057K919M545N637N227M410M403
58618F50694M561L956L282L311L170K087J233J677K141J018q42j588j269j034
58604F72397p41K54J163R55N34J405L106M089M286M735N586O436P724R802J1616
58589G33347J2116J2011J2289J2286J1061R487Q894Q889Q575Q612R909J1564J2394
58576H71434J3338J5868J9141K1216K2192K3651K5727K7130K7403K6840K4866
58565A118806K0751J5456J0687O670K655j065l633n300o727p408o714n641n556
58552A132981o105o266o597q348j1193j3825j5979j8063j9568j9801j9371j9283
$$ y = [652724, 648191, 644851, 642029, 639597, 638368, 638377, 638411, 637828, 637195, 636612, 635023, 631907, 628233, 625110, 622694, 620922, 620030, 619853, 619724, 619466, 619457, 619610, 619456, 619281, 619928, 621496, 623553, 626472, 631017, 636654, 641881, 646291, 650694, 655255, 659211, 662493, 665804, 668974, 671061, 672294, 673971, 676112, 677130, 676288, 674700, 673431, 672397, 671656, 671910, 673073, 674028, 674562, 675967, 679073, 683162, 687448, 692183, 697769, 704205, 711929, 721731, 733347, 745463, 757474, 769763, 782049, 793110, 802597, 811491, 820380, 828955, 837567, 847476, 859040, 871434, 884772, 900640, 919781, 940997, 963189, 986840, 1012567, 1039697, 1067100, 1093940, 1118806, 1139557, 1155013, 1165700, 1172370, 1175025, 1173960, 1170327, 1165027, 1158300, 1150892, 1144178, 1138537, 1132981, 1126876, 1120610, 1114013, 1105665, 1094472, 1080647, 1064668, 1046605, 1027037, 1007236, 987865, 968582]
58540I68582j9353j8974j8353j7562j5793j3062j1030j0496r927q186o594o247
58528H13005n616l386j314j344k049j146L66J02j364j762j402k397m524n558n048
58513G76563m432l939k757j663k196l515l239j183O37J299J546J594J198J392
58499G61305L338N905P087P121P668Q766R392J0102J2041J4260J5093J5220J6225
58486H93523J7091J5618J2448J0075Q504N628J472j780l756o189r171j0682j0090
58473I22691q867p642n663l243j663n67J561M411O267P167Q553J0064R905Q244
58459I51218P045O553N114K410k77k859o283r759j1314j1106j1040j1266j0282
58446H98154q267o980o484n244l372k428k147p85J402K450K374L037M518N042
$$ y = [968582, 949229, 930255, 911902, 894340, 878547, 865485, 854455, 843959, 834032, 825846, 819252, 813005, 807389, 804003, 802689, 801345, 799296, 798150, 798516, 798618, 797254, 795492, 794090, 791693, 787169, 781611, 776563, 772131, 768192, 765435, 763772, 761576, 758061, 754822, 753639, 754276, 755575, 757121, 758715, 759913, 761305, 764643, 770548, 777635, 784756, 792424, 801190, 810582, 820684, 832725, 846985, 862078, 877298, 893523, 910614, 926232, 938680, 948755, 957259, 962887, 964359, 962579, 958823, 952634, 943463, 932781, 922691, 913824, 906182, 900519, 897276, 895613, 895046, 896607, 901018, 907285, 914452, 923005, 933069, 942974, 951218, 958263, 964816, 969930, 972340, 972063, 969204, 962921, 953162, 941848, 930742, 919702, 908436, 898154, 889887, 882907, 876423, 871179, 867807, 865379, 863232, 862447, 863849, 866299, 868673, 871710, 876228, 881270]
58432H81270M530M685N531N352M039L032K084l20l408m805m656n381p227p982
58418H76744p170o647o824o157m668m194m728m256k470j063k08J481L487L807
58404H37134K878L155M655M966L808L488M626N529N897O947P843O467L882L502
58390I04777N580P079P229Q247J0276J0668R097Q371R247R348Q116P923R213R491
58376A024662Q280Q202R880J0662R713R472J0759J1181R868Q880Q565O457K303
58363A138884o96j271j881l550l831j742J52M31J039L033M668N357O974R674J1016
58348A168257J0695J1430J3741J4733J3493J2696J3420J3441J2083J1545J1957
58337A307491J0562P328N815O830O877M612L036L490L346J688J313K998L776L002
$$ y = [881270, 885800, 890485, 896016, 901368, 905407, 908439, 910523, 910203, 906795, 901990, 897334, 891953, 884726, 876744, 869574, 862927, 856103, 849946, 845278, 841084, 836356, 832100, 829630, 828567, 828359, 829840, 833327, 837134, 840012, 843167, 847822, 852788, 856596, 860084, 864710, 870239, 876136, 883083, 890926, 897393, 901275, 904777, 910357, 917436, 924665, 932912, 943188, 953856, 962953, 971324, 980571, 989919, 998035, 1005958, 1015171, 1024662, 1032942, 1041144, 1051024, 1061686, 1071399, 1080871, 1091630, 1102811, 1112679, 1121559, 1130124, 1136581, 1138884, 1138188, 1136917, 1135036, 1131486, 1127655, 1125913, 1126065, 1126496, 1127535, 1130568, 1135236, 1140593, 1147567, 1157241, 1168257, 1178952, 1190382, 1204123, 1218856, 1232349, 1245045, 1258465, 1271906, 1283989, 1295534, 1307491, 1318053, 1325381, 1331196, 1338026, 1344903, 1349515, 1352551, 1356041, 1359387, 1361075, 1362388, 1365386, 1369162, 1372164]
58323A372164M006P533R759R207R256J1360J2314J0896J0663J3113J4620J3312
58311A498203J2542J4324J5694J4797J4251J5314J5103J2814J2167J4488J6072
58300A655769J5467J6345J9920K1824K0146J9164K1312K2926K1971K2291K5858
58289A882993K8434K7476K6848K9147L0932L0275L1169L5558L8787L8079L7730
58278B237428M0831M3733M3892M5002M8944N1004M8648M6706M8191M8634M5407
58267B748420M3639M6614M9284M7908M6986M9953N2243N0642N0181N4425N8377
58256C298672N8457N9834O6171P2044P3470P5854Q3224Q9911R1440R3182R9535
58245D161794J05391J07295J11588J22038J31227J34134J38050J48619J58837
$$ y = [1372164, 1376170, 1383703, 1393462, 1402669, 1411925, 1423285, 1435599, 1446495, 1457158, 1470271, 1484891, 1498203, 1510745, 1525069, 1540763, 1555560, 1569811, 1585125, 1600228, 1613042, 1625209, 1639697, 1655769, 1671236, 1687581, 1707501, 1729325, 1749471, 1768635, 1789947, 1812873, 1834844, 1857135, 1882993, 1911427, 1938903, 1965751, 1994898, 2025830, 2056105, 2087274, 2122832, 2161619, 2199698, 2237428, 2278259, 2321992, 2365884, 2410886, 2459830, 2510834, 2559482, 2606188, 2654379, 2703013, 2748420, 2792059, 2838673, 2887957, 2935865, 2982851, 3032804, 3085047, 3135689, 3185870, 3240295, 3298672, 3357129, 3416963, 3483134, 3555178, 3628648, 3704502, 3787726, 3877637, 3969077, 4062259, 4161794, 4267185, 4374480, 4486068, 4608106, 4739333, 4873467, 5011517, 5160136, 5318973]
58236E318973J63068J68829J82543J96911K05069K13939K30358K47730K60081
58227G187501K75066K98805L22658L40124L61257L94461M30378M60643M95375
58218A0566268N43875N96177O43543O98454P73108Q57715R42874J043018J173198
58209A7838230J324685J490623J693524J959269K288744K686230L187957L826022
58201C6295284M590882N465641O464257P596039Q837498J0198383J1779947J3718600
58193A04946531J6134072J9188216K3038606K7484535L1653028L4295641L4576348
58186B91316977L2507482K8563275K3012295J5754863O715700l728553j4606644
58179C79535395k4479111l1837528l5733507l6240745l4296375l1047859k7326893
$$ y = [5318973, 5482041, 5650870, 5833413, 6030324, 6235393, 6449332, 6679690, 6927420, 7187501, 7462567, 7761372, 8084030, 8424154, 8785411, 9179872, 9610250, 10070893, 10566268, 11110143, 11706320, 12349863, 13048317, 13821425, 14679140, 15622014, 16665032, 17838230, 19162915, 20653538, 22347062, 24306331, 26595075, 29281305, 32469262, 36295284, 40886166, 46351807, 52816064, 60412103, 69249601, 79447984, 91227931, 104946531, 121080603, 140268819, 163307425, 190791960, 222444988, 256740629, 291316977, 323824459, 352387734, 375400029, 391154892, 397870592, 394142039, 379535395, 355056284, 323218756, 287485249, 251244504, 216948129, 185900270, 158573377]
58172A58573377k3593464k0104839j6990725j4261620j1883621r854822q178936
58165E3705350o811750n687998m772576m043711l455567k960079k544044k208887
58157B1220738j934078j692609j482722j312880j171847j041843r25529q32980
58149A0826250p55941o79902o08515n52298n05410m56085m08731l74076l47656
58140F137636l18414k89146k69054k54845k37562k19756k08523j99588j84992
58131C955756j68821j59260j52682j41158j28241j21787j18221j09300r8049r2832
58121B665405r1487q6009p7772p3859p2970o8576o1953n9163n8937n5757n1133
58110A907789n0068n0213m5936l9505l7148l7604l5352l1570l1283l3074l1920
$$ y = [158573377, 134979913, 114875074, 97884349, 83622729, 71739108, 61884286, 53705350, 46893600, 41205602, 36433026, 32389315, 28933748, 25973669, 23429625, 21220738, 19286660, 17594051, 16111329, 14798449, 13626602, 12584759, 11659230, 10826250, 10070309, 9390407, 8781892, 8229594, 7724184, 7268099, 6859368, 6485292, 6137636, 5819222, 5530076, 5261022, 5006177, 4768615, 4548859, 4340336, 4140748, 3955756, 3786935, 3627675, 3474993, 3333835, 3205594, 3083807, 2965586, 2856286, 2758237, 2665405, 2573918, 2487909, 2410137, 2336278, 2263308, 2194732, 2132779, 2073616, 2014679, 1958922, 1907789, 1857721, 1807508, 1761572, 1722067, 1684919, 1647315, 1611963, 1580393, 1549110, 1516036, 1484116]
58099A484116k9043k8935k9969k7712k4201k4199k5617k3270j8951j8048j9386
58088A214785j8073j5440j6415j9615j9767j7659j8252k0911k0765j8149j7695
58077A012044j9472j9520j7830j7609j8059j5874j2444j1807j2981j1957r514
58066H44977r418j0541q762n144m354o241o638n317n590p153o893n756p328j0481
58052G45361j0861q775q328r529q694o072n634p493p731n753m907n770n532m070
58038F46212m121n333m534j972j101k211k385j593k553m657m473k428k561n277
58024F01013o606n213l987m070l333j648j689l495l810j880o29j139j149L0K91
58009E62686o84n56R91J479L77j02M10j93j927k221p63j65j062j240k96m87k109
$$ y = [1484116, 1455073, 1426138, 1396169, 1368457, 1344256, 1320057, 1294440, 1271170, 1252219, 1234171, 1214785, 1196712, 1181272, 1164857, 1145242, 1125475, 1107816, 1089564, 1068653, 1047888, 1029739, 1012044, 992572, 973052, 955222, 937613, 919554, 903680, 891236, 879429, 866448, 854491, 844977, 835559, 825018, 816256, 811112, 806758, 800517, 793879, 788562, 782972, 775819, 768926, 763170, 755842, 745361, 734500, 725725, 717397, 707868, 699174, 693102, 687468, 679975, 672244, 666491, 661584, 655814, 650282, 646212, 642091, 636758, 632224, 630252, 629151, 626940, 624555, 622962, 620409, 615752, 611279, 608851, 606290, 601013, 594407, 589194, 585207, 581137, 577804, 576156, 574467, 570972, 567162, 565282, 564653, 563514, 562365, 562395, 562686, 562002, 561446, 562437, 563916, 564293, 564191, 564601, 564408, 562481, 560260, 559497, 559332, 558270, 557030, 556734, 556247, 554138]
57992E54138k700j650j188j834j426M85J606J154R03J235M22j471k191j572j895
57977E44016l353l528k039j320k026k163j521k325m564n293l767k687l118k771
57963E03541p42O09J50rJ260K006J158N75J360J980J688K108L689M449L823M020
57947E31665N834O995O439O352P945R060Q134O919O911O564M494K260J450R08
57933F11930p13k348k800l126m574o422p773r210j0912j1514j0601r905j0389
57920E21643j0587r426q197p962p512n728l669k555j840r32o59j386j758q72K20
57905D58780N02M91O83N77L03R50K364K944K534K821M030M102K338Q33Q80R53
57889D86085j24j077r35r90k055k587j576o54j222k003j597r23j000p11R20K484
$$ y = [554138, 551438, 549788, 548600, 546766, 545340, 545825, 547431, 548585, 549488, 550723, 551145, 549674, 547483, 545911, 544016, 540663, 537135, 535096, 533776, 531750, 529587, 528066, 525741, 521177, 515884, 512117, 509430, 506312, 503541, 502799, 503408, 503558, 503549, 504809, 506815, 507973, 508548, 509908, 511888, 513576, 515684, 519373, 523822, 527645, 531665, 537499, 544494, 550933, 557285, 565230, 574290, 582424, 589343, 596254, 602818, 607312, 609572, 611022, 611930, 611217, 608869, 606069, 602943, 598369, 591947, 584174, 574964, 564052, 552538, 541937, 532032, 521643, 511056, 501630, 493433, 485471, 477959, 472231, 468562, 466007, 464167, 463235, 462576, 461190, 459432, 458560, 458780, 459282, 459773, 460456, 461033, 461336, 462286, 464650, 467594, 470128, 472949, 476979, 481081, 483419, 484252, 485132, 486085, 485961, 484884, 483949, 482959, 480904, 478317, 476741, 476087, 474865, 472862, 471265, 470342, 469342, 468631, 469551, 472035]
57873D72035K608K444L518N050N685N973O883P696P595P532Q360Q928Q148P275
57859E59730P805Q755Q337O856N776N190M340L432K882J948O7j636j914j296q25
57844F09447k90O20R50J32m49N43K124K658K454K746L296L110K531K591L026K786
57828F38275J836Q89K2r66j591j401r32p89o46j32K26K8j75p6m13j573k745l390
57810F26447m124n131n336m316l344l266l016j650j31L87M10P82J121J059J374
57795F01266K393K926K385K139L077L768K966K029K656L867L657K236J220P95
57781F37380J1j057j724k381l754n276o034o444p227p774p321o665o824p098o391
57766E61421n257m757m417l433k681l262m148l539j751m68K5O03J211J257J371
$$ y = [472035, 474643, 477087, 480605, 485655, 491340, 497313, 504196, 511892, 519487, 527019, 535379, 544307, 552455, 559730, 567535, 576290, 584627, 591483, 597259, 602449, 606789, 610221, 613103, 615051, 615118, 613482, 611568, 610272, 609447, 609157, 609777, 610727, 610859, 610410, 610953, 613077, 615735, 618189, 620935, 624231, 627341, 629872, 632463, 635489, 638275, 640111, 641000, 641022, 640056, 638465, 637064, 636132, 635343, 634697, 634565, 634791, 634819, 634644, 634568, 634155, 632582, 629837, 626447, 622323, 617192, 611856, 607540, 604196, 600930, 597914, 596264, 596133, 596520, 596930, 597712, 598833, 599892, 601266, 603659, 606585, 608970, 611109, 614186, 617954, 620920, 622949, 625605, 629472, 633129, 635365, 636585, 637380, 637391, 636334, 634610, 632229, 628475, 623199, 617165, 610721, 603494, 595720, 588399, 581734, 574910, 567812, 561421, 556164, 551407, 546990, 543557, 540876, 537614, 533466, 529927, 528176, 527708, 527733, 528336, 529547, 530804, 532175]
57751E32175K437L574L346K334K202K842K845K312K625L753M221L712L318L277
57737E74973K758J932K035L067L550K919K299K565L326M145N151O100O271N679
57723F26770N185N205N323N257N106M824M339L958L735L032J643N82O02Q43L28
57708F76732k62J46R45R39N86J132K231K523K032J835J780Q08p91j635j684k205
57692F85112l317l652k671j350l62O71K012L496N425Q074J0491J1607J2293J4400
57678G42229J7886K1038K3545K7045L2350L8432M4639N1571N8774O3637O3870
57667A185016N9709N2616M2990L0135J3670n622k5626m3239n5800o2570o4420
57656A126859o2459n7802n1970m6030l9662l2523k6059k2164k0315j8061j4407
$$ y = [532175, 534612, 538186, 541532, 543866, 546068, 548910, 551755, 554067, 556692, 560445, 564666, 568378, 571696, 574973, 577731, 579663, 581698, 584765, 588315, 591234, 593533, 596098, 599424, 603569, 608720, 614820, 621091, 626770, 631955, 637160, 642483, 647740, 652846, 657670, 662009, 665967, 669702, 672734, 674377, 674959, 675561, 676404, 676732, 676470, 676616, 677561, 678500, 679086, 680218, 682449, 684972, 687004, 688839, 690619, 691427, 690636, 689001, 687317, 685112, 681795, 678143, 675472, 674122, 673760, 674431, 676443, 679939, 685364, 693438, 703929, 715536, 727829, 742229, 760115, 781153, 804698, 831743, 864093, 902525, 947164, 998735, 1057509, 1121146, 1185016, 1244725, 1297341, 1340331, 1370466, 1384136, 1378514, 1352888, 1309649, 1253849, 1191279, 1126859, 1064400, 1006598, 954628, 908598, 868936, 836413, 810354, 788190, 767875, 749814, 735407]
57645G35407j0792q542p328o478n991n625m644l058j804j191n64K78P16O43P33
57630F81760J088J021M35%j63n47r04m81L43L61l87o22j13L4l67r1J115J754J024
57611F85260J14K09Q62J380K128L387M369M467M205M076L660K748K125K337K784
57596G24111K709K121J240J97l82J65J164J213M51M79J637K357J873J372J577
57581G42284J350Q9o26N33K328K886K477K529L135L409L326L358L083J940P61
57566G72862Q82K152L263L660L840M153M512N002N674O036N661M946M475M129
57552H31247L633L394L921M953N920O686P175P016O304N943O395O848O460N568
57538I11463M830M124L295L022L800M845N248N410O123O877O586N409M549M522
$$ y = [735407, 724615, 716073, 708745, 702267, 696276, 690651, 686007, 682949, 681145, 679954, 679390, 679668, 680384, 681027, 681760, 682848, 683869, 684304, 684304, 684141, 683594, 682690, 682209, 682552, 682913, 682526, 681904, 681791, 681825, 681458, 681367, 682482, 684236, 685260, 685374, 685583, 686445, 687825, 689953, 693340, 697709, 702176, 706381, 710457, 714117, 716865, 718990, 721327, 724111, 726820, 728941, 730181, 730378, 729996, 730161, 731325, 732538, 732989, 733468, 735105, 737462, 739335, 740707, 742284, 743634, 743723, 743097, 743630, 745958, 748844, 751321, 753850, 756985, 760394, 763720, 767078, 770161, 772101, 772862, 773744, 775896, 779159, 782819, 786659, 790812, 795324, 800326, 806000, 812036, 817697, 822643, 827118, 831247, 834880, 838274, 842195, 847148, 853068, 859754, 866929, 873945, 880249, 886192, 892587, 899435, 905895, 911463, 916293, 920417, 923712, 926734, 930534, 935379, 940627, 946037, 952160, 959037, 965623, 971032, 975581, 980103]
57524I80103M878N361O163P115P709P894Q048Q305Q511Q585Q289P209N667N008
57510A078845O064P878Q863Q718Q283P976P572P171P228P627P628O810N485M284
57496A180432L817M327N279N712N483N472O073O380N725N060N637P070P938P852
57482A262257P569P475P265P025P315Q065Q416P918P131O883P445Q447R171R131
57468A371513Q707Q796R473R731R068Q497R064J0249J0829J0669J0484J0413J0141
57455A497634R975J0431J1053J1008J0628J0991J2091J2762J2521J2190J2451
57444A623735J2981J3340J3653J3980J3921J3229J2213J1304J0748J0752J1321
57433A761177J1983J2306J2512J2910J3049J2406J1728J2383J4327J5858J5824
$$ y = [980103, 984981, 990342, 996505, 1003620, 1011329, 1019223, 1027271, 1035576, 1044087, 1052672, 1060961, 1068170, 1073837, 1078845, 1084909, 1092787, 1101650, 1110368, 1118651, 1126627, 1134199, 1141370, 1148598, 1156225, 1163853, 1170663, 1176148, 1180432, 1184249, 1188576, 1193855, 1199567, 1205050, 1210522, 1216595, 1222975, 1228700, 1233760, 1239397, 1246467, 1254405, 1262257, 1269826, 1277301, 1284566, 1291591, 1298906, 1306971, 1315387, 1323305, 1330436, 1337319, 1344764, 1353211, 1362382, 1371513, 1380220, 1389016, 1398489, 1408220, 1417288, 1425785, 1434849, 1445098, 1455927, 1466596, 1477080, 1487493, 1497634, 1507609, 1518040, 1529093, 1540101, 1550729, 1561720, 1573811, 1586573, 1599094, 1611284, 1623735, 1636716, 1650056, 1663709, 1677689, 1691610, 1704839, 1717052, 1728356, 1739104, 1749856, 1761177, 1773160, 1785466, 1797978, 1810888, 1823937, 1836343, 1848071, 1860454, 1874781, 1890639, 1906463]
57422A906463J4937J4488J4711J5068J5392J5869J6343J6369J5900J5456J5542
57411B076538J6112J6640J6734J6642J6924J7630J8170J8203J8162J8468J8798
57400B269021J8598J7997J7570J7535J7760J8168J8580J8555J8082J7959J8709
57389B468534J9642J9846J9676K0155K1213K1686K1018J9894J9116J8862J9081
57378B688723J9678K0183K0178K0100K0631K1371K1200K0175J9808K0984K2698
57367B915729K3566K3628K3870K4602K5205K5222K4985K5088K5685K6361K6549
57356C190490K6095K5419K5019K5008K5289K5862K6620K7177K7355K7582K8231
57345C480147K8937K9158K9096K9263K9474K9180K8647K8758K9649L0568L1160
$$ y = [1906463, 1921400, 1935888, 1950599, 1965667, 1981059, 1996928, 2013271, 2029640, 2045540, 2060996, 2076538, 2092650, 2109290, 2126024, 2142666, 2159590, 2177220, 2195390, 2213593, 2231755, 2250223, 2269021, 2287619, 2305616, 2323186, 2340721, 2358481, 2376649, 2395229, 2413784, 2431866, 2449825, 2468534, 2488176, 2508022, 2527698, 2547853, 2569066, 2590752, 2611770, 2631664, 2650780, 2669642, 2688723, 2708401, 2728584, 2748762, 2768862, 2789493, 2810864, 2832064, 2852239, 2872047, 2893031, 2915729, 2939295, 2962923, 2986793, 3011395, 3036600, 3061822, 3086807, 3111895, 3137580, 3163941, 3190490, 3216585, 3242004, 3267023, 3292031, 3317320, 3343182, 3369802, 3396979, 3424334, 3451916, 3480147, 3509084, 3538242, 3567338, 3596601, 3626075, 3655255, 3683902, 3712660, 3742309, 3772877, 3804037]
57334C804037L1843L2654L2909L2497L2434L3427L4665L4849L3945L3132L3247
57323D169639L4014L4701L5011L5135L5298L5473L5561L5664L5892L5976L5463
57312D557827L4527L4096L4761L5935L6626L6631L6471L6504L6787L7420L8309
57301D955894L8849L8637L8228L8435L9120L9569L9770M0278M1039M1441M1534
57290E392794M2045M3074M3844M4040M4260M4865M5370M5422M5418M5684M5846
57279E882662M5535M4996M4530M3932M2947M1758M0711M0015L9897M0410M1012
57268F348405M1084M1014M1916M3942M5805M6387M6056M5851M6138M6584M6819
57257F840001M6531M5483M3956M2705M2037M1424M0426L9402L8859L8650L8310
$$ y = [3804037, 3835880, 3868534, 3901443, 3933940, 3966374, 3999801, 4034466, 4069315, 4103260, 4136392, 4169639, 4203653, 4238354, 4273365, 4308500, 4343798, 4379271, 4414832, 4450496, 4486388, 4522364, 4557827, 4592354, 4626450, 4661211, 4697146, 4733772, 4770403, 4806874, 4843378, 4880165, 4917585, 4955894, 4994743, 5033380, 5071608, 5110043, 5149163, 5188732, 5228502, 5268780, 5309819, 5351260, 5392794, 5434839, 5477913, 5521757, 5565797, 5610057, 5654922, 5700292, 5745714, 5791132, 5836816, 5882662, 5928197, 5973193, 6017723, 6061655, 6104602, 6146360, 6187071, 6227086, 6266983, 6307393, 6348405, 6389489, 6430503, 6472419, 6516361, 6562166, 6608553, 6654609, 6700460, 6746598, 6793182, 6840001, 6886532, 6932015, 6975971, 7018676, 7060713, 7102137, 7142563, 7181965, 7220824, 7259474, 7297784]
57246G297784L7840L7598L7695L7871L7771L7234L6612L6789L8315M0474M1887
57235G717870M2132M2085M2518M3196M3625M3777M3721M3237M2347M1564M1120
57224H187192M0541L9377L7768L5929L3711L1064K8296K5449K2138J8425J5157
57213H515047J2913J1228R391P398N680M412L625L509M139N319O994R301J1982
57200H610938J4420J6465J8571K0878K2974K4715K6384K7766K8142K7476K6536
57189H865265K5480K3581K0819J8257J6127J3180Q935N009K759J041j991n957
57177H992505r077j1105j3350j6236j8824k0772k2921k5721k8532l0814l2678
57166H762475l4080l4646l4515l4250l3651l1708k8065k3613j9286j5023j0069
$$ y = [7297784, 7335624, 7373222, 7410917, 7448788, 7486559, 7523793, 7560405, 7597194, 7635509, 7675983, 7717870, 7760002, 7802087, 7844605, 7887801, 7931426, 7975203, 8018924, 8062161, 8104508, 8146072, 8187192, 8227733, 8267110, 8304878, 8340807, 8374518, 8405582, 8433878, 8459327, 8481465, 8499890, 8515047, 8527960, 8539188, 8548579, 8555977, 8561657, 8566069, 8569694, 8573203, 8577342, 8582661, 8589655, 8598956, 8610938, 8625358, 8641823, 8660394, 8681272, 8704246, 8728961, 8755345, 8783111, 8811253, 8838729, 8865265, 8890745, 8914326, 8935145, 8953402, 8969529, 8982709, 8991644, 8996653, 8999412, 9000453, 8998462, 8992505, 8983428, 8972323, 8958973, 8942737, 8923913, 8903141, 8880220, 8854499, 8825967, 8795153, 8762475, 8728395, 8693749, 8659234, 8624984, 8591333, 8559625, 8531560, 8507947, 8488661, 8473638, 8463569]
57155H463569l711M307J3261K1208K5932K6364K2861J6560Q917J279o177j4613
57143H579757k4774l5482m5027n3456o2038p0857p8554q4364q8685r1509r1974
57132G853037q9882q6092q0877p3387o3419n2343m1650l1839k3448j7883j6190
57121G276027j8027k2535k9235l7211m4462m8860m9007m3717l2011j4667N404
57110F941699K5324M4049O1517P7847R4768J16572J48111J92551K52113L29287
57100H283838M25687N40900O73913Q23626R85852J152010J313827J467742J612190
57091A7279585J743858J858955J947993J974752J868274J572463J137417P57162
57083C0140459O77686J025780J702685K432642K917161K973997K586574J871106
$$ y = [8463569, 8459858, 8464165, 8477426, 8498634, 8524566, 8550930, 8573791, 8590351, 8599268, 8600547, 8594370, 8579757, 8554983, 8519501, 8474474, 8421018, 8358980, 8288123, 8209569, 8125205, 8036520, 7945011, 7853037, 7763155, 7677063, 7596186, 7522799, 7459380, 7407037, 7365387, 7333548, 7310100, 7292217, 7276027, 7258000, 7235465, 7206230, 7169019, 7124557, 7075697, 7026690, 6982973, 6950962, 6936295, 6941699, 6967023, 7011072, 7072589, 7150436, 7245204, 7361776, 7509887, 7702438, 7954551, 8283838, 8709525, 9250425, 9924338, 10747964, 11733816, 12885826, 14199653, 15667395, 17279585, 19023443, 20882398, 22830391, 24805143, 26673417, 28245880, 29383297, 30140459, 30818145, 31843925, 33546610, 35979252, 38896413, 41870410, 44456984, 46328090]
57075D6328090J003941J46919n99859j202457j667602k017919k282666k492398
57067C7216049k666672k804040k887455k900134k836373k701827k509771k278170
57059A5631607k026485j772072j528499j305607j109070r39872p95912o74781
57051E479309n74549m92629m25553l70239l24545k86596k54510k26992k03485
57042B320211j83559j66608j51954j38799j26267j14000j02289r1180p9970o8154
57032A097431n6131m4147l1407j7600m810L579N929L168l341j3326k6527m1145
57020H71673n4107o2727o6083o5240o2132n7946n2712m6582m0696l6059l2294
57009B95095k8474k4626k1296j8260j5052j2360j1266j1164j0103p449m662l022
$$ y = [46328090, 47332031, 47478950, 46879091, 45676634, 44009032, 41991113, 39708447, 37216049, 34549377, 31745337, 28857882, 25957748, 23121375, 20419548, 17909777, 15631607, 13605122, 11833050, 10304551, 8998944, 7889874, 6950002, 6154090, 5479309, 4904760, 4412131, 3986578, 3616339, 3291794, 3005198, 2750688, 2523696, 2320211, 2136652, 1970044, 1818090, 1679291, 1553024, 1439024, 1336735, 1245555, 1165585, 1097431, 1041300, 997153, 965746, 948146, 943336, 946915, 952844, 956012, 952671, 939345, 912818, 871673, 817566, 754839, 688756, 623516, 561384, 503438, 450726, 404144, 363448, 327389, 295095, 266621, 241995, 220699, 202439, 187387, 175027, 163761, 152597, 142494, 135045, 130383, 127361]
56997A27361k046p98O47J870L123M652N966O728P724R918J2975J5586J7011J7538
56983B28255J7565J6889J4923J1324O382R45m149q557j2234j4843j5868j5266
56971B25366j3602j1485r260p094m902k295Q27L826O185Q602J2194J6642K0242
56958B45246K1950K2311K1948K0257J6330J0388L479l619j0502j6553k1007k3457
56946B86771k3844k2179j8635j3806q623m053p33J503L725P022J1467J6357K1235
56933B56207K5942K9731L1325L0185K6868K1827J4709N325n368j5781k4661l1168
56921C65141l4719l5311l3727l0914k7472k3894k0700j7984j5314j2481r867p767
56909I4991n870l801j762k41N74Q23P74P69J057J509J916K551L892N771P500Q857
$$ y = [127361, 125315, 124517, 125164, 127034, 130157, 134809, 140775, 147503, 155227, 165145, 178120, 193706, 210717, 228255, 245820, 262709, 277632, 288956, 295338, 296283, 292134, 283577, 271343, 256500, 240632, 225366, 211764, 200279, 191019, 183925, 179023, 176728, 177555, 181381, 187566, 196168, 208362, 225004, 245246, 267196, 289507, 311455, 331712, 348042, 358430, 361909, 358290, 347788, 331235, 310228, 286771, 262927, 240748, 222113, 208307, 199684, 195631, 194898, 196401, 200126, 207148, 218615, 234972, 256207, 282149, 311880, 343205, 373390, 400258, 422085, 436794, 442119, 436751, 420970, 396309, 365141, 330422, 295111, 261384, 230470, 202998, 179104, 158404, 140420, 125106, 112625, 102758, 94991, 89121, 85320, 83558, 83317, 83891, 84714, 85488, 86257, 87314, 88823, 90739, 93290, 97182, 102953, 110453, 119310]
56893A19310J0274J1948J3578J5190J7224J9517K1043K1097J9922J7805J4451
56882C01359R837M759o9m772r405j3002j4346j3362j1062q429n773k830Q37N270
56868B39012R785J3707J7507K2462K8983L5999M2193M6853M9280M8549M4553L8285
56856F37168L0290J9789O274q723k2320l2276l7706l8622l5817l0663k4264j6929
56844D46201q895q08P012J5057K3820L3183M3182N4249O5775P5235P9939P9134
56832I13084P3529O3520M8915K9914P333j7521m2155o2658p5604q0230p8094p1217
56820G08816o1427n0738m0650l1040k0894j0155J55R614J9085K9458M0330N0034
56808F42588N6454N7996N4396M6586L5439K1044L588j5567l4244n0352o1889o7052
$$ y = [119310, 129584, 141532, 155110, 170300, 187524, 207041, 228084, 249181, 269103, 286908, 301359, 311196, 315955, 315886, 311114, 301709, 288707, 274361, 260999, 249937, 241508, 235735, 232905, 233742, 239012, 248797, 262504, 280011, 302473, 331456, 367455, 409648, 456501, 505781, 554330, 598883, 637168, 667458, 687247, 693521, 684798, 662478, 630202, 592496, 553874, 518057, 487394, 463130, 446201, 437306, 436498, 443510, 458567, 482387, 515570, 558752, 613001, 678776, 754011, 833950, 913084, 986613, 1050133, 1099048, 1128962, 1136295, 1118774, 1076619, 1013961, 938357, 858127, 780033, 708816, 647389, 596651, 556001, 524961, 504067, 493912, 494067, 503681, 522766, 552224, 592554, 642588, 699042, 757038, 811434, 858020, 893459, 914503, 918091, 902524, 868280, 817928, 756039, 688987]
56796F88987o5629n9799n2438m4848l6861k8564k0666j3551p111j319M067R976
56784C72244J6930K3626K7840K8742K7227K4073J8975J1525K027q803j9966k9853
56772D94587l6788m0223m0765l9064l5470l0780k6246k2522j9280j6083j3033
56761A74333j0523q842q036p715p112n955m897m543m467l941l137k706k563k166
56747I7730j624j428j409j096q13j162j690j465p50o48j035n16J251K758K739
56732I0842J744R77P30O59O58P21O64N35P04J105J149P54P19J527K515K697J974
56715A10674J036N22N74R30J188J220J305J605J824J783J955K660L141K381O26
56700A33424q60j410j313q06J36J017J084M86R1P4j64o42p08m45q41k100l097
$$ y = [688987, 623358, 563559, 511121, 466273, 429412, 400848, 380182, 366631, 359520, 358201, 362268, 372244, 389174, 412800, 440640, 469382, 496609, 520682, 539657, 551182, 553209, 544406, 524440, 494587, 457799, 417576, 376811, 337747, 302277, 271497, 245251, 222729, 203449, 187366, 174333, 163810, 154968, 146932, 139217, 132105, 126150, 121253, 116710, 112243, 108302, 105165, 102459, 99896, 97730, 96106, 94678, 93269, 92173, 91360, 90198, 88508, 87043, 86293, 85645, 84610, 84094, 85345, 88103, 90842, 92586, 93563, 94293, 94952, 95610, 96331, 96995, 97530, 98234, 99339, 100488, 101242, 101961, 103488, 106003, 108700, 110674, 111710, 112232, 112806, 113736, 114924, 116144, 117449, 119054, 120878, 122661, 124616, 127276, 130417, 132798, 133424, 132564, 131154, 129841, 129035, 129171, 130188, 131272, 131758, 131849, 131923, 131759, 131117, 130409, 129964, 129123, 127023, 123926]
56683A23926l004k275j552q13j80l39j341j995j439l90l5l96p07p30p72q58o81
56666A06419j90L82Q68J246J532J831K157K177J616R35R52J637J997J364J23r23
56650A24123j256o30P52J921J808O28k47k6O98J097J193J271J105L69p34j736
56634A30336k388k592k357j937j581j081k25M29O3j053j723j444r22p47n76m1
56618A12161N35P73Q33Q76O42L0n15n28k1O99J209J060L19r1N92J755K114J438
56600A23881O09J27j70r8P19J601J263k09j235q95P1P21R31O70k16j040o00R20
56582A27050J890J563J037J229J550J403J371J818J837Q52n5K56J161J377J001
56567A45340J089J873K629K887K764K451K146K093K196K085J839J927K196J851
$$ y = [123926, 120922, 118647, 117095, 116282, 116102, 115763, 114422, 112427, 110988, 110598, 110563, 110167, 109460, 108730, 107958, 107100, 106419, 106229, 106611, 107479, 108725, 110257, 112088, 114245, 116422, 118038, 118973, 119925, 121562, 123559, 124923, 125046, 124123, 122867, 122237, 122989, 124910, 126718, 127346, 127099, 127073, 127771, 128868, 130061, 131332, 132437, 132806, 132072, 130336, 127948, 125356, 122999, 121062, 119481, 118400, 118175, 118604, 118667, 117614, 115891, 114447, 113525, 112778, 112202, 112161, 112696, 113469, 114302, 115178, 115820, 115850, 115335, 114807, 114786, 115485, 116694, 117754, 118073, 117982, 118574, 120329, 122443, 123881, 124490, 124617, 124447, 124349, 125068, 126669, 127932, 127723, 126488, 125593, 125664, 126385, 127316, 127986, 127770, 126730, 126130, 127050, 128940, 130503, 131540, 132769, 134319, 135722, 137093, 138911, 140748, 141600, 141545, 141801, 142962, 144339, 145340, 146429, 148302, 150931, 153818, 156582, 159033, 161179, 163272, 165468, 167553, 169392, 171319, 173515, 175366]
56553A75366Q20J3m4J89L79P05Q41j5j542k302j913j659k259k677k085j230q41
56536A61746l66M74N76o18j670j214o4L37K11N30R50N64k05k59L20O18N04M56
56518A62890M24J77J06M10L02o77j454r04K84O41P5m54o93j029j271r60l83r7
56500A57387R7N68R34Q25P26J010J033L70p6M70J175J002N63R05J485J058r2o64
56482A68776m34k23l35n06r05j587j629l17J345J808J134N04K97Q5o1J85M53M31
56464A69021Q08K000K796J919J92o43m57l87o13n00k61n33p78q3R45R76K36O3
56446A74701N39O19K36L54J015J223P60L58K00j39m95l70r3k02j98M77R13O8j049
56427A78917o60Q69J628J331J386K088K126J129L54M41N37R1l35m05m66m34K09
$$ y = [175366, 176186, 176199, 176155, 176344, 176723, 177428, 178269, 178254, 176712, 174410, 172497, 170838, 168579, 165902, 163817, 162587, 161746, 161380, 161854, 162430, 161812, 160142, 158928, 158864, 159201, 159412, 159942, 160892, 161456, 161251, 160992, 161312, 161930, 162434, 162890, 163314, 163491, 163597, 164007, 164309, 163632, 162178, 161274, 161558, 162199, 162274, 161820, 161127, 160098, 158827, 157867, 157484, 157387, 157484, 158052, 158986, 159811, 160537, 161547, 162580, 162950, 162874, 163344, 164519, 165521, 166084, 166989, 168474, 169532, 169440, 168776, 168342, 168119, 167784, 167278, 166373, 164786, 163157, 162840, 164185, 165993, 167127, 167631, 167928, 168013, 167952, 168137, 168590, 169021, 169829, 171829, 174625, 176544, 176736, 176093, 175636, 175249, 174636, 174136, 173875, 173342, 172564, 172481, 173426, 174402, 174638, 174701, 175240, 175859, 176095, 176449, 177464, 178687, 179447, 179805, 180005, 179866, 179371, 179001, 178908, 178706, 178508, 178985, 179898, 179966, 178917, 178257, 179126, 180754, 182085, 183471, 185559, 187685, 188814, 189168, 189609, 190146, 190237, 189902, 189497, 189031, 188597, 188806]
56410A88806J143J449J197J202J397J083N96R06J647J488L72l99k34L67J320K824
56394B05164L912L264J451L79M65M29j25j75N20R49Q43J085J804K094J857J969
56378B25885K402K174J352J029J199Q07M1L06J580K124J318N13N09M25k51n93
56362B40820j4P60J136J347J245L11q20o30J011K713L764M559M808L700K001J556
56346B68267K330K387J220N07J049J640J619J861K399J848K44k54J152K349J715
56331B90333N95P74J700J977J773J950K371K630L060L775M047L666L472L723L472
56316C29318K452J806K187K810L214M081N417N886M952L937L970M609N326O438
56302C86403P717Q018P217O725P200P650P500P539Q078Q286Q134Q742J0042J0431
$$ y = [188806, 189949, 191398, 192595, 193797, 195194, 196277, 196873, 197779, 199426, 200914, 201286, 200887, 200653, 201020, 202340, 205164, 209076, 212340, 213791, 214170, 214635, 215064, 214939, 214764, 215284, 216233, 217076, 218161, 219965, 222059, 223916, 225885, 228287, 230461, 231813, 232842, 234041, 234848, 234889, 235195, 236775, 238899, 240217, 240730, 241239, 241664, 241413, 240820, 240806, 241566, 242702, 244049, 245294, 245605, 244785, 244155, 245166, 247879, 251643, 256202, 261010, 264710, 266711, 268267, 270597, 272984, 274204, 274711, 275760, 277400, 279019, 280880, 283279, 285127, 285371, 285117, 286269, 288618, 290333, 290928, 291702, 293402, 295379, 297152, 299102, 301473, 304103, 307163, 310938, 314985, 318651, 322123, 325846, 329318, 331770, 333576, 335763, 338573, 341787, 345868, 351285, 357171, 362123, 366060, 370030, 374639, 379965, 386403, 394120, 402138, 409355, 416080, 423280, 430930, 438430, 445969, 454047, 462333, 470467, 479209, 489251, 499682]
56288D99682R694R724J1280J2541J2164J1302J1271J1625J2026J3542J6514J9351
56276F50716K1055K2762K5322K7677K9230L1439L5289L9445M2754M6426N1840
56265A023955N8223O4478P1261P9329Q7732R5592J03894J13607J23756J33190
56255A955017J42463J52046J60455J66061J69247J70945J70514J66763J59613
56246C413124J49264J35166J17209R6421P3318M7386J9402p905l2832n6284p8990
56235C875279r9410j15930j29004j39493j47049j51655j54510j55787j53966j48983
56225B479492j43363j38421j32158j23117j13559j06167j00129r3250q5747p9133
56215A364448p3186o6899o0858n6115n2021m7479m2996l9385l6019l2231k8867
$$ y = [499682, 509376, 519100, 530380, 542921, 555085, 566387, 577658, 589283, 601309, 614851, 631365, 650716, 671771, 694533, 719855, 747532, 776762, 808201, 843490, 882935, 925689, 972115, 1023955, 1082178, 1146656, 1217917, 1297246, 1384978, 1480570, 1584464, 1698071, 1821827, 1955017, 2097480, 2249526, 2409981, 2576042, 2745289, 2916234, 3086748, 3253511, 3413124, 3562388, 3697554, 3814763, 3911184, 3984502, 4031888, 4051290, 4043385, 4010553, 3954269, 3875279, 3775869, 3659939, 3530935, 3391442, 3244393, 3092738, 2938228, 2782441, 2628475, 2479492, 2336129, 2197708, 2065550, 1942433, 1828874, 1722707, 1622578, 1529328, 1443581, 1364448, 1291262, 1224363, 1163505, 1107390, 1055369, 1007890, 964894, 925509, 889490, 857259, 828392]
56204H28392k6603k4444k1664j9282j7900j6242j3610j1533j1040j0643r097p684
56192F38650p601p519o146m752m734m993m152l061k724k118n00O16K32M3J406
56177E92647K786K776K797M078M840L605K414L505N522O323O837Q644J0398J0400
56163F67572J0153J1643J3473J3595J3546J5937J9836K2627K4533K7450L1108
56152H71473L4251L7951M3918N1185N8048O5495P5169Q5749R4900J02841J10430
56141A631410J15759J16390J13126J08018J00779R0706P9803P0110O0328M8947
56131B535376L8161L0545K4305J6249P109n85p614j6310k5928l4472m3044n3610
56119B470182o4565p3316q1211r0889j00717j06843j08879j08659j05418r7567
$$ y = [828392, 801789, 777345, 755681, 736399, 718499, 702257, 688647, 677114, 666074, 655431, 646334, 638650, 631049, 623530, 617384, 612632, 607898, 602905, 598753, 595692, 592968, 590850, 590350, 590966, 591198, 591241, 592647, 595433, 598209, 601006, 605084, 609924, 613529, 615943, 619448, 624970, 631293, 638130, 646774, 657172, 667572, 677725, 689368, 702841, 716436, 729982, 745919, 765755, 788382, 812915, 840365, 871473, 905724, 943675, 987593, 1038778, 1096826, 1162321, 1237490, 1323239, 1418139, 1520980, 1631410, 1747169, 1863559, 1976685, 2084703, 2185482, 2276188, 2355991, 2426101, 2486429, 2535376, 2573537, 2604082, 2628387, 2644636, 2651745, 2651160, 2643546, 2627236, 2601308, 2566836, 2523792, 2470182, 2405617, 2332301, 2251090, 2160201, 2059484, 1952641, 1843762, 1735103, 1629685, 1532118]
56109A532118q7375p8413p0003n9445m8040l9455l3582k7553k1430j7467j5003
56098A034352j1504p475n219m042j788M66N08J7K059N303O281N705O831R303J0355
56083A051152J0449J1885J3578J3052J1815J2778J4355J3285J1111J1356J2500
56072A187316J0715P443O941Q282P348N078N894R256J0627R783J0441J2600J3086
56059A304810J2659J4801J8303J8872J7200J7587J9656J9509J7982J9307K2541
56048A503227K2915K0963K1602K4856K6214K5453K6376K8484K8007K6398K8524
56037A783019L3099L4403L2727L3436L6464L6858L5060L6208L9703M0171L8449
56026B179597M0613M6293M9060M8445N0197N4690N6579N6097N8775O3939O5569
$$ y = [1532118, 1444743, 1366330, 1296327, 1236882, 1188842, 1149387, 1115805, 1088252, 1066822, 1049355, 1034352, 1022848, 1015373, 1010154, 1006112, 1004324, 1004790, 1005298, 1005315, 1007374, 1012677, 1018958, 1024663, 1031494, 1040797, 1051152, 1061601, 1073486, 1087064, 1100116, 1111931, 1124709, 1139064, 1152349, 1163460, 1174816, 1187316, 1198031, 1205474, 1212415, 1220697, 1228045, 1233123, 1239017, 1248273, 1258900, 1268683, 1279124, 1291724, 1304810, 1317469, 1332270, 1350573, 1369445, 1386645, 1404232, 1423888, 1443397, 1461379, 1480686, 1503227, 1526142, 1547105, 1568707, 1593563, 1619777, 1645230, 1671606, 1700090, 1728097, 1754495, 1783019, 1816118, 1850521, 1883248, 1916684, 1953148, 1990006, 2025066, 2061274, 2100977, 2141148, 2179597, 2220210, 2266503, 2315563, 2364008, 2414205, 2468895, 2525474, 2581571, 2640346, 2704285, 2769854]
56015B769854O4644O8027P4992P7932P6682P8698Q4637Q7773Q8161R2846J01227
56004C665473J05292J05435J10539J21064J27999J30125J35784J45767J51624
55995D799102J53116J59721J72325J81516J86582J97492K15189K29433K39231
55986F533707K55157K78150K97309L12235L35323L67982L97974M24461M60919
55977I663217N08651N53815N96030O52061P25187Q00669Q78288R77890J105284
55968A6461092J246791J406564J613663J883138K209519K608613L121473L763224
55960C4314077M513135N366554O344052P439886Q631319R963101J1556005J3521500
55952A01649629J5963982J9058293K2895140K7064150L0522356L2149488L1492356
$$ y = [2769854, 2834498, 2902525, 2977517, 3055449, 3132131, 3210829, 3295466, 3383239, 3471400, 3564246, 3665473, 3770765, 3876200, 3986739, 4107803, 4235802, 4365927, 4501711, 4647478, 4799102, 4952218, 5111939, 5284264, 5465780, 5652362, 5849854, 6065043, 6294476, 6533707, 6788864, 7067014, 7364323, 7676558, 8011881, 8379863, 8777837, 9202298, 9663217, 10171868, 10725683, 11321713, 11973774, 12698961, 13499630, 14377918, 15355808, 16461092, 17707883, 19114447, 20728110, 22611248, 24820767, 27429380, 30550853, 34314077, 38827212, 44193766, 50537818, 57977704, 66609023, 76572124, 88128129, 101649629, 117613611, 136671904, 159567044, 186631194, 217153550, 249303038, 280795394]
55945B80795394K8841713K4602503J8785798J1180518J879661q413798j8443235
55938C39228554k6703795l1960905l3811997l2846186l0184369k6816780k3316069
55931A33588453j9967018j6930596j4262757j1933403r916160q222675o842048
55924D5513796n714263m785309m036101l441331k950837k531027k182825j902601
55916A7969502j663430j448759j268013j124176r98482q80264p81093p06174o40179
55907H458932n73598n16455m74005m34060l90002l52582l27497l03533k73812
55898D813388k47760k31495k16303j96741j80917j72900j63195j46583j31970
55889C125524j25041j17836j04931r3871r0223q7409q0417p5151p5456p4923o9968
$$ y = [280795394, 309637107, 334239610, 353025408, 364205926, 366085587, 357671789, 339228554, 312524759, 280563854, 246751857, 213905671, 183721302, 156904522, 133588453, 113621435, 96690839, 82428082, 70494679, 60578519, 52355844, 45513796, 39799533, 35014224, 30978123, 27536792, 24585955, 22054928, 19872103, 17969502, 16306072, 14857313, 13589300, 12465124, 11466642, 10586378, 9805285, 9099111, 8458932, 7885334, 7368879, 6894874, 6460814, 6070812, 5718230, 5390733, 5087200, 4813388, 4565628, 4334133, 4117830, 3921089, 3740172, 3567272, 3404077, 3257494, 3125524, 3000483, 2882647, 2777716, 2683845, 2593622, 2506213, 2425796, 2350645, 2275189, 2200266, 2130298]
55878B130298o7499p1263p3808p0096o6259o6829o5913n9246n2884n1630n0316
55867A434555m4709l9995m0376m0800l6943l3338l3970l4525l1378k8853l0275
55856A039393l1066k7718k4649k5334k5461k1688j8356j8855j9037j5898j4043
55845G97288j6762j9107j6889j4329j5691j7301j5060j2276j2757j3337j0537
55834F33242p766q737j0106p740m204l288k934k86J969Q19r47l3J211j54j721
55819E89325p21L96r99k294r73l9k485n471n734n617q029j0421r661q117r037
55804E20123j0476r529q096q782r462p544n356n755o554m906l005l816n215m005
55790D27622j963k296l709l550l200m882o595n716m355n613p702p260n482n571
$$ y = [2130298, 2062799, 1991536, 1917728, 1847632, 1781373, 1714544, 1648631, 1589385, 1536501, 1484871, 1434555, 1389846, 1349851, 1309475, 1268675, 1231732, 1198394, 1164424, 1129899, 1098521, 1069668, 1039393, 1008327, 980609, 955960, 930626, 905165, 883477, 865121, 846266, 827229, 811331, 797288, 780526, 761419, 744530, 730201, 714510, 697209, 682149, 669873, 657116, 643779, 633242, 625476, 616739, 606633, 598893, 594689, 591401, 588467, 588181, 590150, 590969, 590022, 589989, 591200, 591046, 589325, 588604, 589000, 588001, 585707, 584734, 584695, 582210, 576739, 571005, 565388, 557359, 546938, 537277, 529160, 520123, 509647, 500118, 492022, 483240, 473778, 466234, 460878, 455123, 448569, 443663, 440658, 436842, 431627, 427622, 425659, 423363, 419654, 416104, 412904, 408022, 401427, 395711, 391356, 385743, 378041, 370781, 365299, 359728]
55776C59728o875o836o184p076q519q460q015r003r820q271o022n741o357n576
55762B56973m462n033n890m703k626j946j923j060q54k867m816l996k027j751
55748B13019k067m59J893K298J518J857K464J202q10j120n26j213k298j622k63
55733B13873o97k142k147j254j683k869k624j469j615k778l018k578l034l758
55719A82207k992j336o47o66j8P35L64j91M67J272P77L33J758L643L601K424K380
55702A94111L017K415J047P11J025N32j05M64J261Q21L65J715L654L956L264L430
55686B21683L779K800J664K216L208K439R26Q88J386K48j351o68J574K464J957
55671B45213K179K800J696n66j466j109j758l338l736l102l595n125n539m812
$$ y = [359728, 352853, 346017, 339833, 332757, 324238, 315778, 307763, 298760, 288940, 280669, 274647, 268906, 262549, 256973, 252511, 247478, 241588, 236885, 234259, 232313, 230390, 229330, 228476, 225609, 220793, 216797, 214770, 213019, 210952, 210493, 212386, 214684, 216202, 218059, 220523, 221725, 220915, 219795, 219269, 218056, 215758, 214136, 213873, 213176, 211034, 208887, 207633, 205950, 203081, 200457, 198988, 197373, 194595, 191577, 188999, 185965, 182207, 179215, 177879, 177232, 176566, 176548, 177283, 177647, 177456, 177923, 179195, 179972, 180305, 182063, 185706, 189307, 191731, 194111, 197128, 199543, 200590, 201301, 202326, 202858, 202753, 203217, 204478, 205299, 205664, 207379, 211033, 214989, 218253, 221683, 225462, 228262, 229926, 232142, 235350, 237789, 238715, 239603, 240989, 241237, 239886, 239218, 240792, 243256, 245213, 247392, 250192, 251888, 251322, 249856, 248747, 246989, 243651, 239915, 236813, 233218, 228093, 222554, 217742]
55657B17742m989o074o009m698m153m675m556l632l447m002l801l028l190l845
55643A57643l214j757j521k286k056j040j305k609k565r84j89p20o90K30Q3j519
55627A35501k495j951j399j542j186p5L12l82o54J0L31j82m81k31l15p50o92n46
55609A23273j435k649k376r52m51j150j413r73j159j788j195M80J256Q29R03J720
55593A12920J589L11k50M19P83M93J057K581L056J891R79J364J850J841K616M575
55577A38075O068O135N901O219O376O054O113O540O080M635L602L164J916j98
55563B06680j329j062j403l348n159n357m933n138n399m892m177l886l505k568
55549A54524j539o76L80J307J112j43j275j902k562k936k206j188j670l352m095
$$ y = [217742, 212753, 206679, 200670, 195972, 191819, 187144, 182588, 178956, 175509, 171507, 167706, 164678, 161488, 157643, 154429, 152672, 151151, 148865, 146809, 145769, 144464, 141855, 139290, 138306, 138117, 137397, 136707, 136937, 137020, 135501, 133006, 131055, 129656, 128114, 126928, 126853, 127165, 126783, 126129, 126139, 126470, 126288, 125807, 125576, 125261, 124511, 123819, 123273, 121838, 119189, 116813, 115861, 115410, 114260, 112847, 111874, 110715, 108927, 107732, 108212, 109468, 110297, 111200, 112920, 114509, 114820, 114570, 114989, 115772, 116265, 117322, 119903, 122959, 124850, 125829, 127193, 129043, 130884, 133500, 138075, 144143, 150278, 156179, 162398, 168774, 174828, 180941, 187481, 193561, 198196, 201798, 204962, 206878, 206680, 205351, 204289, 202886, 199538, 194379, 189022, 184089, 178951, 173552, 168660, 164483, 160597, 157092, 154524, 152985, 152309, 152689, 153996, 155108, 154965, 153690, 151788, 149226, 146290, 144084, 142896, 141226, 137874, 133779]
55534A33779l443l178l950m262l468k893l059k626j152k24o86j301j304j645k571
55519I8017k558j052J86o2o26l22M0m55j061r68p59q87n62N18J217R13O42J066
55501I3287J236N10j55n3Nn67r25n89n47j349j842j136j07K79M41Q27P27k18r46
55482H8878o19K5Q5j64k60n08r63r20k72O0k50l27K59P57O78M23P6o43r90J83
55462H5508K045K360R27J9P12J414Q82R9o8m00j194j123K51J217O62j68j64k42
55444I2737j094j464m83M47P6m58J85J130J090P23J079J409O82k44r5N43N10K80
55426I7053R64K156K723K658K585K426K064K199L042L512K994K531K851K829J482
55411A34069j88r92j588k851l845l427k444k261k409j814j139j699k968l327k571
$$ y = [133779, 130336, 127158, 123208, 118946, 115478, 112585, 109526, 106900, 105748, 105524, 104838, 103537, 102233, 100588, 98017, 95459, 94407, 94593, 94531, 93905, 93583, 93623, 93168, 92107, 91139, 90380, 89493, 88931, 89449, 90666, 91579, 92221, 93287, 94523, 95033, 94878, 94825, 94830, 94263, 93338, 92749, 92202, 90853, 89011, 87875, 87768, 88047, 88488, 89315, 90042, 89824, 88878, 88259, 88284, 88369, 88205, 87945, 87437, 86474, 85554, 85282, 85342, 85092, 84765, 85024, 85781, 86459, 86882, 86958, 86315, 85325, 85508, 87553, 89913, 90840, 90859, 91571, 92985, 93867, 93966, 93898, 93498, 92304, 91181, 91432, 92649, 93311, 93143, 92979, 92737, 91643, 90179, 89696, 90143, 90219, 89761, 89946, 91076, 92166, 92889, 93968, 95377, 96059, 95815, 95720, 96263, 96773, 97053, 98017, 100173, 102896, 105554, 108139, 110565, 112629, 114828, 117870, 121382, 124376, 126907, 129758, 132587, 134069, 133881, 132889, 131301, 128450, 124605, 121178, 118734, 116473, 114064, 112250, 111111, 109412, 106444, 103117, 100546]
55396A00546j772j290p50l27m11o00m82n74j193j382m53N37M00k16j66P9m63j184
55378I0299q44J81O16M94Q06J508J724J440J301J136L45p13j175j142j296j612
55362I3068j666j625j714j385k76P47Q26N02O07P12J02o57o01j1L25N84J149J314
55344I2001M11o01m23M73O80J44j01J10Q3j86o9M05O42N63L81j60j117j670j238
55325I0328n87n79p68m25m1l03o42k98J36j55n54j39N33N45N30J471K501K019
55307I3572M01n52l74j43k89k67j41n69j264j295p38m57m86k16J42j0j28P68K100
55288I0054K277J144J44O9L41M89O62O71K9q89j182q70p23p61k94O25J170J017
55270I3973N17j91r79j090j07R04O70k54l22N36J012O47K10Mm37r16o64J20L54
$$ y = [100546, 98774, 97484, 96734, 96407, 95996, 95396, 94914, 94340, 93147, 91765, 91312, 91849, 92249, 92033, 91867, 91946, 91483, 90299, 89455, 89636, 90252, 90746, 91552, 93060, 94784, 96224, 97525, 98661, 99006, 98293, 97118, 95976, 94680, 93068, 91402, 89777, 88063, 86678, 86402, 87149, 87975, 88477, 89084, 89796, 89898, 89241, 88640, 88629, 88954, 89538, 90687, 92001, 92412, 91811, 91388, 91861, 92541, 92685, 92584, 92694, 92777, 92591, 92522, 92927, 93569, 94132, 94513, 94353, 93236, 91566, 90328, 89741, 89162, 88394, 87969, 87928, 87625, 86983, 86685, 86821, 86666, 86112, 85973, 86506, 87051, 87581, 89052, 91553, 93572, 93973, 93421, 93047, 92904, 92615, 92348, 92207, 91638, 90374, 89079, 88341, 87884, 87398, 87182, 87324, 87314, 87186, 87954, 90054, 92331, 93475, 93619, 93688, 94029, 94518, 95180, 95851, 95880, 94991, 93809, 92939, 92216, 91455, 91161, 91786, 92956, 93973, 94490, 94299, 93320, 92230, 92123, 93027, 93697, 93443, 93121, 93657, 94669, 95316, 95526, 95530, 95093, 94177, 93513, 93633, 93987]
55251I3987j52n06m18m78p19l93N67J233J140P62M12j50q63j259j303j348j333
55234H9179r89o07n91n20J72J011J148P90P10Q53P45P67J459K115J698O65K03
55217I8808J50m96j380j198r8M14j4j80M36R40Q03N21K95k28p31m80M5l73j445
55198I5789j549m22L49j7l99N2N55L69J24N07J091J271J152P95j05j185j381n31
55180I6465K35J82k36o17j170j554p48J092K216J566K62j63K56O31P58R18J033
55163A01126R83J059J362J389Q21R8l03m70n83n33l12j45l3J56J50k81n19J91
55145A04156J244J243J46o41m43j92o35j211j282j128j014n13M74J119Q50K51
55129A02424M7P0j23m03m68l88l07j89j49l69n49k27L33M83L58O48J260J430J189
$$ y = [93987, 93835, 93329, 92911, 92433, 91714, 91321, 91888, 93121, 94261, 95023, 95435, 95285, 94422, 93163, 91860, 90512, 89179, 88190, 87583, 86992, 86472, 86644, 87655, 88803, 89593, 90303, 91156, 91901, 92668, 94127, 96242, 97940, 98605, 98808, 98958, 98462, 97082, 95884, 95786, 96200, 96186, 96006, 96442, 97382, 98185, 98706, 99001, 98773, 98042, 97562, 97607, 97234, 95789, 94240, 93818, 94167, 94150, 93751, 93803, 94358, 94727, 94851, 95358, 96449, 97720, 98872, 99667, 99562, 98377, 96996, 96465, 96700, 96882, 96646, 96029, 94859, 93305, 92557, 93649, 95865, 97431, 97693, 97530, 97786, 98417, 99175, 100093, 101126, 102109, 103168, 104530, 105919, 106740, 106838, 106535, 106065, 105482, 104949, 104637, 104492, 104459, 104615, 104765, 104484, 103965, 104156, 105400, 106643, 106789, 106148, 105705, 105513, 104878, 103667, 102385, 101257, 100243, 99730, 100204, 101323, 102173, 102424, 102471, 102541, 102418, 102015, 101547, 101159, 100852, 100663, 100514, 100145, 99596, 99369, 99702, 100185, 100543, 101191, 102451, 103881, 105070]
55110A05070J295J657J258K0q48p68n56p56o67K22J173J431J321J370J365J025
55094A13612O81O05N34L61L99N78M26J36N09J472J849J141K01k48m95p31m39M25
55076A21016R64P41M13L65K3p62j028k44P20J024J009J112Q81N4o56p93r67j513
55058A22359j580o66J94%n81m42Q8j4o96j125j136j156j210j079r88j166j205
55041A09597o95QL44L57K66L8j28K96J114J245L62m12k41J42q4l20K55R83P18
55022A13845k75q29o65l65m7N48J086R68L97J02K43M96P82J049Q32j6p02n14P5
55003A17010K66K76O99J204J073N55M29N71K46m48p36n86o80j033r08k26J73j02
54985A17783m08j73K98N11N59P59J040J086Q37N71O09R58J210R51L21j09j04l0
$$ y = [105070, 106365, 108022, 109280, 109300, 108452, 107684, 107128, 106372, 105705, 105927, 107100, 108531, 109852, 111222, 112587, 113612, 114293, 114898, 115432, 115793, 116192, 116770, 117196, 117332, 117841, 119313, 121162, 122303, 122504, 122256, 121761, 121030, 120591, 121016, 121980, 122721, 123134, 123499, 123522, 122760, 121732, 121488, 122208, 123232, 124241, 125353, 126234, 126288, 125632, 124839, 123872, 122359, 120779, 120113, 120307, 120307, 119726, 119284, 119372, 119358, 118662, 117537, 116401, 115245, 114035, 112956, 111968, 110802, 109597, 108902, 108910, 109254, 109611, 109877, 109915, 109787, 110083, 111197, 112442, 112804, 112392, 112151, 112293, 112209, 111889, 112144, 113127, 113845, 113570, 112741, 112076, 111711, 111664, 112212, 113298, 114266, 114663, 114765, 115008, 115504, 116286, 117335, 118167, 118151, 117449, 116935, 117010, 117276, 117552, 118251, 119455, 120528, 121083, 121512, 122083, 122329, 121881, 121145, 120559, 119879, 118846, 117938, 117712, 117885, 117783, 117375, 117202, 117500, 118011, 118570, 119329, 120369, 121455, 122292, 122863, 123472, 124430, 125640, 126591, 126912, 126803, 126699, 126669]
54967A26669j04M8P06J440J608J140M28j95n03l16K71Q92J400J952K431K457K083
54950A42407J835J806J528J011J010J846K847L513M294N545O643O886O486N910
54936A93567N035L758K596J827Q38p74k244k767k948l949n660o847o736n627m196
54921A65873l069k690k897k890k316j841k042k411k228j710j354q70J48J105J242
54906A42050J050J605K826L651L797M002M605N034M938M748M885N172N308N250
54892A98921M956M246L041J391n96k543l767m008l902m277n168o008o462o555
54878A69269o309n729m981m171l235k361j997k122k053j439p72n16l87j13o9m83
54862A32532p74m86j31k62m54j42K67J49j32J05N56M44j59n82p15q23o87o5L74
$$ y = [126669, 126565, 126613, 127319, 128759, 130367, 131507, 131935, 131740, 131237, 130921, 131192, 132084, 133484, 135436, 137867, 140324, 142407, 144242, 146048, 147576, 148587, 149597, 151443, 154290, 157803, 162097, 167642, 174285, 181171, 187657, 193567, 198602, 202360, 204956, 206783, 207621, 206847, 204603, 201836, 198888, 194939, 189279, 182432, 175696, 170069, 165873, 162804, 160114, 157217, 154327, 152011, 150170, 148128, 145717, 143489, 141779, 140425, 139555, 139703, 140808, 142050, 143100, 144705, 147531, 151182, 154979, 158981, 163586, 168620, 173558, 178306, 183191, 188363, 193671, 198921, 203877, 208123, 211164, 212555, 211959, 209416, 205649, 201641, 197739, 193462, 188294, 182286, 175824, 169269, 162960, 157231, 152250, 148079, 144844, 142483, 140486, 138364, 136311, 134872, 134100, 133584, 133197, 133084, 133015, 132532, 131758, 131272, 131141, 130879, 130425, 130283, 130550, 130699, 130567, 130672, 131228, 131672, 131513, 130931, 130216, 129393, 128706, 128641, 129015]
54843A29015j88j279j655j073m34k88l56m32o67r13o99JP86J503K185K502K071
54826A30079J185M69O7j74j17K71L79k02p15k00R26J373Q63L46M75R53J337J532
54808A38847J421R95P35J110J731J861J496J095O37m4l28N31K061L024L115L073
54792A61360L240L314L399M011M997N706O317P631R520J0851J1233J1539J2392
54779B55510J3402J4297J5531J7183J8451J8794J8621J8299J7501J6102J4695
54768D38386J3483J1543Q042L541p10m227p310j0127j2589j4884j7441k0284k2811
54755C64612k4215k4001k2292j9794j7266j4904j2362r440o502m177k777j976
54743B04906j025N76K458L765M208M310M341L757K166J80j388k638m049n407o150
$$ y = [129015, 128827, 127548, 125893, 124820, 124386, 124098, 123742, 123310, 122643, 121730, 121031, 121032, 121818, 123321, 125506, 128008, 130079, 131264, 131733, 131800, 131626, 131509, 131780, 132159, 131957, 131242, 131042, 131968, 133341, 134204, 134550, 135025, 135978, 137315, 138847, 140268, 141263, 141998, 143108, 144839, 146700, 148196, 149291, 149928, 149884, 149556, 150087, 152148, 155172, 158287, 161360, 164600, 167914, 171313, 175324, 180321, 186027, 192344, 199975, 209495, 220346, 231579, 243118, 255510, 268912, 283209, 298740, 315923, 334374, 353168, 371789, 390088, 407589, 423691, 438386, 451869, 463412, 471454, 474995, 474285, 470058, 462748, 452621, 440032, 425148, 407707, 387423, 364612, 340397, 316396, 294104, 274310, 257044, 242140, 229778, 220338, 213836, 209659, 206882, 204906, 203881, 204457, 206915, 210680, 214888, 219198, 223539, 227296, 229462, 229642, 228254, 225616, 221567, 216160, 210010]
54728B10010o406o731p044o816o066n293m601l747k942k656k802k877k810k869
54714A46350k964k820k572k367j770n13O54R18P05Q60J002K37q46o96O48J373
54698A38199O27l15k20K92P1p51j267j256j097q76m48m1m6m36p82p60m33k31n83
54679A29647j258j354l81R16J470J263R77P07P9o42p48k98n3j36J6L92K74m40
54661A30431r48p96l61M2M89P19K35o10p91j16N55Q16J234J969K165J263j09j043
54643A35144j304r95k40M20K86n07j144j390j645j737r57M44J252J160J171J643
54627A31601J513K24j020r78j07M09K78j23n98q36k90P65J093K47n27j26P49Q21
54609A33095Q9n88r27j031o37K90Q63L85m01l24N01J019Q31L88M3o2M31J562K431
$$ y = [210010, 203604, 196873, 189829, 183013, 176947, 171654, 167053, 163306, 160364, 157708, 154906, 152029, 149219, 146350, 143386, 140566, 137994, 135627, 133857, 133344, 133998, 134916, 135621, 136481, 137483, 137720, 136874, 136178, 136826, 138199, 138826, 138511, 138291, 138583, 138654, 137903, 136636, 135380, 134283, 133407, 132959, 132918, 132872, 132436, 131654, 130894, 130461, 130230, 129647, 128389, 127035, 126654, 127570, 129040, 130303, 131280, 131987, 132066, 131424, 130676, 130378, 130325, 130189, 130205, 130597, 130871, 130431, 129483, 128687, 128326, 128368, 128857, 129576, 129811, 129201, 128410, 128294, 128849, 129665, 130899, 132868, 135033, 136296, 136187, 135144, 133840, 132845, 132605, 133025, 133311, 132804, 131660, 130270, 128625, 126888, 125931, 126375, 127627, 128787, 129958, 131601, 133114, 133338, 132318, 131340, 131233, 131642, 131920, 131797, 131199, 130363, 130073, 130838, 131931, 132178, 131651, 131525, 132274, 133095, 133184, 132596, 131669, 130638, 130001, 130291, 131154, 131539, 131138, 130814, 131315, 132334, 133165, 133553, 133596, 133534, 133965, 135527, 137958]
54590A37958K097Q82p9l37l07k99k37j58j99j79Q3K63L1k53j4O36J076J057P69
54571A42790L45j42l85j78J57J53k17o66r60q22Q0J543K760L226L226L006K241
54554A56157Q83j90k20L24M92K07M9J22N3k20m84p64j149j346j111p77o83n26
54536A50817k9K54k88j154j306p18l31n79r28r35q41r21j004q84o87o00n92n40
54518A38734l35J39Q34J421J559J209M82m75j247j227l63N18O62L48L30O46O31
54501A43866%p03q68n12j32r6l61n79m65l3N37J094J445J327Q62P56J365J883
54483A49386J206l16j127n46M43P82O64O63O32K34k67m91n79n80l2J051J557O18
54465A53298r31j475o92K86M83K4m99p52p32n63l45N3P66J462J569J117P12M83
$$ y = [137958, 140055, 140937, 140858, 140521, 140214, 139915, 139678, 139520, 139321, 139142, 139225, 139488, 139519, 139266, 139252, 139888, 140964, 142021, 142790, 143135, 142993, 142608, 142430, 142587, 142740, 142523, 141857, 140897, 140075, 140155, 141698, 144458, 147684, 150910, 153916, 156157, 157040, 156850, 156630, 156954, 157446, 157653, 157702, 157824, 157877, 157657, 157173, 156409, 155260, 153914, 152803, 152026, 151343, 150817, 150788, 151042, 150754, 149600, 148294, 147576, 147245, 146666, 145738, 144803, 143962, 143041, 142037, 141153, 140466, 139866, 139274, 138734, 138399, 138538, 139372, 140793, 142352, 143561, 144043, 143568, 142321, 141094, 140731, 141249, 141911, 142259, 142589, 143235, 143866, 143866, 143163, 142295, 141783, 141651, 141555, 141194, 140615, 140150, 140117, 140654, 141748, 143193, 144520, 145382, 146138, 147503, 149386, 150592, 150276, 149149, 148603, 149046, 149828, 150492, 151155, 151787, 152021, 151754, 151263, 150684, 150104, 150072, 151123, 152680, 153298, 152367, 150892, 150200, 150486, 150969, 150993, 150494, 149742, 149010, 148447, 148102, 148155, 148921, 150383, 151952, 153069, 153781, 154264]
54447A54264j18j122j632j172n52o35j105j201q47l15M16J092Q53m81j593j232
54431A44620Q3R72J068Q64M78p3m3J108K359K229R46J30N22J395K018K230J704
54414A62610J78j451j737o71K79K97J09L66O38N01M81J102J940K303K088J448
54398A70481M09o95j132p17k00k05m06k88r2k60m85l3J150K373L029L093K776
54381A78798K286J889J860K140K296K042J690J821K487L028K838K060J198L41
54367B06774p19j748k191k059j965k110k016j540j378k013k910l268k982k367
54353A77508j578q64p42j218j434p97J01L53nk99k54LM25Q20O96J2m84l70k75
54334A71598o75q49n6R77J013J76m04l57k12j72n6j52q06j413j138m03l42q83
$$ y = [154264, 154146, 153024, 151392, 150220, 149668, 149033, 147928, 146727, 145880, 145565, 145981, 147073, 147926, 147445, 145852, 144620, 144703, 145675, 146743, 147607, 148085, 148012, 147969, 149077, 151436, 153665, 154611, 154741, 155263, 156658, 158676, 160906, 162610, 162788, 161337, 159600, 158929, 159208, 159505, 159614, 159980, 160618, 161119, 161600, 162702, 164642, 166945, 169033, 170481, 170890, 170195, 169063, 168346, 168146, 167941, 167535, 167247, 167155, 166895, 166410, 166377, 167527, 169900, 172929, 176022, 178798, 181084, 182973, 184833, 186973, 189269, 191311, 193001, 194822, 197309, 200337, 203175, 205235, 206433, 206774, 206055, 204307, 202116, 200057, 198092, 195982, 193966, 192426, 191048, 189035, 186125, 182857, 179875, 177508, 175930, 175066, 174324, 173106, 171672, 170875, 170976, 171329, 171324, 171025, 170771, 170774, 171199, 172019, 172715, 172727, 172243, 171873, 171598, 170923, 170074, 170018, 170995, 172008, 172184, 171780, 171423, 171211, 171039, 170983, 170831, 170025, 168612, 167474, 167071, 166729, 165846]
54316A65846q41Q2P65M11m70j018r85m32M46J039P78K3m05m85p95j144o72N53
54298A62696J287Q29j29o72p02m97j40J92K31J18K54N56O72Q17J412K008J685
54281A70617O33O1M00P58N09J61K49N36P96J299J977K115J439N81N0l56o86m65
54263A80674K27M18l39j084q17N1L77j58r20j231q36J06J005J242R03O59P72P86
54245A81835M30R5Q7J54P1J4M1n7j82L4M12L28j43j94J98p0j511k981l131k033
54225A73397o51M82J223J235M56l82n37k07q3l22n96p50p60m87kK04r7l71l5O53
54205A72370R77O57l4p51j190j068m26K69O20O52N45M08N01J114J962K275J713
54188A80594P74R7j05J96R06J447J115J45l57J52J013J513J810K211K416K105
$$ y = [165846, 165005, 165087, 165852, 166263, 165793, 164775, 163790, 163358, 163804, 164843, 165621, 165644, 165239, 164754, 163959, 162815, 162143, 162696, 163983, 164812, 164683, 164011, 163309, 162812, 162672, 162864, 163095, 163213, 163467, 164023, 164695, 165512, 166924, 168932, 170617, 171250, 171311, 171711, 172469, 172978, 173139, 173388, 173924, 174720, 176019, 177996, 180111, 181550, 182131, 182181, 181825, 181139, 180674, 180901, 181319, 180980, 179896, 179079, 179130, 179507, 179349, 178429, 177198, 176362, 176468, 177473, 178715, 179618, 180277, 181049, 181835, 182265, 182360, 182447, 182601, 182672, 182686, 182727, 182670, 182488, 182522, 182934, 183262, 183119, 182925, 183123, 183053, 181542, 178561, 175430, 173397, 172746, 173228, 174451, 175686, 176142, 175760, 175223, 175016, 174933, 174611, 174015, 173265, 172505, 172018, 172016, 172220, 172123, 171752, 171717, 172370, 173347, 174004, 173970, 173219, 172029, 170961, 170535, 170804, 171424, 172076, 172621, 173029, 173530, 174644, 176606, 178881, 180594, 181368, 181465, 181360, 181556, 182462, 183909, 185024, 185169, 184812, 184964, 185977, 187490, 189300, 191511, 193927, 196032]
54172A96032J591J277J046P43N45L82k58j390k127j919j434j473j718j480j025
54157A88792j183j926k357j940j023k40N5j27l42J0R84J872K067J808J741K128
54141A90319K841L632M126L987L495L428M024M652M809M638M134K752M98j512
54127B35823k444k871l687m562m576l788l079k803k655k605k844l027k565j653
54113A92664j124j246j482j399j077o47j48J61K9k04P8Q40J387J317R01M07k91
54096A90166j247j965j805o80P13J382R33N8j11P43J808K237K058J672J030j15
54080A96877j425k175k058j377n82J8K32J70K29N85Q56O31J10j92j19O9K47N17
54062A92613R11J274J414J243Q74O32P46J015J123J213J643K187K199J704J502
$$ y = [196032, 197623, 198900, 199946, 200689, 201234, 201616, 201358, 199968, 197841, 195922, 194488, 193015, 191297, 189817, 188792, 187609, 185683, 183326, 181386, 180363, 180123, 180178, 180051, 179709, 179719, 180703, 182575, 184642, 186450, 188191, 190319, 193160, 196792, 200918, 204905, 208400, 211828, 215852, 220504, 225313, 229951, 234085, 236837, 237335, 235823, 233379, 230508, 226821, 222259, 217683, 213895, 210816, 208013, 205358, 202753, 199909, 196882, 194317, 192664, 191540, 190294, 188812, 187413, 186336, 185689, 185541, 185702, 185731, 185527, 185605, 186445, 187832, 189149, 190050, 190457, 190166, 188919, 186954, 185149, 184469, 185182, 186564, 187497, 187555, 187444, 188187, 189995, 192232, 194290, 195962, 196992, 196877, 195452, 193277, 191219, 189842, 189260, 189278, 189510, 189680, 189909, 190494, 191350, 191981, 192091, 191899, 191780, 191849, 192096, 192613, 193524, 194798, 196212, 197455, 198329, 198961, 199707, 200722, 201845, 203058, 204701, 206888, 209087, 210791, 212293]
54047B12293J914K188J707J003R93J819K989M134M995N245M907M582M673M847
54033B58289M702M451M469M632M651M517M177L358K249J645J839K020J443M51
54019C02893l30j015j801k128j544q05r32j645j859j468j370j956k607k687k139
54004B78607j146j1Q17J280K128L867N638O071N098L942L382K964J965K25k073
53989C12754m588o681p799q147q307q259p439n848m328l572l426l333k985k404
53975B35638j778j297r04l66K71N91M63K48O0n45j561j954r95N78J565J969K499
53958B34482K968K519J236K14M0L02O60J307K228L002L469L826M051M046M205
53943B68555M908N598N518N189N973P996R886J0806J1518J2925J4821J6697J8725
$$ y = [212293, 214207, 216395, 218102, 219105, 220098, 221917, 224906, 229040, 234035, 239280, 244187, 248769, 253442, 258289, 262991, 267442, 271911, 276543, 281194, 285711, 289888, 293246, 295495, 297140, 298979, 300999, 302442, 302893, 302563, 301548, 299747, 297619, 296075, 295270, 294338, 292693, 290834, 289366, 287996, 286040, 283433, 280746, 278607, 277461, 277450, 278267, 279547, 281675, 285542, 291180, 297251, 302349, 306291, 309673, 312637, 314602, 314827, 312754, 308166, 301485, 293686, 285539, 277232, 268973, 261534, 255686, 251358, 247786, 244360, 241027, 238042, 235638, 233860, 232563, 231659, 231293, 231564, 232155, 232618, 232866, 232926, 232381, 230820, 228866, 227871, 228449, 230014, 231983, 234482, 237450, 239969, 241205, 241419, 241459, 241761, 242421, 243728, 245956, 248958, 252427, 256253, 260304, 264350, 268555, 273463, 279061, 284579, 289768, 295741, 303737, 313623, 324429, 335947, 348872, 363693, 380390, 399115]
53930C99115K1035K2872K3331K2441K0853J8865J6321J3189R795O706M612L909
53918E83044M230M727M995N196N177M071J187l149p941j2266j5520j7386j7977
53905E38388j7701j6804j5297j3402j1664j0463r699r095q486p881p498p657q261
53892C94480q605q213p646p797q565q993q650q053p646p216o536n789n083m268
53878B91420l541l508m253m894m540l294k010j387j585k343l162l593l569l346
53864B46395l138l003k953k796k180j187n96r55j623j500m86N64J196J673J953
53849B31364J458J56j074j558j538j392r76j88M59M43o4n63q46q76n03K35Q60
53832B25397R27N53J52k7P9N23J230J841J945J425N94L8J73P39J024Q09P11J258
$$ y = [399115, 420150, 443022, 466353, 488794, 509647, 528512, 544833, 558022, 567817, 574523, 579135, 583044, 587274, 592001, 596996, 602192, 607369, 611440, 612627, 609478, 601537, 589271, 573751, 556365, 538388, 520687, 503883, 488586, 475184, 463520, 453057, 443358, 434263, 425777, 417896, 410398, 402741, 394480, 385875, 377662, 370016, 362219, 353654, 344661, 336011, 327958, 320312, 313096, 306560, 300771, 295688, 291420, 287879, 284371, 280118, 275224, 270684, 267390, 265380, 263993, 262408, 260065, 256903, 253310, 249741, 246395, 243257, 240254, 237301, 234505, 232325, 231138, 230542, 229587, 227964, 226464, 225978, 226542, 227738, 229411, 231364, 232822, 232978, 231904, 230346, 228808, 227416, 226440, 226252, 226711, 227154, 227090, 226527, 225681, 224805, 224302, 224537, 225397, 226324, 226877, 227029, 227002, 227081, 227604, 228834, 230675, 232620, 234045, 234639, 234677, 234850, 235589, 236613, 237422, 238133, 239391]
53814B39391K112K733L339M278M999M702L827L679M562N377N355M993M942M930
53800B99219M435L622L006K660K277J681R84M80M76R16J230J070Q62J050J068
53785C25036J33j196j488n98p1r98k685l930m562m957n008m462l686l288l363
53770B84877l602l745l585l076k679l000l714l623k208m58L12q0q83j406j373
53755B51757q79m88q34j690k006j172J71R81Q48m1j295k284k382j680r24m82k7
53738B37573N44P54M62K49M18M81J77Q2N75J045Q82N07N89R68J166J316J696J944
53720B51428J623J204J522K543L403L467K763J695Q98R97J900K647K433J468M54
53705B80445k70o37n18n5K32J79K59N82M63l33p81J1J250J513P96L52P84J495
$$ y = [239391, 241503, 244236, 247575, 251853, 256852, 261554, 265381, 269060, 273622, 278999, 284354, 289347, 294289, 299219, 303654, 307276, 310282, 312942, 315219, 316900, 317884, 318364, 318840, 319756, 320986, 322056, 322918, 323968, 325036, 325169, 323973, 322485, 321887, 321816, 320818, 318133, 314203, 309641, 304684, 299676, 295214, 291528, 288240, 284877, 281275, 277530, 273945, 270869, 268190, 265190, 261476, 257853, 255645, 255187, 255499, 255419, 254536, 253130, 251757, 250878, 250390, 249556, 247866, 245860, 244688, 244859, 245840, 246688, 246647, 245352, 243068, 240686, 239006, 238082, 237600, 237573, 238117, 238871, 239333, 239582, 240000, 240481, 240658, 240740, 241315, 242360, 243242, 243749, 244338, 245306, 246472, 247788, 249484, 251428, 253051, 254255, 255777, 258320, 261723, 265190, 267953, 269648, 270546, 271543, 273443, 276090, 278523, 279991, 280445, 280175, 279538, 279020, 278965, 279197, 279376, 279635, 280217, 280680, 280347, 279566, 279577, 280827, 282340, 283136, 283488, 284272, 285767]
53687B85767J939K232K437K239J597R90P30O46N63O18R27J304J480J350J044Q67
53671C06730J011J168Q04j6n18k80J47P9l58o94q69r65p04N2O99O56L10M64J038
53652C08754J215P07Q6o7L23J069J847K140J670R02O57J184K040K681K808K351
53636C30367J527Q14M09m4p88j376j186k77P09J204R35p1j208j557r73l87n03
53619C27595p56k97O16J152J278J516J758J472R73J233K356L288L280K685K151
53604C50300J884J954K469L076K994K009R52P97J669K892L598L247J992P41M06
53589C80980R22J369J152N79J85%k38n91r12j164j402j622j741j693j511j320
53573C72993j216j059o14L1L92J42m63r22j046r57p99p16q74j229j437j216o62
$$ y = [285767, 287706, 289938, 292375, 294614, 296211, 297201, 297931, 298577, 299140, 299758, 300685, 301989, 303469, 304819, 305863, 306730, 307741, 308909, 309713, 309697, 309179, 308899, 309046, 309125, 308767, 308073, 307204, 306239, 305535, 305587, 306286, 306942, 307252, 307716, 308754, 309969, 310676, 310762, 310695, 311018, 312087, 313934, 316074, 317744, 318646, 319303, 320487, 322527, 325208, 328016, 330367, 331894, 332708, 333117, 333073, 332285, 330909, 329723, 329446, 330155, 331359, 332294, 332223, 331015, 329458, 328485, 328098, 327595, 326839, 326542, 327158, 328310, 329588, 331104, 332862, 334334, 335307, 336540, 338896, 342184, 345464, 348149, 350300, 352184, 354138, 356607, 359683, 362677, 364686, 365638, 366435, 368104, 370996, 374594, 377841, 379833, 380574, 380980, 381902, 383271, 384423, 385002, 385187, 385187, 384949, 384358, 383446, 382282, 380880, 379258, 377517, 375824, 374313, 372993, 371777, 370718, 370104, 370135, 370527, 370669, 370206, 369284, 368238, 367281, 366482, 365766, 364892, 363663, 362226, 361010, 360348]
53556C60348n3L88M48N5m19m54j37j08n43q04m06L17Q98J385J831J885J492J338
53538C67461J857K428K318J883K000K793L750M668N621O356O569O559O776P066
53524D28105P047O943P220P753Q100Q287Q567Q764Q661Q621Q979R316R243R354
53510E44960J0279J1307J1265J0492J0529J1899J3562J4646J5362J6016J6383
53499F86700J6497J6943J7920J8828J9209J9244J9092J8495J7449J6451J5836
53488H82664J5497J5451J5956J6851J7457J7373J6782J5895J4819J3920J3613
53477A056278J3699J3710J3794J4368J4944J4492J3125J2222J2394J2472J1154
53466A202652Q715O344M526K901J204l75j641k684l842n474p471r066r625r591
$$ y = [360348, 360295, 360683, 361131, 361186, 360767, 360313, 360176, 360068, 359525, 358721, 358315, 358632, 359530, 360915, 362746, 364631, 366123, 367461, 369318, 371746, 374064, 375947, 377947, 380740, 384490, 389158, 394779, 401135, 407704, 414263, 421039, 428105, 435152, 442095, 449315, 457068, 465168, 473455, 482022, 490786, 499447, 508068, 517047, 526363, 535606, 544960, 555239, 566546, 577811, 588303, 598832, 610731, 624293, 638939, 654301, 670317, 686700, 703197, 720140, 738060, 756888, 776097, 795341, 814433, 832928, 850377, 866828, 882664, 898161, 913612, 929568, 946419, 963876, 981249, 998031, 1013926, 1028745, 1042665, 1056278, 1069977, 1083687, 1097481, 1111849, 1126793, 1141285, 1154410, 1166632, 1179026, 1191498, 1202652, 1211367, 1217711, 1222237, 1225138, 1226342, 1225967, 1224326, 1221642, 1217800, 1212326, 1204855, 1195789, 1186164, 1176573]
53452A176573j0001j1032j1815j1794j1470j1529j1983j2570j3256j3989j4472
53441A042662j4570j4432j4014j3147j2148j1690j1720j1363j0191q843p923p070
53429I05551n752m286l354k926k414j629r49o13l55K14J109J972K545L103M243
53414H96459O031P702Q581R047R948J1381J2753J3888J5200J6771J8124J9062
53402A044947J9994K1206K2537K3869K5291K6621K7572K8503L0149L2457L4475
53391A337621L5683L6596L7735L8808L9371L9560L9749M0050M0497M1125M1612
53380A768407M1419M0557L9602L8758L7623L6050L4457L3083L1662L0069K8458
53369B160145K6521K3518J9442J5291J1744Q439M918J385j997n730j0197j5038
$$ y = [1176573, 1166572, 1155540, 1143725, 1131931, 1120461, 1108932, 1096949, 1084379, 1071123, 1057134, 1042662, 1028092, 1013660, 999646, 986499, 974351, 962661, 950941, 939578, 929387, 920544, 912621, 905551, 899799, 895513, 892159, 889233, 886819, 885190, 884241, 883628, 883273, 883487, 884596, 886568, 889113, 892216, 896459, 902490, 910192, 918773, 927820, 937768, 949149, 961902, 975790, 990990, 1007761, 1025885, 1044947, 1064941, 1086147, 1108684, 1132553, 1157844, 1184465, 1212037, 1240540, 1270689, 1303146, 1337621, 1373304, 1409900, 1447635, 1486443, 1525814, 1565374, 1605123, 1645173, 1685670, 1726795, 1768407, 1809826, 1850383, 1889985, 1928743, 1966366, 2002416, 2036873, 2069956, 2101618, 2131687, 2160145, 2186666, 2210184, 2229626, 2244917, 2256661, 2265100, 2270018, 2271403, 2269406, 2263676, 2253479, 2238441]
53357B238441j9800k4506k9005l2597l4922l6575l8161l9408l9866l9792l9669
53346A864140l9401l8671l7661l6709l5722l4469l3105l1929l0999l0324k9997
53335A485153k9867k9638k9427k9496k9337k8035k5886k4401k4049k3275k0703
53324A191039j7315j5173j4758j4784j4222j3255j2474j2099j1973j1690j0925
53313A042371j0073j0018j0850j1424j0829r564q530p618o323n020m403m121l142
53300I40456j289O17K078L400M877O357P659Q749R535J0005J0424J1036J1809
53287A025713J2813J4320J6078J7209J7453J7790J8925J9953J9562J8000J6580
53276A214396J5732J4844J3777J3129J2826J1810R492O579M098K327Q74p92l016
$$ y = [2238441, 2218641, 2194135, 2165130, 2132533, 2097611, 2061036, 2022875, 1983467, 1943601, 1903809, 1864140, 1824739, 1786068, 1748407, 1711698, 1675976, 1641507, 1608402, 1576473, 1545474, 1515150, 1485153, 1455286, 1425648, 1396221, 1366725, 1337388, 1309353, 1283467, 1259066, 1235017, 1211742, 1191039, 1173724, 1158551, 1143793, 1129009, 1114787, 1101532, 1089058, 1076959, 1064986, 1053296, 1042371, 1032298, 1022280, 1011430, 1000006, 989177, 979613, 971083, 963465, 957142, 952122, 947719, 943598, 940456, 939167, 939784, 941862, 945262, 950139, 956496, 964155, 972904, 982439, 992444, 1002868, 1013904, 1025713, 1038526, 1052846, 1068924, 1086133, 1103586, 1121376, 1140301, 1160254, 1179816, 1197816, 1214396, 1230128, 1244972, 1258749, 1271878, 1284704, 1296514, 1306006, 1312585, 1316683, 1319010, 1319884, 1319092, 1316076]
53263A316076n666q048r628j0736j2056j3686j5314j6934j8595j9717j9707j9085
53251A146904j9047j9867k0710k1055k1261k1500k1253k0274j9246j8919j9153
53240I24619j9293j9047j8599j8257j8242j8573j8940j8917j8430j7745j7079
53229G21497j6476j5969j5437j4436j2673j0617r242r022r530r955r680q559p050
53216E72851n984n868o436p138p772q339q697q821r059r606j0068j0072r845r677
53202D55469r282q443p785p970q465q163o947n799n465n946p040q400r218q859
53188C47687p771o828o018m812l612l414m061m240l472k719k625k556k015j636
53174B91908j923k173j694j147j586k747l352k759j497m23m9m17j063j335j158
$$ y = [1316076, 1310410, 1302362, 1292734, 1281998, 1269942, 1256256, 1240942, 1224008, 1205413, 1185696, 1165989, 1146904, 1127857, 1107990, 1087280, 1066225, 1044964, 1023464, 1002211, 981937, 962691, 943772, 924619, 905326, 886279, 867680, 849423, 831181, 812608, 793668, 774751, 756321, 738576, 721497, 705021, 689052, 673615, 659179, 646506, 635889, 626647, 617625, 608095, 598140, 588460, 579901, 572851, 566867, 560999, 554563, 547425, 539653, 531314, 522617, 513796, 504737, 495131, 485063, 474991, 465146, 455469, 446187, 437744, 429959, 421989, 413524, 405361, 398414, 392615, 387150, 381204, 374164, 365764, 356546, 347687, 339916, 333088, 327070, 322258, 318646, 315232, 311171, 306931, 303459, 300740, 298115, 295559, 293544, 291908, 289985, 287812, 286118, 284971, 283385, 280638, 277286, 274527, 273030, 272607, 272558, 272141, 271078, 269743, 268585]
53159B68585j089j320j227m77J99j2p42j127j160j364j491p45O93J594J405R77
53143B62699J125J343P68k50n20L08J306J613J399J250J273J283J404J865K414
53128B79280K628K689L164L984M337L821L025K614K416J931J216O58K64j75m89
53113C11363l89j94n53j484k314k570k419k129j732j314j191j526k096k582k855
53098B86015k975l071l252l404l142k231r51J58P82Q45L16o31j502j857j753j486
53082B61861j164q16n95m91k03K86M26j44r60j424j670k073k335j933j090m43
53066B47232m0M63Q99Q77P25J037J458J092J00l66P2N43M86M40Q45J223J133R19
53048B59138Q72O24M5j95K83P55M76j12j57K56L86Q2k18l56n23o16l55P0J57q6
$$ y = [268585, 267496, 266176, 264949, 264472, 264671, 264659, 263917, 262790, 261630, 260266, 258775, 258030, 258723, 260317, 261722, 262699, 263824, 265167, 265935, 265685, 265165, 265473, 266779, 268392, 269791, 271041, 272314, 273597, 275001, 276866, 279280, 281908, 284597, 287761, 291745, 296082, 299903, 302928, 305542, 307958, 309889, 311105, 311763, 312027, 311852, 311363, 310974, 310780, 310227, 308743, 306429, 303859, 301440, 299311, 297579, 296265, 295074, 293548, 291452, 288870, 286015, 283040, 279969, 276717, 273313, 270171, 267940, 266989, 267147, 267929, 268774, 269090, 268459, 266957, 265100, 263347, 261861, 260697, 259881, 259286, 258795, 258592, 258878, 259304, 259160, 258200, 256776, 255106, 253033, 250698, 248765, 247675, 247232, 247192, 247655, 248554, 249431, 250156, 251193, 252651, 253743, 253843, 253477, 253549, 254092, 254578, 255018, 255863, 257086, 258219, 259138, 260010, 260634, 260679, 260484, 260767, 261522, 261998, 261886, 261729, 261985, 262371, 262453, 262235, 261879, 261356, 260740, 260385, 260455, 260612, 260526]
53028B60526j21K68O40N58J55j07j4K76N55Q35J225J589J552J008M15K73M87N80
53010B70700M20K39R4j23j99J94P34O39j58p69n84o6J10Q3M29J205J932K258K087
52991B79225J361K28p09p74N6J091J627J525J195J093J259J370J217R37O77L69
52975B91747J11L50J136J538O71r46j876j625j095j046j018k91R04J614J250M2
52959B91466j255j815j374n62k48m85n73j50L77N55L85j3n38p82l64L38N34K33
52941B85729J87N21M67j88n39p6L49j59j157j595j237n34K16Q19Q76L16k24l04
52923B83467k80m92n15n0K56k14q49p02k4K08j20k88j35k58q23j239j083m56N09
52904B76912J655K322J855P51L84J209K079J729L90n97m29L29N14l43j470j638
$$ y = [260526, 260405, 260673, 261313, 261871, 262026, 261919, 261905, 262181, 262736, 263571, 264796, 266385, 267937, 268945, 269360, 269633, 270120, 270700, 271120, 271359, 271453, 271330, 271131, 271325, 272059, 272698, 272540, 271771, 271187, 271121, 271231, 271314, 271743, 272948, 274880, 277138, 279225, 280586, 280814, 280105, 279331, 279387, 280478, 282105, 283630, 284825, 285918, 287177, 288547, 289764, 290701, 291378, 291747, 291858, 292208, 293344, 294882, 295553, 294607, 292731, 291106, 290011, 288965, 287947, 287656, 288560, 290174, 291424, 291466, 290211, 288396, 287022, 286460, 286212, 285727, 285154, 285004, 285381, 285936, 286321, 286308, 285770, 284988, 284624, 284962, 285496, 285729, 285916, 286437, 286904, 286716, 286177, 286101, 286450, 286291, 285134, 283539, 282302, 281768, 281984, 282803, 283679, 283995, 283771, 283467, 283187, 282695, 282180, 282130, 282386, 282172, 281323, 280621, 280597, 280805, 280685, 280397, 280262, 280004, 279181, 277942, 276859, 276403, 276912, 278567, 280889, 282744, 283495, 283879, 285088, 287167, 288896, 289286, 288689, 288260, 288589, 289103, 288760, 287290, 285652]
52888B85652m71J157K044J748O71m95j165j107o45l30k34P4O50R44P34O06R88
52871B90821J373J131N37K52L26M52O60R02N66o32j724j670j054j368k727l662
52855B84183l335k621k576k932k755j811o71K2m8p55j476j524r48m61m55n17j42
52838B61178N03Q24N08j41m23K24J568K595K581K002J880K333K517J976J234Q97
52822B82256Q17N16j30r20j634k053k074j959k087k312k083j322o40n05p12q92
52806B64266j023j144j100q82p49p12l87K92P45N65J87J93M02K69j58l69k99l71
52788B59725o59p28m34k35m31o12k68M40R49J090J065Q82L26m20p71n60l38n19
52770B58502o66j65P37J260J202J056J050R00O35Q03J510J981J616R16P76J298
$$ y = [285652, 285181, 286338, 288382, 290130, 290801, 290306, 289141, 288034, 287389, 287059, 286825, 286899, 287549, 288493, 289227, 289833, 290821, 292194, 293325, 293862, 294114, 294440, 294892, 295552, 296454, 297020, 296388, 294664, 292994, 291940, 290572, 287845, 284183, 280848, 278227, 275651, 272719, 269964, 268153, 267482, 267504, 267456, 266701, 265225, 263701, 262753, 262292, 261837, 261320, 261178, 261681, 262505, 263013, 262872, 262449, 262673, 264241, 266836, 269417, 271419, 273299, 275632, 278149, 280125, 281359, 282256, 283073, 283589, 283459, 282539, 280905, 278852, 276778, 274819, 272732, 270420, 268337, 267015, 266375, 265870, 265158, 264266, 263243, 262099, 260999, 260117, 259368, 258656, 258269, 258561, 259306, 259871, 260058, 260251, 260653, 260922, 260764, 260395, 260096, 259725, 259066, 258338, 257904, 257669, 257238, 256626, 256358, 256798, 257747, 258837, 259902, 260784, 261110, 260690, 259919, 259359, 259021, 258502, 257836, 257671, 258408, 259668, 260870, 261926, 262976, 263876, 264511, 265314, 266824, 268805, 270421, 271337, 272113, 273411]
52754B73411J922K320K457K153J288L28m8J45L14K44M16J194K233K838K666J954
52738B95835J258R36Q08M15k58o88o14m93p77j186j260j210j528k002j910j072
52722B86254o9N72P49M55j88o05k28O22R68M59k14l35L6M46O33N16J31j97q5K61
52702B90181K06l28n54J03J100J421P83j52o42o26o13r77j409j238m17J55k91
52685B86702j285j711j320r18j014j143p68j06L20L86K30k5n7N87J770K604K426
52668B86678J589Q23L22l8q6L91J012J162Q27N15L71Np22j351j486j321j200j036
52650B86455n50Q1K85j59p00n63M06J614K370K488K234J963J866J932J993J842
52634C03557J431Q53J50o47j258j318j000j001j600k050j475j04R55J072O37K34
$$ y = [273411, 275333, 277653, 280110, 282263, 283551, 283879, 283831, 283976, 284290, 284534, 284950, 286144, 288377, 291215, 293881, 295835, 297093, 298029, 298837, 299252, 298994, 298306, 297692, 297199, 296422, 295236, 293976, 292766, 291238, 289236, 287326, 286254, 286185, 286757, 287506, 287961, 287773, 287168, 286940, 287562, 288530, 288989, 288775, 288440, 288476, 288922, 289555, 290071, 290202, 290005, 289920, 290181, 290387, 290059, 289505, 289608, 290708, 292129, 292912, 292760, 292118, 291492, 290879, 289902, 288493, 287255, 286838, 286993, 286702, 285417, 283706, 282386, 281468, 280454, 279311, 278543, 278437, 278757, 279143, 279373, 279348, 279291, 279878, 281648, 284252, 286678, 288267, 289090, 289412, 289374, 289288, 289679, 290691, 291853, 292680, 293195, 293566, 293571, 292849, 291498, 290012, 288691, 287491, 286455, 285905, 285986, 286271, 286112, 285412, 284849, 285255, 286869, 289239, 291727, 293961, 295924, 297790, 299722, 301715, 303557, 304988, 305841, 305991, 305344, 304086, 302768, 301768, 300767, 299167, 297117, 295642, 295538, 296493, 297565, 298202, 298436]
52618B98436k8k52l94m46n98r19j191j249j213j156q54j65N80Q98O83K15k54o23
52600B91470p03k13P91J671J702R31K52M08J091J417J151Q79R45Q59J45p83j134
52583C00879p82k75r1l18q08j176r09j9O68M00n39j229j235q40m04j22j19k43
52565B92838JO80J010M57k31k2P01O40m19j364j569j581j781j656r19j83R9L33
52547B87034P94R41M69J13N17J167J246Q88O80O00M09N09J287K056J766N59m07
52530C00628n18j57L11R41J558J685J382J322J737K063J972J995K687L664M092
52515C25362L733L001K225J374M37m17j177k082l239m319m813m502l564k372j299
52500C08348o89o76r74j080q13n12m87n47k52M67J228J658J646J260O88K56J82
$$ y = [298436, 298408, 298156, 297762, 297316, 296718, 295799, 294608, 293359, 292146, 290990, 290136, 289971, 290551, 291449, 292132, 292347, 292093, 291470, 290767, 290554, 291345, 293016, 294718, 295649, 295901, 296309, 297400, 298817, 299968, 300847, 301792, 302651, 302796, 302013, 300879, 300097, 299822, 299731, 299413, 298605, 297429, 296520, 296501, 297169, 297569, 297030, 295801, 294566, 293726, 293322, 293200, 293081, 292838, 292839, 293519, 294529, 294986, 294755, 294733, 295434, 296074, 295655, 294291, 292722, 291141, 289360, 287704, 286785, 286602, 286701, 287034, 287828, 288769, 289238, 289351, 289868, 291035, 292281, 293169, 293849, 294449, 294858, 295367, 296654, 298710, 300476, 301035, 300628, 300110, 299953, 300264, 301205, 302763, 304448, 305830, 307152, 308889, 310952, 312924, 314919, 317606, 321270, 325362, 329095, 332096, 334321, 335695, 336132, 335715, 334538, 332456, 329217, 324898, 320085, 315583, 312019, 309647, 308348, 307659, 306983, 306009, 304929, 304116, 303604, 303117, 302570, 302318, 302785, 304013, 305671, 307317, 308577, 309265, 309521, 309703]
52483C09703L23M06L95M48N72O85Q74J265J699J924K021K221K398K199J618R97
52467C29748M51j93q99j383j570j649j698j731k047k910l858m064l396k474j633
52452C00694o92J59K52m58j052j005r22j341j655j126k09J16r0Q7Q27J237P02
52435B95524k76p87n38Q0N48O26M50L84O48J080J369J461J534J705J874J851J564
52418C09097J262J489K613M279N609O063N893N649N566N508N184M260K567L74
52404C65413j729l298m217m544m497m509m766m792m020k736j796j487j354j206
52390C20462j337j652j485o83mL9r0J83P32J328K197L357M112L977L411L003K565
52373C40115J774J038Q55R26P38N00O35P87L37m65q05m84M8N03Q35Q62N61M80
$$ y = [309703, 310026, 310432, 310827, 311275, 311847, 312532, 313406, 314671, 316370, 318294, 320315, 322536, 324934, 327133, 328751, 329748, 330199, 330006, 329107, 327724, 326154, 324505, 322807, 321076, 319029, 316119, 312261, 308197, 304801, 302327, 300694, 300002, 300161, 300413, 299955, 298903, 297898, 296976, 295635, 293980, 292854, 292645, 292761, 292671, 292758, 293585, 294822, 295524, 295248, 294461, 293923, 294003, 294551, 295177, 295627, 296011, 296659, 297739, 299108, 300569, 302103, 303808, 305682, 307533, 309097, 310359, 311848, 314461, 318740, 324349, 330412, 336305, 341954, 347520, 353028, 358212, 362472, 365039, 365413, 363684, 360386, 356169, 351625, 347128, 342619, 337853, 333061, 329041, 326305, 324509, 323022, 321668, 320462, 319125, 317473, 315988, 315305, 315301, 315340, 315250, 315433, 316165, 317493, 319690, 323047, 327159, 331136, 334547, 337550, 340115, 341889, 342927, 343782, 344708, 345446, 345946, 346581, 347368, 347705, 347240, 346435, 345951, 345999, 346502, 347337, 348199, 348760, 349240]
52355C49240J007J566J370O62L03M58O93J029J782K531K510J954J916K569K909
52340C72499K394J837K164L171M074M532M680M661M595M624M682M571M384M486
52326D27354M902N206N179N108N305N687N980O030N896N903O494P652Q661Q989
52312E14346R177J0225J2169J3982J4851J4925J4786J4829J5147J5458J5173J4137
52300F79205J3148J3014J3291J2852J1629J0690J0558J0547J0106R651R568R332
52288H13591Q362O999N953N393N123N121N231M931L951K766J935J348O64m5o30
52273H70693j433k770m172m793m417l488k335j009K62J141J771K733M256N863
52259H62302O938P347P342P212P250P783Q885R994J0178R038P339O360O564P214
$$ y = [349240, 350247, 351813, 353183, 353845, 354148, 354606, 355299, 356328, 358110, 360641, 363151, 365105, 367021, 369590, 372499, 374893, 376730, 378894, 382065, 386139, 390671, 395351, 400012, 404607, 409231, 413913, 418484, 422868, 427354, 432256, 437462, 442641, 447749, 453054, 458741, 464721, 470751, 476647, 482550, 489044, 496696, 505357, 514346, 523523, 533748, 545917, 559899, 574750, 589675, 604461, 619290, 634437, 649895, 665068, 679205, 692353, 705367, 718658, 731510, 743139, 753829, 764387, 774934, 785040, 794691, 804259, 813591, 821953, 828952, 834905, 840298, 845421, 850542, 855773, 860704, 864655, 867421, 869356, 870704, 871368, 871323, 870693, 869260, 866490, 862318, 857525, 853108, 849620, 847285, 846276, 846538, 847679, 849450, 852183, 856439, 862302, 869240, 876587, 883929, 891141, 898391, 906174, 915059, 925053, 935231, 944269, 951608, 957968, 964532, 971746]
52245I71746P466P449P830Q612Q961Q267O833N447M639M456M599M613M248L699
52231A058865L259K825K072R97r9j106k076k754k769k270j841j700j615j559j753
52216A048476j892j235J25R23K96r22j169l0J482K208J826P77j60m03j14j60j031
52199A048997k108k443k090j966k413k662j946n86M39O63M40K56J84J15Q9J66
52183A035135J22l65j190j777j740j357j204j493j984k329k248j573n01L09L36
52168A018141j28l08J00O60Q64O42K01j55l7P41J649J754O74r89k375l071l038
52151A015325k413j680j589k467l770m661m793m255l121j474K60J493K064K363
52137I91282K794L266L370K983K557K623L137L507L419L264L529M107M639N271
$$ y = [971746, 979212, 986661, 994491, 1003103, 1012064, 1020331, 1027164, 1032611, 1037250, 1041706, 1046305, 1050918, 1055166, 1058865, 1062124, 1064949, 1067021, 1068018, 1067919, 1066813, 1064737, 1061983, 1059214, 1056944, 1055103, 1053403, 1051788, 1050229, 1048476, 1046584, 1045349, 1045474, 1046397, 1046693, 1045771, 1044602, 1044572, 1046054, 1048262, 1050088, 1050865, 1050705, 1050302, 1050188, 1050028, 1048997, 1046889, 1044446, 1042356, 1040390, 1037977, 1035315, 1033369, 1032783, 1033222, 1033885, 1034325, 1034581, 1034765, 1034880, 1034969, 1035135, 1035257, 1034892, 1033702, 1031925, 1030185, 1028828, 1027624, 1026131, 1024147, 1021818, 1019570, 1017997, 1017496, 1017805, 1018141, 1018013, 1017705, 1017805, 1018465, 1019329, 1019971, 1020172, 1020017, 1019980, 1020721, 1022370, 1024124, 1024798, 1023809, 1021434, 1018363, 1015325, 1012912, 1011232, 1009643, 1007176, 1003406, 998745, 993952, 989697, 986576, 985102, 985362, 986855, 988919, 991282, 994076, 997342, 1000712, 1003695, 1006252, 1008875, 1012012, 1015519, 1018938, 1022202, 1025731, 1029838, 1034477, 1039748]
$$ [...]
##END NTUPLES=NMR SPECTRUM
##END=
