##TITLE=AC1681_2977_8571555_gdJ5YHvhbD
##JCAMPDX= 6.0         $$ Bruker NMR JCAMP-DX V2.0
##DATA TYPE= NMR SPECTRUM
##DATA CLASS= NTUPLES
##ORIGIN= BRUKER
##OWNER= Administrator
$$ 1.72 TOPSPIN		Version 2.1
$$ 2014-04-10 17:48:04.366 -0700  Administrator@X
$$ Compression mode = diff/dup
##.OBSERVE FREQUENCY= 400.02188249412
##.OBSERVE NUCLEUS= ^1H
##.ACQUISITION MODE= SIMULTANEOUS (DQD)
##.ACQUISITION SCHEME= undefined
##.AVERAGES= 8
##.DIGITISER RES= 22
##SPECTROMETER/DATA SYSTEM= spect
##.PULSE SEQUENCE= zg30
##.SOLVENT NAME= COFFEE_meoh
##.SHIFT REFERENCE= INTERNAL, COFFEE_meoh, 1, 14.98509
##AUDIT TRAIL= $$ (NUMBER, WHEN, WHO, WHERE, PROCESS, VERSION, WHAT)
$$ ##TITLE= Audit trail, TOPSPIN		Version 2.1
$$ ##JCAMPDX= 5.01
$$ ##ORIGIN= Bruker BioSpin GmbH
$$ ##OWNER= Administrator
$$ $$ E:\/data/COFFEE/nmr/AC1681_2977_8571555_gdJ5YHvhbD/10/pdata/1/auditp.txt
$$ ##AUDIT TRAIL=  $$ (NUMBER, WHEN, WHO, WHERE, PROCESS, VERSION, WHAT)
(   1,<2014-04-10 17:47:56.663 -0700>,<Administrator>,<X>,<go>,<TOPSPIN 2.1>,
      <created by zg
	started at 2014-04-10 17:46:50.929 -0700,
	POWCHK enabled, PULCHK disabled,
       configuration hash MD5:
       C8 4E 4E 5D D3 5C D8 9E 9F 52 82 E0 59 8A DE 15
       data hash MD5: 64K
       D0 E1 FB 9E D2 AB 58 9B 91 61 F4 3F 12 4D 45 D0>)
(   2,<2014-04-10 17:48:00.085 -0700>,<Administrator>,<X>,<proc1d>,<TOPSPIN 2.1>,
      <Start of raw data processing
       efp LB = 0 FT_mod = 6 PKNL = 1 PHC0 = 0 PHC1 = 0 SI = 32K 
       data hash MD5: 32K
       DC A4 1A C0 80 64 4D C4 FE 40 9A 7B C1 68 FF 31>)
(   3,<2014-04-10 17:48:00.570 -0700>,<Administrator>,<X>,<proc1d>,<TOPSPIN 2.1>,
      <pk PHC0 = 92.84546 PHC1 = 0 
       data hash MD5: 32K
       33 4E C3 BB AC 8E 4D 4A CE C4 F3 2F 52 7F 4B 0B>)
(   4,<2014-04-10 17:48:00.757 -0700>,<Administrator>,<X>,<proc1d>,<TOPSPIN 2.1>,
      <abs ABSG = 1 
       data hash MD5: 32K
       64 4B 56 CB 95 9C 37 91 09 01 75 D9 23 34 7F E5>)
(   5,<2014-04-10 17:48:00.898 -0700>,<Administrator>,<X>,<proc1d>,<TOPSPIN 2.1>,
      <abs ABSG = 2 
       data hash MD5: 32K
       FC C9 BE 98 87 B1 98 57 D9 F9 C8 AC DA E0 E8 05>)
(   6,<2014-04-10 17:48:01.132 -0700>,<Administrator>,<X>,<proc1d>,<TOPSPIN 2.1>,
      <abs ABSG = 3 
       data hash MD5: 32K
       52 2E 8A 7D 85 90 72 83 7C FF F1 1C 3B 40 BC 3F>)
(   7,<2014-04-10 17:48:01.195 -0700>,<Administrator>,<X>,<proc1d>,<TOPSPIN 2.1>,
      <abs ABSG = 4 
       data hash MD5: 32K
       6D 92 19 24 9A 80 3A B6 91 7D AF 68 66 1E 9B 39>)
(   8,<2014-04-10 17:48:01.257 -0700>,<Administrator>,<X>,<proc1d>,<TOPSPIN 2.1>,
      <abs ABSG = 5 
       data hash MD5: 32K
       97 BD 8D F1 F2 CC E9 D0 DB 03 69 D7 0D CF 8D 01>)
$$ ##END=
$$ 
$$ $$ hash MD5
$$ $$ 3B 56 37 9D B2 0D 68 49 23 7D 62 9C E8 C9 8E DE
##$RELAX= 
##$RELAX= 
##$RELAX= 
##$RELAX= 
##$RELAX= 
##$RELAX= 
##$RELAX= 
$$ Bruker specific parameters
$$ --------------------------
##$DU= <E:\>
##$EXPNO= 10
##$NAME= <AC1681_2977_8571555_gdJ5YHvhbD>
##$PROCNO= 1
$$ [...]
150 150 150 150 150 150 150 150
##$TP07= 0
##$TPNAME0= <>
##$TPNAME1= <>
##$TPNAME2= <>
##$TPNAME3= <>
##$TPNAME4= <>
##$TPNAME5= <>
##$TPNAME6= <>
##$TPNAME7= <>
##$TPOAL= (0..7)
0.5 0.5 0.5 0.5 0.5 0.5 0.5 0.5
##$TPOFFS= (0..7)
0 0 0 0 0 0 0 0
##$TUNHIN= 0
##$TUNHOUT= 0
##$TUNXOUT= 0
##$USERA1= <user>
##$USERA2= <user>
##$USERA3= <user>
##$USERA4= <user>
##$USERA5= <user>
##$V9= 5
##$VALIST= <valist>
##$VCLIST= <CCCCCCCCCCCCCCC>
##$VD= 0
##$VDLIST= <DDDDDDDDDDDDDDD>
##$VPLIST= <PPPPPPPPPPPPPPP>
##$VTLIST= <TTTTTTTTTTTTTTT>
##$WBST= 1024
##$WBSW= 4
##$XGAIN= (0..3)
0 0 0 0
##$XL= 0
##$YL= 0
##$YMAX_a= 616182
##$YMIN_a= -520347
##$ZGOPTNS= <>
##$ZL1= 120
##$ZL2= 120
##$ZL3= 120
##$ZL4= 120
##$ABSF1= 14.98509
##$ABSF2= -5.573092
##$ABSG= 5
##$ABSL= 3
##$ALPHA= 0
##$AQORDER= 0
##$ASSFAC= 0
##$ASSFACI= 0
##$ASSFACX= 0
##$ASSWID= 0
##$AUNMP= <proc_prof1d_extract_pilot.lims>
##$AXLEFT= 0
##$AXNAME= <>
##$AXNUC= <1H>
##$AXRIGHT= 0
##$AXTYPE= 0
##$AXUNIT= <>
##$AZFE= 0.1
##$AZFW= 0.1
##$BCFW= 0
##$BC_mod= 0
##$BYTORDP= 0
##$COROFFS= 0
##$CY= 15
##$DATMOD= 1
##$DC= 0
##$DFILT= <>
##$DTYPP= 0
##$F1P= 0
##$F2P= 0
##$FCOR= 0.5
##$FTSIZE= 32768
##$FT_mod= 6
##$GAMMA= 0
##$GB= 0
##$INTBC= 1
##$INTSCL= 1
##$ISEN= 128
##$LB= 0
##$LEV0= 0
##$LPBIN= 0
##$MAXI= 10000
##$MC2= 0
##$MEAN= 0
##$ME_mod= 0
##$MI= 0
##$NCOEF= 0
##$NC_proc= -8
##$NLEV= 6
##$NOISF1= 0
##$NOISF2= 0
##$NSP= 0
##$NTH_PI= 0
##$NZP= 0
##$OFFSET= 14.98509
##$PC= 1
##$PHC0= 92.84546
##$PHC1= 0
##$PH_mod= 1
##$PKNL= yes
##$PPARMOD= 0
##$PPDIAG= 0
##$PPIPTYP= 0
##$PPMPNUM= 2147483647
##$PPRESOL= 1
##$PSCAL= 4
##$PSIGN= 0
##$PYNMP= <proc.py>
##$REVERSE= no
##$SF= 400.02
##$SI= 32768
##$SIGF1= 0
##$SIGF2= 0
##$SINO= 400
##$SIOLD= 32768
##$SPECTYP= <>
##$SREGLST= <1H.CDCl3>
##$SSB= 0
##$STSI= 32768
##$STSR= 0
##$SW_p= 8223.68421052631
##$SYMM= 0
##$S_DEV= 0
##$TDeff= 65536
##$TDoff= 0
##$TI= <>
##$TILT= no
##$TM1= 0
##$TM2= 0
##$TOPLEV= 0
##$USERP1= <user>
##$USERP2= <user>
##$USERP3= <user>
##$USERP4= <user>
##$USERP5= <user>
##$WDW= 1
##$XDIM= 32768
##$YMAX_p= 454928635
##$YMIN_p= -717957
##$CURPLOT= <Network HP LaserJet P1505>
##$CURPRIN= <$Network HP LaserJet P1505>
##$DFORMAT= <normdp>
##$LAYOUT= <+/1D_H.xwp>
##$LFORMAT= <normlp>
##$PFORMAT= <normpl>
##$SURQMSG= 1
$$ End of Bruker specific parameters
$$ ---------------------------------
##NTUPLES= NMR SPECTRUM
##VAR_NAME=  FREQUENCY,     SPECTRUM/REAL,   SPECTRUM/IMAG
##SYMBOL=    X,             R,               I
##VAR_TYPE=  INDEPENDENT,   DEPENDENT,       DEPENDENT
##VAR_FORM=  AFFN,          ASDF,            ASDF
##VAR_DIM=   32768,         32768,           32768
##UNITS=     HZ,            ARBITRARY UNITS, ARBITRARY UNITS
##FACTOR=    0.250966925370066, 1,           1
##FIRST=     8223.43324360094, -151581,      -174166
##LAST=      0,             -135523,         -134184
##MIN=       0,             -717957,         0
##MAX=       8223.43324360094, 454928635,    0
$$ Real data points
##PAGE= N=1
##DATA TABLE= (X++(R..R)), XYDATA
$$ [...]
19564A32303Q2830k5559n442c20222J35249n849B0068b45115P4782J410l6806
19553b05729E3195a0216j74791Q2480a247A3095b25601b3230B821Q1712c06923
19541C1023a58287B0992b67227C13348c40833A50167C8190J1832L7475b55265
19530a81081G9098a01124J4982b9737j15874a9559p2574B77958a81573j2141N6476
19519a37238j48623A44144a43041p0925J06411d6775j48823A79654f4539C27621
19508C9681a75545G572K22574o5193f9333m4976A24942I504i9188A0429b17666
19496c81062J28607B31499i8655o3710g8447p8898C9124f6330l38034h1344A57681
19484b01644O826D80079a03395k11822J46634G3661a99412e1596E8966c31794
$$ y = [132303, 215133, 189574, 184132, -320222, -184973, -190822, 20068, -245115, -170333, -168923, -205729, 53195, -10216, -185007, -102527, -1247, 13095, -225601, -23230, 2821, 84533, -306923, 31023, -158287, 20992, -267227, 313348, -340833, 150167, 38190, 50022, 87497, -255265, -181081, 79098, -101124, -86142, -29737, -145611, -19559, -92133, 277958, -181573, -193714, -137238, -285861, 144144, -143041, -213966, -107555, -46775, -195598, 179654, -64539, 327621, 39681, -175545, 7572, 230146, 164953, -69333, -114309, 124942, 9504, -99188, 10429, -217666, -381062, -252455, 231499, -98655, -162365, -78447, -157345, 39124, -66330, -404364, -81344, 157681, -201644, -194818, 480079, -103395, -315217, -168583, 73661, -199412, -51596, 58966, -331794]
19473I3811b08070o662N8458d8728l10931J21590a6771j34815f2454j74939D1719
19461b05450B86976b33225R1957c6794A6215J49923I654e26920A92148a93561
19450b18275F8075h2792j47387D0682J26620a55740c8783j48613B5703g3433L6510
19439c6923k53494k4257B79792d9386h495j17134A14353f2165F2542c48102A72839
19427e7885H3129b36052l09103b51287h7384c1123d064l67797a67486C5744e4898
19415D02177c65008A70531a25751j15768a00904C51110c7786l2069B21985b83641
19404a96519A6121g4278A33278N8042J02591b63258d6779a6921l98410r1174b45525
19392C2458g7210B05488a65999G773N8134a9320A67412d3507l74202A3011J6606
$$ y = [93811, -208070, -214732, -156274, -48728, -359659, -238069, -16771, -151586, -62454, -237393, 41719, -205450, 286976, -233225, -141268, -36794, 16215, 166138, 9654, -526920, 192148, -193561, -218275, 68075, -82792, -230179, 40682, 167302, -155740, -38783, -187396, 25703, -73433, -36923, -290417, -314674, 279792, -49386, -8495, -125629, 114353, -62165, 62542, -348102, 172839, -57885, 83129, -236052, -545155, -251287, -87384, -31123, -4064, -371861, -167486, 35744, -54898, 402177, -365008, 170531, -125751, -241519, -100904, 351110, -37786, -69855, 221985, -283641, -196519, 16121, -74278, 133278, 191320, 293911, -263258, -46779, -16921, -415331, -506505, -245525, 32458, -77210, 205488, -165999, 7773, 65907, -19320, 167412, -43507, -417709, 13011, 29617]
19381B9617R9669C6327c1320G7232e1326j4000D7877b14240H1726A9908b59326
19369B47861D7114f9482j10465Q1691k73331a35045N106C1945b24756Q799f1097
19357i2726l1333K5629d2778B68857i6077E03166e5836A47168a69171A26950A2753
19345d3696m9881r8558A9755h8057c8154j30578j6049c2385B28158A6542J30018
19334A46560i700k87807B29534d37459F0718L5740e8580A2768L5637e567A80466
19322h0468l33876I8039C3013J12632c69889F4896a24626b1427j31858A05998
19311a66402a2751r6956m17189C61045a97415l2693M5899g7280A10248A0289R0924
19300A01213h6332d0032j41833m8327C6454b05143Q1301C2732h2765c9958j17202
$$ y = [29617, 129286, 36327, -31320, 77232, -51326, -65326, 47877, -214240, 81726, 19908, -259326, 247861, 47114, -69482, -179947, -98256, -371587, -135045, -129939, 31945, -224756, -215957, -61097, -92726, -124059, -98430, -42778, 268857, -96077, 503166, -55836, 147168, -169171, 126950, 12753, -43696, -93577, -192135, 19755, -88057, -38154, -168732, -184781, -32385, 228158, 16542, 146560, -9700, -297507, 229534, -437459, 60718, 96458, -58580, 12768, 48405, -5567, 180466, -80468, -414344, 98039, 33013, 145645, -369889, 64896, -124626, -21427, -153285, 105998, -166402, -12751, -109707, -526896, 361045, -197415, -230108, -184209, -77280, 110248, 10289, 101213, -86332, -40032, -181865, -230192, 36454, -205143, -123842, 32732, -82765, -39958, -157160]
19289a57160d6496a2034I7239c31652f2710k41497l97293a96908K3684D6601K6718
19278G3319b4179A09137J40208F7687e20673K10680a08469D39851b6404D2963
19267G9296e6078j02595q351e4250k44508B09614E2466J63458i5661A76424b02573
19255I4313a54850J4780m8150f5539m5730c4820A78737p0640a21198d5756B59259
19243I6082B5486a08589D32133b94869B9742a01483A33428a2119C8255L2977d1536
19231a65935I1446h9513B93335a30923j54397R2598h2933o2723B90094a10179
19220A03034a59221O3764j8799j05276N3080G2871l1773b00087d2425a8341n4541
19209g2882B12229a56135A51330b11122k9415a00658M7831b627l93587A49539
$$ y = [-157160, -46496, -12034, 97239, -331652, -62710, -304207, -701500, -196908, -173224, 46601, 73319, -24179, 109137, 249345, 67687, -520673, -309993, -108469, 439851, -26404, 42963, 79296, -56078, -158673, -167024, -54250, -298758, 209614, 52466, 215924, -95661, 176424, -202573, 94313, -154850, -140070, -188220, -65539, -111269, -34820, 178737, 108097, -121198, -45756, 259259, 96082, 25486, -108589, 432133, -294869, 29742, -101483, 133428, -12119, 38255, 71232, -41536, -165935, 91446, -89513, 293335, -130923, -285320, -192722, -82933, -145656, 290094, -110179, 103034, -159221, -95457, -114256, -219532, -166452, 72871, 41098, -200087, -42425, -18341, -72882, 212229, -156135, 151330, -211122, -240537, -100658, -52827, -2627, -396214, 149539]
19198b00919O3055B77369a08584A8100b26264A1525O8417J99224P791e2944l54386
19187d07330A6290a83885J9889q89f331A38516c96195J72877a01692B1513J21548
19176A43061h1896D99c30460G4552C3420b14157l53f0128E1136a42804d5482k62188
19164c07670M7701d3838C9985a99330I6601d09950J71951b3440F6488c8230j75250
19153b13480D4433o138b81852B78282f729j36743A15814b03280R9213N1716J8716
19142c3635k5638j40539B15939F9552c20538Q3645g2559j8838h70k69765F4381
19130G6720b41882h2688D6844J24631c37606G6745b8874D12438c14827B96207
19119h300l1364F6500k3440K20797c21767B35998o4345c53708B08191b78664e0617
$$ y = [-200919, -137864, 277369, -108584, 18100, -226264, 11525, 79942, 279166, 286957, -52944, -407330, 16290, -183885, -163996, -164885, -6331, 138516, -396195, -223318, -101692, 21513, 143061, -81896, 499, -330460, 74552, 33420, -214157, -214510, -60128, 51136, -142804, -45482, -307670, -259969, -43838, 39985, -199330, 96601, -409950, -237999, -23440, 66488, -38230, -213480, 44433, 38295, -281852, 278282, -6729, -143472, 115814, -203280, -104067, -52351, -33635, -59273, -199812, 215939, 69552, -320538, -236893, -72559, -91397, -870, -270635, 64381, 76720, -241882, -82688, 46844, 171475, -337606, 76745, -28874, 412438, -314827, 296207, -8300, -39664, 66500, 43060, 263857, -321767, 235998, 171653, -353708, 208191, -278664, -50617]
19107G7545O6410b63168l4933B02083b09178P3132E8677A8145a09465B28613F4955
19095C7583j5974d5957B10307m7991D7668g3824B27543h8994H4525M8638J82609
19084C15772d16836a16027D08852C7753c14725g0620B16589b38176e5074K0832
19074c4242j32079B20822c40312Q7904C0577b17810A90275d8395H1941a09544
19063c62693h9721k88817a06027B361a34176A14927h6367q5417g4509n9202k52432
19052c86143c7690m4327m1324a973l36656a40221J6606j75816A42237N452a44038
19040b32380D0207b78625A08468K7249K14683d2485J0633k87317B76412a94407
19029A35824E6465c3747H2826n300g9777E4696K7530a50712A81970m9515c0231
$$ y = [77545, 143955, -263168, -298101, 202083, -209178, -136046, 58677, 18145, -109465, 228613, 64955, 37583, 21609, -45957, 210307, 162316, 47668, -73824, 227543, -88994, 84525, 133163, 315772, -416836, -116027, 408852, 37753, -314725, -70620, 216589, -238176, -55074, -34242, -166321, 220822, -340312, -252408, 30577, -217810, 190275, -48395, 81941, -109544, -362693, -89721, -378538, -106027, 2361, -134176, 114927, -86367, -171784, -74509, -133711, -386143, -37690, -82017, -123341, -1973, -338629, -140221, -123615, -299431, 142237, 147689, -144038, -232380, 40207, -278625, 108468, 135717, 350400, -42485, -31852, -319169, 276412, -194407, 135824, 56465, -33747, 82826, 77526, -79777, 54696, 82226, -150712, 181970, 132455, -30231]
19017a6664D8923b40655e4422K2978j59905A68839A9206b1166l57036n6017D7434
19005B7415M831a54169k07699k4124a00620A58224e9774q499j43423B99888f8734
18993A15046b11414b2870A37457a02789M1202r0600j77850c1840k03798H1180
18982a57220B27077a07027l7019A05083J26577B0823g5179c2357o9790d3751B54533
18970a54308a0899J237B27848a56617k15935A00549a78510A47546a113j73733
18960a74846j7732h4291l34458a40134k7746o5195j7936C33610j0649a42361F5884
18948c16171A29941a37017d095J510B78666I8688m5890e3834N922o3136j652N4354
18936e8346q7497j5864A54464N0644a19610j9937A3529b44384A73131d53327a92597
$$ y = [-16664, 48923, -240655, -54422, -31444, -191349, 168839, 19206, -21166, -378202, -434219, 47434, 27415, 32246, -154169, -361868, -385992, -100620, 158224, -59774, -68273, -211696, 299888, -68734, 115046, -211414, -22870, 137457, -102789, -61587, -152187, -330037, -31840, -235638, 81180, -157220, 227077, -107027, -144046, 105083, 231660, 20823, -75179, -32357, -102147, -43751, 254533, -154308, -10899, -9662, 227848, -156617, -372552, 100549, -178510, 147546, -1113, -174846, -192578, -84291, -418749, -140134, -167880, -233075, -251011, 333610, 322961, -142361, 65884, -316171, 129941, -137017, -4095, -2585, 278666, 98688, 52798, -53834, -47912, -111048, -112700, -58346, -145843, -161707, 154464, 205108, -119610, -139547, 13529, -244384, 173131, -453327, -192597]
18924F0262a32705A7648Q3966J7562a61426a211m8161a9659j40880K4952C4633
18912B59585G078e8902l78811c9501A96115b1909G5612c2472E8290a97271j7640
18901b14911d2809l0634N891D1237D551a68658p3827j35519d2526n1184A9300
18889c8225A20272f84277I67K659b29306A41163F393f1185C8061J4139d51056
18877b68116P4317A08480h6596B22378I1385b17577A54013a36940j8491D2085
18866A44244a96088C7610L0257J30266c8194n7314a060j02309B09616h6863j28386
18855b15249A08045i9222b5922j07370k2814A93954q0361h9087A89754g7892L0656
18844d7236K2404C99427a31954c8932p0433A02543J5708b34540A2008g5874K6981
$$ y = [60262, -132705, 17648, 101614, 119176, -161426, -1211, -49372, -19659, -160539, -135587, 34633, 259585, 7078, -58902, -437713, -39501, 196115, -21909, 75612, -32472, 58290, -197271, -214911, -42809, -73443, -67552, 41237, 4551, -168658, -242485, -378004, -42526, -93710, 19300, -38225, 120272, -684277, 967, 3626, -229306, 141163, 6393, -61185, 38061, 52200, -451056, -268116, -193799, 108480, -86596, 222378, 91385, -217577, 154013, -136940, -155431, 42085, 144244, -196088, 37610, 67867, 198133, -38194, -95508, -1060, -103369, 209616, -86863, -215249, 108045, -99222, -25922, -133292, -156106, 193954, 113593, -89087, 189754, -77892, -47236, -24832, 399427, -131954, -38932, -109365, 102543, 118251, -234540, 12008, -75874, -48893]
18833d8893C0739J03570A4279P2807a57625q5507j09633H0440d9537a1719B8101
18821A3325h7684A94065a4076l7116C338K35421f9182l8028A75358o5962A7778
18809C6675a57033C27187j34166a4796j6285l83521d5664A33104a70059k0930
18799a90989n8488i6325k12299E2989b37986Q9400k09562I7030h862k02484O0869
18788a50477I9050a04252j93041O6727A5100N3140a554j28955A90942b94820g2089
18776e0381D5092a44097B51481a97829b2510j78307N3926A36500h8502m9658j42564
18765b80724D3965a21801p8305R6122k4683k14971a58120C1141c49425I6716i9306
18753A46970a74311M7903H2111a01434o778E8853e571r6311k9207m9739d1134
$$ y = [-48893, 30739, 134309, 14279, 87086, -157625, -243132, -352765, 80440, -49537, -11719, 28101, 13325, -87684, 194065, -14076, -51192, 3338, 238759, -69182, -107210, 175358, 109396, 17778, 36675, -157033, 327187, 193021, -14796, -31081, -414602, -45664, 133104, -170059, -190989, -249477, -96325, -308624, 52989, -237986, -148586, -358148, 97030, -8862, -211346, -150477, 99050, -104252, -297293, -230566, 15100, 68240, -1554, -130509, 190942, -294820, -72089, -50381, 45092, -144097, 251481, -197829, -22510, -200817, -146891, 136500, -88502, -138160, -280724, 43965, -121801, -200106, -103984, -128667, -343638, -158120, 31141, -349425, 96716, -99306, 146970, -174311, -126408, 82111, -101434, -108212, 58853, -5571, -101882, -131089, -180828, -41134]
18741h540G5691i7160k85079E2746a54752A6354b07627N3556b9901k3468B1841
18729B4013e455A26176e1756M568k55430c7481l68582J49057F6967i0581r9428
18718a90009B0082N9808i6445k21509J01444g3142r8077Q0237j02213j48990a29479
18706c53133D286a77593K4582k1666l63716a52836k6645D112b15047n5262k16066
18695d86375b30817h2058A23020q000k4317C1234J74977b14459C28205B5998J30082
18684A56080a75368A46433e7412j16483G5307o240M4381a08380B02623c16991
18673f1537k50378c9349l66183J41397B74589c98088A71975L6423g035j38115
18663a45150B3058a23215j65444J39271A05594c75443J15830h6549j04071k5099
$$ y = [-8540, 75691, -97160, -382239, 52746, -154752, 16354, -207627, -154071, -29901, -53369, 21841, 24013, -5455, 126176, -51756, -47188, -302618, -37481, -406063, -257006, 66967, -90581, -190009, 20082, 79890, -96445, -317954, -216510, -73142, -171219, -90982, -193195, -342185, -129479, -353133, 4286, -177593, -153011, -174677, -538393, -152836, -179481, 4112, -215047, -270309, -486375, -230817, -82058, 123020, 115020, 90703, 31234, 206211, -214459, 328205, 25998, 156080, -175368, 146433, -57412, -173895, 75307, 69067, 113448, -108380, 202623, -316991, -61537, -311915, -39349, -405532, -264135, 274589, -398088, 171975, 208398, -7035, -145150, 23058, -123215, -288659, -149388, 105594, -375443, -259613, -86549, -190620, -215719]
18653b15719A27987b38489k4134A02995P0421k4574a29179a5797A06616a47350
18642b97621g806r2987j93363H8804D1131a90816j1629k58323a22264C16537a86502
18630A4491J1674a01815A128c52810h2233r4543f1318c0632A71060M6115c37177
18618B30228D4788b07435E330a16403r8249j66937e2056p7408m7377l0108p1752
18607b78701a07465M8879a1108A11910c11339e576q7829A8683b27674k3606k84742
18596e36022a17419j13279i4374A5014J42419m0128b43533Q9722G1447a0990A24445
18584A90279D9560O9756a25214G9891b46543i4443j97206B63114a29407B9097
18573e2095E3442a2944B74204j12413b48568Q7349M8843j72434j50865H0233a28477
$$ y = [-215719, 127987, -238489, -262623, 102995, 173416, 148842, -129179, -15797, 106616, -147350, -297621, -7806, -100793, -294156, 88804, 41131, -190816, -202445, -460768, -122264, 316537, -186502, 14491, 26165, -101815, 1128, -352810, -82233, -176776, -61318, -30632, 171060, 217175, -337177, 230228, 44788, -207435, 5330, -116403, -214652, -381589, -52056, -129464, -176841, -206949, -278701, -107465, -58586, -11108, 111910, -311339, -5576, -93405, 18683, -227674, -251280, -536022, -117419, -230698, -94374, 15014, 157433, 117305, -243533, -153811, 71447, -10990, 124445, 190279, 49560, 119316, -125214, 79891, -246543, -94443, -291649, 263114, -129407, 29097, -52095, 53442, -12944, 274204, 161791, -248568, -161219, -112376, -284810, -435675, 80233, -128477]
18561a42621I107a85783c4897m9226H463b62732J27112A8998a97974j23592B1436
18549a38367B5609b9107A20643a94578R6834A23831a48035O2989R842G8779d02893
18537b40958j9837B21738a72704D5667a69632O4638k47541F3201J40559o3590
18527A40170a73375A483g729A4252J18506e6745j76029G4735L9788h8425p0709
18516a59134M7995J3662p4483b8806p6938A97202i9667C3284a79838L2167o2272
18505b09943q787j00957J14969k2329M4036H8672a71616I4015a14997m0528A62655
18493G1685c1055j46351K7041F4865R9988H0205f8859j01989j27396B5774m508
18482B1266a10947J4081A23983e15322a00821j37483J14471d9880j51666q709
$$ y = [-142621, 9107, -185783, -34897, -84123, 8463, -262732, -135620, 18998, -197974, -321566, 21436, -138367, 25609, -29107, 120643, -194578, -97744, 123831, -148035, -85046, -75204, 78779, -402893, -240958, -260795, 221738, -172704, 45667, -169632, -104994, -352535, 63201, 203760, 140170, -173375, 1483, -7729, 14252, 132758, -56745, -232774, 74735, 114523, -88425, -159134, -111139, -97477, -171960, -28806, -105744, 197202, -99667, 33284, -179838, -147671, -209943, -218730, -319687, -204718, -227047, -183011, 88672, -171616, 94015, -114997, -155525, 162655, 71685, -31055, -177406, -150365, 64865, 164853, 80205, -68859, -170848, -298244, 25774, 21266, -110947, -96866, 123983, -515322, -100821, -238304, -123833, -49880, -201546, -210255]
18472b10255E1632h0679d461F8004c38710L2938h8477l1605j82566A13700Q4728
18461A98428e7665B8204a25929N0568b0274i681k16146R7052e8435j33292A44591
18449e9612a7356A6643d1834A91593b109j97923j7968a0816E9267b26083E9214
18437G2113P7291b62875L4717a06549K5700D5977a70665a9626F007M26212b79716
18425H1512d5326J7830C8087K93161E5124l242a84849A54390H25f8522n3083l4922
18413a56527j02958a16849k98790C2807b3985k74282o1514a05078b2598A12749
18402H4036i4565A74080h8517G3183a65797C7117P9640C8957A7912J04094c75129
18390C31380g5105A35784a18061d2169A19831a76995L9548A5515R9038b50632
$$ y = [-210255, 51632, -80679, -4461, 68004, -338710, -305772, -88477, -120082, -302648, 113700, 198428, -57665, 28204, -125929, -75361, -20274, -9681, -225827, -128775, -58435, -191727, 144591, -59612, -17356, 16643, -41834, 191593, -2109, -200032, -218000, -10816, 59267, -226083, 59214, 72113, 149404, -262875, -228158, -106549, -80849, 45977, -170665, -19626, 6007, 432219, -279716, 81512, -45326, -27496, 38087, 331248, 55124, 51882, -184849, 154390, 825, -68522, -121605, -156527, -259485, -116849, -415639, 32807, -23985, -298267, -359781, -105078, -22598, 112749, 84036, -94565, 174080, -88517, 73183, -165797, 37117, 116757, 38957, 17912, 122006, -375129, 331380, -75105, 135784, -118061, -42169, 119831, -176995, -137447, 15515, 114553, -250632]
18379d5552b2622H0899a67826A9262O1286i7163j9747G7338d6635A77626Q5114
18368B62740a33959b9859A99595b7480C16593E2524J5889a86889b6377r4496I0649
18356i7897l3086j08579i605E1854g651G8619q252N213i6248I8298R2843b97632
18343a98320A27056c28429G7417c07503A32502a89059K76N7975a0282m5112A00180
18331a58018d8441q5849j47473A6100K70600e2426J4150J7631o3574k58707a51309
18319A46179a6748j97864k5084m8239A11293j7160D224a05356E5843f4490B23667
18307d30116E0673a87299k2093k2948G7400P2411o2451f4823B29817k4443h3846
18295d7138a491l4884a4824o9342B66873e36181c3342k32009B9843a20894G3805
$$ y = [-45552, -22622, 80899, -167826, 19262, 80548, -97163, -116910, 77338, -46635, 177626, 262740, -133959, -29859, 199595, -27480, 316593, 52524, 68413, -186889, -26377, -120873, 90649, -97897, -130983, -239562, -9605, 51854, -7651, 78619, 70367, 75580, -96248, 98298, 191141, -297632, -198320, 127056, -328429, 77417, -307503, 132502, -189059, -188783, -130808, -10282, -55394, 100180, -158018, -48441, -134290, -281763, 16100, 286700, -52426, -38276, -20645, -84219, -342926, -151309, 146179, -16748, -214612, -239696, -287935, 111293, 94133, 4224, -105356, 55843, -64490, 223667, -430116, 50673, -187299, -209392, -232340, 77400, 149811, 87360, -64823, 229817, 205374, -83846, -47138, -1491, -36375, -14824, -84166, 266873, -536181, -33342, -265351, 29843, -120894, 73805]
18283a51192k7797K8779A568R7525e6734l37582C55813A56253a7783A68141h2581
18271a33641r9941E9842c03474a15518g465r4129A28746c29642J07207A0685b15334
18259a02096j80017G6492b08667A49937a2270G5972c09974A54917o6772b18045
18248B18746p1710B3275b20105p3610j2345a03270K1259H9495a1466j311j48988
18237a61765M9520A56117K2910G6150j6106b3432j25141A35577d2528E9393a35307
18225b78051j11049a29250A97509P8177i5347a1691k10705J09154f660q3157A34876
18213B01511b32531B01949E2074a66529A34757b25698R4623C01662A17043h892
18202d45143d6505j66877h7893E8577c0618l74286a9354k47507l03229a81799
$$ y = [-151192, -178989, -150210, 1568, 99093, -56734, -394316, 355813, 156253, -17783, 168141, -82581, -133641, -233582, 59842, -303474, -115518, -7465, -101594, 128746, -329642, -222435, 10685, -215334, -102096, -282113, 76492, -208667, 149937, -12270, 75972, -309974, 154917, 88145, -218045, 218746, 147036, 23275, -220105, -293715, -306060, -103270, -82011, 89495, -11466, -12777, -161765, -112245, 156117, 179027, 76150, 60044, -23432, -148573, 135577, -42528, 59393, -135307, -278051, -389100, -129250, 197509, 275686, -95347, -11691, -222396, -113242, -6660, -89817, 134876, 201511, -232531, 201949, 52074, -166529, 134757, -225698, -131075, 301662, 117043, -8892, -445143, -46505, -213382, -87893, 58577, -30618, -404904, -19354, -266861, -570090, -181799]
18191A59101m2124a67096f7189N990o0069A25339a33786b3294A12315L3419K9177
18180A74911P6485a66690A55511f3427j64125O860j0799M0270k21345A33384i8660
18168G0048a4020A89152e6045a2222G2471O6610e3705A295O9675L9440d209H5388
18155c13812a15558b6761k62475G7092K19187h0684A89445q1517e0741F6906B0520
18143b53515c247j38916A04630B2777N9048c3651j23952c8886j67926g220j308
18132h528k7765B29516j06301K09379c25492J47011B17974L1433a31437e3256
18121B41458c7292A42592a40551A5598c0224k13361H054L03471i2634F5569c01145
18109A54481D271a56863A67479A6515a21876p494k65526a59912e3381J9933A5585
$$ y = [159101, 116977, -167096, -67189, -61199, -121268, 125339, -133786, -23294, 112315, 145734, 174911, 251396, -166690, 155511, -63427, -227552, -220692, -231491, -191221, -412566, 133384, -98660, 70048, -14020, 189152, -56045, -12222, 72471, 139081, -53705, 1295, 70970, 110410, -4209, 85388, -313812, -115558, -26761, -289236, 77092, 296279, -80684, 189445, 107928, -50741, 66906, 20520, -253515, -3247, -142163, 104630, 22777, 81825, -33651, -157603, -38886, -206812, -7220, -8528, -36293, 229516, 123215, 332594, -325492, -178481, 217974, 249407, -131437, -53256, 241458, -37292, 142592, -140551, 15598, -30224, -243585, 8054, 311525, -92634, 65569, -301145, 154481, 4271, -156863, 167479, 16515, -121876, -129370, -394896, -159912, -53381, -33448, 15585]
18097c54160a07149A43951c8189k39304a2879l57194a38183k9323G0952d54352
18086f8472C0137a41072C02817a24557B52100a99441k8882B66802r9885o3257
18076A03660a40681B67003@b38224A1107c4137E9122B5200i5973A32770Q4594
18065B17364Q143g4520C0813P8265e3812j45728k63880a38312d4102q8740B02056
18053A7730J22564A9398a63517B70349d0477A27535d2617n0023H4156b51268C18108
18041a3784l74456a67068A42217J32072a50233D13626a16001B16146F4609O8435
18031A33044h1769G234g6113o432c776E6015b09365c0068j3873j11480q7678A17391
18018C06504j36514i3118C73950a15622k05923D6200Q9336b1956j28424B75875
$$ y = [-354160, -107149, 143951, -38189, -277493, -12879, -370073, -138183, -167506, 70952, -454352, -68472, 30137, -141072, 302817, -124557, 252100, -199441, -228323, 266802, 166917, 103660, -140681, 267003, 0, -238224, 11107, -34137, 59122, 25200, -95973, 132770, 217364, 225507, -74520, 30813, 109078, -53812, -199540, -463420, -138312, -44102, -132842, 202056, 17730, 140294, 19398, -163517, 270349, -40477, 127535, -42617, -92640, 84156, -251268, 318108, -13784, -388240, -167068, 142217, 274289, -150233, 413626, -116001, 216146, 64609, 133044, -81769, 7234, -76113, -82545, -3776, 56015, -209365, -30068, -43941, -155421, -243099, 117391, 306504, 169990, -93118, 373950, -115622, -321545, 46200, 135536, -21956, -150380, 275875]
18007g2634j68876m3913d3500C6360i5515H6176h6347K2407G6338a61520r8808
17996b60328f1753b5064F7401a46326d8746q8787k5283e9389j29002P0164c5955
17984A21686a30370i152B57721d8055n925F0185J13916g6833J5114j32704e319
17972a58409A39693J5629K0329c82660c1398k9598J2945k5051B07634J08667d08929
17960A58139o195O8442b13513A8291K9261A886c3254j12924B00771a7451J822
17949a5629A52169J45741b03675a1601B7534J60980a26095D4249a13798c0652
17938E3686a58254p3989A99687c53248B3219b1131p0118j53859C02782n5051a40293
17926A40049B4110J0902J33678E2666j3614J17712J39921a49392O8305H6536K3394
$$ y = [-72634, -241510, -285423, -43500, 36360, -95515, 86176, -86347, -63940, 76338, -161520, -260328, -61753, -25064, 67401, -146326, -48746, -137533, -162816, -59389, -188391, -118227, -35955, 121686, -130370, -9152, 257721, -48055, -53980, 60185, 174101, -76833, -61719, -194423, -5319, -158409, 139693, 155322, 175651, -382660, -31398, -60996, -48051, -73102, 207634, 316301, -408929, 158139, 151944, 220386, -213513, 18291, 47552, 1886, -33254, -146178, 200771, -17451, -15629, 152169, 297910, -203675, -11601, 27534, 188514, -126095, 44249, -113798, -30652, 53686, -158254, -232243, 199687, -353248, 23219, -21131, -91249, -245108, 302782, 247731, -140293, 140049, 24110, 35012, 168690, 52666, 39052, 156764, 296685, -149392, -81087, 86536, 109930]
17915A09930b35361a16282l6767r5925A88178b02505P5707J8339A78591A392a58452
17903a51774f963j28283L3679E4245P7049b61916P5354e1521B48019c31128J30477
17892b00651C1895j3970c3265G5636C4522a18670c4175A24770b93052e1733d140
17880b2879j90168r6604A49791b8663E2480b76183B3386J31936i0579b7618j6622
17869d4240k5727q8670B6782a82412F1686d7651b0070B44368b296j6213j644p850
17857b8003l0959l9477A9307a70250B01202d40560c1679E2270i5483b9606C6624
17845A76019j5178M8119a04643k3523A20030P8819C9820N9897C1914N5544B6178
17833B66446c986r9209l0904k29958I8673l9577b14277D57094i8522A48426l1267
$$ y = [109930, -235361, -116282, -153049, -248974, 188178, -202505, -126798, -108459, 178591, 1392, -158452, -151774, -6963, -135246, -101567, 54245, 131294, -261916, -186562, -51521, 248019, -331128, -200651, 31895, 17925, -33265, 75636, 34522, -118670, -34175, 124770, -293052, -51733, -4140, -22879, -213047, -309651, 149791, -28663, 52480, -276183, 23386, 155322, -90579, -27618, -44240, -69967, -158637, 26782, -182412, 61686, -47651, -20070, 244368, -2296, -18509, -20153, -28003, -58962, -98439, 19307, -170250, 201202, -440560, -31679, 52270, -95483, -29606, 36624, 176019, 160841, 208960, -104643, -128166, 120030, 198849, 39820, 99717, 31914, 87458, 26178, 266446, -3986, -103195, -134099, -364057, 98673, 59096, -214277, 457094, -98522, 148426, 117159]
17822A17159l9010a00715o0762M6464m7276A82357d79214D2021b63993f4181A82599
17810e2572l7497C1680b10420a8348j81242P406P1557J3205B6230R6613h5482
17798A43486b78713N2698a4299F069d35814e5316e66F7299e0089C4999I756e87
17785I8631a19251C20211h3825A67431L4146I7709c7897j38329D9492a52861R112
17774a43749f0004l19522a6490l21392R5547G423K7324R4502L223c9434A34296
17762b47785f4686L0324A94887p1085n4146d9064B07809b8655H3145b35487A72635
17750a78555j10636h3127K9154l676e248C4359K00916f7681j0433o9060o3512
17739b10686k5124j3908C05373j24344k3597a38662b5991A10846a10496d8636
$$ y = [117159, 78149, -100715, -161477, -115013, -162289, 182357, -479214, 42021, -263993, -64181, 182599, -52572, -90069, 31680, -210420, -18348, -199590, -192184, -120627, -107422, 26230, 122843, -85482, 143486, -278713, -226015, -14299, 6069, -435814, -55316, -566, 67299, -50089, 34999, 9756, -587, 98631, -119251, 320211, -83825, 167431, 201577, 97709, -37897, -176226, 49492, -152861, -143749, -60004, -379526, -16490, -337882, -242335, 7423, 34747, 129249, 132472, -39434, 134296, -247785, -64686, -34362, 194887, 123802, 69656, -49064, 207809, -28655, 83145, -235487, 172635, -178555, -289191, -83127, -53973, -57649, -5248, 34359, 235275, -67681, -78114, -147174, -210686, -235810, -249718, 305373, 181029, 157432, -138662, -25991, 110846, -110496, -48636]
17728b05631B42208a67312k82406g388A93104d56218D0244M7618K1380D4514M9472
17717I3986a37932C53908b11963A49047J15258a68861r2339G6709a07257F0837
17706a46637G8606a11886j5263I1603J76566O3073j20622C9198J61290D2638O185
17695D8823R2317f7974C49186e3475J2700A37621a10508C71256d2218B39723j07566
17684A32157C4538J13705a07294A60366g239j98936A49234i6794A13728J74730
17674B88458g3258A46455J02686A4450L6096a03489n8411d9217D2982b0572j07199
17663a27771k90226b02252A2857a15962A11154J14272e0375A8540b70695N9734
17653b10961c7574J715B48799R2067G4137j6569a05125j45909M4830A9599a69223
$$ y = [-205631, 242208, -167312, -449718, -7388, 193104, -456218, 40244, 87862, 109242, 44514, 93986, -137932, 353908, -211963, 149047, 264305, -168861, -261200, 76709, -107257, 60837, -146637, 78606, -111886, -127149, 91603, 268169, 331242, 210620, 39198, 200488, 42638, 48823, 141140, -67974, 349186, -53475, -40775, 137621, -110508, 371256, -42218, 239723, 132157, 34538, 148243, -107294, 160366, -7239, -206175, 149234, -96794, 113728, 288458, -73258, 146455, 249141, 14450, 50546, -103489, -161900, -49217, 42982, -20572, -127771, -417997, -202252, 12857, -115962, 111154, 225426, -50375, 18540, -270695, -210961, -37574, -35859, 248799, 340866, 74137, 57568, -105125, -251034, -206204, 19599, -169223]
17641D3667P5726E252a35159A82199e2140I1616Q0770J27273b21457K0028f2120
17629H2627L0406h3638B98604p8177K28369A13349d07703B64513A7425J31724
17619A49149a19371n7591A5801a95570G2499B4794J56236H9013Q0080M4902E5837
17607D4395j4920c43055h5883a2618C41184n2309a86639H9923b13629g1640H1172
17595a47117C5512a04691B54085p1334i3165A99834D4169L4848M02992A03380
17584b5326A82636H705a43783A46640L7373K07838B7332f056r2552d946o786k047
17572a3779j22187A43947J85157a7846k77478A88830H5101B0333P2395h946j51859
17561a60805A62306J2721p4578b8034q927J0988E62d1085I3018c4083A48655a60792
$$ y = [43667, 119393, 5252, -135159, 182199, -52140, 91616, 172386, 299659, -221457, -201429, -62120, 82627, 113033, -83638, 298604, 220427, 448796, 113349, -407703, 264513, 17425, 149149, -119371, -176962, 15801, -195570, 72499, 24794, 181030, 89013, 169093, 213995, 55837, 44395, 29475, -343055, -85883, -12618, 341184, 288875, -186639, 89923, -213629, -71640, 81172, -147117, 35512, -104691, 254085, 182751, -93165, 199834, 44169, 79017, 482009, 103380, -25326, 182636, 8705, -143783, 146640, 184013, 391851, 27332, -6056, -98608, -4946, -11732, -13779, -135966, 143947, 329104, -17846, -295324, 188830, 85101, 20333, 92728, -8946, -160805, 162306, 175027, 100449, -28034, -36961, -25973, 562, -41085, 93018, -34083, 148655, -160792]
17548D1590d3455A3873b9236j91113R034C26570I6443h0432E1609K4933J35099
17537B11641I3621a05303G0187K1586I789a7559I2363b84301E8507K1613j5936
17526F4184a30735C6573A565b63201B46220a15518A81560d1806j0514H0454e1747
17514a02153B61438A17439i3295C9991j759K7842a66060O313B95878E9060h5070
17502a33557A08714d45499b5403m0310c0561A96933L2478h1426d949B44802b67849
17490D6050Q7146K10333I7045a30378C64929h5476A54557J77637J78717k20558
17480B90353p6321P3255j22284c31469B97684g6142E33035r4651p8580j77173
17470A82631J08985c7897k60975C05365M9128F6802Q4626b69908b5251B28987
$$ y = [41590, -43455, 13873, -29236, -220349, -211315, 326570, 96443, -80432, 51609, 76542, 211641, 93621, -105303, 70187, 91773, 9789, -17559, 92363, -284301, 58507, 80120, 64184, -130735, 36573, 1565, -263201, 246220, -115518, 181560, -41806, -52320, 80454, -51747, -102153, 261438, 117439, -93295, 39991, 38232, 66074, -166060, -159747, 295878, 59060, -85070, -133557, 108714, -445499, -25403, -65713, -30561, 196933, 229411, -81426, -4949, 244802, -267849, 46050, 133196, 343529, 97045, -130378, 364929, -85476, 154557, 332194, 510911, 290353, 214032, 287287, 165003, -331469, 297684, -76142, 533035, 438384, 359804, 182631, 291616, -37897, -298872, 305365, 354493, 66802, 151428, -269908, -25251, 228987]
17459A86985o3325Q703J11962b49050A92686C8622M79125r7507A21990b2173C76463
17447C16358J13410l7777J697j24544j21662C0974L35733g9183A96550N0991R6886
17436C44427J87080B09201L23244a07524J4269A66196R2473b82122d27D16754
17425C57146Q6311a18790C41515m6072O6588b33098A46000F1489J68450L57371
17415E87310A9927M19387A70116m2873J75298j41970n7537K98540A81891b42883
17404C59320g9038A70439n857R9675A05829K1348b83714B22231i712H1002B9240
17392i919B40038k0167J20341K37491j74392c9936A46486o2749K02987e17520
17381b8331F9697j6273j3223L677b52765d0028B37612K3609J3411J13076A31419
$$ y = [186985, 123660, 132363, 244325, -249050, 192686, 38622, 517747, 420240, 121990, -22173, 376463, 316358, 429768, 391991, 393688, 269144, 147482, 30974, 366707, -79183, 196550, 247541, 344427, 531507, 209201, 532445, -107524, -93255, 166196, 258669, -282122, -427, 416754, 357146, 443457, -118790, 341515, 295443, 362031, -233098, 146000, 61489, 229939, 587310, 19927, 439314, 170116, 127243, 302541, 160571, 103034, 401574, 181891, -242883, 359320, -79038, 170439, 164582, 264257, 105829, 127177, -283714, 222231, -9712, 81002, 29240, -9919, 240038, 219871, 340212, 577703, 403311, -39936, 146486, 83737, 286724, -517520, -28331, 69697, 53424, 40201, 43878, -252765, -40028, 237612, 261221, 274632, 387708, 131419]
17369A77108J77874l7982M7377j50914H7530l7257M8490L7397O1305A6679a63052
17357C84383A02223k642J85303k5214E2265L06048A25873e6854G1819L77437k01910
17346B47346l2802b27082J8004E1060L62174I7057j3856l2041a59497F00941a01462
17334b57790Q3355B96493i2730H147a8554I4873O4514m3668K60597A83521n4754
17323A28767L52914j36530I2805L34644J269p4133r9538n0456J86881b9790l452
17312c3242E8790L6312J38098c16402a41524B09161J99679p4299A48347J15592
17302B63939o8165B2212J02499J43393J42636r9917k4796K13j30478b9388D6613
17290C09831A44035k7801K0237K6122P6834J56355A33861K77733A65035O5001
$$ y = [177108, 354982, 317000, 364377, 213463, 87530, 50273, 98763, 136160, 197465, 16679, -163052, 384383, 102223, 99581, 284884, 259670, 52265, 358313, 125873, -56854, 71819, 449256, 247346, 214544, -227082, -209078, 51060, 413234, 97057, 83201, 51160, -159497, 600941, -101462, -257790, -174435, 296493, -92730, 8147, -18554, 94873, 159387, 115719, 376316, 183521, 128767, 481681, 345151, 92805, 427449, 428718, 354585, 255047, 204591, 391472, -29790, -33242, 58790, 95102, 233200, -316402, -141524, 209161, 408840, 334541, 148347, 263939, 195774, 22212, 124711, 268104, 410740, 310823, 286027, 286240, 155762, -29388, 46613, 309831, 144035, 116234, 136471, 162593, 239427, 395782, 133861, 411594, 165035, 230036]
17280B30036J20548J17929D9102J64583J81710j96793K4735J85635F2997K67995
17270C30992M4878A62423J93640A59978H383K94356R3681j64765r5864K44159
17260C79950j07909I7456b4344C70219A82465L91630k03055J30965k04047r0282
17250B07676m3322K24005G6622j6845L52911k2975A59751P0728n6350K44222C6781
17238A14053P3685J73559A79106E7669N9408J54385E6715J45699J17180A3110
17227B84298K28795a4335j48177C39877j09499k513o9664K95547G9027b8918B70763
17215C84546n515A58562D5453L19651r9493J61177A00415Q3293L28365B52726
17204A17081n8415d090j344A22854K5314R1452J45934J95364k47010j04987C8031
$$ y = [230036, 350584, 468513, 49102, 213685, 395395, 198602, 223337, 408972, 62997, 330992, 375870, 162423, 356063, 159978, 8383, 302739, 396420, 231655, 135791, 379950, 272041, 97456, -24344, 370219, 182465, 574095, 371040, 502005, 297958, 207676, 164354, 388359, 76622, 59777, 412688, 389713, 159751, 230479, 174129, 418351, 36781, 114053, 187738, 361297, 179106, 57669, 117077, 271462, 56715, 202414, 319594, 13110, 284298, 513093, -14335, -162512, 339877, 230378, 227865, 158201, 453748, 79027, -28918, 270763, 384546, 379031, 158562, 45453, 365104, 265611, 426788, 100415, 183708, 512073, 252726, 117081, 58666, -4090, -5434, 122854, 148168, 239620, 385554, 580918, 333908, 228921, 38031]
17192A43228j7174J48227o1977m2876J47247l8144J34557J74975G4200L78011
17182D52211j18138k7766J75228A67247L50751r8444j0604j98998j5992K26375
17172D20335q19A55633d5800A55577J73353K02828H7337L5573C3865K66376j14594
17161A85647K57616A86956J76060j31990K23734p9781B6736L24512j61373L90878
17151E80753j61424k02330J58875I1676M33846j05431j76948A10999R0246M96528
17141F97773k5124l13740K10970n1648P5798K7977A57566K99423j62046L4385
17131C29328J21199A47435M78060k74610n0404J94529p3846K0267m7325J38914
17121E33020k55605j34653N1330L66536k16066A20852l910L71612k4943r6541
$$ y = [143228, 126054, 274281, 212304, 169428, 316675, 278531, 413088, 588063, 74200, 452211, 334073, 306307, 481535, 167247, 517998, 419554, 408950, 209952, 193960, 420335, 419516, 155633, -45800, 155577, 328930, 531758, 87337, 122910, 33865, 300241, 185647, 443263, 186956, 363016, 231026, 454760, 374979, 26736, 351248, 189875, 580753, 419329, 216999, 375874, 91676, 525522, 420091, 243143, 110999, 201245, 697773, 672649, 358909, 569879, 518231, 594029, 622006, 157566, 456989, 294943, 329328, 450527, 147435, 625495, 350885, 300481, 495010, 421164, 441431, 394106, 533020, 277415, 142762, 194092, 560628, 344562, 120852, 116942, 488554, 463611, 367070]
17111C67070j43128L48893B12381N7821j05701L47143k7884l5398j20645J9542
17101C47259M17576k54156A24183J72529J28191l5363L44637B06226M53764k68780
17091C91210J89508h0531E19452p3664Q4714K17424C38612j48629Q5431O5631
17081C41045R9837A89739M39871j10862N87452D62040j00606K54502q8508k17386
17071C10042J22751L0486J94036j81813J7069N6145k62607j6959M37104j80149
17061E26105J19144J895k72262m0619J84543L11095C41049K22696j40060o510
17051D17175M23618j38432k38509K26276K0554B91514L18805L2332K0616p4883
17041E88384j87798K48341p2895j65394K78570k88308K52213K507J96517k32601
$$ y = [367070, 223942, 572835, 212381, 270202, 164501, 511644, 483760, 448362, 327717, 347259, 764835, 510679, 124183, 296712, 424903, 389540, 734177, 206226, 659990, 391210, 580718, -80531, 519452, 445788, 530502, 747926, 338612, 189983, 275414, 341045, 440882, 189739, 629610, 518748, 1106200, 462040, 361434, 615936, 527428, 310042, 432793, 463279, 657315, 475502, 492571, 548716, 286109, 269150, 706254, 526105, 645249, 647144, 374882, 334263, 518806, 829901, 341049, 563745, 423685, 417175, 840793, 702361, 463852, 690128, 710682, 291514, 610319, 642651, 663267, 588384, 400586, 648927, 576032, 410638, 689208, 400900, 653113, 655620, 852137, 619536]
17031F19536m5536L49790l45357P7234m0447L50570K015l56945n2685L91919k97027
17020F53067K74147l57851K02225j57014K50209k46323P2084R8790o2391j05709
17010F21234J7609p0397K05701l5577K37761l5702J6274j89207R1605p822l89320
16999D62159N25065j72755j52603P7783j89088O32097l54197J92883j14151p9441
16989H27752p0186J91489n1343j29750P356K17492n7343J40559j92567o6197R7233
16978I14495P8378j02499J36525j93018L38019j8108k68478j6781J87291m7326
16968A008498n0778j06355J76599J54466j33089K5624L04941l6411k44242J35608
16958A234861R1766J23089m16989J33758M5011j79905L05194j64340j76998J27532
$$ y = [619536, 574000, 923790, 578433, 655667, 615220, 965790, 967805, 610860, 558175, 950094, 653067, 927214, 569363, 771588, 614574, 864783, 618460, 690544, 789334, 726943, 621234, 638843, 568446, 774147, 738570, 976331, 940629, 956903, 767696, 859301, 851479, 462159, 987224, 814469, 661866, 739649, 550561, 1182658, 828461, 1021344, 907193, 827752, 757566, 949055, 897712, 767962, 775318, 992810, 935467, 1076026, 883459, 817262, 914495, 992873, 890374, 1026899, 833881, 1171900, 1153792, 885314, 868533, 1055824, 1008498, 957720, 851365, 1027964, 1182430, 1049341, 1074965, 1379906, 1343495, 1099253, 1234861, 1326627, 1449716, 1032727, 1166485, 1211496, 1031591, 1336785, 1172445, 995447, 1122979]
16948A122979J29305n3357m61189O72577k42179P9202R4191j61402j52782L56606
16938A383951L7020j55421J8829j68882L63482J7680L8083l17708M39820l19740
16928A337114l41J42311K19281j47995J96515l09181K73240k87497N8862M5743
16918A528052R9865K4207q2085J80847m4630q1950L25323n11135K22995J95420
16908A856909j9059k5516M7583j61041j33200O00146k43072K3713O6587J85870
16898B198920k80123l00691L60368m4271J13235J25785k17073M93002o651k67006
16888B175495K56695K7730o1218m3711R4103j49582n6669N68773j22413j66151
16878B523052m0500J47075j31499L53527k24379J42259Q1668n9556J07844J23181
$$ y = [1122979, 1252284, 1198927, 737738, 1410315, 1168136, 1247338, 1341529, 1180127, 1027345, 1383951, 1420971, 1265550, 1284379, 1115497, 1478979, 1496659, 1534742, 1217034, 1656854, 1337114, 1336773, 1479084, 1698365, 1550370, 1746885, 1437704, 1710944, 1423447, 1482309, 1528052, 1627917, 1652124, 1570039, 1750886, 1706256, 1624306, 1949629, 1438494, 1661489, 1856909, 1837850, 1812334, 1859917, 1698876, 1565676, 2165822, 1922750, 1946463, 2013050, 2198920, 1918797, 1618106, 1978474, 1934203, 2047438, 2173223, 1956150, 2449152, 2442501, 2175495, 2432190, 2459920, 2398702, 2354991, 2449094, 2299512, 2242843, 2811616, 2689203, 2523052, 2482552, 2629627, 2498128, 2851655, 2627276, 2769535, 2851203, 2791647, 2899491, 3022672]
16868C022672n1946q4475k00046K67329M2435n2081P5258K87694k59346J74316
16858C221810M033j58649K80279j10752r3677q0739M62059j17721L25684K33731
16848C966058j18549j44122K11695J42001r5552K77090j70547L01913l66577N06200
16838D509610p858O6343j10705L644j28702N06611K8468L86253n33798J89579
16828D909445M93234j22260m2320L4394Q23057k77183p7422J94685k38591K83601
16818E980640K9161M4704M77496l3150j08440N76398l5379R3828m4269M77489
16808G458478J32592K35560N0501K4681K00251J73435M89495l41589K70844J30745
16798H824993N00769K66050L8603L90561N6076K51521O19238k41387N32823M30779
$$ y = [3022672, 2970726, 2886251, 2686205, 2953534, 2995969, 2943888, 3019146, 3306840, 3047494, 3221810, 3225843, 3067194, 3347473, 3236721, 3143044, 3062305, 3524364, 3406643, 3732327, 3966058, 3847509, 3703387, 3915082, 4057083, 3961531, 4238621, 4068074, 4369987, 4003410, 4509610, 4501752, 4568095, 4457390, 4461034, 4332332, 4838943, 4867411, 5253664, 4719866, 4909445, 5402679, 5280419, 5238099, 5272493, 6095550, 5818367, 5740945, 5935630, 5697039, 5980640, 6009801, 6054505, 6532001, 6498851, 6390411, 6966809, 6931430, 7025258, 6980989, 7458478, 7591070, 7826630, 7877131, 7901812, 8102063, 8275498, 8764993, 8423404, 8694248, 8824993, 9325762, 9591812, 9630415, 10020976, 10077052, 10328573, 10947811, 10706424, 11239247, 11670026]
16788A1670026J86125K85147L89515K22345L66821O99639p1059M96286M459P45541
16778A4994845N23145L23061M29872Q75258N21513L21799M50151O73310L32675
16769A9445629J380233L09879O92526P95808P99790Q05871N47262J094397J098123
16760B6969518J019059J271973J253200P94768J439929R86240J444985J388704
16752C6568376J671551J675100K046600J645670J982297K163849K171593K164412
16744E2089448K310472K477753K873979K827565L405563L211388L555368L477261
16736G6228797M035547M026244L988659M520057M701060M952179M992698N020858
16728A12466099N057470N210129N254537N219767M843078M735091L893469M362710
$$ y = [11670026, 11856151, 12141298, 12530813, 12753158, 13119979, 13819618, 13748559, 14244845, 14249304, 14994845, 15517990, 15841051, 16270923, 17146181, 17667694, 17989493, 18439644, 19112954, 19445629, 20825862, 21135741, 21828267, 22624075, 23423865, 24229736, 24776998, 25871395, 26969518, 27988577, 29260550, 30513750, 31308518, 32748447, 33734687, 35179672, 36568376, 38239927, 39915027, 41961627, 43607297, 45589594, 47753443, 49925036, 52089448, 54399920, 56877673, 59751652, 62579217, 65984780, 69196168, 72751536, 76228797, 80264344, 84290588, 88279247, 92799304, 97500364, 102452543, 107445241, 112466099, 117523569, 122733698, 127988235, 133208002, 138051080, 142786171, 146679640, 151042350]
16720A51042350L192443K613122K333304J478075M53132j77438j149172j928910
16712A57856906k338229l121142l944108l911540m668934m713899n329859n549307
16704A24279888n183500n447125n338735m818098n151125n221324m942083m397474
16696H3780424m273596l937856l902281l684066l009605l685331l034149l209345
16688E5044195k273094k721111k195563k394222k341892j634141k102239j420621
16680C7961312j654645j488920j838248j327459j201772j137348j114154j411071
16672B6787695o75568j627159n66177j060316m75097j005577r94946p68412m08655
16663A9205788o47996o47749o17638m70163n86569j63461j109485r0151n15854
$$ y = [151042350, 154234793, 156847915, 159181219, 160659294, 161112426, 160934988, 159785816, 157856906, 155518677, 152397535, 148453427, 144541887, 139872953, 135159054, 129829195, 124279888, 119096388, 113649263, 108310528, 103492430, 98341305, 93119981, 88177898, 83780424, 79506828, 75568972, 71666691, 67982625, 64973020, 61287689, 58253540, 55044195, 52771101, 50049990, 47854427, 45460205, 43118313, 41484172, 39381933, 37961312, 36306667, 34817747, 32979499, 31652040, 30450268, 29312920, 28198766, 26787695, 26112127, 24484968, 23918791, 22858475, 22383378, 21377801, 20382855, 19614443, 19205788, 18557792, 17910043, 17292405, 16822242, 16235673, 16072212, 14962727, 14872576, 14356722]
16654A4356722l86530p24508j48616o20471K35590j204535Q5391m77581m21754
16645A0693708j78618k14526j74630m55341l15743J50389l82865k78413K5462
16636H869423k5058q48939j21630J95414n71123K7345J83483p83308J03323k07722
16626F821208k30337m11828L16728q5889m67176M31292p46202J28507j28894k52580
16616E374829J29936l34429k40788K11695j65064K1307k26155j20288r5000l3203
16606D522840j10086L2054l3903q0821o5012j54671k01303p7039r6844K82384
16596D017599p8615k61243q1912J68216o37306J66054J45473k57127L47066m65550
16586C062655J75621j62262L59988n18283J32231j85835n02631M31602p1609j64042
$$ y = [14356722, 13970192, 13245684, 13097068, 12476597, 12712187, 11507652, 11593043, 11115462, 10693708, 10515090, 10300564, 10125934, 9670593, 9354850, 9505239, 9122374, 8843961, 8869423, 8844365, 7995426, 7873796, 8069210, 7498087, 7525432, 7708915, 6925607, 7028930, 6821208, 6590871, 6179043, 6495771, 6409882, 5942706, 6373998, 5627796, 5756303, 5627409, 5374829, 5504765, 5170336, 4929548, 5141243, 4976179, 4997486, 4771331, 4651043, 4556043, 4522840, 4412754, 4444808, 4410905, 4330084, 4265072, 4110401, 3909098, 3832059, 3735215, 4017599, 3938984, 3677741, 3595829, 3764045, 3126739, 3292793, 3438266, 3181139, 3528205, 3062655, 3238276, 3076014, 3436002, 2917719, 3049950, 2864115, 2361484, 2793086, 2721477, 2557435]
16576B557435K43659j81929q0540J63076l44618J90623k22363l6971R0962m02449
16566A976885L68054j3634r9603m7849L5557Q9442j36959l72274M13514n5155
16556B157978j50686L50763m13527K10261l38655J13319k24512o2354J33404j01213
16546A674778p8523L21926k00571M38048l48999l16846R4276J20774O8608o5135
16536A708336k0166J1507K41266o30386M70085k42761N2788l58505L79737j82827
16526A429074k22036Q8779j11366L87955m41745J50223J26778J94561l46713l07231
16516I48279N47143n37797J88618K49603m81113N24120l31360q5841J86048J2549
16506A220249k12548j59094J55196j24199n715L67223p1321k87431n7563L19581
$$ y = [2557435, 2801094, 2619165, 2538625, 2701701, 2357083, 2547706, 2325343, 2288372, 2379334, 1976885, 2344939, 2331305, 2231702, 2183853, 2219410, 2308852, 2171893, 1799619, 2213133, 2157978, 2007292, 2358055, 1944528, 2154789, 1816134, 1929453, 1704941, 1642587, 1775991, 1674778, 1596255, 1918181, 1717610, 2155658, 1806659, 1489813, 1584089, 1704863, 1773471, 1708336, 1688170, 1699677, 1940943, 1310557, 1780642, 1537881, 1590669, 1232164, 1611901, 1429074, 1207038, 1295817, 1184451, 1572406, 1130661, 1280884, 1407662, 1602223, 1255510, 948279, 1495422, 957625, 1146243, 1395846, 914733, 1438853, 1107493, 1021652, 1207700, 1220249, 1007701, 848607, 1003803, 879604, 873889, 1241112, 1169791, 882360, 824797, 1144378]
16496A144378k00979l40142N48025Q3550j93152j72630j27947N20241k17061P5383
16486A119666k2073k36600O0730j2727k22208L14330k27209L162q5860M53563
16476A144774l24980J13219Q4374k48027k14337J27145j39634j59047M30533j11970
16466G02050k99948L89399n1785j38616B66459M21095q2038r5309N00237l57431
16456F53013j05854L28660l64759K77548L1363l81567J86892K43119C57857M71015
16446H28872j45492j1198j49803K0086p622K04663j85946k560J70196j93491J64016
16435F91721j67390K79565K8649C54716M28131l75109K18208k1519k77220K4860
16425C52067l0322q5411M61128j90446m814r8733J25115r2216O694p1438K14059
$$ y = [1144378, 943399, 603257, 1151282, 1234832, 1041680, 869050, 741103, 1261344, 1044283, 1119666, 1097593, 860993, 921723, 908996, 686788, 1001118, 773909, 777071, 691211, 1144774, 819794, 933013, 1017387, 769360, 555023, 682168, 542534, 383487, 814020, 702050, 402102, 791501, 739716, 601100, 266459, 687554, 605516, 510207, 1010444, 653013, 547159, 875819, 511060, 788608, 819971, 438404, 625296, 868415, 357857, 828872, 683380, 672182, 522379, 542465, 534843, 739506, 553560, 551000, 721196, 527705, 691721, 524331, 803896, 832545, 354716, 782847, 407738, 625946, 604427, 327207, 352067, 321745, 236334, 697462, 507016, 502202, 403469, 528584, 436368, 443062, 371624, 585683]
16414E85683q2386J20718R9050k03110J62823B25581K10867L28631C77430J28383
16404E05813q6307k5411Q8650k30192L44609n0047J87832j37925o9756N6551B23606
16392D15538O556j18038J88675l221J76640J23702B18003J30937l8071A18518
16381D96204A35021K7052K26373J55922K61141B61304K36180j14061E2223J20351
16371A72574J34155J95232A1076M47918M3432B0686L14045l3959j1601A41673
16360C29152M6673A47488K45540k0215A27584m7227N98142A72238M377J01639
16350B78254J20361A02361J99694f042A12576K73369p0166j30334P785J48755
16340C41985A55028R4924K69065j43025A75303f5201D36126j92976R4983a82278
$$ y = [585683, 503297, 624015, 723065, 519955, 682778, 225581, 436448, 765079, 377430, 505813, 419506, 394095, 482745, 252553, 597162, 547115, 734947, 597022, 527266, 583817, 223606, 415538, 422094, 304056, 492731, 489510, 666150, 789852, 218003, 348940, 310869, 118518, 496204, 135021, 162073, 388446, 544368, 805509, 261304, 497484, 383423, 52223, 172574, 306729, 501961, 11076, 458994, 502426, 20686, 334731, 300772, 289171, 141673, 329152, 375825, 147488, 393028, 372813, 127584, 80357, 678499, 172238, 176615, 278254, 398615, 102361, 302055, -6042, 112576, 385945, 315779, 185445, 193230, 341985, 155028, 249952, 519017, 375992, 175303, -65201, 436126, 243150, 338133, -182278]
16329B31740O5403j29760H0168K01203b0361A51984O2092p21K99092j43222j48496
16318B20729h451B63626r5670R5241L9043e4956E40179k39601r449q9076I0084
16306A57201e23981B06721N0862B3227K29890L1448A41055K82582A14357P0041
16296A84398k4423d369A44441Q2840M7800M5941q3405A02532J98796j14733p1890
16285A14705K7916J11249p4179K48142A26557N3718a2544j07897e1101A65223
16274E72166b19787C11975b8109j88976A57180a42525e7363a1647b214B8839a58060
16262i37r8599E26160A02449O7058m535n395F4512K33709M0938A45645a44684
16250C64518j61551r4240J79849c4168B22677R9270a44974f9849l6800I3982p83
$$ y = [231740, 297143, 167383, 80168, 281371, -20361, 151984, 214076, 213355, 512447, 369225, 220729, -8451, 263626, 167956, 263197, 302240, -54956, 540179, 300578, 291129, 202053, 90084, 157201, -523981, 206721, 257583, 23227, 253117, 284565, 141055, 423637, 114357, 184398, 159975, -4369, 144441, 227281, 275081, 321022, 237617, 102532, 301328, 186595, 114705, 142621, 253870, 179691, 427833, 126557, 180275, -12544, -120441, -51101, 165223, 572166, -219787, 311975, -28109, -217085, 157180, -142525, -57363, -11647, -2214, 28839, -158060, -937, -99536, 526160, 102449, 169507, 164972, 159577, 64512, 298221, 339159, 145645, -144684, 364518, 202967, 108727, 288576, -34168, 222677, 321947, -144974, -69849, -106649, 93982, 93199]
16239I3199J70045F1196P541M6371P2015H3437a49314D512K16684k4250l1961
16228A64985K76144E3052K78867a1807r0953G9129Q9100E4940i8938r8708B85801
16216A23053J35731l4168Q8978g0655A42243O981a86838A53304m8395P0327E3471
16204C614L7358K01702c047j63551A95900b54529j72969M9500A3014J75731b5400
16192A34475K35927b12450A29189M0011a59821c3207j9306J9674a5100A96442
16181a6974D1182b02351D0743K3673i5349p8556A27256O413J8778g257G4350K26803
16169C01153c2231A43488J7211K9456E5532b0451q454A71543a2231c542E3435
16157D25472A18640J94259d3883j1133B69778j27629A1671J14417K9187m6404
$$ y = [93199, 263244, 61196, 68737, 115108, 187123, 83437, -149314, 4512, 221196, 196946, 164985, 441129, 53052, 331919, -11807, -102760, 79129, 168229, 54940, -98938, -197646, 285801, 123053, 258784, 224616, 313594, -70655, 142243, 149224, -186838, 153304, 104909, 175236, 53471, 3614, 40972, 242674, -3047, -166598, 195900, -254529, -427498, -377998, 13014, 188745, -25400, 134475, 370402, -212450, 129189, 169200, -159821, -33207, -52513, -32839, -15100, 196442, -16974, 41182, -202351, 40743, 64416, -95349, -173905, 127256, 133669, 152447, -7257, 74350, 301153, -32231, 143488, 160699, 190155, 55532, -20451, -28905, 171543, -12231, -3542, 53435, 425472, 118640, 312899, -43883, -55016, 269778, 142149, 11671, 126088, 155275, 108871]
16147A08871k3367b71772A14501D8872a31212C8034a75252d4396k36825e1360
16136e3222n9819I4158a83467j38888A15532C2525h55k0229r0255E6139J82456
16125B38595a9441A23233b6896A46568e9211B74863H7043K4098J57267P6471j35803
16114B09076c32611F2415B5685M58990c5381A07813h4900j09310D5895a52856
16103A38443K738J7014l1136h5300l0848B62732C1316L24887r179f1774j51890
16092b13664d5075B15777c0036k2363j17584I3257a63863J8797B12341m1113i6517
16080a8292k15756h1735D4715J201K2870q390b9890j58346I4129a77644h8212
16068a31307a386C01496a6432A6677h6837a9622A87047h3236q924j02007N2964
$$ y = [108871, 85504, -271772, 114501, 48872, -131212, 38034, -175252, -44396, -281221, -51360, -53222, -113041, 94158, -183467, -322355, 115532, 32525, -855, -21084, -111339, 56139, 238595, -19441, 123233, -26896, 146568, -59211, 274863, 87043, 111141, 268408, 344879, 209076, -332611, 62415, 25685, 484675, -35381, 107813, -84900, -194210, 45895, -152856, 138443, 141181, 158195, 127059, -85300, -116148, 262732, 31316, 356203, 347024, -61774, -213664, -45075, 215777, -30036, -52399, -169983, 93257, -163863, -145066, 212341, 171228, -96517, -18292, -234048, -81735, 44715, 45916, 68786, 60396, -29890, -188236, 94129, -177644, -88212, -131307, -1386, 301496, -16432, 16677, -86837, -19622, 187047, -83236, -92160, -194167, -141203]
16057a41203j45136f7815i320j5365r533r777B56748b2366G9243a39730D09153
16045b50111m2676l8230b7606k38530g1744n4683H8710O3218e46108f6003A20596
16033a89527g4093B00769N759L8752Q994k976j07966m8834J14236j3865H4121
16021A55091m523b35899e624r3055B35342E3271c0218B3659J47182a22270n7434
16010a79704d8329o7366G7502a16680C39125A25202D3708b37047O8901d512A04052
15998A9009R6050k9858a15713A53425a02274j70654C0059f200F758c02534A37161
15986B47081b45487H5606a68536b1253B00861J02442F6081J03512N0358j8731
15976B01220a42835E8175I182J03948b97073A71550i8177E4923a0604A17310c8160
$$ y = [-141203, -286339, -67815, -9320, -24685, -34218, -43995, 256748, -22366, 79243, -139730, 409153, -250111, -292787, -331017, -27606, -266136, -71744, -126427, 88710, 151928, -546108, -66003, 120596, -189527, -74093, 200769, 206528, 245280, 254274, 251298, 143332, 94498, 208734, 194869, 84121, 155091, 150568, -235899, -5624, -98679, 235342, 53271, -30218, 23659, 170841, -122270, -179704, -48329, -115695, 77502, -116680, 339125, 125202, 43708, -237047, -168146, -4512, 104052, 19009, 115059, 85201, -115713, 153425, -102274, -272928, 30059, -6200, 6758, -302534, 137161, 247081, -245487, 85606, -168536, -21253, 200861, 303303, 66081, 169593, 219951, 201220, -142835, 58175, 9182, 113130, -297073, 171550, -98177, 54923, -10604, 117310, -38160]
15964a6041G9242M9928a98153B39908B1314K41385k2541a47984C10983a35708
15953E7683j3673a49418j8319h2415r893k78034H5243O70a09830B7088R4989a36155
15940A02197a52524B6998a50287n9534i516n6252E506c40714E9711a56452f4513
15928a22l20407k00240B78265a01031a3398A63022g7096j29471i3306C3001A2973
15916b4378A9092K62989b24809A37161a03456B3911K2414L5113J08091C2444H751
15904G9629g6251B60632E026K65235a91173B27075L7119a15294d365B65869A1952
15892A93801N0474b68728A22440B5621O7721a49388C601K55099a68048b4762A1356
15880a57922B2476b06153A5637L5757b1574F8079f8788j80360f1060A82134a09625
$$ y = [-16041, 79242, 129170, -198153, 239908, 21314, 262699, 240158, -147984, 310983, -135708, 57683, 44010, -149418, -167737, -82415, -92308, -370342, 85243, 85913, -109830, 27088, 122077, -136155, 102197, -152524, 26998, -150287, -209821, -9516, -65768, 5506, -340714, 59711, -156452, -64513, -122, -320529, -520769, 278265, -101031, -13398, 163022, -77096, -206567, -93306, 33001, 12973, -24378, 19092, 282081, -224809, 137161, -103456, 23911, 46325, 81438, 189529, 32444, 8751, 79629, -76251, 260632, 5026, 270261, -191173, 227075, 264194, -115294, -4365, 265869, 11952, 193801, 244275, -268728, 122440, 25621, 93342, -149388, 3601, 258700, -168048, -24762, 11356, -157922, 22476, -206153, 15637, 51394, -21574, 68079, -68788, -249148, -61060, 182134, -109625]
15868B4817a16683r9877C82812A1902c3022q4053B63355f9831k93663F3133b58330
15856I4993m1169c24829a1293A08417d4972B53777A4583e8j97766A18371c40573
15844G9155g4031c1490C005d2340B87513a65268m4398h5994q3509c5607l30910
15833c66517A75079b59827H4194J1507k3028a74953F7002e8424m8928A0583a48637
15821A33390O6592c59390R7904B7741L2719a217I46L1086g3286n389r9321M3769
15809a34227g373m15623a86316p1616m8227f1265k66879J50126C9756K2344J03325
15798A65425b55556a18A84370d1826K0846l94001G0708a59785L7875A2224L46942
15787C59166a48133A000J45862J31774A20205a94088C3256J06528A5360J98815
$$ y = [24817, -116683, -216560, 382812, 11902, -33022, -117075, 263355, -69831, -363494, 63133, -258330, 94993, 53824, -324829, -11293, 108417, -44972, 253777, 14583, -58, -197824, 118371, -340573, 79155, -74031, -31490, 3005, -42340, 287513, -165268, -209666, -85994, -169503, -35607, -366517, 175079, -259827, 84194, 95701, 72673, -174953, 67002, -58424, -107352, 10583, -148637, 133390, 199982, -359390, -261486, 27741, 60460, -1217, 946, 32032, -73286, -78675, -177996, -134227, -7373, -422996, -186316, -257932, -306159, -61265, -328144, -178018, 39756, 62100, 165425, -255556, -118, 184370, -41826, -20980, -414981, 70708, -159785, -121910, 12224, 359166, -148133, 1000, 146862, 278636, 120205, -194088, 33256, 139784, 15360, 214175]
15777B14175F7679d9940p780B78080a48515K5314q3518A49982D4514N9303A2593
15765b15471B09600a08439q9898d1016k2072I0292c2731B77265a93941q9001A2235
15753A54259C9045b38336C05632j13378D191a07083c602l3107j50503C1499a01235
15741D59071b2515C5059R3677a54224k7486a33l3706q7376k75574a056A20938
15729a87043B390J0532R7222b40643I2333a58289A71555c91480B6092d0201l38847
15718c79048F2139O2943c18192a01298K0113o3836p6912C08463b8262L740B05441
15706A58109j8164a68670e6606l224o6198G5311a17532c8965o633o9680A36365
15694F1148N85488C7590P3865k1495Q881m949N5101f6568C64130H5271h3329A09286
$$ y = [214175, 67679, -49940, -57720, 278080, -148515, -123201, -206719, 149982, 44514, 103817, 12593, -215471, 209600, -108439, -198337, -41016, -63088, 90292, -32731, 277265, -193941, -282942, 12235, 154259, 39045, -238336, 305632, 192254, 4191, -107083, -3602, -36709, -187212, 31499, -101235, 459071, -22515, 35059, 128736, -154224, -181710, -133, -33839, -121215, -396789, -1056, 120938, -187043, 2390, 12922, 110144, -240643, 92333, -158289, 171555, -391480, 26092, -40201, -379048, 62139, 125082, -318192, -101298, -81185, -145021, -221933, 308463, -28262, -24522, 205441, 158109, 139945, -168670, -56606, -59830, -126028, 75311, -117532, -38965, -45598, -115278, 136365, 61148, 646636, 37590, 111455, 89960, 98841, 93892, 148993, -66568, 364130, 85271, -83329, 109286]
15681F9794B204f9536A05574a18764N8421j55789i0373m3874B9115a31675E1927
15669i4450M008j339B01387C4684J69123R9848D0652c38683a15022J5183A25317
15657a66411d0126l7989F7149e3400C48581a27638A24053J52422d16422A0055
15646B5425a49409C3707l36a17515B64863e7306B34839a96087A62678J68737h3397
15634D6231m185a3591l7084p0096c2534C82564I2536J51394g532C48933A03652
15622a94825f3745A20260C9390R507N473e4633A80147B163J06519d71163D1797
15610i4424A87922L6368q4203b91523A68161K8363a65370A1577a4252G1781d4583
15598g3612K5834B23963A2811L0347K52347c7012k7382B6839a96105l9705e5712
$$ y = [69794, 2204, -69536, 105574, -118764, -60343, -216132, -90373, -134247, 29115, -131675, 51927, -94450, -90442, -91781, 201387, 34684, 203807, 303655, 40652, -338683, -115022, -99839, 125317, -166411, -40126, -78115, 67149, -53400, 348581, -127638, 124053, 276475, -416422, 10055, 25425, -149409, 33707, 33371, -117515, 264863, -57306, 234839, -196087, 162678, 331415, -83397, 46231, 42046, -13591, -50675, -120771, -32534, 382564, 92536, 243930, -7532, 348933, 103652, -194825, -63745, 120260, 39390, 48897, 54370, -54633, 180147, 2163, 108682, -471163, 41797, -94424, 187922, 224290, 140087, -291523, 168161, 196524, -165370, 11577, -14252, 71781, -44583, -73612, -47778, 223963, 12811, 43158, 295505, -37012, -64394, 26839, -196105, -235810, -55712]
15586A96282K40305c29944i1j5872C13649e7185j57676f366F2423a94465H7256
15574h3146B96675b4248A97347K9838E1324h932k32894K5496e4375b4733A01792
15562i5284A40673A8869b70719G8557L4936l8908c70051f9715D0572c5030C347
15550B6457c51186Q4268a18464p7568m5386J04138A25804j8305H057c28757a39331
15538F4324a1177o8044A26390C7923g7839r0246A91006n7347K1794a41740B85385
15526G9939Q5338B5950h9k29847R7657K1163e2266k18299j15055D4721a80461
15514B26515D8901O5430c1415j16152A94268k7899a2408B26343B8465J35545J2008
15503A76018j5575a44077N970j13165n6417a19640D6832J08238i2521L24K907
$$ y = [196282, 436587, -329944, -91, -15963, 313649, -57185, -214861, -6366, 62423, -194465, 87256, -83146, 296675, -24248, 197347, 227185, 51324, -8932, -241826, -216330, -54375, -24733, 101792, -95284, 140673, 18869, -270719, 78557, 113493, 74585, -370051, -69715, 40572, -35030, 3347, 26457, -351186, -266918, -118464, -196032, -241418, -137280, 125804, 107499, 8057, -328757, -139331, 64324, -11177, -79221, 126390, 37923, -77839, -168085, 191006, 133659, 155453, -141740, 285385, 79939, 165277, 25950, -89, -229936, -132279, -111116, -52266, -270565, -385620, 44721, -180461, 226515, 48901, 114331, -31415, -147567, 194268, 166369, -12408, 226343, 28465, 164010, 176018, 160443, -144077, -138107, -251272, -307689, -119640, 46832, 155070, -92521, -92197, -89290]
15492h9290p666c5231j05985k54988a96246A37522L01432i8522A33596f7414b8871
15480b26921B04455E8575J48173G6585J71613B1321Q6396A6920L9927h7947L6263
15469e1684n38727b39747F7169a7905B85314F2829J65146m6473A0218M6246b6790
15457d4053a9458j71740m6281J11752A44731J43414r2147r1591k4575a43929G5609
15445E1246d83829a90511m3320g9875E9643K37204a63643N2464n731n9336A97603
15433A25748M7947a61249A64967g6629K8819k04875N7751A17409i2980c5578l5145
15422g0723B62986G7541a77026B33657H8986J7870m478J09886b26154M1817c602
15410A17626J58564M4207q4914q6993n179C1494b29334R6202m7498r9612f2690
$$ y = [-89290, -96956, -35231, -141216, -396204, -196246, 137522, 438954, -98522, 133596, -67414, -28871, -226921, 204455, 58575, 206748, 76585, 248198, 21321, 107717, 16920, 56847, -87947, -51684, -590411, -239747, 67169, -17905, 285314, 62829, 227975, 181502, 10218, 56464, -26790, -44053, -19458, -191198, -237479, -125727, 144731, 288145, 195998, 104407, 79832, -143929, 75609, 51246, -483829, -190511, -233831, -79875, 59643, 296847, -163643, -111179, -116910, -176246, 197603, 125748, 173695, -161249, 164967, -76629, -47810, -252685, -194934, 117409, -92980, -35578, -70723, 262986, 77541, -177026, 233657, 88986, 106856, 102378, 212264, -226154, -184337, -3602, 117626, 276190, 320397, 235483, 148490, 143311, 31494, -229334, -133132, -180630, -280242, -62690]
15398B7471Q467H318J86779b40089C13867F7547O7012a19343p1736i0354F9457
15386a24233l1173h051q8821c0741A55068R6145a83533A93014I0281J91769e4231
15374B03211e7791k21602A74117b83739A63910c22953g1680E6994P8987a85033
15363I0512L080g4065a3939E0361i0018K6051D724a87291C46634a46111m198A6687
15350C19119i9562A98507G8678i2761k96261h3806j591K7668A40343a44085b9950
15338i2528K3500J0423a0817A27081b92106J35146n3041g9753K3916j45021h4622
15326C1043c48095J68551f1470j04072B34622p3627m5042K3392a05384b2706G6528
15314B10655J74004I4506a45259A88361b8773A96081I6874c1079k16O095j20045
$$ y = [27471, 35938, 8318, 195097, -240089, 313867, 67547, 134559, -119343, -191079, -90354, 69457, -124233, -155406, -8051, -96872, -30741, 155068, 251213, -183533, 193014, 90281, 282050, -54231, 203211, -57791, -279393, 174117, -283739, 163910, -322953, -71680, 56994, 135981, -185033, 90512, 93592, -74065, -13939, 50361, -90018, -63967, 4724, -187291, 346634, -146111, -150309, 16687, 319119, -99562, 198507, 78678, -92761, -389022, -83806, -85397, -57729, 140343, -144085, -29950, -92528, -69028, -58605, -10817, 127081, -292106, -156960, -210001, -79753, -55837, -200858, -84622, 31043, -348095, -179544, -61470, -165542, 234622, 160995, 115953, 139345, -105384, -22706, 76528, 210655, 384659, 94506, -145259, 188361, -28773, 196081, 96874, -31079, -31295, -25200, -145245]
15303a45245c5186A86831o2274a29284d8310I6418Q295b4279D19560b21874e316
15291A86477J14878B9234a44643J8358a2594B08464I0932b84043m0771E3816O9186
15280A23002g1976B52764A3741L69641a44927a2152j71575b1372A14225a05833
15269F8929J83768E1986K3750K63463A61641m887a6982A06808e5317C30361r3557
15258B36804L6149G5710C5690J31861j633a59466F5678L12825A43931m4137D5544
15246C91354K23937N02910L41815P0881J61102n48924m13787D9384K25118C7226
15235a51086A35136N0292K15544G40i3823D05555A29573J48244B2453h4467A48934
15223D3581M42422A17248a17847j2449C05898b25320F3282e5413p5837P774A52283
$$ y = [-145245, -35186, 186831, 124557, -129284, -48310, 96418, 104713, -24279, 419560, -221874, -5316, 186477, 301355, 29234, -144643, -126285, -12594, 208464, 90932, -284043, -324814, 53816, 123002, -71976, 252764, 13741, 383382, -144927, -12152, -183727, -21372, 114225, -105833, 68929, 252697, 51986, 75736, 339199, 161641, 156754, -16982, 106808, -55317, 330361, 236804, 272953, 75710, 35690, 167551, 165918, -159466, 65678, 378503, 143931, 99794, 45544, 391354, 615291, 1118201, 1460016, 1530897, 1691999, 1143075, 729288, 49384, 274502, 37226, -151086, 135136, 185428, 400972, 740, -93823, 405555, 129573, 277817, 22453, -84467, 148934, 43581, 486003, 117248, -117847, -130296, 305898, -225320, 63282, -55413, -131250, -123476, 152283]
15211F0969f7401k2329A91062a08358C60297a08556C08238G0764b11344P3111
15201a38233M5326j32502A62793J36142d3807n8699b8335G4800J25468J44805
15191C45073c17838A02373m0978J59898o741a06937B61961b26981A5063b6961
15180B84953A6022h744B33450n5955a48716I9539N04800h098j5236B8789C643
15168B00099F8765c4008A71485Q9168O7765A30282J7281b4876j11324B46830J02434
15157C49264B0975N2837N0517J18589R2067D8979J89658J64642E5457g9741C0425
15145B01316J92269c05381C8426O3289m1523a38385O7737C65882d0369A40628
15134A7908h8402A06264J0313J97073l0905l5622L2195R370C4258J02392a00143
$$ y = [60969, -67401, -89730, 191062, -108358, 360297, -108556, 308238, 70764, -211344, -138233, -92907, -225409, 162793, 298935, -43807, -102506, -28335, 74800, 200268, 345073, -317838, 102373, 61395, 221293, 214552, -106937, 261961, -226981, 15063, -26961, 284953, 16022, -8744, 233450, 177495, -148716, 99539, 604339, -8098, -23334, 28789, 3643, 200099, 68765, -34008, 171485, 260653, 328418, 130282, 147563, -24876, -136200, 246830, 349264, 20975, 73812, 124329, 242918, 334985, 48979, 238637, 403279, 55457, -79741, 30425, 201316, 393585, -305381, 38426, 101715, 60192, -138385, -70648, 365882, -40369, 140628, 17908, -88402, 106264, 116577, 313650, 282745, 247123, 279318, 288688, 34258, 136650, -100143]
15122D2008J88456J85490a47410C7558J70444l2249G3829J17350c89722a77266
15111F5945L18702j42403a608B52536b8647B29J8807o308a49623B28289J75325
15100D03614d1329G7325C5819a48587D80616A93599b00814J3787A1995L77088
15090C89083H5110K89978E1741a36132D0620e9597D05K00532Q6520j11195F3485
15078A42461N1557d9218A83674m565B9642J64378r13m6849b14712i7425C14790
15066E9612M9609l5436J19578d0663j95217B88537j30114b17393D00963A73776
15055B07316a08569C79257j83372m3545E6934Q5219J887O1267C6683K26067P2095
15044C34845G1222J60539J62437R2267C3250a81799A99084o0079O8006b5225p1467
$$ y = [42008, 230464, 415954, -147410, 37558, 208002, 175753, 73829, 191179, -389722, -177266, 65945, 384647, 242244, -1608, 252536, -28647, 229, 19036, 12728, -149623, 228289, 403614, -41329, 77325, 35819, -148587, 480616, 193599, -200814, -187027, 11995, 389083, 85110, 375088, 51741, -136132, 40620, -59597, 405, 200937, 287457, 176262, 63485, 142461, 194018, -49218, 183674, 179109, 29642, 194020, 193107, 146258, -214712, -97425, 314790, 59612, 109221, 73785, 193363, -40663, -235880, 288537, 158423, -217393, 400963, 173776, 207316, -108569, 379257, 195885, 152340, 56934, 142153, 144040, 205307, 36683, 262750, 334845, 71222, 231761, 394198, 486465, 33250, -181799, 199084, 139005, 207011, -25225, -96692]
15033i6692E4801J52045A8674M94185b4611A85059a77055E7648J42791J25549
15023C25988j53138J74705A55177J25608o1735q2991E5207J03577J54489P7702
15013C90975j26644I9907K59401B64K28396p7647K36328K298a15508C05175H8655
15001A77725i1961A27788L0631K45406o1709A44487J45126q0147d8084j7603B42229
14989e1052E1249J49537K0680J05573a18085B908J4669L58571b9898A69627K9285
14978A98912L6687q6914P4305J5514r9750J67645J05861K5455j16194P3626K1761
14967D16908A34216J74698j05946A00555J62952j3722M3658n927N9729N5624k5162
14956C77707i3328E96460j68128j75382P7339j25535r7830M35114A47268L897
$$ y = [-96692, 54801, 206846, 18674, 512859, -24611, 185059, -177055, 57648, 200439, 325988, 172850, 347555, 155177, 280785, 219050, 136059, 55207, 158784, 313273, 390975, 264331, 99907, 359308, 264, 228660, 151013, 387341, 389639, -115508, 305175, 88655, 177725, -91961, 127788, 158419, 403825, 342116, 144487, 289613, 209466, -48084, -65687, 242229, -51052, 51249, 200786, 221466, 327039, -118085, 2908, 17577, 376148, -29898, 169627, 198912, 235599, 148685, 222990, 238504, 138754, 306399, 412260, 437715, 321521, 395147, 416908, 134216, 308914, 202968, 100555, 263507, 249785, 293443, 287516, 347245, 402869, 377707, -93328, 596460, 428332, 252950, 330289, 204754, 106924, 542038, 147268, 151165]
14946A51165J28197H5339J95727h0531A708M25275C811J27950e9466D23658j87303
14935B36355K174J04373c149C38926j55237K46708a05754B31911H9978M46353
14925E36331k06741O1695A59351K67015k5471J03604A59087J22662l6182k9906
14915B15661R3184f6157F01175A91711p0295C8809M67196l3771j60936J22806
14905D34104A84412O266J07197K13991J2065A07639m7850L98636j49069j28499
14895A80857G0471N22073A58647F4268K05032F3890L88594B17259o8139K62593
14885D11713P1674j05861F6291J84868k565J84254j26037j44669k8371R0587K3502
14874B47860K51726B03204J32990K3825J47901j20R5015A89797N2722p3631L5893
$$ y = [151165, 279362, 85339, 281066, -80531, 1708, 426983, 3811, 131761, -59466, 423658, 236355, 238529, 342902, -3149, 338926, 183689, 430397, -105754, 231911, 89978, 536331, 329590, 391285, 159351, 426366, 400895, 504499, 159087, 281749, 245567, 215661, 308845, -66157, 601175, 191711, 121416, 38809, 506005, 472234, 311298, 434104, 184412, 190678, 297875, 511866, 523931, 107639, 59789, 458425, 309356, 180857, 70471, 592544, 158647, 64268, 269300, 63890, 452484, 217259, 149120, 411713, 483387, 377526, 66291, 251159, 248594, 432848, 306811, 162142, 133771, 224358, 247860, 499586, 203204, 336194, 360019, 507920, 507800, 602815, 189797, 242519, 168888, 204781]
14863B04781O8975J43100A99352J71401Q0456q2958J8699L50933C43419k7291
14853C16128L21849k62017J26468K3482J5507k1313B41602O1733P7743j65531
14843B15547k4393K55474k8698c4439E19114q604R9357j97110J76503B36323J79057
14832D15380m1816B4661M51871k09112K67612k62873J10726n3429L0378J73712
14822E33546B59066k5464M57317l21699K15264R3043k15719r185j77352K8726
14812C03997L2191K51475J24312B18383N15366C12636J19381L93382B95747K1167
14802C16914Q2657j71914N5746J81412j16764L19256B10608L14046j43089K10227
14792E91792k87173J27060K07004j1431L0405k48242J80200p6449k31790L22733
$$ y = [204781, 273756, 416856, 199352, 370753, 451209, 368251, 386950, 737883, 343419, 316128, 637977, 375960, 502428, 525910, 541417, 520104, 241602, 303335, 381078, 215547, 191154, 446628, 417930, -34439, 519114, 510510, 609867, 412757, 589260, 236323, 415380, 373564, 24661, 476532, 267420, 535032, 272159, 382885, 329456, 359834, 533546, 259066, 233602, 690919, 369220, 584484, 677527, 461808, 452623, 275271, 303997, 336188, 587663, 711975, 218383, 733749, 312636, 432017, 825399, 295747, 316914, 399571, 227657, 283403, 464815, 348051, 667307, 210608, 524654, 381565, 591792, 304619, 431679, 638683, 627252, 657657, 409415, 589615, 513166, 281376, 604109]
14782F04109k14800K09186B53631K32573R1370o0896L0517p7968K3937j13644
14772C79520L13142k54145R1418m2417K86177k43067L44461K7446k76825k15067
14762D10643j1824L75111k37874n9866J13032N3317J0139j65840J98707o9527
14752F16018n2898Q2615L14004r6592l40246k01168L39081j32107L94289j62544
14742G60452k14444B35967O29414l33114K96045l11072r4725J90156L72943n2180
14732I33434o5154j28164N7474C21774O13897k20130J98629o026D25937J75412
14722F01349O02399D96966O8002K65838q5730J02155J14949k47298C47247L05895
14712F53142K97510l76851K80445J16723j93350N2339k32953K06248C75492O8584
$$ y = [604109, 389309, 598495, 253631, 486204, 577574, 516678, 547195, 469227, 493164, 379520, 692662, 438517, 529935, 487518, 773695, 530628, 875089, 902535, 625710, 410643, 398819, 773930, 536056, 476190, 589222, 642539, 652678, 486838, 685545, 616018, 563120, 645735, 959739, 863147, 522901, 321733, 660814, 528707, 922996, 760452, 546008, 235967, 865381, 532267, 828312, 517240, 422515, 612671, 985614, 933434, 868280, 740116, 797590, 321774, 935671, 715541, 914170, 908144, 425937, 601349, 1203748, 496966, 564968, 830806, 745076, 847231, 962180, 714882, 347247, 653142, 950652, 573801, 854246, 970969, 777619, 829958, 597005, 803253, 375492, 444076]
14702D44076J05041K18146K88415D14331M36722M5712k99153K97990j77353J51779
14692H70028l196J91653l3597j72810m9291j24855J48046k99462L41544j64242
14682G03818k19573M07421o0888J00041O7772k79661J49844J1557K19523k31441
14672H68413n2852J02304K29513j80245p2222J30595K38955j82834N6290k6514
14662A111403k30030K09748j63462j20277K66246k23495M57765m11945J99875
14653A095828K75731j33906m9083k72k23465o9819L63734L599m28623J98452K36090
14642A268266j84828k0608K04196j50476J09198K98362j96750K15012m30393J63154
14632A275133J15541k25660K45807J925m89687L52332l32558M81981k90515K57379
$$ y = [444076, 549117, 767263, 1055678, 414331, 851053, 896765, 597612, 895602, 718249, 870028, 866832, 1058485, 1024888, 852078, 802787, 677932, 825978, 526516, 868060, 703818, 484245, 891666, 830778, 930819, 998591, 718930, 868774, 880331, 1099854, 868413, 815561, 917865, 1147378, 967133, 894911, 1025506, 1264461, 1081627, 1137917, 1111403, 881373, 1091121, 927659, 807382, 1073628, 850133, 1307898, 895953, 1095828, 1371559, 1237653, 1188570, 1188298, 964833, 895014, 1258748, 1262347, 833724, 1032176, 1268266, 1083438, 1062830, 1267026, 1116550, 1225748, 1524110, 1327360, 1542372, 1111979, 1275133, 1390674, 1165014, 1410821, 1412746, 923059, 1275391, 942833, 1424814, 1134299, 1391678]
14622A391678l03112J4086K17817J41266k51574K93842n14354K63855K44087m69485
14612A028106N74594o69021O98021m4669m07434M69629j04382m739n1540o5210
14602A423355M5637j32592J78339P4365L3181K42313m11486j9136J99149p7876
14592A555249L19881k36333J76109K76663n29825K65265l34466N18141l47065
14583A663619L43075m2569K4659q6393J77215m09973J38173L08195k10127K46697
14573B152571k78333K12070k23406J55157K81009n9961J20774K90432l05892R7382
14563B441803k00457N20354k83659M737L8251L4255L10116R5459O3265j1446M07377
14552C420055J74643O40111J373547J853736M378909R290957J5068076o361330
$$ y = [1391678, 1088566, 1102652, 1320469, 1461735, 1210161, 1504003, 989649, 1253504, 1497591, 1028106, 1602700, 933679, 1631700, 1587031, 1179597, 1649226, 1544844, 1540105, 1488565, 1423355, 1468992, 1336400, 1514739, 1589104, 1622285, 1864598, 1453112, 1433976, 1633125, 1555249, 1875130, 1638797, 1814906, 2091569, 1561744, 1827009, 1492543, 2010684, 1663619, 2006694, 1964125, 1988784, 1902391, 2079606, 1669633, 1807806, 2116001, 1905874, 2152571, 1874238, 2086308, 1862902, 2018059, 2299068, 2239107, 2359881, 2650313, 2344421, 2441803, 2241346, 2761700, 2478041, 2482778, 2521029, 2555284, 2865400, 2960859, 3024124, 3012678, 3420055, 3594698, 4234809, 5608356, 7462092, 11841001, 21131958, 36200034, 29838704]
14544B9838704p705925r377128m246932k120454k161874q77826o93232l52938
14536B302395n18120n5500P5364j1588p1347K63041k2408J23922p0537J22638
14526B137860l09270M94662j07616k2031J935j52928R8982K39419J58519k60761
14516B278771M4625M7760L04307k50470K39788r4026N8186N0309J65290M2034
14506B886574J78531o7081k87532K95983R913L91108n76270K3242L69054k34337
14496B989185M00198m14325J79207J99069p9653K5767q1051Q8282j9859L01144
14486C587964k28147L17843M6223k8524Q6513J58177m49119P7713p9584K04080
14476C693139J92775k41494j36734L50444J21397l8183M53227l70546K87659J0612
$$ y = [29838704, 22132779, 12755651, 8508719, 6388265, 4226391, 3348565, 2655333, 2302395, 1784275, 1728775, 1804139, 1792551, 1721204, 1984245, 1961837, 2085759, 2015222, 2137860, 1828590, 2323252, 2215636, 2193605, 2195540, 2042612, 2141594, 2381013, 2539532, 2278771, 2323396, 2371156, 2675463, 2424993, 2664781, 2570755, 2628941, 2679250, 2844540, 2886574, 3065105, 2998024, 2710492, 3006475, 3016388, 3407496, 2831226, 2854468, 3223522, 2989185, 3389383, 2975058, 3154265, 3353334, 3273681, 3299448, 3218397, 3306679, 3286820, 3587964, 3359817, 3677660, 3723883, 3695359, 3781872, 3940049, 3490930, 3568643, 3489059, 3693139, 3885914, 3644420, 3507686, 3858130, 3979527, 3941344, 4394571, 4024025, 4311684, 4322296]
14466D322296K0893K48287K9352J99319p49619N10618K05925J78650j4718k95617
14456D655386J53968K1071J11M92209j30734j9499j17037K06611L45000l04039
14446E303047K044j2712J09804O2232j22431L96105k402M93386o04399M44830
14436F069504N685K81824k16333J44057J34639R4105N479L19609j54082k51628
14426F432859M68224J80821K21601j35894J67471j80160M12410Q1957K44466K21584
14416H115339k11335K96496P306J14390J25813N9356J64473j34564N52132k87325
14406H802081P10999j54630K97987Q6170L2240K52895R9546j27753P42264k84473
14396A0457326L17299O8313L49728R4149M9255N12665M9803j45466M64250L18905
$$ y = [4322296, 4343189, 4591476, 4620828, 4820147, 4070528, 4581146, 4787071, 4965721, 4951003, 4655386, 4809354, 4830425, 4830536, 5322745, 5192011, 5172512, 5055475, 5262086, 5607086, 5303047, 5305091, 5292379, 5402183, 5464415, 5341984, 5738089, 5735687, 6229073, 5624674, 6069504, 6075189, 6357013, 6140680, 6284737, 6419376, 6513481, 6518960, 6838569, 6684487, 6432859, 6901083, 7081904, 7303505, 7167611, 7335082, 7154922, 7567332, 7649289, 7893755, 8115339, 7904004, 8200500, 8207806, 8322196, 8448009, 8507365, 8671838, 8537274, 9089406, 8802081, 9513080, 9358450, 9656437, 9742607, 9774847, 10027742, 10127288, 9999535, 10741799, 10457326, 10774625, 10842938, 11192666, 11286815, 11336070, 11848735, 11898538, 11753072, 12217322, 12536227]
14386A2536227K88648j23434K19398P13774J27989J6405L12131M9247L41372L96854
14376A4878611J01800O06820J45205M48738J45937L85648M46468J53471L45446
14367A7658144K28232Q58057K50219M91582j56369Q40464M76527K88434K04350
14358B1139640R83624N77890L32876K43047P90484P50515N94918L87236N84644
14349B6384874O29492R81850O03994P28892J042235M33042R49563O35040Q14069
14340C3203051J005002O97828J237682J224547Q74199Q53477J277238J466131
14332D1839155J023225J371034J068930K075597J054046J669726J333636J998674
14324E3434023J513482J965243J925843J806670K504122K365456K484476K176011
$$ y = [12536227, 12824875, 12701441, 12920839, 13634613, 13762602, 13779007, 14091138, 14140385, 14481757, 14878611, 14980411, 15587231, 15732436, 16181174, 16327111, 16712759, 17159227, 17312698, 17658144, 17886376, 18744433, 18994652, 19486234, 19329865, 20170329, 20646856, 20935290, 21139640, 22123264, 22701154, 23034030, 23277077, 24067561, 24818076, 25412994, 25800230, 26384874, 27014366, 27996216, 28600210, 29329102, 30371337, 30804379, 31753942, 32388982, 33203051, 34208053, 34905881, 36143563, 37368110, 38242309, 39095786, 40373024, 41839155, 42862380, 44233414, 45302344, 47377941, 48431987, 50101713, 51435349, 53434023, 54947505, 56912748, 58838591, 60645261, 63149383, 65514839, 67999315, 70175326]
14316G0175326K814061K793417K716080L552943L331805K918517M341458L349619
14308I5993226M340597M344636M691288M572480N027600N716035N849651N825635
14300A36361148O624086O746408P080261P543541Q279979Q540244R181256R378749
14292A99735672J0236921J0821915J1097677J2286083J2638543J3012354J3728076
14285B83557241J4388022J4437049J5186184J5345926J5560861J5512097J5220060
14278C89207440J4942709J4102360J3080463J1034528P412072L539314J609749
14271D54928635j852200n674204q205246N102124p015558l189934m473616r180862
14263D20439139j2162098j4304344j5087936j6107985j6392945j6140312j6581149
$$ y = [70175326, 72989387, 75782804, 78498884, 82051827, 85383632, 88302149, 92643607, 95993226, 100333823, 104678459, 109369747, 113942227, 118969827, 124685862, 130535513, 136361148, 142985234, 149731642, 156811903, 164355444, 172635423, 181175667, 190356923, 199735672, 209972593, 220794508, 231892185, 244178268, 256816811, 269829165, 283557241, 297945263, 312382312, 327568496, 342914422, 358475283, 373987380, 389207440, 404150149, 418252509, 431332972, 442367500, 449779572, 453318886, 454928635, 453076435, 447402231, 439196985, 444299109, 437283551, 434093617, 429620001, 420439139, 408277041, 393972697, 378884761, 362776776, 346383831, 330243519, 313662370]
14256C13662370j5678373j5674387j4898937j4001407j2633492j2556976j1772367
14249B16446431j1147098j0999767j0026385r142714q805299q590438p663991
14242A50070739p126953o747082o545230n825355n686372n277303m630198m794717
14234A03437529m804165m173402l574211l679390l371061l337910l373915k870152
14226G4253323l074558k682748k022229k352021k434639k237583j905220j946822
14218E5597503j949512k188468j561310j294175j182866j564211j797535j010346
14210D3049080j536641j434840p85666q65310j002071j379648r18630j187395
14202C3938879q91011l73256o52882r64121j106722q85622q61839m24067q02025
$$ y = [313662370, 297983997, 282309610, 267410673, 253409266, 240775774, 228218798, 216446431, 205299333, 194299566, 184273181, 175130467, 166325168, 157734730, 150070739, 142943786, 136196704, 129651474, 123826119, 118139747, 112862444, 108232246, 103437529, 98633364, 94459962, 90885751, 87206361, 83835300, 80497390, 77123475, 74253323, 71178765, 68496017, 66473788, 64121767, 61687128, 59449545, 57544325, 55597503, 53647991, 51459523, 49898213, 48604038, 47421172, 45856961, 44059426, 43049080, 41512439, 40077599, 39291933, 38426623, 37424552, 36044904, 35126274, 33938879, 33047868, 32674612, 32021730, 31057609, 29950887, 29065265, 28203426, 27779359, 26977334]
14193B6977334o79358o08146m22966n14591m30268j172480m10416o58110o4922
14184B2016077r97209l71765l91213p31492K33301p04581l65693l55979l85730
14175A7945716m47965l96833l73138m28643N596m16928k50930l81870k29486j59372
14165A4866147l42410J10540p69968l37286r618j55049l31564k29906J30454p93036
14155A2138304J6561j0707k01435l18160k45445l54366M36660n74024j46181o31195
14145A0110012L55184j77751k69411k9865o22320l58674L06885O3336l300l52207
14135I021889N0836P7093n76044K38538p10049K53863j76845l67175J42176j96673
14125G757609j76552L49737l24783J30452o03205J72085L5307j74093n5454j59730
$$ y = [26977334, 26297976, 25689830, 25266864, 24752273, 24322005, 23149525, 22739109, 22080999, 22016077, 21018868, 20647103, 20255890, 19524398, 19757699, 19053118, 18687425, 18331446, 17945716, 17497751, 17100918, 16727780, 16299137, 16304733, 15887805, 15636875, 15255005, 15025519, 14866147, 14523737, 14634277, 13864309, 13527023, 13517405, 13362356, 13030792, 12800886, 12931340, 12138304, 12154865, 12144158, 11942723, 11624563, 11379118, 11024752, 11461412, 10887388, 10741207, 10110012, 10465196, 10287445, 10018034, 9988169, 9365849, 9007175, 9314060, 9377396, 9374096, 9021889, 9072725, 9149818, 8573774, 8812312, 8102263, 8356126, 8179281, 7812106, 7954282, 7757609, 7581057, 7930794, 7606011, 7736463, 7133258, 7305343, 7340650, 7166557, 7111103, 6951373]
14115F951373k94884l3536K26861n04622K11511j74263k63403J1280j89420K41721
14105F182618l88483j1329N2707j36712j4180r057k89098p107L29187l2975m40699
14094E234872J92736j69920m03818L28957l94535K39112l54786J94828K8573n5745
14084D840274j80720j21124l00m52051M38812j07322l79859K52929k61961J75284
14074D203962j08422M18336o82891p6702L48471r4560O1529k86335K36839j99974
14064C820253O5146k20358J64680l74629L93846k54373L19805m57519O7198j16678
14054C407371j77159J64466Q1424j03290j37157j9688n2721k44483O9726k47545
14044B740944K88498j62188L23566k15563P6027l32620j06088L71540l31798J78475
$$ y = [6951373, 6656489, 6622953, 6849814, 6345192, 6556703, 6382440, 6119037, 6130317, 5940897, 6182618, 5794135, 5782806, 5835513, 5698801, 5684621, 5675564, 5386466, 5379359, 5708546, 5675571, 5234872, 5427608, 5257688, 4853870, 5182827, 4788292, 5027404, 4672618, 4867446, 4896019, 4840274, 4659554, 4538430, 4538130, 4086079, 4524891, 4417569, 4037710, 4290639, 4028678, 4203962, 4095540, 4513876, 3830985, 3754283, 4102754, 4008194, 4069723, 3783388, 4020227, 3820253, 3885399, 3665041, 3829721, 3455092, 3848938, 3594565, 3914370, 3456851, 3524049, 3407371, 3230212, 3394678, 3476102, 3372812, 3235655, 3215967, 3163246, 2918763, 2988489, 2740944, 3029442, 2867254, 3190820, 2975257, 3051284, 2718664, 2612576, 2984116, 2652318, 2830793]
14034B830793K29690k90795J24886J53118k94435J90876j54486k34764O4488O9141
14024B688512m7821j23472j28654K90244n12608M24078l70111k6679J04339J59391
14014B457219l26323L91720k92896K30835k67197K54971p8641l6940k27947L54155
14004B458956j86932l2056l04286J23149j77341J26291J80333P5419j61526k92611
13994A809396J08196L96040n1509k47408O20580J084936K956296Q036441J7115147
13985C1828115r84855m871186r386824o074158l238833j979082j510464l81683
13977C401030m87049L2729j67186m19561L45941l70109R4478l33361K59642n00126
13967A856428J43870K52389k14757j05231p5443L72498j20851r3924l3991M506
$$ y = [2830793, 3060483, 2769688, 2894574, 3047692, 2753257, 2944133, 2789647, 2554883, 2619371, 2688512, 2640691, 2517219, 2388565, 2678809, 2166201, 2590279, 2220168, 2193489, 2297828, 2457219, 2130896, 2522616, 2229720, 2460555, 2193358, 2448329, 2369688, 2332748, 2104801, 2458956, 2272024, 2239968, 1935682, 2058831, 1881490, 2007781, 2188114, 2263533, 2102007, 1809396, 1917592, 2313632, 2262123, 2014715, 2635295, 3720231, 6676527, 14712968, 31828115, 30843260, 25972074, 16585250, 10511092, 7272259, 5293177, 3782713, 3401030, 2913981, 2946710, 2779524, 2359963, 2705904, 2335795, 2430273, 2096912, 2356554, 1856428, 2000298, 2252687, 2037930, 1932699, 1857256, 2229754, 2108903, 2014979, 1980988, 1985494]
13957A985494J33697l31523L07762Q182j65967j6067k03517j50750M30437j93332
13947A804416k51131J4471j34960J00103K21675j02376j1904K87898j20387M1154
13937A848959k28222q966M04217l89601p6061K6721k22697K16443l65450J77552
13927A382895K17493J20706k41727J0572k62796L78053p21878Q84683n14655j9663
13917A233683J69953o8625J25970j51336M06650m15145J91798k92582j71398M10903
13907A439871j58921k39273J92573J01253K7416k0865k47821j77198J56297j23253
13897I50079O52238o60600K63134p268k7488j13203J51930L9468p5976r8646L9303
13886A112971j26053O35069n24392J1376j44616M6854Q1592q2679M61979n71937
$$ y = [1985494, 2119191, 1787668, 2095430, 2103612, 1937645, 1921578, 1718061, 1567311, 1997748, 1804416, 1553285, 1567756, 1432796, 1532899, 1754574, 1652198, 1640294, 1928192, 1807805, 1848959, 1620737, 1611771, 2015988, 1626387, 1550326, 1577047, 1354350, 1570793, 1205343, 1382895, 1600388, 1721094, 1479367, 1489939, 1227143, 1605196, 883318, 1768001, 1253346, 1233683, 1403636, 1335011, 1460981, 1309645, 1716295, 1301150, 1492948, 1200366, 1028968, 1439871, 1280950, 1041677, 1234250, 1335503, 1362919, 1342054, 1094233, 917035, 1073332, 950079, 1602317, 941717, 1204851, 1197583, 1170095, 1056892, 1208822, 1248290, 1172314, 1073668, 1112971, 986918, 1621987, 1097595, 1108971, 964355, 1011209, 1092801, 1010122, 1472101, 900164]
13876I00164L0579J85741j84441l97207N37861M04780n32563J44278k38318K83148
13866A134022j21566j0672n5308L8414K24448J71304m36105N9830k98375J17920
13856H23912N5809n1267L69411N0603l97737J01990O0013K0320j33188K53071
13846A152937m76764M60548k28618o1145K35557N0747j38302k45453Q6814K24202
13836A060523l18627J61130N3651m72062o8675L43507J07880J0812K93606n65525
13826F06220M33819j67850k1920j0851L034O6204k70113K98271j74515j39938
13816F22361O2034J21892o5854L77643m43031K22897k1002k21083L13711j45498
13806H24070m00732K38977L1451K35205k83728J09437n4693k22656M77596k67758
$$ y = [900164, 930743, 1116484, 932043, 534836, 1072697, 1477477, 944914, 1089192, 850874, 1134022, 1012456, 1001784, 946476, 984890, 1209338, 1380642, 944537, 1004367, 705992, 823912, 879721, 828454, 1197865, 1248468, 850731, 952721, 1012734, 1033054, 899866, 1152937, 676173, 1136721, 908103, 846958, 1082515, 1133262, 994960, 749507, 836321, 1060523, 741896, 903026, 956677, 484615, 415940, 759447, 867327, 878139, 1171745, 606220, 1040039, 872189, 850269, 839418, 842452, 908656, 638543, 936814, 762299, 622361, 684395, 806287, 740433, 1118076, 675045, 897942, 876940, 655857, 969568, 824070, 423338, 662315, 693766, 928971, 645243, 754680, 699987, 477331, 954927, 687169]
13796F87169J15478k55266J12439K55596k30977M48143E24448k60059K52622K88997
13786H06008k22902J19520k13533J83627n251M4714N6638k28775k07832K50479
13776E82693K05557k6394J16719m4162k98697J46416o9023J20540Q4297q8122
13766G29824l2255l33705J61100L0348k7366j83097L43595K9662p6072L9882J63234
13755H45150k16614j42506R5862J97293j73209P3452J6692k12200k28665J16735
13745C71990M2155M35791j72688k4883J48326C59648L63191j50456o3364J5088
13735E24107j45290K06971j87543J95211p6162J22341K57467k81890l03897L42980
13725F54295j15099J44626B17971O9384A30376K85398M55741m26335J71104O9863
$$ y = [687169, 802647, 547381, 659820, 915416, 684439, 1132582, 524448, 264389, 517011, 806008, 583106, 702626, 489093, 672720, 667469, 712183, 768821, 540046, 332214, 582693, 788250, 761856, 878575, 834413, 535716, 682132, 613109, 733649, 817946, 729824, 697569, 363864, 524964, 555312, 527946, 344849, 688444, 718106, 642034, 681916, 845150, 628536, 486030, 581892, 779185, 605976, 679428, 696120, 483920, 255255, 371990, 414145, 849936, 677248, 652365, 800691, 359648, 722839, 572383, 509019, 524107, 378817, 585788, 398245, 593456, 517294, 639635, 897102, 615212, 311315, 654295, 539196, 683822, 217971, 287355, 130376, 415774, 871515, 445180, 616284, 686147]
13715F86147j78799Q8372p8378L37086m08759K39581p899B79077N46726C83114
13704F85921Q1120B55230M1429L07974J12750A19331L03694j13302j29649K09434
13694C89508K03083j9435n726J71330J9953j18648k09090J64258B41316J97197
13684D38513k789p729K70235k07459J06086j99292j30001K73944K7142B64419
13673C43843K93985A77960K24847J41091A48454K73015q8470L0696L6905N7560
13663D58160I1377M66992j38157o7194J02139j01885q9934K72432l7509N5167
13653E53428k19580j32175L51549O9616n0718m4279l6524A80432O7571P8167P1657
13642C97827K81725q5364j8048j73275K2021J0555J06129j24280L7427M7523B41777
$$ y = [686147, 507348, 595720, 517342, 854428, 445669, 685250, 677351, 279077, 825803, 383114, 685921, 767041, 255230, 296659, 604633, 717383, 119331, 423025, 309723, 180074, 389508, 592591, 573156, 567430, 738760, 758713, 640065, 430975, 595233, 241316, 438513, 435724, 427995, 698230, 490771, 596857, 397565, 267564, 541508, 568650, 264419, 343843, 637828, 177960, 402807, 543898, 148454, 421469, 332999, 363695, 400600, 458160, 91377, 558369, 420212, 353018, 455157, 353272, 263338, 535770, 498261, 553428, 333848, 201673, 553222, 622838, 572120, 527841, 491317, 180432, 248003, 326170, 397827, 679552, 594188, 576140, 402865, 424886, 435441, 541570, 417290, 454717, 502240, 241777]
13630D81504m8458m8190J28840n2156Q187j56357J5180n4662J89822B7248K91079
13619C18327N9070H0664r800J72002r85K50880k16865J01795J64342j30934k7525
13608C83574k9596L0066q2823P6676J04365r0725A79371K55591k388M717A33763
13596D10001L28070A52179J95768J09715j18662j08727K6849M7211R9524A67466
13585A76422L98435B40002K93205j65459l4410q4691q2016R6584J81032r1319
13575C52928j57967K08293r6956C1736M29055L3157j65184j2653J68765B40707
13564D52136J10006A37315B9503M00592L58386k50019j40161j533A92939q723
13554A84216L13576j03053j47396o707m4336L2775K6603j7893B4986K22267l0666
$$ y = [481504, 433046, 384856, 513696, 461540, 469727, 313370, 328550, 273888, 463710, 27248, 318327, 377397, 80664, 70864, 242866, 241881, 492761, 275896, 377691, 542033, 411099, 383574, 353978, 384044, 301221, 377897, 482262, 391537, 179371, 434962, 432574, 437291, 133763, 410001, 738071, 152179, 347947, 457662, 339000, 230273, 257122, 304333, 403857, 167466, 176422, 574857, 240002, 533207, 367748, 333338, 248647, 166631, 263215, 444247, 352928, 194961, 403254, 306298, 31736, 460791, 493948, 328764, 316111, 484876, 240707, 452136, 562142, 137315, 29503, 430095, 788481, 538462, 398301, 396768, 192939, 184216, 497792, 394739, 247343, 240636, 196300, 229075, 255678, 237785, 24986, 247253, 216587]
13543B16587K22200I8129O2886B2221g5711C00095j02755J18490j38393B8699
13532A13175K10046n4084A5726M20791F2922c8560C92014p5153L9577j8105J18738
13521D57071j97661d9469E5567K90636A17218J17270L8060q8675n6128R3970J43051
13510C64766j407J90626k22316p9943q0592J73054J4634D4501J42927O4154J31293
13499C82875E2537k5730L05352j48504M18274B89797A33820L4792J07410E8037
13488E24544A0382J08711e7328D89621H6732K6494L08968p5933f9156E86L46103
13477C46689j16066J6440j573J17044p7249q5255L6931H052L21535a57379E14994
13465C19270a1279G9482K15116b422B79032c8098A71011P0250J11701g8166A67590
$$ y = [216587, 438787, 98129, 161015, 22221, -75711, 300095, 197340, 315830, 177437, 28699, 113175, 323221, 269137, 15726, 436517, 62922, -38560, 392014, 316861, 356438, 338333, 457071, 259410, -49469, 55567, 346203, 117218, 234488, 272548, 183873, 127745, 221715, 364766, 363359, 553985, 331669, 251726, 171134, 344188, 358822, 44501, 187428, 251582, 382875, 52537, 26807, 332159, 183655, 601929, 289797, 133820, 168612, 276022, 58037, 524544, 10382, 119093, -57328, 489621, 86732, 113226, 422194, 346261, -69156, 586, 346689, 230623, 247063, 245490, 362534, 285285, 200030, 236961, 8052, 329587, -157379, 514994, 319270, -11279, 79482, 294598, -2422, 279032, -38098, 171011, 241261, 352962, -78166, 167590]
13453B21704J02669j30403I4787e4977Q098E9737J91954A20208m5739K70745a7234
13441c11175F7276K92550b9902G6429K80782G8585b46049C6089K40974K9840j36732
13430A70171a97595B02452J09604c7413A75189H6725J66054M38692a03762D09819
13419H0936K51103H5959J60333p6896a66088D39381H3895b24909B37310o9911
13409A67399k9761J23844E0673K72606G7053d408D38103A81274L8654r0800D2023
13397G3149M32504j91975H1390a488C9518L51205G2111Q4381M9516j01363J33163
13386B37808K85974j72003j32502J15741A52923l3934b5102I7179j587K06164
13376C01756F3333P4363l495N7370r1437J74511P1981h6584D51754J10949A86728
$$ y = [221704, 324373, 193970, 94787, -54977, -46879, 59737, 251691, 120208, 74469, 345214, -17234, -311175, 67276, 359826, -29902, 76429, 357211, 78585, -246049, 36089, 277063, 306903, 170171, -197595, 202452, 312056, -37413, 175189, 86725, 252779, 691471, -103762, 409819, 80936, 332039, 85959, 246292, 169396, -166088, 439381, 83895, -224909, 237310, 167399, 137638, 261482, 50673, 323279, 77053, -4408, 438103, 181274, 219928, 129128, 42023, 73149, 505653, 313678, 81390, -1488, 39518, 390723, 72111, 156492, 206008, 104645, 237808, 523782, 351779, 219277, 335018, 152923, 118989, -25102, 97179, 95592, 301756, 63333, 137696, 134201, 191571, 100134, 274645, 346626, -86584, 451754, 562703, 186728]
13364E53504B05556k7206Q3011A23224L8239K1219J91713k8262A50987c9276A39538
13352D71587k31023j19909K81852A62899O692L43521b106C37590p9706j1895G6897
13340B08054L23778k40566J15476P8278j55975J14678j42148j48659L76430j2182
13330E17164B27685r9992b93556B46400c2707B41526j5199Q456R0564K44803B14575
13318B04763o1745J39030A03121K56032o111A37776Q8446J28151A38856C9346
13307a27282B60082K38884r6306A51590J05143a07695A32567l4582a19798k647
13297a22445H3736K15065q2428l7635b15564k3536B06110a3338B95206H8577Q0252
13286A68829J3666c1957I880J04650K64435a63294A48143J4383a74529G4674J04703
$$ y = [553504, 205556, 178350, 261361, 123224, 161463, 182682, 374395, 346133, 150987, -39276, 139538, 471587, 240564, 120655, 402507, 162899, 169591, 513112, -2106, 337590, 257884, 245989, 76897, 208054, 531832, 291266, 406742, 485020, 329045, 443723, 301575, 152916, 529346, 517164, 227685, 127693, -293556, 246400, -32707, 241526, 226327, 234783, 325347, 570150, 214575, 204763, 143018, 282048, 103121, 359153, 353042, 137776, 226222, 354373, 138856, 39346, -127282, 260082, 498966, 402660, 151590, 256733, -107695, 132567, 97985, -119798, -122445, 83736, 298801, 216373, 178738, -215564, -239100, 206110, -13338, 295206, 88577, 168829, 182495, -31957, 9880, 114530, 378965, -163294, 148143, 162526, -174529, 74674, 179377]
13275A79377H3978R9866J48247j01049b85013C42821n650j13641J49951j13499
13265B59982j01120k9276P0934J37075D0043J23853f5194A26518K8757J40969
13255B96244j5518d3438J3579D63876j96732A02902Q7151H3702e9153I4985L2892
13244A27877K29653a11205A41386R473M9038a22634B46487a07663G7823Q0820
13234A58643p3634a7306m2318p5381G2164c13261C75367F9846b2768C22104j42880
13223A79224J1317b22478G7974J07806b52261g0717B20681R3496H7498J05370
13213A92868f3465F07305A0939J26694d1808k33417C14355A07009R431P5529K6202
13202B18171J96661a74161L9996L5090k3427a4191A14178h8010C01001A15968
$$ y = [179377, 83978, 183844, 332091, 231042, -285013, 342821, 337171, 223530, 373481, 259982, 158862, 129586, 200520, 337595, 40043, 163896, -65194, 126518, 155275, 296244, 280726, -43438, -29859, 463876, 267144, 102902, 190053, 83702, -59153, 94985, 127877, 357530, -111205, 141386, 150859, 199897, -122634, 246487, -107663, 77823, 158643, 85009, -17306, -59624, -135005, 72164, -313261, 375367, 69846, -22768, 322104, 179224, 190541, -222478, 77974, 185780, -252261, -70717, 220681, 314177, 87498, 192868, -63465, 607305, 10939, 137633, -41808, -275225, 314355, 107009, 116440, 191969, 218171, 414832, -174161, -134165, -99075, -122502, -14191, 114178, -88010, 301001, 115968]
13191G3121M4288C4384K0717a32971j66596A34652f3885A30049N6886J43767j62217
13180A68485a91373g7426C18864q2492q4532R974E2233c4155A03584M0881N6624
13169B01089p3598b4109k58604D0025A854J71095f3586j36832E4838b89521A88390
13157A41178O4954J74486E7542d3843C8484K63610A28623G934J02374N5468K6565
13146A92341a29598j82875A42390h4674B25402R8579a29185I0685J25372C7080
13135a57955g3722K6336o1364A14620L9442J38658m0881K3501n8871H0785i7615
13123b64132B4668J57863b24227B09082r3054c0584A04794d0650r3583e5938m6349
13112a02287A22070m3639J29278b40111J04972e3527q4523O3669j31332i4106
$$ y = [73121, 117409, 34384, 55101, -132971, -299567, 134652, -63885, 130049, 186935, 330702, 168485, -191373, -77426, 318864, 236372, 151840, 161814, 52233, -34155, 103584, 144465, 201089, 127491, -24109, -282713, 40025, 1854, 172949, -63586, -200418, 54838, -289521, 188390, 141178, 206132, 380618, 57542, -43843, 38484, 302094, 128623, 7934, 110308, 165776, 192341, -129598, -312473, 142390, -84674, 225402, 323981, -129185, 90685, 216057, 37080, -157955, -73722, -47386, -108750, 114620, 154062, 292720, 251839, 275340, 216469, 80785, -97615, -264132, 24668, 182531, -224227, 209082, 116028, -30584, 104794, -40650, -134233, -55938, -102287, 122070, 78431, 207709, -240111, -135139, -53527, -138050, -74381, -205713, -94106]
13101a35317r2856A33724D4505I160b17789P5131A43632a79880l5111G4464J67180
13090B41644F9432K37033a5833A5886K94765F5810h6524M888E8121O935a43927
13078F3619d4820F7997a56403k61971B05184k0800J29184e0647B88105F36e7972
13066I2198d5930A99652b3105A17399J04625K18608k8064j70105F9880K29399
13056B99279c6500A34208N9298K94888g687A88624J30233H3885L05043n1107M7674
13045C85495q4175f626A66957a8678q6368E6810L18926g5002B92481j13269K4540
13034B03752J2461N053J92566r2729a66017e4429j05228D45289a85593H8006k4706
13023F3300J11758M879b9047B9114R9115A7473a24120L0211G2658O7525R7226
$$ y = [-135317, -228173, 133724, 44505, 9160, -217789, -142658, 143632, -179880, -214991, 74464, 241644, 69432, 306465, -15833, 15886, 310651, 65810, -86524, -81636, 58121, 65056, -143927, 63619, -44820, 67997, -156403, -418374, 205184, 184384, 313568, -50647, 288105, 636, -57972, 92198, -45930, 199652, -23105, 117399, 222024, 440632, 412568, 242463, 69880, 299279, -36500, 134208, 193506, 488394, -7687, 188624, 318857, 83885, 388928, 337821, 385495, 301320, -6626, 166957, -18678, -105046, 56810, 375736, -75002, 292481, 179212, 203752, 216213, 221266, 413832, 321103, -166017, -54429, -159657, 445289, -185593, 88006, 63300, 175058, 179937, -29047, 29114, 128229, 17473, -124120, -93909, 72658, 140183, 237409]
13012B37409o6467a09932G505K20290e5785B16880P2671b1B48866a730D34064
13000A49853M7398Q8173D8897K6883L9235D0860b05223B2260K17914j2680J07113
12989C34607A9897B189K43972b79078E9598Q5925J49294e6315j80630a1530A58512
12977A17044O6680f2255C44077A12536N0358J88375a28632m0423D18225A16972
12966B22541E3901m799a45844A38857O9467g6008a563A83838e7476G3626a0890
12954A50077J66722B9337K88341A0793c9263A09217J93368h1729b3604C42503
12943A27936P2220o1564b53695H9111b30934C29005a43425B0637J17056b20284
12932a12259A74817a10524B87517p0805q1761f9466n7141N5430E2647J8009b72551
$$ y = [237409, 170942, -109932, 7505, 227795, -55785, 216880, 289551, -21, 248866, -1730, 434064, 149853, 197251, 285424, 48897, 75780, 115015, 40860, -205223, 22260, 240174, 227494, 334607, 19897, 2189, 246161, -279078, 59598, 145523, 294817, -56315, -236945, -11530, 158512, 117044, 183724, -62255, 344077, 112536, 162894, 351269, -128632, -169055, 418225, 116972, 222541, 53901, 49102, -145844, 138857, 208324, -76008, -1563, 183838, -57476, 73626, -10890, 150077, 316799, 29337, 317678, 10793, -39263, 109217, 302585, -81729, -23604, 342503, 127936, 200156, 138592, -253695, 89111, -230934, 329005, -143425, 20637, 137693, -220284, -112259, 174817, -110524, 287517, 216712, 134951, -69466, -126607, -71177, 52647, 70656, -272551]
12920E5562a67172F9691f3190I9142P1502A5575c93015A32505a7862C4523a33555
12908a39372N9314E12992a06855K2191J155F4236K2718d33840K10778A34201h337
12896B0767J57032p4530g5005a4336I479N9756J59166J39438A70713J03045a32367
12884A51308k9808n6116M5943A2492J47998J75249A36436K6713L3797g4716B41017
12872d3971a9824A03707K88326a06871J0987A55868a63878L1225A49348j4255
12862A35093A0310b17758k02432D53929c04962F3005c4077B51520J68174A67579
12851F8732J64297E893Q0665J15922a3687A0924a44285A50480D0296e6868C90992
12839a12962K3131K4035B21286A6605N47264I3436c1590k42223I9591m7150K18651
$$ y = [55562, -167172, 69691, -63190, 99142, 170644, 15575, -393015, 132505, -17862, 34523, -133555, -139372, -80058, 512992, -106855, -84664, -83509, 64236, 86954, -433840, -223062, 134201, -8337, 20767, 177799, 103269, -75005, -14336, 9479, 69235, 228401, 367839, 170713, 273758, -132367, 151308, 121500, 65384, 111327, 12492, 160490, 335739, 136436, 163149, 196946, -74716, 241017, -43971, -19824, 103707, 392033, -106871, -95884, 155868, -163878, -132653, 149348, 135093, 10310, -217758, -420190, 453929, -304962, 63005, -34077, 251520, 419694, 167579, 68732, 233029, 5893, 86558, 202480, -13687, 10924, -144285, 150480, 40296, -56868, 390992, -112962, -89831, -65796, 221286, 16605, 563869, 93436, -31590, -273813, 99591, 52441, 271092]
12828B71092E7489c62652B1688d2045A66216b6983O672C22107A48306k3882R4546
12817B18970m4901G7692J19234i9450M7018C7601L9218K63626e213F6440J56686
12806B23126a56126B27561P6347b2788B7019M8450g2656B24011g1521B02144J94819
12795C96963A8771P3738o740b1090C59604A34873b45996n5713a09716F7049a5045
12783B6577Q1320J6470d72091a53492A64701G8266C709a05348A11922J13343J42261
12772C67526q7199J1469e4227D07674a28333H206L15162d1635E686J74528a63078
12760A44868o6771R6532B0239h2276A28863c7467I8382a96684A6820K7717a4517
12748g1106j76884a12791C14409b79629A48963a15633I4073i624l68j2699I5776
$$ y = [271092, 57489, -362652, 21688, -42045, 166216, -26983, -20311, 322107, 148306, 124424, 218970, 174069, 77692, 196926, -99450, -52432, 37601, 76819, 340445, -5213, 66440, 223126, -156126, 227561, 303908, -22788, 27019, 75469, -72656, 224011, -71521, 202144, 396963, 18771, 92509, 85769, -21090, 359604, 134873, -245996, -301709, -109716, 67049, -15045, 26577, 107897, 124367, -472091, -153492, 164701, 78266, 3709, -105348, 111922, 225265, 367526, 280327, 291796, -54227, 407674, -128333, 8206, 323368, -41635, 5686, 180214, -163078, 144868, 78097, 174629, 20239, -82276, 128863, -37467, 98382, -196684, 16820, 44537, -14517, -71106, -247990, -112791, 314409, -279629, 148963, -115633, 94073, -9624, -9992, -22691, 95776]
12736a2834C99668f6826q7770A15675J36395b16229j38850B61257l9875H0390
12725f5013G7887A6150J81289O6992b64453D7521K02939N251F8859a08383L3475
12714g4908C18127a99262A34524M1361b44902A6053J80562p1603J16689J79090
12704D20791A85042L47322k59979l7017a6492F6385J78652c23669A70073o5004
12694A05069a5136j50578I3711e9949j30975E0931M7423c7790C16423d0691H390
12682A06387j3692k9191J4309B5287h3118l43631g8508D35691f891E8242R1246
12671A49488J09822K975J2039G5850J47801g4592D3472N21J4319J0633K70790
12660C39735i0411A65659L50507B24652i5892a7390j45680O5792L0483A06606
$$ y = [-12834, 399668, -66826, -154596, 115675, 252070, -216229, -355079, 261257, 221382, 80390, -65013, 77887, 16150, 197439, 264431, -264453, 47521, 250460, 255711, 68859, -108383, -74908, 318127, -199262, 134524, 175885, -244902, 16053, 196615, 125012, 241701, 420791, 185042, 532364, 272385, 235368, -16492, 66385, 245037, -323669, 170073, 105069, -15136, -165714, 93711, -59949, -190924, 50931, 98354, -37790, 316423, -40691, 8390, 106387, 92695, 63504, 77813, 25287, -83118, -426749, -78508, 435691, -6891, 58242, 149488, 259310, 262285, 274324, 75850, 223651, -74592, 43472, 43993, 58312, 68945, 339735, -90411, 165659, 516166, 224652, -95892, -17390, -163070, -97278, -66795, 106606]
12649A70568a17183B1060g9724j253k88401a03960l3638B71698h3585C02076j05364
12638A96712P2212f9642B91650I6068P2291K0493b9874A66557m0384J72956o4109
12627B35020L71214a3173C8065a24369A83396J83140b43630A61595O5173r8871
12617A27897b12102B0729K62812b62591B43419a06822I522c27313d0745r6940
12607a37685j17620K7837E8977A7386f7328b8726B60820q7588P3356J06689j67094
12596A86183J0624K22905A33847J25521j18762d1781E5195J36553A528a94127
12585B44529a38954A37700c12328B65587b3786j2351I9257K440b2213q6576b3955
12573B75532a97661q3860R1585B07028L6849k7082a47017H2979J43024a17164
$$ y = [170568, -117183, 21060, -79724, -80977, -369378, -103960, -137598, 271698, -83585, 302076, 196712, 268924, -69642, 291650, 96068, 168359, 188852, -29874, 166557, 126173, 299129, 235020, 606234, -13173, 38065, -124369, 183396, 366536, -243630, 161595, 226768, 127897, -212102, 20729, 283541, -262591, 243419, -106822, 9522, -327313, -40745, -137685, -255305, -227468, 58977, 17386, -67328, -28726, 260820, 173232, 246588, 353277, 186183, 196807, 419712, 133847, 259368, 140606, -41781, 55195, 191748, 1528, -194127, 244529, -138954, 137700, -312328, 265587, -23786, -36137, 99257, 101697, -22213, -108789, -23955, 275532, -197661, -281521, -189936, 207028, 243877, 216795, -147017, 82979, 226003, -117164]
12562a9397m87099b10899I6755d3435A21796b16662m006B42233b75612h4671l7268
12551a21939C25029E2168K39741a51311j28324h902B10492a16565r5867A82085
12540D1331N3474J39625g0260p1186B84067J0236C1299K75991B0392K71106A5178
12528c4224A97222A5952P3336C5575J18162E4866g7865c7794q0875B23203o9978
12517A53225i2003D5634J31359b0832A35089i5794F411J18864k0059L45841j43016
12506C08041j43308J93958Q3474p2954G3092a86309j51914E7777e3742a8945k88629
12495c07574G6865Q9393J29390h1223j74345A93880J1753G2301J14459A8978L04173
12484C23151A60343m6476E2285J81902C6461L0995K90539j15572c5631A50191
$$ y = [-19397, -506496, -210899, 96755, -43435, 121796, -216662, -220668, 242233, -275612, -84671, -121939, 325029, 52168, 291909, -151311, -279635, -8902, 210492, -116565, -212432, 182085, 41331, 94805, 234430, -70260, -141446, 284067, 294303, 31299, 307290, 20392, 291498, 15178, -34224, 197222, 15952, 89288, 35575, 153737, 54866, -77865, -37794, -118669, 223203, 153225, -92003, 45634, 176993, -20832, 135089, -95794, 6411, 125275, 105216, 451057, 308041, 164733, 358691, 442165, 369211, 73092, -186309, -338223, 57777, -53742, -18945, -307574, 76865, 166258, 295648, -81223, -255568, 193880, 205633, 72301, 186760, 18978, 323151, 160343, 113867, 52285, 234187, 36461, 67456, 357995, 242423, -35631, 150191]
12473B62449p0078e9847A3785a20006b0676C38496i1955j50624J13804a3844j94490
12462b08334C79865A31635K9401c18446J36485e9607k5244D58768G3842N7361
12452A31203b18954B60283n2929b0675j53710d3452A51233b15867d7822A67877
12441B96904A37129h8754A31061m2797K07128b12920D7645b10269b900j33659
12431a36559O4092A40622b41576A19201d03825a45461L2790B16999a53383A00263
12420b18432j41807C46988n3723j6001a03897E7554b31713J9969N0117c9181A92694
12408h1523j81399A28898a41945C9179M8877l5247h2050n6509K6277M3990B45711
12396b081k42741B67382H8866f4494B07510q9419b66936g3204D4263b93104Q8965
$$ y = [262449, 192371, -59847, 13785, -120006, -20676, 338496, -91955, -242579, -128775, -13844, -208334, 379865, 131635, 161036, -318446, -181961, -59607, -84851, 458768, 73842, 131203, -218954, 260283, 207354, -20675, -174385, -43452, 151233, -215867, -47822, 167877, 296904, 137129, -88754, 131061, 88264, 295392, -212920, 47645, -210269, -2900, -136559, -72467, 140622, -241576, 119201, -403825, -145461, -112671, 216999, -153383, 100263, -218432, -360239, 346988, 293265, 277264, -103897, 57554, -231713, -211744, -161627, -39181, 192694, -81523, -262922, 128898, -141945, 39179, 88056, 52809, -82050, -138559, -112282, -68292, 245711, -2081, -244822, 267382, 88866, -64494, 207510, 118091, -266936, -73204, 44263, -293104, -204139]
12385b04139B7141a46047E7555J1090A5856J7530e903j28858j93252J46502C2028
12373B8840K48071b40212j21170B7475a72905B98396j02831a00220k1055l51297
12363d72572A56142p1397a60987k8976E7097K94221a1200o3971A09244a7539n3316
12352g0855B00964J05402F4053j0052J3191a09230G1033J41590g2216A06263b7470
12340g2016j49055e5083A7756e3474q3575c8371B29691M4944d1943p2432B02930
12328i7477k16398a48474a2764n869j25548f4619l8344F1558J02709a07696A55478
12316a18868D21940H9925L12576g2338F4330J01289F3548a30822a0228B05834
12305D4262b62309C8707c51425J16205C08810f5595D8063c27800F5909K80395
$$ y = [-204139, 27141, -146047, 57555, 68645, 15856, 33386, -5903, -134761, -328013, -181511, 32028, 28840, 276911, -240212, -361382, 27475, -172905, 298396, 195565, -100220, -121275, -472572, 156142, 84745, -160987, -189963, 57097, 351318, -11200, -75171, 109244, -17539, -70855, 200964, 306366, 64053, 54001, 67192, -109230, 71033, 212623, -72216, 106263, -27470, -72016, -221071, -55083, 17756, -53474, -137049, -38371, 229691, 274635, -41943, -114375, 202930, -97477, -313875, -148474, -12764, -18633, -144181, -64619, -102963, 61558, 164267, -107696, 155478, -118868, 421940, 89925, 402501, -72338, 64330, 165619, 63548, -130822, -10228, 205834, 44262, -262309, 38707, -351425, -235220, 308810, -65595, 48063, -327800, 65909, 346304]
12295C46304o8869C917a39425G2078b15279C29792o3203a57929l7725N8757A1206
12283C48299a97204B69191A8705L13890i587E93644H9485L32631A82130F4555
12272A79078L76662B46520A05383L6760a03293D8875g5059n5324A41177M0049
12262A81226L0778b19795B32257M15339A97056l2322a16487C75585A72220f4962
12251A3454K41166E4542j6519a54645A14920j8033K89912I1961K8958l8415C0614
12239A25846o2910a71226A5340M6394b22291J03498a9749A34395n2999K98085
12229C79481M8175j87248j7945a03124C84494A71458K89109K12L3901j52401J8577
12218C60856q743M1316n0249j70745J18627K1887b3426A70560D144L272K82335
$$ y = [346304, 277435, 3917, -139425, 72078, -215279, 329792, 266589, -157929, -195654, -136897, 11206, 348299, -197204, 269191, 18705, 332595, -9587, 593644, 89485, 422116, 182130, 64555, 179078, 555740, 246520, 105383, 142143, -103293, 48875, -75059, -130383, 141177, 181226, 212004, -219795, 232257, 647596, 197056, 164734, -116487, 375585, 172220, -64962, 13454, 254620, 54542, 38023, -154645, 114920, 96887, 386799, 91961, 120919, 82504, 30614, 125846, 62936, -171226, 15340, 61734, -222291, -118793, -19749, 134395, 81396, 379481, 427656, 240408, 222463, -103124, 384494, 171458, 460567, 460779, 494680, 342279, 360856, 352113, 393429, 343180, 172435, 291062, 312949, -23426, 170560, 4144, 7416, 289751]
12207B89751H1979g2544j22861a0295E2490J09284K75371D8351L78771j02907
12197C24215l4036L31617b67787B34397j5380O8392J9503j26275m8477J3447J20944
12186B66551a0423B29151K23498G0138l2081K26917a065F1246a73054A91774Q8248
12175B80022J6843C1209K50434P4001A36446o2295A0332j232K58327K2277m8483
12164B41221L7267a6865H4489J28214K6209d6170j06801A85943N3181C5520K17086
12153B52606a07927H8793a75479B62772g2071B24172g3053C23470q2404Q428b3328
12141D15707a25573B16534c14187R4500B40818c4621m1283k4799j7624B73363
12130c42184j3163E0693K71390b77318I4050K2957A4948K2823b46G4909a24068
$$ y = [289751, 81979, -72544, -195405, -10295, 52490, 161774, 437145, 48351, 427122, 324215, 290179, 621796, -267787, 234397, 219017, 287409, 306912, 180637, 132160, 145607, 266551, -10423, 229151, 452649, 70138, 38057, 264974, -1065, 61246, -173054, 191774, 280022, 296865, 31209, 281643, 355644, 136446, 74151, 10332, 9100, 267427, 289704, 241221, 278488, -16865, 84489, 212703, 238912, -46170, -152971, 185943, 239124, 35520, 252606, -107927, 88793, -175479, 262772, -72071, 224172, -73053, 323470, 241066, 249494, -23328, 415707, -125573, 216534, -314187, -219687, 240818, -34621, -75904, -100703, -118327, 273363, -342184, -355347, 50693, 322083, -277318, 94050, 117007, 14948, 37771, -246, 74909, -124068]
12118A535J28687a23490j30565F2286J01974g3463A83755b66944A33167F3232
12107B83380i0939D6881b9084B73564j36080C272K49172F8650J17472A2529b08054
12095b8321m6453G0059J60865J62159c300l9303o5865C57850j05722B4874a28873
12083b63174a00015A22078i049A68139b52256C4522i112k6221B3768M47537B16875
12071f9148n6021D1902L1993d27160a10950o6901p9760A91537q5536b12326B1935
12059A15607E3759M4958c188j07949A81494f0591j05098A19355J65028M00347
12049F84730M49650O778j31499B05140B4586a48306D8183J34831A5416a68645
12038a04655l5732c5740n763A75997a97A76542J33208b01355L095k4801A67796
$$ y = [1535, 130222, -123490, -254055, 62286, 164260, -73463, 183755, -266944, 133167, 63232, 283380, -90939, 46881, -29084, 273564, 137484, 3272, 252444, 68650, 186122, 12529, -208054, -28321, -74774, 70059, 230924, 393083, -3300, -42603, -108468, 357850, 252128, 24874, -128873, -263174, -100015, 122078, -9049, 168139, -252256, 34522, -9112, -35333, 23768, 471305, 216875, -69148, -125169, 41902, 73895, -427160, -110950, -177851, -257611, 191537, 106001, -212326, 21935, 115607, 53759, 98717, -3188, -111137, 181494, -60591, -165689, 119355, 284383, 684730, 1134380, 1141158, 1009659, 205140, 24586, -148306, 48183, 183014, 15416, -168645, -104655, -140387, -35740, -41503, 175997, -197, 176542, 309750, -201355, -198260, -223061, 167796]
12026E9832m72a31535j29851I8306a37220C9028J61206B3887J79505J64582b189
12014A07004j2575R6774O2039r2544a37081A08787b898q1130F1062K12122c7520
12002c00400G7714G624M9678J06327a61758M3229B01454c4165l3040H6072f9806
11990I7013g8638l1035B69583i6112k18491D9345N3163b13889D0509h1508j09883
11979a91391B00494F524R7149J77360r9391L0302a38156A43739m199c32912A37204
11967g6797D2615f6453k04187f0466D20858d0519A8645b82192D7417a19915A3764
11955A23054g7698k659B74252i7507D68718D4251J84234g6728j11520E0213J39161
11944A89374E7952a36051l7385O7882B24795J40693a42285O960H9092i2580k17520
$$ y = [59832, 59360, -131535, -261386, 98306, -137220, 39028, 200234, 23887, 203392, 367974, -2189, 107004, 94429, 191203, 253242, 160698, -137081, 108787, -2898, -84028, 61062, 273184, -37520, -300400, 77714, 7624, 57302, 163629, -161758, -118529, 201454, -34165, -67205, 86072, -69806, 97013, -78638, -109673, 269583, -96112, -314603, 49345, 102508, -213889, 40509, -81508, -191391, 200494, 6524, 103673, 281033, 181642, 211944, -138156, 143739, 139540, -332912, 137204, -76797, 42615, -66453, -270640, -60466, 420858, -40519, 18645, -282192, 47417, -119915, 13764, 123054, -77698, -80357, 274252, -97507, 468718, 44251, 228485, -76728, -188248, 50213, 189374, 57952, -136051, -173436, -105554, 224795, 365488, -142285, -135325, 89092, -92580, -310100]
11933c10100a13816f342n7923D62777D7231K5404K85490E3864Q5398A9489a50652
11921c31899a5001B27004e5708I6759J23547q5401b1550k49698D46923A87518
11910B22023A00134a88151C4720K60678G2622f3731A0134N6416a07340A5846L7750
11899E3596g9576j06450E2423J98270o2130a51844B43223A9726c1505k31043d8387
11887a81674Q6995j57190B9704f6615j16273B05750j7490b39452E6666K01177
11877B57843b45284C31390E4121g4938H612b19549E7975K15737C7015i8793j7655
11866a16448C4772J27785J35506C2719B215J05523c67292a03718O826F7546a04026
11854e2448G8550a09342I2997J75264f7540l064j04497f5542B7556b71884c8462
$$ y = [-310100, -113816, -6342, -64265, 462777, 47231, 72635, 358125, 53864, 139262, 19489, -150652, -331899, -15001, 227004, -55708, 96759, 220306, 134905, -21550, -271248, 446923, 187518, 222023, 100134, -188151, 34720, 295398, 72622, -63731, 10134, 66550, -107340, 15846, 53596, -79576, -186026, 52423, 250693, 188563, -151844, 243223, 19726, -31505, -262548, -48387, -181674, -94679, -251869, 29704, -66615, -182888, 205750, 188260, -239452, 56666, 257843, -245284, 331390, 54121, -74938, 8612, -219549, 57975, 273712, 37015, -98793, -116448, 34772, 162557, 298063, 32719, 2215, 107738, -367292, -103718, -96892, 67546, -104026, -52448, 78550, -109342, 92997, 268261, -67540, -70604, -175101, -65542, 27556, -271884, -38462]
11842b56352N3289l3850C2087M028J47136a62816G4835a1678B1981a80941a1332
11830A25133J24794r3290a30307j6796D0888c17422a09919M3202A26124a49501
11819b61614f9280l00394A2922K43982A26310C3544b15021q2039b1935p3995C75121
11807C010i6374A64588J5837L04095j67660j34057J3085h5875A97827J79337e1385
11795A77806n0728L2007O5118a3598I9234k5631f846k949p6447m6940L6062k62190
11783c59310H30O8755Q5464c4239Q95R692j3092B76923i6789j89240J27447D1500
11770b2892I1334O4791c18570M3991f8642c1670j20197B19400F8386a44815j44852
11759b89667O5327j5569A14388k6930J66977c83842d5248E061K37901b69424f7584
$$ y = [-256352, -203063, -236913, 32087, 36115, 183251, -162816, 74835, -11678, 21981, -180941, -11332, 125133, 249927, 156637, -130307, -147103, 40888, -317422, -109919, -66717, 126124, -149501, -261614, -69280, -369674, 12922, 256904, 126310, 33544, -215021, -297060, -21935, -95930, 375121, 3010, -96374, 164588, 180425, 484520, 316860, 182803, 195888, -85875, 197827, 377164, -51385, 177806, 127078, 159085, 224203, -13598, 99234, 73603, -6846, -9795, -86242, -133182, -97120, -359310, 830, 69585, 155049, -34239, -33344, -23652, -36744, 276923, -96789, -286029, -158582, 41500, -22892, 91334, 156125, -318570, -274579, -68642, -31670, -151867, 219400, 68386, -144815, -289667, -224340, -239909, 114388, 87458, 254435, -383842, -45248, 5061, 242962, -269424, -67584]
11747F7782l40a81687k63964A36080g1197C89297a80420A13930c6614n2857A97833
11735A64588o6411a77496d0563A10088J08899a11973A68375b8306H1756i2234
11724B12236j05929a26517H5892b37926A3158J36763a25295j498B83290C6543
11713a38047d6691C26861j40861a52962F7453N6232e60j95025q7801a29740J1759
11702a17981b6922A83378a42280d3486a0688A17013g7579B47290A20418R3114
11692B13532c38473R0966c6293E0050M7246a20310E35900E3106K56612j13573
11682A96145a43811A45432D7485N8947Q9433k2317R8403D1193h7647I1605K5517
11671A17122E3715J26126G2960b24955B08467J37770E4825e0322j89443j07885
$$ y = [67782, 67442, -181687, -445651, 136080, -71197, 389297, -180420, 113930, -36614, -89471, 197833, 164588, 98177, -177496, -40563, 110088, 218987, -111973, 168375, -28306, 81756, -92234, 212236, 106307, -126517, 85892, -237926, 13158, 149921, -125295, -126793, 283290, 36543, -138047, -46691, 326861, 186000, -152962, 67453, 123685, -560, -195585, -283386, -129740, -117981, -26922, 183378, -142280, -43486, -10688, 117013, -77579, 247290, 120418, 213532, -338473, -247507, -36293, 50050, 97296, -120310, 535900, 53106, 309718, 196145, -143811, 145432, 47485, 106432, 195865, 173548, 271951, 41193, -87647, 91605, 117122, 53715, 179841, 72960, -224955, 208467, 346237, 54825, -50322, -239765, -347650]
11661c47650A71991J48737p9949e4311k37343g5053l44504G0753a96143P1761
11651a24382C86157a7362A04932a80872D4579B714i0235F232O3162B2822L37918
11640C60740f7082b7820C0459D508b526j23614j16572H8918P7433k0108d1851
11628b8330B43970N5J35184A13558P0229O4183A16867h1238A39128F2790J77547
11617B40337F691K59785I305Q6811H227K83910C2468N25383a73451J4475K2547
11606a36429A96906j1385K23058a9261A57474G3778a8300n5018O204A99155C4514
11594b1914A44144J08389b19637B18562a09428m5724B81104D2915a00045A93325
11583A90786K14673a9846q3482C23147m9995J01479A59736E4385J79144f1639
$$ y = [-347650, 171991, 320728, 240779, -54311, -291654, -75053, -419557, 70753, -196143, -124382, 386157, -17362, 104932, -180872, 44579, 2714, -90235, 6232, 69394, 22822, 360740, -67082, -27820, 30459, 4508, -2526, -126140, -242712, 88918, 166351, 146243, -41851, -28330, 243970, 244025, 379209, 113558, 183787, 247970, 116867, -81238, 139128, 62790, 240337, 6691, 266476, 9305, 96116, 8227, 292137, 32468, 557851, -173451, -158976, -136429, 196906, 185521, 408579, -19261, 157474, 73778, -18300, -73318, -67114, 199155, 34514, -21914, 144144, 252533, -219637, 218562, -109428, -155152, 281104, 42915, -100045, 193325, 190786, 405459, -19846, -103328, 323147, 273152, 374631, 159736, 54385, 233529, -61639]
11572D44997C8891K2333B1032K0036a62283M5526D39591j05442h65E2601J45501
11561A98102C6484a21544e4767B78583F315K71074A319R4471j03b29169J09209
11550a19960D60645B09163j0252k4754H5522K0205K09459f4483A20608L33079
11540D53687A78752b9700A63753B5986K05376j05651a43646H1964a1779B56888
11529C93876A73643R1684O6328j40628g469p5773l4533I8601J2307L45747d2746
11517H4802J32536J4467n0984Q936b9613B04926J65912c8720F6578b1273A56115
11505C43159a9567m368j8819C29048K06447B59243N512q8015M6565o9745J70256
11494C23816c45057A86703a89804f9176B27908J54650l0960q5537g1565C46357
$$ y = [444997, 38891, 61224, 21032, 41068, -162283, -116757, 439591, 334149, -865, 52601, 198102, 36484, -121544, -54767, 278583, 6315, 277389, 1319, 95790, 95687, -229169, -119960, 460645, 209163, 198911, 174157, 85522, 105727, 315186, -64483, 120608, 453687, 178752, -29700, 163753, 25986, 231362, 125711, -143646, 81964, -11779, 256888, 393876, 173643, 265327, 331655, 191027, -7469, -83242, -117775, 98601, 110908, 456655, -42746, 84802, 217338, 231805, 180821, 189757, -29613, 204926, 370838, -38720, 66578, -21273, 156115, 343159, -19567, -23935, -42754, 329048, 535495, 259243, 264755, 176740, 223305, 153560, 323816, -345057, 186703, -189804, -69176, 227908, 382558, 351598, 266061, -71565, 346357]
11483D51092J08545h9308F3664k9896f0758A30573h121D183M58920A20054g4674
11471C68448j51936a78704C42810j64733J43213A02980l5597J02507q480N207
11461A66617d3252B15970q9867J46416j01905L4071j5923r036k6551m4041c6955
11449H7836L6414C7977m441K7160k6372K75044p8694o2490B5683J30428M71906
11438F28017A06327J5457b36109B32569A00093J40064M6109B2034K76672b29532
11427G0488l4804J70495j989j7410a91965L9898a3700A01407h8920B13555e496
11415A89168J39103b0417A66743g2100n1827A48707c07015K2693a00964B24496
11404a0035I3691a21187R334B36470j14310c9590A06027J39710J92900A83483
$$ y = [451092, 559637, -89308, 63664, 33768, -60758, 130573, -8121, 4183, 463103, 120054, -74674, 368448, 216512, -178704, 342810, 178077, 321290, 102980, 67383, 169890, 161410, 166617, -43252, 215970, 126103, 272519, 170614, 204685, 188762, 179726, 153175, 109134, -36955, 87836, 124250, 37977, 33536, 60696, 34324, 309368, 230674, 168184, 25683, 156111, 628017, 106327, 121784, -236109, 232569, 100093, 240157, 286266, 22034, 298706, -229532, 70488, 35684, 206179, 204190, 186780, -191965, -152067, -13700, 101407, -88920, 213555, -5496, 189168, 328271, -20417, 166743, -72100, -123927, 148707, -307015, -284322, -100964, 224496, -10035, 93691, -121187, -111853, 236470, 122160, -39590, 106027, 245737, 438637, 183483]
11393c42859f4404A37224j424n8009F531N9742b22826H8239f3912B3981g5794
11381c65556C88717F6332c2618G8676b6485j47679B21784a21445c3231p3472n856
11370a12559C6192J84202a38186K0355C13181a71154E7092d56547C35494A9561
11359A10930E0011J51860l3532k4698m8568p86J35087j03471g4063j35371a5391
11347D77b47923j29620F4778K25347C1284B943a02649C2824J42183m1239F0217
11335c56748J72742g7747J0498A13499n6197J11565b19334A78109A6148b8993
11324g0896C9050Q703K20275b70178H0641k2041a17736d4888D7139P4632l7621
11313H4150Q0681k7187b19121f9671D2912b17403A56043M4496k1539R698c45381
$$ y = [-342859, -64404, 137224, 135800, 77791, 6531, 66273, -222826, 88239, -63912, 23981, -75794, -365556, 388717, 66332, -32618, 78676, -26485, -174164, 221784, -121445, -33231, -106703, -112559, 36192, 220394, -138186, -117831, 313181, -171154, 57092, -456547, 335494, 19561, 110930, 50011, 201871, 168339, 143641, 95073, 94287, 229374, 125903, -74063, -209434, -15391, 477, -247923, -377543, 64778, 290125, 31284, 2943, -102649, 32824, 175007, 133768, 60217, -356748, -184006, -77747, -67249, 113499, 57302, 168867, -219334, 178109, 16148, -28993, -70896, 39050, 47753, 268028, -270178, 80641, 58600, -117736, -44888, 47139, 121771, 84150, 164831, 137644, -219121, -69671, 42912, -217403, 156043, 200539, 179000, 188698, -345381]
11301F4653b65574C25447a06961B0681b57078p6532B31352d453C18915a87637
11290A65573b5886k69550G9190J56497l0723p2253c44317a33168k44425i9360
11279a05494M3025J6906A48842a58745j01497A11385D9842M2745g3648F1705R7381
11268A59086l8577J92057a89741K8423A06894g7362m9633A7063K87645D775g3713
11256g3088F8698K6404P2908M2590a86761M7866D5712A0621O1545J45802q3799
11245A34169C9981a27974L6202I0336B383d5755j91379i2193D21792b11092d2645
11233A38434a01519H6951i4429A30392b50791g3070A50582b05301E1205a41259
11222e07921a23492j7026d3879C4193K5864c2341j27364N4683e0022k59020a44210
$$ y = [64653, -265574, 325447, -106961, 20681, -257078, -333610, 231352, -4453, 318915, -187637, 165573, -25886, -295436, 79190, 235687, 204964, 132711, -344317, -133168, -377593, -99360, -105494, -62469, -45563, 148842, -158745, -260242, 111385, 49842, 92587, -73648, 61705, 159086, 120509, 312566, -189741, -161318, 106894, -77362, -126995, 17063, 304708, 4775, -73713, -73088, 68698, 95102, 168010, 210600, -186761, -138895, 45712, 10621, 72166, 217968, 134169, 39981, -127974, -91772, 90336, 2383, -45755, -237134, -92193, 421792, -211092, -42645, 138434, -101519, 86951, -94429, 130392, -250791, -73070, 150582, -205301, 51205, -141259, -507921, -123492, -140518, -43879, 34193, 60057, -32341, -159705, -105022, -50022, -309042, -144210]
11210a64711C1856K17252a00942q209K7265B52763a92806O8688j09555D65791
11199a56236m7429I7975D5819a51703A66838B9039J50090e2136C3913K47496A36965
11187B16532c2690n8820b2540k26879j8654b2860p9050j1272A71123A4993a03851
11175b22029a1622K492A28709J48601C317b44272R8708j0667b3182F3052a8702
11163a88286A53296a46329f2859j68899A902J99522m3344K56034i971B42614r2834
11152A49780a38701f0310A26782g571A81545h0619B35418A7699L4474c5168D22968
11140A7759K9182b77008B4913a43138B86286A15940b12741A91336H9039f9899
11129f844j1841A45951o4032B6430h2731A17161E7573K2148K60327H7553K5150
$$ y = [-164711, 31856, 249108, -100942, -109151, -81886, 252763, -192806, -124118, -233673, 465791, -156236, -203665, 97975, 45819, -151703, 166838, 29039, 179129, -52136, 33913, 281409, 136965, 216532, -32690, -91510, -22540, -249419, -268073, -22860, -101910, -113182, 171123, 14993, -103851, -222029, -11622, -9130, 128709, 277310, 3317, -244272, -145564, -156231, -23182, 63052, -18702, -188286, 153296, -146329, -62859, -231758, 1902, 201424, 158080, 414114, -9971, 242614, 149780, -138701, -60310, 126782, -7571, 181545, -80619, 235418, 17699, 52173, -35168, 422968, 17759, 46941, -277008, 24913, -143138, 286286, 115940, -212741, 191336, 89039, -69899, -6844, -18685, 145951, 81919, 26430, -82731, 117161, 57573, 79721, 340048, 87553, 112703]
11118A12703J42158F4355G903L43616j24809A5748e3494A60548D7437L74354B03723
11106e4159A69503a66799c9358B64969O8244q7554E6358N4742P4985Q6122m7514
11095B24693o2438q0737k0633J18668i01B49568I3622j2185R5660G9219K0065
11084I9284a05330A97433K00075P0967j67485J38341k9567n305a24739B98103
11073G84731l16172O5102B30092J85195j02910N6179j46584K42005L79441l25854
11063E17564L57472B61985M26794B31549M6947L55557M3251k05651Q0918J25051
11053F77622Q1234J88298p405j58775J26977L18415l96173K7633J1340L17654
11043A186820k18042l4753K08345k00566k15420N6104L97571m70606J37835k11617
$$ y = [112703, 254861, 64355, 7903, 351519, 226710, 15748, -53494, 160548, 47437, 421791, 203723, -54159, 169503, -166799, -39358, 264969, 333213, 245659, 56358, 111100, 186085, 272207, 224693, 162255, 81518, 60885, 179553, -901, 249568, 93622, 81437, 177097, 79219, 99284, -105330, 197433, 397508, 468475, 300990, 439331, 409764, 404459, -124739, 298103, 784731, 468559, 533661, 230092, 415287, 312377, 368556, 221972, 463977, 843418, 517564, 875036, 261985, 688779, 231549, 278496, 634053, 677304, 471653, 552571, 677622, 758856, 947154, 939749, 780974, 907951, 1226366, 830193, 857826, 869166, 1186820, 968778, 934025, 1142370, 941804, 726384, 782488, 1180059, 709453, 847288, 635671]
11033F35671K45668J08823j34321r4489q374K96151k87254L80200j48517K89668
11023A283226j66730k23331R8302K73795o26454L46444q9044J9037R985j76341
11013G48889k01337L9467K58116l31081J89240P5822J279j94008L29478m0284
11003H75581j55361j77699L01229J35321j46164l8138L99812m88798P8872N5460
10993H40115j14340n0529J6882p3675L37628K8844L12428l10619k4722K33583
10983A195595J05581o0957J06367L5392O0038L13355P1215J63028j01139O57769
10973B546244J76183L22490K44078L87267J46152j30723L61916j13454o67047
10964C273106r3843l36892l30161l58846o3174l3847R7464q1851m1368j14250
$$ y = [635671, 881339, 990162, 855841, 761352, 752978, 1049129, 761875, 1142075, 993558, 1283226, 1116496, 893165, 991467, 1265262, 638808, 985252, 896208, 915245, 925230, 748889, 547552, 587019, 845135, 514054, 703294, 779116, 780395, 586387, 915865, 875581, 720220, 542521, 843750, 979071, 832907, 794769, 1194581, 705783, 784655, 840115, 725775, 675246, 692128, 618453, 956081, 984925, 1297353, 986734, 962012, 1195595, 1301176, 1240219, 1346586, 1381978, 1442016, 1755371, 1826586, 1989614, 1888475, 2546244, 2722427, 3044917, 3288995, 3676262, 3822414, 3691691, 4053607, 3940153, 3273106, 3179263, 2842371, 2512210, 2153364, 2090190, 2056343, 2153807, 2071956, 2030588, 1916338]
10954A916338N2943j38954J30465p48665r1178n042k18129j95442K54065C51953
10943B68475J55480J71770k6882D9143M44079j17131K656r6037N6260A20174M23914
10932E44088E3569o637Q415J94327G8410b16850A28744i38C43601J65605A85377
10920A90777D3948Q3451g1428M04j00454A24914A2153J37796a57786B07807a92989
10908A18382b9319I9122a98390n2687e015k3485J0649A55596d1685E5713F770
10896b86292A03210M8850A6607P6118K19207A50135L0124k0782g2136A27026n8213
10885F8813b3140A95994a42740A38047K37515a7619B33897d1606j05353C2768
10874B71389a30205A62049G7987b07135B03743E5584P1309b12485A13898a7381
$$ y = [1916338, 1969281, 1830327, 1960792, 1212127, 1120949, 1115907, 897778, 702336, 956401, 351953, 268475, 423955, 595725, 568843, 49143, 493222, 376091, 378747, 282710, 338970, 120174, 544088, 53569, 46932, 55347, 249674, 78410, -216850, 128744, -938, 343601, 509206, 185377, 190777, 43948, 127399, -71428, -71024, -171478, 124914, 12153, 149949, -157786, 207807, -192989, 118382, -29319, 99122, -198390, -251077, -5015, -28500, -17851, 155596, -41685, 55713, 6770, -286292, 103210, 152060, 16607, 92725, 311932, 150135, 180259, 159477, -72136, 127026, 68813, -23140, 195994, -142740, 138047, 375562, -17619, 233897, -41606, -146959, 32768, 271389, -130205, 162049, 77987, -207135, 203743, 55584, 126893, -212485, 113898, -17381]
10863i7772L8555E2449l171a98424K3883A59586f4339B50389A1996J197d84531
10851d6119m4069q4273d2038H0512a10339M3899F9745c95197f7172M255p2633
10840a35550A62389N7078I930O9959C8961P6265C1513a54936A16166h708D35289
10828a27362N2061o8279A5272J31385R2971c48106F4307K74071a21593l29777
10818d51370a30955G3368g7287b4647j61823B34375C2790n733O0772a60739B61789
10806I9356K1578k9305a29625d3132p4127I5233a06566j44405B85824i5446B24113
10794A24512a23890C0465K65314b06189j12157d1024B40217e31C30423c03314
10783C2984a67243j26625A1210g2662A60488a7640r2288o9973F2927b9840I6618
$$ y = [-97772, -59217, 52449, 49278, -198424, -174541, 159586, -64339, 250389, 11996, 13193, -484531, -46119, -90188, -174461, -42038, 80512, -110339, -66440, 69745, -395197, -67172, -62917, -135550, 162389, 219467, 9930, 79889, 38961, 115226, 31513, -154936, 116166, -8708, 435289, -127362, -75301, -143580, 15272, 146657, 239628, -348106, 64307, 338378, -121593, -451370, -130955, 73368, -77287, -24647, -186470, 234375, 32790, 27057, 87829, -160739, 261789, 99356, 120934, 91629, -129625, -43132, -117259, 95233, -106566, -250971, 285824, -95446, 224113, 124512, -123890, 30465, 295779, -206189, -318346, -41024, 240217, -531, 330423, -303314, 32984, -167243, -293868, 11210, -72662, 160488, -17640, -109928, -179901, 62927, -29840, 96618]
10771c88171J28565B01731q2565g3005A10359c16715A84974i010b378j68042N5650
10760a14770j05907i9628A15052a76661L5530A11903b04279j34129a32745B52327
10749B54624i9723b6465A66423d8346C5088q131k964J73064B977a60421g7369
10737b30613A65545a37488D0390b10506A0933b51720j62151D03536g1734j0527
10727h2261d0870I0299h1045a0584Q34m60651f7925A22313a62438k12415B05966
10715A93211e5967j22087e8239B72402A00813J31171a46037c8666m9968A61148
10704b06521m4690i4432l0661L7251A40905g7792B33737f9186k7324E0124J7521
10693F7645K15157g8579m0722n4969j52661a24972j27097a20081j22892a13769
$$ y = [-388171, -259606, 201731, 119166, -73005, 110359, -316715, 184974, -9010, -2378, -170420, -114770, -220677, -99628, 115052, -176661, -141131, 111903, -204279, -338408, -132745, 252327, 254624, -99723, -26465, 166423, -48346, 35088, 26957, 23993, 197057, 2977, -160421, -77369, -230613, 165545, -137488, 40390, -210506, 10933, -251720, -413871, 403536, -71734, -82261, -40870, 90299, -81045, -10584, -9750, -470401, -67925, 122313, -162438, -374853, 205966, 193211, -55967, -178054, -58239, 272402, 100813, 231984, -146037, -38666, -88634, 161148, -206521, -251211, -94432, -125093, -87842, 140905, -77792, 233737, -69186, -96510, 50124, 67645, 282802, -78579, -119301, -174270, -326931, -124972, -252069, -120081, -242973, -113769]
10682B3285a48041d3358F0648a53294E5862b01439N3615A59761a42043A5851a66999
10670a36243K3953b0035m5983A7062g5247a4398l7613l7240o3841A02958a05905
10658B81180a67120A34433b90094B88746a02915C7458b9751C09464e2159l38714
10648c90873g2230K2782B99083m4991G5670b25322L9657A37048a68075K6603r9461
10637b40933b3810n8734k90991J84623g2229A2605a5784j25753d2383A34933a30706
10625D17956H6556a30792k71862A64457a33863A01949C8125a2894j0805j91371
10615b15070M8428A55652a28768j28313B1452a33132K2706I4539J27253a19058
10604i9418c3900D09475F3230e1101q2100f0948C4165a67153A37728D3019c04374
$$ y = [23285, -148041, -43358, 60648, -153294, 55862, -201439, -147824, 159761, -142043, 15851, -166999, -136243, -112290, -20035, -66018, 17062, -75247, -14398, -52011, -89251, -153092, 102958, -105905, 281180, -167120, 134433, -290094, 288746, -102915, 37458, -29751, 309464, -52159, -390873, -72230, -49448, 299083, 254092, 75670, -225322, -185665, 137048, -168075, -141472, -240933, -23810, -82544, -373535, -188912, -72229, 12605, -15784, -141537, -42383, 134933, -130706, 417956, 86556, -130792, -402654, 164457, -133863, 101949, 38125, -12894, -23699, -215070, -166642, 155652, -128768, -257081, 21452, -133132, -110426, 94539, 221792, -119058, -99418, -33900, 409475, 63230, -51101, -133201, -60948, 34165, -167153, 137728, 43019, -304374]
10592A66959c12567C73160b7771j75503O2412a8750r1664A16255A1160f4314k16271
10581b80585A27202a14200A03777b63385J22232R807C2313e1898k12875J16898
10571a47875A50537h1268I9978b84104j23694h0308F6597i2062M0058o6743L8967
10560g9780k57373C66305A63600B0930b45702J07641j07566A76524J9045K19325
10550D14894A57453b39258c3412n3671k7525e4139B5259M6557O7270B2227d5485
10538A37882C8476J18795a14027o8815o8981M6828P0451A53487f9995A03453b28186
10526a09887F3768J59651P6613i7997A21371K1090a4454l8917F1623K07178E1603
10514b66535A02212k1252a27819j40763L1925C499e8720k70809L9434a37707N2611
$$ y = [166959, -312567, 373160, -27771, -203274, -140862, -18750, -110414, 116255, 11160, -64314, -280585, 127202, -114200, 103777, -263385, -141153, -131346, 32313, -51898, -264773, -147875, 150537, -81268, 99978, -284104, -407798, -80308, 66597, -92062, -52004, -118747, -79780, -337153, 366305, 163600, 20930, -245702, -138061, -245627, 176524, 195569, 414894, 157453, -239258, -33412, -87083, -114608, -54139, 25259, 71816, 139086, 22227, -45485, 137882, 38476, 157271, -114027, -182842, -251823, -204995, -134544, 153487, -69995, 103453, -228186, -109887, 63768, 223419, 300032, -97997, 121371, 142461, -14454, -53371, 61623, 268801, 51603, -266535, 102212, 80960, -127819, -268582, -236657, 3499, -58720, -329529, -290095, -137707, -85096]
10503h5096l3334A89314a80597e5227B13942b18864J6733C61998c7453j60371
10493a97824d7140A54205L8705i9065k7968A55996C2874N0759b64487a31165E7582
10481c8240A42267J19496P8891L50507A79426Q9535J04394p7361j17999N9044
10471B37039q5312l8365B0523O5186c8854j51096C57855A27915b28395A2911K54350
10460B67261A2858g0733F9081i5493K3465F3262a80502B1043b17315a8729A15327
10448b64362a09474A32258F999L11588b0044k11475b2480B84389A9078M8378l2604
10437C4852a23025C0929e9042A37607a60313j87123a3625D287M9382i1536C17483
10425A58657n2023g4246C10019A01042a57887J8078C2032P6932R8848K81178B20084
$$ y = [-85096, -118430, 189314, -180597, -55227, 213942, -218864, -202131, 361998, -37453, -197824, -47140, 154205, 192910, -99065, -127033, 155996, 32874, 83633, -264487, -131165, 57582, -38240, 142267, 261763, 340654, 691161, 179426, 268961, 373355, 295994, 177995, 237039, 151727, 113362, 20523, 85709, -38854, -189950, 357855, 127915, -228395, 12911, 267261, 12858, -70733, 69081, -95493, -72028, 63262, -180502, 21043, -217315, -18729, 115327, -264362, -109474, 132258, 6999, 318587, -20044, -231519, -22480, 284389, 19078, 67456, 34852, -123025, 30929, -59042, 137607, -160313, -347436, -13625, 4287, 53669, -91536, 317483, 158657, 106634, -74246, 310019, 101042, -157887, -139809, 32032, 108964, 207812, 488990, 220084]
10413a06715R099H6364c69311g0698l9504A76101A0403a04199j96126B96799F1656
10401g7647I2343J80270a69105A12025D0890c6633A70972q3926P1724J70709A48549
10389A01606J63456L32589A39393k0214k414J89353A42961N8972r6650f3938C24467
10377C41923j46650J64007F3537P3695L62629J91162k43827k02213J98387j58737
10367B84633l8684P13K63913K38900l24987o8157A31060K86311l2297m3044A20859
10355C83453A46834P6054l4927J05945R9234J10603L35092j73862k08946N3620
10345E09647j77806R5029o4393m6089K08771F4151J06917m4297n9148k6738J93483
10334B34368J04655J65132j56960j20829Q7328C2858J39258D6591m467M24459
$$ y = [-106715, -97616, 86364, -369311, -70698, -110202, 176101, 10403, -104199, -300325, 296799, 61656, -77647, 92343, 272613, -169105, 112025, 40890, -36633, 170972, 87046, 158770, 329479, 148549, 101606, 265062, 597651, 139393, 119179, 116765, 306118, 142961, 201933, 105283, -63938, 324467, 341923, 195273, 359280, 63537, 137232, 499861, 691023, 447196, 244983, 443370, 284633, 245949, 246662, 510575, 749475, 424488, 356331, 131060, 417371, 385074, 342030, 120859, 383453, 146834, 222888, 187961, 293906, 393140, 503743, 838835, 664973, 456027, 509647, 331841, 426870, 362477, 316388, 525159, 64151, 171068, 126771, 67623, 40885, 234368, 339023, 504155, 347195, 226366, 313694, 32858, 172116, 46591, 42124, 466583]
10324D66583a41589B74328c2731D19755A68003O3603G0870K76457d7878C24616
10313I6217K56203G9309b69523C05352d1692n58606F5620J45411m8786J55539
10303C17784A58721b32051b5274A8544J17452j4001N4696a47297A44374b68B6101
10291D66948A79127J90053g1451j66163Q0748A36877b11374Q9847j4750j68889
10281c05166d8273m1675j71323B40056b77703G2816j8267e5924A15713n5583a1065
10269g3462b4255C90351A22462l8417J64087a75426A13898Q3815I5424f9070B3497
10257b45791A66441K80109K7383l0629k09283J20970A11129r603b48001E5999
10246c7844p7738p9130C97024a55864C40497H0396b04863g7126A01503a72483
$$ y = [466583, -141589, 274328, -32731, 419755, 168003, 231606, 70870, 347327, -47878, 324616, 96217, 352420, 79309, -269523, 305352, -41692, -600298, 65620, 211031, 162245, 317784, 158721, -232051, -25274, 18544, 135996, 121995, 176691, -147297, 144374, -268, 26101, 466948, 179127, 369180, -71451, -237614, -156866, 136877, -211374, -121527, -136277, -305166, -48273, -89948, -261271, 240056, -277703, 72816, 54549, -55924, 115713, 60130, -11065, -73462, -24255, 390351, 122462, 84045, 248132, -175426, 113898, 197713, 95424, -69070, 23497, -245791, 166441, 446550, 473933, 443304, 234021, 354991, 111129, 101526, -248001, 55999, -37844, -115582, -194712, 397024, -155864, 340497, 80396, -204863, -77126, 101503, -172483]
10235B77701g4069A91821o0308f363C5857c50194H8805A3634a86105a9873j76665
10224a96538A0919a54039A47451b85918A1135J86243a63294b0087k7413C56745
10213e8048l20448A8338L3580j3780a21076A6587b5040o4032j7734j08118c8229
10201d40651B46562G8463a23559j60637J12287j74623A98368a99414r9529L2744
10191b66199K1862j6757e6519E0692c73476A5179a63479K5350b1023k03918P2082
10180a52859j57320F0904N8660b95146A25007R2964a9318B47044o7267D5032b30291
10168D6928h389j39585A07871m6022Q4814a89133h0353A06171J6727a70055p790
10157a77845o5493B7694c51624m3679H2057K28580b86165j3927G0256a53209N3722
$$ y = [277701, -74069, 191821, 131513, -6363, 35857, -350194, 88805, 13634, -186105, -19873, -196538, 10919, -154039, 147451, -285918, 11135, 197378, -163294, -20087, -47500, 356745, -58048, -378496, 18338, 51918, 38138, -121076, 16587, -25040, -89072, -106806, -214924, -38229, -440651, 246562, 78463, -123559, -284196, -171909, -346532, 198368, -199414, -298943, -266199, -244337, -261094, -56519, 50692, -373476, 15179, -163479, -138129, -21023, -224941, -152859, -310179, 60904, 119564, -295146, 125007, 217971, -19318, 247044, 179777, 45032, -230291, 46928, -8389, -147974, 107871, 61849, 146663, -189133, -80353, 106171, 122898, -170055, -177845, -243338, 27694, -351624, -395303, 82057, 310637, -286165, -300092, 70256, -153209, -99487]
10146i9487c8565G4303j2114a74423B66284d6928I7047a44062E128J05506a24874
10134C9262c4733k88271G9095b07890c6001k75194n0339a0140l82217B4613b68773
10122a19836j82742J16762C48a59912g2040B4317a49373A5186K3080i3500l13992
10111d07492a84557D4723J39893a63948N3111A79349a94907M2662e3125a9388
10100A22797a24652A07885G377b2448G229a89204a0632j83556C63575a71757a0521
10088A23877b04597A77876b21698O9358D2331J72459E4205J13844D7542J21682
10078A69224c32240d224k62775O4579B6142K04236a14722G1051c69362a68667
10067d25047R8813C27783g7838C1276f2821G8289A089e7206K3313j99386g1438
$$ y = [-99487, -38565, 74303, 62189, -174423, 266284, -46928, 97047, -144062, 5128, 110634, -124874, 39262, -34733, -323004, 79095, -207890, -36001, -311195, -361534, -10140, -392357, 24613, -268773, -119836, -302578, -185816, 348, -159912, -72040, 24317, -149373, 15186, 38266, -93500, -407492, -184557, 44723, 184616, -163948, -110837, 179349, -194907, -152245, -53125, -19388, 122797, -124652, 107885, 7377, -22448, 7229, -189204, -10632, -194188, 363575, -171757, -10521, 123877, -204597, 177876, -221698, -152340, 42331, 214790, 54205, 168049, 47542, 169224, -332240, -4224, -266999, -202420, 26142, 230378, -114722, 71051, -369362, -168667, -425047, -326234, 327783, -77838, 31276, -62821, 78289, 1089, -57206, -33893, -233279, -71438]
10055E8367A1151b47014g2419f051A13182a14846j42861B25481c73821L6459c4747
10043C06673a17461L6167J6902H8698C8327A302a73216E8543b71411a13422k246
10032a15668A01926m4938b26367M2063b0558A06805a0754k18609A02931K0558
10022A23489b93729K0066g2515j56589m4249A91313c3478E364L8534K3439J43284
10011B10621a98185B61L48512g2027F9906J8047J27446G1834J99610r9571m0559
10000A31314l9251d6233A5251i5044D0012b24732A79585a53168j16684B00996
9989I0534B7851f7461m027n2233j25852j0999i6830p5341C8769K15932c4116A11078
9976a88381o4652J7552E2625a52320m7824b0729b20q9788j62903g4270j61851
$$ y = [58367, 11151, -247014, -72419, -6051, 113182, -114846, -257707, 225481, -373821, -337362, -34747, 306673, -117461, -81294, -64392, 88698, 38327, 1302, -173216, 58543, -271411, -113422, -115668, 101926, 56988, -226367, -184304, -20558, 106805, -10754, -229363, 102931, 123489, -293729, -273663, -72515, -229104, -273353, 191313, -33478, 5364, 43898, 67337, 210621, -198185, 261, 348773, -72027, 69906, 87953, 215399, 71834, 271444, 171873, 131314, 92063, -46233, 15251, -95044, 40012, -224732, 179585, -153168, -269852, 200996, 90534, 27851, -67461, -71488, -123721, -249573, -260572, -96830, -172171, 38769, 254701, -34116, 111078, -188381, -253033, -235481, 52625, -152320, -200144, -20729, -220, -90008, -252911, -74270, -236121]
9965b36121A19590D3047c02668B6133e1542E8009a10755j18480A50434b60161
9954G5245k364J9160i5899l03381a70957c6199B51657a5841A60386c18685L4937
9943b83748a11805k47398j4333J48584R3009L9840p9053j61280g2171A97965e5930
9931E7057R7049h9754l04640a23106C5934a65997I5654K04952a02258k28407A16432
9919A01917j0568J1194b36611d498E0021A841L3067e6847e216p7644k7300k5513
9907a35673b0442m25299b00977r915C7083M2976c48491I1346b88246B988O8179
9896G1167c84428B69605a47176j30181B9369d90308b29816I2977f3244G2353a07908
9884b17020A81157G3497d3415q8604j086A87332b05101o1497C01547a14573l6109
$$ y = [-236121, 119590, 43047, -302668, 26133, -51542, 58009, -110755, -229235, 150434, -260161, 75245, 72881, 92041, -95899, -399280, -170957, -36199, 251657, -15841, 160386, -318685, -283748, -111805, -359203, -373536, -224952, -131943, -92103, -171156, -332436, -72171, 197965, -55930, 57057, 154106, -89754, -394394, -123106, 35934, -165997, 95654, 300606, -102258, -330665, 116432, 101917, 91349, 102543, -236611, -4498, 50021, 1841, 34908, -56847, -5216, -82860, -110160, -135673, -20442, -445741, -200977, -210892, 37083, 80059, -348491, 91346, -288246, 2988, 71167, -384428, 269605, -147176, -277357, 29369, -490308, -229816, 92977, -63244, 72353, -107908, -217020, 181157, 73497, -43415, -132019, -133105, 187332, -205101, -266598, 301547, -114573, -150682]
9873a50682r640H14O0846b23038n8834H6710g247E2300a21119m0215r915A61553
9860a18836L4149A62035e17104b27899G3070a96408g1179B69449b63048a10371
9849a77678b8203j30228k5210j03097J13419C15507A4041b55180B14722a76359
9838a90853j12538F2646a03839J4943j1249k5616A90723a50855c1469I9179K82697
9827C81876a10345j28717d1081m58642J77217J30833A15811c16976A67121m5763
9817A21358a38350j15332A36808L35853a18151a9435F0780d8277k38062F5771
9806c27752G3754a51779j26697m2966a226k27137j7558A4040e3959B4676J12132
9795A36808d843k77608Q8963c3051k41048P4332g9877B00407a3019m5956a5740
$$ y = [-150682, -160322, 814, 61660, -223038, -281872, 86710, -7247, 52300, -121119, -161334, -171249, 161553, -118836, -84687, 162035, -517104, -227899, 73070, -196408, -71179, 269449, -263048, -110371, -177678, -28203, -158431, -183641, -286738, -173319, 315507, 14041, -255180, 214722, -176359, -190853, -303391, 62646, -103839, -88896, -100145, -125761, 190723, -150855, -31469, 99179, 381876, -110345, -239062, -41081, -499723, -322506, -191673, 115811, -316976, 167121, 121358, -138350, -253682, 136808, 472661, -118151, -19435, 60780, -48277, -286339, 65771, -327752, 73754, -151779, -278476, -321442, -1226, -228363, -245921, 14040, -53959, 24676, 136808, -4843, -282451, -193488, -33051, -274099, -199767, -79877, 200407, -13019, -58975, -15740]
9783G3465c55934A56995J22660F3094d9477k50833E6968B2337b53003A04194K3750
9772A27944n9923c7175r6258I9360b34684C11332b06071Q0383B011J67604e5350
9760I588a95338m1778c3951a032k12544m09774C16938h8332l88191a22397B32795
9748d11263J80994A25198C788i505D7097g2241j41222k7961k17886B00660c09791
9736B1812J64791a44154I9375C2066a3826l14556A66581f7186B43779b12946f7246
9724d0445G0451b71175r4862J24871i820b982k30434A77341a86375B11214o5106
9713A46108d74777a1391j61166k9474d042G530e3722r1521l8280B7854b3114l84108
9701d07222a34342B4108i8688A07490C129J09939f784D415J4168a05209K8268
$$ y = [73465, -355934, 156995, 279655, 63094, -49477, -300310, 56968, 22337, -253003, 104194, 127944, 68021, -37175, -133433, 99360, -234684, 311332, -206071, -125688, 2011, 169615, -55350, 9588, -195338, -237116, -33951, -1032, -213576, -623350, 316938, -88332, -476523, -122397, 232795, -411263, -230269, 125198, 3788, -9505, 47097, -72241, -213463, -241424, -459310, 200660, -309791, 21812, 186603, -144154, 99375, 32066, -13826, -328382, 166581, -67186, 243779, -212946, -67246, -40445, 70451, -271175, -366037, -241166, -9820, -2982, -233416, 177341, -186375, 211214, 146108, -474777, -11391, -172557, -202031, -4042, 7530, -53722, -145243, -183523, 27854, -23114, -407222, -134342, 24108, -98688, 107490, 3129, 113068, -6784, 4415, 18583, -105209, -76941]
9690g6941a0223j04831r9226k61120J66025J36450o4893I3758c72322B10976k1056
9679A89920a18714N4333o2302k6967N6051a6421A2450b6347m88496a53541o5345
9668b18886J04876M0717C2656b9541A743c9454r56k90875I2468K42249a69167
9656A87307r2987N8470a58051C6013K85544a53459q7572i1121m0115q8801a0540
9644d25218K05598A78661a25003k20379a24944j8934p6122f4687C1086c26533
9633a56855A06179e7261I1761l412a81705F25P3028a55753H226J0117d29790a69933
9620F3749c08608H8936a7562j61576F3067a88647A16550a28421A63777m0459J81978
9609C05296D9430b92838J21755B52230b6528D9292L4186c41501A38805n9782b08515
$$ y = [-76941, -10223, -115054, -214280, -475400, -309375, -172925, -237818, 93758, -372322, 210976, 189920, -118714, -64381, -126683, -153650, -97599, -16421, 12450, -26347, -514843, -153541, -218886, -114010, -73293, 32656, -29541, 1743, -39454, -40410, -331285, 92468, 334717, -169167, 187307, 94320, 152790, -158051, 36013, 321557, -153459, -241031, -91121, -131236, -220037, -10540, -425218, -219620, 178661, -125003, -345382, -124944, -143878, -220000, -64687, 31086, -326533, -156855, 106179, -57261, 91761, 88349, -181705, 625, 73653, -155753, 8226, 18343, -429790, -169933, 63749, -308608, 88936, -17562, -179138, 63067, -188647, 116550, -128421, 163777, 123318, 305296, 49430, -292838, -171083, 252230, -26528, 49292, 83478, -341501, 138805, 79023, -208515]
9597b9860q4340K0936C59614a02923L5505j65958q4064K7572A78257b23145A48617
9585b1433B28280f6948l3566B3468f7080n1869b9029D0497L8587L67146A27841
9573c3591r4064C31057a15418k77079Q6831a03800j28076A61967a44617j7285
9563a61902A14632b48871R3534j08243a16586l6890J9640K8665B13700a72779
9552d56119a76417M5116k63202a02095A00534c94467a92604k013F299b49842E3878
9540b36527o2299a4275F1209a91811O8963e3636l65630B11364a7534R56A17680
9528d4848k92118J64061l395L8589N4673j40767l1858G9328B5920a32685A5792
9516b9696k39060g6039b3365j52498j6814A0551a6192B9672b13858l2257B4115
$$ y = [-29860, -114200, -93264, 359614, -102923, -67418, -233376, -317440, -289868, 178257, -223145, 148617, -21433, 228280, -66948, -100514, 23468, -67080, -118949, -29029, 40497, 79084, 446230, 127841, -33591, -127655, 331057, -115418, -392497, -305666, -103800, -231876, 161967, -144617, -161902, 114632, -248871, -155337, -263580, -116586, -153476, -133836, -105171, 213700, -172779, -456119, -176417, -131301, -394503, -102095, 100534, -394467, -192604, -194617, 6299, -249842, 53878, -236527, -298826, -14275, 61209, -191811, -122848, -53636, -419266, 211364, -17534, -16578, 117680, -44848, -336966, -172905, -176300, -137711, -83038, -223805, -255663, 79328, 25920, -132685, 15792, -29696, -268756, -76039, -23365, -175863, -192677, 10551, -16192, 29672, -213858, -246115, 24115]
9504a68386a6972p2315j55345e3522o380J9033b097j57006L3252B62372E6341
9492F6357J32735a39044O1026B172L37980c7279B2645e58888C268a37640a9229
9480C4731g790m8292F3604i5600A6214a77700j35251f3562a9287A95776m5004
9469A50772i8824a9640m13773D10214c04201I0472O8767n1434d6043B53041H0018
9457D4175b6161F3921a49122M5167I8506d64792e1990j18969P7866B08436B7567
9445G6880b47529J8745l503K0299K8561R427D1620a53079C1967a22518N8014o36
9433f5140l87800N7583b5332j1078l66162a04958o9244B4167P4878M9588b59528
9421b58939A24414B5248J30552b93559i4363j34039m7006H8849K8529a65762k3742
$$ y = [-168386, -16972, -89287, -244632, -53522, -59902, -40869, -2097, -159103, -125851, 262372, 56341, 66357, 199092, -139044, -78018, 2172, 340152, -37279, 22645, -558888, 3268, -137640, -19229, 34731, -7790, -56082, 63604, -95600, 16214, -177700, -312951, -63562, -19287, 195776, 150772, -98824, -19640, -433413, 410214, -304201, 90472, 159239, 107805, -46043, 253041, 80018, 44175, -26161, 63921, -149122, -103955, 98506, -464792, -51990, -170959, -93093, 208436, 27567, 76880, -247529, -228784, -232287, -211988, -183427, -174000, 41620, -153079, 31967, -122518, -64504, -65140, -452940, -395357, -25332, -36410, -402572, -104958, -174202, 24167, 99045, 148633, -259528, -258939, 124414, 25248, 155800, -293559, -94363, -228402, -275408, 88849, 117378, -165762, -189504]
9410a89504A24056b03123I879L3136b33422K3695L8674g022k77040C2496J9732
9399E2228a43639c1161H6878a55059k56641a04846r9976A66912b0261B3461b00472
9387A84174e30004B7577i3304c0282q2853K566r733A15442a14685p6333N8244
9376a32774e6902j91827A78542a89086D4290b05085H8540b82836e6195H0802N3354
9365A34156d1384m020B73371b03215e3360H2554g5359n3245j46542f1961G3133
9353d0229i531j8970k2159p4872K9441j13384g0412o6570l4321c3044k31440H1751
9340a79314k3326n8726G8452a08161A2059L4312b25706l317A31736J35484C8249
9328E6601b74687a8972A04951a8306k77158B02290E8666L2098J8296a53896n2000
$$ y = [-189504, 124056, -203123, 9879, 43015, -233422, -209727, -171053, -7022, -284062, 32496, 52228, -143639, -31161, 86878, -155059, -411700, -104846, -204822, 166912, -20261, 23461, -200472, 184174, -530004, 27577, -93304, -30282, -113135, -110569, -120302, 115442, -114685, -191018, -132774, -56902, -248729, 178542, -189086, 44290, -205085, 88540, -282836, -56195, 80802, 134156, -41384, -45404, 273371, -203215, -53360, 82554, -75359, -128604, -275146, -61961, 73133, -40229, -9531, -28501, -50660, -125532, -96091, -209475, -70412, -136982, -171303, -33044, -264484, 81751, -179314, -202640, -261366, 78452, -108161, 12059, 46371, -225706, -229023, 131736, 267220, 38249, 56601, -274687, -18972, 104951, -18306, -295464, 202290, 58666, 90764, 109060, -153896, -205896]
9317b05896i794r9388m5334O9811c6904r5646l5639q907a4007A30906c39815A61234
9304G4383a1478E4801a47528I3770e7615r6336M6936G7058A9654c12143C287d3410
9291b26477h3307B07445q0984a00453m0463p4315a4506a733m31082J53108B16222
9279b94194B9957O7095b65353J3658a04407L6774o5139p68A72050a9422I6804
9267b1496N891G9339a25024A01812a90903H614J2483d12646a29557k02290d9710
9255g5679B00354a96148A68121a20076a1306A5646J56465a06739m5348m7410B70730
9243a72543O9326j86216a18087k30483q3052A55588c06629J40117j24632J37472
9233a53672k6523a8542l8498J7615m4019L371I2513a3090j84373C3794b42877
$$ y = [-205896, -9794, -109182, -154516, -84705, -36904, -132550, -168189, -177096, -14007, 130906, -339815, 161234, 74383, -11478, 54801, -147528, 93770, -57615, -153951, -107015, 77058, 19654, -312143, 3287, -43410, -226477, -83307, 207445, 126461, -100453, -140916, -215231, -14506, -1733, -432815, -279707, 216222, -294194, 29957, 97052, -265353, -251695, -104407, -67633, -132772, -133540, 172050, -19422, 96804, -21496, -15605, 79339, -125024, 101812, -190903, 8614, 21097, -412646, -129557, -331847, -49710, -75679, 200354, -196148, 168121, -120076, -11306, 15646, 172111, -106739, -152087, -199497, 270730, -172543, -103217, -289433, -118087, -348570, -431622, 155588, -306629, -166512, -291144, -153672, -180195, -18542, -57040, -39425, -83444, -80073, 92513, -13090, -197463, 33794, -242877]
9221d4025B8727a22521E8713a72077A23298a23553j20422J15600H1495O7739b0089
9209C3233b32770e3767B37779j00409f9431k6626J2885q5713F4674b8711A51296
9197D7655A357e9382l3085m28722a60690r9491h7282j77261N7786D3501F598N7664
9185F4262J11277e2915O49G6938b94352J6852J38163A41302e8885a3876j70269
9174a84145N4039J3150c4834A77961b97804R0741h7287j02020P1874r6840E6916
9162b4602j55931N1785j03334C10775b71160a03321L8097H6572d52561i1542I5600
9150a20981j07288A23042d06116J84316C57852b37147j58087b5667r3782C4993
9139d6092j19926C76807G217a49324P2743A20707h9928j19709I2684k3346L981
$$ y = [-44025, 28727, -122521, 58713, -172077, 123298, -123553, -243975, -128375, 81495, 149234, -20089, 33233, -232770, -53767, 237779, 137370, -69431, -96057, -83172, -168885, 64674, -28711, 151296, 47655, 1357, -59382, -92467, -521189, -160690, -260181, -87282, -264543, -206757, 43501, 6598, 64262, 175539, -52915, -52266, 76938, -294352, -277500, -139337, 141302, -58885, -13876, -184145, -130106, -116956, -34834, 177961, -297804, -207063, -87287, -189307, -117433, -214273, 56916, -24602, -180533, -128748, -232082, 310775, -271160, -103321, -65224, 86572, -452561, -91542, 95600, -120981, -228269, 123042, -406116, -221800, 357852, -237147, -395234, -25667, -119449, 34993, -46092, -166018, 376807, 7217, -149324, -76581, 120707, -89928, -209637, 92684, 69338, 73319]
9128G3319J18932a4429E7901c40610J67323r6577e1614l6285j52413d4208j06384
9117a50592A3344a63782j9022A40423a24060o7161j01049O0128E0531B1002a68984
9105a36531r6405j00363H9425b24746H5569a2900j08984k24566d1089p342j6576
9094f5007j03375A30179b98293j19a38609e4950H5888a18442q4924H7488h8536
9082a72215A24489n6224c7671m8515q2715d3724q4556F5923g4128j48410a05319
9070A92119j6555o8375d03951c1357A01125k2575a81918c0293R298l2981j9738
9059g3714n048D9645a94805H5149a11002K8463L0222c475j22418E5588c02422
9047a0856j93569a00472k71011c7172A04355a68771b2460j04670c6554F8185c057
$$ y = [73319, 192251, -14429, 57901, -340610, -173287, -269864, -51614, -87899, -240312, -44208, -150592, 13344, -163782, -182804, 140423, -124060, -191221, -292270, -232142, 50531, 21002, -168984, -136531, -232936, -333299, 89425, -224746, 85569, -12900, -121884, -346450, -41089, -48431, -65007, -168382, 130179, -298293, -298412, -138609, -54950, 85888, -118442, -203366, 87488, -88536, -172215, 124489, 68265, -37671, -86186, -168901, -43724, -128280, 65923, -74128, -222538, -105319, 192119, 175564, 107189, -403951, -31357, 101125, 78550, -181918, -30293, -20995, -53976, -73714, -78762, 49645, -194805, 85149, -111002, -82539, -52317, -3475, -125893, 55588, -302422, -10856, -204425, -100472, -371483, -37172, 104355, -168771, -22460, -127130, -36554, 68185, -3057]
9035A0984a97671C0854b11422n724B04888m0025J6125C4603Q8829O1556H34d41822
9022a75848j57011k1716A84761H6881e5255o2406A74294b72682B06995a16256
9011a30435A8422h8798m2410a2158F057N5051J24241B2033e7234B09302i9598
8999e9320k9519j32774j53406g0614o6623l2576J4094b2406n371j43637o1849
8988b33263B61189a45398A36358a3765j7700j96449C20633b27131j42244a20040
8977B20415b45753l9550h0222A63647b25950J3255A5491b33831k19386i761r6717
8966a06478j20918k09758h5717j56628A21111a29009l4326N173A26459a42260
8955A19416b38525A71697n2735c73796a66349A12640j605c691p5809c933C1592
$$ y = [10984, -197671, 30854, -211422, -217146, 204888, 164863, 180988, 34603, 123432, 184988, 834, -441822, -175848, -332859, -354575, 184761, 86881, -55255, -117661, 174294, -272682, 206995, -116256, -130435, 18422, -88798, -131208, -12158, 6057, 61108, 185349, 22033, -57234, 209302, -99598, -59320, -88839, -221613, -375019, -70614, -137237, -169813, -155719, -22406, -27777, -171414, -233263, 261189, -145398, 136358, -13765, -31465, -227914, 320633, -227131, -369375, -120040, 220415, -245753, -285303, -80222, 163647, -225950, -212695, 15491, -233831, -453217, -9761, -106478, -227396, -437154, -85717, -242345, 121111, -129009, -163335, -158162, 126459, -142260, 119416, -238525, 171697, 118962, -373796, -166349, 112640, 111035, -3691, -79500, -3933, 31592]
8943B06445C0719J33265e7277l9175c0908B2404J33113b96572J1703A09924b04453
8931A53801d5890B35387b10675a0795p4074B49463M27609j9053R69422K848168
8921D475609r6586n97908A437486m78675l54960F5260b14376a02162H6896h6798
8910C71014b67539h923F6527c38576J56581B12085d2963F7197k4644K28490C6257
8898h6535C65320b46866O0888A35577M490B7766a5046p5285a7693l9350j2212
$$ y = [206445, 30719, 163984, -57277, -96452, -30908, 22404, 155517, -296572, -284869, 109924, -204453, 153801, -45890, 235387, -210675, -10795, -84869, 249463, 677072, 658019, 1627441, 4475609, 4379023, 3781115, 1437486, 958811, 603851, 65260, -214376, -102162, 86896, -86798, 371014, -267539, -8923, 66527, -338576, -181995, 212085, -42963, 67197, 42553, 271043, 36257, -86535, 365320, -246866, -185978, 135577, 140067, 27766, -15046, -90331, -17693, -57043, -69255]
$$ [...]
##END NTUPLES=NMR SPECTRUM
##END=
