##TITLE=AC1681_2977_8571555_gdJ5YHvhbD
##JCAMPDX= 6.0         $$ Bruker NMR JCAMP-DX V2.0
##DATA TYPE= NMR SPECTRUM
##DATA CLASS= NTUPLES
##ORIGIN= BRUKER
##OWNER= Administrator
$$ 1.72 TOPSPIN		Version 2.1
$$ 2014-04-10 18:01:06.028 -0700  Administrator@X
$$ Compression mode = diff/dup
##.OBSERVE FREQUENCY= 400.02188249412
##.OBSERVE NUCLEUS= ^1H
##.ACQUISITION MODE= SIMULTANEOUS (DQD)
##.ACQUISITION SCHEME= undefined
##.AVERAGES= 64
##.DIGITISER RES= 22
##SPECTROMETER/DATA SYSTEM= spect
##.PULSE SEQUENCE= noesygpps1d.comp
##.SOLVENT NAME= COFFEE_meoh
##.SHIFT REFERENCE= INTERNAL, COFFEE_meoh, 1, 14.96115
##AUDIT TRAIL= $$ (NUMBER, WHEN, WHO, WHERE, PROCESS, VERSION, WHAT)
$$ ##TITLE= Audit trail, TOPSPIN		Version 2.1
$$ ##JCAMPDX= 5.01
$$ ##ORIGIN= Bruker BioSpin GmbH
$$ ##OWNER= Administrator
$$ $$ E:\/data/COFFEE/nmr/AC1681_2977_8571555_gdJ5YHvhbD/12/pdata/1/auditp.txt
$$ ##AUDIT TRAIL=  $$ (NUMBER, WHEN, WHO, WHERE, PROCESS, VERSION, WHAT)
(   1,<2014-04-10 18:00:59.637 -0700>,<Administrator>,<X>,<go>,<TOPSPIN 2.1>,
      <created by zg
	started at 2014-04-10 17:49:29.523 -0700,
	POWCHK enabled, PULCHK disabled,
       configuration hash MD5:
       C8 4E 4E 5D D3 5C D8 9E 9F 52 82 E0 59 8A DE 15
       data hash MD5: 64K
       B2 07 C3 D0 69 D5 E3 04 05 1A 57 05 65 C5 07 88>)
(   2,<2014-04-10 18:01:03.231 -0700>,<Administrator>,<X>,<proc1d>,<TOPSPIN 2.1>,
      <Start of raw data processing
       efp LB = 0.3 FT_mod = 6 PKNL = 1 PHC0 = 0 PHC1 = 0 SI = 128K 
       data hash MD5: 128K
       72 F8 94 96 33 9D 72 9D DE 7A EF 6B 1F 65 E6 B5>)
(   3,<2014-04-10 18:01:04.278 -0700>,<Administrator>,<X>,<proc1d>,<TOPSPIN 2.1>,
      <pk PHC0 = -84.89685 PHC1 = 0 
       data hash MD5: 128K
       13 89 FB 1C 7A 06 2E F2 68 0F E4 A7 D5 54 12 DE>)
(   4,<2014-04-10 18:01:05.075 -0700>,<Administrator>,<X>,<proc1d>,<TOPSPIN 2.1>,
      <abs ABSG = 1 
       data hash MD5: 128K
       5B C9 34 01 EF CA 39 5E A0 98 40 86 AA D4 BC 31>)
(   5,<2014-04-10 18:01:05.231 -0700>,<Administrator>,<X>,<proc1d>,<TOPSPIN 2.1>,
      <abs ABSG = 2 
       data hash MD5: 128K
       12 D8 DC F6 DE AF 94 66 5A 9E 40 0A 7D 7E 90 32>)
(   6,<2014-04-10 18:01:05.387 -0700>,<Administrator>,<X>,<proc1d>,<TOPSPIN 2.1>,
      <abs ABSG = 3 
       data hash MD5: 128K
       01 21 96 D3 B9 09 18 A2 6A CE 63 7A 36 25 3C FC>)
(   7,<2014-04-10 18:01:05.559 -0700>,<Administrator>,<X>,<proc1d>,<TOPSPIN 2.1>,
      <abs ABSG = 4 
       data hash MD5: 128K
       6A ED 04 E5 99 0A 8D 35 4A 06 13 12 24 50 A4 26>)
(   8,<2014-04-10 18:01:05.669 -0700>,<Administrator>,<X>,<proc1d>,<TOPSPIN 2.1>,
      <abs ABSG = 5 
       data hash MD5: 128K
       33 69 A9 75 5E 49 6B 09 5C FB 3F 35 2A 05 55 0F>)
$$ ##END=
$$ 
$$ $$ hash MD5
$$ $$ 0B B6 D0 C3 D1 D8 94 17 5F 6E 03 FB E5 4F 54 AC
##$RELAX= 
##$RELAX= 
##$RELAX= 
##$RELAX= 
##$RELAX= 
##$RELAX= 
##$RELAX= 
##$RELAX= 
$$ Bruker specific parameters
$$ --------------------------
##$DU= <E:\>
##$EXPNO= 12
$$ [...]
##$TP07= 0
##$TPNAME0= <>
##$TPNAME1= <>
##$TPNAME2= <>
##$TPNAME3= <>
##$TPNAME4= <>
##$TPNAME5= <>
##$TPNAME6= <>
##$TPNAME7= <>
##$TPOAL= (0..7)
0.5 0.5 0.5 0.5 0.5 0.5 0.5 0.5
##$TPOFFS= (0..7)
0 0 0 0 0 0 0 0
##$TUNHIN= 0
##$TUNHOUT= 0
##$TUNXOUT= 0
##$USERA1= <user>
##$USERA2= <user>
##$USERA3= <user>
##$USERA4= <user>
##$USERA5= <user>
##$V9= 5
##$VALIST= <valist>
##$VCLIST= <CCCCCCCCCCCCCCC>
##$VD= 0
##$VDLIST= <DDDDDDDDDDDDDDD>
##$VPLIST= <PPPPPPPPPPPPPPP>
##$VTLIST= <TTTTTTTTTTTTTTT>
##$WBST= 1024
##$WBSW= 4
##$XGAIN= (0..3)
0 0 0 0
##$XL= 0
##$YL= 0
##$YMAX_a= 9312568
##$YMIN_a= -10713527
##$ZGOPTNS= <>
##$ZL1= 120
##$ZL2= 120
##$ZL3= 120
##$ZL4= 120
##$ABSF1= 14.96115
##$ABSF2= -5.597032
##$ABSG= 5
##$ABSL= 3
##$ALPHA= 0
##$AQORDER= 0
##$ASSFAC= 0
##$ASSFACI= 0
##$ASSFACX= 0
##$ASSWID= 0
##$AUNMP= <proc_prof1d_extract.lims>
##$AXLEFT= 0
##$AXNAME= <>
##$AXNUC= <1H>
##$AXRIGHT= 0
##$AXTYPE= 0
##$AXUNIT= <>
##$AZFE= 0.1
##$AZFW= 0.1
##$BCFW= 0
##$BC_mod= 0
##$BYTORDP= 0
##$COROFFS= 0
##$CY= 15
##$DATMOD= 1
##$DC= 0
##$DFILT= <>
##$DTYPP= 0
##$F1P= 0
##$F2P= 0
##$FCOR= 0.5
##$FTSIZE= 131072
##$FT_mod= 6
##$GAMMA= 0
##$GB= 0
##$INTBC= 1
##$INTSCL= 1
##$ISEN= 128
##$LB= 0.3
##$LEV0= 0
##$LPBIN= 0
##$MAXI= 10000
##$MC2= 0
##$MEAN= 0
##$ME_mod= 0
##$MI= 0
##$NCOEF= 0
##$NC_proc= -2
##$NLEV= 6
##$NOISF1= 0
##$NOISF2= 0
##$NSP= 0
##$NTH_PI= 0
##$NZP= 0
##$OFFSET= 14.96115
##$PC= 1
##$PHC0= -84.89685
##$PHC1= 0
##$PH_mod= 1
##$PKNL= yes
##$PPARMOD= 0
##$PPDIAG= 0
##$PPIPTYP= 0
##$PPMPNUM= 2147483647
##$PPRESOL= 1
##$PSCAL= 4
##$PSIGN= 0
##$PYNMP= <proc.py>
##$REVERSE= no
##$SF= 400.020009576933
##$SI= 131072
##$SIGF1= 0
##$SIGF2= 0
##$SINO= 400
##$SIOLD= 131072
##$SPECTYP= <>
##$SREGLST= <1H.CDCl3>
##$SSB= 0
##$STSI= 131072
##$STSR= 0
##$SW_p= 8223.68421052631
##$SYMM= 0
##$S_DEV= 0
##$TDeff= 65536
##$TDoff= 0
##$TI= <>
##$TILT= no
##$TM1= 0
##$TM2= 0
##$TOPLEV= 0
##$USERP1= <user>
##$USERP2= <user>
##$USERP3= <user>
##$USERP4= <user>
##$USERP5= <user>
##$WDW= 1
##$XDIM= 131072
##$YMAX_p= 236640219
##$YMIN_p= -422406455
##$CURPLOT= <Network HP LaserJet P1505>
##$CURPRIN= <$Network HP LaserJet P1505>
##$DFORMAT= <normdp>
##$LAYOUT= <+/1D_H.xwp>
##$LFORMAT= <normlp>
##$PFORMAT= <normpl>
##$SURQMSG= 1
$$ End of Bruker specific parameters
$$ ---------------------------------
##NTUPLES= NMR SPECTRUM
##VAR_NAME=  FREQUENCY,     SPECTRUM/REAL,   SPECTRUM/IMAG
##SYMBOL=    X,             R,               I
##VAR_TYPE=  INDEPENDENT,   DEPENDENT,       DEPENDENT
##VAR_FORM=  AFFN,          ASDF,            ASDF
##VAR_DIM=   131072,        131072,          131072
##UNITS=     HZ,            ARBITRARY UNITS, ARBITRARY UNITS
##FACTOR=    0.0627417313425164, 1,          1
##FIRST=     8223.62146879497, 5067,         -59311
##LAST=      0,             6061,            -59156
##MIN=       0,             -422406455,      0
##MAX=       8223.62146879497, 236640219,    0
$$ Real data points
##PAGE= N=1
##DATA TABLE= (X++(R..R)), XYDATA
$$ [...]
62560H64966k4061k1728j9497j8098j7492j6794j5240j3029j0986r578q616p737
$$ 864966 840905 819177 799680 781582 764090 747296 732056 719027 708041 698463 689847 682110
62548F82110o838o008n331m797m227l400k463j986k227k515j921n34N34N63P7
$$ 682110 675272 669264 663933 659136 654909 651509 649046 647060 644833 642318 640397 639863 640397 640960 641037
62533F41037J8O32J603K897M720O768Q198Q524Q232Q230Q899R912J0895J2084
$$ 641037 641055 641687 643290 646187 650907 657675 665873 674397 682629 690859 699758 709670 720565 732649
62519G32649J4106J7167K0666K3755K6187K8399L0842L3577L6450L9271M1711
$$ 732649 746755 763922 784588 808343 834530 862929 893771 927348 963798 1003069 1044780
62508A044780M3400M4315M4854M5340M5691M5673M5160M3991M1989L9322L6514
$$ 1044780 1088180 1132495 1177349 1222689 1268380 1314053 1359213 1403204 1445193 1484515 1521029
62497A521029L3811L0924K7684K4605K2338K0794J9219J6898J3511R181M587P17
$$ 1521029 1554840 1585764 1613448 1638053 1660391 1681185 1700404 1717302 1730813 1739994 1744581 1745298
62485A745298k102m767q510j3627j9502k5606l1755l7513m2145m5362m7634m9655
$$ 1745298 1743196 1738429 1729919 1716292 1696790 1671184 1639429 1601916 1559771 1514409 1466775 1417120
62473A417120n1761n3817n5207n5073n3135n0272m7759m5946m4156m1784l8828
$$ 1417120 1365359 1311542 1256335 1201262 1148127 1097855 1050096 1004150 959994 918210 879382
62462H79382l5461l1844k8419k5584k2991j9942j6705j4438j3491j2702j1009
$$ 879382 843921 812077 783658 758074 735083 715141 698436 683998 670507 657805 646796
62451F46796q896p468o736n818m459l342k957k957k753k202j510q78m15j83k36
$$ 646796 637900 630432 623696 617878 613419 610077 607120 604163 601410 599208 597698 596820 596405 596222 595986
62436E95986n99j144j578j742j907k380k852k696k026j762k353l101l211k897
$$ 595986 595387 594243 592665 590923 589016 586636 583784 581088 579062 577300 574947 571846 568635 565738
62422E65738k844l057l013k559k046j738j657j821k079k006j445q51o03l77K08
$$ 565738 562894 559837 556824 554265 552219 550481 548824 547003 544924 542918 541473 540622 540019 539642 539850
62407E39850P66P70O13J147K386L616M576N571O483O813O769P266Q524R697J0201
$$ 539850 540616 541386 541999 543146 545532 549148 553724 559295 565778 572591 579360 586626 595150 604847 615048
62392F15048J0445J0819J0905J0407R953J0155J0488R994Q709P587P151O998O586
$$ 615048 625493 636312 647217 657624 667577 677732 688220 698214 706923 714510 721661 728659 735245
62379G35245N901N206M613M065L533L183L356M250N575O776P684Q677J0075J1813
$$ 735245 741146 746352 750965 755030 758563 761746 765102 769352 774927 781703 789387 798064 808139 819952
62365H19952J3877J6578K0003K3610K6825K9693L2576L5477L8123M0485M2633
$$ 819952 833829 850407 870410 894020 920845 950538 983114 1018591 1056714 1097199 1139832
62354A139832M4247M4797M4167M2760M0968L8877L6453L3637L0237K6001K0778
$$ 1139832 1184079 1228876 1273043 1315803 1356771 1395648 1432101 1465738 1495975 1521976 1542754
62343A542754J4526P367o2o624j1602j5495j9463k4009k8655l2765l6145l8750
$$ 1542754 1557280 1564647 1564585 1557961 1546359 1530864 1511401 1487392 1458737 1425972 1389827 1351077
62331A351077m0395m1060m1068m0752m0165l9220l7861l5959l3516l0985k8996
$$ 1351077 1310682 1269622 1228554 1187802 1147637 1108417 1070556 1034597 1001081 970096 941100
62320I41100k7546k5887k3575k1107j9073j7175j4754j2064j0187r533r158p887
$$ 941100 913554 887667 864092 842985 823912 806737 791983 779919 769732 760199 751041 743154
62308G43154n688l454j831p29J40Q09J256J669K276L039L618L667L124K320J694
$$ 743154 737466 734012 732181 731452 731592 732401 733657 735326 737602 740641 744259 747926 751050 753370 755064
62293G55064J317P59l67j780k752k951k791k851l272l866m474m958n130n004m914
$$ 755064 756381 757140 756773 754993 752241 749290 746499 743648 740376 736510 732036 727078 721948 716944 712030
62278G12030n037m970m205k908j692p19M91K235M171N908P597R612J1967J4447
$$ 712030 706993 702023 697818 694910 693218 692499 692990 695225 699396 705304 712901 722513 734480 748927
62264G48927J7070K0017K3212K6332K9247L2120L5035L7729L9816M1159M1846
$$ 748927 765997 786014 809226 835558 864805 896925 931960 969689 1009505 1050664 1092510
62253A092510M1794M0618L8031L4406L0535K6744K2533J7375J1564N779J89n445
$$ 1092510 1134304 1174922 1212953 1247359 1277894 1304638 1327171 1344546 1356110 1361889 1362078 1356633
62241A356633j0878j5529j9493k3535k7713l0951l2553l3283l4186l4984l4698
$$ 1356633 1345755 1330226 1310733 1287198 1259485 1228534 1195981 1162698 1128512 1093528 1058830
62230A058830l3400l2152l1327l0140k8075k5745k3927k2491k0888j9060j7330
$$ 1058830 1025430 993278 961951 931811 903736 877991 854064 831573 810685 791625 774295
62219G74295j5778j4229j2623j1030r463q002o893o186n502m425l095k050j521
$$ 774295 758517 744288 731665 720635 711172 703170 696277 690091 684589 680164 677069 675019 673498
62206F73498j140m21N68J213J120P91J197K555L918M378M267M611N624O622P273
$$ 673498 672358 671937 672505 673718 674838 675629 676826 679381 683299 687677 691944 696555 702179 708801 716074
62191G16074Q010Q951R415R040Q556Q756R314R388Q831Q044P078N804M653M212
$$ 716074 724084 733035 742450 751490 760046 768802 778116 787504 796335 804379 811457 817261 821914 826126
62177H26126M284M246M251N095O838Q625J0103J1995J4822J7960K0541K2550K4325
$$ 826126 830410 834656 838907 844002 850840 859465 869568 881563 896385 914345 934886 957436 981761
62164I81761K5669K6286K6559K6927K6820K5169K2001J8589J5847J3321J0138
$$ 981761 1007430 1033716 1060275 1087202 1114022 1139191 1161192 1179781 1195628 1208949 1219087
62153A219087O253K237j706n859j0205j4070j6789j8411j9497k0390k0948k1043
$$ 1219087 1225340 1227577 1225871 1220012 1209807 1195737 1178948 1160537 1141040 1120650 1099702 1078659
62141A078659k0963k0975k0692j9388j7030j4557j2791j1427r522o771l687p28
$$ 1078659 1057696 1036721 1016029 996641 979611 965054 952263 940836 931314 924543 920856 920128
62129I20128K207N248Q114J0547J2818J5400J8296K1063K3424K5455K7188K8342
$$ 920128 922335 927583 935697 946244 959062 974462 992758 1013821 1037245 1062700 1089888 1118230
62117A118230K8656K8283K7647K6913K5852K4290K2508K0985J9781J8439J6585
$$ 1118230 1146886 1175169 1202816 1229729 1255581 1279871 1302379 1323364 1343145 1361584 1378169
62106A378169J4363J2113R860P455N143L554L115L640M650N799O934P962Q842
$$ 1378169 1392532 1404645 1414505 1421960 1427103 1430657 1433772 1437412 1442062 1447861 1454795 1462757 1471599
62093A471599R528R857R649R059Q605Q645Q949R019Q657Q099P745Q024R289J1413
$$ 1471599 1481127 1490984 1500633 1509692 1518297 1526942 1535891 1544910 1553567 1561666 1569411 1577435 1586724 1598137
62079A598137J3574J4885J5367J5966J7404J9361K0969K1802K1988K1639K0617
$$ 1598137 1611711 1626596 1641963 1657929 1675333 1694694 1715663 1737465 1759453 1781092 1801709
62068A801709J8881J6707J4439J2242J0135Q003N624K973N45j009j791k743m546
$$ 1801709 1820590 1837297 1851736 1863978 1874113 1882116 1887740 1890713 1891258 1890249 1888458 1885715 1881169
62055A881169o775q532r636j0553j1438j1966j2161j2690j3955j5503j6770j7973
$$ 1881169 1874394 1865862 1856226 1845673 1834235 1822269 1810108 1797418 1783463 1767960 1751190 1733217
62043A733217j9755k2242k5033k7961l1282l5025l8545m0920m1676m1184m0434
$$ 1733217 1713462 1691220 1666187 1638226 1606944 1571919 1533374 1492454 1450778 1409594 1369160
62032A369160m0249m0447l9992l8285l6051l4531l3915l3206l1565k9231k6971
$$ 1369160 1328911 1288464 1248472 1210187 1174136 1139605 1105690 1072484 1040919 1011688 984717
62021I84717k5106k3391k1530j9489j7538j6075j5200j4416j3028j0973q890p255
$$ 984717 959611 936220 914690 895201 877663 861588 846388 831972 818944 807971 799081 791826
62009G91826n847m264k505p80R44K734M312N226N328M804L886K827J943J327O30
$$ 791826 785979 781715 779210 778430 779374 782108 786420 791646 796974 801778 805664 808491 810434 811761 812391
61994H12391o43k566m709o499p592q079q463r237j0290j1000j1063j0866j0803
$$ 812391 811748 809182 804473 797974 790382 782303 773840 764603 754313 743313 732250 721384 710581
61981G10581j0643j0053r330q991q803q012o506n061m257l757k981k003j396j412
$$ 710581 699938 689885 680555 671564 662761 654749 648243 643182 638925 635168 632187 630184 628788 627376
61967F27376j765k032j982j535p18K98J242J933K395K809L325L948M628N431O531
$$ 627376 625611 623579 621597 620062 619344 619642 620884 622817 625212 628021 631346 635294 639922 645353 651884
61952F51884P953R511J1076J2784J4801J6985J9014K0737K2271K3728K5120K6450
$$ 651884 659837 669348 680424 693208 708009 724994 744008 764745 787016 810744 835864 862314
61940H62314K7736K8940K9977L0791L1312L1431L1071L0211K8762K6592K3802
$$ 862314 890050 918990 948967 979758 1011070 1042501 1073572 1103783 1132545 1159137 1182939
61929A182939K0746J7638J4411J1172Q384O269M341K057k92j863k340k162j730
$$ 1182939 1203685 1221323 1235734 1246906 1255290 1261559 1265900 1267957 1267665 1265802 1263462 1261300 1259570
61916A259570r13O03K882N752Q842J1582J3614J5167J6591J7549J7219J5390J2741
$$ 1259570 1258657 1259260 1262142 1267894 1276736 1288318 1301932 1317099 1333690 1351239 1368458 1383848 1396589
61903A396589R852O567K670j371m859p774j0672j3819j6747j8712j9455j9544
$$ 1396589 1406441 1413008 1415678 1414307 1409448 1401674 1391002 1377183 1360436 1341724 1322269 1302725
61891A302725k0016k1474k3429k4772k4881k4095k3208k2794k2995k3480k3523
$$ 1302725 1282709 1261235 1237806 1213034 1188153 1164058 1140850 1118056 1095061 1071581 1048058
61880A048058k2593k0918j9100j7232j4962j2438j0415r188q136o714n165l794
$$ 1048058 1025465 1004547 985447 968215 953253 940815 930400 921212 913076 906362 901197 897403
61868H97403k210P3K822N487P946J0284J2415J4506J7285K1063K4991K8155L1015
$$ 897403 895193 895266 898088 903575 911521 921805 934220 948726 966011 987074 1012065 1040220 1071235
61855A071235L4651L8896M2457M4770M6552M8293M9413M9345M8373M6797M4199
$$ 1071235 1105886 1144782 1187239 1232009 1278561 1326854 1376267 1425612 1473985 1520782 1564981
61844A564981M0292L5692L1115K6340K0842J4992R749N433J742j156k469j946
$$ 1564981 1605273 1640965 1672080 1698420 1719262 1734254 1744003 1749436 1751178 1750022 1747553 1745607
61832A745607l83J363L241N490P734R223R751R706R185P621M573M71l815q054
$$ 1745607 1745224 1746587 1749828 1755318 1763052 1772275 1782026 1791732 1800917 1808538 1813111 1813582 1809767 1801713
61818A801713j2725j7990k3089k7150l0295l3377l6689l9447m0766m0693l9964
$$ 1801713 1788988 1770998 1747909 1720759 1690464 1657087 1620398 1580951 1540185 1499492 1459528
61807A459528l9016l7744l6126l4574l3437l2432l0931k8724k6262k4060k2207
$$ 1459528 1420512 1382768 1346642 1312068 1278631 1246199 1215268 1186544 1160282 1136222 1114015
61796A114015k0544j9088j7934j6872j5536j3933j2526j1617j1038j0506j0015
$$ 1114015 1093471 1074383 1056449 1039577 1024041 1010108 997582 985965 974927 964421 954406
61785I54406r551q820p593o098m752l614k536j647j259j315j371j113n64K42J313
$$ 954406 944855 936035 928442 922344 917592 913978 911442 909795 908536 907221 905850 904737 904173 904415 905728
61770I05728K396L058L286L637M572N859O799O892O147N039M308M483N339N929
$$ 905728 908124 911182 914468 918105 922677 928536 935335 942227 948374 953413 957721 962204 967543 973472
61756I73472N416L856K091R07L50k37j468l170m456m735m423m337m576m504l870
$$ 973472 978888 982744 984835 985742 986092 985855 984387 981217 976761 972026 967603 963266 958690 954186 950316
61741I50316l248l153l287l064k413j670j005m05Q1N06J202K315L387L889L973
$$ 950316 947068 943915 940628 937564 935151 933481 932476 932071 932152 932658 933860 936175 939562 943451 947424
61726I47424M161M447M299L570K835K706L161L664L644K816J411Q6p40j388k390
$$ 947424 951585 956032 960331 963901 966736 969442 972603 976267 979911 982727 984138 984224 983484 982096 979706
61711I79706l552m129l970l857m419n330n927o066n950n573m874m140l707l453
$$ 979706 976154 972025 968055 964198 959779 954449 948522 942456 936506 930933 926059 921919 918212 914759
61697I14759l051k513k122j969j936j957j892j401m31M21N46K00J42O20J228J713
$$ 914759 911708 909195 907073 905104 903168 901211 899319 897918 897487 897908 898454 898654 898796 899416 900644 902357
61681I02357K189K580K648K582K866L381L506L301L677M922N955N776M876M349
$$ 902357 904546 907126 909774 912356 915222 918603 922109 925410 929087 934009 939964 945740 950616 954965
61667I54965M204L597K354J234P25N15J95l24j153k334l362l532k986k651k976
$$ 954965 959169 962766 965120 966354 967079 967594 967789 967465 966312 963978 960616 957084 954098 951447 948471
61652I48471l470l760m190m935n325m772l802l320l324l115k637k671l612m819
$$ 948471 945001 941241 937051 932116 926791 922019 918217 914897 911573 908458 905821 903150 899538 894719
61638H94719n485n619n820o336o808o835o466o032n729n505n293n114m853m206
$$ 894719 889234 883615 877795 871459 864651 857816 851350 845318 839589 834084 828791 823677 818824 814618
61624H14618l068j801q93m68l74o17j331k342l231l816m249m610m898n334o156
$$ 814618 811550 809749 808856 808388 808014 807397 806066 803724 800493 796677 792428 787818 782920 777586 771430
61609G71430p019p271o961o929p534q062p845p286p091p079o575n699n308n778
$$ 771430 764411 757140 750179 743250 735716 727654 719809 712523 705432 698353 691778 686079 680771 674993
61595F74993o541o900o700o140n512n132n041m773l933l003k963m016n144n248
$$ 674993 668452 661552 654852 648712 643200 638068 633027 628254 624321 621318 618355 614339 609195 603947
61581F03947m259l004k308k397k878l137k899k505k394k424k090j376q80r68j263
$$ 603947 599688 596684 594376 591979 589101 585964 583065 580560 578166 575742 573652 572276 571396 570428 569165
61566E69165j224q55n87o81j006j228j068n68j71l66j100j742j746j154m17N5
$$ 569165 567941 567086 566499 565818 564812 563584 562516 561948 561777 561411 560311 558569 556823 555669 555252 555307
61550E55307Q2k15l77J12J223K243K437J807J067Q43J090J334J333J300J390J233
$$ 555307 555389 555174 554797 554909 556132 558375 560812 562619 563686 564529 565619 566953 568286 569586 570976 572209
61534E72209L39j050k042k190k078k393k936l041k676k398k425k479k497k774
$$ 572209 572548 571498 569456 567266 565188 562795 559859 556818 554142 551744 549319 546840 544343 541569
61520E41569l245l365k901k284j918j692j542j847k804l843m184l768l178k775
$$ 541569 538324 534959 532058 529774 527856 526164 524622 522775 519971 516128 511944 508176 504998 502223
61506E02223k389j803j172p96o95n56j73J72qo24q44j28R03J188O72L13O40J118
$$ 502223 499834 498031 496859 496063 495368 494812 494639 494811 494803 494179 493335 493207 494110 495298 495970 496283 496923 498041
61488D98041J211J273J800K444K479J910J474J543J693J400P89N29J021J807J956
$$ 498041 499252 500525 502325 504769 507248 509158 510632 512175 513868 515268 516057 516586 517607 519414 521370
61473E21370J159K09k3J43l23j507k296j980j171o05K5J180K248K227J276M40
$$ 521370 522529 522738 522715 522858 522535 521028 518732 516752 515581 514976 515001 516181 518429 520656 521932 522372
61457E22372J21j50n09m39J87P37Q25Q70J220J499J305R89J183J884K583L012
$$ 522372 522493 522343 521834 521395 521582 522319 523144 524014 525234 526733 528038 529027 530210 532094 534677 537689
61441E37689L271L381L189K737K416K612L298L967M082L634L234L432M014M308
$$ 537689 540960 544341 547530 550267 552683 555295 558593 562560 566642 570276 573510 576942 580956 585264
61427E85264M113L896L973M035L674K968K164J202K3r06r84l87j9m83j483k300
$$ 585264 589377 593273 597246 601281 604955 607923 610087 611289 611312 610406 609422 609035 609016 608533 607050 604750
61411F04750k580k517k569l169m357n567o021n530m753m400m466m468m182l803
$$ 604750 602170 599653 597084 593915 589558 583991 577970 572440 567687 563287 558821 554353 550171 546368
61397E46368l539l420l394l263k665j562n93l40l55L48J672K216J130n47j157
$$ 546368 542829 539409 536015 532752 530087 528525 527932 527592 527237 527585 529257 531473 532603 532056 530899
61382E30899m54M32P47Q19J107J496J783K115K603L018L147L080K927K665K362
$$ 530899 530445 530877 531624 532443 533550 535046 536829 538944 541547 544565 547712 550792 553719 556384 558746
61367E58746K288K584L148L887M735N432N722N795O086O544O731O729P283Q747
$$ 558746 561034 563618 566766 570653 575388 580820 586542 592337 598423 604967 611698 618427 625710 634457
61353F34457J0563J2042J3154J4088J4669J4780J4909J5603J6584J6924J6061
$$ 634457 645020 657062 670216 684304 698973 713753 728662 744265 760849 777773 793834
61342G93834J4265J2245J0484Q880O900M309J679k82j838l917o529q397q667q127
$$ 793834 808099 820344 830828 839708 846608 850917 852596 852314 850476 846559 840030 831633 822966 814839
61328H14839p997q243q031p312o855o914o856o157n005l857l031k667k550j984
$$ 814839 806842 798599 790568 783256 776401 769487 762631 756474 751469 747612 744581 741914 739364 737380
61314G37380n44J125J922J686J391J829K851M013N263O665P982Q849R140Q933
$$ 737380 736836 737961 739883 741569 742960 744789 747640 751653 756916 763581 771563 780412 789552 798485
61300G98485Q406P852P495P139O232M458K109j18j631k321k645l219m140m926
$$ 798485 806891 814743 822238 829377 835609 840067 842176 842058 840427 838106 835461 832242 828102 823176
61286H23176n152m879m260l254k103j530j876k371j953n21J145K470L414M052
$$ 823176 818024 813145 808885 805631 803528 801998 800122 797751 795798 795277 796422 798892 802306 806358
61272H06358M562N456P101R079J0705J1958J3337J5025J6927J9111K1357K2634
$$ 806358 810920 816376 823477 832556 843261 855219 868556 883581 900508 919619 940976 963610
61260I63610K2209K1010K0658K1210K1111J9464J6935J4198J0982P190L559M44
$$ 963610 985819 1006829 1027487 1048697 1069808 1089272 1106207 1120405 1131387 1138577 1142136 1142580
61248A142580k886o869j0684j3446j5415j7074j7994j7656j6533j5304j3748j1581
$$ 1142580 1139694 1132825 1122141 1108695 1093280 1076206 1058212 1040556 1024023 1008719 994971 983390
61236I83390r659q930q683p281m494j725P6J402K901M285N014N202N293N349N188
$$ 983390 973731 964801 956118 948837 944343 942618 942694 944096 946997 951282 956296 961498 966791 972140 977328
61221I77328M801M399M259M577N226N732N841N987O705P721Q284Q338Q664R793
$$ 977328 982129 986528 990787 995364 1000590 1006322 1012163 1018150 1024855 1032576 1040860 1049198 1057862 1067655
61207A067655J1410J2987J4389J5573J6334J6779J7531J9039K0949K2590K3819
$$ 1067655 1079065 1092052 1106441 1122014 1138348 1155127 1172658 1191697 1212646 1235236 1259055
61196A259055K5025K6407K7679K8450K8632K8411K7926K7101K5727K3730K1290
$$ 1259055 1284080 1310487 1338166 1366616 1395248 1423659 1451585 1478686 1504413 1528143 1549433
61185A549433J8611J5703J2460Q930N274J563k166n702q829j1747j4976j8657
$$ 1549433 1568044 1583747 1596207 1605137 1610411 1611974 1609808 1604106 1595277 1583530 1568554 1549897
61173A549897k2205k4934k6818k8378k9903l1201l2094l2715l3075l2693l1138
$$ 1549897 1527692 1502758 1475940 1447562 1417659 1386458 1354364 1321649 1288574 1255881 1224743
61162A224743k8797k6530k4599k2493k0020j7833j6419j5110j2904r970p468n904
$$ 1224743 1195946 1169416 1144817 1122324 1102304 1084471 1068052 1052942 1040038 1030068 1022600 1016696
61150A016696m527k517l5K248M098N801P644R623J1372J2315J2309J2079J2516
$$ 1016696 1012169 1009652 1009617 1011865 1015963 1021764 1029408 1039031 1050403 1062718 1075027 1087106 1099622
61137A099622J3536J4359J4958J6275J8698K1304K3222K4823K6841K9175L1426
$$ 1099622 1113158 1127517 1142475 1158750 1177448 1198752 1221974 1246797 1273638 1302813 1334239
61126A334239L3836L6600L8866L9625L9249L8999L9213L9117L8312L7226L5968
$$ 1334239 1368075 1404675 1443541 1483166 1522415 1561414 1600627 1639744 1678056 1715282 1751250
61115A751250L3965L0996K7627K4237K0424J5806J0698N594O44m066q259j1928
$$ 1751250 1785215 1816211 1843838 1868075 1888499 1904305 1915003 1920597 1921241 1917175 1908916 1896988
61103A896988j5446j9018k2476k5841k9389l2935l5760l7681l9476m1728m3779
$$ 1896988 1881542 1862524 1840048 1814207 1784818 1751883 1716123 1678442 1638966 1597238 1553459
61092A553459m4510m3814m2655m1843m1267m0285l8496l6101l3634l1319k8796
$$ 1553459 1508949 1465135 1422480 1380637 1339370 1299085 1260589 1224488 1190854 1159535 1130739
61081A130739k5753k2665k0350j8794j7145j4982j2882j1369j0076q418o480m667
$$ 1130739 1104986 1082321 1061971 1043177 1026032 1011050 998168 986799 976723 968305 961825 957158
61069I57158l022j437n3J152K692M811O892Q363R679J1600J3877J5664J7034J8982
$$ 957158 954136 952699 952646 953798 956490 961301 968193 976556 986235 997835 1011712 1027376 1044410 1063392
61055A063392K1825K4653K6619K7895K8988K9947L0713L1541L2460L2816L2027
$$ 1063392 1085217 1109870 1136489 1164384 1193372 1223319 1254032 1285573 1318033 1350849 1382876
61044A382876L0563K9506K9296K9267K8487K6624K4019K1231J8598J6111J3582
$$ 1382876 1413439 1442945 1472241 1501508 1529995 1556619 1580638 1601869 1620467 1636578 1650160
61033A650160J0945Q400O251M601L283K018P28k60m13M68J960L496M969O782R368
$$ 1650160 1661105 1669505 1675756 1680357 1683640 1685658 1686386 1686126 1685713 1686181 1688141 1691637 1696606 1703388 1712756
61018A712756J2825J6913K1095K4857K8350L2559L8344M5387N2643N9742O7283
$$ 1712756 1725581 1742494 1763589 1788446 1816796 1849355 1887699 1933086 1985729 2045471 2112754
61007B112754P5712Q4691R3997J04285J16517J31171J48601J69712J95658K27220
$$ 2112754 2188466 2273157 2367154 2471439 2587956 2719127 2867728 3037440 3233098 3460318
60997C460318K65055L10294L64446M29251N07237O01838P16032Q50946J005632
$$ 3460318 3725373 4035667 4400113 4829364 5336601 5938439 6654471 7505417 8511049
60988H511049J175259J345356J487718J567947J564748J485835J365111J242987
$$ 8511049 9686308 11031664 12519382 14087329 15652077 17137912 18503023 19746010
60980A9746010J146423J080783J031722R70757Q64627O90520M50516J72986j02152
$$ 19746010 20892433 21973216 23004938 23975695 24840322 25530842 25981358 26154344 26052192
60971B6052192l42617n33891o78908p94301r04988j032681j180337j325835j434356
$$ 26052192 25709575 25175684 24496776 23702475 22797487 21764806 20584469 19258634 17824278
60962A7824278j480742j462485j394924j298086j188135j076094r68840q69656
$$ 17824278 16343536 14881051 13486127 12188041 10999906 9923812 8954972 8085316
60954H085316p79268o97411o23397n55940m93791m36778l85534l40172k99895
$$ 8085316 7306048 6608637 5985240 5429300 4935509 4498731 4113197 3773025 3473130
60945C473130k63902k31902k03725j79233j58631j42081j28721j16863j05509
$$ 3473130 3209228 2977326 2773601 2594368 2435737 2293656 2164935 2048072 1942563
60936A942563r5079q6389p9496p3898o9232o5189o1135n6496n1443m6722m2791
$$ 1942563 1847484 1761095 1681599 1607701 1538469 1473280 1412145 1355649 1304206 1257484 1214693
60925A214693l9349l5773l1786k7712k4060k0927j8009j5232j3085j1945j1354
$$ 1214693 1175344 1139571 1107785 1080073 1056013 1035086 1017077 1001845 988760 976815 965461
60914I65461j0502r301q417q225q359q366q223q022p755p575p720p938p626o760
$$ 965461 954959 945658 937241 929016 920657 912291 904068 896046 888291 880716 872996 865058 857432 850672
60900H50672o103o156o482o461o077n557m781l668k640k098j850j566j423j681
$$ 850672 844569 838413 831931 825470 819393 813836 809055 805387 802747 800649 798799 797233 795810 794129
60886G94129j978j768j132o23n35r18j966l671n300n963n667n136m780m434m050
$$ 794129 792151 790383 789251 788628 788093 787175 785209 781538 776238 770275 764608 759472 754692 750258 746208
60871G46208l863l812l511k871k233j808j501j302j273j120m13P14J622J969J963
$$ 746208 742345 738533 735022 732151 729918 728110 726609 725307 724034 722914 722501 723215 724837 726806 728769
60856G28769J828J723K167L717N931P439P527O975O906P401P814P892P847P659
$$ 728769 730597 732320 734487 738204 744135 751574 759101 766076 772982 780383 788197 796089 803936 811595
60842H11595P121O487O350O727O801N910M427L258K656J944N19j149j998j737
$$ 811595 818716 825203 831553 838280 845081 850991 855418 858676 861332 863276 863795 862646 860648 858911
60828H58911j224j291j706j738j358j211j662k497l502m590n323n156m387m132
$$ 858911 857687 856396 854690 852952 851594 850383 848721 846224 842722 838132 832809 827653 823266 819134
60814H19134m985o316p225p611p776p651p114o640o874p679q272q187p610o895
$$ 819134 814149 807833 800608 792997 785221 777570 770456 763816 756942 749263 740991 732804 725194 718299
60800G18299o343o313o913p525p268o068m792m135l898l519k837j994j049r9N41
$$ 718299 711956 705643 698730 691205 683937 677869 673077 668942 665044 661525 658688 656694 655645 655546 656087
60785F56087P11P59J061J340J039L72L16J317K557L001K798K975L872M713M841
$$ 656087 656798 657557 658618 659958 660997 661369 661685 663002 665559 668560 671358 674333 678205 682918 687759
60770F87759M771N431O823Q046Q435Q210P895P688P536P460P511P589P473O993
$$ 687759 692530 697961 704784 712830 721265 729475 737370 745058 752594 760054 767565 775154 782627 789620
60756G89620O135N120M383M197M331M238L743L246L084K959K247Q02q10j897k301
$$ 789620 795755 800875 805258 809455 813786 818024 821767 825013 828097 831056 833303 834105 833295 831398 829097
60741H29097k495l121m443o140p590q383q598q611q651q569q062p170o435o396
$$ 829097 826602 823481 819038 812898 805308 796925 788327 779716 771065 762496 754434 747264 740829 734433
60727G34433o942p348p073o273n435m689l823k815k007j683j688j599j135l13
$$ 734433 727491 720143 713070 706797 701362 696673 692850 690035 688028 686345 684657 683058 681923 681610
60713F81610O39J477K100K558K939L346L953M901N986O632O436N671N066N108
$$ 681610 682249 683726 685826 688384 691323 694669 698622 703523 709509 716141 722577 728248 733314 738422
60699G38422N682O321O678O731O642O419N828M752L574K866K661K424J770Q14
$$ 738422 744104 750425 757103 763834 770476 776895 782723 787475 791049 793915 796576 799000 800770 801584
60685H01584l03j598k681k701j425J78J086J453J975K566K680K622L347M865O023
$$ 801584 801281 799683 797002 794301 792876 793054 794140 795593 797568 800134 802814 805436 808783 813648 819671
60670H19671O127N862O133O941P856Q850R930J0644J0709J0745J1662J3472J5279
$$ 819671 825798 831660 837793 844734 852590 861440 871370 882014 892723 903468 915130 928602 943881
60657I43881J6341J6688J6765J6936J7330J7870J8388J8809J9202J9543J9616
$$ 943881 960222 976910 993675 1010611 1027941 1045811 1064199 1083008 1102210 1121753 1141369
60646A141369J9294J8742J8243J7933J7735J7358J6395J4691J2682J0995R684
$$ 1141369 1160663 1179405 1197648 1215581 1233316 1250674 1267069 1281760 1294442 1305437 1315121
60635A315121Q196O174L945K019N62n43j452k453l871n634p189q133q680r314
$$ 1315121 1323317 1329491 1333436 1335455 1336017 1335474 1334022 1331569 1327698 1322064 1314875 1306742 1298062 1288748
60621A288748j0278j1569j3103j4658j5918j6820j7648j8612j9563k0248k0519
$$ 1288748 1278470 1266901 1253798 1239140 1223222 1206402 1188754 1170142 1150579 1130331 1109812
60610A109812k0262j9449j8494j8061j8258j8387j7765j6490j5108j3962j3202
$$ 1109812 1089550 1070101 1051607 1033546 1015288 996901 979136 962646 947538 933576 920374
60599I20374j3057j3564j4142j3916j2499j0375q481p560p666q186q411q124p523
$$ 920374 907317 893753 879611 865695 853196 842821 834340 826780 819114 810928 802517 794393 786870
60586G86870o791n983n335n102n133n022m667m227l578k514j461j209j707j897
$$ 786870 780079 774096 768761 763659 758526 753504 748837 744610 741032 738518 737057 735848 734141 732244
60572G32244j158o5P13J477K801M410N591O294P088Q319R848J1350J2317J2144
$$ 732244 731086 731021 731734 733211 736012 740422 746013 752307 759395 767714 777562 788912 801229 813373
60558H13373J0810R238Q363Q048P419O023M155K222L95j229k554l542m047l874
$$ 813373 824183 833421 841784 849832 857251 863274 867429 869651 870046 868817 866263 862721 858674 854800
60544H54800l203k607k311j853p95O36K091L745N860Q178J0252J1930J2932J2566
$$ 854800 851597 848990 846679 844826 844031 844667 846758 850503 856363 864541 874793 886723 899655 912221
60530I12221J0609Q077O216N082L868K288P23p51k455m277n615o198o269n958
$$ 912221 922830 930907 937123 942205 946073 948361 949084 948333 945878 941601 935986 929788 923519 917561
60516I17561n226m352l744l241k360j208m36j97J16R98K321L784N230O459P346
$$ 917561 912335 907983 904239 900998 898638 897430 896994 896797 896913 897911 900232 904016 909246 915705 923051
60501I23051Q271R824J2082J4617J7247K0185K3524K7191L1311L5920M0310M3500
$$ 923051 931322 941146 953228 967845 985092 1005277 1028801 1055992 1087303 1123223 1163533 1207033
60489A207033M5380M6635M7402M6809M4110L9449L3285K5778J7169Q055j125j0370
$$ 1207033 1252413 1299048 1346450 1393259 1437369 1476818 1510103 1535881 1553050 1561105 1559980 1549610
60477A549610j9494k7723l4367l9441m3310m6013m7420m7640m6949m5443m3106
$$ 1549610 1530116 1502393 1468026 1428585 1385275 1339262 1291842 1244202 1197253 1151810 1108704
60466A108704m0088l6799l3749l1305k9396k7510k5237k2713k0295j8007j5714
$$ 1108704 1068616 1031817 998068 966763 937367 909857 884620 861907 841612 823605 807891
60455H07891j3651j2259j1561j1158j0734j0115r072p647o444n938n688m969m014
$$ 807891 794240 781981 770420 759262 748528 738413 729341 721694 715250 709312 703624 698655 694641
60442F94641l711m176m544m236l526k722j795r84q28j261j543j438j548k106k368
$$ 694641 690930 686754 682210 677974 674448 671726 669931 668947 668119 666858 665315 663877 662329 660223 657855
60427F57855j783q80l86j91J48N11N46M25O01J070J396J237N52l62q81n57K24
$$ 657855 656072 655192 654806 654615 654763 655274 655820 656245 656846 657916 659312 660549 661101 660739 659858 659301 659525
60410F59525O43O66J022J856K357K139J957K393K839K587K065J987K085J819J649
$$ 659525 660168 660834 661856 663712 666069 668208 670165 672558 675397 677984 680049 682036 684121 685940 687589
60395F87589K384L547L736K568J193P63J264K004K472K503K231K099K418K851
$$ 687589 689973 693520 697256 699824 701017 701780 703044 705048 707520 710023 712254 714353 716771 719622
60381G19622K791K186J575J309J314J569K154K789K901K393J860J755J810J556
$$ 719622 722413 724599 726174 727483 728797 730366 732520 735309 738210 740603 742463 744218 746028 747584
60367G47584J143J229K089L114L318K314P36l79m95K12J298K354K979K957K577
$$ 747584 748727 749956 752045 755159 758477 760791 761527 761148 760653 760865 762163 764517 767496 770453 773030
60352G73030K418K672L038L325L665M020M059L778L709M225N064N870O698P638
$$ 773030 775448 778120 781158 784483 788148 792168 796227 800005 803714 807939 813003 818873 825571 833209
60338H33209Q398Q626Q248P245N658M055L220K959J918o67l734n615n975n738
$$ 833209 841607 850233 858481 865726 871384 875439 878659 881618 883536 882869 879135 873520 867545 861807
60324H61807n630n713n967o355o452n837m801l929l172k033n45P36J615K358K987
$$ 861807 856177 850464 844497 838142 831690 825853 821052 817123 813951 811918 811373 812109 813724 816082 819069
60309H19069L313L644M734O820R366J1857J4302J6769J8935K0280K0533J9849
$$ 819069 822382 826026 830760 837580 846946 858803 873105 889874 908809 929089 949622 969471
60297I69471J8775J7730J6314J3560R338M912J414j645n384r512j2573j4033j4753
$$ 969471 988246 1005976 1022290 1035850 1045188 1050100 1051514 1049869 1044485 1034973 1022400 1008367 993614
60284I93614j5352j5370j4512j3402j2533j1370r399p235n873n335m854m089l475
$$ 993614 978262 962892 948380 934978 922445 911075 901676 894441 888568 883233 878379 874290 870815
60271H70815l515m191n079n708n889n862n974o242o475o675o892o759n905m813
$$ 870815 867300 863109 858030 852322 846433 840571 834597 828355 821880 815205 808313 801554 795649 790836
60257G90836m493n063n440m842l825l237k962k385j566j042p80k77M27O80K91
$$ 790836 786343 781280 775840 770998 767173 763936 760974 758589 757023 755981 755201 754924 755351 756031 756322
60242G56322m8K90J052J554J630J743K284L054L562L682L717L804L511K501J452
$$ 756322 756274 756564 757616 759170 760800 762543 764827 767881 771443 775125 778842 782646 786157 788658 790110
60227G90110J642L400N433O222N688N000M936N121M883M198L534L202L260L769
$$ 790110 791752 795152 800585 806807 812495 817495 822431 827552 832435 836633 840167 843369 846629 850398
60213H50398M736N817O420O166N201L974K941K403K428K733K787K227J181Q4p62
$$ 850398 855134 860951 867371 873537 878738 882712 885653 888056 890484 893217 896004 898231 899412 899496 898734
60198H98734j287j520j563j667j998k384k547k608k932l472l661l143k159j039
$$ 898734 897447 895927 894364 892697 890699 888315 885768 883160 880228 876756 873095 869952 867793 866754
60184H66754J33J075J203N26R8Q06K059K459J689Q20P73J317J824K200K672L157
$$ 866754 866887 867962 869165 869691 869789 870595 872654 875113 876802 877622 878395 879712 881536 883736 886408 889565
60168H89565L332L105K722K601L108M159M970M678L399K263K193K984L765L961
$$ 889565 892897 896002 898724 901325 904433 908592 913562 918240 921639 923902 926095 929079 932844 936805
60154I36805L510K653J875J717K182K527K098J267J136K290M163N649O128N842
$$ 936805 940315 942968 944843 946560 948742 951269 953367 954634 955770 958060 962223 967872 974000 979842
60140I79842N447N329N383N441N679O402P426Q106Q090P724P452P080O044M234
$$ 979842 985289 990618 996001 1001442 1007121 1013523 1020949 1029055 1037145 1044869 1052321 1059401 1065445 1069679
60126A069679K187L68j317l139m890n990o252o212o540p266p842p907p662p491
$$ 1069679 1071866 1072234 1070917 1067778 1062888 1056898 1050646 1044434 1037894 1030628 1022786 1014879 1007217 999726
60112I99726p438p272o787n912m763l728l273l407l509k930j638j00J224K080
$$ 999726 992288 985016 978229 972317 967554 963826 960553 957146 953637 950707 949069 948969 950193 952273
60098I52273K389K358K466L043M076N531P452R434J0494J0149R279R258J0305
$$ 952273 954662 957020 959486 962529 966605 972136 979588 989022 999516 1009665 1018944 1028202 1038507
60085A038507J1355J1416J0438Q883P189N662M285K545K5k793m970o429q093j0534
$$ 1038507 1049862 1061278 1071716 1080599 1087788 1093450 1097735 1100280 1100305 1097512 1092542 1086113 1078020 1067486
60071A067486j3182j5165j6231j6470j5834j4461j3031j2207j1945j1687j1033
$$ 1067486 1054304 1039139 1022908 1006438 990604 976143 963112 950905 938960 927273 916240
60060I16240r889q332o743n739n584n751n384m091k181l28Q64J259J295J552K116
$$ 916240 906351 898019 891276 885537 879953 874202 868818 864727 862546 862218 863082 864341 865636 867188 869304
60045H69304K638K939L175L326L082K368J447L82j011k438l042k575k055k670
$$ 869304 871942 874881 878056 881382 884464 886832 888279 888661 887650 885212 882170 879595 877540 874870
60031H74870m341n936o623o496o106n960o375p308q263q703q531q047p557p220
$$ 874870 870529 864593 857970 851474 845368 839408 833033 825725 817462 808759 800228 792181 784624 777404
60017G77404p056o860o355n673n298n339n229m529l656l290l360l217k583j784
$$ 777404 770348 763488 757133 751460 746162 740823 735594 731065 727409 724119 720759 717542 714959 713175
60003G13175j070k61Q56K176L405M268M608M550M549M943N515N803N760N782O081
$$ 713175 712105 711844 712700 714876 718281 722549 727157 731707 736256 741199 746714 752517 758277 764059 770140
59988G70140O380O229N463M299L215K654K599K504J824O21n78j428j981k393k648
$$ 770140 776520 782749 788212 792511 795726 798380 800979 803483 805307 805928 805350 803922 801941 799548 796900
59973G96900k690k545k280j975j708j425r49k05N95J184J531J769J938J988J922
$$ 796900 794210 791665 789385 787410 785702 784277 783328 783123 783718 784902 786433 788202 790140 792128 794050
59958G94050J756J435R50M49L6l73q83j398j816k230k736l181l403l574l937m309
$$ 794050 795806 797241 798191 798640 798676 798303 797420 796022 794206 791976 789240 786059 782656 779082 775145 770836
59942G70836m204l527k792k497k537k342j560m35L98M63j14o84o15J85J249K029
$$ 770836 766632 763105 760313 757816 755279 752937 751377 750942 751340 751803 751689 751005 750390 750575 751824 753853
59926G53853K328K328K237K056J749J576J944K832L603L712L422L386L784M264
$$ 753853 756181 758509 760746 762802 764551 766127 768071 770903 774506 778218 781640 785026 788810 793074
59912G93074M685N294O028O270N618M421L300K467J890J732K141K839L298L293
$$ 793074 797759 803053 809081 815351 820969 825390 828690 831157 833047 834779 836920 839759 843057 846350
59898H46350L010K743K764L258M123M890N083M679M127M006M678O009P379Q189
$$ 846350 849360 852103 854867 858125 862248 867138 872221 876900 881027 885033 889711 895720 903099 911288
59884I11288Q440Q530Q580Q381Q025P944Q079P685O355M662L311K133O14j082
$$ 911288 919728 928258 936838 945219 953244 961188 969267 976952 983307 987969 991280 993413 994027 992945
59870I92945k359l259m494o452q723j0677j1990j2550j2336j1570j0699j0121
$$ 992945 990586 987327 982833 976381 967658 956981 944991 932441 920105 908535 897836 887715
59858H87715j0020j0291j0431r696p833n489l590k406j602r81o33m07J30J147
$$ 887715 877695 867404 856973 847277 839444 833955 830365 827959 826357 825376 824743 824336 824466 825613
59844H25613K270L121L758M455N321O262P262Q417R683J0610J0591R529Q194P561
$$ 825613 827883 831004 834762 839217 844538 850800 858062 866479 876162 886772 897363 906892 915086 922647
59830I22647P710P792P041N427L244O99j812l717n005o452q496j0420j1299j1279
$$ 922647 930357 938149 945190 950617 953861 954560 952748 949031 944026 937574 929078 918658 907359 896080
59816H96080j1201j1284j1103j0659j0496j0756j0823j0168q897p405o018n067
$$ 896080 884879 873595 862492 851833 841337 830581 819758 809590 800693 793288 787270 782203
59804G82203m724m596l980k738j504r47j172j918k809l418l503l383l586m085
$$ 782203 777479 772883 768903 766165 764661 763714 762542 760624 757815 754397 750894 747511 743925 739840
59790G39840m285l821k982k202j584j074o65k59L05R54J407J618J874K352K888
$$ 739840 735555 731734 728752 726550 724966 723892 723227 722968 723273 724227 725634 727252 729126 731478 734366
59775G34366L252L384L302L155L342M185N405O299O605O725P030P367P451P404
$$ 734366 737618 741002 744304 747459 750801 754986 760391 766690 773295 780020 787050 794417 801868 809272
59761H09272P544P897Q175Q212Q179Q351Q674Q643P848O703O189O568O787N729
$$ 809272 816816 824713 832888 841100 849279 857630 866304 874947 882795 889498 895687 902255 909042 914771
59747I14771L790K441K356K693K359J222j40j214j683j334l53M78L12j002k759
$$ 914771 918561 921002 923358 926051 928410 929632 929492 928278 926595 925261 924908 925386 925698 924696 921937
59732I21937l934l954l156k410k096j642m82Q81J379Q52K27K48P87J518K424L290
$$ 921937 918003 914049 910893 908483 906387 904745 904263 905144 906523 907375 907602 907850 908637 910155 912579 915869
59716I15869L501K935K435K750L480L738L518L647M459N292N488N316N483O032
$$ 915869 919370 922305 924740 927490 930970 934708 938226 941873 946332 951624 957112 962428 967911 973943
59702I73943O187N463M468M195M612M589L413J763O61K3r45k264l085l110l087
$$ 973943 980130 985593 990061 994256 998868 1003457 1006870 1008633 1009294 1009317 1008372 1006108 1003023 999913 996826
59687I96826l616m262m321l807l248k972k946l005k950k722k655l143l977m552
$$ 996826 993210 988948 984627 980820 977572 974600 971654 968649 965699 962977 960322 957179 953202 948650
59673I48650m772n070n473n416m840m593n218o145o666o893p026o456m647k414
$$ 948650 943878 938808 933335 927919 923079 918486 913268 907123 900457 893564 886538 880082 875435 873021
59659H73021j205j352j929k179k081j648p59J49K08o76j564j764j725k109k653
$$ 873021 871816 870464 868535 866356 864275 862627 861868 862017 862225 861549 859985 858221 856496 854387 851734
59644H51734k648k139j869k174k630k904l269l983m565m219k872j359n74o99j334
$$ 851734 849086 846947 845078 842904 840274 837370 834101 830118 825553 821334 818462 817103 816529 815830 814496
59629H14496j979k216j838j152r15j499k286k312j416l96k9l43p63o27L85J871
$$ 814496 812517 810301 808463 807311 806396 804897 802611 800299 798883 798487 798458 798115 797352 796725 797110 798981
59613G98981K838K719K188K352L242L843L628L194L074K912K307J643J355J073
$$ 798981 801819 804538 806726 809078 812320 816163 819791 822985 826059 828971 831278 832921 834276 835349
59599H35349K86n69o36L1M45j3r39j517j365o91l1J63l9j13K39O30N21j24r44
$$ 835349 835635 835066 834430 834461 834906 834893 833954 832437 831072 830381 830350 830513 830474 830361 830600 831230 831751 831627 830683
59580H30683j682k190k302k132k182k725l333l459l151k721k118j255n44l97m49
$$ 830683 829001 826811 824509 822377 820195 817470 814137 810678 807527 804806 802688 801433 800889 800492 800043
59565H00043q4N06O80N60Q64J488J417L16p79r26m76k01J7P36J713K120J875J836
$$ 800043 799959 800465 801145 801705 802569 804057 805474 805790 805011 804085 803609 803408 803425 804161 805874 807994 809869 811705
59547H11705K657M041N418O803Q627J0959J3223J4744J5350J5478J5665J6069
$$ 811705 814362 818403 823821 830624 839251 850210 863433 878177 893527 909005 924670 940739
59535I40739J6558J7099J7839J8662J8996J8325J6797J5092J3645J2235J0354
$$ 940739 957297 974396 992235 1010897 1029893 1048218 1065015 1080107 1093752 1105987 1116341
59524A116341P790M811J914m60k168l543n238p646j0412j2741j4226j5174j5998
$$ 1116341 1124131 1128942 1130856 1130396 1128228 1124685 1119447 1111801 1101389 1088648 1074422 1059248 1043250
59511A043250j6579j6449j5454j4023j2832j2358j2564j2743j1911r791p277n576
$$ 1043250 1026671 1010222 994768 980745 967913 955555 942991 930248 918337 908546 901269 895693
59499H95693m890m475l840l244k878k351j415n62l54n58m95Q1J009K260L784N065
$$ 895693 890803 886328 882488 879244 876366 874015 872600 872038 871684 871126 870631 870712 871721 873981 877765 882830
59483H82830N622N911O911Q679J0058J0146R398Q845Q719Q479P833P084O569O336
$$ 882830 888452 894363 901274 909953 920011 930157 939555 948400 957119 965598 973431 980515 987084 993420
59469I93420O442O962P626P958P977Q336R430J0808J1853J2633J3593J4673J5503
$$ 993420 999862 1006824 1014450 1022408 1030385 1038721 1048151 1058959 1070812 1083445 1097038 1111711 1127214
59456A127214J6225J7255J8161J7802J5880J3526J1679R726O520K147k229n790
$$ 1127214 1143439 1160694 1178855 1196657 1212537 1226063 1237742 1247468 1253988 1256135 1253906 1248116
59444A248116q476j0323j1495j2757j4755j6824j7564j6765j5657j5059j4322
$$ 1248116 1239640 1229317 1217822 1205065 1190310 1173486 1155922 1139157 1123500 1108441 1094119
59433A094119j2593j0056p394m812k214L54K987O004R178J1562J2666J3181J3926
$$ 1094119 1081526 1071470 1064076 1059264 1057050 1057404 1060391 1066395 1075573 1087135 1099801 1112982 1126908
59420A126908J4758J5143J5115J4906J4169J2442R867O697K583k585p614j0883
$$ 1126908 1141666 1156809 1171924 1186830 1200999 1213441 1223308 1230005 1232588 1230003 1222389 1211506
59408A211506j2267j3171j4524j5632j5277j3332j0924r390r285j0199j1368j2378
$$ 1211506 1199239 1186068 1171544 1155912 1140635 1127303 1116379 1106989 1097704 1087505 1076137 1063759
59396A063759j3202j3689j3695j3701j4485j5819j6383j5563j4435j4067j3769
$$ 1063759 1050557 1036868 1023173 1009472 994987 979168 962785 947222 932787 918720 904951
59385I04951j2226r748p920p322o948n965m690l627k631j451k09R34J926K502
$$ 904951 892725 882977 875057 867735 860787 854822 850132 846505 843874 842423 842214 843148 845074 847576
59371H47576K391K006K171L138M555O281Q337J0166J1136J1841J3701J6905J9989
$$ 847576 849967 851973 854144 857282 861837 868118 876455 886621 897757 909598 923299 940204 960193
59358I60193K1904K3323K5239K7435K9200L0636L2202L3621L4257L4054L3137
$$ 960193 982097 1005420 1030659 1058094 1087294 1117930 1150132 1183753 1218010 1252064 1285201
59347A285201L0958K6887K1479J6144J1557P192K474k351o771j0810j4948j9381
$$ 1285201 1316159 1343046 1364525 1380669 1392226 1399418 1401892 1399541 1392770 1381960 1367012 1347631
59335A347631k3595k6661k7933k7607k6536k5553k4962k4598k4010k2744k0794
$$ 1347631 1324036 1297375 1269442 1241835 1215299 1189746 1164784 1140186 1116176 1093432 1072638
59324A072638j8773j7250j5956j4264j2357j1152j0861j0511r327p735o405n141
$$ 1072638 1053865 1036615 1020659 1006395 994038 982886 972025 961514 952187 944452 938047 932906
59312I32906l545k136j783k308k620k164j344n98R2O48P80O19P93J522K284K694
$$ 932906 929361 927225 925442 923134 920514 918350 917006 916408 916500 917148 917928 918547 919340 920862 923146 925840
59296I25840L201M455O393Q408J0159J1796J3561J5533J7658J9600K0718K0571
$$ 925840 929041 933496 939889 948297 958456 970252 983813 999346 1017004 1036604 1057322 1077893
59284A077893J9587J8842J9025J9750K0097J9569J8389J7006J5702J4622J3857
$$ 1077893 1097480 1116322 1135347 1155097 1175194 1194763 1213152 1230158 1245860 1260482 1274339
59273A274339J3246J2335J0755Q616O347M202K061l89l358o727r985j2477j3971
$$ 1274339 1287585 1299920 1310675 1319291 1325638 1329840 1331901 1331512 1328154 1321427 1311442 1298965 1284994
59260A284994j4908j5910j7074j7949j8149j7759j7111j6401j5500j4084j2006
$$ 1284994 1270086 1254176 1237102 1219153 1201004 1183245 1166134 1149733 1134233 1120149 1108143
59249A108143r638p616o074m378j975P04K723L863M756N760O328N780M161J956
$$ 1108143 1098505 1090889 1084815 1080437 1078462 1079166 1081889 1085752 1090508 1096268 1102596 1108376 1112537 1114493
59235A114493o14l520o410q742j0436j1997j3824j5670j6927j7331j7244j7204
$$ 1114493 1113879 1110359 1103949 1095207 1084771 1072774 1058950 1043280 1026353 1009022 991778 974574
59223I74574j7350j7341j6800j5683j4253j2833j1633j0639r581q244o807n681
$$ 974574 957224 939883 923083 907400 893147 880314 868681 858042 848461 840217 833410 827729
59211H27729m889l978k702j446o56k27K13P34J299K106L211M067M125L696L566
$$ 827729 822840 818862 816160 814714 814058 813831 814044 814778 816077 818183 821394 825461 829586 833282 836848
59196H36848L886M162M305M868O073P312P883P723P231O816O804P347Q197Q978
$$ 836848 840734 844896 849201 854069 860142 867454 875337 883060 890291 897107 903911 911258 919455 928433
59182I28433R656J0385J0979J1239J1609J2750J4391J5533J6001J6702J7991J8771
$$ 928433 938089 948474 959453 970692 982301 995051 1009442 1024975 1040976 1057678 1075669 1094440
59170A094440J7997J6161J4429J3000J1222Q930O513L936O87l225o961r765j1587
$$ 1094440 1112437 1128598 1143027 1156027 1167249 1176179 1182692 1186628 1187315 1184090 1177129 1167364 1155777
59157A155777j2767j3596j4325j5183j6068j6469j5898j4371j2527j1274j1105
$$ 1155777 1143010 1129414 1115089 1099906 1083838 1067369 1051471 1037100 1024573 1013299 1002194
59146A002194j1610j1851j1323j0299r137p658n648l583k316k096k311k101j027
$$ 1002194 990584 978733 967410 957111 947974 940316 934668 931085 928769 926673 924362 922261 921234
59133I21234P33K533L728M280M832N951P492Q957J0235J1582J3060J4420J5513
$$ 921234 921967 924500 928228 932508 937340 943291 950783 959740 969975 981557 994617 1009037 1024550
59120A024550J6465J7513J8901K0778K2829K4152K3999K2655K1217K0374J9821
$$ 1024550 1041015 1058528 1077429 1098207 1121036 1145188 1169187 1191842 1213059 1233433 1253254
59109A253254J8867J7272J5216J2780R857O547L342O92j451l531n786p945r600
$$ 1253254 1272121 1289393 1304609 1317389 1327246 1333793 1337135 1337827 1336376 1332845 1327059 1319114 1309514
59096A309514j0644j1181j1197j0688j0044r920j0566j1560j2292j2490j2282
$$ 1309514 1298870 1287689 1276492 1265804 1255760 1245840 1235274 1223714 1211422 1198932 1186650
59085A186650j2011j2039j2484j3043j3383j3607j4002j4361j4036j2900j1641
$$ 1186650 1174639 1162600 1150116 1137073 1123690 1110083 1096081 1081720 1067684 1054784 1043143
59074A043143j0887j0452r816q875p836o744n628m894m965n619o117o052n756
$$ 1043143 1032256 1021804 1011988 1003113 995277 988533 982905 978011 973046 967427 961310 955258 949502
59061I49502n778o205o645o740o517o192n716m816l615k858l010l391k770r13
$$ 949502 943724 937519 930874 924134 917617 911425 905709 900893 897278 894420 891410 888019 885249 884336
59047H84336J053J983J910J639J715K119K658L250M026N259P019Q824J0073J0905
$$ 884336 885389 887372 889282 890921 892636 894755 897413 900663 904689 909948 916967 925791 935864 946769
59033I46769J2091J3882J5526J6254J6189J5894J5508J4894J4208J3722J3236
$$ 946769 958860 972742 988268 1004522 1020711 1036605 1052113 1067007 1081215 1094937 1108173
59022A108173J2219J0481Q392O490N055L961K781J255k29q85l84Q30K125L146
$$ 1108173 1120392 1130873 1139265 1145755 1150810 1154771 1157552 1158807 1158578 1157693 1157309 1158139 1160264 1163410
59008A163410L773M187N099P121R634J1057J0727R781R642J0294J0758J0553R853
$$ 1163410 1167183 1171370 1176469 1183590 1193224 1204281 1215008 1224789 1234431 1244725 1255483 1266036 1275889
58995A275889Q657O697M067J218j539m027o017p620r452j1781j3862j4777j4656
$$ 1275889 1284546 1291243 1295310 1296528 1294989 1290962 1284945 1277325 1267873 1256092 1242230 1227453 1212797
58982A212797j4253j3725j2653j1076r464p785n487k482O60L665O861J0361J3656
$$ 1212797 1198544 1184819 1172166 1161090 1151626 1143841 1138354 1135872 1136532 1140197 1147058 1157419 1171075
58969A171075J6347J8597K0511K1653K1618K0699J9595J8621J7389J5144J1302
$$ 1171075 1187422 1206019 1226530 1248183 1269801 1290500 1310095 1328716 1346105 1361249 1372551
58958A372551O003K24m846q741j1842j4603j6950j8600j9652k0525k1292k1310
$$ 1372551 1378554 1378778 1373932 1365191 1353349 1338746 1321796 1303196 1283544 1263019 1241727 1220417
58946A220417j9821j6951j3818j1418r675q026o619o186o739p345p455p620q401
$$ 1220417 1200596 1183645 1169827 1158409 1148734 1140708 1134089 1127903 1121164 1113819 1106364 1098744 1090343
58933A090343r430j0215j1076j2418j3585j3527j2296j0965j0171r571q776p926
$$ 1090343 1080913 1070698 1059622 1047204 1033619 1020092 1007796 996831 986660 977089 968313 960387
58921I60387p242o624n904n062m073k895j636m72O12J776L179M952P036Q874R859
$$ 960387 953145 946521 940617 935555 931482 928587 926951 926479 927091 928867 932046 936998 944034 952908 962767
58906I62767J0338J1543J4050J6953J9242K1265K3978K7383L0688L3642L6570
$$ 962767 973105 984648 998698 1015651 1034893 1056158 1080136 1107519 1138207 1171849 1208419
58895A208419L9368M1564M3288M5078M6738M7365M6592M4861M2399L8846L4092
$$ 1208419 1247787 1289351 1332639 1377717 1424455 1471820 1518412 1563273 1605672 1644518 1678610
58884A678610K8515K2245J4964O757j561r231j6004k1713k6093k9253l1723l3862
$$ 1678610 1707125 1729370 1744334 1751091 1749530 1740299 1724295 1702582 1676489 1647236 1615513 1581651
58872A581651l5649l7084l8090l8079l6421l3505l0528k8099k5784k3237k0939
$$ 1581651 1546002 1508918 1470828 1432749 1396328 1362823 1332295 1304196 1278412 1255175 1234236
58861A234236j9391j8283j7025j5662j4780j4703j5120j5358j4996j4337j4110
$$ 1234236 1214845 1196562 1179537 1163875 1149095 1134392 1119272 1103914 1088918 1074581 1060471
58850A060471j4537j4957j4807j4443j4390j4277j3403j2044j1128j0794j0389
$$ 1060471 1045934 1030977 1016170 1001727 987337 973060 959657 947613 936485 925691 915302
58839I15302r772r427r178q125o141m315l384k793j857q53l15r4K25N94Q20R83
$$ 915302 905530 896103 886925 878800 872659 868344 864960 862167 860310 859457 859142 859048 859273 859867 860687 861670
58823H61670J095R40N94M70M71j30j509k798l330l631m423n387n669n120m255
$$ 861670 862765 863705 864299 864769 865240 865110 863601 860803 857473 853842 849419 844032 838363 833243 828988
58808H28988l421k711k362k503k713k428j701j091r66j230j521j323k05J665L409
$$ 828988 825567 822856 820494 817991 815278 812850 811149 810058 809092 807862 806341 805018 804813 806478 809887
58793H09887M257M293M254M742N809P005P693P568P016O656O583O423O022N526
$$ 809887 814144 818437 822691 827433 833242 840247 847940 855508 862524 869180 875763 882186 888208 893734
58779H93734M880L973L267L400L992L851K671J544J311J381R09K03P1L92M47J92
$$ 893734 898614 902587 905854 909254 913246 917097 919768 921312 922623 924004 924913 925116 925187 925579 926026 926218
58763I26218K37P39J271J658K167K780L093L059L266M131N244N866N893O016O895
$$ 926218 926455 927194 928465 930123 932290 935070 938163 941222 944488 948619 953863 959729 965622 971638 978533
58748I78533Q360R714J0698J1751J3198J4687J5877J7144J8937K0773K1784K2018
$$ 978533 986893 996607 1007305 1019056 1032254 1046941 1062818 1079962 1098899 1119672 1141456 1163474
58736A163474K2254K2542K2049K0460J8421J6389J4064J1464R378Q140O846M621
$$ 1163474 1185728 1208270 1230319 1250779 1269200 1285589 1299653 1311117 1320495 1328635 1335481 1340102
58724A340102J916k59j779l245m874o355p508q442r253j0062j1100j2393j3731
$$ 1340102 1342018 1341759 1339980 1336735 1331861 1325506 1317998 1309556 1300303 1290241 1279141 1266748 1253017
58711A253017j5142j6902j8812k0143k0685k1123k1877k2379k2122k1689k1847
$$ 1253017 1237875 1220973 1202161 1182018 1161333 1140210 1118333 1095954 1073832 1052143 1030296
58700A030296k2290k2161k1397k0578j9803j8601j6876j5081j3545j2267j1338
$$ 1030296 1008006 985845 964448 943870 924067 905466 888590 873509 859964 847697 836359
58689H36359j0928j0827j0519r775q805p851o950o010m895l535k073o54R40L004
$$ 836359 825431 814604 804085 794310 785505 777654 770704 764694 759799 756264 754191 753537 754477 757481
58675G57481N219O884Q021R534J1831J4039J5168J5379J5388J5204J4303J2671
$$ 757481 762700 769584 777605 787139 798970 813009 828177 843556 858944 874148 888451 901122
58663I01122J0814Q908O665L944R60k045m845p048q375q931q960q537p816p265
$$ 901122 911936 920844 927509 931453 932413 930368 925523 918475 910100 901169 892209 883672 875856 868591
58649H68591p158p103o505n330m064l077k383j857j372r15o83r42j663k536l269
$$ 868591 861433 854330 847825 842495 838431 835354 832971 831114 829742 828827 828144 827202 825539 823003 819734
58634H19734l550k950j517k95l29j082q51R37K997M259N432P670J0574J2709J3596
$$ 819734 816184 813234 811717 811422 811093 810011 809160 810097 813094 817353 822785 830455 841029 853738 867334
58619H67334J4154J5345J7100J8543J8710J7229J4638J1963R809Q108O680N393
$$ 867334 881488 896833 913933 932476 951186 968415 983053 995016 1004825 1012933 1019613 1025006
58607A025006L777J376j354l323m181m533m648m131l159k623k540j605P97L538
$$ 1025006 1028783 1030159 1028805 1025482 1021301 1016768 1012120 1007989 1004830 1002207 999667 998062 998859 1002397
58593A002397N536P291R501J1474J2327J2753J3973J5625J6193J5151J3382J1787
$$ 1002397 1007933 1015224 1024725 1036199 1048526 1061279 1075252 1090877 1107070 1122221 1135603 1147390
58581A147390J0578R653Q751P556O330N905O497P373Q328J0300J3567J6696J8556
$$ 1147390 1157968 1167621 1176372 1183928 1190258 1196163 1202660 1210033 1218361 1228661 1242228 1258924 1277480
58568A277480K0050K2267K4233K4431K3528K3285K3396K1826J8095J4005J0882
$$ 1277480 1297530 1319797 1344030 1368461 1391989 1415274 1438670 1460496 1478591 1492596 1503478
58557A503478Q133M864J172k636o591j0376j3327j5521j7681j9882k1432k2142
$$ 1503478 1511611 1516475 1517647 1515011 1508420 1498044 1484717 1469196 1451515 1431633 1410201 1388059
58545A388059k2598k3155k3723k4484k5500k5830k4489k2283k1107k1220k0785
$$ 1388059 1365461 1342306 1318583 1294099 1268599 1242769 1218280 1195997 1174890 1153670 1132885
58534A132885j8486j5117j2136r960q285o841n135k491J028M424O883Q345Q803
$$ 1132885 1114399 1099282 1087146 1077186 1068901 1062060 1056925 1054434 1055462 1059886 1066769 1075114 1083917
58521A083917Q074O534N174M505M203L937L758L514K874K099J826J954J697J003
$$ 1083917 1091991 1098525 1103699 1108204 1112407 1116344 1120102 1123616 1126490 1128589 1130415 1132369 1134066 1135069
58507A135069P36J121J113p5j690k378j887j225j395k384l305l416l052l182l926
$$ 1135069 1135805 1136926 1138039 1137964 1136274 1133896 1132009 1130784 1129389 1127005 1123700 1120284 1117232 1114050 1110124
58492A110124m125k914r37P77K331M347O506P978Q780R402R583Q840P755P132
$$ 1110124 1105999 1103085 1102148 1102925 1105256 1109603 1116109 1124087 1132867 1142269 1151852 1160692 1168447 1175579
58478A175579O236L578n95m340o635q338j0415j2763j5000j6923j7861j7082j5178
$$ 1175579 1181815 1185393 1184798 1180458 1173823 1165485 1155070 1142307 1127307 1110384 1092523 1075441 1060263
58465A060263j3625j2685j1151q467n601l363j451L13J218R74M76M81N51j0j085
$$ 1060263 1046638 1033953 1022802 1014335 1008734 1005371 1003920 1004233 1005451 1006425 1006901 1007382 1007933 1007923 1006838
58450A006838k180l057l536l461l184l248l399k889j801r99o95j59R33K145L419
$$ 1006838 1004658 1001601 998065 994604 991420 988172 984773 981884 980083 979084 978389 978230 979163 981308 984727
58435I84727N233P405R011R770J0322J0854J0785J0106R650R687R477Q677P871
$$ 984727 989960 997365 1006376 1016146 1026468 1037322 1048107 1058213 1067863 1077550 1087027 1095704 1103575
58422A103575P351O605N424M359L681L075K516K297J967O38j474l165m037m822
$$ 1103575 1110926 1117531 1122955 1127314 1130995 1134070 1136586 1138883 1140850 1141488 1140014 1136849 1132812 1127990
58408A127990n782o362o585p095p595p019n584m839n230n501n001m698n283o062
$$ 1127990 1122208 1115846 1109261 1102166 1094571 1087552 1081968 1077129 1071899 1066398 1061397 1056699 1051416 1045354
58394A045354o526p129p871p887p241p141p640p200n533m667n841p399p250n640
$$ 1045354 1038828 1031699 1023828 1015941 1008700 1001559 993919 986719 981186 976519 970678 963279 956029 950389
58380I50389l882k088J0J596J973K223L757O170Q049R120J0128J1311J2364J3315
$$ 950389 946507 944419 944429 946025 947998 950221 953978 960148 968197 977317 987445 998756 1011120 1024435
58366A024435J4251J4698J4240J3185J1930J0335Q345O393M645K753Q13m72j031
$$ 1024435 1038686 1053384 1067624 1080809 1092739 1103074 1111419 1117812 1122457 1125210 1126023 1125551 1124520
58353A124520j531j907j212N08J840K182K766M641P164R304J0925J2025J2197
$$ 1124520 1122989 1121082 1119870 1120378 1122218 1124400 1127166 1131807 1138971 1148275 1159200 1171225 1183422
58340A183422J1737J1735J2265J2058J0746R658R563R432Q440P362O823N993M264
$$ 1183422 1195159 1206894 1219159 1231217 1241963 1251621 1261184 1270616 1279056 1286418 1293241 1299234 1303498
58327A303498K552J737J363J003J210K129K795K830L071L678L710L436M661P514
$$ 1303498 1306050 1307787 1309150 1310153 1311363 1313492 1316287 1319117 1322188 1325866 1329576 1333012 1337673 1345187
58313A345187R391Q722P406P796R470J0854J1864J2846J2901J1458R876R515R690
$$ 1345187 1354578 1363300 1370706 1378502 1387972 1398826 1410690 1423536 1436437 1447895 1457771 1467286 1476976
58300A476976R272Q630Q424Q174P648P826Q995R825R762J0207J1830J3143J3422
$$ 1476976 1486248 1494878 1503302 1511476 1519124 1526950 1535945 1545770 1555532 1565739 1577569 1590712 1604134
58287A604134J4410J7103J9534K0003J9918K1064K2546K3110K3984K6552K9483
$$ 1604134 1618544 1635647 1655181 1675184 1695102 1716166 1738712 1761822 1785806 1812358 1841841
58276A841841L1132L2754L6308M0875M4174M6035M7754M9448N0507N1170N1510
$$ 1841841 1872973 1905727 1942035 1982910 2027084 2073119 2120873 2170321 2220828 2271998 2323508
58265B323508N0583M8461M7023M6869M5913M3002M0111L8839L7841L6107L5457
$$ 2323508 2374091 2422552 2469575 2516444 2562357 2605359 2645470 2684309 2722150 2758257 2793714
58254B793714L7051L8831L9424M1085M5543N0452N3467N6282O0890O5534O8343
$$ 2793714 2830765 2869596 2909020 2950105 2995648 3046100 3099567 3155849 3216739 3282273 3350616
58243C350616P1364P6766Q2538Q6313Q9919R5674J01768J06061J10739J18314
$$ 3350616 3421980 3498746 3581284 3667597 3757516 3853190 3954958 4061019 4171758 4290072
58233D290072J26644J33015J39427J48671J59019J68120J78126J91467K05767
$$ 4290072 4416716 4549731 4689158 4837829 4996848 5164968 5343094 5534561 5740328
58224E740328K18729K33529K53330K75202K95893L18532L46841L78193M09806
$$ 5740328 5959057 6192586 6445916 6721118 7017011 7335543 7682384 8060577 8470383
58215H470383M46037M91635N43805N99477O63958P43393Q35900R40364J066376
$$ 8470383 8916420 9408055 9951860 10551337 11215295 11958688 12794588 13734952 14801328
58206A4801328J224537J415455J641061J918017K265669K689488L191096L785132
$$ 14801328 16025865 17441320 19082381 21000398 23266067 25955555 29146651 32931783
58198C2931783M491987N329907O337332P592434R189075J1197351J3627218J6325430
$$ 32931783 37423770 42753677 49091009 56683443 65872518 77069869 90697087 107022517
58190A07022517J8804517K0234549J9822021J7374326J3512462R287503N565792
$$ 107022517 125827034 146061583 165883604 183257930 196770392 206057895 211623687
58183B11623687K694904N44055j309436l355776n855501q605479j1034362j2608110
$$ 211623687 214318591 214862646 213553210 210197434 204341933 195736454 184702092 172093982
58175A72093982j3162102j2876794j2042061j0914106r722003q669690p871629
$$ 172093982 158931880 146055086 134013025 123098919 113376916 104707226 96835597
58168I6835597p314963o905271o538174o139112n681284n195209m749569m401336
$$ 96835597 89520634 82615363 76077189 69938077 64256793 59061584 54312015 49910679
58160D9910679m155999l970118l784552l558830l287898k994548k705276k432956
$$ 49910679 45754680 41784562 38000010 34441180 31153282 28158734 25453458 23020502
58152B3020502k180656j952294j751291j573994j413454j267485j136473j016640
$$ 23020502 20839846 18887552 17136261 15562267 14148813 12881328 11744855 10728215
58144A0728215r03076p97026p03242o22078n50469m88280m37087l94510l56138
$$ 10728215 9825139 9028113 8324871 7702793 7152324 6664044 6226957 5832447 5476309
58135E476309l21677k93324k69653k46845k24578k05260j88637j72443j57177
$$ 5476309 5154632 4861308 4591655 4344810 4120232 3914972 3726335 3553892 3396715
58126C396715j45063j35360j25517j15978j09046j04073r8446r2313q7806q4427
$$ 3396715 3251652 3116292 2990775 2874797 2765751 2661678 2563232 2470919 2383113 2298686
58116B298686p9698p3696o8638o4712o0383n6058n3434n1782m8874m4959m2015
$$ 2298686 2218988 2145292 2076654 2011942 1951559 1895501 1842067 1790285 1741411 1696452 1654437
58105A654437l9752l6210l1729k8489k6504k3826k0362j7959j6919j5804j4491
$$ 1654437 1614685 1578475 1546746 1518257 1491753 1467927 1447565 1429606 1412687 1396883 1382392
58094A382392j4104j4263j3609j2722j3335j4955j5489j4929j5199j6578j7462
$$ 1382392 1368288 1354025 1340416 1327694 1314359 1299404 1283915 1268986 1253787 1237209 1219747
58083A219747j7576j8262j9530j9849j9089j8766j9203j9143j8358j8034j8341
$$ 1219747 1202171 1183909 1164379 1144530 1125441 1106675 1087472 1068329 1049971 1031937 1013596
58072A013596j8113j7146j6405j5911j4755j3250j2662j2807j2197j0667r541
$$ 1013596 995483 978337 961932 946021 931266 918016 905354 892547 880350 869683 860142
58061H60142r153q521p509o999o876o071m755m227m496m231l263k878l381l581
$$ 860142 850989 842468 834959 827960 821084 815013 810258 806031 801535 797304 794041 791163 787782 784201
58047G84201l127l157m168n169n508n765o351o815o922o967o731n682m281l638
$$ 784201 781074 777917 773749 768580 763072 757307 750956 744141 737219 730252 723521 717839 713558 709920
58033G09920l791l857l754m162m837m841m389m640n457n339l885k507k221k346
$$ 709920 706129 702272 698518 694356 689519 684678 680289 675649 670192 664853 660968 658461 656240 653894
58019F53894j994j319p87l89j29j74k35K44J121J765K194L010M325N763P262Q732
$$ 653894 651900 650581 649794 649405 649276 649102 648867 649111 650232 651997 654191 657201 661526 667289 674551 683283
58003F83283R403Q848Q200Q896J0513J1437J1325J1201J1362J1032J0073R286
$$ 683283 692686 701534 709734 718630 729143 740580 751905 763106 774468 785500 795573 804859
57991H04859Q838Q041O805N732M679K840L77j588k790m071n631o648o848o962
$$ 804859 813697 821738 828543 834275 838954 841794 842171 840583 837793 833722 828091 821443 814595 807633
57977H07633p365p587p459p372p313o990o865p628q635q519p351o554o509o132
$$ 807633 800268 792681 785222 777850 770537 763547 756682 749054 740419 731900 724549 717995 711486 705354
57963G05354m989m067l918l784l203k764k688k184r86o4k8j36L99J261J913K491
$$ 705354 700365 696298 692380 688596 685393 682629 679941 677757 676771 676707 676679 676543 676942 678203 680116 682607
57947F82607L228L969M757N865O939P251P071P508Q639R196Q581P768P542P315
$$ 682607 685835 689804 694561 700426 707365 714616 721687 729195 737834 747030 755611 763379 770921 778236
57933G78236O439N413M927M719M259L567K692J290o04k291l545n036p069q875
$$ 778236 784675 790088 795015 799734 803993 807560 810252 811542 810938 808647 805102 800066 792997 784122
57919G84122r829j0353j0925j1151j0699j0157j0154j0331j0112r769r899j0347
$$ 784122 774293 763940 753015 741864 731165 721008 710854 700523 690411 680642 670743 660396
57907F60396j0495j0186r675r034q171p184o205n202m210l461l052k835k729k689
$$ 660396 649901 639715 630040 621006 612835 605651 599446 594244 590034 586573 583521 580686 577957 575268
57893E75268k372j467l46K92N16J092K258L365L939M271M694N024N030M709M011
$$ 575268 572896 571429 571083 571375 571891 572983 575241 578606 582545 586816 591510 596534 601564 606273 610284
57878F10284K902J902J753K450L265L747L987L965L563L251L624M218L887K593
$$ 610284 613186 615088 616841 619291 622556 626303 630290 634255 637818 641069 644693 648911 652798 655391
57864F55391J657J887K568K779K672K881L483M136M566M514L829K911K481K661
$$ 655391 657048 658935 661503 664282 666954 669835 673318 677454 682020 686534 690363 693274 695755 698416
57850F98416K918K930K852K689K208J541J078P60K92j57l64q50k116l389l479
$$ 698416 701334 704264 707116 709805 712013 713554 714632 715392 715684 715527 715163 714313 712197 708808 705329
57835G05329k740k599l232l405k719k189k217j877q23r8k64l70L41J217J637K139
$$ 705329 702589 699990 696758 693353 690634 688445 686228 684351 683528 683430 683166 682796 683137 684354 685991 688130
57819F88130L135L921M018M129M687M807L872K875K864L196K657J400L94k40j048
$$ 688130 691265 695186 699204 703333 708020 712827 716699 719574 722438 725634 728291 729691 730085 729845 728797
57804G28797k067l015m006n080n769n977o503p743q776q782q369q390q420p681
$$ 728797 726730 723715 719709 714629 708860 702883 696380 688637 679861 671079 662710 654320 645900 638219
57790F38219o640o261o308n799m630l455k469j472o80l14J16J031J847J983K117
$$ 638219 631579 625318 619010 613211 608581 605126 602657 601185 600505 600191 600307 601338 603185 605168 607285
57775F07285L117M316M364L447K991L396L619L088K459K202J736N16j007k067
$$ 607285 610402 614718 619082 622529 625520 628916 632535 635623 638082 640284 642020 642536 641529 639462
57761F39462k496k584k556k455k299k170k314k975l890m338m024l426k912k127
$$ 639462 636966 634382 631826 629371 627072 624902 622588 619613 615723 611385 607361 603935 601023 598896
57747E98896q39K71M56j7l76n05p04q11m18K90P53Q13O13J72l26k88M50J127J128
$$ 598896 598057 598328 598784 598767 598391 597886 597182 596371 595953 596243 596996 597809 598422 598594 598268 597980 598430 599557 600685
57728F00685R86J403J958J804J101O49N97O59J092K219L340L431K680K122J941
$$ 600685 601671 603074 605032 606836 607937 608586 609183 609842 610934 613153 616493 619924 622604 624726 626667
57713F26667J527R70J078J792K055J496J025J310J802J705J067M63L16P73J642
$$ 626667 628194 629164 630242 632034 634089 635585 636610 637920 639722 641427 642494 642957 643273 644046 645688
57698F45688K287K250K007K435L566M527M726M305L638L138L463M915O743P953
$$ 645688 647975 650225 652232 654667 658233 662760 667486 671791 675429 678567 682030 686945 693688 701641
57684G01641Q787J0322J2708J5024J7024J9697K3787K8891L4534M1032M8591N6452
$$ 701641 710428 720750 733458 748482 765506 785203 808990 837881 872415 913447 962038 1018490
57672A018490O3616O9694P4361P6543P4836O8495N7847M4154K9367J5221K077
$$ 1018490 1082106 1151800 1226161 1302704 1377540 1446035 1503882 1548036 1577403 1592624 1594701
57661A594701j0976k4507l7651m8750n6566o0632o1125n8929n5390n1457m7249
$$ 1594701 1583725 1559218 1521567 1472817 1416251 1355619 1294494 1235565 1180175 1128718 1081469
57650A081469m2638l7923l3620k9939k6733k3769k0888j8083j5510j3212j0921
$$ 1081469 1038831 1000908 967288 937349 910616 886847 865959 847876 832366 819154 808233
57639H08233q468o230m716l812k940j923j068n06p6J13k62r53j151n08M57J162
$$ 808233 799765 793535 788819 785007 782067 780144 779076 778570 778494 778607 778345 777392 776241 775733 776190 777352
57623G77352J601J925K004J799J629J702J781J643J488J580J848K111K377K664
$$ 777352 778953 780878 782882 784681 786310 788012 789793 791436 792924 794504 796352 798463 800840 803504
57609H03504K776K567K273K331K910L680M030L639K925K734L286L827L642L082
$$ 803504 806280 808847 811120 813451 816361 820041 824071 827710 830635 833369 836655 840482 844124 847206
57595H47206K932L114K802J810J018J197K073K775K761K031R46R0l2O18J573K244
$$ 847206 850138 853252 856054 857864 858882 860079 862152 864927 867688 869719 870665 870755 870723 871341 872914 875158
57579H75158K240J552P27N40J117J703J761J737K186K669K521K185K618L586L911
$$ 875158 877398 878950 879677 880217 881334 883037 884798 886535 888721 891390 893911 896096 898714 902300 906211
57564I06211L428L285M008M625M253L418L016K959K697K373K571L349M199M687
$$ 906211 909639 912924 916932 921557 925810 929228 932244 935203 937900 940273 942844 946193 950392 955079
57550I55079M685M317M019M242M840N218N282N602O323O712O292N677N641N962
$$ 955079 959764 964081 968100 972342 977182 982400 987682 993284 999607 1006319 1012611 1018288 1023929 1029891
57536A029891N901N349M790M457M227M123M283M514M450M057L642L433L505L933
$$ 1029891 1035792 1041141 1045931 1050388 1054615 1058738 1063021 1067535 1071985 1076042 1079684 1083117 1086622 1090555
57522A090555M687N451N827N675N165M666M597N023N351M872L787L203L868N279
$$ 1090555 1095242 1100693 1106520 1112195 1117360 1122026 1126623 1131646 1136997 1141869 1145656 1148859 1152727 1158006
57508A158006O326O473O039N665N791O305O573O119N383N247N732N825M918L739
$$ 1158006 1164332 1170805 1176844 1182509 1188300 1194605 1201178 1207297 1212680 1217927 1223659 1229484 1234402 1238141
57494A238141L335L697L966L701L274L218L637M217M561M601M767N479O446O909
$$ 1238141 1241476 1245173 1249139 1252840 1256114 1259332 1262969 1267186 1271747 1276348 1281115 1286594 1293040 1299949
57480A299949O643O187N954N851N905O493P471P917P315O377N971N951N840N984
$$ 1299949 1306592 1312779 1318733 1324584 1330489 1336982 1344453 1352370 1359685 1366062 1372033 1377984 1383824 1389808
57466A389808O968Q232Q470P437O366O389P322Q263Q662Q499Q023P642P773Q331
$$ 1389808 1396776 1405008 1413478 1420915 1427281 1433670 1440992 1449255 1457917 1466416 1474439 1482081 1489854 1498185
57452A498185Q662Q279P530P275P914Q991R722R741R194Q304P210O281O097O805
$$ 1498185 1506847 1515126 1522656 1529931 1537845 1546836 1556558 1566299 1575493 1583797 1591007 1597288 1603385 1610190
57438A610190P721Q082P929P770P596P004O221O071O698P171O859O423O783P707
$$ 1610190 1617911 1625993 1633922 1641692 1649288 1656292 1662513 1668584 1675282 1682453 1689312 1695735 1702518 1710225
57424A710225Q198P922P479P373P426P289P005O930P310Q010Q554Q541Q103P794
$$ 1710225 1718423 1726345 1733824 1741197 1748623 1755912 1762917 1769847 1777157 1785167 1793721 1802262 1810365 1818159
57410A818159P939Q331Q671Q922R134R208R072Q789Q362P786P344P466Q114Q784
$$ 1818159 1826098 1834429 1843100 1852022 1861156 1870364 1879436 1888225 1896587 1904373 1911717 1919183 1927297 1936081
57396A936081R212R581R874R735R228Q981R165R127Q555Q270R028J0163J0395
$$ 1936081 1945293 1954874 1964748 1974483 1983711 1992692 2001857 2010984 2019539 2027809 2036837 2047000 2057395
57383B057395R651R115R608J0726J1613J1859J1526J0926J0439J0203R947R432
$$ 2057395 2067046 2076161 2085769 2096495 2108108 2119967 2131493 2142419 2152858 2163061 2173008 2182440
57371B182440Q961R008R480R768R508Q916Q449Q427Q856R336R379R062R081R802
$$ 2182440 2191401 2200409 2209889 2219657 2229165 2238081 2246530 2254957 2263813 2273149 2282528 2291590 2300671 2310473
57357B310473J0633J0770J0238R641R265R018R012R441R969R903R035P892P112
$$ 2310473 2321106 2331876 2342114 2351755 2361020 2370038 2379050 2388491 2398460 2408363 2417398 2425290 2432402
57344B432402P044P713Q692R127Q523P449O882O933O877O416O122O399O738O415
$$ 2432402 2439446 2447159 2455851 2464978 2473501 2480950 2487832 2494765 2501642 2508058 2514180 2520579 2527317 2533732
57330B533732N471M573M214M369M703M806M391L541K727K383K526K888L311L844
$$ 2533732 2539203 2543776 2547990 2552359 2557062 2561868 2566259 2569800 2572527 2574910 2577436 2580324 2583635 2587479
57316B587479M440M776M539L892L467L613L882L528K555J798J914K700L600M413
$$ 2587479 2591919 2596695 2601234 2605126 2608593 2612206 2616088 2619616 2622171 2623969 2625883 2628583 2632183 2636596
57302B636596N200N755N712N010M017L191K781K730K729K560K412K612L004L026
$$ 2636596 2641796 2647551 2653263 2658273 2662290 2665481 2668262 2670992 2673721 2676281 2678693 2681305 2684309 2687335
57288B687335K444J529M57r09k398l303l245k716k315j977j425q84p09o12PJ135
$$ 2687335 2689779 2691308 2691765 2690856 2688458 2685155 2681910 2679194 2676879 2674902 2673477 2672593 2671884 2671272 2671279 2672414
57272B672414K102K365J920J134N31N36J041J398J170O31K90K43L05L48J25o70
$$ 2672414 2674516 2676881 2678801 2679935 2680466 2681002 2682043 2683441 2684611 2685242 2685532 2685775 2686080 2686428 2686553 2685883
57256B685883j727k051j140J79P50N08K04J35l3m73r59j410k014k870l939n204
$$ 2685883 2684156 2682105 2680965 2681144 2681894 2682402 2682606 2682741 2682708 2682235 2681276 2679866 2677852 2674982 2671043 2665839
57240B665839o425p055o929o704p048p646p602o579n025l481k236j326m23J009
$$ 2665839 2659414 2652359 2645430 2638726 2631678 2624032 2616430 2609851 2604826 2601345 2599109 2597783 2597360 2598369
57226B598369K950M650N719O769Q377J0067J1214J2194J3644J5142J5849J5997
$$ 2598369 2601319 2605969 2611688 2618457 2626834 2636901 2648115 2660309 2673953 2689095 2704944 2720941
57214B720941J6461J7117J7034J6192J5602J5542J5030J3354J1018Q731O397L610
$$ 2720941 2737402 2754519 2771553 2787745 2803347 2818889 2833919 2847273 2858291 2867022 2873419 2877029
57202B877029L17l356p351j1413j5184j8673k2040k4863k6272k5934k4206k1416
$$ 2877029 2877346 2873990 2866639 2855226 2840042 2821369 2799329 2774466 2748194 2722260 2698054 2676638
57190B676638j7755j3918j0909r097q142p941q771j0336j1530j1528j0532r355
$$ 2676638 2658883 2644965 2634056 2624959 2616817 2608876 2600105 2589769 2578239 2566711 2556179 2546824
57178B546824q879r801j2091j4659j6382j7452j8901k0889k2597k3893k5891k9439
$$ 2546824 2537945 2528144 2516053 2501394 2485012 2467560 2448659 2427770 2405173 2381280 2355389 2325950
57166B325950l4096l9070m4217m9574n4824n9844o5136p1082p7310q3286q9032
$$ 2325950 2291854 2252784 2208567 2158993 2104169 2044325 1979189 1908107 1830797 1747511 1658479
57155A658479r4841j00792j06990j13966j22290j32018j42624j53448j64162j75044
$$ 1658479 1563638 1462846 1355856 1241890 1119600 987582 844958 691510 527348 352304
57145C52304A65669c3194k10854k21814k31841k41297k50055k57972k65492k72831
$$ 352304 165669 -33194 -244048 -465862 -697703 -939000 -1189055 -1447027 -1712519 -1985350
57135a985350k79201k83875k87480k91012k94085k95539k95551k95651k96804
$$ -1985350 -2264551 -2548426 -2835906 -3126918 -3421003 -3716542 -4012093 -4307744 -4604548
57126d604548k99002l02761l09591l20830l37243l59819l89588m26426m69287
$$ -4604548 -4903550 -5206311 -5515902 -5836732 -6173975 -6533794 -6923382 -7349808 -7819095
57117g819095n17624n71524o30611o94369p63834q41943r32265j038396j164217
$$ -7819095 -8336719 -8908243 -9538854 -10233223 -10997057 -11839000 -12771265 -13809661 -14973878
57108a4973878j313522j489926j698691j948614k251469k621370l077345l646918
$$ -14973878 -16287400 -17777326 -19476017 -21424631 -23676100 -26297470 -29374815 -33021733
57100c3021733m366401n278831o431723p872113r638095j1754466j4236382j7088081
$$ -33021733 -37388134 -42666965 -49098688 -56970801 -66608896 -78363362 -92599744 -109687825
57092a09687825k0278656k3694178k7085030l0039179l2025292l2540976l1328275
$$ -109687825 -129966481 -153660659 -180745689 -210784868 -242810160 -275351136 -306679411
57085c06679411k8521673k4601980k0181024j5779319j1720244q120645m910745
$$ -306679411 -335201084 -359803064 -379984088 -395763407 -407483651 -415604296 -420515041
57078d20515041j891414J140448M264724P425637J0531660J3526927J6343787
$$ -420515041 -422406455 -421266007 -417001283 -409575646 -399043986 -385517059 -369173272
57071c69173272J8822805K0738932K1931052K2398723K2275437K1729178K0894560
$$ -369173272 -350350467 -329611535 -307680483 -285281760 -263006323 -241277145 -220382585
57064b20382585J9871570J8748727J7605832J6495185J5427252J4378487J3315885
$$ -220382585 -200511015 -181762288 -164156456 -147661271 -132234019 -117855532 -104539647
57057a04539647J2219573J1090594R946389Q813722P723016O702422N772311M943654
$$ -104539647 -92320074 -81229480 -71283091 -62469369 -54746353 -48043931 -42271620 -37327966
57049c7327966M219881L598574L072060K629161K258060J947835J688474J471193
$$ -37327966 -33108085 -29509511 -26437451 -23808290 -21550230 -19602395 -17913921 -16442728
57041a6442728J288922J135660J005666Q94270P98867P17822O48608N88106N34363
$$ -16442728 -15153806 -14018146 -13012480 -12118210 -11319343 -10601521 -9952913 -9364807 -8830444
57032h830444M86815M44966M07956L75141L46065L20023K96616K76407K59918
$$ -8830444 -8343629 -7898663 -7490707 -7115566 -6769501 -6449478 -6152862 -5876455 -5616537
57023e616537K46232K33806K22343K12604K04476J96631J88365J80516J74070
$$ -5616537 -5370305 -5136499 -4914156 -4701552 -4497076 -4300445 -4112080 -3931564 -3757494
57014c757494J68808J63882J58916J53850J48027J40202J29637J17018J04083
$$ -3757494 -3588686 -3424804 -3265888 -3112038 -2964011 -2823809 -2694172 -2577154 -2473071
57005b473071R2225Q1551P1616O2743N5898N1169M7295M3206L9196L6047L3773
$$ -2473071 -2380846 -2299295 -2227679 -2164936 -2109038 -2057869 -2010574 -1967368 -1928172 -1892125 -1858352
56994a858352L2016L1025L1278L2441L3651L4625L5756L7234L8717L9819M0327
$$ -1858352 -1826336 -1795311 -1764033 -1731592 -1697941 -1663316 -1627560 -1590326 -1551609 -1511790 -1471463
56983a471463M0028L8767L6661L3936L0811K7705K5176K3291K1567J9814J8533
$$ -1471463 -1431435 -1392668 -1356007 -1322071 -1291260 -1263555 -1238379 -1215088 -1193521 -1173707 -1155174
56972a155174J8056J7928J7750J7939J8957K0315K1179K1548K2072K2979K3984
$$ -1155174 -1137118 -1119190 -1101440 -1083501 -1064544 -1044229 -1023050 -1001502 -979430 -956451 -932467
56961i32467K4993K6083K6988K7247K6746K5641K3945K1727J9392J7150J4665
$$ -932467 -907474 -881391 -854403 -827156 -800410 -774769 -750824 -729097 -709705 -692555 -677890
56950f77890J1778R199P701P050O472N918N985O813P897Q929J0025J1232J2509
$$ -677890 -666112 -656913 -649212 -642162 -635690 -629772 -623787 -616974 -609077 -600148 -590123 -578891 -566382
56937e66382J4161J6508J9144K1144K1999K1811K0674J8627J6185J4101J2482
$$ -566382 -552221 -535713 -516569 -495425 -473426 -451615 -430941 -412314 -396129 -382028 -369546
56926c69546J0671Q217N416K793N43j376k964m156m812m773m123l327k843k690
$$ -369546 -358875 -350658 -345242 -342449 -341906 -343282 -346246 -350402 -355214 -359987 -364110 -367437 -370280 -372970
56912c72970k536k069j117K52J574K281K413K559K872K808K207J900K598L798
$$ -372970 -375506 -377575 -378692 -378440 -376866 -374585 -372172 -369613 -366741 -363933 -361726 -359826 -357228 -353430
56898c53430M544M803N262O277P749R647J1810J3675J4914J5953J7075J7602J6864
$$ -353430 -348886 -344083 -338821 -332544 -324795 -315148 -303338 -289663 -274749 -258796 -241721 -224119 -207255
56885b07255J5441J4304J3326J1854J0208R139Q085N760K519M30N72J764K480
$$ -207255 -191814 -177510 -164184 -152330 -142122 -132983 -124898 -119138 -116619 -116189 -115617 -113853 -111373
56872a11373K619K814L282M218O167R099J2009J4218J6338J9085D15K3798K4171
$$ -111373 -108754 -105940 -102658 -98440 -92273 -83174 -71165 -56947 -40609 -21524 415 24213 48384
56859D8384K3127K0607J6877J3040J0091P663M566M06m023p729j0145j0941r978
$$ 48384 71511 92118 108995 122035 132126 139789 144355 144761 140738 133009 122864 111923 101945
56846A01945p587m460j152K126N404Q997J3399J8771K4662L0447L5638L9413M0351
$$ 101945 94358 89898 88746 90872 96276 105273 118672 137443 162105 192552 228190 267603 307954
56833C07954L7447L1299K3728J6185R103K568l173q174j3035j8130k2814k5869
$$ 307954 345401 376700 400428 416613 425716 428284 425111 416937 403902 385772 362958 337089
56821C37089k6651k5539k3296k0316j6546j1915o562p19N410J1553J7233K1816
$$ 337089 310438 284899 261603 241287 224741 212826 206264 205545 210955 222508 239741 261557
56809B61557K4624K5089K2995J8774J3402P891K866j463n277r162j3726j8713
$$ 261557 286181 311270 334265 353039 366441 374332 377198 375735 370458 361296 347570 328857
56797C28857k2807k4710k4360k2716k0540j7906j4809j1577q461n317j961J416
$$ 328857 306050 281340 256980 234264 213724 195818 181009 169432 160971 155654 153693 155109
56785A55109M491P147R361J0883J1283J0270P907M631J084k146m780o896q810
$$ 155109 159600 166747 176108 186991 198274 208544 216451 221082 222166 220020 215240 208344 199534
56772A99534j0874j3075j4815j5343j4577j3261j2080j1030r878q805q121p650
$$ 199534 188660 175585 160770 145427 130850 117589 105509 94479 84601 75796 67675 60025
56760F0025p012o239n605n058m440m030m081m064l209j843j174j563j918j208
$$ 60025 53013 46774 41169 36111 31671 27641 23560 19496 16287 14444 13270 11707 9789 8581
56746H581Q8P18K71m99p38l34J82L22J37J05M49P65O14K99N52J512K540L040K970
$$ 8581 8669 9387 9658 9159 8421 8087 8269 8591 8728 8833 9282 10047 10661 10960 11512 13024 15564 18604 21574
56727B1574K533K007J855K273K572J818L15m04M85J983K651K418K261K600K870
$$ 21574 24107 26114 27969 30242 32814 34632 34947 34543 35028 37011 39662 42080 44341 46941 49811
56712D9811K459J457M19r9R4N99P02J49n18o73l17J66O13J013J172R70O83N84
$$ 49811 52270 53727 54146 54047 54141 54740 55442 55591 55073 54400 54083 54249 54862 55875 57047 58017 58700 59284
56694E9284M37j17q87j321j325j280j300r70j3J188J925J836J127K88k02j10M59
$$ 59284 59721 59604 58717 57396 56071 54791 53491 52521 52508 53696 55621 57457 58584 58872 58670 58560 59019
56677E9019J117J371R72K03j98K63J268J951J821J132M49J27L10R32J592J843
$$ 59019 60136 61507 62479 62682 62484 62747 64015 65966 67787 68919 69368 69495 69805 70737 72329 74172
56661G4172J788K011K603K788J935N65j68J79J026J658J933K078K203K237K142
$$ 74172 75960 77971 80574 83362 85297 85862 85694 85873 86899 88557 90490 92568 94771 97008 99150
56646I9150K041K111K310K258J615N78k33m73l51j74L5K33J50l19q13r95r88r63
$$ 99150 101191 103302 105612 107870 109485 110063 109830 109357 109006 108832 108867 109100 109250 108931 108118 107123 106135 105172
56628A05172o17L83J610K137J634P23K32M02R32J428J705J832K010K280K394K207
$$ 105172 104555 104938 106548 108685 110319 111042 111274 111676 112608 114036 115741 117573 119583 121863 124257 126464
56612A26464K002K139K493K585K279J930J788J680J476J448J850K388K514K107
$$ 126464 128466 130605 133098 135683 137962 139892 141680 143360 144836 146284 148134 150522 153036 155143
56598A55143J514R87M77M0%M31Q28O97L12M16J136J673J318L70k86k87q9k29o72
$$ 155143 156657 157644 158121 158161 158161 158592 159420 160117 160429 160845 161981 163654 164972 165342 165056 164769 164680 164451 163779
56579A63779r74q67n49m50p14r25m91N76J545J813J666J940L013M444N546O038
$$ 163779 162805 161938 161389 160939 160225 159300 158809 159385 160930 162743 164409 166349 169362 173806 179352 185390
56563A85390O171O427P129Q148R037R515R676R679R489R095Q644Q153P412O458
$$ 185390 191561 197988 205117 213265 222302 231817 241493 251172 260661 269756 278400 286553 293965 300423
56549C00423N760N546N312M518L403K616K272J946J356M90o92k135l442m290m869
$$ 300423 306183 311729 317041 321559 324962 327578 329850 331796 333152 333642 332950 330815 327373 323083 318214
56534C18214n393n571n267n222o194p673q408q104p565p279o972o520o194n875
$$ 318214 312821 307250 301983 296761 290567 282894 274486 266382 258817 251538 244566 238046 231852 225977
56520B25977n162m416m509n235n280m179l154l286l981m065l465k893k614k378
$$ 225977 220815 216399 211890 206655 201375 197196 194042 190756 186775 182710 179245 176352 173738 171360
56506A71360k091j786j372r77j038j570j924j752j553j734j788j112l7O72Q52
$$ 171360 169269 167483 166111 165134 164096 162526 160602 158850 157297 155563 153775 152663 152626 153298 154150
56491A54150Q27P46O34O59P90O46K08P1M43O08N8n29k70N54R41O60L23K68K22
$$ 154150 154977 155723 156357 157016 157806 158452 158660 158731 159174 159782 159840 159311 159041 159595 160536 161196 161519 161787 162009
56472A62009k0l11m65m56l22j58J7N28J653K783K802J633N55M85Q33P55N75J010
$$ 162009 161989 161678 161213 160757 160435 160277 160294 160822 162475 165258 168060 169693 170248 170733 171566 172321 172896 173906
56454A73906J819K282K398K472K136R01o59j456j356j070q68m57R3K90Q3m9J78
$$ 173906 175725 178007 180405 182877 185013 185914 185255 183799 182443 181373 180505 180048 180141 180431 180514 180465 180643
56437A80643P22J543K318K277J124k00n35M1O26R22J245J524J335P40J76l07p69
$$ 180643 181365 182908 185226 187503 188627 188427 187892 187933 188559 189481 190726 192250 193585 194325 194501 194194 193425
56420A93425p43R9J039J155P55P72J155J166R95J500K439K467J191k13p93q74
$$ 193425 192682 192781 193820 194975 195730 196502 197657 198823 199818 201318 203757 206224 207415 207202 206409 205535
56404B05535r85q82k50N86J191J454J256N13k52k92K30M27J24J32Q38J588J798
$$ 205535 204550 203668 203418 204004 205195 206649 207905 208418 208166 207874 208104 208531 208655 208787 209625 211213 213011
56387B13011J645J332O89m0m8Q53J752J906J654J618J767J813J772J592R86J12
$$ 213011 214656 215988 216677 216637 216589 217442 219194 221100 222754 224372 226139 227952 229724 231316 232302 232414
56371B32414k85P9N66O54P19J135J388Q84O5r7N43J232J378J078O80L10n4l79
$$ 232414 232129 232208 232774 233428 234147 235282 236670 237554 237619 237522 238065 239297 240675 241753 242433 242743 242689 242310
56353B42310n62n99p06j070j403j068NR30R42N12O40J346J732J457J146J269J495
$$ 242310 241748 241149 240443 239373 237970 236902 236907 237837 238779 239291 239931 241277 243009 244466 245612 246881 248376
56336B48376J485J384J352J285J286J687K302K448J937J446J529J901J996J701
$$ 248376 249861 251245 252597 253882 255168 256855 259157 261605 263542 264988 266517 268418 270414 272115
56322B72115J230Q19P57J260K052K489K300J849J601J745K227K676K493J553O00
$$ 272115 273345 274164 274921 276181 278233 280722 283022 284871 286472 288217 290444 293120 295613 297166 297766
56307B97766L80O39P37Q45J546K566L025K831K623K413J583L41k30J72O39O93
$$ 297766 298146 298785 299522 300367 301913 304479 307504 310335 312958 315371 316954 317295 317065 317237 317876 318569
56291C18569J004J926K543K053J115R82J905L125L945M220M180M163M212L891
$$ 318569 319573 321499 324042 326095 327210 328192 330097 333222 337167 341387 345567 349730 353942 357833
56277C57833K925J997K105L203M241M585M508M371M291M647N735O884P092O619
$$ 357833 360758 362755 364860 368063 372304 376889 381397 385768 390059 394706 400441 407325 414417 421036
56263D21036O736P692Q460Q639R200J0714J2336J3271J3965J5052J6263J7224
$$ 421036 427772 435464 443924 452563 461763 472477 484813 498084 512049 527101 543364 560588
56251E60588J8337K0032K2064K4177K6573K9060L0743L1257L1407L1901L2289
$$ 560588 578925 598957 621021 645198 671771 700831 731574 762831 794238 826139 858428
56240H58428L1774L0195K7711K4423K0824J7712J5105J2127Q422M620J032k878
$$ 858428 890202 920397 948108 972531 993355 1011067 1026172 1038299 1046721 1051341 1052373 1049495
56228A049495p209j1026j3763j6020j8297k0154k1356k2569k4082k5036k4816
$$ 1049495 1042286 1031260 1017497 1001477 983180 963026 941670 919101 895019 869983 845167
56217H45167k4097k3663k3312k2751k2380k2237k1337j9142j6645j5064j4332
$$ 845167 821070 797407 774095 751344 728964 706727 685390 666248 649603 634539 620207
56206F20207j3789j3263j2606j1311r473q072p423o534m888l504l247l418l197
$$ 620207 606418 593155 580549 569238 559765 551693 544270 537736 532848 529344 526097 522679 519482
56193E19482l068l449l301j707K83J020N89K49L58M18M51Q10J158R18L35Pr0j62
$$ 519482 516414 512965 509664 507957 508240 509260 509849 510098 510456 510874 511325 512135 513293 514211 514546 514553 514463 514301
56175E14301J13Q46J359J303J498K568L709L913L522L426L643L863M394N450O367
$$ 514301 514414 515260 516619 517922 519420 521988 525697 529610 533132 536558 540201 544064 548458 553908 560275
56160E60275O722P184Q199Q964Q871Q752R378J0004R868R874J1171J3168J4633
$$ 560275 566997 574181 582380 591344 600215 608967 618345 628349 638217 648091 659262 672430 687063
56147F87063J5728J7305J9179K0755K2456K4888K7533K9876L2844L7487M3233
$$ 687063 702791 720096 739275 760030 782486 807374 834907 864783 897627 935114 978347
56136I78347M9141N5822O4291P3853Q2988R1378R9252J05732J09776J11975J13443
$$ 978347 1027488 1083310 1147601 1221454 1304442 1395820 1495072 1600804 1710580 1822555 1935998
56125A935998J13769J11971J08565J04573R9337R1383Q0854O9111N6684M3708
$$ 1935998 2049767 2161738 2270303 2374876 2474213 2565596 2646450 2715561 2772245 2815953
56115B815953L1575K1829J3845N613l632j3451k4080l5965m7972n8263o6713p4560
$$ 2815953 2847528 2869357 2883202 2888815 2885183 2871732 2847652 2811687 2763715 2705452 2638739 2564179
56103B564179q2074q8486r3719r8207j01367j02141j00594r7335r2085q4626p6303
$$ 2564179 2482105 2393619 2299900 2201693 2100326 1998185 1897591 1800256 1708171 1623545 1547242
56092A547242o8662o1452n3830m6452m0257l4364k7610k1065j6470j3146r199
$$ 1547242 1478580 1417128 1363298 1316846 1276589 1242225 1214615 1193550 1177080 1163934 1154735
56081A154735m810j536Q30L702O676Q017P792P583P570O733N488N182N319M179
$$ 1154735 1149925 1148389 1149219 1152921 1159597 1167614 1175406 1182989 1190559 1197292 1202780 1207962 1213281 1217460
56067A217460J956M57nn92j189o48N62R31Q57K057M299N711O098O983Q526R476
$$ 1217460 1219416 1219873 1219868 1219276 1218087 1217439 1218001 1218932 1219789 1221846 1226145 1231856 1237954 1244937 1253463 1262939
56051A262939R942J1165J2761J3246J3012J3712J5045J5407J5274J6533J8799
$$ 1262939 1272881 1284046 1296807 1310053 1323065 1336777 1351822 1367229 1382503 1399036 1417835
56040A417835J9865J9634K0022K1286K2039K2642K4790K7873K9612L0216L2049
$$ 1417835 1437700 1457334 1477356 1498642 1520681 1543323 1568113 1595986 1625598 1655814 1687863
56029A687863L5246L7636L8922M0885M3391M4345M3870M4361M6191M7375M7606
$$ 1687863 1723109 1760745 1799667 1840552 1883943 1928288 1972158 2016519 2062710 2110085 2157691
56018B157691M8565N0196N0900N1342N3745N7488N9862O1037O3596O7397O9912
$$ 2157691 2206256 2256452 2307352 2358694 2412439 2469927 2529789 2590826 2654422 2721819 2791731
56007B791731P1417P4611P9189Q2262Q4163Q8168R4334R9447J03170J08310J14900
$$ 2791731 2863148 2937759 3016948 3099210 3183373 3271541 3365875 3465322 3568492 3676802 3791702
55996C791702J20172J24519J30985J38837J44520J49048J57057J68301J77949
$$ 3791702 3911874 4036393 4167378 4306215 4450735 4599783 4756840 4925141 5103090
55987E103090J85776J96823K12128K27421K42160K60976K84617L08478L31817
$$ 5103090 5288866 5485689 5697817 5925238 6167398 6428374 6712991 7021469 7353286
55978G353286L59345L92050M26067M62324N07240N61963O21459O86305P64380
$$ 7353286 7712631 8104681 8530748 8993072 9500312 10062275 10683734 11370039 12134419
55969A2134419Q59025R67452J093120J247321J436833J663843J940463K288701
$$ 12134419 12993444 13960896 15054016 16301337 17738170 19402013 21342476 23631177
55961B3631177K723672L252178L889685M663102N599266O732418Q120194R822482
$$ 23631177 26354849 29607027 33496712 38159814 43759080 50491498 58611692 68434174
55953F8434174J1857601J4187806J6697330J9086602K0781815K1097170J9650615
$$ 68434174 80291775 94479581 111176911 130263513 151045328 172142498 191793113
55946A91793113J6657730J2786655Q740706M978403J683612j208109l981457o945040
$$ 191793113 208450843 221237498 229978204 234956607 236640219 235432110 231450653 224505613
55938B24505613j0096064j3000831j5091935j6085937j6098193j5437006j4390329
$$ 224505613 214409549 201408718 186316783 170230846 154132653 138695647 124305318
55931A24305318j3178363j1970521j0864424r873471q969268q125938p322403
$$ 124305318 111126955 99156434 88292010 78418539 69449271 61323333 54000930
55924E4000930o538471n772225n045187m377931l774565l236463k771696k381086
$$ 54000930 47462459 41690234 36645047 32267116 28492551 25256088 22484392 20103306
55916B0103306k050753j767776j530254j335361j171327j029007r09257q11747
$$ 20103306 18052553 16284777 14754523 13419162 12247835 11218828 10309571 9497824
55908I497824p27696o50545n83248n28317m80186m33881l92235l58217l28191
$$ 9497824 8770128 8119583 7536335 7008018 6527832 6093951 5701716 5343499 5015308
55899E015308k98687k72321k51468k32938k14007j97107j83802j70630j55472
$$ 5015308 4716621 4444300 4192832 3959894 3745887 3548780 3364978 3194348 3038876
55890C038876j41802j32225j23717j13498j03780r6516q9152p9814p1266o5560
$$ 3038876 2897074 2764849 2641132 2527634 2423854 2327338 2238186 2158372 2087106 2021546
55880B021546n9898n1954m4288l9351l4889k8554k2633j9945j9108j7895j7548
$$ 2021546 1961648 1909694 1865406 1826055 1791166 1762612 1739979 1720034 1700926 1683031 1665483
55869A665483j9758k2789k4441k5761k8379l1123l2582l4067l6857l9243l9261
$$ 1665483 1645725 1622936 1598495 1572734 1544355 1513232 1480650 1446583 1409726 1370483 1331222
55858A331222l7862l6703l5380l3306l1690l1280l0731k9309k8464k8771k8293
$$ 1331222 1293360 1256657 1221277 1187971 1156281 1125001 1094270 1064961 1036497 1007726 979433
55847I79433k6128k4432k4606k4685k2907k0823k0224j9866j8069j5939j5170
$$ 979433 953305 928873 904267 879582 856675 835852 815628 795762 777693 761754 746584
55836G46584j5031j4154j3127j2819j2336j0918r714r431q571o181m000l563l558
$$ 746584 731553 717399 704272 691453 679117 668199 658485 649054 640483 634302 630302 626739 623181
55823F23181k484j475j821k024k47K259L103K552K549L385L991M352N031N361
$$ 623181 620697 619222 617401 615377 615130 617389 620492 623044 625593 628978 632969 637321 642352 647713
55809F47713M399K833J807Q77j029l547n583p081q500r596j0245j1225j2709j3338
$$ 647713 652112 654945 656752 657629 656600 653053 647470 640389 631889 622293 612048 600823 588114 574776
55795E74776j2289j0855j0354j0017q683p065o364n961m514k304n84M78J480K250
$$ 574776 562487 551632 541278 531261 522578 515513 509149 503188 498674 496370 495786 496264 497744 499994
55781D99994K350K198K245J848M31j159j856k053k760m025n386o913q557r467
$$ 499994 502344 504542 506787 508635 509066 507907 506051 503998 501238 497213 491827 484914 476357 466890
55767D66890r190q611q587q690q336p961q012p953p366o847o733o332n437n177
$$ 466890 457700 449089 440502 431812 423476 415515 407503 399550 392184 385337 378604 372272 366835 361658
55753C61658o130p121p087o666o586o157m848l769l924m365l857l067l264m018
$$ 361658 355528 348407 341320 334654 328068 321911 317063 313294 309370 305005 301148 298081 294817 290799
55739B90799l975k998j915j029l32k38p18p04L11J210R99L47L4o52k324l781l692
$$ 290799 286824 283826 281911 280882 280550 280312 279594 278890 279201 280411 281410 281757 281791 281139 278815 275034 271342
55722B71342k791k506k616k109j302j113j205p42j00l0L2R36K043K294K164K587
$$ 271342 268551 266045 263429 261320 260018 258905 257700 256958 256858 256828 256860 257796 259839 262133 264297 266884
55706B66884K926K062P08M54J027P81m98j370j144n60j50K72N40K17l61m53k06
$$ 266884 269810 271872 272580 273034 274061 274842 274344 272974 271830 271270 271120 271392 271932 272149 271788 271335 271129
55689B71129j87o6Q30K047K550K341K188K199K136K522L818N001M738L563L086
$$ 271129 270942 270876 271706 273753 276303 278644 280832 283031 285167 287689 291507 296508 301246 304809 307895
55674C07895L419L231K156J308J323J643J910K452L176L343K760K037J591J308
$$ 307895 311314 314545 316701 318009 319332 320975 322885 325337 328513 331856 334616 336653 338244 339552
55660C39552J073P24k08j724k818k867k865m044n870o907p085p424q000p982p411
$$ 339552 340625 341349 341141 339417 336599 333732 330867 326823 320953 314046 306961 299537 291537 283555 276144
55645B76144p147p194o794o038n759n830n240l914k894k669k758k890l114k918
$$ 276144 268997 261803 255009 248971 243212 237382 232142 228228 225334 222665 219907 217017 213903 210985
55631B10985j850q87j421k875l184j776k10L37L45K81m02j796k716k330j330p27
$$ 210985 209135 208248 206827 203952 200768 198992 198782 199119 199464 199745 199343 197547 194831 192501 191171 190444
55615A90444n44m16m19n80m94p2J12l08r76j520j939k104j677q08j36J52M45Q15
$$ 190444 189900 189484 189065 188485 187991 187919 188031 187723 186747 185227 183288 181184 179507 178699 178563 178715 179160 179975
55597A79975Q19L36j86m16l30J55Q97J097K01j037j396q73l56R4J077K209K273
$$ 179975 180794 181130 180944 180528 180198 180353 181250 182347 182548 181511 180115 179242 178886 178980 180057 182266 184539
55580A84539J188K77K64M80M33N61J026J177Q29P24J147J388J199J406K415L322
$$ 184539 185727 186004 186268 186748 187181 187742 188768 189945 190774 191498 192645 194033 195232 196638 199053 202375
55564B02375L357K954K606J857M10p87p71q4K8n60q97m65K50N69L19j99n24l42
$$ 202375 205732 208686 211292 213149 213559 212772 212001 211917 211945 211385 210488 210023 210273 210842 211161 210962 210438 210096
55546B10096K80R85J461J472Q55q6n44j40L59M1p92j219j303j881k919l406l049
$$ 210096 210376 211361 212822 214294 215149 215063 214519 214379 214738 214779 213987 212768 211465 209584 206665 203259 200210
55529B00210k746l042l352l121k657k339k017j647j560j754j754j518j513j693
$$ 200210 197464 194422 191070 187949 185292 182953 180936 179289 177729 175975 174221 172703 171190 169497
55515A69497j443p67m52o57o23j34no33j239j223j038j073q57j61K66j6k08M56
$$ 169497 168054 167287 166835 166178 165555 165421 165416 164783 163544 162321 161283 160210 159353 159192 159458 159442 159234 159690
55497A59690J403J665J251O73qo92o55L98J390J115o9q52q20o43p77r65r15o02
$$ 159690 161093 162758 164009 164682 164674 163982 163327 163725 165115 166230 166161 165309 164489 163846 163069 162104 161189 160587
55479A60587LP84J254J026L89l6l5J53J77k52j116j677j057M51J350Q11j70j83
$$ 160587 160590 161374 162628 163654 164043 164007 163972 164125 164302 164050 162934 161257 160200 160651 162001 162812 162642 162459
55461A62459P04J314J049K93m59r53r19k89M08N21M8n23r36j150r53k32N65Q65
$$ 162459 163163 164477 165526 165819 165360 164407 163488 163199 163607 164128 164176 163653 162717 161567 160614 160382 160947 161812
55443A61812P29O58P51O36J46m15o75n48k00O0Mk53l30j21M4m8j98j85j30j18
$$ 161812 162541 163199 163950 164586 164732 164317 163642 163094 162894 162954 162958 162705 162375 162254 162298 162250 162052 161867 161737 161619
55423A61619P4N65J013J099J007J107J416J664J707J507J072O65P50J443K147
$$ 161619 161693 162258 163271 164370 165377 166484 167900 169564 171271 172778 173850 174515 175265 176708 178855
55408A78855K096J121k21j111j067l57J67r3q63j472j771k008k063j590q50n94
$$ 178855 180951 182072 181851 180740 179673 179316 179483 179390 178527 177055 175284 173276 171213 169623 168773 168179
55392A68179r64j226q50q6N57P87L98m96j072n83M74Q78M87K63M33J06q86j350
$$ 168179 167215 165989 165139 165053 165610 166397 166795 166299 165227 164644 165118 165996 166483 166746 167179 167285 166399 165049
55374A65049p51k86q47j336m86P64N04j250k552k211q85L82J273J705J446O78
$$ 165049 164298 164012 163165 161829 161343 162107 162611 161361 158809 156598 155713 156095 157368 159073 160519 161197
55358A61197J38K42O53Q35O66L50J12L2k8k02k64J23P04O65j62q86p45j36J35
$$ 161197 161335 161577 162230 163065 163731 164081 164193 164225 164197 163995 163731 163854 164558 165223 165061 164175 163430 163294 163429
55339A63429L4m7j63n40q57o83k72j71k82j82m0l24q67j021o86l00M3O44J385
$$ 163429 163463 163416 163253 162713 161856 161173 160901 160730 160448 160266 160226 159902 159035 158014 157328 157028 157071 157715 159100
55320A59100J665J280P08M35M97P06Q35N42l19j313j751j418o95o1K39J26k43
$$ 159100 160765 162045 162753 163188 163685 164391 165226 165768 165449 164136 162385 160967 160272 160211 160450 160576 160333
55303A60333n34o66r34j429j585q25N65J683J930J424O97L36O15J163J308R73
$$ 160333 159799 159133 158199 156770 155185 154360 154925 156608 158538 159962 160659 160995 161610 162773 164081 165054
55287A65054P74R66R54L32k80j62L59M77J68M6K71M37L72K73J96j0l27o70j073
$$ 165054 165828 166794 167748 168080 167800 167638 167997 168474 168642 168688 168959 169396 169768 170041 170237 170227 169900 169230 168157
55268A68157j374j092j86N07L21k50k75K48O20O56P77J133J404J411J211Q27M26
$$ 168157 166783 165691 165505 166012 166333 166083 165808 166056 166676 167332 168109 169242 170646 172057 173268 174095 174521
55251A74521M01O98N43l86j171r25k53l16r75j170p45m37k66M52J440J417J00
$$ 174521 174922 175620 176163 175777 174606 173681 173428 173112 172137 170967 170222 169785 169519 169971 171411 172828 172928
55234A72928j094r95j32L31J56j31j78N6M96Q21O21O0j55K83R29J248J134O17
$$ 172928 171834 170839 170707 171038 171194 171063 170885 170941 171437 172258 172879 172939 172784 173067 173996 175244 176378 176995
55216A76995k07q14n63L78J063R38L44k46p02q40m20K25L97J92M55J297J671J003
$$ 176995 176788 175974 175411 175789 176852 177790 178134 177888 177186 176346 175926 176151 176548 176740 177195 178492 180163 181166
55198A81166K10L27R25Q91J43m34m65m50p65j074r45n17l26o63j256j447q51K07
$$ 181166 181376 181703 182628 183519 183662 183228 182763 182313 181548 180474 179529 179012 178686 178023 176767 175320 174469 174676
55180A74676J053J411J422J062J74q28j056l06N06N64K44L88R46J174R07P72J025
$$ 174676 175729 177140 178562 179624 179798 178970 177914 177608 178114 178678 178922 179310 180256 181430 182337 183109 184134
55163A84134J057M06k66Q6J415K454K252J307P64R11J065Q26O04O42M21m31j259
$$ 184134 185191 185597 185331 185417 186832 189286 191538 192845 193609 194520 195585 196411 197015 197657 198078 197647 196388
55146A96388j234o37m46q90j258j095p27n29m58m78p33j101j101n75J3J48j93
$$ 196388 195154 194517 194071 193181 191923 190828 190101 189572 189114 188636 187903 186802 185701 185126 185139 185287 185094
55129A85094o53q14m39K32M85n5p89q14j23N68R71J380J700J338K97n20n16j23
$$ 185094 184441 183627 183188 183420 183905 183850 183061 182247 182124 182692 183663 185043 186743 188081 188378 187858 187342 187219
55111A87219P6K12N86Q77N96p7m49j77M40Q90R20P19O69P96O24p4o18k18P43J086
$$ 187219 187295 187507 188093 188970 189566 189489 189040 188863 189303 190193 191113 191832 192501 193297 193921 193847 193229 193011 193754 194840
55091A94840N31L6J86K81l90j271j320n60N7ll30l23P5M28L19j64l97O0P44P42
$$ 194840 195371 195407 195593 195874 195484 194213 192893 192333 192390 192387 192057 191734 191809 192237 192556 192392 191995 192055 192799 193541
55071A93541j12j047j469j585j617j154J68J835K902K878J829N1j863k964k629
$$ 193541 193429 192382 190913 189328 187711 186557 186725 188560 191462 194340 196169 196220 194357 191393 188764
55056A88764j202L56J320J538J239Q09N37L10j72p39p51L2R43J092K77r40j797
$$ 188764 187562 187918 189238 190776 192015 192824 193361 193671 193499 192760 192009 192041 192984 194076 194353 193413 191616
55039A91616j806j074k72Q5K99R23J696J805J218P71P49M66l63r18o23j41j48
$$ 191616 189810 188736 188464 188549 188848 189771 191467 193272 194490 195261 196010 196476 196113 195195 194572 194431 194283
55022A94283j26N78J325J042J0n09q9N51Q95J067J011L78n90j032o18N2M04M64
$$ 194283 194157 194735 196060 197102 197112 196603 196514 197065 197960 199027 200038 200416 199826 198794 198176 198228 198632 199096
55004A99096L75P0k85k40K23N09L25K04O70J348J438Q44K96L11N22K09o41j231
$$ 199096 199471 199541 199256 199016 199239 199748 200073 200277 200947 202295 203733 204577 204873 205184 205706 205915 205274 204043
54986B04043r44j84J44j97n36l21K26O19P90Q72P98N35L18K97K56J14K61R03J476
$$ 204043 203099 202915 203059 202862 202326 202005 202231 202850 203640 204512 205310 205845 206163 206460 206716 206830 207091 207994 209470
54967B09470J430J169J487K285K672K249J513R77O84O52J102J892K385K167J516
$$ 209470 210900 212069 213556 215841 218513 220762 222275 223252 223936 224588 225690 227582 229967 232134 233650
54952B33650R24N41L12K34L47P06J502K844M302N098M970M512M490N104O082P193
$$ 233650 234574 235115 235427 235661 236008 236714 238216 241060 245362 250460 255430 259942 264432 269536 275618 282811
54936B82811Q340R446J0445J1296J1817J1740J1045J0045Q959P615N805L667J480
$$ 282811 291151 300597 311042 322338 334155 345895 356940 366985 375944 383559 389364 393031 394511
54923C94511p87l321n853p628q218q117q214q730r071q803q357q335q499q008
$$ 394511 393724 390403 384550 376922 368704 360587 352373 343643 334572 325769 317412 309077 300578 292570
54909B92570o668n267m428l744k518r68k5q3n01m63J37Q67J451K064L088M718
$$ 292570 285902 280635 276207 272463 269945 268977 268952 268869 268368 267905 268042 268909 270360 272424 275512 280230
54893B80230O790Q855J0453J1389J1794J1943J1957J1637J0585Q619O030L342
$$ 280230 287020 295875 306328 317717 329511 341454 353411 365048 375633 384252 390282 393624
54881C93624Q99j222k958m284n456o854q474r822j0477j0524j0341j0155r955
$$ 393624 394523 393301 390343 386059 380603 373749 365275 355453 344976 334452 324111 313956 304001
54868C04001r571q750p431o061n351n437n628n197m201l247k698k433k263k209
$$ 304001 294430 285680 278249 272188 266837 261400 255772 250575 246374 243127 240429 237996 235733 233524
54854B33524k360k587k563k109j495j177j124p21K59R87N29p62j562j317p86p17
$$ 233524 231164 228577 226014 223905 222410 221233 220109 219388 219647 220634 221163 220401 218839 217522 216736 216019
54838B16019r20r86j061j290j280p76k69k66m44k06L38O90P72P98O46K07j9N23
$$ 216019 215099 214113 213052 211762 210482 209706 209437 209171 208727 208521 208859 209549 210321 211119 211765 211972 211953 212476
54820B12476J418J680J150P22J077J831K120J590O18j15j46M28J114J542J661
$$ 212476 213894 215574 216724 217446 218523 220354 222474 224064 224682 224567 224421 224849 225963 227505 229166
54805B29166J442Q28J58O8N96R35N93J78M77J222J618J584J642J907K078K244
$$ 229166 230608 231436 231594 231662 232258 233193 233786 233964 234441 235663 237281 238865 240507 242414 244492 246736
54789B46736K767L468L747L563L538M097N160O640Q473J0197J1204J1438J1311
$$ 246736 249503 252971 256718 260281 263819 267916 273076 279716 288189 298386 309590 321028 332339
54776C32339J0965J0320R573Q933P950O002L429J227l50j950l781n160n767o295
$$ 332339 343304 353624 363197 372130 380080 386082 389511 390738 390388 388438 384657 379497 373730 367435
54762C67435p341q457q838q359p455o514n819n560n525n244m690m306m070l300
$$ 367435 360094 351637 342799 334440 326985 320471 314652 309092 303567 298323 293633 289327 285257 281957
54748B81957j805n45m67j114j094L36K584M527N543N974O730Q303J0064J0868
$$ 281957 280152 279607 279140 278026 276932 277268 279852 284379 289922 295896 302626 310929 320993 331861
54734C31861J0395R471Q927Q695Q257P314N726L335M40k089l667m692n897p407
$$ 331861 342256 351727 360654 369349 377606 384920 390646 393981 394421 392332 388665 383973 378076 370669
54720C70669q822r916j0636j0715r943q747p958p885q025p747o950n953n011m111
$$ 370669 361847 351931 341295 330580 320637 311890 303932 296047 288022 280275 273325 267372 262361 258250
54706B58250l212k486k214k339k397k037j521j334j445j353q71l85k66m87q52
$$ 258250 255038 252552 250338 247999 245602 243565 242044 240710 239265 237912 237041 236656 236390 235903 235051
54691B35051j182j164n57K34L90k67r40r40n53m34n81n45l10l48q10j195r46q7
$$ 235051 233869 232705 232148 232382 232772 232505 231565 230625 230072 229638 229057 228512 228202 227854 227044 225849 224903 224816
54673B24816P44Q41R3q02r76l60K81L15j9j66p7r8k29q1M34P76M47k67m88K29
$$ 224816 225560 226401 226494 225692 224716 224356 224637 224952 224933 224767 224690 224592 224363 224282 224716 225492 225939 225672 225184 225413
54653B25413J298J733J320P48N12K59m06r81p11J14L89j79n96JJ141J704J313
$$ 225413 226711 228444 229764 230512 231024 231283 230877 229896 229185 229299 229688 229509 228913 228914 230055 231759 233072
54636B33072N56J09R1Q5l30j011j248o25K42M00j39n07l56k41m39m11J03L72j87
$$ 233072 233628 233737 233828 233913 233583 232572 231324 230699 230941 231341 231202 230695 230339 230098 229659 229248 229351 229723 229536
54617B29536r80j129p65n60m55J11R72J256O74m7j51L49J004J483J648J464J050
$$ 229536 228556 227427 226662 226102 225647 225758 226730 227986 228660 228613 228462 228811 229815 231298 232946 234410 235460
54600B35460O45M09L98N52N64L4r56j665j519q77n56p13p32j30Q47J592J795J585
$$ 235460 236105 236514 236912 237464 238028 238062 237106 235441 233922 233045 232489 231776 231044 230914 231761 233353 235148 236733
54582B36733J245Q52K29o05j049m52Q83J753J426M46l38r16j668k260j930p13
$$ 236733 237978 238830 239059 238454 237405 236953 237836 239589 241015 241461 241123 240207 238539 236279 234349 233636
54566B33636M43Q53P53O80P91R33R17N70r9o51n62J08P37R59J030J241J323P53
$$ 233636 234079 234932 235685 236365 237156 238089 239006 239576 239477 238826 238264 238372 239109 240068 241098 242339 243662 244415
54548B44415m43j491j555o03M55P52M39M07R50J299Q20J50L67J374J968J511P44
$$ 244415 243972 242481 240926 240323 240778 241530 241969 242376 243326 244625 245445 245595 245962 247336 249304 250815 251559
54531B51559O19R90R46J87m97j38J246K571K764J836P44K53K15O7l27o37n81j76
$$ 251559 252178 253168 254114 254301 253804 253666 254912 257483 260247 262083 262827 263080 263295 263362 263035 262398 261817 261641
54513B61641L43O08L03m18r45r46p85q57r22n97j91k71o47n57R1N07J97l27l72
$$ 261641 261984 262592 262895 262477 261532 260586 259801 258944 258022 257425 257234 256963 256316 255759 255850 256357 256554 256227 255855
54494B55855k9J26n7j98qL18L21j40o02l56P33J867K083J298K78l09m15k84r4
$$ 255855 255826 255952 255895 255697 255689 256007 256328 256188 255586 255230 255963 257830 259913 261211 261489 261180 260765 260481 260387
54475B60387Jj17k74j28L60Q70J173J308J250Q64L29J68N64J004Q96K71l88p70
$$ 260387 260388 260271 259997 259869 260229 261099 262272 263580 264830 265694 266023 266191 266755 267759 268655 268926 268538 267768
54457B67768q55o52j97K28K42j93o34n97q7L95M04lm21n66l93O2O24P23j36j511
$$ 267768 266913 266261 266064 266292 266534 266341 265707 265110 265023 265418 265822 265819 265398 264832 264439 264501 265125 265848 265712 264201
54437B64201k202j680q27o04n82L00J905K912K619J682Q75J76n46q81n90k12k61
$$ 264201 261999 260319 259492 258888 258306 258606 260511 263423 266042 267724 268599 268775 268229 267348 266758 266546 266285
54420B66285l67K5O08O40R2l59l31k9L67Q55J186Q93j1r05j279j176q42l43J76
$$ 266285 265918 265943 266551 267191 267283 266924 266593 266564 266931 267786 268972 269865 269854 268949 267670 266494 265652 265309 265485
54401B65485L25o2m56j32R03J733J529N37k11r8M26N82L32K62N78Q38P61P39J112
$$ 265485 265810 265748 265292 265160 266063 267796 269325 269862 269651 269553 269979 270561 270893 271155 271733 272571 273332 274071 275183
54382B75183J513J459J162J087R80J96j084j829j545q92n90m19O8N71N26J16k6
$$ 275183 276696 278155 279317 280404 281384 281580 280496 278667 277122 276230 275640 275221 275289 275860 276386 276502 276476
54365B76476O5k53j004j346p49K51Q13P25L03o5O7R90K178K369R72j042k199k093
$$ 276476 276541 276288 275284 273938 273189 273440 274253 274978 275281 275216 275283 276273 278451 280820 281792 280750 278551 276458
54347B76458j295k34R17J607J258K36n30r21j529k143j632J61J679J645Q31P54
$$ 276458 275163 274929 275846 277453 278711 278947 278417 277496 275967 273824 272192 272353 274032 275677 276508 277262
54331B77262J455J729J084J60n62j298k112k529k322j837j354p35K6N52O40N34
$$ 277262 278717 280446 281530 281690 281128 279830 277718 275189 272867 271030 269676 268941 268967 269519 270159 270693
54315B70693M71L94L26M78Q35R87O44l9p68j345j514j071l04J39N2m9L29J027
$$ 270693 271164 271558 271884 272362 273197 274184 274828 274789 274021 272676 271162 270091 269787 269926 269978 269929 270258 271285
54297B71285J625J970K069J790J160O17N75Q19P50J81m36n43r6L93L70j42m86
$$ 271285 272910 274880 276949 278739 279899 280516 281091 281910 282660 282841 282405 281862 281766 282159 282529 282387 281901
54280B81901r1P85J310J075M46r6n51j097j564j606j178n60k7K54J62k67p56r85
$$ 281901 281810 282595 283905 284980 285426 285330 284779 283682 282118 280512 279334 278774 278747 279001 279163 278896 278140 277155
54262B77155q34l56K23M91J18n93q22k31M42K84n62j125r65o69p97j045q26k51
$$ 277155 276321 275965 276188 276679 276797 276204 275382 275151 275593 275877 275315 274190 273225 272556 271759 270714 269888 269637
54244B69637K2k68p34j017j157j189q96k48L14M78N98J138J792J767R46J05j34
$$ 269637 269659 269391 268657 267640 266483 265294 264398 264150 264464 264942 265540 266678 268470 270237 271183 271288 271154
54227B71154N2K99O20J001J042O53N15J138J773J214m62j823j869j117o42p83
$$ 271154 271206 271505 272125 273126 274168 274821 275336 276474 278247 279461 278999 277176 275307 274190 273548 272765
54211B72765j172j435j389q68M2Q29R72M89j57o01q03q62q00n71j82J78K17j02
$$ 272765 271593 270158 268769 267901 267943 268772 269744 270233 270076 269475 268672 267810 267010 266439 266257 266435 266652 266550
54193B66550l73k04J97K29k69p26n62R7O31O33J51o06j484k277k558j880l04J335
$$ 266550 266177 265973 266170 266399 266130 265404 264842 264939 265570 266203 266354 265748 264264 261987 259429 257549 257245 258580
54175B58580J986J441N47J73K05k4n88q30l59L62O10J81n35j041j117r16p47o57
$$ 258580 260566 262007 262554 262727 262932 262908 262320 261490 261131 261493 262103 262284 261749 260708 259591 258675 257928 257271
54157B57271m12k7O6k65l84K45J106J279Q07M80M43P2o53q26q1O48M88j70m40
$$ 257271 256859 256832 256898 256633 256249 256494 257600 258879 259686 260166 260609 260681 260028 259202 259121 259769 260257 260087 259647
54138B59647k53n6J57O62J329J821K187K546K556J868Q86L35L20L98L87M31N60
$$ 259647 259394 259338 259495 260157 261486 263307 265494 268040 270596 272464 273350 273685 274005 274403 274790 275221 275781
54121B75781P71J356K443L401L450K780K262K135J781R47K94M16R92J316J214
$$ 275781 276552 277908 280351 283752 287202 289982 292244 294379 296160 297107 297401 297817 298809 300125 301339
54106C01339R69P28L56k83j126j879k135j801j397j542k035j976j032n3l3q28
$$ 301339 302308 303036 303392 303109 301983 300104 297969 296168 294771 293229 291194 289218 288186 288133 288100 287272
54090B87272j432j296p65k87J72P04J013P78K32l9J26K59j09q38j298j002q4P58
$$ 287272 285840 284544 283779 283492 283664 284368 285381 286159 286391 286352 286478 286737 286628 285790 284492 283490 283406 284164
54072B84164P89j8q45q88l28k5j87J6J159K456K600J388j52j080j262r21k19N42
$$ 284164 284953 284935 284090 283202 282874 282849 282662 282678 283837 286293 288893 290281 290129 289049 287787 286866 286647 287189
54054B87189R67J011R60R23Q10Q40J357K069K178J538J002J304K227L114L621
$$ 287189 288156 289167 290127 291050 291860 292700 294057 296126 298304 299842 300844 302148 304375 307489 311110
54039C11110L588K964K209K122K799L395L361L208L478L773L589L388L793M309
$$ 311110 314698 317662 319871 321993 324792 328187 331548 334756 338234 342007 345596 348984 352777 357086
54025C57086L938K810K107K369K871K777K096J336Q78R03J372J820J595M70j182
$$ 357086 361024 363834 365941 368310 371181 373958 376054 377390 378268 379171 380543 382363 383958 384428 383246
54010C83246k671l339k930k006j658k265k945k808k304k508l367l724l037k100
$$ 383246 380575 377236 374306 372300 370642 368377 365432 362624 360320 357812 354445 350721 347684 345584
53996C45584j798k017k107j818j373j041r61j090j226j266j385j638j617j001
$$ 345584 343786 341769 339662 337844 336471 335430 334469 333379 332153 330887 329502 327864 326247 325246
53982C25246k05J18O0K57Q36J280J300J079P08J32k70N6Q63J261J031R88J719
$$ 325246 325041 325159 325219 325476 326312 327592 328892 329971 330679 330811 330541 330597 331460 332721 333752 334740 336459
53965C36459K798L633M355N347O520P547Q406R299J0467J2288J5062J8455K1667
$$ 336459 339257 342890 347245 352592 359112 366659 375065 384364 394831 407119 422181 440636 462303
53952D62303K4331K6522K7733K6751K3200J8388J4044J0661P664M527J044k965
$$ 462303 486634 513156 540889 567640 590840 609228 623272 633933 641597 646124 647168 644203
53940F44203p345j1229j3682j4598j4534j3942j3082j2287j1730j1132j0223r208
$$ 644203 636858 625629 611947 597349 582815 568873 555791 543504 531774 520642 510419 501211
53928E01211q328p326n960m723m321m582m624m001l096k356j801j409j356j630
$$ 501211 492883 485557 479597 474874 470553 465971 461347 457346 454250 451894 450093 448684 447328 445698
53914D45698j769j248K7J681L119L917M112M085M034L782L231K681K359J981J173
$$ 445698 443929 442681 442708 444389 447508 451425 455537 459622 463656 467438 470669 473350 475709 477690 478863
53899D78863J55n39q44j184j763k320k563k516k404k519l077l889m408m413m491
$$ 478863 479018 478479 477635 476451 474688 472368 469805 467289 464885 462366 459289 455400 450992 446579 442088
53884D42088n285o437o873o189n126m596m679m819m562l940l379l326l771m077
$$ 442088 436803 430366 423493 417304 412178 407582 402903 398084 393522 389582 386203 382877 379106 375029
53870C75029l639k679k018k103k648l206l591l597k949j823r23p37r74j079r29
$$ 375029 371390 368711 366693 364590 361942 358736 355145 351548 348599 346776 345853 345116 344142 343063 342134
53855C42134p89q49j155j680k151k076j358o35n78r76j008l74L12L30k83q34o81
$$ 342134 341345 340496 339341 337661 335510 333434 332076 331441 330863 329887 328879 328505 328817 329147 328864 328030 327349
53838C27349K90J589K444K387J643Q51L27j51q09j386j439r14j57N23R70J034
$$ 327349 327639 329228 331672 334059 335702 336553 336880 336729 335920 334534 333095 332181 332024 332547 333517 334551
53822C34551N93j51p09p69m46J0M71P53N32k51j047j116l10Q39J779K421K905
$$ 334551 335144 334993 334284 333515 333069 333079 333550 334303 334835 334584 333537 332421 332111 332950 334729 337150 340055
53805C40055L210L199K952K849L271M209N172N532N049M117L409L358L903M578
$$ 340055 343265 346464 349416 352265 355536 359745 364917 370449 375498 379615 383024 386382 390285 394863
53791C94863M771M185L227K747K998L180K395R13j17j45J94J17k86m15j4P41J616
$$ 394863 399634 403819 407046 409793 412791 415971 418366 419279 419162 419017 419211 419328 419042 418627 418613 419354 420970
53774D20970K338K560K271K059K555L758N247O853Q714J0837J3093J5555J8263
$$ 420970 423308 425868 428139 430198 432753 436511 441758 448611 457325 468162 481255 496810 515073
53761E15073K0615K1487K0218J7235J3517R745O034K263j647n640r523j3020j5875
$$ 515073 535688 557175 577393 594628 608145 617890 623924 626187 624540 618900 609377 596357 580482
53748E80482j7885j8908j8947j8282j7318j6289j5115j3640j1957j0427r394q812
$$ 580482 562597 543689 524742 506460 489142 472853 457738 444098 432141 421714 412320 403508
53736D03508q192p045n442m030l385l462l712l572k843j753q33m81m75j07R29
$$ 403508 395316 388271 382829 378799 375414 371952 368240 364668 361825 360072 359239 358758 358283 358176 359105
53721C59105K064K573K517K542K883L112K981K869L148L577L762L903M537N611
$$ 359105 361169 363742 366259 368801 371684 374796 377777 380646 383794 387371 391133 395036 399573 405184
53707D05184O421O578O617P236Q303Q991Q834Q123P165N794L976K446J968K139
$$ 405184 411605 418183 424800 432036 440339 449330 458164 466287 473452 479246 483222 485668 487636 489775
53693D89775J655L9j579j887j101o77j457k773l441l088k245j468q21j89K94L43
$$ 489775 491430 491469 489890 488003 486902 486225 484768 481995 478554 475466 473221 471753 470932 470743 471037 471380
53677D71380l7m98p88j027j320j420j065n82n77j075j449j385j297j529j705j375
$$ 471380 471343 470845 470057 469030 467710 466290 465225 464643 464066 462991 461542 460157 458860 457331 455626 454251
53661D54251q39p75j238j684j810j774j699j543j425j586j914j981j637j158p43
$$ 454251 453412 452637 451399 449715 447905 446131 444432 442889 441464 439878 437964 435983 434346 433188 432445
53646D32445l18R8L11L11L13L07O1k94j98N33J225J078J50p21q09p1R74J676J715
$$ 432445 432127 432225 432536 432847 433160 433467 433528 433234 433036 433569 434794 435872 436022 435301 434492 434421 435395 437071 438786
53627D38786J339J029R40Q35O69P59J259J837K204K562L127L539L293K580K171
$$ 438786 440125 441154 442094 442929 443598 444357 445616 447453 449657 452219 455346 458885 462178 464758 466929
53612D66929K426K917L174L370L976M997N841N993N592N205N032M637L638K499
$$ 466929 469355 472272 475446 478816 482792 487789 493630 499623 505215 510420 515452 520089 523727 526226
53598E26226K174K900L811M019L623L261L098K784K221J710J376J026O53N39O85
$$ 526226 528400 531300 535111 539130 542753 546014 549112 551896 554117 555827 557203 558229 558882 559421 560106
53583E60106O50K08k53k73M2K36N5m78j243k008k408k326k112k194k541k783k579
$$ 560106 560756 560964 560711 560438 560480 560716 560771 560293 559050 557042 554634 552308 550196 548002 545461 542678 540099
53566E40099j819o88J37j74j559k692k398j182n73j054j564j259o67n79o79j95
$$ 540099 538280 537592 537729 537555 535996 533304 530906 529724 529151 528097 526533 525274 524607 524028 523349 523154
53550E23154O47Q61J96n39o48l12L7L80Q50J344J700J965K198K374K589L056L685
$$ 523154 523801 524662 524858 524319 523671 523359 523396 523776 524626 525970 527670 529635 531833 534207 536796 539852 543537
53533E43537M010L849L697M177N278O436P230P707Q145Q769R658J0698J1625J2212
$$ 543537 547547 551396 555093 559270 564548 570984 578214 585921 594066 602835 612493 623191 634816 647028
53519F47028J2451J2585J2996J4002J5525J7044J8150J9056K0165K1252K1683
$$ 647028 659479 672064 685060 699062 714587 731631 749781 768837 789002 810254 831937
53508H31937K1564K1856K3019K4201K4465K4163K4299K4889K5030K4523K4350
$$ 831937 853501 875357 898376 922577 947042 971205 995504 1020393 1045423 1069946 1094296
53497A094296K5151K6212K6537K6334K6636K7745K8827K9120K8922K9067K9726
$$ 1094296 1119447 1145659 1172196 1198530 1225166 1252911 1281738 1310858 1339780 1368847 1398573
53486A398573L0175K9744K8737K8143K8538K9447K9899K9409K8287K7147K6274
$$ 1398573 1428748 1458492 1487229 1515372 1543910 1573357 1603256 1632665 1660952 1688099 1714373
53475A714373K5467K4307K2637K0813J9378J8386J7281J5609J3568J1484R114
$$ 1714373 1739840 1764147 1786784 1807597 1826975 1845361 1862642 1878251 1891819 1903303 1912417
53464A912417O049K740L08q39j685l395n880q091r554j0967j3148j5873j8145
$$ 1912417 1918466 1921206 1921514 1920675 1918990 1915595 1909715 1901624 1892070 1881103 1867955 1852082 1833937
53451A833937j9383j9946k0449k0959k1178k1184k1516k2453k3617k4539k5215
$$ 1833937 1814554 1794608 1774159 1753200 1732022 1710838 1689322 1666869 1643252 1618713 1593498
53440A593498k5740k5755k4840k3360k2239k1797k1338k0173j8572j7313j6584
$$ 1593498 1567758 1542003 1517163 1493803 1471564 1449767 1428429 1408256 1389684 1372371 1355787
53429A355787j5748j4125j1721r181p161n817m720l264j157J506M463P313R492
$$ 1355787 1340039 1325914 1314193 1305012 1297851 1292034 1287314 1284050 1282893 1284399 1288862 1296175 1305667
53416A305667J0715J1513J2847J4952J6977J8167J8908K0099K1854K3545K4993
$$ 1305667 1316382 1327895 1340742 1355694 1372671 1390838 1409746 1429845 1451699 1475244 1500237
53405A500237K6791K9206L1549L3104L4214L5785L8028M0336M2317M4335M6835
$$ 1500237 1527028 1556234 1587783 1620887 1655101 1690886 1728914 1769250 1811567 1855902 1902737
53394A902737M9642N2254N4501N6574N8576O0411O2028O3495O4828O5918O6677
$$ 1902737 1952379 2004633 2059134 2115708 2174284 2234695 2296723 2360218 2425046 2490964 2557641
53383B557641O7044O6944O6405O5588O4522O2945O0763N8462N6598N4870N2390
$$ 2557641 2624685 2691629 2758034 2823622 2888144 2951089 3011852 3070314 3126912 3181782 3234172
53372C234172M9021M5794M3549M1733L9103L5287L0868K6279K1336J5920J0245
$$ 3234172 3283193 3328987 3372536 3414269 3453372 3488659 3519527 3545806 3567142 3583062 3593307
53361C593307M318k235r445j6659k3263k9357l5365m1276m6654n1138n4629n7209
$$ 3593307 3597625 3595390 3585945 3569286 3546023 3516666 3481301 3440025 3393371 3342233 3287604 3230395
53349C230395n9217o1138o3078o4460o4666o3949o3358o3693o4746o5584o5432
$$ 3230395 3171178 3110040 3046962 2982502 2917836 2853887 2790529 2726836 2662090 2596506 2531074
53338B531074o4294o2854o1824o1203o0276n8418n5812n3162n0835m8566m5975
$$ 2531074 2466780 2403926 2342102 2280899 2220623 2162205 2106393 2053231 2002396 1953830 1907855
53327A907855m3069m0155l7523l5350l3694l2380l1020k9247k7010k4574k2355
$$ 1907855 1864786 1824631 1787108 1751758 1718064 1685684 1654664 1625417 1598407 1573833 1551478
53316A551478k0680j9515j8424j6976j5255j3750j2597j1308r446p356n776m874
$$ 1551478 1530798 1511283 1492859 1475883 1460628 1446878 1434281 1422973 1413527 1406171 1400395 1395521
53304A395521m142l154j930m65J463L769N829P282Q613J0423J2453J4065J5416
$$ 1395521 1391379 1388225 1386295 1385830 1387293 1391062 1396891 1404173 1412786 1423209 1435662 1449727 1465143
53291A465143J7334J9945K2241K3374K3726K4333K5666K7391K8865K9487K8982
$$ 1465143 1482477 1502422 1524663 1548037 1571763 1596096 1621762 1649153 1678018 1707505 1736487
53280A736487K7792K6923K6879K7059K6592K5391K3925K2340K0469J8532J6989
$$ 1736487 1764279 1791202 1818081 1845140 1871732 1897123 1921048 1943388 1963857 1982389 1999378
53269A999378J5766J4283J2284J0001P415M122K40l266n653p455r913j3607j7917
$$ 1999378 2015144 2029427 2041711 2051712 2059127 2063249 2063489 2060223 2054570 2047115 2037202 2023595 2005678
53256B005678k1772k4646k6800k8803l0815l2523l3754l4868l6216l7391l7622
$$ 2005678 1983906 1959260 1932460 1903657 1872842 1840319 1806565 1771697 1735481 1698090 1660468
53245A660468l6856l5912l5462l5354l5194l4966l4760l4327l3399l2206l1316
$$ 1660468 1623612 1587700 1552238 1516884 1481690 1446724 1411964 1377637 1344238 1312032 1280716
53234A280716l1122l1603l2402l2872l2418l1014k9207k7450k5772k4250k3286
$$ 1280716 1249594 1217991 1185589 1152717 1120299 1089285 1060078 1032628 1006856 982606 959320
53223I59320k3000k2774k1901k0359j8601j6854j5241j4192j4032j4327j4314
$$ 959320 936320 913546 891645 871286 852685 835831 820590 806398 792366 778039 763725
53212G63725j3988j4038j4641j4969j4271j2838j1542j0807j0447j0266j0304
$$ 763725 749737 735699 721058 706089 691818 678980 667438 656631 646184 635918 625614
53201F25614j0517j0573j0135r226q344q051q393q746q426p466o528o027n713
$$ 625614 615097 604524 594389 585163 576819 568768 560375 551629 543203 535737 529209 523182 517469
53188E17469n300n031n265n752n854n400m872m666m644m548m405m248l795k877
$$ 517469 512169 507138 501873 496121 490267 484867 479995 475329 470685 466137 461732 457484 453689 450812
53174D50812j973j806k425l107l188k666j913j193o43l37j17K90P92Q56K39n33
$$ 450812 448839 447033 444608 441501 438313 435647 433734 432541 431898 431561 431444 431734 432526 433382 433621 433088
53158D33088q41p87r21j272j323q68k95Q9M65R71J259R77L87P6J81K69L4k20K4
$$ 433088 432247 431460 430539 429267 427944 427076 426781 426870 427335 428306 429565 430542 430929 431005 431186 431455 431489 431269 431293
53139D31293P69J392J359Q60M93L93J58k95l28N25J651J946J222L35k9o0j48j85
$$ 431293 432062 433454 434813 435673 436166 436559 436717 436422 436094 436619 438270 440216 441438 441773 441744 441684 441536 441351
53121D41351O6L73L06n4j21M49J281J592R41l02j246j308p42l03n53j556k938
$$ 441351 441417 441790 442096 442042 441921 442370 443651 445243 446184 445882 444636 443328 442586 442283 441730 440174 437236
53104D37236m030m232l613k957k722k354j203J28K21j341l399m581m532l580k072
$$ 437236 433206 428974 425361 422404 419682 417328 416125 416253 416474 415133 411734 407153 402621 399041 396969
53089C96969m54O55R20N25k93j386k221k048q77L24Q12P60N32L2o49q91m46J1
$$ 396969 396515 397170 398090 398615 398322 396936 394715 392667 391790 392114 392926 393686 394218 394250 393601 392710 392264 392275
53071C92275L5K46J140J836J290K11K89J635K385J226r04k145j928j195r23j100
$$ 392275 392310 392556 393696 395532 396822 397033 397322 398957 401342 402568 401664 399519 397591 396396 395473 394373
53055C94373j040l51O00J137J094Q71O91L63m6L4P02J102O19J4L58J314J597R09
$$ 394373 393333 392982 393582 394719 395813 396684 397375 397738 397692 397726 398428 399530 400149 400163 400521 401835 403432 404341
53037D04341K35K01L90M53P37J331J553J015L91M43Q65Q48L18l9K30Q65J362J498
$$ 404341 404576 404777 405167 405620 406357 407688 409241 410256 410647 411090 411955 412803 413121 413082 413312 414177 415539 417037
53019D17037J420J361J287Q71N3o13n13J89Q43J248J688K021J627M99m31m97j61
$$ 417037 418457 419818 421105 421976 422029 421416 420903 421092 421935 423183 424871 426892 428519 429018 428587 428090 427929
53002D27929j70m17k78L42Q97R21L51o11j503j720j102l00j52o73j042n20P72
$$ 427929 427759 427342 427064 427406 428303 429224 429575 428964 427461 425741 424639 424339 424187 423514 422472 421952 422724
52985D22724K050K600K401K020J930K010J950J859K043K234J805Q55L89R70J845
$$ 422724 424774 427374 429775 431795 433725 435735 437685 439544 441587 443821 445626 446481 446870 447840 449685
52970D49685J902J087K64J1J66L91N47N71M50L86N49O74K95n84j315j334q02l91
$$ 449685 451587 452674 452938 452949 453115 453506 454053 454624 455074 455460 456009 456683 456978 456394 455079 453745 452943 452552
52952D52552n26r44j049o79l56o52j433j991j951j653j566j648j505r25n7P27
$$ 452552 452026 451082 450033 449354 448998 448346 446913 444922 442971 441318 439752 438104 436599 435674 435617 436344
52936D36344J019O56j6l57j02L23L39j53p81j159j113p27k72j5M1M4l1l75r31
$$ 436344 437363 438019 438003 437646 437544 437867 438206 438053 437272 436113 435000 434273 434001 433986 434027 434071 434040 433665 432734
52917D32734j367j557j668j687j294m95Q2o8o34r42q68q18j013j251j324j244
$$ 432734 431367 429810 428142 426455 425161 424666 424748 424680 424046 423104 422236 421418 420405 419154 417830 416586
52901D16586j014n00L70J417K217K342J692P18P1q5k18p03j221j203o36j48k24
$$ 416586 415572 415072 415442 416859 419076 421418 423110 423828 423899 423814 423596 422893 421672 420469 419833 419685 419461
52884D19461p18j206j595k090k610k530j420J04Q02L21k85pO93P12J22R2J061
$$ 419461 418743 417537 415942 413852 411242 408712 407292 407396 408198 408519 408234 408227 408920 409632 409754 409846 410907
52867D10907K085K312K039J912J869J540R85M50j1k77q7K84P3p18r54p6P02r5
$$ 410907 412992 415304 417343 419255 421124 422664 423649 424099 424088 423811 423724 424008 424081 423363 422409 422333 423035 422940
52849D22940j967l015k452j402j171j707j992j316P5J143R31l83j549j708j309
$$ 422940 420973 417958 415506 414104 412933 411226 409234 407918 407993 409136 410067 409684 408135 406427 405118
52834D05118j072p61Q0Q51O05k86n72r2N2o21j313j476j515j536p13J248L200
$$ 405118 404046 403285 403365 404216 404821 404535 403963 403871 403923 403302 401989 400513 398998 397462 396749 397997 401197
52817D01197M077M393N244O521P192O842N936M821L446J951P75P9m46j252k754
$$ 401197 405274 409667 414911 421432 428624 435466 441402 446223 449669 451620 452395 452474 452028 450776 448022
52802D48022n063p570r076r008q090p327o669n449l776k579k290k408k470k618
$$ 448022 442959 435389 426313 417305 409215 401888 395219 389770 385994 383415 381125 378717 376247 373629
52788C73629k876k612j392J36Q14L88j98L7J029J884J925J324O99M58N85Q79J108
$$ 373629 370753 368141 366749 366885 367699 368087 367889 367926 368955 370839 372764 374088 374787 375245 375830 376709 377817
52771C77817J037O56L47N32J057J351J256J279J780K326K195J279J24o40o56N9
$$ 377817 378854 379510 379857 380389 381446 382797 384053 385332 387112 389438 391633 392912 393036 392396 391740 391799
52755C91799R56J183M74m21o37k62O3K68P96J452J365L66m61j82O76Q94K12n34
$$ 391799 392755 393938 394412 393991 393354 393092 393155 393423 394219 395671 397036 397402 396941 396759 397435 398329 398541 398007
52737C98007o91m04J4O08J376J892J692Q45j43p97r01n27l1J69L4NL39N71Pj279
$$ 398007 397316 396912 396926 397534 398910 400802 402494 403339 403196 402399 401498 400971 400940 401109 401143 401148 401487 402058 402065 400786
52717D00786k354k506k058j846k140k422k098j143l1O55N56j50p17m36N38J199
$$ 400786 398432 395926 393868 392022 389882 387460 385362 384219 384188 384843 385399 385249 384532 384096 384634 385833
52701C85833Q67J10O1J028K111K352J774J108Q93J091J399J537J347R16N99O37
$$ 385833 386700 386810 386871 387899 390010 392362 394136 395244 396137 397228 398627 400164 401511 402427 403026 403663
52685D03663Q22P96O14O40R32J132J109J210J610J844J452P67N24Q20J050Q74
$$ 403663 404485 405281 405895 406535 407467 408599 409708 410918 412528 414372 415824 416591 417115 417935 418985 419859
52669D19859O96J022J734K299K366J958J285O24K42K29M79R37J659K508K977K544
$$ 419859 420555 421577 423311 425610 427976 429934 431219 431843 432085 432314 432793 433730 435389 437897 440874 443418
52653D43418J230l13j227j098k70M86P22O28N14K65l62j094j414j341j331j378
$$ 443418 444648 444335 443108 442010 441740 442226 442948 443576 444090 444355 443993 442899 441485 440144 438813 437435
52637D37435r84j66K50j63o72m12L75Q00N88J73j80o10j116j484j643j669j464
$$ 437435 436451 436285 436535 436372 435700 435288 435663 436463 437051 437224 437044 436434 435318 433834 432191 430522 429058
52620D29058r86n58m90n49l57j10k56o05n20J14P69J106J208J002L27m16n24p7
$$ 429058 428072 427514 427024 426475 426118 426008 425752 425147 424627 424741 425510 426616 427824 428826 429153 428737 428213 428136
52602D28136R0k93n05j26K06r6n78n23j20j1j68k4N33J071J304J310J184R94R37
$$ 428136 428226 427933 427428 427302 427508 427412 426834 426311 426191 426180 426012 425988 426521 427592 428896 430206 431390 432384 433321
52583D33321J102J257J231J262J515J625J251P50P31J111J314J199J083J006P11
$$ 433321 434423 435680 436911 438173 439688 441313 442564 443314 444045 445156 446470 447669 448752 449758 450469
52568D50469K95K30O07J020J242J343J141K88r16j583j362q44n21j55M09N99J1
$$ 450469 450764 450994 451601 452621 453863 455206 456347 456635 455719 454136 452774 451930 451409 451254 451663 452262 452273
52551D52273o93o52j53j32o62q54l27K27K30J07M72J037J049M78J70P50J819K368
$$ 452273 451580 450928 450775 450643 449981 449127 448800 449027 449257 449364 449836 450873 451922 452400 452570 453320 455139 457507
52533D57507J793M40p62j204j118j180j585j792j286l04M59P47R55J498K264K761
$$ 457507 459300 459740 458978 457774 456656 455476 453891 452099 450813 450509 450968 451715 452670 454168 456432 459193
52517D59193K671K167J739J672J662J095j17j235j558j351j449j986k239j809
$$ 459193 461864 464031 465770 467442 469104 470199 470082 468847 467289 465938 464489 462503 460264 458455
52503D58455j373j800k963l984m278l948l281k456j730j330j091n67L14J005R43
$$ 458455 457082 455282 452319 448335 444057 440109 436828 434372 432642 431312 430221 429654 429968 430973 431916
52488D31916J79o12o97J40J406K243K193J608J174J187J477J914K500L048L280
$$ 431916 432095 431483 430786 430926 432332 434575 436768 438376 439550 440737 442214 444128 446628 449676 452956
52473D52956L333L662M216M202L164J814J276J637J884J284K51m10n91p80j202
$$ 452956 456289 459951 464167 468369 471533 473347 474623 476260 478144 479428 479679 479269 478678 477898 476696
52458D76696j610j939k472l218l642l400k940k839k879k429j579j049r87p63k08
$$ 476696 475086 473147 470675 467457 463815 460415 457475 454636 451757 449328 447749 446700 445713 444950 444742
52443D44742r3q14j477j129j77L20K43J92R3o30j630j750q00kj79o17l80J76J11
$$ 444742 444649 443835 442358 441229 441052 441372 441615 441807 441900 441270 439640 437890 437090 437088 436909 436292 435912 436088 436199
52424D36199n57r32n63J43O64Q92R73J077J281J420J203O73L14N10J184K145L393
$$ 436199 435642 434710 434147 434290 434954 435846 436819 437896 439177 440597 441800 442473 442787 443297 444481 446626 450019
52407D50019M755N754O156O330O646O952P010O919O665N776M093K351J349P96
$$ 450019 454774 460528 466684 473014 479660 486612 493622 500541 507206 512982 517075 519426 520775 521571
52393E21571j59j585k770l428m030m843n383n081l981k638j666j411j621j494
$$ 521571 521412 519827 517057 513629 509599 504756 499373 494292 490311 487673 486007 484596 482975 481481
52379D81481n10Q13J496J387J247J579K036K104J800J317N89m18j298j454p58
$$ 481481 480971 481784 483280 484667 485914 487493 489529 491633 493433 494750 495339 494921 493623 492169 491411
52364D91411K68Q66O80R9j21K56O87P51Q54J515K293K222J256M05K94M97N49P60
$$ 491411 491679 492545 493225 493324 493203 493459 494146 494897 495751 497266 499559 501781 503037 503442 503736 504233 504782 505542
52346E05542J504K381K775K766K888L231L403L261L152L461M215N068N526N389
$$ 505542 507046 509427 512202 514968 517856 521087 524490 527751 530903 534364 538579 543647 549173 554562
52332E54562N052N134N655N995N855N713N988O292O069N580N527N950O260O249
$$ 554562 559614 564748 570403 576398 582253 587966 593954 600246 606315 611895 617422 623372 629632 635881
52318F35881O365O939P766Q625R614J0715J1572J1982J2214J2580J3045J3536
$$ 635881 642246 649185 656951 665576 675190 685905 697477 709459 721673 734253 747298 760834
52306G60834J4308J5526J6773J7378J7226J6797J6435J5941J5062J4075J3619
$$ 760834 775142 790668 807441 824819 842045 858842 875277 891218 906280 920355 933974
52295I33974J3973J4692J5021J4579J3676J2931J2675J2705J2622J2319J2042
$$ 933974 947947 962639 977660 992239 1005915 1018846 1031521 1044226 1056848 1069167 1081209
52284A081209J2001J2013J1693J0902R952R236Q780Q274P569O885O476O204N787
$$ 1081209 1093210 1105223 1116916 1127818 1137770 1147006 1155786 1164060 1171629 1178514 1184990 1191194 1196981
52271A196981N296N081N052M544L258K034K038L219M242M192L693L848M548M658
$$ 1196981 1202277 1207358 1212410 1216954 1220212 1222246 1224284 1227503 1231745 1235937 1239630 1243478 1248026 1252684
52257A252684L714K536K036K129K196K106K238K855L826M894N855O647P443Q503
$$ 1252684 1256398 1258934 1260970 1263099 1265295 1267401 1269639 1272494 1276320 1281214 1287069 1293716 1301159 1309662
52243A309662R695J0523J0803J0967J1377J1749J1688J1406J1280J1077J0363
$$ 1309662 1319357 1329880 1340683 1351650 1363027 1374776 1386464 1397870 1409150 1420227 1430590
52232A430590R538R609J0723J1764J1643J0451Q954P541O160M862L906L432L249
$$ 1430590 1440128 1449737 1460460 1472224 1483867 1494318 1503272 1510813 1516973 1521835 1525741 1529173 1532422
52219A532422K975K167O88r63j970k069j766j537j254p65n03q81j416j210j97
$$ 1532422 1535397 1537564 1538252 1537289 1535319 1533250 1531484 1529947 1528693 1527928 1527425 1526544 1525128 1523918 1523721
52204A523721P90J258J656K435L240L530L510L804M458M970N228N746O709P401
$$ 1523721 1524511 1525769 1527425 1529860 1533100 1536630 1540140 1543944 1548402 1553372 1558600 1564346 1571055 1578456
52190A578456P053N869M707L982L477L113L206L771M211M015L380K721K033J179
$$ 1578456 1585509 1591378 1596085 1600067 1603544 1606657 1609863 1613634 1617845 1621860 1625240 1627961 1629994 1631173
52176A631173N05M85R24J070N81j56p40j256j906k634l310l975m595m986n208
$$ 1631173 1631678 1632163 1633087 1634157 1634738 1634582 1633842 1632586 1630680 1628046 1624736 1620761 1616166 1611180 1605972
52161A605972n643o358o725o171n093m522m846n337m971l482j373O78K217K990
$$ 1605972 1600329 1593971 1587246 1581075 1575982 1571460 1566614 1561277 1556306 1552824 1551451 1552129 1554346 1557336
52147A557336K931K317J683J368J277J257J488K151K755K444J237L94J014K591
$$ 1557336 1560267 1562584 1564267 1565635 1566912 1568169 1569657 1571808 1574563 1577007 1578244 1578638 1579652 1582243
52133A582243L699L846L885M504N185N023L985K801J955J367Q92O73R70J817K859
$$ 1582243 1585942 1589788 1593673 1598177 1603362 1608385 1612370 1615171 1617126 1618493 1619385 1620058 1621028 1622845 1625704
52118A625704L471L291K649K252K372K776L428M748O819Q992J0782J2634J5089
$$ 1625704 1629175 1632466 1635115 1637367 1639739 1642515 1645943 1650691 1657510 1666502 1677284 1689918 1705007
52105A705007J7576J8867J8692J8040J7741J7586J7129J6653J6755J7356J7765
$$ 1705007 1722583 1741450 1760142 1778182 1795923 1813509 1830638 1847291 1864046 1881402 1899167
52094A899167J7587J7089J6705J6592J6680J6812J6704J6123J5198J4321J3513
$$ 1899167 1916754 1933843 1950548 1967140 1983820 2000632 2017336 2033459 2048657 2062978 2076491
52083B076491J2234J0149P872O352N599M572K630M91p54j139j652k754l881m465
$$ 2076491 2088725 2098874 2106746 2113098 2118697 2123269 2125899 2126390 2125636 2124497 2122845 2120091 2116210 2111745
52069B111745m716n026n185m750l765k706j859j192o73l05L4N45J312K286L320
$$ 2111745 2107029 2102003 2096818 2092068 2088303 2085597 2083738 2082546 2081873 2081568 2081602 2082147 2083459 2085745 2089065
52054B089065M054M125L711L560M150N046N538N647O016O926P923Q430Q249P499
$$ 2089065 2093119 2097244 2100955 2104515 2108665 2113711 2119249 2124896 2130912 2137838 2145761 2154191 2162440 2169939
52040B169939O470N610N181M830L914K319O34n70j259j596j567j247j030j205
$$ 2169939 2176409 2182019 2187200 2192030 2195944 2198263 2198897 2198327 2197068 2195472 2193905 2192658 2191628 2190423
52026B190423j489j352o62K40J057J739K266K507K455K334K314K175J401l32k807
$$ 2190423 2188934 2187582 2186920 2187160 2188217 2189956 2192222 2194729 2197184 2199518 2201832 2204007 2205408 2205076 2202269
52011B202269n443p820r969j2184j4509j6580j7983j8756j9462k0664k2359k3999
$$ 2202269 2196826 2189006 2179037 2166853 2152344 2135764 2117781 2099025 2079563 2058899 2036540 2012541
51999B012541k5116k5809k6514k7418k8317k8981k9370k9482k9356k9285k9664
$$ 2012541 1987425 1961616 1935102 1907684 1879367 1850386 1821016 1791534 1762178 1732893 1703229
51988A703229l0442l1010l0907l0371k9905k9596k9147k8378k7272k5769k3939
$$ 1703229 1672787 1641777 1610870 1580499 1550594 1520998 1491851 1463473 1436201 1410432 1386493
51977A386493k2224k0967j9765j7814j4976j2049r892q707q302q485q980r407
$$ 1386493 1364269 1343302 1323537 1305723 1290747 1278698 1268806 1260099 1251797 1243312 1234332 1224925
51965A224925r702j0200j1044j1883j2454j3006j3734j4141j3558j2090j0445
$$ 1224925 1215223 1205023 1193979 1182096 1169642 1156636 1142902 1128761 1115203 1103113 1092668
51954A092668q909p142n007k962j337K26K155M157N503N956N956N916N651M644
$$ 1092668 1083759 1076617 1071610 1068648 1067311 1067537 1069692 1073849 1079352 1085308 1091264 1097180 1102831 1107475
51940A107475K669J06k225l667m362n222o892q834r828r493q873r232j0650j2153
$$ 1107475 1110144 1110250 1108025 1104358 1099996 1094774 1087882 1079048 1069220 1059727 1050854 1041622 1030972 1018819
51926A018819j2883j2687j1793j0520r337q593q053p146n807m539l487k031K46
$$ 1018819 1005936 993249 981456 970936 961599 953006 944953 937807 932000 927461 923974 921943 922189
51913I22189K677M177M504M290M039L674L055K236J112o85l187n823q015r726
$$ 922189 924866 929043 933547 937837 941876 945550 948605 950841 951953 951268 948081 942258 934243 924517
51899I24517j1198j2394j3062j3210j3094j2763j1923j0328q176n909l730j435
$$ 924517 913319 900925 887863 874653 861559 848796 836873 826545 818369 812460 808730 807295
51887H07295J250M231P096R548J1619J3414J4762J5297J4789J3291J1050Q482
$$ 807295 808545 812776 819872 829420 841039 854453 869215 884512 899301 912592 923642 932124
51875I32124O102M167K351P7k779n702q056r501r906r254p959o905o686o907o599
$$ 932124 938226 942393 944744 944821 942042 936340 928284 918783 908877 899623 891664 884759 878073 871166 864567
51860H64567n367l779k623k167k259k740l418l928m022l916m049m503m961n150
$$ 864567 859200 855421 852798 850631 848372 845632 842214 838286 834264 830348 826299 821796 816835 811685
51846H11685n011m442l356k002q62L3J212K991M986O740Q327R938J1315J2297
$$ 811685 806674 802232 798876 796874 796012 796045 797257 800248 805234 811974 820301 830239 841554 853851
51832H53851J3534J5784J8633K0840K1974K2789K3758K4259K3647K2158K0136
$$ 853851 867385 883169 901802 922642 944616 967405 991163 1015422 1039069 1061227 1081363
51821A081363J7116J2630P335K376k034o474j1020j5052j8294k1090k3453k4725
$$ 1081363 1098479 1111109 1118444 1120820 1118786 1112312 1101292 1086240 1067946 1046856 1023403 998678
51809I98678k4560k3521k2304k0945j9247j7512j6296j5588j4727j3129j0869
$$ 998678 974118 950597 928293 907348 888101 870589 854293 838705 823978 810849 799980
51798G99980q536o652n226l900k501j382r59j148j473j704j977k275k217j557
$$ 799980 791444 784792 779566 775666 773165 771783 770824 769676 768203 766499 764522 762247 760030 758473
51784G58473o31oJ70L66J189K710M293N163N265N251N470N363M228K292M19j004
$$ 758473 757842 757836 758006 758372 759561 762271 766564 771727 776992 782243 787713 793076 797304 799596 800015 799011
51768G99011k278l538m455m915n368o161p053p650p911p911p555o854o083n411
$$ 799011 796733 793195 788740 783825 778457 772296 765243 757593 749682 741771 734216 727362 721279 715868
51754G15868m678l783k927k173j230Q5J436K427L102L677M096M258M402M795N229
$$ 715868 711190 707407 704480 702307 701077 701162 702598 705025 708127 711804 715900 720158 724560 729355 734584
51739G34584N209M549L519K508J811J521J396J035M28Q0L17Q12J158J459J920
$$ 734584 739793 744342 747861 750369 752180 753701 755097 756132 756560 756640 756957 757769 758927 760386 762306
51724G62306K222J927J360J297J797K053J518O38J73K99O73R90J145J129J047
$$ 762306 764528 766455 767815 769112 770909 772962 774480 775118 775291 775590 776263 777253 778398 779527 780574
51709G80574J160J649K393L165L867M393M436L846L132L219M419N864O328N559
$$ 780574 781734 783383 785776 788941 792808 797201 801637 805483 808615 811834 816253 822117 828445 834004
51695H34004M423L762L496L086K389J579O11o85k148l496m922o801q806j0141
$$ 834004 838427 842189 845685 848771 851160 852739 853350 852665 850517 847021 842099 835298 826492 816351
51681H16351j0754j1411j2215j2101j0470q506p810q311q612q013o960n630l449
$$ 816351 805597 794186 781971 769870 759400 750894 743084 734773 726161 718148 711188 705558 702109
51668G02109m19K255L596M118M965O303P267P260O547N708N098M827M759M370
$$ 702109 701690 703945 707541 711659 716624 722927 730194 737454 744001 749709 754807 759634 764393 768763
51654G68763L033P21j774l465l999l796l518l551l860m135m027l506l032l229
$$ 768763 771796 772517 770743 767278 763279 759483 755965 752414 748554 744419 740392 736886 733854 730625
51640G30625m156n089n257m709m128l937m000m175m551m999n068m641m162l841
$$ 730625 726469 721380 716123 711414 707286 703349 699349 695174 690623 685624 680556 675915 671753 667912
51626F67912l218j968p14k95o28r59j021j142j439j682j879k224k493k317k046
$$ 667912 664694 662726 662012 661717 661089 660130 659109 657967 656528 654846 652967 650743 648250 645933 643887
51611F43887k444l364l739l131k319j915j399k48R09J239J122J649L034M597O033
$$ 643887 641443 638079 634340 631209 628890 626975 625576 625328 626237 627476 628598 630247 633281 637878 643911
51596F43911P662R450J0789J1354J1396J1044J0089Q756P863P848Q225Q432Q613
$$ 643911 651573 661023 671812 683166 694562 705606 715695 724451 732314 740162 748387 756819 765432
51583G65432R172J0109J1397J3498J6765K0617K4049K6874K9873L3705L8317M3373
$$ 765432 774604 784713 796110 809608 826373 846990 871039 897913 927786 961491 999808 1043181
51571A043181M8528N3140N6509N8835O1370O4950O8798P1454P2526P2737P2286
$$ 1043181 1091709 1144849 1201358 1260193 1321563 1386513 1455311 1526765 1599291 1672028 1744314
51560A744314P0181O5460N8330M9485L8933K6286J2047k181j5030k6472l7318
$$ 1744314 1814495 1879955 1938285 1987770 2026703 2052989 2065036 2062855 2047825 2021353 1984035
51549A984035m7915n7623o5464p0949p4243p5655p5330p3413p0295o6385o1781
$$ 1984035 1936120 1878497 1813033 1742084 1667841 1592186 1516856 1443443 1373148 1306763 1244982
51538A244982n6534n1124m6195m1708l6974l1843k7301k4272k2293k0081j7241
$$ 1244982 1188448 1137324 1091129 1049421 1012447 980604 953303 929031 906738 886657 869416
51527H69416j4619j2948j1924j0889r762q861q238p622o873o101n498n153m938
$$ 869416 854797 841849 829925 819036 809274 800413 792175 784553 777680 771579 766081 760928 755990
51514G55990m501l639k763k573l158l787l815l500l527m079m704m984m895m537
$$ 755990 751489 747850 745087 742514 739356 735569 731754 728254 724727 720648 715944 710960 706065 701528
51500G01528l924l129k471k321k692l080k886k154j719k256l302l643k826j746
$$ 701528 697604 694475 692004 689683 686991 683911 681025 678871 677152 674896 671594 667951 665125 663379
51486F63379j590k575m026n214n758n532m768m111m068m435m498l826k697j798
$$ 663379 661789 659214 655188 649974 644216 638684 633916 629805 625737 621302 616804 612978 610281 608483
51472F08483j603j933k091j645r99p92q21l09O50Q76j49j235j070m7N96Q61J807
$$ 608483 606880 604947 602856 601211 600212 599420 598599 598290 598940 599816 599667 598432 597362 597315 597911 598772 600579
51455F00579L506M768N107N579P090R034J0404J1325J2620J4444J6153J7083J6892
$$ 600579 604085 608853 613960 619539 626629 635663 646067 657392 670012 684456 700609 717692 734584
51442G34584J5503J3377J1454J0281R495Q592P687O916N717L493O93j635l107
$$ 734584 750087 763464 774918 785199 794694 803286 810973 817889 823606 827099 827792 826157 823050
51429H23050m105m857n347n999p383r134j0081r730q884q369p924o804m952l039
$$ 823050 818945 814088 808741 802742 795359 786225 776144 766414 757530 749161 741237 734433 729481 726442
51415G26442j705j131j093j085o34K16J043J778K910M652O413P513Q021Q440Q916
$$ 726442 724737 723606 722513 721428 720794 721010 722053 723831 726741 731393 737806 745319 753340 761780 770696
51400G70696R329R922J1194J3230J5681J8407K1656K5463K9377L3044L6860M1776
$$ 770696 780025 789947 801141 814371 830052 848459 870115 895578 924955 957999 994859 1036635
51388A036635M8425N6470O4767P2262P8769Q4679Q9913R3585R4914R4006R1231
$$ 1036635 1085060 1141530 1206297 1278559 1357328 1442007 1531920 1625505 1720419 1814425 1905656
51377A905656Q6233P8293O7427N4416L9767K3492O073j1164k7117m1716n5216
$$ 1905656 1991889 2070182 2137609 2192025 2231792 2255284 2261357 2250193 2223076 2181360 2126144
51366B126144o7206p6896q3976q8614r0887r0840q8945q5876q1851p6717p0682
$$ 2126144 2058938 1982042 1898066 1809452 1718565 1627725 1538780 1452904 1371053 1294336 1223654
51355A223654o4489n8774n3678m9063m4677m0117l5185l0390k6577k3840k1322
$$ 1223654 1159165 1100391 1046713 997650 952973 912856 877671 847281 820704 796864 775542
51344G75542j8382j5498j3519j2446j1471j0085q567p447o916o820o860o693o173
$$ 775542 757160 741662 728143 715697 704226 694141 685574 678127 671211 664391 657531 650838 644665
51331F44665n556n211n125m908m377l759l286k936k678k633k781k792k415j774
$$ 644665 639109 633898 628773 623865 619488 615729 612443 609507 606829 604196 601415 598623 596208 594434
51317E94434j034o5J199K375L075L530M265N178N602N326M978N055N147M575L391
$$ 594434 593400 593335 594534 596909 599984 603514 607779 612957 618559 623885 628863 633918 639065 643640 647031
51302F47031K206J281L51o66j384j508j299j245j536j956k170k016j612j260j120
$$ 647031 649237 650518 650869 650203 648819 647311 646012 644767 643231 641275 639105 637089 635477 634217 633097
51287F33097r97o15J3O17R54Q54K16p10j148n29O11J027K66q26j322j260j044
$$ 633097 632100 631485 631498 632115 633069 633923 634139 633429 632281 631752 632363 633390 633656 632830 631508 630248 629204
51270F29204n56M07J242J135L35m0M18R52R46Q55J368K338L102L356L190K691
$$ 629204 628648 629055 630297 631432 631767 631727 632145 633097 634043 634898 636266 638604 641706 645062 648252 650943
51254F50943K072J840K173K426J904R91P06J226J613J116M0r31j572j928j964
$$ 650943 653015 654855 657028 659454 661358 662349 663055 664281 665894 667010 667050 666119 664547 662619 660655
51239F60655j858k195l206m197m319l665l012k734k575k337k077j663r12k98p04
$$ 660655 658797 656602 653396 649199 644880 641215 638203 635469 632894 630557 628480 626817 625905 625607 624903
51224F24903k156l464l524k506j285k57P55J809K750L566M287M662M466L994L733
$$ 624903 622747 619283 615759 613253 611968 611711 612466 614275 617025 620591 624878 629540 634006 638000 641733
51209F41733L710L632L536L635L722L417K973L063L646L919L615L497M146N040
$$ 641733 645443 649075 652611 656246 659968 663385 666358 669421 673067 676986 680601 684098 688244 693284
51195F93284N445N529N803O009N463M301L457L408L631L426K643J485R6j392k789
$$ 693284 698729 704258 710061 716070 721533 725834 729291 732699 736330 739756 742399 743884 743980 742588 739799
51180G39799m010n073n867o263o467o882p505p818p480o849o545o708o856o400
$$ 739799 735789 730716 724849 718586 712119 705237 697732 689914 682434 675585 669040 662332 655476 649076
51166F49076n201l669k399j659j210p22j76L21Q45J489K008K079J934K163K813
$$ 649076 643875 640206 637807 636148 634938 634216 634040 634361 635206 636695 638703 640782 642716 644879 647692
51151F47692L120K476J261M07K99N18M80M5n51j074j487j830k024j953j787j970
$$ 647692 650812 653288 654549 654956 655255 655773 656253 656298 655747 654673 653186 651356 649332 647379 645592 643622
51135F43622k604l100k860k208j970k098j481M46K614L527L107K519K463K532
$$ 643622 641018 637918 635058 632850 630880 628782 627301 627747 630361 633888 636995 639514 641977 644509
51121F44509K355K312K784L404L642L668L933M268M078L299K519K122J913J680
$$ 644509 646864 649176 651960 655364 659006 662674 666607 670875 674953 678252 680771 682893 684806 686486
51107F86486J543J493J150L73l31m14K5O18J391K430L180K927J979J498J972K570
$$ 686486 688029 689522 690672 691045 690714 690300 690325 690943 692334 694764 697944 700871 702850 704348 706320 708890
51091G08890K367J553R06O44M14K4m67j098j877k509k790l012l397l386k310o21
$$ 708890 711257 712810 713716 714360 714774 714798 714331 713233 711356 708847 706057 703045 699648 696262 693952 693331
51075F93331L90K16l02k66K18N95Q82J470K352L099L450L627M026M829N772O308
$$ 693331 693721 693937 693635 693369 693587 694182 695064 696534 698886 701985 705435 709062 713088 717917 723689 729997
51059G29997O150N697N553N685N551N104N015N594O114N743M700L958M062M851
$$ 729997 736147 741844 747397 753082 758633 763737 768752 774346 780460 786203 790903 794861 798923 803774
51045H03774O068P598R085R887R686Q825Q017P845Q448R405R878R171P350N177
$$ 803774 809842 817440 826525 836412 846098 854923 862940 870785 879233 888638 898516 907687 915037 920214
51031I20214L423K274J333J34j347k684l569m258n143n999o086n175l978l223
$$ 920214 923637 925911 927244 927378 926031 923347 919778 915520 910377 904378 898292 893117 889139 885916
51017H85916k667j507M88K658M182M797M847M930N439O285P051P492P656P490
$$ 885916 883249 881742 882230 884888 889070 893867 898714 903644 909083 915368 922419 929911 937567 945057
51003I45057O695N229L569K196J122K29l38m89n02n10n4J277L023M362N258O451
$$ 945057 951752 956981 960550 962746 963868 964097 963759 963270 962768 962258 962204 963481 966504 970866 976124 982575
$$ [...]
##END NTUPLES=NMR SPECTRUM
##END=
