##TITLE=AC1681_2977_8571555_gdJ5YHvhbD
##JCAMPDX= 6.0         $$ Bruker NMR JCAMP-DX V2.0
##DATA TYPE= NMR SPECTRUM
##DATA CLASS= NTUPLES
##ORIGIN= BRUKER
##OWNER= Administrator
$$ 1.72 TOPSPIN		Version 2.1
$$ 2014-04-10 20:10:41.549 -0700  Administrator@X
$$ Compression mode = diff/dup
##.OBSERVE FREQUENCY= 400.02188249412
##.OBSERVE NUCLEUS= ^1H
##.ACQUISITION MODE= SIMULTANEOUS (DQD)
##.ACQUISITION SCHEME= undefined
##.AVERAGES= 64
##.DIGITISER RES= 22
##SPECTROMETER/DATA SYSTEM= spect
##.PULSE SEQUENCE= noesygpps1d.comp
##.SOLVENT NAME= COFFEE_meoh
##.SHIFT REFERENCE= INTERNAL, COFFEE_meoh, 1, 14.96161
##AUDIT TRAIL= $$ (NUMBER, WHEN, WHO, WHERE, PROCESS, VERSION, WHAT)
$$ ##TITLE= Audit trail, TOPSPIN		Version 2.1
$$ ##JCAMPDX= 5.01
$$ ##ORIGIN= Bruker BioSpin GmbH
$$ ##OWNER= Administrator
$$ $$ E:\/data/COFFEE/nmr/AC1681_2977_8571555_gdJ5YHvhbD/22/pdata/1/auditp.txt
$$ ##AUDIT TRAIL=  $$ (NUMBER, WHEN, WHO, WHERE, PROCESS, VERSION, WHAT)
(   1,<2014-04-10 20:10:35.220 -0700>,<Administrator>,<X>,<go>,<TOPSPIN 2.1>,
      <created by zg
	started at 2014-04-10 19:59:05.994 -0700,
	POWCHK enabled, PULCHK disabled,
       configuration hash MD5:
       C8 4E 4E 5D D3 5C D8 9E 9F 52 82 E0 59 8A DE 15
       data hash MD5: 64K
       5C 9F 10 1B 9B 4C 63 55 5E B8 11 19 AF 38 ED 59>)
(   2,<2014-04-10 20:10:38.767 -0700>,<Administrator>,<X>,<proc1d>,<TOPSPIN 2.1>,
      <Start of raw data processing
       efp LB = 0.3 FT_mod = 6 PKNL = 1 PHC0 = 0 PHC1 = 0 SI = 128K 
       data hash MD5: 128K
       B5 00 E2 FE 4A 85 1F F5 8A DB F9 CD 51 5E B6 B8>)
(   3,<2014-04-10 20:10:39.861 -0700>,<Administrator>,<X>,<proc1d>,<TOPSPIN 2.1>,
      <pk PHC0 = -80.88135 PHC1 = 0 
       data hash MD5: 128K
       B5 21 0C 9F E4 A8 04 15 BD D8 E0 E2 B4 50 D4 ED>)
(   4,<2014-04-10 20:10:40.642 -0700>,<Administrator>,<X>,<proc1d>,<TOPSPIN 2.1>,
      <abs ABSG = 1 
       data hash MD5: 128K
       35 69 13 D4 0D 43 C7 82 C8 57 4D F8 BF 1E 21 5D>)
(   5,<2014-04-10 20:10:40.783 -0700>,<Administrator>,<X>,<proc1d>,<TOPSPIN 2.1>,
      <abs ABSG = 2 
       data hash MD5: 128K
       42 67 0D 45 39 1D C6 0D E3 B9 69 9D 5D 5F 49 2A>)
(   6,<2014-04-10 20:10:40.924 -0700>,<Administrator>,<X>,<proc1d>,<TOPSPIN 2.1>,
      <abs ABSG = 3 
       data hash MD5: 128K
       5A 98 95 25 8B C9 10 F5 BC BD B9 32 6A 63 C7 15>)
(   7,<2014-04-10 20:10:41.080 -0700>,<Administrator>,<X>,<proc1d>,<TOPSPIN 2.1>,
      <abs ABSG = 4 
       data hash MD5: 128K
       E5 D4 AF 9C 71 A7 09 89 36 20 A1 D2 F0 A8 9C 7C>)
(   8,<2014-04-10 20:10:41.174 -0700>,<Administrator>,<X>,<proc1d>,<TOPSPIN 2.1>,
      <abs ABSG = 5 
       data hash MD5: 128K
       C5 17 42 BD 72 C9 F0 AF AC B6 0C D3 4F 15 E8 37>)
$$ ##END=
$$ 
$$ $$ hash MD5
$$ $$ E6 FA B8 4B 17 C2 F6 3B 9B 34 75 73 42 69 CD ED
##$RELAX= 
##$RELAX= 
##$RELAX= 
##$RELAX= 
##$RELAX= 
##$RELAX= 
##$RELAX= 
##$RELAX= 
$$ Bruker specific parameters
$$ --------------------------
##$DU= <E:\>
##$EXPNO= 22
$$ [...]
##$TP07= 0
##$TPNAME0= <>
##$TPNAME1= <>
##$TPNAME2= <>
##$TPNAME3= <>
##$TPNAME4= <>
##$TPNAME5= <>
##$TPNAME6= <>
##$TPNAME7= <>
##$TPOAL= (0..7)
0.5 0.5 0.5 0.5 0.5 0.5 0.5 0.5
##$TPOFFS= (0..7)
0 0 0 0 0 0 0 0
##$TUNHIN= 0
##$TUNHOUT= 0
##$TUNXOUT= 0
##$USERA1= <user>
##$USERA2= <user>
##$USERA3= <user>
##$USERA4= <user>
##$USERA5= <user>
##$V9= 5
##$VALIST= <valist>
##$VCLIST= <CCCCCCCCCCCCCCC>
##$VD= 0
##$VDLIST= <DDDDDDDDDDDDDDD>
##$VPLIST= <PPPPPPPPPPPPPPP>
##$VTLIST= <TTTTTTTTTTTTTTT>
##$WBST= 1024
##$WBSW= 4
##$XGAIN= (0..3)
0 0 0 0
##$XL= 0
##$YL= 0
##$YMAX_a= 13347582
##$YMIN_a= -14033570
##$ZGOPTNS= <>
##$ZL1= 120
##$ZL2= 120
##$ZL3= 120
##$ZL4= 120
##$ABSF1= 14.96161
##$ABSF2= -5.596572
##$ABSG= 5
##$ABSL= 3
##$ALPHA= 0
##$AQORDER= 0
##$ASSFAC= 0
##$ASSFACI= 0
##$ASSFACX= 0
##$ASSWID= 0
##$AUNMP= <proc_prof1d_extract.lims>
##$AXLEFT= 0
##$AXNAME= <>
##$AXNUC= <1H>
##$AXRIGHT= 0
##$AXTYPE= 0
##$AXUNIT= <>
##$AZFE= 0.1
##$AZFW= 0.1
##$BCFW= 0
##$BC_mod= 0
##$BYTORDP= 0
##$COROFFS= 0
##$CY= 15
##$DATMOD= 1
##$DC= 0
##$DFILT= <>
##$DTYPP= 0
##$F1P= 0
##$F2P= 0
##$FCOR= 0.5
##$FTSIZE= 131072
##$FT_mod= 6
##$GAMMA= 0
##$GB= 0
##$INTBC= 1
##$INTSCL= 1
##$ISEN= 128
##$LB= 0.3
##$LEV0= 0
##$LPBIN= 0
##$MAXI= 10000
##$MC2= 0
##$MEAN= 0
##$ME_mod= 0
##$MI= 0
##$NCOEF= 0
##$NC_proc= -1
##$NLEV= 6
##$NOISF1= 0
##$NOISF2= 0
##$NSP= 0
##$NTH_PI= 0
##$NZP= 0
##$OFFSET= 14.96161
##$PC= 1
##$PHC0= -80.88135
##$PHC1= 0
##$PH_mod= 1
##$PKNL= yes
##$PPARMOD= 0
##$PPDIAG= 0
##$PPIPTYP= 0
##$PPMPNUM= 2147483647
##$PPRESOL= 1
##$PSCAL= 4
##$PSIGN= 0
##$PYNMP= <proc.py>
##$REVERSE= no
##$SF= 400.020009392629
##$SI= 131072
##$SIGF1= 0
##$SIGF2= 0
##$SINO= 400
##$SIOLD= 131072
##$SPECTYP= <>
##$SREGLST= <1H.CDCl3>
##$SSB= 0
##$STSI= 131072
##$STSR= 0
##$SW_p= 8223.68421052631
##$SYMM= 0
##$S_DEV= 0
##$TDeff= 65536
##$TDoff= 0
##$TI= <>
##$TILT= no
##$TM1= 0
##$TM2= 0
##$TOPLEV= 0
##$USERP1= <user>
##$USERP2= <user>
##$USERP3= <user>
##$USERP4= <user>
##$USERP5= <user>
##$WDW= 1
##$XDIM= 131072
##$YMAX_p= 78829720
##$YMIN_p= -381205724
##$CURPLOT= <Network HP LaserJet P1505>
##$CURPRIN= <$Network HP LaserJet P1505>
##$DFORMAT= <normdp>
##$LAYOUT= <+/1D_H.xwp>
##$LFORMAT= <normlp>
##$PFORMAT= <normpl>
##$SURQMSG= 1
$$ End of Bruker specific parameters
$$ ---------------------------------
##NTUPLES= NMR SPECTRUM
##VAR_NAME=  FREQUENCY,     SPECTRUM/REAL,   SPECTRUM/IMAG
##SYMBOL=    X,             R,               I
##VAR_TYPE=  INDEPENDENT,   DEPENDENT,       DEPENDENT
##VAR_FORM=  AFFN,          ASDF,            ASDF
##VAR_DIM=   131072,        131072,          131072
##UNITS=     HZ,            ARBITRARY UNITS, ARBITRARY UNITS
##FACTOR=    0.0627417313425164, 1,          1
##FIRST=     8223.62146879497, 1018,         -25133
##LAST=      0,             1997,            -25033
##MIN=       0,             -381205724,      0
##MAX=       8223.62146879497, 78829720,     0
$$ Real data points
##PAGE= N=1
##DATA TABLE= (X++(R..R)), XYDATA
$$ [...]
62874C27887m06k15l20n43o71o65o08o30q04j021j109j072j115j293j400j305
$$ 327887 327481 327266 326946 326403 325732 325067 324459 323829 323025 322004 320895 319823 318708 317415 316015 314710
62858C14710j194j205j153q80n99n33m36L7O22O97K08k41k89j83j33R6O32J054
$$ 314710 313516 312311 311158 310278 309679 309146 308710 308747 309369 310066 310274 310033 309744 309561 309428 309524 310156 311210
62840C11210R85O69N49N46L36M2J25O32J096J180J053J003J073J160J189J124
$$ 311210 312195 312864 313413 313959 314295 314337 314462 315094 316190 317370 318423 319426 320499 321659 322848 323972
62824C23972R83R34J142J500J710J701J698J827J985K108K348K764L105L122K953
$$ 323972 324955 325889 327031 328531 330241 331942 333640 335467 337452 339560 341908 344672 347777 350899 353852
62809C53852K932L142L389L578L803M085M284M382M647N260O011O519O757P071
$$ 353852 356784 359926 363315 366893 370696 374781 379065 383447 388094 393354 399365 405884 412641 419712
62795D19712P714Q535R263R847J0464J1241J2217J3404J4706J5844J6577J7020
$$ 419712 427426 435961 445224 455071 465535 476776 488993 502397 517103 532947 549524 566544
62783E66544J7568J8478J9610K0632K1346K1773K2066K2365K2608K2521K1883
$$ 566544 584112 602590 622200 642832 664178 685951 708017 730382 752990 775511 797394
62772G97394K0843J9809J8973J8105J6861J5200J3373J1643J0087Q538O703M438
$$ 797394 818237 838046 857019 875124 891985 907185 920558 932201 942288 950826 957529 961967
62760I61967J943m51k751n293q199j1097j3544j5568j7523j9587k1598k3341k4707
$$ 961967 963910 963459 960708 955415 947216 936119 922575 907007 889484 869897 848299 824958 800251
62747H00251k5631k6072k6042k5618k4916k4122k3374k2543k1294j9614j7985
$$ 800251 774620 748548 722506 696888 671972 647850 624476 601933 580639 561025 543040
62736E43040j6809j5807j4420j2630j0982r753q617p292o046n248m737l994k805
$$ 543040 526231 510424 496004 483374 472392 462639 454022 446730 440684 435436 430699 426705 423900
62723D23900j449k90N46J116J573K163L065M208N366O464P606Q758R653J0179
$$ 423900 422451 422161 422707 423823 425396 427559 430624 434832 440198 446662 454268 463026 472679 482858
62709D82858J0694J1666J3072J4411J5371J6233J7431J8940K0373K1475K2254
$$ 482858 493552 505218 518290 532701 548072 564305 581736 600676 621049 642524 664778
62698F64778K2671K2579K2105K1767K1922K2297K2241K1404J9961J8356J6955
$$ 664778 687449 710028 732133 753900 775822 798119 820360 841764 861725 880081 897036
62687H97036J5856J4778J3233J1012Q466O115M016J781p95l471n962q339j0849
$$ 897036 912892 927670 940903 951915 960381 966496 970512 972293 971498 968027 962065 953726 942877
62674I42877j3515j6117j8467k0563k2435k4007k5108k5657k5804k5835k5891
$$ 942877 929362 913245 894778 874215 851780 827773 802665 777008 751204 725369 699478
62663F99478k5838k5441k4606k3423k2052k0668j9402j8171j6740j5125j3761
$$ 699478 673640 648199 623593 600170 578118 557450 538048 519877 503137 488012 474251
62652D74251j2986j2469j1537j0093q728p872p251o428n468m733m276l844l397
$$ 474251 461265 448796 437259 427166 418438 410566 403315 396887 391419 386686 382410 378566 375169
62639C75169l186l309l515l472l063k379j623j107j091j520k019k210k016j593
$$ 375169 371983 368674 365159 361687 358624 356245 354622 353515 352424 350904 348885 346675 344659 343066
62625C43066j122o92l60j78j90l17l85k31J29N18P86R13R42R63J145J648K353
$$ 343066 341944 341252 340892 340714 340524 340207 339822 339591 339720 340238 341024 341937 342879 343842 344987 346635 348988
62608C48988K911L167L403L943M690N294N703O229P042P871Q389Q606Q790R124
$$ 348988 351899 355066 358469 362412 367102 372396 378099 384328 391370 399241 407630 416236 425026 434150
62594D34150R589J0045J0310J0301J0146J0060J0002R677Q969Q215P771P500O927
$$ 434150 443739 453784 464094 474395 484541 494601 504603 514280 523249 531464 539235 546735 553662
62581E53662N880M662L600K686J763P80k93j563l010m360n366o181p176q475r785
$$ 553662 559542 564204 567804 570490 572253 573033 572740 571177 568167 563807 558441 552260 545084 536609 526824
62566E26824j0767j1316j1514j1468j1296j1136j1006j0766j0283r617q920q260
$$ 526824 516057 504741 493227 481759 470463 459327 448321 437555 427272 417655 408735 400475
62554D00475p590o886o192n583n090m715m412m095l661l093k447j782j095l64
$$ 400475 392885 385999 379807 374224 369134 364419 360007 355912 352251 349158 346711 344929 343834 343470
62540C43470L63R28J186J171J105J175J394J728K244K988L765M307M662N213O164
$$ 343470 343833 344761 345947 347118 348223 349398 350792 352520 354764 357752 361517 365824 370486 375699 381863
62525C81863P213P905Q205Q462Q981R806J0915J2294J3770J4947J5556J5784J6073
$$ 381863 389076 396981 405186 413648 422629 432435 443350 455644 469414 484361 499917 515701 531774
62512E31774J6677J7432J8053J8509J9010J9649K0178K0288K0010J9654J9375
$$ 531774 548451 565883 583936 602445 621455 641104 661282 681570 701580 721234 740609
62501G40609J8981J8284J7375J6417J5327J3927J2280J0618Q980P166N074K836
$$ 740609 759590 777874 795249 811666 826993 840920 853200 863818 872798 879964 885038 887874
62489H87874N74j748m141o440q430j0044j1339j2424j3463j4629j5960j7314j8547
$$ 887874 888448 886700 882559 876119 867689 857645 846306 833882 820419 805790 789830 772516 753969
62476G53969j9617k0529k1247k1790k2241k2592k2665k2308k1662k1039k0560
$$ 753969 734352 713823 692576 670786 648545 625953 603288 580980 559318 538279 517719
62465E17719j9995j9063j7822j6628j5680j4727j3376j1676j0120r044q217p201
$$ 517719 497724 478661 460839 444211 428531 413804 400428 388752 378632 369588 361371 354170
62453C54170n953m805m012l566l362l243k933k269j544j264j505j775j679j337
$$ 354170 348217 343412 339400 335834 332472 329229 326296 324027 322483 321219 319714 317939 316260 314923
62439C14923j061q97p56p15q50r78q77o59n99p27q19q05q42r92j057q96o67o62
$$ 314923 313862 312965 312209 311494 310644 309666 308789 308130 307531 306804 305985 305180 304338 303346 302289 301393 300726 300064
62421C00064r58j313j404j134p02l58j12K21O69R95R99P93O61P43J009J407J866
$$ 300064 299106 297793 296389 295255 294553 294195 294083 294304 294973 295968 296967 297760 298421 299164 300173 301580 303446
62404C03446K235K444K641K996L367L438L184K996L224L785M250M298M008L719
$$ 303446 305681 308125 310766 313762 317129 320567 323751 326747 329971 333756 338006 342304 346312 350031
62390C50031L698L870L971L883L777L823L948L988L977M089M384M720M970N103
$$ 350031 353729 357599 361570 365453 369230 373053 377001 380989 384966 389055 393439 398159 403129 408232
62376D08232N103M986M934N222N924O773P463Q021Q761R887J1144J2021J2303
$$ 408232 413335 418321 423255 428477 434401 441174 448637 456658 465419 475306 486450 498471 510774
62363E10774J2378J2811J3681J4530J4963J5043J4985J4776J4341J3824J3380
$$ 510774 523152 535963 549644 564174 579137 594180 609165 623941 638282 652106 665486
62352F65486J2902J2248J1612J1191J0654R406P455N522M107K901J337o40k648
$$ 665486 678388 690636 702248 713439 724093 733499 740954 746476 750583 753484 754821 754181 751533
62339G51533m462o160p818r402j0894j2311j3584j4636j5513j6299j6928j7231
$$ 751533 747071 740911 733093 723691 712797 700486 686902 672266 656753 640454 623526 606295
62327F06295j7171j6899j6576j6240j5789j5046j3946j2680j1562j0686r817q739
$$ 606295 589124 572225 555649 539409 523620 508574 494628 481948 470386 459700 449883 441144
62315D41144p544o441n450m514l732l270l025k688k163j657j331j109q86p42p39
$$ 441144 433600 427159 421709 417195 413463 410193 407168 404480 402317 400660 399329 398220 397334 396592 395853
62300C95853o97m15J3K68K09J5j30k84n71q80r56p90o82q76j216j410j459j593
$$ 395853 395156 394741 394754 395022 395231 395246 395116 394832 394261 393381 392425 391635 390953 390077 388861 387451 385992 384399
62282C84399j747j460m81P51J501J567J474J815K607L374L762L971M560N847P539
$$ 384399 382652 381192 380711 381462 382963 384530 386004 387819 390426 393800 397562 401533 406093 411940 419479
62267D19479R002R915J0498J1098J1713J2109J2214J2220J2295J2442J2583J2608
$$ 419479 428481 438396 448894 459992 471705 483814 496028 508248 520543 532985 545568 558176
62255E58176J2296J1519J0504R675R120Q471P468O354N487M775L790K322N43j357
$$ 558176 570472 581991 592495 602170 611290 619761 627229 633583 639070 643845 647635 649957 650500 649143
62241F49143l342n316p018q273r164r879j0517j1142j1879j2764j3596j4065j4075
$$ 649143 645801 640485 633467 625194 616030 606151 595634 584492 572613 559849 546253 532188 518113
62228E18113j3782j3430j3105j2738j2171j1303j0174q968p934p247o887o595
$$ 518113 504331 490901 477796 465058 452887 441584 431410 422442 414508 407261 400374 393779
62216C93779o046n152m205l536l114k571j705p71j68K2O7K11M51O55P68Q78J106
$$ 393779 387733 382581 378376 374840 371726 369155 367450 366679 366511 366533 366600 366811 367262 367917 368685 369563 370669
62199C70669J489J990K573L184L614L569L038K529K595L164L601L555L358L482
$$ 370669 372158 374148 376721 379905 383519 387088 390126 392655 395250 398414 402015 405570 408928 412410
62185D12410L914M335M659M983N278N445N614N969O358O495O465O654P082P316
$$ 412410 416324 420659 425318 430301 435579 441024 446638 452607 458965 465460 471925 478579 485661 492977
62171D92977P110O764O656O753O802O735O641O581O580O645O646O396N928N521
$$ 492977 500087 506851 513507 520260 527062 533797 540438 547019 553599 560244 566890 573286 579214 584735
62157E84735N244M825M078L170K276J262J4j209k093k719l374m076m646n092n573
$$ 584735 589979 594804 598882 602052 604328 605590 605604 604395 602302 599583 596209 592133 587487 582395 576822
62142E76822o027o197o016n644n193m680m187l736l063j847j78J483K839L943
$$ 576822 570795 564598 558582 552938 547745 543065 538878 535142 532079 530232 530054 531537 534376 538319
62128E38319M868N547O043O597P311P991Q477Q865R254R512R495R361R433R786
$$ 538319 543187 548734 554777 561374 568685 576676 585153 594018 603272 612784 622279 631640 641073 650859
62114F50859J0159J0219R914R500R237R025Q508P609O767O433O456O268N662N013
$$ 650859 661018 671237 681151 690651 699888 708913 717421 725030 731797 738230 744686 750954 756616 761629
62100G61629M682M581M391L990L480L071L038L577M485N213N376N172N122N526
$$ 761629 766311 770892 775283 779273 782753 785824 788862 792439 796924 802137 807513 812685 817807 823333
62086H23333O283P094P681P933P920P786P569P260O980O869O827O594O208O020
$$ 823333 829616 836710 844391 852324 860244 868030 875599 882859 889839 896708 903535 910129 916337 922357
62072I22357O138O152N628M706L922L613L713L972M102L828L029J876O27n88j711
$$ 922357 928495 934647 940275 944981 948903 952516 956229 960201 964303 968131 971160 973036 973663 973075 971364
62057I71364k618l313m105n283o688p873q663r250r765j0096j0247j0571j1389
$$ 971364 968746 965433 961328 956045 949357 941484 932821 923571 913806 903710 893463 882892 871503
62044H71503j2538j3508j4025j4310j4738j5350j5849j5977j5864j5892j6263
$$ 871503 858965 845457 831432 817122 802384 787034 771185 755208 739344 723452 707189
62033G07189j6801j7197j7370j7438j7443j7243j6724j6024j5374j4752j3888
$$ 707189 690388 673191 655821 638383 620940 603697 586973 570949 555575 540823 526935
62022E26935j2673j1439j0611j0141r557q576p427o403n454m492l792l621l638
$$ 526935 514262 502823 492212 482071 472514 463938 456511 450108 444654 440162 436370 432749 429111
62009D29111l214k364j791j870k114j904j320q73p51p28o41n71o02p46r91j279
$$ 429111 425897 423533 421742 419872 417758 415854 414534 413661 412910 412182 411541 410970 410368 409622 408631 407352
61993D07352j498j700k140k866l473l573l348l312l614l929l992l891l798l734
$$ 407352 405854 404154 402014 399148 395675 392102 388754 385442 381828 377899 373907 370016 366218 362484
61979C62484l632l434l106k723k524k601k670k375j796j340j145r19m34J90P74
$$ 362484 358852 355418 352312 349589 347065 344464 341794 339419 337623 336283 335138 334219 333785 333975 334749
61964C34749J318J779J957J834J834K444L582M639N121N183N411O147P155P927
$$ 334749 336067 337846 339803 341637 343471 345915 349497 354136 359257 364440 369851 375998 383153 391080
61950C91080Q296Q531Q904R354R730J0091J0554J0991J1204J1300J1528J1820
$$ 391080 399376 407907 416811 426165 435895 445986 456540 467531 478735 490035 501563 513383
61938E13383J1858J1576J1277J1128J0900J0407R856R550R440R224Q747Q119P478
$$ 513383 525241 536817 548094 559222 570122 580529 590385 599935 609375 618599 627346 635465 642943
61925F42943O886O374N938N518N036M486L935L474L185L047K885K519J986J504
$$ 642943 649829 656203 662141 667659 672695 677181 681116 684590 687775 690822 693707 696226 698212 699716
61911F99716J210J039R05Q17P63O27L44nl03n70r26j445k086k769l500m403n589
$$ 699716 700926 701965 702870 703687 704450 705077 705421 705416 705113 704543 703617 702172 700086 697317 693817 689414 683825
61894F83825o886p918q538r070r847j0689j1112j0995j0685j0434j0139r675r148
$$ 683825 676939 669021 660483 651413 641566 630877 619765 608770 598085 587651 577512 567837 558689
61881E58689q649q100p504p002o527n741m557l367k479j624l97J075K342L310
$$ 558689 550040 541940 534436 527434 520907 515166 510609 507242 504763 503139 502742 503817 506159 509469
61867E09469M322N598P020Q415R755J0983J1958J2646J3198J3791J4501J5292
$$ 509469 513791 519389 526409 534824 544579 555562 567520 580166 593364 607155 621656 636948
61855F36948J5993J6360J6344J6227J6309J6548J6719J6751J6677J6385J5749
$$ 636948 652941 669301 685645 701872 718181 734729 751448 768199 784876 801261 817010
61844H17010J4970J4377J3933J3289J2384J1529J0832R935Q547O882N301L836
$$ 817010 831980 846357 860290 873579 885963 897492 908324 918259 926806 933688 938989 942825
61832I42825K342Q92l15j338k416l622m768n655o184o349o323o461o952p533p846
$$ 942825 945167 946059 945744 944406 941990 938368 933600 927945 921761 915412 909089 902628 895676 888143 880297
61817H80297p990q453r424j0564j1571j2571j3794j5076j6050j6625j6979j7168
$$ 880297 872307 863854 854430 843866 832295 819724 805930 790854 774804 758179 741200 724032
61805G24032j7050j6623j6123j5676j5115j4314j3468j2867j2417j1691j0444
$$ 724032 706982 690359 674236 658560 643445 629131 615663 602796 590379 578688 568244
61794E68244q994p899p375p093o590n790n020m515m110l526k820k295k071j964
$$ 568244 559250 551351 543976 536883 530293 524503 519483 514968 510858 507332 504512 502217 500146 498182
61780D98182j808j609j301o87J92Q93J043Q29P26Q92J095J183J224J256J180J040
$$ 498182 496374 494765 493464 492777 492969 493862 494905 495734 496460 497352 498447 499630 500854 502110 503290 504330
61764E04330J044J248J424J410J320J264J133Q01M26K49K78K62J6l94p25q33q22
$$ 504330 505374 506622 508046 509456 510776 512040 513173 513974 514400 514649 514927 515189 515205 514811 514086 513253 512431
61747E12431r23j154j215r40o74q67j354j467r82m60l90m90k30K89N15K94M5J09
$$ 512431 511508 510354 509139 508199 507525 506658 505304 503837 502855 502395 502005 501515 501285 501574 502089 502383 502428 502537
61729E02537M11P62J117J419J534J414J183R44P43O41O59O51M69K09M0j26m64
$$ 502537 502948 503710 504827 506246 507780 509194 510377 511321 512064 512705 513364 514015 514484 514693 514733 514607 514143
61712E14143q66j089j192j437j711j610j169r92j392j886j921j678j711k090k373
$$ 514143 513277 512188 510996 509559 507848 506238 505069 504077 502685 500799 498878 497200 495489 493399 491026
61697D91026k302k054j824j547j070m07K62O57N54Q2k75j92J06K26K23M47Q78
$$ 491026 488724 486670 484846 483299 482229 481822 482084 482741 483295 483377 483102 482910 483016 483242 483465 483912 484790
61680D84790J111J023R97J287J558J396R44P07Q45J014R01N84L44K62J64j12n02
$$ 484790 485901 486924 487921 489208 490766 492162 493106 493813 494658 495672 496573 497157 497501 497763 497927 497815 497313
61663D97313p75q08o91n84m94l70l25n59j065j587j918k088k193k206k110k026
$$ 497313 496538 495730 495039 494455 493961 493591 493266 492707 491642 490055 488137 486049 483856 481650 479540 477514
61647D77514k062k170k282k426k567k555k393k380k642k776k325j558j247j665
$$ 477514 475452 473282 471000 468574 466007 463452 461059 458679 456037 453261 450936 449378 448131 446466
61633D46466k233k354k139k015k036j959j788j761j897j971j930j967k153k292
$$ 446466 444233 441879 439740 437725 435689 433730 431942 430181 428284 426313 424383 422416 420263 417971
61619D17971k287k327k572k852k893k675k423k327k406k610k866l098l264l366
$$ 417971 415684 413357 410785 407933 405040 402365 399942 397615 395209 392599 389733 386635 383371 380005
61605C80005l385l286l089k899k797k817k997l328l616l602l291k978k832k671
$$ 380005 376620 373334 370245 367346 364549 361732 358735 355407 351791 348189 344898 341920 339088 336417
61591C36417k357k116k222k512k579k386k235k163j825j135n92o72j199j652j853
$$ 336417 334060 331944 329722 327210 324631 322245 320010 317847 316022 314887 314295 313623 312424 310772 308919
61576C08919j982k042j809j306r24q90r66q26n36m18n66p62p81o36m89m56m87
$$ 308919 306937 304895 303086 301780 300856 299966 299000 298174 297638 297220 296654 295892 295111 294475 293986 293530 293043
61559B93043m14j38K36M69M85M74N80O66N06J41j54k05j18r1j89l02k12K15P87
$$ 293043 292629 292491 292727 293196 293681 294155 294735 295401 295907 296048 295894 295689 295571 295480 295291 294989 294777 294992 295779
61540B95779J029O48p6o30q81j126j475j618j316q14n18n12o26p70r31j015j003
$$ 295779 296808 297456 297380 296750 295869 294743 293268 291650 290334 289520 289002 288490 287864 287094 286163 285148 284145
61523B84145j065j285j369j029n32m47q53j200j081p15n20n50o04o80r15j237
$$ 284145 283080 281795 280426 279397 278865 278418 277565 276365 275284 274569 274049 273499 272895 272215 271300 270063
61507B70063j352j114o93l51j62j7J88L89M02J75o5j3L49P09P66N31K44R0R5J53
$$ 270063 268711 267597 266904 266553 266391 266374 266562 266951 267353 267528 267463 267450 267799 268508 269274 269805 270049 270139 270234 270387
61487B70387J61J01O5J14J76J69J99M26P77R90R71Q60O91L13k66o76o27l11j41
$$ 270387 270548 270649 270714 270828 271004 271173 271372 271798 272575 273565 274536 275396 276087 276400 276134 275458 274831 274520 274379
61468B74379k02k66j97q8NJ50L45M57M51M75O33P95P52M67J32k1J09M32P68R89
$$ 274379 274177 273911 273714 273626 273631 273781 274126 274583 275034 275509 276142 276937 277689 278156 278288 278267 278376 278808 279576 280565
61448B80565J092J145J223J392J642J849J852J643J385J246J290J523J862K067
$$ 280565 281657 282802 284025 285417 287059 288908 290760 292403 293788 295034 296324 297847 299709 301776
61434C01776J911J493J179J131J103Q90O85P83J090J215R68N18J07j41j85j03
$$ 301776 303687 305180 306359 307490 308593 309483 310168 310951 312041 313256 314224 314742 314849 314708 314523 314420
61418C14420j24m08p75r02p88p89j096j442j461j180j026j311j847k115j867j434
$$ 314420 314296 313888 313113 312211 311423 310634 309538 308096 306635 305455 304429 303118 301271 299156 297289 295855
61402B95855j301j450j433j102r25j283j833j918j427q29m67k81j64j59j75M0
$$ 295855 294554 293104 291671 290569 289644 288361 286528 284610 283183 282354 281887 281606 281442 281283 281108 281148
61386B81148N12R26J051J026J078J193J229J146R92Q13P06P96J045J280J418J583
$$ 281148 281660 282586 283637 284663 285741 286934 288163 289309 290301 291114 291820 292616 293661 294941 296359 297942
61370B97942J867K206K524K784K917K840K696K795L227L755M165M528M937N292
$$ 297942 299809 302015 304539 307323 310240 313080 315776 318571 321798 325553 329718 334246 339183 344475
61356C44475N469N523N526N388N065M786M811N066N178M921M408L941L708L659
$$ 344475 349944 355467 360993 366381 371446 376232 381043 386109 391287 396208 400616 404557 408265 411924
61342D11924L558L225K718K232J881J693J700J809J627Q09m73j626k323k718k945
$$ 411924 415482 418707 421425 423657 425538 427231 428931 430740 432367 433176 432703 431077 428754 426036 423091
61327D23091k894k626k567k889l125k800k138j677j462j103n06J6L28O61J138
$$ 423091 420197 417571 415004 412115 408990 406190 404052 402375 400913 399810 399304 399320 399648 400309 401447
61312D01447J543J704J764J886K023K099K182K328K413K290J997J686J458J371
$$ 401447 402990 404694 406458 408344 410367 412466 414648 416976 419389 421679 423676 425362 426820 428191
61298D28191J451J653J810J760J466J040O91N83O79P62O72M52J86j67n72p83n94
$$ 428191 429642 431295 433105 434865 436331 437371 438062 438645 439324 440086 440758 441210 441396 441229 440657 439874 439280
61281D39280j54K51O04J089J689K200K668L396M417N286N634N655N806O180O488
$$ 439280 439126 439377 439981 441070 442759 444959 447627 451023 455440 460726 466360 472015 477821 484001 490489
61266D90489O510O389O386O558O708O607O223N727N299M933M495L911L245K634
$$ 490489 496999 503388 509774 516332 523040 529647 535870 541597 546896 551829 556324 560235 563480 566114
61252E66114K211J983J725J083n9j336k238k668k967l426l958m319m426m364m218
$$ 566114 568325 570308 572033 573116 573057 571721 569483 566815 563848 560422 556464 552145 547719 543355 539137
61237E39137m034l835l593l261k801k198j434o07K3L07M88R29J597K114K312K462
$$ 539137 535103 531268 527675 524414 521613 519415 517981 517374 517397 517704 518192 519121 520718 522832 525144 527606
61221E27606K843L382L923M502N138N651N928O164O520O766O649O442O717P583
$$ 527606 530449 533831 537754 542256 547394 553045 558973 565137 571657 578423 585072 591514 598231 605814
61207F05814Q553R178R469R587R574R505R629J0043J0492J0693J0746J0860J0905
$$ 605814 614367 623545 633014 642601 652175 661680 671309 681352 691844 702537 713283 724143 735048
61194G35048J0510R677Q848Q309P775O828N541M416L708L152K361J309K46p16
$$ 735048 745558 755235 764083 772392 780167 786995 792536 796952 800660 803812 806173 807482 807728 807012
61180H07012j741l029m517n955p162q221r314j0440j1387j2021j2490j2961j3271
$$ 807012 805271 802242 797725 791770 784608 776387 767073 756633 745246 733225 720735 707774 694503
61167F94503j3088j2473j1936j1806j1761j1316j0499r752r204q484p295n847
$$ 694503 681415 668942 657006 645200 633439 622123 611624 601872 592668 584184 576889 571042
61155E71042m558l618k935k327j604o49M39J427K297L290M526N792O879P885Q975
$$ 571042 566484 562866 559931 557604 556000 555351 555790 557217 559514 562804 567330 573122 580001 587886 596861
61140E96861J0038J0866J1522J2206J2893J3343J3537J3686J3921J4187J4499
$$ 596861 606899 617765 629287 641493 654386 667729 681266 694952 708873 723060 737559
61129G37559J4961J5451J5624J5366J5003J4863J4851J4697J4352J3902J3270
$$ 737559 752520 767971 783595 798961 813964 828827 843678 858375 872727 886629 899899
61118H99899J2323J1197J0164R173P849O047M093K376Q95o03k233l929n608p191
$$ 899899 912222 923419 933583 942756 950605 956652 960745 963121 964016 963413 961180 957251 951643 944452
61104I44452q553r735j1065j2802j4670j6068j6807j7330j8044j8786j9181j9287
$$ 944452 935899 926164 915099 902297 887627 871559 854752 837422 819378 800592 781411 762124
61092G62124j9413j9495j9117j8202j7219j6551j5998j5195j4201j3317j2514
$$ 762124 742711 723216 704099 685897 668678 652127 636129 620934 606733 593416 580902
61081E80902j1475j0162q951q111p438o558n386m066k725j429k77O90J570K434
$$ 580902 569427 559265 550314 542203 534765 528207 522821 518755 516030 514601 514324 515014 516584 519018
61067E19018L193L769M348N200O286P276P978Q542R198R950J0670J1243J1585
$$ 519018 522211 525980 530328 535528 541814 549090 557068 565610 574808 584758 595428 606671 618256
61054F18256J1664J1645J1820J2267J2693J2810J2676J2522J2365J2066J1625
$$ 618256 629920 641565 653385 665652 678345 691155 703831 716353 728718 740784 752409
61043G52409J1191J0764J0231R651R175Q683P826O574N398M723M470M329M221
$$ 752409 763600 774364 784595 794246 803421 812104 819930 826504 831902 836625 841095 845424 849645
61030H49645M224M264M239M296M670N270N782O150O707P748R265J1118J3234J5563
$$ 849645 853869 858133 862372 866668 871338 876608 882390 888540 895247 902995 912260 923378 936612 952175
61016I52175J8077K0888K4194K8041L2305L7093M2896N0232N9243O9830Q1981
$$ 952175 970252 991140 1015334 1043375 1075680 1112773 1155669 1205901 1265144 1334974 1416955
61005A416955R5771J11040J27384J44488J62409J81567K02566K26114K52831K82790
$$ 1416955 1512726 1623766 1751150 1895638 2058047 2239614 2442180 2668294 2921125 3203915
60995C203915L14873L46501L74307L95614M09638M17390M20455M20011M17003
$$ 3203915 3518788 3865289 4239596 4635210 5044848 5462238 5882693 6302704 6719707
60986F719707M12871M09382M07472M06312M03838L98062L87560L70657L44865
$$ 6719707 7132578 7541960 7949432 8355744 8759582 9157644 9545204 9915861 10260726
60977A0260726L08175K61339K08434J54426J01942N0461j553n4199j06000j55684
$$ 10260726 10568901 10830240 11038674 11193100 11295042 11345503 11343950 11289751 11183751 11028067
60967A1028067k03576k51016k98484l44500l86450m22531m52631m77247m95847
$$ 11028067 10824491 10573475 10274991 9930491 9544041 9121510 8668879 8191632 7695785
60958G695785n06858n09442n04879m95796m84041m69374m50052m24436l92313
$$ 7695785 7188927 6679485 6174606 5678810 5194769 4725395 4275343 3850907 3458594
60949C458594l55224l15786k76615k39603k05936j76417j51454j30798j13636
$$ 3458594 3103370 2787584 2510969 2271366 2065430 1889013 1737559 1606761 1493125
60940A493125r9135q6863p6652o8221o1097n4903m9544m5023m1154l7581l4101
$$ 1493125 1393990 1307127 1230475 1162254 1101157 1046254 996710 951687 910533 872952 838851
60929H38851l0803k7849k5189k2693k0429j8665j7469j6523j5424j4112j2818
$$ 838851 808048 780199 755010 732317 711888 693223 675754 659231 643807 629695 616877
60918F16877j1739j0835r982r150q388p720p103o496n944n533n295n176n093n028
$$ 616877 605138 594303 584321 575171 566783 559063 551960 545464 539520 533987 528692 523516 518423 513395
60904E13395m980m900m686m299l842l508l470l695l848l583k976k556k665k996
$$ 513395 508415 503515 498829 494530 490688 487180 483710 480015 476167 472584 469608 467052 464387 461391
60890D61391l023k752k644k858l001k791k509k491k554k269j627j025p41p46r66
$$ 461391 458368 455616 452972 450114 447113 444322 441813 439322 436768 434499 432872 431847 431106 430360 429394
60875D29394j388j849k049j870j491j160r57q49p66o14l11R3M82Q11J131J447
$$ 429394 428006 426157 424108 422238 420747 419587 418630 417781 417015 416401 416090 416183 416665 417476 418607 420054
60859D20054J711J912K100K272K362K363K323K258K148K070K169K479K872L189
$$ 420054 421765 423677 425777 428049 430411 432774 435097 437355 439503 441573 443742 446221 449093 452282
60845D52282L376L453L428L230K750J973J128O01N92R03J137J054O81J72l17p03
$$ 452282 455658 459111 462539 465769 468519 470492 471620 472221 472813 473716 474853 475907 476588 476760 476443 475740
60829D75740j037j414j752j807j591j505j874k473k868l024l248l561l640l382
$$ 475740 474703 473289 471537 469730 468139 466634 464760 462287 459419 456395 453147 449586 445946 442564
60815D42564l153l237l468l545l452l338l222l124l209l545l888l954l801l662
$$ 442564 439411 436174 432706 429161 425709 422371 419149 416025 412816 409271 405383 401429 397628 393966
60801C93966l532l181k564j936j545j388j319j272j253j232j083p03k00J07K7
$$ 393966 390434 387253 384689 382753 381208 379820 378501 377229 375976 374744 373661 372958 372758 372865 372892
60786C72892k08j55K82P74J046J217J485J745J826J844K039K407K748L000L213
$$ 372892 372684 372529 372811 373585 374631 375848 377333 379078 380904 382748 384787 387194 389942 392942 396155
60771C96155L304L229L235L542L797L384K399J756K091K900L233K870K366K151
$$ 396155 399459 402688 405923 409465 413262 416646 419045 420801 422892 425792 429025 431895 434261 436412
60757D36412K061J808J448J181J015Q30O09M19K28n3m29q10j144j442j684j801
$$ 436412 438473 440281 441729 442910 443925 444755 445364 445783 446011 445958 445529 444719 443575 442133 440449 438648
60741D38648j783j789k016k471k897l021k858k697k739k851k806k611k475k442
$$ 438648 436865 435076 433060 430589 427692 424671 421813 419116 416377 413526 410720 408109 405634 403192
60727D03192k283j881j498j480j751j846j471q10k36J50M62P37Q80R44J186J716
$$ 403192 400909 399028 397530 396050 394299 392453 390982 390172 389936 390086 390548 391285 392165 393109 394295 396011
60711C96011K286K564K555K506K512K420K174K000K092K293K270J983J754J837
$$ 396011 398297 400861 403416 405922 408434 410854 413028 415028 417120 419413 421683 423666 425420 427257
60697D27257K075K143J960J786J850K027J983J611J191J061J239J471J619J808
$$ 427257 429332 431475 433435 435221 437071 439098 441081 442692 443883 444944 446183 447654 449273 451081
60683D51081K162K597K945L119L089K844K581K734L504M468M976M939M865N098
$$ 451081 453243 455840 458785 461904 464993 467837 470418 473152 476656 481124 486100 491039 495904 501002
60669E01002N421N563N674O022O470O708O799P070P532P814P720P503P453P517
$$ 501002 506423 511986 517660 523682 530152 536860 543659 550729 558261 566075 573795 581298 588751 596268
60655E96268P474P275P051O931O952O998O813O207N349M648M265L954L449K816
$$ 596268 603742 611017 618068 624999 631951 638949 645762 651969 657318 661966 666231 670185 673634 676450
60641F76450K257J777J262P20K23l16j054j964k854l567m039m248m319m581n253
$$ 676450 678707 680484 681746 682466 682689 682373 681319 679355 676501 672934 668895 664647 660328 655747 650494
60626F50494o067o512o430o209o245o499o693o748o807o960p116p216p312p461
$$ 650494 644427 637915 631485 625276 619031 612532 605839 599091 592284 585324 578208 570992 563680 556219
60612E56219p568p536p451p504p710p786p464o823o219n887n771n741n725n594
$$ 556219 548651 541115 533664 526160 518450 510664 503200 496377 490158 484271 478500 472759 467034 461440
60598D61440n182m588m263m488m899m831m140l359k975k867k612k138j798j836
$$ 461440 456258 451670 447407 442919 438020 433189 429049 425690 422715 419848 417236 415098 413300 411464
60584D11464k041k003j571r72n02k39j00l5j7P0L85Q67J256J461J696K107K470
$$ 411464 409423 407420 405849 404877 404375 404136 404036 404001 403984 404054 404439 405306 406562 408023 409719 411826 414296
60567D14296K480K211K037K178K525K895L146L118K739K248K044K198K378K334
$$ 414296 416776 418987 421024 423202 425727 428622 431768 434886 437625 439873 441917 444115 446493 448827
60553D48827K211K271K510K710K722K560K301K056J903J790J582J261R91R19J046
$$ 448827 451038 453309 455819 458529 461251 463811 466112 468168 470071 471861 473443 474704 475695 476614 477660
60538D77660J289J522J524J133N27J70L34Q69J512K145K631K707K324J859J681
$$ 477660 478949 480471 481995 483128 483655 483825 484159 485028 486540 488685 491316 494023 496347 498206 499887
60523D99887J684J513J133Q33P22O00L20J2j28m9J95M77O49O94Q77J496K466L432
$$ 499887 501571 503084 504217 505050 505772 506372 506692 506704 506576 506527 506722 507199 507848 508542 509419 510915 513381 516813
60505E16813M269N221O453P738Q763R500J0161J0859J1543J2106J2434J2436J2139
$$ 516813 521082 526303 532756 540494 549257 558757 568918 579777 591320 603426 615860 628296 640435
60492F40435J1695J1234J0732J0134R509Q932Q323P521O501N385M265L130J917
$$ 640435 652130 663364 674096 684230 693739 702671 710994 718515 725016 730401 734666 737796 739713
60479G39713O17p18k050l460n156p225r392j1205j2507j3631j4930j6305j7351
$$ 739713 740330 739612 737562 734102 728946 721721 712329 701124 688617 674986 660056 643751 626400
60466F26400j7873j7999j7898j7592j7061j6305j5245j3837j2330j1173j0501
$$ 626400 608527 590528 572630 555038 537977 521672 506427 492590 480260 469087 458586
60455D58586r936r059p914o838n980n248m668m416m491m561m309l739l083k556
$$ 458586 448650 439591 431677 424839 418859 413611 408943 404527 400036 395475 391166 387427 384344 381788
60441C81788k286k280k343k150j609j026p83r14j096j003n71j0L17J63l27o63
$$ 381788 379502 377222 374879 372729 371120 370094 369311 368397 367301 366298 365727 365717 366034 366197 365870 365207
60425C65207n31j20J85K87L43L86L13K22L24N40N37K41J4J12L37M00L62M40O28
$$ 365207 364676 364556 364741 365028 365371 365757 366070 366292 366616 367156 367693 367934 367948 368060 368397 368797 369159 369599 370227
60406C70227P92R72J247J470J441J263J202J292J305J152R69Q42P42P37R81J395
$$ 370227 371019 371991 373238 374708 376149 377412 378614 379906 381211 382363 383332 384174 384916 385653 386634 388029
60390C88029J643J528J210R48Q36Q79J108J464J753J851J814J674J291O39M4r6
$$ 388029 389672 391200 392410 393358 394194 395073 396181 397645 399398 401249 403063 404737 406028 406667 406711 406615
60374D06615K35P05J041J225J254J075P67O30Q66J281J529J524J463J464J414
$$ 406615 406850 407555 408596 409821 411075 412150 412917 413547 414413 415694 417223 418747 420210 421674 423088
60359D23088J239J118J238J455J450J196J013J127J392J592J770K066K387K501
$$ 423088 424327 425445 426683 428138 429588 430784 431797 432924 434316 435908 437678 439744 442131 444632
60345D44632K346K070J760J416J133J089J257J406J378J225J013P40M95N08Q16
$$ 444632 446978 449048 450808 452224 453357 454446 455703 457109 458487 459712 460725 461465 461960 462468 463284
60330D63284J142J174Q70L65k05o52p26m25j49k97p14q74n12R2N31P21Q98J337
$$ 463284 464426 465600 466470 466835 466630 465978 465252 464827 464678 464381 463667 462793 462281 462373 462904 463625 464523 465860
60312D65860K103K982L589L739L657L739M065M349M381M273M205M124L874L457
$$ 465860 467963 470945 474534 478273 481930 485669 489734 494083 498464 502737 506942 511066 514940 518397
60298E18397L013K641K431K500K808K986K688K036J487J188P72p6j093j800k211
$$ 518397 521410 524051 526482 528982 531790 534776 537464 539500 540987 542175 542947 542871 541778 539978 537767
60283E37767k847m017n354o256o529o444o280o054n720n347m977m486l737k873
$$ 537767 534920 530903 525549 519293 512764 506320 500040 493986 488266 482919 477942 473456 469719 466846
60269D66846k266k154k359k471k279j953j827k030k401k713k855k760k357j726
$$ 466846 464580 462426 460067 457596 455317 453364 451537 449507 447106 444393 441538 438778 436421 434695
60255D34695j218j167j492j750j658j316r13m70l3J63J3j65J4M30O35N62O10R73
$$ 434695 433477 432310 430818 429068 427410 426094 425181 424711 424678 424841 424854 424689 424703 425133 425768 426330 426940 427913
60237D27913J329J352J210J226J370J422J409J519J735J916K104K387K590K457
$$ 427913 429242 430594 431804 433030 434400 435822 437231 438750 440485 442401 444505 446892 449482 451939
60223D51939K147K027K047J765J153Q05J132J753K063K036K041K136K023J616
$$ 451939 454086 456113 458160 459925 461078 461883 463015 464768 466831 468867 470908 473044 475067 476683
60209D76683J174Q97P43O60O92P87P75N96L08n3m54p00o01k69jJ44K97L39p0q77
$$ 476683 477857 478754 479497 480157 480849 481636 482411 483007 483315 483262 482808 482108 481507 481238 481237 481381 481678 482017 481947 481070
60189D81070j452j307o95k40j81k70k49o7K40O04Q46Q53P82R10J239J502J555
$$ 481070 479618 478311 477616 477376 477195 476925 476676 476609 476849 477453 478299 479152 479934 480844 482083 483585 485140
60172D85140J540J654J841J894J728J478J355J450J674J854J903J866J797J690
$$ 485140 486680 488334 490175 492069 493797 495275 496630 498080 499754 501608 503511 505377 507174 508864
60158E08864J583J585J725J873J892J803J713J687J775K077K569K996L060K779
$$ 508864 510447 512032 513757 515630 517522 519325 521038 522725 524500 526577 529146 532142 535202 537981
60144E37981K453K332K402K482K397K061J595J352J609K179K472K104J347Q48
$$ 537981 540434 542766 545168 547650 550047 552108 553703 555055 556664 558843 561315 563419 564766 565614
60130E65614Q99J168J104N39k15p62j019j146j282j446j642j861k050k164k269
$$ 565614 566513 567681 568785 569324 569109 568347 567328 566182 564900 563454 561812 559951 557901 555737 553468
60115E53468k441k601k599k495k511k610k454j900j326j193j464j645j345n56
$$ 553468 551027 548426 545827 543332 540821 538211 535757 533857 532531 531338 529874 528229 526884 526328
60101E26328M56J362J915K154K387K818L267L446L369L277L269L260L231L206
$$ 526328 526784 528146 530061 532215 534602 537420 540687 544133 547502 550779 554048 557308 560539 563745
60087E63745L052K576J832J090N05M5k71l75l71m92p87j157j608k227k873l322
$$ 563745 566797 569373 571205 572295 572800 572845 572574 572199 571828 571336 570549 569392 567784 565557 562684 559362
60071E59362l643m120m668m860m615m427m692n174n450n475n376n017m216l231
$$ 559362 555719 551599 546931 542071 537456 533029 528337 523163 517713 512238 506862 501845 497629 494398
60057D94398k559k331k228j971j603j296j102r91r27q59p74o66n06k84j52l20
$$ 494398 491839 489508 487280 485309 483706 482410 481308 480317 479390 478531 477757 477091 476585 476301 476149 475829
60041D75829p02r18p85n49m81n27o27j026j882k772l090k819k504k511k716k923
$$ 475829 475127 474209 473424 472875 472394 471867 471240 470214 468332 465560 462470 459651 457147 454636 451920 448997
60025D48997l096l165l002k742k737l068l435l560l450l153k681k237k140k314
$$ 448997 445901 442736 439734 436992 434255 431187 427752 424192 420742 417589 414908 412671 410531 408217
60011D08217k237j604p51j46J79M17N65N67O29R37J271J315J204J328J655J738
$$ 408217 405980 404376 403625 403479 403658 404075 404640 405207 405836 406773 408044 409359 410563 411891 413546 415284
59995D15284J432J132J187J482J750J956K146K214K061J802J574J316R36N59L83
$$ 415284 416716 417848 419035 420517 422267 424223 426369 428583 430644 432446 434020 435336 436272 436831 437214
59980D37214L60K72L2k30l82m09l25j19J44L31L49J98n8l20m69m73m34m44m59
$$ 437214 437574 437846 437878 437648 437266 436857 436532 436413 436557 436888 437237 437435 437377 437057 436588 436115 435681 435237 434778
59961D34778m21l80l94l93l09k66l79n11m69l89n97j040j255j024o95o44p76q19
$$ 434778 434357 433977 433583 433190 432881 432615 432236 431725 431256 430867 430270 429230 427975 426951 426256 425612 424836 424017
59943D24017q15r35j030q24m59l69o28q29o83l52o9K16N96R21R80Q34P11P22Q23
$$ 424017 423202 422267 421237 420413 419954 419585 418957 418128 417445 417093 417024 417240 417836 418757 419737 420571 421282 422004 422827
59924D22827R71J119J188J146J131J282J563J821J990K129K250K280K163J985
$$ 422827 423798 424917 426105 427251 428382 429664 431227 433048 435038 437167 439417 441697 443860 445845
59910D45845J895J943K019J980J878J938K227K487K457K259K243K499K796K954
$$ 445845 447740 449683 451702 453682 455560 457498 459725 462212 464669 466928 469171 471670 474466 477420
59896D77420L034L037K833K460K241K375K647K768K772K852L016L115L098K947
$$ 477420 480454 483491 486324 488784 491025 493400 496047 498815 501587 504439 507455 510570 513668 516615
59882E16615K532J809J079P17P01O66M20R5j83m93r14j354j659j797j865k035
$$ 516615 519147 520956 522035 522752 523453 524119 524539 524634 524451 523958 523044 521690 520031 518234 516369 514334
59866E14334k524l383m280m676m315l536k938k853l134l404l437l271l035k713
$$ 514334 511810 508427 504147 499471 495156 491620 488682 485829 482695 479291 475854 472583 469548 466835
59852D66835k217j585j011n84k05K34P18J272J996K757L129K875K356K097K113
$$ 466835 464618 463033 462022 461438 461233 461467 462185 463457 465453 468210 471339 474214 476570 478667 480780
59837D80780K030J774J679J892K032J737J150O51L49R2j52k60k24k46m88q79j274
$$ 480780 482810 484584 486263 488155 490187 491924 493074 493725 494074 494166 494014 493754 493530 493284 492796 491917 490643
59820D90643j628j999k368k613k650k607k737l182l805m302m427m185l879l850
$$ 490643 489015 487016 484648 482035 479385 476778 474041 470859 467054 462752 458325 454140 450261 446411
59806D46411m086m123l622k897k530k511k230j482r20j101j608j667j271j029
$$ 446411 442325 438202 434580 431683 429153 426642 424412 422930 422010 420909 419301 417634 416363 415334
59792D15334j143j228j139j174j339j145m35K08K64K3Q9N24R82J315J626J872
$$ 415334 414191 412963 411824 410650 409311 408166 407731 407939 408203 408226 408315 408839 409821 411136 412762 414634
59776D14634J906J836J940K264K574K727K808K944L181L515L873M111M126L984
$$ 414634 416540 418376 420316 422580 425154 427881 430689 433633 436814 440329 444202 448313 452439 456423
59762D56423L807L654L591L695L846L717L193K613K338K258K051J754J731K059
$$ 456423 460230 463884 467475 471170 475016 478733 481926 484539 486877 489135 491186 492940 494671 496730
59748D96730K319K103J495R46P86R44J076R41O06K61j07o43j209j415j191r67
$$ 496730 499049 501152 502647 503593 504379 505323 506399 507340 507946 508207 508100 507457 506248 504833 503642 502675
59732E02675j037j045n53J24K53k38n96k57N08J115J392J472J387J160J053J344
$$ 502675 501638 500593 500040 500164 500417 500179 499583 499326 499834 500949 502341 503813 505200 506360 507413 508757
59716E08757J901K318K413K339K271K204K129K110K136K080J895J739J774J936
$$ 508757 510658 512976 515389 517728 519999 522203 524332 526442 528578 530658 532553 534292 536066 538002
59702E38002K005J877J645J405J137Q24N85N02M37J71k85o65q13q54r70j102j100
$$ 538002 540007 541884 543529 544934 546071 546895 547480 547982 548419 548590 548305 547640 546827 545973 545003 543901 542801
59685E42801r98j021j319j845k396k729k702k414k179k265k616k971l115k980
$$ 542801 541803 540782 539463 537618 535222 532493 529791 527377 525198 522933 520317 517346 514231 511251
59671E11251k633k294k218k389k452k092j446r56r07j290j916k497k678k359j904
$$ 511251 508618 506324 504106 501717 499265 497173 495727 494771 493864 492574 490658 488161 485483 483124 481220
59656D81220j777j954k018j783j495j349j225r98q28q86j057j136j125j140j153
$$ 481220 479443 477489 475471 473688 472193 470844 469619 468621 467793 466907 465850 464714 463589 462449 461296
59641D61296j061q87q22j025j454j823j769j202n04j85l06n23o38p80r44q22l15
$$ 461296 460235 459348 458526 457501 456047 454224 452455 451253 450749 450564 450258 449735 449097 448317 447373 446551 446236
59624D46236J41J63l5l4J04L4j40N5O70J164J160R13Q02P88O69N70P38J048J082
$$ 446236 446377 446540 446505 446471 446575 446609 446469 446524 447194 448358 449518 450431 451233 452021 452690 453260 453998 455046 456128
59605D56128P31L67L20M55M21J92O9K30M43M04J81J13L20N36N13L62L00K73R1
$$ 456128 456859 457226 457546 458001 458422 458614 458683 458913 459356 459760 459941 460054 460374 460910 461423 461785 462085 462358 462449
59586D62449j87l62n01q80j426j640j255o80m61n89o61n83o15p78o99k28J99J17
$$ 462449 462262 461900 461399 460519 459093 457453 456198 455518 455057 454468 453807 453224 452609 451831 451132 450904 451103 451220
59568D51220l31o66p61q48r34p43k49J42K22L45Q37J394J523J377J581K278K926
$$ 451220 450889 450223 449462 448614 447680 446937 446688 446830 447052 447397 448234 449628 451151 452528 454109 456387 459313
59551D59313L169L350L835M362M507M474M813N507N925N714N284N206N540N971
$$ 459313 462482 465832 469667 474029 478536 483010 487823 493330 499255 504969 510253 515459 520999 526970
59537E26970O299O519O569O356N985N744N784N926N819N232M235L098K037J089
$$ 526970 533269 539788 546357 552713 558698 564442 570226 576152 581971 587203 591438 594536 596573 597662
59523E97662K13n39j100j538j986k464k933l484m262n126n722n895n864n831n739
$$ 597662 597875 597336 596236 594698 592712 590248 587315 583831 579569 574443 568721 562826 556962 551131 545392
59508E45392n511n306n262n202m891m394l933l462k776j924j215p52l31J48N13
$$ 545392 539881 534575 529313 524111 519220 514826 510893 507431 504655 502731 501516 500764 500433 500581 501094
59493E01094O54P53J000J350J715K204K895L544L783L616L468L678M114M357M223
$$ 501094 501748 502501 503501 504851 506566 508770 511665 515209 518992 522608 526076 529754 533868 538225 542448
59478E42448L948L865M018M207M389M787N555O439O999P115P001O836O638O463
$$ 542448 546396 550261 554279 558486 562875 567662 573217 579656 586655 593770 600771 607607 614245 620708
59464F20708O428O401O012N178M348L991M057M183M189M124L926L475K895K490
$$ 620708 627136 633537 639549 644727 649075 653066 657123 661306 665495 669619 673545 677020 679915 682405
59450F82405K248J790Q96j53r28j319j530j771k158k746l433l896l855l408k977
$$ 682405 684653 686443 687339 687186 686258 684939 683409 681638 679480 676734 673301 669405 665550 662142 659165
59435F59165k871k998l065k925k654k363k052j669j210p20k48J64M72O71Q12R56
$$ 659165 656294 653296 650231 647306 644652 642289 640237 638568 637358 636638 636390 636554 637026 637697 638509 639465
59419F39465J101J211J247J171R65P10M89J41o88k019l245l711l576l675m439
$$ 639465 640566 641777 643024 644195 645160 645870 646359 646500 645812 643793 640548 636837 633261 629586 625147
59404F25147n442o157o659p237p695p628p145o768o687o603o307n920n546n126
$$ 625147 619705 613548 606889 599652 591957 584329 577184 570416 563729 557126 550819 544899 539353 534227
59390E34227m743m600m627m459m007l633l555l547l387l212l129k814j954p78
$$ 534227 529484 524884 520257 515798 511791 508158 504603 501056 497669 494457 491328 488514 486560 485782
59376D85782K51J031J741K394K906L454M272N196N846O269O901P846Q678R117
$$ 485782 486033 487064 488805 491199 494105 497559 501831 507027 512873 519142 526043 533889 542567 551684
59362E51684R457J0006J0557J0715J0582J0613J0906J1025J0614R890R313Q959
$$ 551684 561141 571147 581704 592419 603001 613614 624520 635545 646159 656049 665362 674321
59350F74321Q459P529O359N345M581L798K751J511L13p32j666k594l611m826o229
$$ 674321 682780 690309 696668 702013 706594 710392 713143 714654 714967 714235 712569 709975 706364 701538 695309
59335F95309p631q789r625j0197j0576j0772j0832j0861j0906j0887j0623r969
$$ 695309 687678 678889 669264 659067 648491 637719 626887 616026 605120 594233 583610 573641
59323E73641q975p927p151o701o293n609m640l673l031k839k906k792k139j049
$$ 573641 564666 556739 549588 542887 536594 530985 526345 522672 519641 516802 513896 511104 508965 507916
59309E07916l1N07O44P24R47J276J650K022K344K648L085L737M452N030N474N910
$$ 507916 507885 508392 509036 509760 510707 511983 513633 515655 517999 520647 523732 527469 531921 536951 542425 548335
59293E48335O338O681O983P351P769Q147Q472Q716Q772Q647Q572Q644Q559Q036
$$ 548335 554673 561354 568337 575688 583457 591604 600076 608792 617564 626211 634783 643427 651986 660022
59279F60022P352O984O845O407N545M678M006L200K132J257R05O48j08j282k340
$$ 660022 667374 674358 681203 687610 693155 697833 701839 705039 707171 708428 709333 709981 709873 708591 706251
59264G06251l186m147n274o128o434o388o268o082n780n505n419n452n403n209
$$ 706251 703065 698918 693644 687516 681082 674694 668426 662344 656564 651059 645640 640188 634785 629576
59250F29576m924m564m106l592l130k812k663k677k841l119l393l437l053k305
$$ 629576 624652 620088 615982 612390 609260 606448 603785 601108 598267 595148 591755 588318 585265 582960
59236E82960j613j485k080l035l787m088m190m518n162n817o171o258o279o252
$$ 582960 581347 579862 577782 574747 570960 566872 562682 558164 553002 547185 541014 534756 528477 522225
59222E22225o064n797n707n815n809n480n004m622m249l632k774j944j347r74
$$ 522225 516161 510364 504657 498842 493033 487553 482549 477927 473678 470046 467272 465328 463981 463007
59208D63007p12l79K34J103J820J958J652J508J859K388K659K780L163L812M177
$$ 463007 462295 461916 462150 463253 465073 467031 468683 470191 472050 474438 477097 479877 483040 486852 491029
59193D91029L909L417L430M082M801N071N041N153N469N678N650N604N690N774
$$ 491029 494938 498355 501785 505867 510668 515739 520780 525933 531402 537080 542730 548334 554024 559798
59179E59798N708N555N371N060M663M484M665M851M572L868L198K795K451J920
$$ 559798 565506 571061 576432 581492 586155 590639 595304 600155 604727 608595 611793 614588 617039 618959
59165F18959J232N35j47q97j754k651l374l686l620l603m051m883n650o101o355
$$ 618959 620191 620726 620579 619682 617928 615277 611903 608217 604597 600994 596943 592060 586410 580309 573954
59150E73954o484o352n929n489n215m928m350l534k730k037j389p71k11L90J149
$$ 573954 567470 561118 555189 549700 544485 539557 535207 531673 528943 526906 525517 524746 524535 524925 526074
59135E26074J927K422K565K687L168M053N038N792O199O381O546O807P128P414
$$ 526074 528001 530423 532988 535675 538843 542896 547934 553726 559925 566306 572852 579659 586787 594201
59121E94201P623P795P995Q253Q474Q450Q017P279O547O007N542M974M374L972
$$ 594201 601824 609619 617614 625867 634341 642791 650808 658087 664634 670641 676183 681157 685531 689503
59107F89503L822L692L317K584J521K86q30j551j934k391l250m359n247n653n761
$$ 689503 693325 697017 700334 702918 704439 704725 703895 702344 700410 698019 694769 690410 685163 679510 673749
59092F73749n902o176o443o573o608o640o653o557o366o216o186o121n827n395
$$ 673749 667847 661671 655228 648655 642047 635407 628754 622197 615831 609615 603429 597308 591481 586086
59078E86086n159n256n385n194m759m470m508m625m523m235m000l933l924l761
$$ 586086 580927 575671 570286 565092 560333 555863 551355 546730 542207 537972 533972 530039 526115 522354
59064E22354l264k442j604j201j353j661j649j331j110j234j537j717j570j023
$$ 522354 519090 516648 515044 513843 512490 510829 509180 507849 506739 505505 503968 502251 500681 499658
59050D99658j39P58J284J435J632K175K859L291L418L519L778M122M425M662M856
$$ 499658 499519 500277 501561 502996 504628 506803 509662 512953 516371 519890 523668 527790 532215 536877 541733
59035E41733M988N028M959M782M611M660N042N568N918N949N750N449N113M798
$$ 541733 546721 551749 556708 561490 566101 570761 575803 581371 587289 593238 598988 604437 609550 614348
59021F14348M558M361M146L927L754L580L317L004K780K671K580K478K487K694
$$ 614348 618906 623267 627413 631340 635094 638674 641991 644995 647775 650446 653026 655504 657991 660685
59007F60685L010L241L211K817K114J390R52Q35Q51R28J152J408J298O17k75q62
$$ 660685 663695 666936 670147 672964 675078 676468 677420 678255 679106 680034 681186 682594 683892 684509 684234 683372
58991F83372j049j124j233j220r86o97n77p08j059j500j705j344n28J73L47K11
$$ 683372 682323 681199 679966 678746 677760 677063 676486 675778 674719 673219 671514 670170 669642 669815 670162 670373
58975F70373K51N80R55J290J793K517L128L320L202L121L216L365L443L436L292
$$ 670373 670624 671204 672159 673449 675242 677759 680887 684207 687409 690530 693746 697111 700554 703990 707282
58960G07282K893K182J240K34o56j310j803k405l338m508n597o377o834p027p049
$$ 707282 710175 712357 713597 713831 713175 711865 710062 707657 704319 699811 694214 687837 681003 673976 666927
58945F66927p130p538q230q797q868q457p823p137o432n781n265m842m389l911
$$ 666927 659797 652259 644029 635232 626364 617907 610084 602947 596515 590734 585469 580627 576238 572327
58931E72327l559l413l366l288l179l123l152l212l233l146k843k212j302l89
$$ 572327 568768 565355 561989 558701 555522 552399 549247 546035 542802 539656 536813 534601 533299 532910
58917E32910K72P87J577K858M297N349N917O448P331Q492R618J0600J1535J2451
$$ 532910 533182 533969 535546 538404 542701 548050 553967 560415 567746 576238 585856 596456 607991 620442
58903F20442J3232J3762J4084J4370J4816J5415J5876J5898J5561J5186J4800
$$ 620442 633674 647436 661520 675890 690706 706121 721997 737895 753456 768642 783442
58892G83442J4045J2810J1601J0923J0540R789Q469O958N513L961K199N01r09
$$ 783442 797487 810297 821898 832821 843361 853150 861619 868577 874090 878051 880250 880751 879842
58879H79842k263l914n823p693r421j1125j2735j3940j4562j4808j5003j5200
$$ 879842 877579 873665 867842 860149 850728 839603 826868 812928 798366 783558 768555 753355
58867G53355j5194j4867j4402j4066j3841j3417j2578j1474j0425r570q891q441
$$ 753355 738161 723294 708892 694826 680985 667568 654990 643516 633091 623521 614630 606189
58855F06189q334q470q514q222p666p066o558o172n907n717n492n162m768m405
$$ 606189 597855 589385 580871 572649 564983 557917 551359 545187 539280 533563 528071 522909 518141 513736
58841E13736m164m079m073l970l630l102k540k027j574j287j257j326j177p46
$$ 513736 509572 505493 501420 497450 493820 490718 488178 486151 484577 483290 482033 480707 479530 478784
58827D78784l43k84n26q16j028j211j369j384j138o78k43j33m50j003j490j766
$$ 478784 478441 478157 477631 476815 475787 474576 473207 471823 470685 470007 469764 469631 469181 468178 466688 464922
58811D64922j815j596j123o19l55l15k82k43l86o11m74J98R53J282J249J258J419
$$ 464922 463107 461511 460388 459769 459414 459099 458817 458574 458188 457577 457103 457301 458254 459536 460785 462043 463462
58794D63462J530J519J585J857K256K658K949K938K504J902J651K002K663L151
$$ 463462 464992 466511 468096 469953 472209 474867 477816 480754 483258 485160 486811 488813 491476 494627
58780D94627L243L050K801K619K496K349K129J833J461J029O58N20O14P16O86
$$ 494627 497870 500920 503721 506340 508836 511185 513314 515147 516608 517637 518295 518815 519429 520145 520831
58765E20831O40P49R85J266J674K265K835L132L215L349L601L884M294M963N612
$$ 520831 521471 522220 523205 524471 526145 528410 531245 534377 537592 540941 544542 548426 552720 557683 563295
58750E63295N712N310N164N818O849P450P457P386P564P749P618P243O919O773
$$ 563295 569007 574317 579481 585299 592148 599598 607055 614441 622005 629754 637372 644615 651534 658307
58736F58307O738O707O562O183N605N041M648M272L617K598J466N46n5n11j167
$$ 658307 665045 671752 678314 684497 690102 695143 699791 704063 707680 710278 711744 712290 712235 711724 710557
58721G10557k311l871n371o281o553o630o909p393p909q456r025r362r264r016
$$ 710557 708246 704375 699004 692723 686170 679540 672631 665238 657329 648873 639848 630486 621222 612206
58707F12206r135r650j0022r911r552r247q916q489q310q639r044q835q025p266
$$ 612206 603071 593421 583399 573488 563936 554689 545773 537284 528974 520335 511291 502456 494431 487165
58693D87165o862o425n660m881m475m225l684k857k116j518p51K49J032J220J058
$$ 487165 480303 473878 468218 463337 458862 454637 450953 448096 445980 444462 443711 443960 444992 446212 447270
58678D47270J115J573K094K380K515K663K654K294J875J972K624L150L028K575
$$ 447270 448385 449958 452052 454432 456947 459610 462264 464558 466433 468405 471029 474179 477207 479782
58664D79782K398K527K534K300K074J840J252L08n03q80j099j452j830k163k734
$$ 479782 482180 484707 487241 489541 491615 493455 494707 495015 494512 493632 492533 491081 489251 487088 484354
58649D84354l650m365m322l691l027k406j542o14k68o83j211j148m59L76R53J158
$$ 484354 480704 476339 472017 468326 465299 462893 461351 460737 460469 459786 458575 457427 456968 457344 458297 459455
58633D59455J132J219J709K463L035L236L352L651M002M112L955L745L659L766
$$ 459455 460587 461806 463515 465978 469013 472249 475601 479252 483254 487366 491321 495066 498725 502491
58619E02491M056M372M469M314M174M246M386M337M091L812L569L347L160K991
$$ 502491 506547 510919 515388 519702 523876 528122 532508 536845 540936 544748 548317 551664 554824 557815
58605E57815K726K352K124K260K606K779K610K241J892J702J796K183K669L018
$$ 557815 560541 562893 565017 567277 569883 572662 575272 577513 579405 581107 582903 585086 587755 590773
58591E90773L257L587M082M615N113N568N945O210O520P085P815Q364Q544Q459
$$ 590773 594030 597617 601699 606314 611427 616995 622940 629150 635670 642755 650570 658934 667478 675937
58577F75937Q258P914P412O864O377N999N856O075O474O566O066N199M387L786
$$ 675937 684195 692109 699521 706385 712762 718761 724617 730692 737166 743732 749798 754997 759384 763170
58563G63170L292K871K592K464K379K151J571M89r63k412l578m502n375o261p143
$$ 763170 766462 769333 771925 774389 776768 778919 780490 780979 780016 777604 774026 769524 764149 757888 750745
58548G50745q012q780r283r522r740j0118j0479j0523j0160r490q634p765p108
$$ 750745 742733 733953 724670 715148 705408 695290 684811 674288 664128 654638 646004 638239 631131
58535F31131o638n970m911l853l297l102k695j922j210q41n85j60L73Q72J350
$$ 631131 624493 618523 613612 609759 606462 603360 600665 598743 597533 596692 596107 595947 596320 597192 598542
58520E98542J763J905J748J599J635J630J369J055J005J138J160R73O38P1p41
$$ 598542 600305 602210 603958 605557 607192 608822 610191 611246 612251 613389 614549 615522 616160 616231 615490
58505F15490j410j462r94n46l01J10Q88J569J617J195R34J103J364J337J009N26
$$ 615490 614080 612618 611624 611078 610777 610887 611775 613344 614961 616156 617090 618193 619557 620894 621903 622429
58489F22429l7n50p33m65j04j36n88j006j105j090j260j566j766j807j816j841
$$ 622429 622392 621842 621109 620644 620540 620404 619816 618810 617705 616615 615355 613789 612023 610216 608400 606559
58473F06559j892k134k702l383l788l885m053m528n053n279n191n001m795m521
$$ 606559 604667 602533 599831 596448 592660 588775 584722 580194 575141 569862 564671 559670 554875 550354
58459E50354m139l609k853j934j129o62m07o7M44R55J320J507J511J307R72O72
$$ 550354 546215 542606 539753 537819 536690 536028 535621 535554 535998 536953 538273 539780 541291 542598 543570 544242
58443E44242N12M86N40O49Q21J092J465J817J979J973K044K379K885L345L659
$$ 544242 544754 545240 545780 546429 547250 548342 549807 551624 553603 555576 557620 559999 562884 566229 569888
58428E69888L805L704L291K700K193J902J773J691J535J227Q09M74L36K56J0m53
$$ 569888 573693 577397 580688 583388 585581 587483 589256 590947 592482 593709 594518 594992 595328 595584 595594 595141
58412E95141j027j617k125k419k456k421k528k741k876k944l136l497l795l805
$$ 595141 594114 592497 590372 587953 585497 583076 580548 577807 574931 571987 568851 565354 561559 557754
58398E57754l560l273l131l203l404l565l536l297k912k497k264k414k824l007
$$ 557754 554194 550921 547790 544587 541183 537618 534082 530785 527873 525376 523112 520698 517874 514867
58384E14867k616j892j339j054o90q7M61P06Q73J372K192K871L022K757K575K812
$$ 514867 512251 510359 509020 507966 507276 507189 507650 508356 509229 510601 512793 515664 518686 521443 524018 526830
58368E26830L275L500L346L230L586M284M789M829M602M407M312M250M132L873
$$ 526830 530105 533605 536951 540181 543767 548051 552840 557669 562271 566678 570990 575240 579372 583245
58354E83245L464L091K969L024L001K862K796K825K776K650K678K864K918K815
$$ 583245 586709 589800 592769 595793 598794 601656 604452 607277 610053 612703 615381 618245 621163 623978
58340F23978K993L691M464M765M652M530M421M088L678L639L983M157L827L324
$$ 623978 626971 630662 635126 639891 644543 649073 653494 657582 661260 664899 668882 673039 676866 680190
58326F80190L094L094K995K695K346K097K026K219K666L175L556L773L865L823
$$ 680190 683284 686378 689373 692068 694414 696511 698537 700756 703422 706597 710153 713926 717791 721614
58312G21614L740L836M165M439M465M500M914N558N917N895O006O625P485Q084
$$ 721614 725354 729190 733355 737794 742259 746759 751673 757231 763148 769043 775049 781674 789159 797243
58298G97243Q295Q259Q040P723P691Q303R380J0369J1021J1561J2187J2788J3270
$$ 797243 805538 813797 821837 829560 837251 845554 854934 865303 876324 887885 900072 912860 926130
58285I26130J3800J4496J5192J5707J6153J6754J7549J8416J9260K0030K0685
$$ 926130 939930 954426 969618 985325 1001478 1018232 1035781 1054197 1073457 1093487 1114172
58274A114172K1230K1700K1971K1833K1402K1158K1423K1955K2332K2496K2659
$$ 1114172 1135402 1157102 1179073 1200906 1222308 1243466 1264889 1286844 1309176 1331672 1354331
58263A354331K2914K3217K3631K4254K4965K5535K5922K6291K6785K7519K8611
$$ 1354331 1377245 1400462 1424093 1448347 1473312 1498847 1524769 1551060 1577845 1605364 1633975
58252A633975L0014L1435L2746L4219L6108L8163M0014M1831M4150M7147N0517
$$ 1633975 1663989 1695424 1728170 1762389 1798497 1836660 1876674 1918505 1962655 2009802 2060319
58241B060319N4093N8004O2254O6597P0983P5657Q0689Q5871R1218R7197J04207
$$ 2060319 2114412 2172416 2234670 2301267 2372250 2447907 2528596 2614467 2705685 2802882 2907089
58230B907089J12127J20625J29672J39647J51101J64427J79656J96630K15652
$$ 2907089 3019216 3139841 3269513 3409160 3560261 3724688 3904344 4100974 4316626
58221D316626K37726K63862K94447L29992L72256M23958M87685N66297O64265
$$ 4316626 4554352 4818214 5112661 5442653 5814909 6238867 6726552 7292849 7957114
58212G957114P86946R37379J114341J314245J534135J771918K023841K282423
$$ 7957114 8744060 9681439 10795780 12110025 13644160 15416078 17439919 19722342
58204A9722342K537234K778497L000775L202663L381928L533055L653651L751823
$$ 19722342 22259576 25038073 28038848 31241511 34623439 38156494 41810145 45561968
58196D5561968L837360L896912L881600L732561L428034L005334K535955K083063
$$ 45561968 49399328 53296240 57177840 60910401 64338435 67343769 69879724 71962787
58188G1962787J683262J356222J111750R37995P90474O08121L51275K7834l18944
$$ 71962787 73646049 75002271 76114021 77052016 77842490 78450611 78801886 78829720 78510776
58179G8510776o52636r78655j338829j768457k255978k745687l181191l544515
$$ 78510776 77858140 76879485 75540656 73772199 71516221 68770534 65589343 62044828
58171F2044828l851592m113324m306814m385275m311861m083792l731718l304584
$$ 62044828 58193236 54079912 49773098 45387823 41075962 36992170 33260452 29955868
58163B9955868k854507k425944k048182j733224j480911j287277j148946j061067
$$ 29955868 27101361 24675417 22627235 20894011 19413100 18125823 16976877 15915810
58155A5915810j013245r89324r72549r52203r26251q97809q68816q36649p96197
$$ 15915810 14902565 13913241 12940692 11988489 11062238 10164429 9295613 8458964 7662767
58146G662767p44303o81925o12952n41984m73109m09482l53024l04343k63216
$$ 7662767 6918464 6236539 5623587 5081603 4608494 4199012 3845988 3541645 3278429
58137C278429k29061k01025j77952j58678j42328j28292j16104j05472r6330q8567
$$ 3278429 3049368 2848343 2670391 2511713 2369385 2241093 2124989 2019517 1923187 1834620
58127A834620q1821p5661o9953o4826o0303n6182n2266m8601m5357m2621m0303
$$ 1834620 1752799 1677138 1607185 1542359 1482056 1425874 1373608 1325007 1279650 1237029 1196726
58116A196726l8221l6203l4216l2380l0792k9346k7807k6162k4698k3648k2854
$$ 1196726 1158505 1122302 1088086 1055706 1024914 995568 967761 941599 916901 893253 870399
58105H70399k1955k0783j9429j8001j6538j5188j4200j3648j3317j2973j2578
$$ 870399 848444 827661 808232 790231 773693 758505 744305 730657 717340 704367 691789
58094F91789j2146j1605j0958j0382j0003r683r272q846q509q079p386o724o600
$$ 691789 679643 668038 657080 646698 636695 627012 617740 608894 600385 592306 584920 578196 571596
58081E71596o993p282p066o673o593o772o754o387o006n948o154o312o247o040
$$ 571596 564603 557321 550255 543582 536989 530217 523463 517076 511070 505122 498968 492656 486409 480369
58067D80369n844n622n205m572l992l696l563l330l025k855k740k360j770j525
$$ 480369 474525 468903 463698 459126 455134 451438 447875 444545 441520 438665 435925 433565 431795 430270
58053D30270j937k579k845k743k720k900k939k584k040j703j742k048k370k517
$$ 430270 428333 425754 422909 420166 417446 414546 411607 409023 406983 405280 403538 401490 399120 396603
58039C96603k503k489k536k511k330k150k143k261k350k374k297j968j390r04
$$ 396603 394100 391611 389075 386564 384234 382084 379941 377680 375330 372956 370659 368691 367301 366397
58025C66397q11r16q03m60k49k86k37J51P01J078J207J243J382J743K286K754
$$ 366397 365586 364670 363867 363407 363158 362872 362635 362786 363487 364565 365772 367015 368397 370140 372426 375180
58009C75180K896K825K918L304L656L644L372L154L067K913K608K354K366K560
$$ 375180 378076 380901 383819 387123 390779 394423 397795 400949 404016 406929 409537 411891 414257 416817
57995D16817K651K510K344K412K606K520J930J108M94J85q1n34j117j643j989
$$ 416817 419468 421978 424322 426734 429340 431860 433790 434898 435392 435577 435496 434962 433845 432202 430213
57980D30213k164k293k535k942l375l661l781l873m066m350m562m449l892l146
$$ 430213 428049 425756 423221 420279 416904 413243 409462 405589 401523 397173 392611 388162 384270 381124
57966C81124k645k480k331k022j832j975k072j596o87j7J29J14K84N16O07P13
$$ 381124 378479 375999 373668 371646 369814 367839 365767 364171 363484 363467 363596 363710 363994 364510 365117 365830
57950C65830J064J532J799J813J841K071K363K458K289K051J959K041K187K338
$$ 365830 366894 368426 370225 372038 373879 375950 378313 380771 383060 385111 387070 389111 391298 393636
57936C93636K424K178J364K65l88k52K02L59K09L3k85j059k036k601k694k887
$$ 393636 396060 398238 399602 399867 399479 399227 399429 399788 399997 400030 399745 398686 396650 394049 391355 388468
57920C88468l450l931l919l690l733m113m612n118n534n607n232m733m508m538
$$ 388468 385018 381087 377168 373478 369745 365632 361020 355902 350368 344761 339529 334796 330288 325750
57906C25750m480m155l676l232k938k811k729k520k172j835j602j436j314j195
$$ 325750 321270 317115 313439 310207 307269 304458 301729 299209 297037 295202 293600 292164 290850 289655
57892B89655q71j55O95J165J148J098J354J700J823J795J795J743J531J370J513
$$ 289655 288784 288629 289324 290489 291637 292735 294089 295789 297612 299407 301202 302945 304476 305846 307359
57877C07359J857K120K214K198K050J829J764J911J948J633J226J074J065R19
$$ 307359 309216 311336 313550 315748 317798 319627 321391 323302 325250 326883 328109 329183 330248 331167
57863C31167P45Q42J104J173J063J043R98N35k01m51J48J007J356J139Q17N96
$$ 331167 331912 332754 333858 335031 336094 337137 338135 338670 338469 338018 338166 339173 340529 341668 342485 343081
57847C43081K90j87o25q28q23p47o62n67m94n31p70j165j512j609j479j333j286
$$ 343081 343371 343184 342559 341731 340908 340161 339499 338932 338438 337907 337137 335972 334460 332851 331372 330039 328753
57830C28753j231j006o15k02J12K82K56Kl92p13p67n40j58K26N03N77M21J94J05
$$ 328753 327522 326516 325901 325699 325811 326093 326349 326351 325959 325246 324479 323939 323781 324007 324510 325087 325508 325702 325807
57811C25807R2k21j016j903k270k031j705j745k069k312k305k148k066k266k745
$$ 325807 325899 325678 324662 322759 320489 318458 316753 315008 312939 310627 308322 306174 304108 301842 299097
57796B99097l189l266l103l170l597l950l865l528l277l068k676k184j809j488
$$ 299097 295908 292642 289539 286369 282772 278822 274957 271429 268152 265084 262408 260224 258415 256927
57782B56927j012n22l68n12n07j38K39K09k04o20p58o11l31p2R6J90J90Rl41o41
$$ 256927 255915 255393 255025 254513 254006 253868 254107 254316 254112 253492 252734 252123 251792 251720 251816 252006 252196 252205 251864 251223
57762B51223o70n15n11q28j290j610j702j667j623j615j663j820k103k335k218
$$ 251223 250553 250038 249527 248699 247409 245799 244097 242430 240807 239192 237529 235709 233606 231271 229053
57747B29053j658r65n25l73k87k29l80o73p17l77o5j81n12n43j66K33L13J11j14
$$ 229053 227395 226430 225905 225532 225245 225016 224636 223963 223246 222869 222804 222623 222111 221568 221402 221635 221948 222059 221945
57728B21945j10J73N07N54K58p3j78j18kK42N81O58K81j73k20Pj0l63o11m40k2
$$ 221945 221835 222008 222515 223069 223327 223254 223076 222958 222956 223198 223779 224437 224718 224545 224325 224332 224322 223959 223348 222908 222886
57707B22886L14L74Q1m19o87l58L47Q53R87J073J294J443J459J708K451L423M249
$$ 222886 223200 223574 223655 223236 222549 222191 222538 223391 224378 225451 226745 228188 229647 231355 233806 237229 241478
57690B41478N014O036P322Q535R485J0299J1212J2355J3804J5580J7482J8988
$$ 241478 246492 252528 259850 268385 277870 288169 299381 311736 325540 341120 358602 377590
57678C77590J9488J8772J7276J5718J4469J3384J2288J1351J0820J0567J0214
$$ 377590 397078 415850 433126 448844 463313 476697 488985 500336 511156 521723 531937
57667E31937R609Q900Q157P188N770L861J591q54l369o095r316j2995j6539j9289
$$ 531937 541546 550446 558603 565791 571561 575422 577013 576159 572790 566695 557379 544384 527845 508556
57653E08556k1113k2308k3067k3346k3170k2618k1580j9844j7508j5037j2805
$$ 508556 487443 465135 442068 418722 395552 372934 351354 331510 314002 298965 286160
57642B86160j0907r289p861o455n044l928l412l308l108k645k158j772j331q60
$$ 286160 275253 265964 258103 251648 246604 242676 239264 235956 232848 230203 228045 226273 224942 224082
57628B24082p13j042j512j719j606j307r00m60j36N4K52M64M66J50k82n70o34
$$ 224082 223369 222327 220815 219096 217490 216183 215283 214823 214687 214741 214993 215457 215923 216073 215791 215221 214587
57611B14587n38m17m56o88p93m92n3k6m66r09j147j427j739j560o71K74N21J54
$$ 214587 214049 213632 213176 212488 211695 211203 211150 211124 210658 209749 208602 207175 205436 203876 203205 203479 204000 204154
57593B04154j98k69k68l17l36l87o83j174j535j540j295j092j132j396j627j563
$$ 204154 203956 203687 203419 203102 202766 202379 201696 200522 198987 197447 196152 195060 193928 192532 190905 189342
57577A89342j217q21m78j05K32K87N6j24q6p2k86n35n90n14l72k5M54O19L48K40
$$ 189342 188125 187304 186826 186721 186953 187240 187296 187172 187086 187014 186728 186193 185603 185089 184717 184692 185146 185765 186113 186353
57557A86353P57J397J393R15Q15J285J613J334Q12N41M88M76O24J001J287J184
$$ 186353 187110 188507 189900 190815 191630 192915 194528 195862 196674 197215 197703 198179 198803 199804 201091 202275
57541B02275Q50O40O16O20O11O53P07P05O86O71O00N02N63Q15R88R08Q18R99J269
$$ 202275 203125 203765 204381 205001 205612 206265 206972 207677 208363 209034 209634 210136 210699 211514 212502 213410 214228 215227 216496
57522B16496J206Q20N52O08P08N74L77M13O32P72P73P72P59O08L97L67N08N27
$$ 216496 217702 218522 219074 219682 220390 220964 221341 221754 222386 223158 223931 224703 225462 226070 226467 226834 227342 227869
57504B27869L33K65N66R57J021Q10O65O03L28j48m20l02j18j34j23K21P13R18
$$ 227869 228202 228467 229033 229990 231011 231821 232486 233089 233417 233269 232849 232547 232429 232295 232172 232393 233106 234024
57486B34024P89O61O97P05N40L85M67P08Q71Q83Q94R99J096J068R94J041J199
$$ 234024 234813 235474 236171 236876 237416 237801 238268 238976 239847 240730 241624 242623 243719 244787 245781 246822 248021
57469B48021J305J346J535J943K256K123J650J272J145J030P72N68O22Q13R43
$$ 248021 249326 250672 252207 254150 256406 258529 260179 261451 262596 263626 264398 264966 265588 266401 267344
57454B67344J080J430J921K189J994J530J259J456J902K086J798J374J283J557
$$ 267344 268424 269854 271775 273964 275958 277488 278747 280203 282105 284191 285989 287363 288646 290203
57440B90203J882K074K169K121J847J597J778K304K542K135J533J351J589J844
$$ 290203 292085 294159 296328 298449 300296 301893 303671 305975 308517 310652 312185 313536 315125 316969
57426C16969J983K194K506K717K775K812K811K594K189J907J968K242K533K847
$$ 316969 318952 321146 323652 326369 329144 331956 334767 337361 339550 341457 343425 345667 348200 351047
57412C51047L209L368L006K215J585J635K272K931L239L257L142K843K352J956
$$ 351047 354256 357624 360630 362845 364430 366065 368337 371268 374507 377764 380906 383749 386101 388057
57398C88057J943K240K552K770K928K956K825K793L099L488L506L228L124L269
$$ 388057 390000 392240 394792 397562 400490 403446 406271 409064 412163 415651 419157 422385 425509 428778
57384D28778L274L073L104L475L652L342L063L374M008M360M409M511M645M483
$$ 428778 432052 435125 438229 441704 445356 448698 451761 455135 459143 463503 467912 472423 477068 481551
57370D81551M071L810L866M014M098M155M145L969L751L704L776L765L753M035
$$ 481551 485622 489432 493298 497312 501410 505565 509710 513679 517430 521134 524910 528675 532428 536463
57356E36463M589N027N085M886M693M671M928N472N991O052N553M863M368M137
$$ 536463 541052 546079 551164 556050 560743 565414 570342 575814 581805 587857 593410 598273 602641 606778
57342F06778M051M105M374M825N252N401N202M859M747N064N657O138O230N955
$$ 606778 610829 614934 619308 624133 629385 634786 639988 644847 649594 654658 660315 666453 672683 678638
57328F78638N605N508N706N904N847N637N511N445N274N168N479O153O677O804
$$ 678638 684243 689751 695457 701361 707208 712845 718356 723801 729075 734243 739722 745875 752552 759356
57314G59356O828O990P092O921O657O511O379O167O091O279O429O266O005N997
$$ 759356 766184 773174 780266 787187 793844 800355 806734 812901 818992 825271 831700 837966 843971 849968
57300H49968O150O175O100O170O414O739P221P886Q435Q669Q953R795J1086J2224
$$ 849968 856118 862293 868393 874563 880977 887716 894937 902823 911258 919927 928880 938675 949761 961985
57286I61985J2919J3377J3787J4070J4112J3934J3599J3247J3114J3234J3268
$$ 961985 974904 988281 1002068 1016138 1030250 1044184 1057783 1071030 1084144 1097378 1110646
57275A110646J2962J2592J2593J2883J3006J2785J2500J2420J2549J2822J3224
$$ 1110646 1123608 1136200 1148793 1161676 1174682 1187467 1199967 1212387 1224936 1237758 1250982
57264A250982J3730J4288J4839J5123J4743J3621J2231J1080J0188R346Q600Q134
$$ 1250982 1264712 1279000 1293839 1308962 1323705 1337326 1349557 1360637 1370825 1380171 1388771 1396905
57252A396905P968Q151Q995J0612J2465J3824J4490J4652J4300J3266J1712R986
$$ 1396905 1404873 1413024 1422019 1432631 1445096 1458920 1473410 1488062 1502362 1515628 1527340 1537326
57240A537326Q139O055L950K255J038j6j082k103l069l945m399m099l229k277
$$ 1537326 1545465 1551520 1555470 1557725 1558763 1558747 1557665 1555562 1552493 1548548 1544149 1540050 1536821 1534544
57226A534544j383k69J168K618L733M445M912N303N647N754N478N067M975N208
$$ 1534544 1533161 1532892 1534060 1536678 1540411 1544856 1549768 1555071 1560718 1566472 1571950 1577017 1581992 1587200
57212A587200N326N258N544O457P532Q389R366J0797J2225J3066J3551J4264J5173
$$ 1587200 1592526 1597784 1603328 1609785 1617317 1625706 1635072 1645869 1658094 1671160 1684711 1698975 1714148
57199A714148J5783J5941J5773J5181J4065J2698J1292R583P435N391L958K848
$$ 1714148 1729931 1745872 1761645 1776826 1790891 1803589 1814881 1824464 1831899 1837290 1841248 1844096
57187A844096J600M32l14q94j547j788j259o68p80j143q88k65j03k86j20K44Q2
$$ 1844096 1845696 1846128 1845814 1844920 1843373 1841585 1840326 1839658 1838878 1837735 1836847 1836582 1836479 1836193 1836073 1836317 1836399
57170A836399m94q33j195k498m797p371j0166j3764j8069k2423k6967l2507l9165
$$ 1836399 1835905 1835072 1833877 1831379 1826582 1819211 1809045 1795281 1777212 1754789 1727822 1695315 1656150
57157A656150m6494n4805o4894p6532q8676j01141j14627j29180j44128j59416
$$ 1656150 1609656 1554851 1489957 1413425 1324749 1223608 1108981 979801 835673 676257
57147F76257j75385j91303A03851a14477k29904k40369k48832k55304k60663k64931
$$ 676257 500872 309569 103851 -114477 -344381 -584750 -833582 -1088886 -1349549 -1614480
57137a614480k67482k69000k71272k74993k79822k86661k97626l13526l33532
$$ -1614480 -1881962 -2150962 -2422234 -2697227 -2977049 -3263710 -3561336 -3874862 -4208394
57128d208394l57646l87266m23099m64850n13275n70163o36051p10476p94716
$$ -4208394 -4566040 -4953306 -5376405 -5841255 -6354530 -6924693 -7560744 -8271220 -9065936
57119i065936q91701j003273j130760j278685j455051j668346j928825k253775
$$ -9065936 -9957637 -10960910 -12091670 -13370355 -14825406 -16493752 -18422577 -20676352
57111b0676352k668160l200418l881686m745534n814910p081014q500785j0022354
$$ -20676352 -23344512 -26544930 -30426616 -35172150 -40987060 -48068074 -56568859 -66591213
57103f6591213j1609456j3235649j4859287j6408951j7784166j8858202j9489043
$$ -66591213 -78200669 -91436318 -106295605 -122704556 -140488722 -159346924 -178835967
57096a78835967j9557311j9018731j7927360j6410131j4625377j2744433j0949531
$$ -178835967 -198393278 -217412009 -235339369 -251749500 -266374877 -279119310 -290068841
57089b90068841r412320q246368p470674p017794o775916o629103o481593o278573
$$ -290068841 -299481161 -307727529 -315198203 -322215997 -328991913 -335621016 -342102609 -348381182
57081c48381182o021016n744507n455295n078334m477587l528227k161467l58109
$$ -348381182 -354402198 -360146705 -365602000 -370680334 -375157921 -378686148 -380847615 -381205724
57073c81205724J846954M316070O792253Q996690J0783804J2205902J3434666
$$ -381205724 -379358770 -375042700 -368250447 -359253757 -348469953 -336264051 -322829385
57066c22829385J4638015J5917416J7298066J8716380K0011418K0966350K1392317
$$ -322829385 -308191370 -292273954 -274975888 -256259508 -236248090 -215281740 -193889423
57059a93889423K1192820K0375039J9029735J7305221J5374997J3399915J1502777
$$ -193889423 -172696603 -152321564 -133291829 -115986608 -100611611 -87211696 -75708919
57052g5708919R764629Q230621O914526N806243M884574M126165L506085K998044
$$ -75708919 -65944290 -57713669 -50799143 -44992900 -40108326 -35982161 -32476076 -29478032
57044b9478032K579282K233473J947572J708999J507602J337217J193009J069448
$$ -29478032 -26898750 -24665277 -22717705 -21008706 -19501104 -18163887 -16970878 -15901430
57036a5901430R62175Q69335P89273P18982O56099O00355N51606N08254M68853
$$ -15901430 -14939255 -14069920 -13280647 -12561665 -11905566 -11305211 -10753605 -10245351 -9776498
57027i776498M33441M02085L73760L47792L24800L05067K87496K71112K56151
$$ -9776498 -9343057 -8940972 -8567212 -8219420 -7894620 -7589553 -7302057 -7030945 -6774794
57018f774794K42705K29842K17026K05095J94771J85463J76486J68243J61212
$$ -6774794 -6532089 -6302247 -6085221 -5880126 -5685355 -5499892 -5323406 -5155163 -4993951
57009d993951J54867J48456J42021J35901J30131J24828J20228J15865J10799
$$ -4993951 -4839084 -4690628 -4548607 -4412706 -4282575 -4157747 -4037519 -3921654 -3810855
57000c810855J05154J00248R6676R3412Q9476Q5275Q1631P8501P5460P2509O9716
$$ -3810855 -3705701 -3605453 -3508777 -3415365 -3325889 -3240614 -3158983 -3080482 -3005022 -2932513 -2862797
56989b862797O6807O3733O0864N8198N5271N2203M9853M8443M7072M5104M3022
$$ -2862797 -2795990 -2732257 -2671393 -2613195 -2557924 -2505721 -2455868 -2407425 -2360353 -2315249 -2272227
56978b272227M1356L9799L8059L6548L5546L4523L3030L1461L0250K9191K8148
$$ -2272227 -2230871 -2191072 -2153013 -2116465 -2080919 -2046396 -2013366 -1981905 -1951655 -1922464 -1894316
56967a894316K7603K7737K7824K7257K6483K6136K5963K5424K4710K4340K4307
$$ -1894316 -1866713 -1838976 -1811152 -1783895 -1757412 -1731276 -1705313 -1679889 -1655179 -1630839 -1606532
56956a606532K4271K4181K4048K3588K2752K2051K1806K1579K0941K0218J9871
$$ -1606532 -1582261 -1558080 -1534032 -1510444 -1487692 -1465641 -1443835 -1422256 -1401315 -1381097 -1361226
56945a361226J9641J9034J8198J7599J7230J6780J6288J5991J5789J5449J5035
$$ -1361226 -1341585 -1322551 -1304353 -1286754 -1269524 -1252744 -1236456 -1220465 -1204676 -1189227 -1174192
56934a174192J4754J4562J4358J4196J4043J3663J3032J2490J2165J1738J1103
$$ -1174192 -1159438 -1144876 -1130518 -1116322 -1102279 -1088616 -1075584 -1063094 -1050929 -1039191 -1028088
56923a028088J0638J0451J0037R121Q243P894P669P001O174N883O168O510O692
$$ -1028088 -1017450 -1006999 -996962 -987841 -979598 -971704 -964035 -957034 -950860 -944977 -938809 -932299 -925607
56910i25607O856O975O963P091P702Q607R362R961J0786J1943J3109J3928J4214
$$ -925607 -918751 -911776 -904813 -897722 -890020 -881413 -872051 -862090 -851304 -839361 -826252 -812324 -798110
56897g98110J3963J3444J3079J2865J2292J1148J0014R515R434R172Q707Q504
$$ -798110 -784147 -770703 -757624 -744759 -732467 -721319 -711305 -701790 -692356 -683184 -674477 -665973
56885f65973Q676Q888R020R284R682R915R857R739R755R835R836R683R349Q868
$$ -665973 -657297 -648409 -639389 -630105 -620423 -610508 -600651 -590912 -581157 -571322 -561486 -551803 -542454 -533586
56871e33586Q429Q171Q017P806P521P251P019O832O672O456O170O065O378O820
$$ -533586 -525157 -516986 -508969 -501163 -493642 -486391 -479372 -472540 -465868 -459412 -453242 -447177 -440799 -433979
56857d33979O826O364O038O116O114N626N038M912N195N480N636N677N442M985
$$ -433979 -427153 -420789 -414751 -408635 -402521 -396895 -391857 -386945 -381750 -376270 -370634 -364957 -359515 -354530
56843c54530M831N268N739N560M936M595M739M999N232N559N798N603N125M883
$$ -354530 -349699 -344431 -338692 -333132 -328196 -323601 -318862 -313863 -308631 -303072 -297274 -291671 -286546 -281663
56829b81663M873M530L650K732K252K132K084K003J828J430Q55L55O2j59m16o19
$$ -281663 -276790 -272260 -268610 -265878 -263626 -261494 -259410 -257407 -255579 -254149 -253294 -252939 -252877 -253036 -253452 -254071
56813b54071o49m68m5N81J151J421J538J889K557L184L377L035K288J435Q71P64
$$ -254071 -254720 -255188 -255233 -254652 -253501 -252080 -250542 -248653 -246096 -242912 -239535 -236500 -234212 -232777 -231906 -231142
56797b31142P66L97k82p29o75m92o88j285j876k084j852j375r10n39j72K47O02
$$ -231142 -230376 -229979 -230261 -230990 -231665 -232157 -232845 -234130 -236006 -238090 -239942 -241317 -242227 -242766 -242938 -242691 -242089
56780b42089P92Q62Q57O75L06J1M7K73L11J8m28q49j196j485j744k005k131j873
$$ -242089 -241297 -240435 -239578 -238903 -238597 -238586 -238539 -238266 -237955 -237937 -238365 -239214 -240410 -241895 -243639 -245644 -247775 -249648
56762b49648j244o72n20o38o68n34l32L5O33J124J121Q12P50J006J097P65L36
$$ -249648 -250892 -251564 -252084 -252722 -253390 -253924 -254256 -254221 -253588 -252464 -251343 -250531 -249781 -248775 -247678 -246913 -246577
56745b46577J91L20N65Q58J070R92P43Q29J526K398K737K319J613J233J401J827
$$ -246577 -246386 -246066 -245501 -244643 -243573 -242581 -241838 -241009 -239483 -237085 -234348 -232029 -230416 -229183 -227782 -225955
56729b25955K063J940J685J555J529J454J349J313J262J031P58P73J138J544J756
$$ -225955 -223892 -221952 -220267 -218712 -217183 -215729 -214380 -213067 -211805 -210774 -210016 -209243 -208105 -206561 -204805
56714b04805J863J993K048J867J491J141J060J351J833K059J700R58L72K26L37
$$ -204805 -202942 -200949 -198901 -197034 -195543 -194402 -193342 -191991 -190158 -188099 -186399 -185441 -185069 -184843 -184506
56699a84506M45N31P15J015J333J545J524J290J045R37P99L74k34o02n07j19L23
$$ -184506 -184061 -183530 -182815 -181800 -180467 -178922 -177398 -176108 -175063 -174126 -173327 -172953 -173187 -173789 -174296 -174415 -174092
56682a74092P54J085J118Q25N15M50N38N52N14O34R61J308J506J562J586J630
$$ -174092 -173338 -172253 -171135 -170310 -169795 -169345 -168807 -168255 -167741 -167107 -166146 -164838 -163332 -161770 -160184 -158554
56666a58554J632J494J203Q98P47P99R48J095J222J320J336J215R92Q05P91R49
$$ -158554 -156922 -155428 -154225 -153327 -152580 -151781 -150833 -149738 -148516 -147196 -145860 -144645 -143653 -142848 -142057 -141108
56650a41108J096J095J039J117J243J115O57K22J30K66L15K39K15K60K50J91K25
$$ -141108 -140012 -138917 -137878 -136761 -135518 -134403 -133746 -133524 -133394 -133128 -132813 -132574 -132359 -132099 -131849 -131658 -131433
56633a31433L61M60M85N42P02R58J258J473J412J102Q67R29J059R89R31J285J924
$$ -131433 -131072 -130612 -130127 -129585 -128883 -127925 -126667 -125194 -123782 -122680 -121813 -120884 -119825 -118836 -117905 -116620 -114696
56616a14696K246J950J380J005R15R59J054J170J255J271J205J019P48N75N95
$$ -114696 -112450 -110500 -109120 -108115 -107200 -106241 -105187 -104017 -102762 -101491 -100286 -99267 -98519 -97944 -97349
56601i7349O26N36N80J024J578J689J396J284J529J597J103M01K5pK5O8J84K39
$$ -97349 -96723 -96187 -95607 -94583 -93005 -91316 -89920 -88636 -87107 -85510 -84407 -84006 -83981 -83988 -83963 -83895 -83711 -83472
56583h3472J32P6L03O88R56J119J341J544J525J346J285J412J578J735K005K408
$$ -83472 -83340 -83264 -82961 -82273 -81317 -80198 -78857 -77313 -75788 -74442 -73157 -71745 -70167 -68432 -66427 -64019
56567f4019K710K686K343J941J792K021K447K753K828K802K747K543K168J847
$$ -64019 -61309 -58623 -56280 -54339 -52547 -50526 -48079 -45326 -42498 -39696 -36949 -34406 -32238 -30391
56553c0391J759J752J610J424J444J682J908J966J871J665J387J164J086R90N82
$$ -30391 -28632 -26880 -25270 -23846 -22402 -20720 -18812 -16846 -14975 -13310 -11923 -10759 -9673 -8683 -8101
56538h101j65q96j248j211j145j396j968k523k735k612k400k234k065j891j835
$$ -8101 -8266 -9162 -10410 -11621 -12766 -14162 -16130 -18653 -21388 -24000 -26400 -28634 -30699 -32590 -34425
56523c4425j938k080k200k346k427k208j724j394j497j737j690j401j215j172
$$ -34425 -36363 -38443 -40643 -42989 -45416 -47624 -49348 -50742 -52239 -53976 -55666 -57067 -58282 -59454
56509e9454j011o92m38k86k1L20L58n2n20o31m66l02j27K07N34N41K82J22J43
$$ -59454 -60465 -61157 -61595 -61881 -61902 -61582 -61224 -61276 -61796 -62427 -62893 -63195 -63322 -63115 -62581 -62040 -61758 -61636 -61493
56490f1493O3j83j92K57P39P18L46K57O38R79Q17L32kj3J00J12p2l55m02J21J042
$$ -61493 -61430 -61613 -61805 -61548 -60809 -60091 -59745 -59488 -58850 -57871 -57054 -56722 -56724 -56737 -56637 -56525 -56597 -56952 -57354 -57233 -56191
56469e6191J645J442P42J90k3r6qM38J067J350J145Q69P86O35J98j83n5M85R19
$$ -56191 -54546 -53104 -52362 -52172 -52195 -52291 -52299 -51861 -50794 -49444 -48299 -47430 -46644 -46009 -45811 -45994 -46049 -45564 -44645
56450d4645R32O08J59j94k23J12M96N79L78J95K18L68N29O65P49P28N95L90J51
$$ -44645 -43713 -43105 -42946 -43140 -43363 -43251 -42755 -42176 -41798 -41603 -41385 -41017 -40488 -39823 -39074 -38346 -37751 -37361 -37210
56431c7210l6m1J47L49L83K89K26K43K99L89N02N10L40J76L07O99R89R04N95L82
$$ -37210 -37246 -37287 -37140 -36791 -36408 -36119 -35893 -35650 -35351 -34962 -34460 -33950 -33610 -33434 -33127 -32428 -31439 -30535 -29940 -29558
56411b9558L54L31K04J01J93M26O20O92P24P14N20J31k00k07P2M30P68J037J032
$$ -29558 -29204 -28873 -28669 -28568 -28375 -27949 -27329 -26637 -25913 -25199 -24679 -24548 -24748 -24955 -24883 -24453 -23685 -22648 -21616
56392b1616N87l8l27j08L16O42Q92J124J237J188J119J047P87L60J97N88J189
$$ -21616 -21029 -21067 -21394 -21502 -21186 -20544 -19652 -18528 -17291 -16103 -14984 -13937 -13150 -12790 -12593 -12005 -10816
56375a0816J412J148Q00O58O46O19N70N13L77J73M5J18L72O88R15h48b20h6l92
$$ -10816 -9404 -8256 -7456 -6798 -6152 -5533 -4963 -4450 -4073 -3900 -3855 -3737 -3365 -2677 -1762 -848 -220 -86 -478
56356d78p15o20j72J99R3k92k87L82f81H49J318R36N61J10l18m16j25K90N93P64
$$ -478 -1193 -1813 -1985 -1786 -1693 -1985 -2272 -1890 -681 849 2167 3103 3664 3774 3456 3040 2915 3205 3798 4562
56336D562P96O51M76N45Q49J005P42K94J47M99J066J414J344J029P80P10O49M23
$$ 4562 5358 6009 6485 7030 7879 8884 9626 9920 10067 10566 11632 13046 14390 15419 16199 16909 17558 17981
56318A7981J33K1J48L25L45K59K90N62R06J012P82M86M31N82O67O05N39N08M15
$$ 17981 18114 18135 18283 18608 18953 19212 19502 20064 20970 21982 22764 23250 23681 24263 24930 25535 26074 26582 26997
56299B6997L87P38J382J720J437J028J112J539J666J312R44R69J307J677J907
$$ 26997 27384 28122 29504 31224 32661 33689 34801 36340 38006 39318 40262 41231 42538 44215 46122
56284D6122J868J559J285J450K043K570K624K310J992J899K026K276K558K870
$$ 46122 47990 49549 50834 52284 54327 56897 59521 61831 63823 65722 67748 70024 72582 75452
56270G5452L293L821M257M447M493M565M677M803N128N806O618P206P535P814
$$ 75452 78745 82566 86823 91270 95763 100328 105005 109808 114936 120742 127360 134566 142101 149915
56256A49915Q044Q097Q159Q602R351R898J0014R984J0020R969R768R702R861R845
$$ 149915 157959 166056 174215 182817 192168 202066 212080 222064 232084 242053 251821 261523 271384 281229
56242B81229R299Q491P915P667P495P231O759N839M382K792J595P92l3j078k161
$$ 281229 290528 299019 306934 314601 322096 329327 336086 341925 346307 349099 350694 351486 351453 350375 348214
56227C48214l150m181n302o333p146p855q580r203r561r700r788r863r837r659
$$ 348214 345064 340883 335581 329248 322102 314247 305667 296464 286903 277203 267415 257552 247715 238056
56213B38056r347q905q338p777p408p223o988o527n974n526n134m607m015l642
$$ 238056 228709 219804 211466 203689 196281 189058 182070 175543 169569 164043 158909 154302 150287 146645
56199A46645l515l293k798k342k225k221j931j404j028r06p74n15k88j58k8L4
$$ 146645 143130 139837 137039 134697 132472 130251 128320 126916 125888 124982 124208 123693 123405 123247 123219 123253
56183A23253j18k47J33R58J494J299Q66Q78J282J549J562J674J986K170K067J999
$$ 123253 123135 122888 123021 123979 125473 126772 127638 128516 129798 131347 132909 134583 136569 138739 140806 142805
56167A42805K274K717K937K849K719K792L032L270L496L890M553N295N826O136
$$ 142805 145079 147796 150733 153582 156301 159093 162125 165395 168891 172781 177334 182629 188455 194591
56153A94591O533P249Q164Q988R602J0121J0755J1671J2959J4575J6367J8197
$$ 194591 201124 208373 216537 225525 235127 245248 256003 267674 280633 295208 311575 329772
56141C29772K0008K1767K3405K4837K6024K7022K8003K9166L0532L1937L3279
$$ 329772 349780 371547 394952 419789 445813 472835 500838 530004 560536 592473 625752
56130F25752L4615L5866L6653L6723L6329L5871L5303L4277L2711L0738K8187
$$ 625752 660367 696233 732886 769609 805938 841809 877112 911389 944100 974838 1003025
56119A003025K4742K0634J6592J2938R309N451J702j635m840q301j1920j5377
$$ 1003025 1027767 1048401 1064993 1077931 1087240 1092691 1094393 1092758 1087918 1079617 1067697 1052320
56107A052320j8562k1381k3539k5029k6430k8213l0067l1379l2082l2501l2668
$$ 1052320 1033758 1012377 988838 963809 937379 909166 879099 847720 815638 783137 750469
56096G50469l2361l1661l0844k9874k8508k6814k5085k3313k1238j8858j6413
$$ 750469 718108 686447 655603 625729 597221 570407 545322 522009 500771 481913 465500
56085D65500j3953j1363q808o637m922l521k493j945j544p66L57J243J577J627
$$ 465500 451547 440184 431376 424739 419817 416296 413803 411858 410314 409548 409905 411148 412725 414352
56071D14352J686J737J749J855K076K239K331K521K802K986L082L274L508L559
$$ 414352 416038 417775 419524 421379 423455 425694 428025 430546 433348 436334 439416 442690 446198 449757
56057D49757L530L821M490N176N681O154O648P027P427Q164R055R474R334R360
$$ 449757 453287 457108 461598 466774 472455 478609 485257 492284 499711 507875 516930 526404 535738 545098
56043E45098J0030J0904J1375J1567J1936J2512J3040J3493J3954J4294J4485
$$ 545098 555128 566032 577407 588974 600910 613422 626462 639955 653909 668203 682688
56032F82688J4870J5660J6432J6666J6546J6686J7254J7881J8381J9006J9984
$$ 682688 697558 713218 729650 746316 762862 779548 796802 814683 833064 852070 872054
56021H72054K1133K2115K2853K3600K4654K5950K7025K7610K8185K9499L1539
$$ 872054 893187 915302 938155 961755 986409 1012359 1039384 1066994 1095179 1124678 1156217
56010A156217L3475L4831L6070L7737L9690M1624M3729M6239M8783N0923N2982
$$ 1156217 1189692 1224523 1260593 1298330 1338020 1379644 1423373 1469612 1518395 1569318 1622300
55999A622300N5631N8944O2481O6136P0135P4416P8696Q3131Q8287R4419J01310
$$ 1622300 1677931 1736875 1799356 1865492 1935627 2010043 2088739 2171870 2260157 2354576 2455886
55988B455886J08825J17149J26505J37048J49047J62824J78621J96804K17997
$$ 2455886 2564711 2681860 2808365 2945413 3094460 3257284 3435905 3632709 3850706
55979C850706K42746K71555L05698L47608M00067M65627N47447O49393P73013
$$ 3850706 4093452 4365007 4670705 5018313 5418380 5884007 6431454 7080847 7853860
55970G853860R13565J060312J202346J335737J466588J608268J775574J980545
$$ 7853860 8767425 9827737 11030083 12365820 13832408 15440676 17216250 19196795
55962A9196795K231761K532273K870734L212215L504904L705706L801601L802505
$$ 19196795 21428556 23960829 26831563 30043778 33548682 37254388 41055989 44858494
55954D4858494L715141L533171L257647K919856K574224K267160K015133J808186
$$ 44858494 48573635 52106806 55364453 58284309 60858533 63125693 65140826 66949012
55946F6949012J623567J430937J191955Q69600M51751k6751m89228q62069j135634
$$ 66949012 68572579 70003516 71195471 72065071 72516822 72490071 72000843 71138774 70003140
55937G0003140j387162j730092k221572k810020l372960l808240m093166m266696
$$ 70003140 68615978 66885886 64664314 61854294 58481334 54673094 50579928 46313232
55929D6313232m367990m396198m320545m117810l797682l399071k969252k546636
$$ 46313232 41945242 37549044 33228499 29110689 25313007 21913936 18944684 16398048
55921A6398048k156091j811608j518650j275356j075382r11792p78796o70922
$$ 16398048 14241957 12430349 10911699 9636343 8560961 7649169 6870373 6199451
55913F199451n82490n08662m46254l93148l47630l08471k74869k45828k20104
$$ 6199451 5616961 5108299 4662045 4268897 3921267 3612796 3337927 3092099 2871995
55904B871995j97023j76781j59526j44625j31273j19263j08714r9413r0905q3013
$$ 2871995 2674972 2498191 2338665 2194040 2062767 1943504 1834790 1735377 1644472 1561459
55894A561459p5788o9141o2935n7330n2621m8764m5329m1943l8578l5465l2812
$$ 1561459 1485671 1416530 1353595 1296265 1243644 1194880 1149551 1107608 1069030 1033565 1000753
55883A000753l0569k8372k5892k3332k1330k0216j9563j8757j7757j6978j6549
$$ 1000753 970184 941812 915920 892588 871258 851042 831479 812722 794965 777987 761438
55872G61438j6117j5404j4576j3960j3630j3415j3169j2887j2690j2729j3062
$$ 761438 745321 729917 715341 701381 687751 674336 661167 648280 635590 622861 609799
55861F09799j3526j3882j4122j4468j5014j5502j5609j5365j5114j5032j4899
$$ 609799 596273 582391 568269 553801 538787 523285 507676 492311 477197 462165 447266
55850D47266j4387j3516j2639j2000j1425j0564r347q103p186o626o219n826n463
$$ 447266 432879 419363 406724 394724 383299 372735 363388 355285 348099 341473 335254 329428 323965
55837C23965n099m601l925l291k958k923k946k824k550k161j679j201r16q37p03
$$ 323965 318866 314265 310340 307049 304091 301168 298222 295398 292848 290687 289008 287807 286891 286054 285351
55822B85351l17J22K90J81Q7R6Nk37l46j65Kj90n94p94p22p09r83j444j949k464
$$ 285351 285034 285156 285446 285627 285714 285810 285815 285578 285232 285067 285069 284879 284285 283491 282769 282060 281077 279633 277684 275220
55802B75220k877l025k995l162l644m020l823l142k556k454k720k995l076k965
$$ 275220 272343 269318 266323 263161 259517 255497 251674 248532 245976 243522 240802 237807 234731 231766
55788B31766k712k288j674j007o06o53r21r48n98k55k98o28q93j072j463k123
$$ 231766 229054 226766 225092 224085 223479 222826 221905 220957 220359 220104 219806 219178 218285 217213 215750 213627
55772B13627k649k696k437k312k499k831l134l418l727l994m109m055l887l707
$$ 213627 210978 208282 205845 203533 201034 198203 195069 191651 187924 183930 179821 175766 171879 168172
55758A68172l628l668l690l525l202k972k965k999k813k423k132k121k272k337
$$ 168172 164544 160876 157186 153661 150459 147487 144522 141523 138710 136287 134155 132034 129762 127425
55744A27425k221j999j797j707j709j655j420j143j094j261j261q30k34O5K4l9
$$ 127425 125204 123205 121408 119701 117992 116337 114917 113774 112680 111419 110158 109328 109094 109159 109183 109144
55728A09144mr7m09o69o33m36l07k72l01n04q58r95o46j40k6l03m60k62jJ19L08
$$ 109144 109140 109043 108634 107965 107332 106896 106589 106317 106016 105512 104654 103659 103013 102873 102847 102544 102084 101822 101821 101940 102248
55707A02248O75Q64O02K30K25M39L43r7l48j13K83M72M95N39N55M84M79O89R75
$$ 102248 102923 103787 104389 104619 104844 105283 105626 105529 105181 105068 105351 105823 106318 106857 107412 107896 108375 109064 110039
55688A10039J119J150J169J066P09K98K06N22J023J524J945K097J793J194P39
$$ 110039 111158 112308 113477 114543 115252 115550 115756 116278 117301 118825 120770 122867 124660 125854 126593
55673A26593O04N01J50l09n49m70k15M4J89J25j56n42r30j288j531j528j315j169
$$ 126593 127197 127698 127848 127539 126990 126520 126305 126349 126538 126663 126507 125965 125035 123747 122216 120688 119373 118204
55655A18204j266j453j503j492j693k139k567k733k655k487k274j935j473j102
$$ 118204 116938 115485 113982 112490 110797 108658 106091 103358 100703 98216 95942 94007 92534 91432
55641I1432j096j454j829j907j762j672j662j504j174r62j050j248j314j224j001
$$ 91432 90336 88882 87053 85146 83384 81712 80050 78546 77372 76410 75360 74112 72798 71574 70573
55626G0573o02k09k38p61j196j010m40j50k89m38l28j15O6K89M83L66j07n50o45
$$ 70573 69971 69762 69524 68763 67567 66557 66117 65967 65678 65240 64912 64797 64863 65152 65635 66001 65894 65344 64699
55607F4699n40n74q23j112j246j125p38k17K37M98N56M00R4j37j12J5Ml8J73N38
$$ 64699 64159 63585 62762 61650 60404 59279 58541 58324 58561 59059 59615 60015 60109 59972 59860 59875 59879 59841 60014 60552
55587F0552N82J66k57k70OK62M80P34Q48O29K46N8J38K86L74M35M94N36N94O61
$$ 60552 61134 61300 61043 60773 60779 61041 61521 62255 63103 63732 63978 64036 64174 64460 64834 65269 65763 66299 66893 67554
55567F7554O19L99J83K26N45Q79R77Q13O02O21Q95J056P29L6m74m77j93L8J49
$$ 67554 68173 68572 68755 68981 69526 70405 71382 72195 72797 73418 74313 75369 76098 76134 75660 75183 74990 75028 75177
55548G5177J69L5k17l21j82r8l23o31o81n30m74n54n90n76o12n89l75j74l15o92
$$ 75177 75346 75381 75164 74843 74661 74563 74240 73609 72928 72398 71924 71370 70780 70204 69592 69003 68628 68454 68139 67447
55528F7447r13r31j086j435j585j309r17p59p14m85j56m7k32m59n45n68o24o25
$$ 67447 66534 65603 64517 63082 61497 60188 59271 58512 57798 57313 57157 57110 56878 56419 55874 55306 54682 54057
55510E4057m61k55k34l84l96j07J79N8l74o08m36k24l06n06m89k82j09M8L14N21
$$ 54057 53596 53341 53107 52723 52327 52220 52399 52457 52083 51475 51039 50815 50509 50003 49514 49232 49123 49171 49485 50006
55490E0006M05J00JJ84L17J86k8j18j12j12j15j13j16r9m2n6k27l91k75J01M47
$$ 50006 50411 50511 50512 50696 51013 51199 51171 51053 50941 50829 50714 50601 50485 50386 50344 50288 50061 49670 49395 49496 49943
55469D9943N84N60M01P2k86m07k34MR4j2k84o03p01m04P7L85M99O49Q44Q86P80
$$ 49943 50527 51087 51488 51560 51274 50867 50633 50637 50731 50719 50435 49832 49131 48727 48804 49189 49688 50337 51181 52067 52847
55448E2847O62M15j51p32p65l00k1j82k26K02N80L33k02l03P2L65L39K66L27L84
$$ 52847 53509 53924 53773 53041 52276 51976 51955 51773 51547 51749 52329 52662 52460 52157 52229 52594 52933 53199 53526 53910
55428E3910L48L23L49L67M23N71O71N65L57K47J70n8k90j75K88O55N53O4m22n42
$$ 53910 54258 54581 54930 55297 55720 56291 56962 57527 57884 58131 58301 58243 57953 57778 58066 58721 59274 59338 58916 58374
55408E8374j95L36N80L75L0j60l61p46r43m80L44O66K22l04k94nm0m61q31q65
$$ 58374 58179 58515 59095 59470 59500 59340 58979 58233 57290 56810 57154 57820 58042 57738 57444 57439 57399 56938 56107 55242
55388E5242o62m22l01m03o18o26k63J45J55j95m40l28m0J95M18O76P68N24J38
$$ 55242 54580 54158 53857 53454 52836 52210 51947 52092 52247 52052 51612 51284 51244 51439 51857 52533 53301 53825 53963
55369E3963l3Nr7m89q65q74n94l42k09j5K96N07M17J17j67l13l10j80K4K00K63
$$ 53963 53930 53935 53838 53349 52484 51610 51016 50674 50465 50450 50746 51253 51670 51787 51620 51307 50997 50817 50841 51041 51304
55348E1304K05M2j97m15m85m04l14k66j39J50M85O37N06J75j48k43o0K02L11L24
$$ 51304 51509 51551 51354 50939 50454 50050 49736 49470 49331 49481 49966 50603 51109 51284 51136 50893 50833 51035 51346 51670
55328E1670M61P04P29L80q6l60m38m48l63j45N0Q4P0J51K07Q3o5K7K84L75J95
$$ 51670 52131 52835 53564 53944 53858 53498 53060 52612 52249 52104 52154 52238 52308 52459 52666 52749 52684 52711 52995 53370 53565
55307E3565m2j52j55p9M4L2k85p19q30m64K3K21J20J8J21L85N93N67L32J11N5
$$ 53565 53523 53371 53216 53137 53181 53213 52928 52209 51379 50915 50938 51159 51279 51297 51418 51803 52396 52963 53295 53406 53461
55286E3461K7j84m90n36j53M19P65O34R0n42q53o65k13J06J57J07J24K32M23O69
$$ 53461 53488 53304 52814 52278 52125 52544 53309 53943 54033 53491 52638 51973 51760 51866 52023 52130 52254 52486 52909 53578
55266E3578Q83R44Q48O33K87j29l45j33L12N71M90K63J3l29p16q96p40l89k2L16
$$ 53578 54461 55405 56253 56886 57173 57044 56699 56566 56878 57449 57939 58202 58215 57886 57170 56274 55534 55145 55123 55439
55246E5439N07L71J9j22J72O05P59O20M17K05j56o17q54o11qN18O18L38N5M6J80
$$ 55439 55946 56317 56336 56214 56386 56991 57750 58370 58787 58992 58836 58219 57365 56754 56746 57264 57882 58220 58275 58321 58501
55225E8501J86O3M6J57J67j2j84j86j02k9P7K05K12N3j12k35m48p08o48j06M88
$$ 58501 58687 58750 58796 58953 59120 59108 58924 58738 58636 58607 58684 58889 59101 59154 59042 58807 58359 57651 57003 56897 57385
55204E7385O28L63J29R7M7j65l72m04k65n3J53K60K21J18N5k1j91l45k89q8j4
$$ 57385 58013 58376 58505 58602 58649 58484 58112 57708 57443 57390 57543 57803 58024 58142 58197 58176 57985 57640 57351 57263 57249
55183E7249j31j69J14N65P98O19K09p3k7K90O87J010J168J073P12K62k0m2O4J70
$$ 57249 57118 56949 57063 57628 58426 59045 59254 59181 59154 59444 60131 61141 62309 63382 64094 64356 64336 64294 64358 64528
55163F4528K44K59J62L8P1K35K45l5l81n52n94o29n69k98N1K89M61O52O64K43
$$ 64528 64772 65031 65193 65231 65302 65537 65782 65747 65366 64814 64220 63591 63022 62724 62775 63064 63525 64177 64841 65084
55143F5084m23p95o17j68J70L04L28K74R0k32n62o72m26l5P7j76l56j10K49J91
$$ 65084 64661 63866 63249 63081 63251 63555 63883 64157 64247 64015 63453 62781 62355 62320 62397 62221 61865 61755 62004 62195
55123F2195j75k05K95P68P40M59M12O01O72M71J35k17n17o36m79j71Q1K32L47
$$ 62195 62020 61815 62110 62878 63618 64077 64489 65090 65762 66233 66368 66151 65634 64998 64519 64348 64429 64661 65008
55104F5008L99L70L78M93N17K21k40m39k28Q8J77P9M3J47K50K00pk95n73p40o88
$$ 65008 65407 65777 66155 66648 67165 67386 67146 66707 66479 66567 66744 66823 66866 67013 67263 67463 67456 67161 66588 65848 65160
55083F5160l67J24M96M89J71m5J61N92O99K31m49p56n35j47j4j34j79J5K15Q4
$$ 65160 64793 64917 65413 65902 66073 66028 66189 66781 67480 67711 67262 66506 65971 65824 65810 65676 65497 65512 65727 65811
55063F5811l33n92l74R7L23J48o4N7M05N83M27J56K8P3J97L31M07K96k4l39m04
$$ 65811 65478 64886 64512 64609 64932 65080 65016 65073 65478 66061 66488 66644 66672 66745 66942 67273 67680 67976 67952 67613 67209
55042F7209k35m8K1Nn4j47j75k8J82J42k09m98l52J26N30O93P46P34M90J4k97
$$ 67209 66974 66926 66947 66952 66898 66751 66576 66548 66730 66872 66663 66165 65813 65939 66469 67162 67908 68642 69132 69146 68849
55021F8849p7N28R70Q62K65m80j018j131q56m70k64k16r7J33K01l9k61m5N05Q34
$$ 68849 68772 69300 70270 71132 71397 70917 69899 68768 67912 67442 67178 66962 66865 66998 67199 67160 66899 66854 67359 68193
55001F8193O58L14K38L91M62L76L05K89J67l4l4L01P23R11Q02N22J80j03j76n7
$$ 68193 68851 69165 69403 69794 70256 70632 70937 71226 71393 71359 71325 71626 72349 73260 74062 74584 74764 74661 74485 74428
54981G4428J4q7j43P0M14N59M76M26N25O12N82N50O09O39N57N09O81R85J165J083
$$ 74428 74442 74355 74212 74282 74696 75255 75731 76157 76682 77294 77876 78426 79035 79674 80231 80740 81421 82406 83571 84654
54961H4654Q14M90K26J69M06Q05J074J081J019J165J506J801J932K057K337K655
$$ 84654 85468 85958 86184 86353 86759 87564 88638 89719 90738 91903 93409 95210 97142 99199 101536 104191
54945A04191K774K646K439K317K397K774L361L751L507K728J976J659J662J673
$$ 104191 106965 109611 112050 114367 116764 119538 122899 126650 130157 132885 134861 136520 138182 139855
54931A39855J606J508J350J151J072J160J187R57N79J73m18j332k259k736k727
$$ 139855 141461 142969 144319 145470 146542 147702 148889 149846 150425 150598 150180 148848 146589 143853 141126
54916A41126k578k483k435k532k912l327l284k670j865j186o06j13J68L28O78
$$ 141126 138548 136065 133630 131098 128186 124859 121575 118905 117040 115854 115248 115135 115303 115631 116309
54901A16309J225J574J602J720K175K528K318J817J577J575J428J219J378J787
$$ 116309 117534 119108 120710 122430 124605 127133 129451 131268 132845 134420 135848 137067 138445 140232
54887A40232J780J180O56P28R53O04k39q50r08q61j195j815k358k755l175l608
$$ 140232 142012 143192 143848 144576 145529 146133 145894 145044 144136 143275 142080 140265 137907 135152 131977 128369
54871A28369l821l708l458l260l094k868k615k411k205j956j824j994k299k293
$$ 128369 124548 120840 117382 114122 111028 108160 105545 103134 100929 98973 97149 95155 92856 90563
54857I0563j823j253j016j084j115r64p96p68q21q21p11m92j94J04K96L46L10
$$ 90563 88740 87487 86471 85387 84272 83308 82512 81744 80923 80102 79391 78899 78705 78809 79105 79451 79761
54840G9761K51J65L6j11k24k64k79l80o17q41q08m73q5R3J09K29N83R91J150R29
$$ 79761 80012 80177 80213 80102 79878 79614 79335 78955 78338 77497 76689 76216 76131 76224 76333 76562 77145 78136 79286 80215
54820H0215M79J36J48M47P55Q68Q25P12N34L53L67O58R97J092R53P87O39L71M9
$$ 80215 80694 80830 80978 81425 82180 83048 83873 84585 85119 85472 85839 86497 87494 88586 89539 90326 90965 91336 91385
54801I1385j5L30Q58J247J426J519J595J647J705J826K005K201K407K640K876
$$ 91385 91370 91700 92558 93805 95231 96750 98345 99992 101697 103523 105528 107729 110136 112776 115652
54786A15652L049L102L024K910K907L017K977K542J827J211Q87P07N64O03R10
$$ 115652 118701 121803 124827 127737 130644 133661 136638 139180 141007 142218 143105 143812 144376 144979 145889
54771A45889J196J090O02Q6k42m68p26j032j412j941k544k926k876k529k210k096
$$ 145889 147085 148175 148777 148863 148621 148153 147427 146395 144983 143042 140498 137572 134696 132167 129957 127861
54755A27861k062j867j366o33O4M77O20P49J017J292J349J219J140J272J546J838
$$ 127861 125799 123932 122566 121933 121997 122474 123094 123843 124860 126152 127501 128720 129860 131132 132678 134516
54739A34516K068K129J878J345Q33O76Q62J055R78P13N57O28O99M69j03p58j283
$$ 134516 136584 138713 140591 141936 142769 143445 144307 145362 146340 147053 147610 148238 148937 149406 149303 148545 147262
54722A47262j704k135k528k770k901l074l271l331l255l265l427l452l105k597
$$ 147262 145558 143423 140895 138125 135224 132150 128879 125548 122293 119028 115601 112149 109044 106447
54708A06447k328k346k318k044j650j307j001o97n05m86m97l68j42QJ3n1j39k95
$$ 106447 104119 101773 99455 97411 95761 94454 93453 92756 92251 91765 91268 90900 90758 90766 90779 90728 90589 90294
54690I0294n22o77n50j25K83K67k16p36q41n38j19K89P33J053R22L65j36k49j58
$$ 90294 89772 89095 88545 88420 88703 88970 88754 88018 87177 86639 86520 86809 87542 88595 89517 89882 89746 89497 89339
54671H9339j56j64L8L29L91J88l1j14j37j57j47j53k55l66k95l3K35L97M59L92
$$ 89339 89183 89019 89057 89386 89777 89965 89934 89820 89683 89526 89379 89226 88971 88605 88310 88277 88512 88909 89368 89760
54651H9760J64p3j11OLk00l71l37k35k61l64l35p7L25O70P35M43%l19m97p04q52
$$ 89760 89924 89851 89740 89746 89749 89549 89178 88841 88606 88345 87981 87646 87569 87894 88564 89299 89742 89742 89423 88926 88222 87370
54629H7370n76J67P84O61m6o26o65m05k03m8K58O42P95N99K83Q5l4k29m30l79
$$ 87370 86794 86961 87745 88406 88360 87734 87069 86664 86461 86413 86671 87313 88108 88707 88990 89075 89041 88812 88382 88003
54609H8003k9K97L15J39J10L07M69L95J88M1rn7j70l21m25l71j50Q8J91K45M16
$$ 88003 87974 88271 88586 88725 88835 89142 89611 90006 90194 90235 90226 90169 89999 89678 89253 88882 88732 88820 89011 89256 89672
54588H9672O40O37L41L6k5J31L66O19P24L96l39r20q09j72K73J30l08m89j65M78
$$ 89672 90312 90949 91290 91326 91301 91432 91798 92417 93141 93537 93198 92278 91469 91297 91570 91700 91392 90903 90738 91216
54568I1216J037J186Q82L97J3k33m27n40m82k85o2K15N66P61N29M5j82N4L86M34
$$ 91216 92253 93439 94321 94718 94731 94498 94071 93531 93049 92764 92702 92917 93483 94244 94773 94818 94636 94690 95076 95510
54548I5510K73J76J45J1j78k14p4M8L3m3p0l3P9K86N41P67R48J075R99N80j4l41
$$ 95510 95783 95959 96104 96115 95937 95723 95649 95697 95730 95687 95617 95584 95663 95949 96490 97257 98205 99280 100279 100859 100845 100504
54526A00504j73K23M20L16J38O1K6m6j06p5J0P9J57K82L83L44J88P3O5K8j97n45
$$ 100504 100331 100554 100974 101290 101428 101489 101515 101469 101363 101288 101298 101377 101534 101816 102199 102543 102731 102804 102869 102897 102700 102155
54504A02155p37n75j66J47J02k21m92m85k96j53r5M9L68O91P99O68M73L71M17
$$ 102155 101418 100843 100677 100824 100926 100705 100213 99728 99432 99279 99184 99233 99601 100292 101091 101759 102232 102603 103020
54485A03020N58O65N83L12K5j38k31l30l31r9K83N83P29Q34R30R17P75O32M95
$$ 103020 103578 104243 104826 105138 105163 105025 104794 104464 104133 104034 104317 104900 105629 106463 107393 108310 109085 109717 110212
54466A10212K37j20l35l36m12p61j059q22j16M65N13K02q3k09k06p5J67L17K41
$$ 110212 110449 110329 109994 109658 109246 108485 107426 106604 106488 106953 107466 107668 107585 107376 107170 107095 107262 107579 107820
54447A07820J14K34N64P20M80M0k85m92p44r99r48m48K17O18O04L07j22n54p43
$$ 107820 107934 108168 108732 109452 109932 109972 109687 109195 108451 107452 106504 106056 106273 106891 107495 107802 107680 107126 106383
54428A06383m51J87O65O41K90j2j65k55k03J25N49O84M97L26L14J81k09m88l17
$$ 106383 105932 106119 106784 107425 107715 107703 107538 107283 107080 107205 107754 108438 108935 109261 109575 109756 109547 109059 108742
54409A08742N5J74O5J06L48M60L72M06O69P98M92J5j65P0M66P00N23j03p62p56
$$ 108742 108797 108971 109036 109142 109490 109950 110322 110728 111397 112195 112687 112702 112537 112607 113073 113773 114296 114193 113431 112675
54389A12675N1Q90Q97J79l88k79J63L33K2n69j099j256r70n78n00o90o86k86K06
$$ 112675 112726 113616 114513 114692 114304 114025 114188 114521 114543 113974 112875 111619 110649 110071 109571 108881 108195 107909 108115
54370A08115N03P05R20R26N67J24o4r9k78m98l70J40N99O56L53r8n43q16p41l57
$$ 108115 108618 109323 110243 111169 111736 111860 111796 111697 111419 110921 110551 110691 111290 111946 112299 112201 111658 110842 110101 109744
54350A09744J04M70P07P44M82M9j93m6K90M96M50K48M4n4l4rl4J6K12L20N9l81
$$ 109744 109848 110318 111025 111769 112251 112300 112107 112061 112351 112847 113297 113545 113589 113535 113501 113492 113458 113474 113686 114006 114065 113684
54328A13684n21l02j84l97n54l05Q0J85J24K48M36K43k88n98m07m0J32J42J34
$$ 113684 113163 112861 112677 112280 111726 111421 111501 111686 111810 112058 112494 112737 112449 111851 111444 111404 111536 111678 111812
54309A11812O6j19k83k75j11J23L36L35J1l22j67L96O67K56k92k64K37N75N74
$$ 111812 111878 111759 111476 111201 111090 111213 111549 111884 111895 111573 111406 111802 112469 112725 112433 112169 112406 112981 113555
54290A13555O16Q32Q69N13L7k76m93o78n80m0O13Q89P05L74J09j24l51m40k50
$$ 113555 114171 115003 115872 116385 116422 116146 115653 114975 114395 114355 114968 115857 116562 116936 117045 116921 116570 116130 115880
54271A15880J76N84O72L36j43l35j29J47J42j35m32n68m95k70j04k40o04p35l69
$$ 115880 116056 116640 117312 117648 117505 117170 117041 117188 117330 117195 116763 116195 115700 115430 115326 115086 114482 113747 113378
54252A13378J45K75jk96m34n45n81l10J70L75J11k22k20k7K7j2J04L22L40O4k75
$$ 113378 113523 113798 113797 113501 113067 112522 111941 111631 111801 112176 112287 112065 111845 111818 111845 111833 111937 112259 112599 112663 112388
54231A12388m44l77j15J70K02q0l21j32L54O27M51J00j19j87k04j71j35k61n91
$$ 112388 111944 111567 111452 111622 111824 111744 111423 111291 111645 112272 112723 112823 112704 112517 112313 112142 112007 111746 111155
54212A11155q60p42k08M71R37R30M37k39o75p04n32l56j51Q8J35j66n33n35j92
$$ 111155 110295 109553 109345 109816 110753 111683 112120 111881 111206 110502 109970 109614 109463 109551 109686 109520 108987 108452 108260
54193A08260K1j54l67j51M19P61M85j80o54o25k87m2n7j87k68l38m74n51l39J34
$$ 108260 108281 108127 107760 107609 108028 108789 109274 109094 108440 107815 107528 107486 107429 107242 106974 106636 106162 105611 105272 105406
54173A05406N33O17N25N28O00M82J09k51l70l66m64o16n48j85K25M00L09R9j02
$$ 105406 105939 106556 107081 107609 108209 108691 108800 108549 108179 107813 107349 106733 106185 106000 106225 106625 106934 107033 106931
54154A06931k38k85k60j97p9J45M14N23L85J88K01M08N27M07K41L03N91P91O36
$$ 106931 106693 106408 106148 105951 105872 106017 106431 106954 107339 107527 107728 108136 108663 109070 109311 109614 110205 110996 111632
54135A11632K31m4M5L71O43P74Q79R75Q94N88K87K45M03N45N59M96L80K33J72
$$ 111632 111863 111819 111864 112235 112878 113652 114531 115506 116400 116988 117275 117520 117923 118468 119027 119523 119903 120136 120308
54116A20308K78M39M56L52L18M04N13O09P33P55M57j02m96l93L6L19J33m72j133
$$ 120308 120586 121025 121481 121833 122151 122555 123068 123677 124410 125165 125622 125520 125024 124631 124667 124986 125119 124647 123514
54097A23514j400j071m24K7O7q9k09l52o19q64q51n27k2N33R82J116Q69M34O9
$$ 123514 122114 121043 120619 120646 120713 120624 120415 120063 119444 118580 117729 117202 117180 117713 118695 119811 120680 121114 121183
54078A21183j22j57r9j07l33o16n46n3L47J91k17k09L38Q85R94P47M10R1j55k38
$$ 121183 121061 120904 120805 120698 120365 119749 119203 119150 119497 119688 119471 119262 119600 120485 121479 122226 122636 122727 122572 122334
54058A22334k10k38k73K1P59J559J940J818J434R98N94L08K09K59L97O59J054
$$ 122334 122124 121886 121613 121634 122393 123952 125892 127710 129144 130142 130736 131044 131253 131512 131909 132568 133622
54041A33622J409J525J455J445J569J601J333R34Q24J182J701J934J830J713J779
$$ 133622 135031 136556 138011 139456 141025 142626 143959 144893 145717 146899 148600 150534 152364 154077 155856
54026A55856J798J513J082Q95J021J139J029P89N68L26J6k51l69m31n62p03p05
$$ 155856 157654 159167 160249 161144 162165 163304 164333 165122 165690 166016 166032 165781 165412 164981 164419 163716 163011
54009A63011n88m96m95n08m92n51p87j102j238j084r00j040j410j479r84l83l11
$$ 163011 162423 161927 161432 160924 160432 159881 159094 157992 156754 155670 154770 153730 152320 150841 149857 149474 149163
53992A49163o89q44m64MP0j65k81j69n6n7o0J01M87J013J434J533J437J538K003
$$ 149163 148474 147630 147166 147170 147240 147075 146794 146625 146569 146512 146452 146553 147040 148053 149487 151020 152457 153995 155998
53973A55998K533K783K788K817L035L485M187M970N444N412N176N118N186N054
$$ 155998 158531 161314 164102 166919 169954 173439 177626 182596 188040 193452 198628 203746 208932 213986
53959B13986M648M164L759L517L556L840L996L754L410L368L401K917J945J190
$$ 213986 218634 222798 226557 230074 233630 237470 241466 245220 248630 251998 255399 258316 260261 261451
53945B61451R94Q25J01j041k124k998l747m251m366m287m305m343m110l647l286
$$ 261451 262445 263270 263371 262330 260206 257208 253461 249210 244844 240557 236252 231909 227799 224152 220866
53930B20866l101k803k241j680j449j496j494j281j032r74j008p79j69M09M33
$$ 220866 217765 214962 212721 211041 209592 208096 206602 205321 204289 203315 202307 201528 201359 201768 202201
53915B02201l4l82k32J40K89K18K46M85P78J021J232J341J226R65P52O09L95J25
$$ 202201 202167 201785 201553 201693 201982 202200 202446 202931 203709 204730 205962 207303 208529 209494 210246 210855 211250 211375
53897B11375j8j1j14n17j096j588j870j953j912j863j927k074k184k271k480k792
$$ 211375 211357 211346 211232 210715 209619 208031 206161 204208 202296 200433 198506 196432 194248 191977 189497 186705
53881A86705k911k635k173j905j907j937j793j531j320j260j367j607j832j825
$$ 186705 183794 181159 178986 177081 175174 173237 171444 169913 168593 167333 165966 164359 162527 160702
53867A60702j506j040p02o18o99q12r18j063j237j370j426j445j446j339j068
$$ 160702 159196 158156 157454 156836 156137 155325 154407 153344 152107 150737 149311 147866 146420 145081 144013
53852A44013p33n22m83m68l82k85k12l9K88N26L99K5j94j00P2J68L79Q06J066
$$ 144013 143280 142758 142275 141807 141425 141140 140928 140889 141177 141703 142102 142127 141933 141833 141905 142073 142452 143258 144324
53833A44324P62J53j07J36L79K88J58L18N31M10J07J10N06Q74R09P26N32L66K57
$$ 144324 145086 145239 145132 145268 145647 145935 146093 146411 146942 147352 147459 147569 148075 148949 149858 150584 151116 151482 151739
53814A51739K74L66L98L99N05O26N67N09Q74J580J926J536R80R91J461J709J506
$$ 151739 152013 152379 152777 153176 153681 154307 154874 155383 156257 157837 159763 161299 162279 163270 164731 166440 167946
53797A67946J221J122J121J206J504J891K024J966K196K795L112K629J764J377
$$ 167946 169167 170289 171410 172616 174120 176011 178035 180001 182197 184992 188104 190733 192497 193874
53783A93874J703K266K618K772K864K888K903L146L727M340M530M182L634L263
$$ 193874 195577 197843 200461 203233 206097 208985 211888 215034 218761 223101 227631 231813 235447 238710
53769B38710L094K806K154J274N58K60L16N46Q51J120J136P51J21m61r21j467
$$ 238710 241804 244610 246764 248038 248596 248856 249172 249718 250569 251689 252825 253576 253697 253236 252315 250848
53753B50848k238l059l647l943m100m227m352m556n003n685o290o423n960n127
$$ 250848 248610 245551 241904 237961 233861 229634 225282 220726 215723 210038 203748 197325 191365 186238
53739A86238m295l723l454l263k790j919j021o20p40p91k61O49J349J624J760
$$ 186238 181943 178220 174766 171503 168713 166794 165773 165153 164413 163622 163361 164010 165359 166983 168743
53724A68743J974K073J831J421J192J222J299J318J378J504J520J332J173J352
$$ 168743 170717 172790 174621 176042 177234 178456 179755 181073 182451 183955 185475 186807 187980 189332
53710A89332J812K142K072J781J603J580J472J142P11L19l5l50n18m46j97J34
$$ 189332 191144 193286 195358 197139 198742 200322 201794 202936 203647 203966 203931 203581 203063 202617 202420 202554
53694B02554N02P73O63R3n57p40l43K54O17N92K71j62m62m56k23kQ1O9oj18j16
$$ 202554 203056 203829 204492 204585 204028 203288 202945 203199 203816 204408 204679 204517 204055 203599 203376 203374 203455 203524 203518 203400 203284
53673B03284J55N93Q87Q48N13n8p68j278j162m68K40M92L68J37j52n22p93p96
$$ 203284 203439 204032 204919 205767 206280 206222 205454 204176 203014 202546 202786 203278 203646 203783 203631 203109 202316 201520
53655B01520o75o60p03o44n64o27p29o41m18l34m34m76l13o7J44K96K73p1n62
$$ 201520 200845 200185 199482 198838 198274 197647 196918 196277 195859 195525 195091 194615 194302 194235 194379 194675 194948 194877 194315
53636A94315p32l81J38L51K39J35K11L17K94K49M13Q04J179J375J514J753J938
$$ 194315 193583 193202 193340 193691 193930 194065 194276 194593 194887 195136 195549 196353 197532 198907 200421 202174 204112
53619B04112J767J323J113J414J862J959J752J637J696J638J376J238J518K080
$$ 204112 205879 207202 208315 209729 211591 213550 215302 216939 218635 220273 221649 222887 224405 226485
53605B26485K545K621K251J619J083R27J108J422J772K092K147J797J356J269
$$ 226485 229030 231651 233902 235521 236604 237531 238639 240061 241833 243925 246072 247869 249225 250494
53591B50494J419J245O29J01O9K66K52j0l14n55n48m4P26R61K82n95p43k79n7
$$ 250494 251913 253158 253787 253888 253957 254223 254475 254465 254151 253596 253048 253004 253730 254691 254973 254378 253635 253356 253299
53572B53299l39n89m70l16m32o28p27r22j299j474j118n23k37l82o32p11n63k37
$$ 253299 252960 252371 251901 251585 251153 250525 249798 248876 247577 246103 244985 244462 244225 243843 243211 242500 241937 241700
53554B41700J54M24N15N90P40P77N16J23j04j02oJ86N65J043J397J630J931K283
$$ 241700 241854 242278 242793 243383 244123 244900 245416 245539 245435 245333 245327 245513 246078 247121 248518 250148 252079 254362
53536B54362K402K164J873J934K432L123L711M039M095L996L924M003M262M686
$$ 254362 256764 258928 260801 262735 265167 268290 272001 276040 280135 284131 288055 292058 296320 301006
53522C01006N252N853O304O521O631O880P395Q115Q851R401R642R658R716J0052
$$ 301006 306258 312111 318415 324936 331567 338447 345842 353957 362808 372209 381851 391509 401225 411277
53508D11277J0624J1121J1297J1234J1270J1601J2076J2360J2360J2336J2604
$$ 411277 421901 433022 444319 455553 466823 478424 490500 502860 515220 527556 540160
53497E40160J3190J3823J4240J4382J4382J4401J4526J4702J4760J4578J4230
$$ 540160 553350 567173 581413 595795 610177 624578 639104 653806 668566 683144 697374
53486F97374J3894J3628J3322J2916J2519J2252J2070J1862J1605J1344J1016
$$ 697374 711268 724896 738218 751134 763653 775905 787975 799837 811442 822786 833802
53475H33802J0543R987R472Q931Q093O840N459M403L845L544L111K351J395N12
$$ 833802 844345 854332 863804 872735 880828 887668 893127 897530 901375 904919 908030 910381 911776 912288
53461I12288k23j041k158l394m300m723n013n542o270o973p676q499r264r668
$$ 912288 912065 911024 908866 905472 901172 896449 891436 885894 879624 872651 864975 856476 847212 837544
53447H37544r802j0040j0359j0289r748r356r594j0020r880r247q896r132r339
$$ 837544 827742 817702 807343 797054 787306 777950 768356 758336 748456 739209 730313 721181 711842
53434G11842q906q007p204o655o095n372m638m038l515k927k160j163K0J239K383
$$ 711842 702936 694929 687725 681070 674975 669603 664965 660927 657412 654485 652325 651162 651182 652421 654804
53419F54804L446M415N217N881O635P613Q586R245R649J0188J1077J2147J3161
$$ 654804 658250 662665 667882 673763 680398 688011 696597 705842 715491 725679 736756 748903 762064
53406G62064J4082J4984J5874J6755J7702J8717J9668K0458K1132K1755K2304
$$ 762064 776146 791130 807004 823759 841461 860178 879846 900304 921436 943191 965495
53395I65495K2857K3677K4903K6197K7021K7240K7261K7488K7897K8211K8361
$$ 965495 988352 1012029 1036932 1063129 1090150 1117390 1144651 1172139 1200036 1228247 1256608
53384A256608K8480K8595K8540K8246K7863K7548K7215K6669K5826K4747K3489
$$ 1256608 1285088 1313683 1342223 1370469 1398332 1425880 1453095 1479764 1505590 1530337 1553826
53373A553826K2088K0659J9259J7686J5627J3097J0529Q309O332M229J935k35
$$ 1553826 1575914 1596573 1615832 1633518 1649145 1662242 1672771 1681080 1687412 1691641 1693576 1693341
53361A693341k059l704n464p412r415j1392j3411j5518j7634j9576k1170k2438
$$ 1693341 1691282 1687578 1682114 1674702 1665287 1653895 1640484 1624966 1607332 1587756 1566586 1544148
53349A544148k3630k5037k6650k8093k9022k9455k9666k9823k9861k9711k9443
$$ 1544148 1520518 1495481 1468831 1440738 1411716 1382261 1352595 1322772 1292911 1263200 1233757
53338A233757k9187k8952k8618k8033k7151k6100k5095k4226k3386k2462k1537
$$ 1233757 1204570 1175618 1147000 1118967 1091816 1065716 1040621 1016395 993009 970547 949010
53327I49010k0760k0085j9318j8418j7532j6668j5579j4130j2649j1638j1161
$$ 949010 928250 908165 888847 870429 852897 836229 820650 806520 793871 782233 771072
53316G71072j0756r962q812p694o859o254n676n022m276l399k331j122OP93J215
$$ 771072 760316 750354 741542 733848 726989 720735 715059 710037 705761 702362 700031 698909 698915 699708 700923
53301G00923J527K032K777L545M176M759N514O496P491Q242Q668Q873R029R268
$$ 700923 702450 704482 707259 710804 714980 719739 725253 731749 739240 747482 756150 765023 774052 783320
53287G83320R698J0320J0951J1307J1289J1129J1139J1327J1413J1183J0719J0189
$$ 783320 793018 803338 814289 825596 836885 848014 859153 870480 881893 893076 903795 913984
53275I13984R611Q936Q233P579O863N903M789L839L124K280J007m50j602k375
$$ 913984 923595 932531 940764 948343 955206 961109 965898 969737 972861 975141 976148 975698 974096 971721
53261I71721l188m355n718o981q124r265j0370j1318j2154j2992j3738j4185j4391
$$ 971721 968533 964178 958460 951479 943355 934090 923720 912402 900248 887256 873518 859333 844942
53248H44942j4692j5293j6075j6807j7328j7463j7069j6383j5986j6189j6614
$$ 844942 830250 814957 798882 782075 764747 747284 730215 713832 697846 681657 665043
53237F65043j6640j6181j5630j5239j4863j4378j3954j3781j3749j3597j3197
$$ 665043 648403 632222 616592 601353 586490 572112 558158 544377 530628 517031 503834
53226E03834j2585j1869j1268j1019j1118j1219j0971j0353r600q900q309p832
$$ 503834 491249 479380 468112 457093 445975 434756 423785 413432 403832 394932 386623 378791
53214C78791p443p078o745o576o623o693o531o116n678n436n452n645n808n725
$$ 378791 371348 364270 357525 350949 344326 337633 331102 324986 319308 313872 308420 302775 296967 291242
53200B91242n411n152n130n124m814m270l897l868l926l820l630l516l434l266
$$ 291242 285831 280679 275549 270425 265611 261341 257444 253576 249650 245830 242200 238684 235250 231984
53186B31984l080l010l017k928k691k391k084j765j489j353j343j296j095q36
$$ 231984 228904 225894 222877 219949 217258 214867 212783 211018 209529 208176 206833 205537 204442 203606
53172B03606p20q15r38q33n09k48k65l89l10l0R7j50n46p04n13j37K37N03N61
$$ 203606 202886 202071 201133 200300 199791 199543 199278 198889 198579 198549 198646 198496 197950 197246 196733 196596 196833 197336 197897
53153A97897L73M6k13k82j69P5L46M94M49L27K92L19K32qj76l4L56O37M95Qm09
$$ 197897 198270 198316 198103 197821 197652 197727 198073 198567 199016 199343 199635 199954 200186 200178 200002 199968 200324 200961 201456 201464 201055
53132B01055m24j36J54L61O42R77J046P29L75L32M27K64j18l19k27j79l64n56
$$ 201055 200631 200495 200649 201010 201652 202629 203675 204404 204779 205111 205538 205802 205684 205365 205138 204959 204595 204039
53114B04039n50m94n72o79p00q12j149j421j256p89n31o85r60j053r64p81n30
$$ 204039 203489 202995 202423 201744 201044 200232 199083 197662 196406 195617 195086 194401 193441 192388 191424 190643 190113
53097A90113l39m65r17j344j432j256j051q72o68n29n59o23n05k42o2l7l8m0j35
$$ 190113 189774 189309 188392 187048 185616 184360 183309 182437 181769 181240 180681 180058 179553 179311 179249 179212 179174 179134 178999
53078A78999k69k20M5K71K92K61L04K41q5m31m05l6K63K49P1m5o8j9J40L64M65
$$ 178999 178730 178510 178555 178826 179118 179379 179683 179924 179839 179408 179003 178967 179230 179479 179550 179505 179437 179418 179558 179922 180387
53057A80387L98L65N08O55N68K82L6p7j61k60k85j92j03j45k85l67k42J08N35
$$ 180387 180785 181150 181658 182313 182881 183163 183199 183122 182961 182701 182416 182224 182121 181976 181691 181324 181082 181190 181725
53038A81725Q13Q16N99L10Q3L5K43O23R14R21P04M75L58L88N96R42J214J186Q88
$$ 181725 182538 183354 183953 184263 184346 184381 184624 185247 186161 187082 187786 188261 188619 189007 189603 190545 191759 192945 193833
53019A93833N41K60J4j85k35j61j41k76m55n03l48%M44P42O94M32L29N21P20O34
$$ 193833 194374 194634 194648 194463 194228 194067 193926 193650 193195 192692 192344 192344 192788 193530 194224 194656 194985 195506 196226 196860
52999A96860L07l4l04m72l86LM14N11L39K48L97O25P62P89O88M36J79J61L46M23
$$ 196860 197167 197133 196829 196357 195971 195974 196388 196899 197238 197486 197883 198508 199270 200059 200747 201183 201362 201523 201869 202292
52979B02292K66J41K71M88N67O30R02J217J202Q62N77M75K45k84p36o45q7M88
$$ 202292 202558 202699 202970 203458 204025 204655 205557 206774 207976 208838 209415 209890 210135 209851 209115 208470 208383 208871
52961B08871Q31R95R70O21K7m44n46m06k44j39j53m12p91p96j63O31P89J72n62
$$ 208871 209702 210697 211667 212288 212315 211871 211325 210919 210675 210536 210383 209971 209180 208384 208221 208852 209641 209813 209251
52942B09251q57q62r61j103r71n87k96k78l69m46o17q81r49o49k78k78o09p52
$$ 209251 208394 207532 206571 205468 204497 203910 203614 203336 202967 202521 201904 201023 200074 199425 199147 198869 198260 197508
52924A97508l99J33K87n4n37p86p35m67l4M60P90P97N74L24J11j04k85l08j79
$$ 197508 197109 197242 197529 197475 196938 196152 195417 194950 194916 195376 196166 196963 197537 197861 197972 197868 197583 197275 197096
52905A97096o6r6k37l77m29l38j37J8l7k48m01m25m36m62l37J0L44L84J43j35
$$ 197096 197030 196934 196697 196320 195891 195553 195416 195434 195397 195149 194748 194323 193887 193425 193088 193098 193442 193826 193969 193834
52885A93834k77k59j10R3K04K06K52L74L28m6m47m13L3L91L54J43O0J16J57J32
$$ 193834 193557 193298 193188 193281 193485 193691 193943 194317 194645 194599 194152 193739 193772 194163 194517 194660 194720 194836 194993 195125
52865A95125Ok77n65m76J03O90P06K09k17k54j57k30l28j60J63K10j39m58l18
$$ 195125 195131 194854 194289 193813 193916 194606 195312 195521 195304 195050 194893 194663 194335 194175 194338 194548 194409 193951 193633
52846A93633J26K86j27p69j107j024q01o63n92n27m56l19m4K27K49P7O2L03M58
$$ 193633 193759 194045 193918 193149 192042 191018 190217 189554 188962 188435 187979 187660 187616 187843 188092 188169 188231 188534 188992
52827A88992L45L72R57J747J951J362N71J35j3j94m38o01o14m38pN46Q15O22L33
$$ 188992 189337 189709 190666 192413 194364 195726 196297 196432 196419 196225 195787 195186 194572 194134 194127 194673 195488 196110 196443
52808A96443L60N47M41Nl57m66o13j004j403j502j409j463j756k067k198k140
$$ 196443 196803 197350 197791 197796 197439 196973 196360 195356 193953 192451 191042 189579 187823 185756 183558 181418
52792A81418j956j725j534j422j303j091q38o66n49l25M8L90M92L53J70J25K48
$$ 181418 179462 177737 176203 174781 173478 172387 171549 170883 170334 170009 170057 170447 170939 171292 171462 171587 171835
52775A71835M16M62K99L2r8P3M21O13M66J67O3K40M24L62J66J76N17R63J210J166
$$ 171835 172251 172713 173012 173044 172946 173019 173440 174053 174519 174686 174749 174989 175413 175775 175941 176117 176634 177597 178807 179973
52755A79973R23N94K48p4l51n86p20o89n12l15j62M7L83O90P03L70m5j93jK97
$$ 179973 180896 181490 181738 181664 181313 180727 180007 179318 178806 178491 178329 178376 178759 179449 180152 180522 180477 180284 180283 180580
52735A80580L69J39j32j35J55M83O49O97O95N57K13j57l32l83n43p50o34p9M98
$$ 180580 180949 181088 180956 180821 180976 181459 182108 182805 183500 184057 184270 184113 183781 183398 182855 182105 181471 181392 181890
52716A81890O06K77k2jJ70J78k5k22k32j33j33l20n21m87j72K48N78P69Q48Q44
$$ 181890 182496 182773 182751 182750 182920 183098 183073 182851 182619 182486 182353 182033 181512 181025 180853 181101 181679 182448 183296 184140
52696A84140Q03P75O97M49P6j37RL38M99M26M03O69J134J506J548J166M18m17
$$ 184140 184943 185718 186415 186864 186940 186803 186812 187150 187649 188075 188478 189147 190281 191787 193335 194501 194919 194502
52678A94502r16q22k70L43P18Q11P73P56Q19Q99Q71O62L17m1k68k46L9L89N12
$$ 194502 193586 192764 192494 192837 193555 194366 195139 195895 196714 197613 198484 199146 199463 199422 199154 198908 198947 199336 199848
52659A99848L04j0j24J4K47M74P33R74R99P53M58L27K41o7n70r43r32o18k13J45
$$ 199848 200152 200142 200018 200032 200279 200753 201486 202460 203459 204212 204670 204997 205238 205171 204601 203658 202726 202108 201895 202040
52639B02040L73L83J92m6k24m18o68q12o76m01k95l97m14j77R0J17k1n8O2J65
$$ 202040 202413 202796 202988 202942 202718 202300 201632 200820 200144 199743 199448 199051 198637 198460 198550 198667 198646 198588 198650 198815
52619A98815J79K18L11K95P2k11l51k97j00J96M44L68j39o88p37k30L00L86J58
$$ 198815 198994 199212 199523 199818 199890 199679 199328 199031 198931 199127 199571 199939 199800 199112 198375 198145 198445 198831 198989
52600A98989P3L11O55Q05O52K82p5j73j4J46J57K21N27Q42Q05N54N94J019J330
$$ 198989 199062 199373 200028 200833 201485 201767 201692 201519 201505 201651 201808 202029 202556 203398 204203 204757 205351 206370 207700
52581B07700J192Q83P86P97O29L65L08M44M82K97K7j89k60p5L21N82M30O2j06
$$ 207700 208892 209775 210561 211358 211987 212352 212660 213104 213586 213883 213910 213721 213461 213386 213707 214289 214719 214781 214675
52562B14675k3P4J29K21J25m58j244j487r49k58m7k10k66p8J38J90jm56r79j162
$$ 214675 214652 214726 214855 215076 215201 214743 213499 212012 211063 210805 210758 210548 210282 210204 210342 210532 210531 210075 209096 207934
52542B07934q51l83j37q8m4J0RL9J70K88L50N19P69P08J70l43k72K24N82O79Q06
$$ 207934 207083 206700 206563 206475 206431 206441 206450 206489 206659 206947 207297 207816 208585 209293 209463 209120 208848 209072 209654 210333 211139
52521B11139R73Q77N52L94N12N83M51L72M50L90J7l88n11m01k14O3L57L23j88
$$ 211139 212112 212989 213541 213935 214447 215030 215481 215853 216303 216693 216710 216322 215811 215410 215196 215259 215616 215939 215751
52502B15751p56q65n89m44o66r06p52k77L7j60o84r60o14J29P19Q69P08M52J66
$$ 215751 214995 214130 213541 213097 212431 211525 210773 210496 210533 210373 209689 208729 208115 208244 208963 209832 210540 210992 211158
52483B11158r3j66M7M66R07J185J147Q21N18N19O84O49M25L82N97O13J16n22p10
$$ 211158 211065 210899 210946 211412 212319 213504 214651 215472 215990 216509 217193 217842 218267 218649 219246 219859 219975 219453 218743
52464B18743m13j09j19l01l79k58m2R6M2j69m11o06p41p94p98r36j324j704j709
$$ 218743 218330 218221 218102 217801 217422 217164 217122 217218 217260 217091 216680 216074 215333 214539 213741 212805 211481 209777 208068
52445B08068j428j317j458j385q57l02j46j71J4K60J67j54k30%J54P3K2J36J96
$$ 208068 206640 205323 203865 202480 201623 201321 201175 201004 201018 201278 201445 201291 201061 201061 201215 201288 201310 201446 201642
52426B01642N1j38k12j96j11J01L46M25M03N88R93J236J122J004J307J896K233
$$ 201642 201693 201555 201343 201147 201036 201137 201483 201908 202311 202899 203892 205128 206250 207254 208561 210457 212690
52409B12690K053J626J429J656K060K195J858J305R31Q22P82P28Q10J091J360
$$ 212690 214743 216369 217798 219454 221514 223709 225567 226872 227803 228625 229407 230135 230945 232036 233396
52394B33396J380J138P80M70L51M52N76M28m1o12j100j489j712j630j280r37p66
$$ 233396 234776 235914 236694 237164 237515 237967 238543 238971 238930 238318 237218 235729 234017 232387 231107 230170 229404
52377B29404o71n71n50o09n51l12p7M9K65O54R14P58L82J71J15l4k29j68J42L77
$$ 229404 228733 228162 227612 227003 226452 226140 226063 226112 226377 227031 227945 228703 229085 229256 229371 229337 229108 228940 229082 229459
52357B29459M22N63R70J397J547J480J442J480J438J199Q23N20N47R76J534J835
$$ 229459 229881 230444 231414 232811 234358 235838 237280 238760 240198 241397 242220 242740 243287 244263 245797 247632
52341B47632J807J748J895K148K327K450K595K667K539K293K117K083K170K417
$$ 247632 249439 251187 253082 255230 257557 260007 262602 265269 267808 270101 272218 274301 276471 278888
52327B78888K837L236L389L334L332L513L807M164M610N049N289N283N181N058
$$ 278888 281725 284961 288350 291684 295016 298529 302336 306500 311110 316159 321448 326731 331912 336970
52313C36970M857M620M568M789N096N351N684O171O600O777O897P217P574P585
$$ 336970 341827 346447 351015 355804 360900 366251 371935 378106 384706 391483 398380 405597 413171 420756
52299D20756P245O929O815O726O607O722P178P620P645P284O847O528O315O150
$$ 420756 428001 434930 441745 448471 455078 461800 468978 476598 484243 491527 498374 504902 511217 517367
52285E17367N959N712N531N594N761N605N020M465M349M432M273L965L955M239
$$ 517367 523326 529038 534569 540163 545924 551529 556549 561014 565363 569795 574068 578033 581988 586227
52271E86227M292L811L086K516K157J928J855J910J915J775J639J647J716J752
$$ 586227 590519 594330 597416 599932 602089 604017 605872 607782 609697 611472 613111 614758 616474 618226
52257F18226J868K164K497K608K438K145J950K012K355K755K930K892K975L362
$$ 618226 620094 622258 624755 627363 629801 631946 633896 635908 638263 641018 643948 646840 649815 653177
52243F53177L793L941L907M025M325M509M445M402M659N132N498N576N426N161
$$ 653177 656970 660911 664818 668843 673168 677677 682122 686524 691183 696315 701813 707389 712815 717976
52229G17976M816M416M077L924L959M024L963L756L507L286L050K709K224J663
$$ 717976 722792 727208 731285 735209 739168 743192 747155 750911 754418 757704 760754 763463 765687 767350
52215G67350J161Q73Q42R60J053J001P71M49K18K65N43P67P46N90N09N40O36Q59
$$ 767350 768511 769384 770226 771186 772239 773240 774011 774460 774678 774943 775486 776253 776999 777589 778098 778638 779274 780133
52197G80133J222J500J514J445J551J657J424J047J102J600J830J415R39J062
$$ 780133 781355 782855 784369 785814 787365 789022 790446 791493 792595 794195 796025 797440 798379 799441
52183G99441J526J631J327J151J237J153O86K32J20J52J7k24l56m27o16q86j061
$$ 799441 800967 802598 803925 805076 806313 807466 808152 808384 808504 808656 808673 808449 808093 807666 807050 806164 805103
52166H05103j140j271j460j515j312r96q53j056j480j780j666j143n05r3j04n05
$$ 805103 803963 802692 801232 799717 798405 797409 796556 795500 794020 792240 790574 789431 788926 788833 788729 788224
52150G88224j086j520j551j141m90J26N04O52Q13J248J940K534K682K402J965
$$ 788224 787138 785618 784067 782926 782436 782562 783066 783718 784531 785779 787719 790253 792935 795337 797302
52135G97302J607J426J422J472J332R36O16P52J256J620J543J237J110J339J821
$$ 797302 798909 800335 801757 803229 804561 805497 806113 806865 808121 809741 811284 812521 813631 814970 816791
52120H16791K327K596K522K325K366K733L142L357L438L497L448L229L075L312
$$ 816791 819118 821714 824236 826561 828927 831660 834802 838159 841597 845094 848542 851771 854846 858158
52106H58158L962M767N521O194O789P272P645P918Q034P944P730P550P475P482
$$ 858158 862120 866887 872408 878602 885391 892663 900308 908226 916260 924204 931934 939484 946959 954441
52092I54441P561P640P527P093O557O349O625P012O975O303N269M340L821L676
$$ 954441 962002 969642 977169 984262 990819 997168 1003793 1010805 1017780 1024083 1029352 1033692 1037513 1041189
52078A041189L631L438L043K552K031J469Q98M37J65M4Lkm1k28n64q61q84o30
$$ 1041189 1044820 1048258 1051301 1053853 1055884 1057353 1058251 1058688 1058853 1058897 1058900 1058898 1058857 1058629 1058065 1057204 1056320 1055690
52060A055690l48k45k64j50K76R13J483J751J681J361R06M87L83Q45J767K635
$$ 1055690 1055342 1055097 1054833 1054683 1054959 1055872 1057355 1059106 1060787 1062148 1063054 1063541 1063924 1064769 1066536 1069171
52044A069171K944K675K249K037K060K147K201K221K180K039J849J707J658J670
$$ 1069171 1072115 1074790 1077039 1079076 1081136 1083283 1085484 1087705 1089885 1091924 1093773 1095480 1097138 1098808
52030A098808J709J710J575J278R31O36L87J47j5o6j68n21j035j442j725k193
$$ 1098808 1100517 1102227 1103802 1105080 1106011 1106647 1107034 1107181 1107166 1107100 1106932 1106411 1105376 1103934 1102209 1100016
52014A100016l006l889m435m553m495m570n022n951p205q376r128r480r726j0147
$$ 1100016 1097010 1093121 1088686 1084133 1079638 1075068 1070046 1064095 1056890 1048514 1039386 1029906 1020180 1010033
52000A010033j0887j1912j2952j3613j3789j3833j4098j4474j4602j4432j4284
$$ 1010033 999146 987234 974282 960669 946880 933047 918949 904475 889873 875441 861157
51989H61157j4329j4359j4103j3592j3061j2683j2451j2251j1958j1598j1343
$$ 861157 846828 832469 818366 804774 791713 779030 766579 754328 742370 730772 719429
51978G19429j1281j1220j0935j0457r971r495q917q305p856p543p132o589o134
$$ 719429 708148 696928 685993 675536 665565 656070 647153 638848 630992 623449 616317 609728 603594
51965F03594n823n436m910m507m318m020l404k843k811l145l250k942k635k645
$$ 603594 597771 592335 587425 582918 578600 574580 571176 568333 565522 562377 559127 556185 553550 550905
51951E50905k743k555k109j735j648j770j881j789j444r83o74p17j080j520j762
$$ 550905 548162 545607 543498 541763 540115 538345 536464 534675 533231 532248 531574 530857 529777 528257 526495
51936E26495j677j403j231j357j740k215k717l262l775m084m115m011l965l951
$$ 526495 524818 523415 522184 520827 519087 516872 514155 510893 507118 503034 498919 494908 490943 486992
51922D86992l747l194k439j836j605j615j605j539j585j786j940j926j870j916
$$ 486992 483245 480051 477612 475776 474171 472556 470951 469412 467827 466041 464101 462175 460305 458389
51908D58389j922j676j275j094j343j854k274k357k085j663j379j398j613j833
$$ 458389 456467 454791 453516 452422 451079 449225 446951 444594 442509 440846 439467 438069 436456 434623
51894D34623k006k148k156j882j406j003p85n53j14M64R93J427J801K042K025
$$ 434623 432617 430469 428313 426431 425025 424022 423237 422684 422570 423034 424027 425454 427255 429297 431322
51879D31322J783J535J529J825K218K322J834Q39k27r52j279j398j471j549j706
$$ 431322 433105 434640 436169 437994 440212 442534 444368 445207 444980 444028 442749 441351 439880 438331 436625
51864D36625k020k437k769k908k952l032l118l045k712k227j773j387r09k24N29
$$ 436625 434605 432168 429399 426491 423539 420507 417389 414344 411632 409405 407632 406245 405336 405112 405641
51849D05641J040J199J233J384J598J668J662J912K540L223L594L723L985M534
$$ 405641 406681 407880 409113 410497 412095 413763 415425 417337 419877 423100 426694 430417 434402 438936
51835D38936N124N461N526N487N469N473N409N107M435L505K629K039J697J462
$$ 438936 444060 449521 455047 460534 466003 471476 476885 481992 486427 489932 492561 494600 496297 497759
51821D97759J306J187R48M83p1n50j095j976l151m286n210o090p058p985q684
$$ 497759 499065 500252 501200 501683 501612 501062 499967 497991 494840 490554 485344 479254 472196 464211 455527
51806D55527r103r158q691p780o879o337n969n350m432l542k898k383j819j233
$$ 455527 446424 437266 428575 420795 413916 407579 401610 396260 391828 388286 385388 383005 381186 379953
51792C79953p57m76l87l75k51O0L90N49N69N88N68L85J36M0O8k6k85m52m16l83
$$ 379953 379196 378720 378333 377958 377707 377767 378157 378706 379275 379863 380431 380816 380952 380992 381060 381034 380749 380297 379881 379498
51772C79498n00o07n43m24l90l71l42n82j274k070k422k231j903j720j594j443
$$ 379498 378998 378391 377848 377424 377034 376663 376321 375739 374465 372395 369973 367742 365839 364119 362525 361082
51756C61082j416j556j593j271p52m28m36n23m11j16J24J85K52O33J335J933J982
$$ 361082 359666 358110 356517 355246 354494 354066 353630 353107 352696 352580 352704 352889 353141 353774 355109 357042 359024
51739C59024J537J102J050J254J353J213J019R88J123J241J172R72R10J149J443
$$ 359024 360561 361663 362713 363967 365320 366533 367552 368540 369663 370904 372076 373048 373958 375107 376550
51724C76550J347Q01L05L42P86J108J085J000J136J365J433J407J552J849J918
$$ 376550 377897 378698 379003 379345 380131 381239 382324 383324 384460 385825 387258 388665 390217 392066 393984
51709C93984J535J009Q98J382K056K337J980J213M76Q5M6J39J53R7R8J29l6n03
$$ 393984 395519 396528 397426 398808 400864 403201 405181 406394 406870 406955 407001 407140 407293 407390 407488 407617 407581 407078
51691D07078j039j320j308j226j268j521k105l048l957m198l573k607j988j917
$$ 407078 406039 404719 403411 402185 400917 399396 397291 394243 390286 386088 382515 379908 377920 376003
51677C76003k159k502k784k742k192j421r89j119j486j669j561j266q51l26K51
$$ 376003 373844 371342 368558 365816 363624 362203 361214 360095 358609 356940 355379 354113 353262 352936 353187
51662C53187P68J052R59O22N05R81J769K172J882J250P30L64K1l02o39j203j982
$$ 353187 353955 355007 355966 356588 357093 358074 359843 362015 363897 365147 365877 366241 366262 365960 365321 364118 362136
51645C62136k539k506k138j949k012k018j882j842j952j976j842j777j882j925
$$ 362136 359597 357091 354953 353004 350992 348974 347092 345250 343298 341322 339480 337703 335821 333896
51631C33896j725j442j322j391j576j811j908j574q72l70n40j152j550j446j128
$$ 333896 332171 330729 329407 328016 326440 324629 322721 321147 320275 319905 319365 318213 316663 315217 314089
51616C14089r42q38n92k08O8J02P5K48O02Q60Q65Q49J163J804K392K610K506K355
$$ 314089 313147 312309 311717 311509 311577 311679 311754 312002 312604 313464 314329 315178 316341 318145 320537 323147 325653 328008
51598C28008K374K633L070L519L861M204M772N564O280O716P096P831R015J0319
$$ 328008 330382 333015 336085 339604 343465 347669 352441 358005 364285 371001 378097 385928 394943 405262
51584D05262J1362J2091J2799J3776J4991J6124J6987J7765J8723J9811K0755
$$ 405262 416624 428715 441514 455290 470281 486405 503392 521157 539880 559691 580446
51573E80446K1503K2258K3049K3583K3620K3247K2621K1738K0570J9254J7886
$$ 580446 601949 624207 647256 670839 694459 717706 740327 762065 782635 801889 819775
51562H19775J6390J4699J2863J0857Q546O062L860K117L76j917m677p424j0001
$$ 819775 836165 850864 863727 874584 883130 889192 893052 895169 895545 893628 888951 881527 871526
51549H71526j2654j5454j8162k0625k2856k4732k5980k6588k6895k7117k7092
$$ 871526 858872 843418 825256 804631 781775 757043 731063 704475 677580 650463 623371
51538F23371k6561k5463k3880k1975k0042j8339j6785j5041j3026j1028r316p873
$$ 623371 596810 571347 547467 525492 505450 487111 470326 455285 442259 431231 421915 414042
51526D14042o651n750n172m659m043l495l213l073k833k522k377k450k552k547
$$ 414042 407391 401641 396469 391810 387767 384272 381059 377986 375153 372631 370254 367804 365252 362705
51512C62705k480k450k433k313k007j601j315j262j284j181j038j103j364j539
$$ 362705 360225 357775 355342 353029 351022 349421 348106 346844 345560 344379 343341 342238 340874 339335
51498C39335j574j767k210k459k120j474j142j266j426j373j363j672k052k005
$$ 339335 337761 335994 333784 331325 329205 327731 326589 325323 323897 322524 321161 319489 317437 315432
51484C15432j418p34m70o79r68j050j113j511k156k453j994j081l91k59m63o38
$$ 315432 314014 313280 312810 312131 311163 310113 309000 307489 305333 302880 300886 299805 299414 299155 298692 298054
51468B98054o30m59j87J36M84Q39J114J175J076J139J639K433L119L498L698L846
$$ 298054 297424 296965 296778 296914 297398 298237 299351 300526 301602 302741 304380 306813 309932 313430 317128 320974
51452C20974L932L995M173M378M295L837L466L711M453M992M806M096L440L142
$$ 320974 324906 328901 333074 337452 341747 345584 349050 352761 357214 362206 367012 371108 374548 377690
51438C77690L036K838K445J936J370P45O1n91j055j181r75o88o70j068j669k118
$$ 377690 380726 383564 386009 387945 389315 390060 390121 389530 388475 387294 386319 385631 384961 383893 382224 380106
51422C80106k242k119j919j756j666j583j350r07m36j23J70Q08J865K936L578
$$ 380106 377864 375745 373826 372070 370404 368821 367471 366564 366128 366005 366175 366983 368848 371784 375362
51407C75362L825M113M843O101P704R340J0791J2100J3479J4971J6351J7474J8518
$$ 375362 379187 383300 388143 394244 401948 411288 422079 434179 447658 462629 478980 496454 514972
51394E14972J9741K1097K2367K3523K4707K5860K6668K6903K6649K6107K5379
$$ 514972 534713 555810 578177 601700 626407 652267 678935 705838 732487 758594 783973
51383G83973K4447K3271K1812K0115J8336J6601J4829J2853J0631Q242N650K730
$$ 783973 808420 831691 853503 873618 891954 908555 923384 936237 946868 955110 960760 963490
51371I63490m51l629o662r694j2910j6295j9711k3075k6277k9096l1298l2779
$$ 963490 963039 959410 952748 943054 930144 913849 894138 871063 844786 815690 784392 751613
51359G51613l3551l3681l3334l2717l1864l0562k8631k6218k3730k1477j9450
$$ 751613 718062 684381 651047 618330 586466 555904 527273 501055 477325 455848 436398
51348D36398j7420j5213j2936j0924r471q503p681o784n896n163m539l922l389
$$ 436398 418978 403765 390829 379905 370434 361931 354250 347466 341570 336407 331868 327946 324557
51335C24557l131l149l212l085k771k438k220k076j838j398q99n92n30m62k22
$$ 324557 321426 318277 315065 311980 309209 306771 304551 302475 300637 299239 298340 297748 297218 296756 296534
51320B96534K1nj88j40K87P85J018J022J049J155J190J073R13Q29Q30Q59Q28O55
$$ 296534 296555 296550 296362 296222 296509 297294 298312 299334 300383 301538 302728 303801 304714 305543 306373 307232 308060 308715
51302C08715L56J26J53L28L30K5l24m22l19k89m09n03m39k87j54n0K3l9l12o81
$$ 308715 309071 309197 309350 309678 310008 310033 309709 309287 308968 308679 308270 307767 307328 307041 306887 306837 306860 306821 306509 305828
51282C05828r07q37n19j55Q8K04L17N06O79O65M24J04q1k0K27M58N19N53Q64J446
$$ 305828 304921 304084 303565 303410 303498 303702 304019 304525 305204 305869 306293 306397 306316 306296 306523 306981 307500 308053 308917 310363
51262C10363J775J411O53K12K85M33L76L90O79Q88O50K32J36L12L23J17M6K06
$$ 310363 312138 313549 314202 314414 314699 315132 315508 315898 316577 317465 318115 318347 318483 318795 319118 319235 319281 319487
51244C19487K56Rk69l09k17k21l58n74q91j273j573j708j736j672j435j059o96
$$ 319487 319743 319752 319483 319174 318957 318736 318378 317804 316913 315640 314067 312359 310623 308951 307516 306457 305761
51227C05761l95j03P0m6k49o3N69J055Q93L15p8KM60J106J688J893J732J652J927
$$ 305761 305366 305263 305333 305287 305038 304975 305544 306599 307492 307807 307729 307731 308191 309297 310985 312878 314610 316262 318189
51208C18189K162J876J320J183J569J920J946K010K379K713K595K189J962K012
$$ 318189 320351 322227 323547 324730 326299 328219 330165 332175 334554 337267 339862 342051 344013 346025
51194C46025K017J738J240P19L41K10K61K21j05n39o84l86M2J03m28j304k029
$$ 346025 348042 349780 351020 351739 352080 352290 352551 352772 352667 352128 351444 351058 351100 351203 350775 349471 347442
51177C47442k296k224k132k170k227k229k254k350k401k275k012j690j329r94
$$ 347442 345146 342922 340790 338620 336393 334164 331910 329560 327159 324884 322872 321182 319853 318859
51163C18859q60r94j162j053o38j41K48M48L55r8o75r32o51p8L98O34P11O85N41
$$ 318859 317999 317005 315843 314790 314152 314011 314259 314707 315062 314964 314289 313357 312706 312628 313026 313660 314371 315056 315597
51144C15597L26J60J02R0M6p0k54m43n06m11k83k66k63m6L51N77M33J66J57M35
$$ 315597 315923 316083 316185 316275 316321 316251 315997 315554 315048 314637 314354 314088 313825 313779 314130 314707 315140 315306 315463 315898
51124C15898P43R86J256J488J480J290J260J459J491J089N98N18Q00J024J104
$$ 315898 316641 317627 318883 320371 321851 323141 324401 325860 327351 328440 329038 329556 330356 331380 332484
51109C32484J313J628J600J026L43N2J09J59Q1K8M3J3q4j28n1J18L43N76P14O91
$$ 332484 333797 335425 337025 338051 338394 338446 338555 338714 338795 338823 338866 338879 338795 338667 338616 338734 339077 339653 340367 341058
51089C41058N98N37M56K75N2q9j41j69j65r5j1N2J89M11N17M02L54P01J248J476
$$ 341058 341656 342193 342649 342924 342976 342887 342746 342577 342412 342317 342306 342358 342547 342958 343475 343877 344231 344932 346180 347656
51069C47656J250R47Q72R31J029J288J717K033K147K379K876L187K891K367K370
$$ 347656 348906 349853 350725 351656 352685 353973 355690 357723 359870 362249 365125 368312 371203 373570 375940
51054C75940K930L287L020K637K840L530L960L683L046K706K834K973K647K070
$$ 375940 378870 382157 385177 387814 390654 394184 398144 401827 404873 407579 410413 413386 416033 418103
51040D18103J989K706L586L755L151K481K240K222K100J935J884J804J502J140
$$ 418103 420092 422798 426384 430139 433290 435771 438011 440233 442333 444268 446152 447956 449458 450598
51026D50598R71R03O74L44K47M19N22L37L9j39k22l25m03l69k82k22r3K75Q19
$$ 450598 451569 452472 453146 453490 453737 454156 454678 455015 455054 454915 454693 454368 453965 453596 453314 453092 452999 453274 454093
51007D54093J258J445J536J754K091K328K379K432K710L115L320L189L057L352
$$ 454093 455351 456796 458332 460086 462177 464505 466884 469316 472026 475141 478461 481650 484707 488059
50993D88059M087M824N195N300N541O107O798P332P724Q255R109J0136J1035J1709
$$ 488059 492146 496970 502165 507465 513006 519113 525911 533243 540967 549222 558331 568467 579502 591211
50979E91211J2339J3158J4206J5316J6264J6943J7464J8093J8927J9683J9991
$$ 591211 603550 616708 630914 646230 662494 679437 696901 714994 733921 753604 773595
50968G73595J9888J9792J9874J9799J9300J8722J8644J9095J9563J9675J9514
$$ 773595 793483 813275 833149 852948 872248 890970 909614 928709 948272 967947 987461
50957I87461J9196J8636J7876J7255J6944J6580J5696J4345J2994J1916J0943
$$ 987461 1006657 1025293 1043169 1060424 1077368 1093948 1109644 1123989 1136983 1148899 1159842
50946A159842R823Q484P026N591M311L182J964M01j403l042m269n296o502p988
$$ 1159842 1169665 1178149 1185175 1190766 1195077 1198259 1200223 1200624 1199221 1196179 1191910 1186614 1180112 1172124
50932A172124r515j0826j1886j2865j3935j5116j6292j7350j8255j8997j9534
$$ 1172124 1162609 1151783 1139897 1127032 1113097 1097981 1081689 1064339 1046084 1027087 1007553
50921A007553j9880k0204k0662k1157k1391k1286k1145k1254k1400k1067k0076
$$ 1007553 987673 967469 946807 925650 904259 882973 861828 840574 819174 798107 778031
50910G78031j8828j7784j6932j5952j4772j3661j2760j1870j0815r767q971q299
$$ 778031 759203 741419 724487 708535 693763 680102 667342 655472 644657 634890 625919 617620
50898F17620p398o180m943l923l078k357j823j402q10mN44M33K5J34J016K110
$$ 617620 610222 604042 599099 595176 592098 589741 587918 586516 585706 585702 586246 586679 586704 586838 587854 589964
50882E89964K826L206L581M024M454M997N816O697P250P533Q044R048J0226J1171
$$ 589964 592790 595996 599577 603601 608055 613052 618868 625565 632815 640348 648392 657440 667666 678837
50868F78837J1930J2807J3914J5186J6681J8531K0619K2594K4301K5958K7832
$$ 678837 690767 703574 717488 732674 749355 767886 788505 811099 835400 861358 889190
50857H89190K9893L1911L3728L5373L6943L8518M0134M1747M3216M4359M5078
$$ 889190 919083 950994 984722 1020095 1057038 1095556 1135690 1177437 1220653 1265012 1310090
50846A310090M5422M5570M5695M5773M5619M5124M4414M3631M2635M1219L9535
$$ 1310090 1355512 1401082 1446777 1492550 1538169 1583293 1627707 1671338 1713973 1755192 1794727
50835A794727L7974L6567L4801L2285K9308K6454K3831K1033J7724J3917R791
$$ 1794727 1832701 1869268 1904069 1936354 1965662 1992116 2015947 2036980 2054704 2068621 2078412
50824B078412N549J500k111n434q848j2400j5675j8346k0514k2371k3860k4951
$$ 2078412 2083961 2085461 2083350 2077916 2069068 2056668 2040993 2022647 2002133 1979762 1955902 1930951
50812A930951k5964k7247k8716l0039l1196l2455l3838l5068l6058l7059l8145
$$ 1930951 1904987 1877740 1849024 1818985 1787789 1755334 1721496 1686428 1650370 1613311 1575166
50801A575166l8873l8829l8199l7473l6703l5454l3513l1240k9088k7056k4861
$$ 1575166 1536293 1497464 1459265 1421792 1385089 1349635 1316122 1284882 1255794 1228738 1203877
50790A203877k2443k0014j7697j5452j3351j1608j0251q998p589o139m974m348
$$ 1203877 1181434 1161420 1143723 1128271 1114920 1103312 1093061 1084063 1076474 1070335 1065361 1061013
50778A061013m349m897n627o004n911n917o618p780q639q990r477j0589j1867
$$ 1061013 1056664 1051767 1046140 1040136 1034225 1028308 1021690 1013910 1005271 996281 986804 976215 964348
50765I64348j2533j2558j2576j2894j3131j2863j2189j1439j0727r967r161q351
$$ 964348 951815 939257 926681 913787 900656 887793 875604 864165 853438 843471 834310 825959
50753H25959p434o292n046l902k746j160J017L365N329O858Q382J0166J2076J3926
$$ 825959 818525 812233 807187 803285 800539 799379 800396 803761 809090 815948 824330 834496 846572 860498
50739H60498J5752J7529J8979J9962K0811K1910K3089K3857K4172K4516K5135
$$ 860498 876250 893779 912758 932720 953531 975441 998530 1022387 1046559 1071075 1096210
50728A096210K5663K5692K5338K4952K4598K4087K3370K2547K1700K0887K0145
$$ 1096210 1121873 1147565 1172903 1197855 1222453 1246540 1269910 1292457 1314157 1335044 1355189
50717A355189J9292J7892J5764J3393J1463J0080Q705O864M611K280O0k063m126
$$ 1355189 1374481 1392373 1408137 1421530 1432993 1443073 1451778 1458642 1463253 1465533 1465593 1463530 1459404
50704A459404o087p836r248j0302j1080j1651j2021j2291j2668j3184j3568j3598
$$ 1459404 1453317 1445481 1436233 1425931 1414851 1403200 1391179 1378888 1366220 1353036 1339468 1325870
50692A325870j3455j3472j3683j3846j3815j3605j3143j2299j1180j0105r195
$$ 1325870 1312415 1298943 1285260 1271414 1257599 1243994 1230851 1218552 1207372 1197267 1188072
50681A188072q234o973n366l522j571L79K344M451O662Q606R993J1075J2316J3659
$$ 1188072 1179838 1172865 1167499 1163977 1162406 1162785 1165129 1169580 1176242 1184848 1194841 1205916 1218232 1231891
50667A231891J4551J4794J4865J5230J5697J5738J5098J3908J2418J0932R722
$$ 1231891 1246442 1261236 1276101 1291331 1307028 1322766 1337864 1351772 1364190 1375122 1384844
50656A384844Q749P612N985M021K130N77n52j205j462j634k013k592l191l696
$$ 1384844 1393593 1401205 1407190 1411211 1413341 1413918 1413366 1412161 1410699 1409065 1407052 1404460 1401269 1397573
50642A397573m050m116l823l296k665j909j099n57m96o14l99K44R44J405J603
$$ 1397573 1393523 1389407 1385584 1382288 1379623 1377714 1376615 1376058 1375562 1374948 1374549 1374793 1375737 1377142 1378745
50627A378745J514J012K14l94m40j20j4m71j315k134k775l511m677o216p716q930
$$ 1378745 1380259 1381271 1381485 1381091 1380651 1380531 1380517 1380046 1378731 1376597 1373822 1370311 1365634 1359418 1351702 1342772
$$ [...]
##END NTUPLES=NMR SPECTRUM
##END=
