##TITLE=AC1681_2977_8571555_gdJ5YHvhbD
##JCAMPDX= 6.0         $$ Bruker NMR JCAMP-DX V2.0
##DATA TYPE= NMR SPECTRUM
##DATA CLASS= NTUPLES
##ORIGIN= BRUKER
##OWNER= Administrator
$$ 1.72 TOPSPIN		Version 2.1
$$ 2014-04-11 20:02:31.368 -0700  Administrator@X
$$ Compression mode = diff/dup
##.OBSERVE FREQUENCY= 400.02188249412
##.OBSERVE NUCLEUS= ^1H
##.ACQUISITION MODE= SIMULTANEOUS (DQD)
##.ACQUISITION SCHEME= undefined
##.AVERAGES= 8
##.DIGITISER RES= 22
##SPECTROMETER/DATA SYSTEM= spect
##.PULSE SEQUENCE= zg30
##.SOLVENT NAME= COFFEE_meoh
##.SHIFT REFERENCE= INTERNAL, COFFEE_meoh, 1, 14.98509
##AUDIT TRAIL= $$ (NUMBER, WHEN, WHO, WHERE, PROCESS, VERSION, WHAT)
$$ ##TITLE= Audit trail, TOPSPIN		Version 2.1
$$ ##JCAMPDX= 5.01
$$ ##ORIGIN= Bruker BioSpin GmbH
$$ ##OWNER= Administrator
$$ $$ E:\/data/COFFEE/nmr/AC1681_2977_8571555_gdJ5YHvhbD/30/pdata/1/auditp.txt
$$ ##AUDIT TRAIL=  $$ (NUMBER, WHEN, WHO, WHERE, PROCESS, VERSION, WHAT)
(   1,<2014-04-11 20:02:24.009 -0700>,<Administrator>,<X>,<go>,<TOPSPIN 2.1>,
      <created by zg
	started at 2014-04-11 20:01:17.274 -0700,
	POWCHK enabled, PULCHK disabled,
       configuration hash MD5:
       C8 4E 4E 5D D3 5C D8 9E 9F 52 82 E0 59 8A DE 15
       data hash MD5: 64K
       1D 77 10 22 F1 BA F1 D7 A9 41 87 6E DD 53 EE 2E>)
(   2,<2014-04-11 20:02:27.134 -0700>,<Administrator>,<X>,<proc1d>,<TOPSPIN 2.1>,
      <Start of raw data processing
       efp LB = 0 FT_mod = 6 PKNL = 1 PHC0 = 0 PHC1 = 0 SI = 32K 
       data hash MD5: 32K
       F0 57 3F 67 E9 98 93 BA D8 F8 39 28 D7 E7 8B 6D>)
(   3,<2014-04-11 20:02:27.478 -0700>,<Administrator>,<X>,<proc1d>,<TOPSPIN 2.1>,
      <pk PHC0 = 95.18555 PHC1 = 0 
       data hash MD5: 32K
       4E E1 06 0B A8 8C 95 32 89 DA CE E6 36 D3 0A E1>)
(   4,<2014-04-11 20:02:27.587 -0700>,<Administrator>,<X>,<proc1d>,<TOPSPIN 2.1>,
      <abs ABSG = 1 
       data hash MD5: 32K
       E0 73 19 F4 D1 95 46 A6 BD D0 1E D4 B0 5B BD 50>)
(   5,<2014-04-11 20:02:27.634 -0700>,<Administrator>,<X>,<proc1d>,<TOPSPIN 2.1>,
      <abs ABSG = 2 
       data hash MD5: 32K
       EA AE 0C 38 18 4C 5A 61 DD 8E 62 C2 D4 DE 01 5A>)
(   6,<2014-04-11 20:02:27.712 -0700>,<Administrator>,<X>,<proc1d>,<TOPSPIN 2.1>,
      <abs ABSG = 3 
       data hash MD5: 32K
       21 C7 4D B1 A6 B9 EB 89 50 3B 89 72 54 F6 E4 E8>)
(   7,<2014-04-11 20:02:27.790 -0700>,<Administrator>,<X>,<proc1d>,<TOPSPIN 2.1>,
      <abs ABSG = 4 
       data hash MD5: 32K
       43 E2 58 E1 73 12 45 DB E5 CB ED CF A0 F2 EC 95>)
(   8,<2014-04-11 20:02:27.915 -0700>,<Administrator>,<X>,<proc1d>,<TOPSPIN 2.1>,
      <abs ABSG = 5 
       data hash MD5: 32K
       46 48 F8 8E 7D 79 E4 0E E7 EE C8 63 36 38 89 DB>)
$$ ##END=
$$ 
$$ $$ hash MD5
$$ $$ 3E FB 13 53 20 20 6B E7 6C 25 51 1F E3 EA C9 A7
##$RELAX= 
##$RELAX= 
##$RELAX= 
##$RELAX= 
##$RELAX= 
##$RELAX= 
##$RELAX= 
$$ Bruker specific parameters
$$ --------------------------
##$DU= <E:\>
##$EXPNO= 30
##$NAME= <AC1681_2977_8571555_gdJ5YHvhbD>
##$PROCNO= 1
$$ [...]
##$TP= (0..7)
150 150 150 150 150 150 150 150
##$TP07= 0
##$TPNAME0= <>
##$TPNAME1= <>
##$TPNAME2= <>
##$TPNAME3= <>
##$TPNAME4= <>
##$TPNAME5= <>
##$TPNAME6= <>
##$TPNAME7= <>
##$TPOAL= (0..7)
0.5 0.5 0.5 0.5 0.5 0.5 0.5 0.5
##$TPOFFS= (0..7)
0 0 0 0 0 0 0 0
##$TUNHIN= 0
##$TUNHOUT= 0
##$TUNXOUT= 0
##$USERA1= <user>
##$USERA2= <user>
##$USERA3= <user>
##$USERA4= <user>
##$USERA5= <user>
##$V9= 5
##$VALIST= <valist>
##$VCLIST= <CCCCCCCCCCCCCCC>
##$VD= 0
##$VDLIST= <DDDDDDDDDDDDDDD>
##$VPLIST= <PPPPPPPPPPPPPPP>
##$VTLIST= <TTTTTTTTTTTTTTT>
##$WBST= 1024
##$WBSW= 4
##$XGAIN= (0..3)
0 0 0 0
##$XL= 0
##$YL= 0
##$YMAX_a= 641042
##$YMIN_a= -543140
##$ZGOPTNS= <>
##$ZL1= 120
##$ZL2= 120
##$ZL3= 120
##$ZL4= 120
##$ABSF1= 14.98509
##$ABSF2= -5.573092
##$ABSG= 5
##$ABSL= 3
##$ALPHA= 0
##$AQORDER= 0
##$ASSFAC= 0
##$ASSFACI= 0
##$ASSFACX= 0
##$ASSWID= 0
##$AUNMP= <proc_prof1d_extract_pilot.lims>
##$AXLEFT= 0
##$AXNAME= <>
##$AXNUC= <1H>
##$AXRIGHT= 0
##$AXTYPE= 0
##$AXUNIT= <>
##$AZFE= 0.1
##$AZFW= 0.1
##$BCFW= 0
##$BC_mod= 0
##$BYTORDP= 0
##$COROFFS= 0
##$CY= 15
##$DATMOD= 1
##$DC= 0
##$DFILT= <>
##$DTYPP= 0
##$F1P= 0
##$F2P= 0
##$FCOR= 0.5
##$FTSIZE= 32768
##$FT_mod= 6
##$GAMMA= 0
##$GB= 0
##$INTBC= 1
##$INTSCL= 1
##$ISEN= 128
##$LB= 0
##$LEV0= 0
##$LPBIN= 0
##$MAXI= 10000
##$MC2= 0
##$MEAN= 0
##$ME_mod= 0
##$MI= 0
##$NCOEF= 0
##$NC_proc= -8
##$NLEV= 6
##$NOISF1= 0
##$NOISF2= 0
##$NSP= 0
##$NTH_PI= 0
##$NZP= 0
##$OFFSET= 14.98509
##$PC= 1
##$PHC0= 95.18555
##$PHC1= 0
##$PH_mod= 1
##$PKNL= yes
##$PPARMOD= 0
##$PPDIAG= 0
##$PPIPTYP= 0
##$PPMPNUM= 2147483647
##$PPRESOL= 1
##$PSCAL= 4
##$PSIGN= 0
##$PYNMP= <proc.py>
##$REVERSE= no
##$SF= 400.02
##$SI= 32768
##$SIGF1= 0
##$SIGF2= 0
##$SINO= 400
##$SIOLD= 32768
##$SPECTYP= <>
##$SREGLST= <1H.CDCl3>
##$SSB= 0
##$STSI= 32768
##$STSR= 0
##$SW_p= 8223.68421052631
##$SYMM= 0
##$S_DEV= 0
##$TDeff= 65536
##$TDoff= 0
##$TI= <>
##$TILT= no
##$TM1= 0
##$TM2= 0
##$TOPLEV= 0
##$USERP1= <user>
##$USERP2= <user>
##$USERP3= <user>
##$USERP4= <user>
##$USERP5= <user>
##$WDW= 1
##$XDIM= 32768
##$YMAX_p= 458140168
##$YMIN_p= -742126
##$CURPLOT= <Network HP LaserJet P1505>
##$CURPRIN= <$Network HP LaserJet P1505>
##$DFORMAT= <normdp>
##$LAYOUT= <+/1D_H.xwp>
##$LFORMAT= <normlp>
##$PFORMAT= <normpl>
##$SURQMSG= 1
$$ End of Bruker specific parameters
$$ ---------------------------------
##NTUPLES= NMR SPECTRUM
##VAR_NAME=  FREQUENCY,     SPECTRUM/REAL,   SPECTRUM/IMAG
##SYMBOL=    X,             R,               I
##VAR_TYPE=  INDEPENDENT,   DEPENDENT,       DEPENDENT
##VAR_FORM=  AFFN,          ASDF,            ASDF
##VAR_DIM=   32768,         32768,           32768
##UNITS=     HZ,            ARBITRARY UNITS, ARBITRARY UNITS
##FACTOR=    0.250966925370066, 1,           1
##FIRST=     8223.43324360094, 97828,        -51709
##LAST=      0,             -92626,          110309
##MIN=       0,             -742126,         0
##MAX=       8223.43324360094, 458140168,    0
$$ Real data points
##PAGE= N=1
##DATA TABLE= (X++(R..R)), XYDATA
$$ [...]
23842 -122126 65205 76092 -257133 -213236 352634 -55025 370401 56294 -115787 11286 -75133
23830 -26256 206228 -400639 -58708 271837 -109747 6545 -6447 6300 -203657 11007 2829
23818 -90896 3403 -122267 -514396 -302065 291766 -3986 -76638 -393139 191781 94899 -208482
23806 -115673 16176 41171 19120 96078 -208963 15477 -130843 22878 65606 -77552 -7754
23794 111632 -163571 -118853 -45317 40235 -264410 -281377 -225967 -188283 -180799 -507 23724 81082
23782 81082 -334624 86896 84771 98449 -273777 45701 39216 -79886 96201 158117 54800 134483
23770 134483 47678 -182379 -148269 27174 -87779 149350 -222694 173424 110053 -214060
23759 -165965 -26507 62719 22642 -292187 49375 -196732 -54919 100822 363060 -193829
23748 -438461 -166365 161089 -139886 265131 -105745 -214179 -107502 -198099 -101803 -235365
23738 -235365 108289 -41738 32517 175680 143691 17337 -135771 -361328 -28621 9459 114694
23727 114694 455214 15968 270462 177276 -108506 80606 242207 259201 30110 2149 159141
23716 159141 -169979 -241720 -115879 302 -1271 214784 66061 165019 238499 9150 -124362
23704 334698 -186522 229949 129530 76595 -139128 15271 -385742 -274927 32096 140946
23694 140946 -4157 -17785 -84248 181554 -20263 -96428 206587 58956 -98831 49093 -11877
23682 -56282 -63259 -93576 -31087 56798 261978 -18653 -73592 -88619 -37406 18495 217204
23671 217204 -405620 -9236 -296936 -346645 -144223 -237006 -150472 -31882 -60621 -13341 -137843
23660 -137843 -299008 47492 89246 -66728 -52325 -445486 -328365 302816 222154 -200041
23649 93197 -123438 -127431 -36045 251711 -7917 114771 -51098 -178388 -25820 123754 271231
23638 271231 -90519 -61378 -15026 -255701 63354 -34065 -119007 197764 -318843 -82639 27598
23626 71004 -115453 -202546 -144235 -292074 13396 -261591 -12634 485306 -111156 100257
23615 -238688 -259203 326221 -151050 -51405 -184331 236209 165721 232180 -96439 49833 118404
23604 118404 47820 -132464 -132099 -67029 66166 -91349 -40443 -97275 -224941 337458 -286441
23592 -218124 17644 30124 40036 136076 -68093 -9302 -62420 -14829 106207 124543 -26247 240276
23579 -25435 23599 393834 -128866 57193 197468 78249 17701 9840 -8319 -192159 -261311
23568 -261311 -12732 65273 28332 -299481 100092 -355645 23860 318567 -107497 -78296
23558 -78296 -41194 76464 179476 -114198 -21555 300739 -369717 -365959 466358 28434 -89872
23546 -60732 114990 -312626 88352 -106353 259852 -188895 -220238 178669 74534 4055 265029
23535 265029 -14619 354968 -266586 -354 -197998 83419 -183865 31366 -92241 121276 374
23523 109340 -35705 -143434 133290 -43460 197880 319739 -209024 -54987 -111736 -54278
23512 164229 -27669 271579 159926 105417 -200714 57828 97594 -513643 -544655 302566
23501 -193959 -285362 -86902 29482 76414 -19409 200415 -15360 146604 124448 -309700 -156977
23490 -156977 16304 -252561 208896 11789 60068 211819 -9617 212249 -95729 -177739 -147504
23479 -147504 57102 22226 -529472 -126116 -213195 -62076 85377 -308483 5324 38565 -279486
23467 133887 84409 6291 108607 254150 143907 -99873 -252171 25421 -28753 -21055 37739
23455 -84100 -81933 -78985 -72428 -335846 -62309 2680 -162239 133117 208847 -103499 107170
23443 -151187 -94815 -171238 -177075 -556392 -49059 42708 -58206 -19273 131150 -7739 -135093
23432 -135093 155571 184972 -37109 280738 -142142 74247 225190 84428 -15616 14023 133133
23421 133133 13311 -107664 -128863 -192754 292536 -143440 -111221 -165498 -226173 47696 142196
23410 142196 -106285 -93735 -267133 -110892 -272377 183776 -181690 55194 -275412 -487
23399 326876 40257 119021 312522 -75761 103339 214691 259978 -158151 -162231 -256540 364668
23387 173649 -35108 -226905 200461 -265109 -56961 -13801 51161 -164326 -113524 -251277
23377 -251277 -55044 -192948 124012 -155787 83194 -292370 249686 -118721 -402561 431471
23366 -48443 157255 -247766 -230775 -1620 101430 282780 -77997 -139742 18719 -111691 33571
23354 -64243 -25276 303276 -237094 5973 209270 -249865 357373 -225599 148685 -159436
23343 156314 127480 -219018 192964 -114012 178863 122656 -135729 -125471 -24696 108888
23332 -19047 -159058 98725 148053 -104292 -38106 -109295 31242 54588 8371 -105549 -106045 -54264
23320 -54264 14742 187404 182639 86237 -31919 -34356 206288 -16308 165989 23019 -327458
23308 66357 93851 18589 -23367 144208 95932 140648 17724 -179620 -46542 63324 -207521
23296 -44543 -107169 -266520 -219662 -138335 -18683 23395 -113226 45232 -78239 49124 101015
23285 101015 173950 257685 -239046 -121576 -32037 -257287 -37892 -317338 65888 -135479
23274 165187 -317239 81202 -118923 -377259 -38685 -246922 73859 192799 413930 198347
23263 32270 75022 353962 -104175 -31714 26311 43540 -82522 31300 -297408 -36393 244674
23251 32608 195246 131360 129110 192928 -96126 -188382 54223 115434 20742 93548 140940 -70761
23238 -37698 36715 -172708 68699 -301945 99019 235248 -100321 -15955 -124229 -20598 25806
23226 -186771 84774 -272136 -18971 -253944 99354 143658 31833 -70510 -149698 -133136 27087
23214 -195094 -120062 77316 -114845 -77003 -89626 -107180 253842 -51649 -235157 163457 59326
23202 -62357 -316453 172934 108844 -77247 -43205 -217087 -6804 39380 18712 -91625 -241444
23191 -241444 -241336 1416 -70718 -130197 -7420 44081 -141482 251941 -162135 404260 -84869
23179 141114 43299 -152699 -84882 -40042 -122900 68706 113224 190930 -66237 -101031 30259
23167 -276540 -4603 69345 -101943 -65499 -131708 -16014 -104779 -90452 -302566 -81821 -150853
23156 -150853 -184659 52357 141111 -405314 -294631 33690 273000 -138228 251671 66733
23145 21231 53565 -68723 -46489 297014 -117316 -375261 -102193 150162 -312930 295964
23134 145308 136103 -268267 141181 291899 91734 -63485 22274 365085 35823 -79099 488924
23122 -390619 -326632 206903 41661 238734 63338 22334 51303 -16794 107858 2366 -38842
23110 -42580 16083 243253 35060 -41583 54519 95017 -249804 -44549 16676 143501 222664
23099 222664 97438 36601 -42544 -46713 -53580 -84475 95372 -108901 -270367 -124259 107109
23087 -16786 254182 -238321 -257548 -125857 -38018 75080 165704 -285358 270420 283441 16224
23075 44877 -128864 -18917 -260468 28885 -303869 -74604 -12431 221668 140093 -263057 112290
23063 -3873 117133 10535 -253781 -15107 153120 -135852 -233876 55424 -104438 -174872 -30340
23051 -140453 -115228 63338 50360 90991 281726 -217623 9235 -122627 -351101 -196162 -192572
23040 -192572 -285699 -267662 119492 12043 -181350 -149052 -10961 63351 104313 194181 53857
23028 -57808 98205 158185 -38457 -103295 114792 -104303 -92300 33248 -86034 -122571 -1891
23016 164377 -217189 -197307 -174312 174968 137557 -74206 -246321 -378456 -148232 266216
23005 -156712 86462 157187 259067 -119898 -236509 89875 116125 276599 -202982 -200881 -169900
22994 -169900 -69387 -8576 84206 164637 -248893 -254795 -310362 131596 -3114 -80536 -321571
22983 -321571 92537 164939 -19308 196591 78377 315334 -38848 191501 -63811 -70652 5118
22971 -157410 14513 102051 -57209 -165869 -28293 -251829 -201428 -33817 -129308 -103427 -269596
22960 -269596 -56417 -159918 -172903 105791 104637 -54744 55277 -78090 163773 -73581 -187449
22949 -187449 190729 -318739 140741 -79198 90534 217990 94085 -125470 238117 247433
22939 247433 -209609 -370344 136854 -359443 92965 -33701 54521 81465 287166 28432
22928 -53951 332015 416669 -393137 -196079 -215180 -149156 -27012 -19680 -44819 -227299 -11378
22916 142976 -132905 -111699 26167 -239205 93242 -294290 -163491 243100 -140563 147748
22905 -97776 59038 -14461 -54649 13984 -107541 -74982 -23371 -129939 -11622 88542 -3259
22893 -146346 -125319 -187537 71116 -248787 60044 -208925 250952 50140 97174 -101637 15870
22881 -52030 -85636 -299580 -201589 120122 126642 -5038 295520 -242018 -217874 226671 -69923
22869 -158005 68376 -391067 -88408 -68085 195040 -50356 356506 -388990 38737 80338 -1967
22857 51278 -83376 -356410 -125255 196811 -216512 -162160 136248 129745 174459 360285 -171151
22845 -65836 -188858 -35514 -260107 81440 287097 -170025 145905 -222880 -208261 -343541
22835 -343541 207376 -157299 206523 103403 272116 4246 -3958 24013 235925 50912 109722
22824 109722 -107952 543419 -71304 144233 -52312 112420 -15150 293645 8827 251072
22814 251072 -189248 -128759 -174444 158696 127223 24688 -41646 285857 155435 -266696
22803 244350 -248396 48332 198080 -81008 86862 -205322 -191952 15295 -267028 -133707
22793 -133707 -302650 188079 128356 225192 25451 220563 -385047 -209837 -173541 -114860
22783 -114860 74658 -96353 136960 70140 -150375 -18343 193483 -196347 -119674 75676 298672
22772 298672 -68376 123711 -366149 11120 -247604 -129224 105529 -14123 144417 37915
22761 -144918 -24525 41146 -55520 152969 -48507 -487 100365 -273341 -19436 -299646 169451
22749 -315596 -85263 -47953 -141382 176916 258304 136212 -354236 -6906 -13918 -222256 30252
22737 41949 -225820 -50911 -40384 -16691 13099 -286722 158775 -57538 78270 -3760 216195
22725 -169990 45556 88039 -181688 296093 -273209 146479 -59508 -133001 -90332 -379762
22715 -379762 -155733 -170375 -225530 -35868 -50559 -216485 120722 -221884 250439 60522
22704 -66878 49364 449 118284 -78624 -59393 211946 182942 48809 -98840 75453 30955 -184596
22691 -317268 -191482 47685 -56296 44340 98094 237362 -445120 -86028 250847 173533 -92282
22679 9736 22305 -148742 130073 67969 -305650 -169683 -280555 494589 79961 18627 -313924
22667 -158485 213431 206075 -478486 50263 -52583 -46663 -303640 156199 143443 106141 -304587
22655 -32985 -197364 -619481 164498 130462 -469695 -132784 124564 -93769 -6442 -134824
22645 -134824 -52221 -116770 433822 199546 -290387 -327614 11898 332 -37929 -272837 61539
22633 -6577 208785 -56303 -5829 -22031 -45829 63264 -159510 -166684 -150257 -74185 -72774 -46166
22621 -46166 79292 -86967 42680 -287947 76638 -73542 368907 22234 -381326 -47381 -16000
22609 -331196 57164 455256 199886 -200456 -356844 -142166 136519 -179204 152927 -135856
22598 -137612 4102 -317622 -180258 58389 112855 -52828 -256199 33852 -407585 476545 222490
22586 247244 -155259 -85343 5203 -166564 3310 -131369 -308940 -72024 -113202 439033 48170
22574 -39966 -42070 -110484 30396 -292150 -24208 -15134 -115085 133142 11799 -88061 -157325 12132
22561 44291 -51505 21695 -197192 -208006 135520 29509 -214440 41616 56145 -91424 147394
22549 481561 -123900 7379 87201 -11741 -52626 348021 131520 129745 -214967 -102013 86440
22537 107653 77428 68183 -310123 -148385 69838 -179746 -185354 112188 37512 -139641 -59745
22525 -205407 276489 106433 -195203 127229 -47120 137200 -395633 15921 46892 -290422
22514 -56666 -14958 93571 -198581 45146 240296 138362 231920 -13376 156861 -12333 34549
22502 139655 -158998 334170 -157761 249573 126890 -169201 -211292 136466 154545 -99937
22491 -104735 -340285 -106358 -268249 13468 112469 -384501 -190190 -306724 -48957 5014
22480 -15699 -206133 18877 -93646 -283912 47213 108961 55258 -79444 -90272 189749 -123733
22468 209848 144979 140707 -117194 7052 9099 -62843 87122 -141906 9021 301799 -126429
22456 -53093 -361182 -212 189341 109356 5436 289476 -50179 -34310 139618 -98131 112658
22444 -364793 99099 -234565 -1398 -212834 -241957 -135014 -196974 48992 -142014 -33558 -33286
22433 -33286 5418 -91177 294363 251924 78580 -464159 -35572 199768 -23288 71515 -237005
22421 -304769 -224534 -140761 -178467 169676 71416 -189928 134058 21689 -132733 34335 259217
22410 259217 41186 135052 259855 27149 -129812 201103 -225380 -236366 -30759 -206723
22400 -206723 -71674 17906 -271004 -114693 -163130 -139004 9811 113391 -680 -264615 46124
22388 -115516 46272 381671 205395 132037 42355 66560 -72544 85332 182962 -330532 38052
22376 34344 -186465 -340039 -39680 -198420 -347690 188035 -295876 -263129 -257482 261638
22365 61790 145713 -137074 -149826 168048 71054 54430 87241 -327460 -167456 125063 -112307
22353 14762 65877 -24877 -114238 44623 -120103 -66535 252252 15791 38709 99332 -42605
22341 -14247 153468 -128183 -259808 130551 -276781 -10268 162556 136008 209995 -201564
22330 58261 -50571 93181 57478 -97715 219780 -57914 41960 -187635 -7542 -76461 -127923
22319 -127923 -118846 -66342 180691 237530 -16364 50151 -140767 -223693 -12382 -176993 169818
22307 141148 137100 -103617 -49255 137941 -238034 -221034 37207 -299578 -219753 91510 -19882
22295 -224384 -97716 -154322 11193 178593 -52461 23838 176937 51751 332605 -231782 282107
22283 -112245 21085 -128197 258274 66967 -62409 -71162 -90616 -477456 126828 -623557 -190753
22271 -20975 -52639 163890 -76870 -344581 -490733 209091 -356878 243270 -255193 -105714
22260 164977 55340 -58323 206973 -16360 130160 313735 -148016 -386247 39486 -39156
22249 239034 -141706 257033 -10936 -105574 121879 86861 -97148 -37682 -150513 -83126 27625
22237 -150620 -148001 -227274 65254 -188506 122566 -168183 -21970 -214806 59640 31025 -416298
22225 -28154 -274900 239073 31712 -41717 269195 7576 -286453 -164807 -12955 262187 308631
22214 308631 -259833 357434 101476 174395 -121722 -124911 226789 73856 -61357 -94221 -177807
22203 -177807 29193 -237658 -98762 -129312 -39486 -131679 247143 -173761 19818 226696 118385
22192 118385 52144 -68292 41399 32814 37524 256545 337302 -151436 155961 83813 -173066
22180 121957 -207505 -74188 -97376 -196312 20810 -81903 -7737 55835 -129855 179604 -201156
22168 223077 315930 34619 -179431 -116435 -354665 195804 -46050 -250455 204869 -236525
22157 -73175 -27180 91808 150349 -102211 130333 227527 -140746 6974 184899 43997 -359595
22145 -144116 -159811 164641 19597 -241286 -28731 37464 -393155 -145459 196542 -160698
22134 -44019 -31266 -312581 -94180 -137871 -146636 -31552 -314790 -118676 -274433 -105800 124352
22122 289253 140261 386291 -115191 -399922 -129104 -101259 -177125 403319 -91693 184916
22111 90549 -145363 -146814 -129036 71425 273060 -108522 102057 -140404 6108 -118289 40153
22099 -111119 -472054 -204457 188545 -296138 -89001 28858 -430128 -41664 -159512 -43709
22088 14312 -189325 -164735 130413 198580 214829 -107172 -168793 -317845 322010 -18945 231975
22076 60385 260052 -70824 35684 -186502 175659 -109926 -186993 -307622 71102 -208422
22065 -110474 -23318 -84533 -75441 57332 277029 158592 -47937 -162726 -328922 -11919 201733
22053 -190768 -360865 -37596 67183 -93944 3959 -361299 -229428 292552 45151 -357331 -129383
22041 16721 -432560 359341 -127797 91687 -66816 -458197 -145910 110765 101664 3557 11592
22030 11592 150716 -87471 -121829 -105626 -92096 -51000 -49231 -211674 -6726 -77992 182155
22018 152846 -231519 -53330 -201111 -230313 -105593 297780 -84546 537575 274979 -206373
22007 -67755 54273 -240405 95698 -209501 -50769 -194897 -262817 -12988 89313 46518 -207778
21995 -13479 26222 42767 -54457 56477 -351570 -20845 -223125 43677 19441 228740 -181824
21983 342920 -89425 -253131 89808 106177 225865 -127942 -173997 173202 -15931 -39555 -206718
21972 -206718 36935 -6152 9366 -74034 -57378 57734 84400 -184471 -61356 37109 -97251 42599
21959 107440 -10885 -200901 -30673 -168740 498 323487 86601 -131728 49228 79670 -108548
21947 -204864 213945 78258 -224264 316157 -38441 -376306 22244 -156451 222607 -133289
21936 -208216 -57136 -66492 32784 -252154 65304 4600 119696 -30397 -31296 -198929 -371751
21925 -371751 72994 -254947 186201 -152973 -198658 -515294 231817 27169 111898 -27851
21914 -51876 164015 192410 -38921 20636 187133 -424193 83769 -340399 -378418 80970 133254
21903 133254 -208810 -132742 -30573 -265387 49599 298107 17667 -117452 -127163 42853 -133444
21891 140247 -201613 -33568 -46500 -273408 114490 156724 -28754 -20622 97066 -666903 32480
21879 179060 -42324 127033 -57053 -97992 58353 -35360 132287 371482 -112106 -90889 -112851
21868 -112851 -128341 -49605 -73081 -167780 27146 -108974 115780 -44767 332379 215934 -243155
21856 -214908 -424105 285586 -53303 -183853 -22036 -384535 -261569 -203729 -87388 -156448
21846 -156448 -275388 -318117 64118 24444 -113203 212096 -103650 -31418 -16271 144622
21835 88632 49545 -11293 -156690 190611 -37696 139055 -206750 216463 -176928 7465 99980
21824 99980 -25543 210860 -82662 -42123 19446 -194782 -107433 195464 16102 -176728 158776
21812 -256849 -327414 203031 89424 -68551 -214505 -109943 -42940 -188507 20956 197611
21802 197611 -211865 25662 -33590 48746 47197 135631 -134190 -58256 -30173 74247 198200
21791 198200 66485 6053 -16384 374422 217754 -173794 59203 293111 -151359 -20145 -212537
21780 -212537 -231314 -105571 60665 246932 -144518 198479 281853 46655 207368 -116694
21769 -79195 237211 42552 269500 210250 -204082 -355522 -172994 -67125 -115022 -145686 76970
21757 -72302 102104 -169456 324857 -117233 -307045 -177285 25957 30604 -170757 179725
21746 -281787 237709 67020 -80378 25453 4409 -321472 -102802 422744 -278038 -70380 -333309
21735 -333309 -172364 -188313 224144 289125 27813 -4825 128793 -18708 -46026 -78372 -126682
21724 -126682 -153253 -255882 -129297 194698 105303 -432934 -75921 16245 2386 -267804 -29244
21712 -252328 -187915 148125 19562 -244558 -278660 -145992 -97583 211253 98481 -300836
21701 -17864 167012 319930 -175557 -43360 128973 463368 -299964 -74360 -19286 -173973
21691 -173973 -44659 -1847 12830 -89134 -190147 -62031 68655 -20844 -63598 -181571 -187810
21680 -187810 -316453 -74727 191417 -105952 -3893 -376370 143433 -263760 -21972 -315022
21670 -315022 41940 55738 192569 363122 71096 -143273 -13766 31183 314462 -155060
21659 -213285 -217067 -242024 179655 155704 -41729 -111551 139295 -79318 -352029 -85747 -79723
21648 -79723 55457 -39031 -183375 -208117 -40591 -201015 47245 403738 -211560 -330736 -81404
21636 65026 37936 67302 243018 244932 -268851 87509 -250809 218702 42335 53655 48124
21625 48124 -171478 -97883 -106735 -278082 149769 -277724 156320 -412368 36815 92137 -159796
21613 250473 -74909 142216 153094 178253 -171844 -209658 97313 -240691 -343258 50634 140862
21602 140862 -304946 78298 -194688 -96916 62323 155549 -34603 -70096 -20540 -4203 211467
21590 -301983 -14178 -202204 182568 48296 13412 -137474 -157611 -108244 -187867 -191040 -219111
21579 -219111 165170 -129740 60185 -9901 -265153 136455 30734 5927 -70041 -205449 123996
21567 -208728 26503 13567 171402 272079 95191 -6083 -316444 52431 -290013 -246468 -323635
21556 -323635 232513 -9187 -79317 -205016 -138783 -213792 20680 -177085 -84834 315758 -144141
21544 -288447 -148321 -169706 -428316 -137618 42007 42177 -119008 17462 -171843 -181129 -11167
21532 -148119 301357 9703 185880 -185623 -51677 80409 -308780 -20724 -214150 18943 -324237
21520 -115267 -278269 -10054 136397 134594 -38481 -257234 174044 -9100 315925 -191726 265345
21508 -180660 110973 41938 -182589 5451 -175772 158590 -166928 -74582 -35014 -236536
21498 -236536 -38300 -19866 86931 30272 -174079 -36907 -23232 -478 -212771 -88859 148145
21486 -290684 -182473 -15320 -54966 384720 -184140 -69389 -77800 -57591 -398411 -82565 -92667
21475 -92667 -195784 49703 307066 83123 -33062 -53625 -257099 78557 -223756 -77647 -16437
21463 -113934 -32522 -106646 -151657 -267056 -140380 -47264 -91997 -246687 24352 -170515 -4830
21451 197236 73245 33849 59034 -222169 156246 -131204 74605 101356 -281942 -66724 -88485
21440 -88485 186940 78488 146435 65403 148374 307840 345593 365116 -34192 193927 -2169
21428 -190711 51952 -223031 -113033 201564 47112 -125288 13015 -140275 -148500 -202295 -92445
21416 21438 59659 -128075 40954 -125426 -253288 -80949 -160052 -39916 -196980 104650 15153
21404 192484 7944 120574 -33529 13780 -203838 157785 137274 -37745 -111371 175450 -77226
21392 -218866 32172 -76386 -22690 -350588 -187654 -150969 -185375 20875 206552 3587 100021
21381 100021 -196827 -257308 85318 -299555 -259502 -3674 54744 215572 282719 -132164 -95606
21370 -95606 -202729 -95143 120536 41083 -156933 48221 28395 -219722 -105941 73294 -208482
21358 18475 153639 -94530 -134548 -20336 69169 -138376 -210986 262059 -347084 -124650 16613
21346 123514 -237 21110 72869 134647 -51161 194583 -240471 -79183 48138 -159015 -95770
21335 -95770 67908 -36115 -217566 -386917 -106349 62846 -214204 114935 -62648 106465
21324 280861 -261199 -18445 -5424 -156092 55371 -50251 -135401 -186163 290198 169784 -335590
21312 -194086 -304044 -61158 -284577 135371 -24772 -19418 -181658 -225139 175806 373586
21302 373586 42477 277475 102490 189355 4349 -93950 304790 -194568 -191527 -321837 139269
21290 -14526 -154010 -115644 44776 30138 121145 -66988 -171366 185604 -100669 18512 -103438
21278 -113829 -189397 -178075 70962 275211 -163925 137002 -165101 240224 -13044 -44746
21268 -44746 183338 -117650 -174741 -177336 238082 -208466 294697 -438445 138493 -108676
21257 46007 111799 -33040 -218775 37345 28673 -158310 -412997 -37807 -113377 -403185 -206140
21246 -206140 198756 -174920 -351182 -299510 -87379 -7030 112422 170904 -58586 -5219 217109
21234 -411884 -234018 184462 113667 12325 -328017 -289602 -82188 70750 -262426 -86773 -351710
21223 -351710 193167 -363389 -105998 203750 -158879 70388 -307879 -466727 -22589 -35227
21213 -35227 -284339 -140270 162308 -117794 -797 137406 -53622 -122415 -120345 29033 -289589
21201 67882 -154534 -60540 -154787 -315281 -230613 151127 -331807 -143551 127063 -118570
21190 44309 -28965 -171640 -250928 -174436 -94570 -263091 -317896 41305 -236683 339642 101860
21178 -40388 -131475 -233662 -44606 -270133 30707 309963 -199232 -194549 180829 -146213 -166542
21167 -166542 -53727 124749 -238335 -378349 76568 -221214 131239 66002 177408 -64090
21156 -238761 46237 152355 -57594 25562 -98513 -80932 26945 -163922 66813 -195354 131003
21144 -120022 149433 -62874 56895 -78655 -219147 226330 54838 -41785 19653 -171864 -130763
21133 -130763 74984 -57013 -151612 -344743 -148910 -127644 -241847 -143062 -113177 91816 -14625
21121 -202684 -196587 198165 120415 -189312 -199978 12280 35249 -76994 122805 126201 -350055
21109 373517 -239093 -138497 -390475 -175266 -123691 -22429 -255022 34736 -202724 58073
21098 -324871 41663 295485 -134751 -121645 14351 -39963 -173819 -3583 65497 133131 69578
21087 69578 -290418 -218667 -176387 -185698 -338960 -183891 -237247 -188945 240219 117415 293922
21076 293922 253173 56366 -109051 -491774 -82793 178096 -140815 -340789 244214 132254
21066 132254 116422 -44113 176753 138239 4818 -85392 -199202 102049 -28679 142981 -146657
21054 -287763 172116 -107649 46058 -72711 -206765 37348 36230 68884 304074 -135817 -457748
21043 -457748 -35454 -106984 46530 22618 -163545 -225811 -28736 -185165 -148361 -257973 -222137
21032 -222137 -105645 124318 -22191 -46294 -99189 62557 -389133 -189829 194870 -32162
21021 -268977 193554 237245 8623 -451747 -55468 -22066 77392 -98673 56572 165926 105723
21010 105723 39101 -128984 99742 -8517 177255 -185017 -44965 -336153 -77508 186170 166201
20999 166201 401695 -358307 -4442 102443 -160682 -104405 92008 -335768 61931 173461
20989 173461 228066 39498 519 250515 -87186 16853 -311447 -38838 455094 343688 234484
20978 234484 -64780 -68773 -17629 27070 78026 -193769 -70713 143458 143261 -134751 -444479
20967 -444479 -304784 149920 10159 -82089 191227 -147835 77134 -313190 -213378 50725
20956 367217 117198 -147216 -3583 12771 -59312 207413 139476 150709 121633 -251034 -129836
20945 -129836 -156732 68078 -1584 -91292 -9521 280737 -116578 150367 127895 -38960 -268182
20934 -268182 -289046 -136620 93557 27887 -20290 270391 -453676 -421226 -218814 299441
20923 -257178 -75380 -401589 -184102 -73154 -528698 134666 -110812 -5921 60747 -273726
20912 -150759 -71250 -203762 -228522 -458323 64859 -110147 -32111 157706 159204 84567 -107081
20900 -40520 -102300 -45360 118838 195439 -8232 -94968 -123209 -65543 -170272 -69501 -275470
20889 -275470 17378 37173 -192475 -111804 157797 -180181 109924 -165773 -182041 96194
20878 -97225 26111 -191587 222705 28074 147676 -229136 -101031 -241572 -217951 -357320
20868 -357320 64756 -380185 100180 79980 -184676 -194520 -70388 -119401 34425 -33282 -177351
20857 -177351 -184357 -50922 179007 -430422 -161077 252876 -56190 115693 -12996 148942
20846 -154114 -255439 -83773 -4689 -136389 -56880 -246632 -233614 164034 -180047 112938
20835 -284433 -169183 179684 -162776 -113862 -388911 84416 -179132 55775 -276197 -116795
20824 -435512 -387385 -203818 -37812 63740 -194385 111370 19082 91653 -179156 90098 -422435
20812 -48691 -193049 106331 1845 -111381 -453101 47563 35900 43243 108182 -40135 -144374
20801 -144374 87206 -251195 -206063 24451 -220373 58139 -70390 69406 51014 -151604 16183
20789 -268873 68237 -146561 -117507 26600 -12737 -224250 -50113 -313359 6252 26678 -231636
20777 148424 -57508 130814 47649 -335704 -175846 308299 -268839 24229 116963 207525
20767 207525 -171686 -550098 -209506 17356 -166229 240690 -33822 -46192 -146979 -310280
20757 -310280 -112099 -196335 -274761 269634 -155500 -114918 376243 -301330 -77363 -200041
20747 -200041 246013 -141525 -201992 -195731 -26871 -329091 -323828 -372641 -78891 228376 94345
20735 -129472 49170 -56914 -488940 192452 -183231 -234061 -22885 142513 173014 -77171 -236886
20724 -236886 50953 -8376 -210058 -111959 147273 -373807 55788 88625 47977 -29915 187745
20712 40380 -163980 -352461 -247255 -216000 -200150 219944 46197 -159132 321405 -342166
20701 86620 186839 -200447 89216 -188612 -14797 143342 -130622 23052 106937 83670 48791
20690 48791 -105857 -273971 -253307 -7881 -89967 -230810 -196050 -28088 -413043 -166173 -446058
20679 -446058 -66726 -224327 184388 -97066 9772 232966 43977 220189 -79982 -267838 -243692
20668 -243692 -177618 100941 -102048 23327 407040 -94307 -12195 -110080 75462 38690 -414685
20656 250424 -37005 -150024 453487 -101904 -397776 -88923 -6553 -164067 38842 -464673
20645 -213301 -375534 -55253 -207453 71331 -21793 -313939 52577 -79372 -19754 117896 -240803
20633 -77647 90746 -214912 -84101 56945 6966 -86481 70264 -23983 -128325 -332519 -263987
20622 -263987 298813 -22001 -148382 -329062 121909 -315642 125391 119022 -409233 34136
20611 346077 -254263 -367591 73658 -312084 -110271 31356 79409 102272 -301702 142689
20600 67186 -388365 -187837 -82852 -123494 -104562 -277940 332861 -183510 -122088 52728 34764
20589 34764 227699 163497 134064 -48889 177970 -231213 175820 135420 -22240 31312 -98221
20577 -63471 232900 -27217 -65046 -96605 -244255 -28390 -343231 -603100 90986 77471 -34019
20565 -302851 -34442 166029 -132453 2062 -21890 -61356 -337861 -419669 -91981 -74355 -235165
20554 -235165 -205810 -103504 -166580 -5561 -244829 96393 -2315 -59782 293265 -118135 -44898
20542 -246488 68470 -408386 -100964 53431 -137952 235213 -140853 57810 -104064 325459
20531 27071 102824 -162893 237095 52913 38042 11562 -21564 -144134 -253061 -136686 -247214
20520 -247214 46788 -2666 -184445 -126586 50880 -77000 85007 310658 -21187 -110984 -174901
20509 -174901 -261793 -6237 114134 -100670 -24231 -198231 310187 83290 103569 -144500 -14073
20497 37490 35483 -180922 -164273 120016 -66624 157865 -135791 66924 -100459 158997 -187578
20485 -21281 3298 -267730 -11055 116711 -38279 -306647 15946 -295565 65713 89072 87553
20474 87553 -21776 -137980 -366388 -74136 -245733 31013 -59870 29109 118092 -103819 -157253
20463 -157253 292906 -227941 103918 -242906 65747 97934 30430 344107 96483 -125946
20452 -116859 -158647 85085 172585 268087 -354019 -23813 -207388 12790 1299 -115303 2465
20440 -416031 -92368 -79056 -44459 -75856 -26727 -198060 -95290 -201355 47744 -328233 -36779
20428 79 258653 -29990 -178005 263589 145046 -87982 -460580 -20805 75749 -363159 46864
20416 -64165 -24986 -198984 -176331 -69837 -133812 -333647 275111 -54754 -37290 -281880 -215623
20405 -215623 237040 -140314 -79639 123388 -177357 83207 -1245 163920 -77538 -177475 -61166
20393 -1402 -274645 19277 -156628 28920 200617 16720 38555 -255532 -165121 22248 -250290
20381 35050 292159 124028 217295 -75950 -309357 -63929 -128679 -262038 -10667 84203 201374
20370 201374 -341510 53801 38787 -110482 -291991 76544 -36638 136047 10655 -21005 -100036
20359 -100036 -426409 -2755 -189232 -602648 -168855 119895 260136 188128 -140554 100166
20348 -352616 206250 -554827 -7212 51034 -17658 -155323 56567 110574 11015 -78397 103950
20336 126869 225978 -122457 -200195 -203966 162718 47567 125424 -21617 289340 -175714 -257413
20325 -257413 11110 -99919 55929 -136463 -5062 -196129 -152256 -242520 -10947 -7363 29217
20313 14469 273145 -78169 -187067 17678 -370820 173646 -145689 -239895 -23493 256787
20302 88648 331865 125644 -272345 -123235 182130 -18984 -61794 475389 -87923 -223955
20292 -223955 -61669 -45895 -9950 76860 -67493 -58364 -55068 -99913 -143650 -126030 -65480 419774
20279 57158 -37183 -49022 -335108 -134268 -288168 22699 -95831 228568 -154463 -367427
20269 -367427 -189857 -134013 -462540 -19452 -110544 -125882 -28005 217836 104291 115308 -72084
20257 230999 -9505 -183891 103977 -203716 33538 -166760 -128653 -198190 -62924 -44935 -383595
20246 -383595 -90868 129721 116013 -128944 -15743 -399862 102757 62001 137262 -298207
20235 -224589 -4297 110441 -29845 -40162 -460074 113899 -10946 75489 -190766 -165500 -88267
20224 -88267 -183926 -213537 -124744 -345472 179945 -60624 -41887 -324521 -101483 -38682 -259555
20213 -259555 -10651 -73838 14413 -115322 -48462 460368 1527 -1491 -849 -281245 -30388 190618
20200 -184082 3955 5245 -11028 232 -32951 -278334 -15594 -148916 -141103 -204183 -29485 -108862
20188 -108862 -407935 215311 353525 -168220 122626 226525 -240447 -125515 412326 28030
20177 20945 14942 249967 160392 -146834 9585 105162 -231717 -110331 -190846 352701 214711
20166 214711 30566 52830 -259259 -62335 -48639 119681 67566 17853 -385761 -51774 117020
20154 -135342 218613 61791 81848 -137917 40424 95155 -294047 -10627 -151944 -393063
20144 -393063 -88053 93018 -83130 77891 -468956 143494 -299276 107972 -59929 -254134
20134 -254134 -231091 -171171 25640 -157220 -61362 -179233 -100630 -207162 62310 -5444 74484
20122 -61131 105708 -180549 -191386 30348 -213841 -109605 246276 -64561 -156507 -94250 76676
20110 42796 -105071 -62019 -74273 -122776 100787 -71910 -65600 161011 -115721 -247838 33685
20098 -95118 -77504 -123747 -141026 36459 91137 76257 147779 -138473 -157535 -86274 -147506
20087 -147506 119698 186752 207937 34316 -173808 -141952 153634 -148660 373898 -140236
20076 -133926 -248413 91514 54302 130513 330936 -139197 -146725 -34529 130460 -120750 53194
20064 -62429 -23519 -164217 -10032 -50904 71903 -13155 47196 -201217 -169580 72788 63850
20053 63850 212253 -18800 -157295 -117626 -447186 -36249 -172076 103222 -301370 -165459
20043 -165459 -142665 -149993 -134651 -235614 -268814 -61413 108825 -230024 34412 -279176 126546
20031 -128578 -168301 58635 -176470 -167229 -130047 169668 34614 -138285 -164656 -106656 49846
20019 42568 215923 60437 -126205 -147955 -76980 -163785 -122830 43506 -34578 -264151 185662
20007 107284 -155136 89193 131877 -103498 50865 -265777 -247031 -237024 -312187 -136332 152931
19995 144366 -23168 -39937 255797 -200251 -356923 -85033 -118596 -255078 -216208 -70454 -47350
19984 -47350 -72412 10972 -68032 -121389 72414 -23815 -243386 93727 -291975 -104366 29782
19972 72700 -9120 204478 -461785 23080 -80690 -11751 -176145 40836 -275372 331715 -169792
19960 106658 46341 -102452 255552 -311642 322045 -56759 -128419 214832 34211 -118813
19949 -190132 -402707 -244419 74440 -99410 85151 -299062 214798 -46020 -207492 35817
19938 -69207 207767 -38505 -5680 -135901 228170 -30363 -80698 -80827 173670 135107 -55197
19926 -401444 -170615 -333140 85566 -186839 -197141 -268832 231387 -165075 -293804 80887
19915 3212 -26217 -55982 114895 35378 -130466 -37899 35634 -63388 -250303 -13903 53855
19903 -216191 -343060 -395091 -176774 -128822 -89858 -84912 -4902 -50402 -225460 -41675 -116874
19892 -116874 16076 -50688 -120943 68638 7032 -190995 -291173 -229491 -193334 15465 -21644
19880 159291 70040 -218849 17932 -123539 -88751 -6309 39820 -219464 100248 -151945 -73760
19868 -401758 10605 81296 -25192 -85073 -53343 -175707 317947 62072 -247927 -36196 17766
19856 131724 256657 -13050 -228823 -223653 22447 -59934 -92724 289008 95059 52126 -47489
19844 -85295 -159076 41242 -52561 26094 -213558 109047 -27439 -3595 30696 285082 -535551
19832 -205835 -404007 280186 57658 110566 -25675 -302052 -77906 -43328 -33713 88869 -270676
19820 -66167 268510 -393948 -396207 129026 -163438 -321841 97336 -145158 53426 -59433 -571394
19809 -571394 -540 362314 -223680 199876 74228 -376784 -64926 -115204 -75882 -37005 -79604
19798 -79604 -146283 -91547 -162790 116212 -23739 71102 -150102 -193446 173130 77152 16353
19786 -31109 -20265 -18705 -78419 394722 -61685 -175720 109396 -105278 44869 -149542 -197544
19775 -197544 -44790 -68650 150561 408014 -198644 -80676 15273 106700 -140910 -275599
19765 -275599 129407 -172406 401220 -187533 -318976 -88733 60174 -219449 58650 -21738
19754 -30069 -100824 -267458 -270770 232430 195380 -175592 -289466 258094 -47733 7375 309778
19743 309778 -116649 -354211 -104168 -249859 -329443 7154 69992 57648 163283 -236447
19732 -174290 -483078 -49386 -148102 -303052 -81183 -177381 -358709 -243334 -1888 249814 89926
19720 -104662 -127662 -105951 -171501 229312 -246364 -239452 -75451 -40485 169777 160921 -304369
19708 -259503 -77274 54195 60906 -73087 -165339 -72007 6609 135070 -23179 102619 170150
19697 170150 -81451 -72096 -17164 53075 128711 -272519 -12006 116775 -124564 20981 139340
19686 139340 192321 -29141 -166839 -50502 97861 67861 -126662 87885 -25899 -193554 185765
19674 -171941 -187495 4225 -2262 270936 32458 86221 57055 -174671 -198200 156180 143615
19663 143615 -118733 -46981 -392282 -59241 -238658 -87290 -216479 -135973 11079 4644 129399
19652 129399 -20388 -182654 294013 18457 -287758 83934 -69843 26903 39132 106347 16748
19640 299326 -47782 104257 -185304 -178697 143209 -443848 -287955 41287 -516705 -339514
19630 -339514 -339181 84346 -96195 175928 -167280 174493 182010 -285334 177050 80830 32745
19618 -59354 -274696 -98435 -53873 -268373 224174 -207343 82030 345691 -44698 -41999 -33231
19607 -33231 89840 -136402 -494785 -47102 140247 175720 -427362 -184532 -99310 41920 7646
19595 -106709 262719 -119284 -272779 124951 -41171 18570 -305705 274865 -143385 -22410
19584 53958 -189698 30890 -339750 41742 154096 160598 -114097 -198024 -328506 47539 -12234
19572 -234958 -26134 -16111 -272244 -260375 -54953 194145 18312 10291 -155246 -74837 -67215
19561 -67215 302340 36701 -172978 -229764 -340374 -579873 -50400 -176241 -192940 66198 -145434
19549 275708 110677 -173091 186126 -385258 -114554 -223975 202395 -164566 302919 -31496
19538 -174065 -254006 -110832 269544 -54819 173290 -76395 150009 -63103 -49620 269298
19527 90529 -44776 -220521 -216188 43612 -202355 7759 -143949 -198579 5066 -401475 260343
19515 44863 -12056 32314 -337960 90327 -251907 81894 129560 15030 -23076 -44108 237169
19503 -153353 -2205 214863 -273972 2046 -267426 70168 -310465 -261833 -289934 -109338 5608
19491 -287436 119917 -162598 -108825 9903 -114909 -83177 -189540 -110767 154790 1728 -203374
19479 -158792 -159584 164308 48811 -82689 35339 -86036 -11247 111807 229156 50912 -496147
19467 278058 -279731 -145097 -182719 88486 -52619 -128918 168431 108067 -465597 70018 -48673
19455 168677 95455 108543 -229908 -238721 -162378 -157425 -200153 -209266 -43910 4419 -173850 -170597
19443 -170597 -265086 653277 37223 -68955 -176534 7503 -29672 -90938 -55509 -244302 -1636
19431 -113628 -203279 10735 74326 2735 70169 -226654 -1489 -162432 -17140 31087 -117736
19419 -45292 -90850 229811 -159695 -55396 -242025 -214085 -132227 -117692 364297 -378217 10180
19407 -302769 -16389 38268 -3058 -24161 113937 176577 -173206 -178322 -21163 -20072 -470618
19396 -470618 -22351 67385 73073 459391 155294 -402164 -240544 8001 -220209 -115438 -186888
19385 -186888 310825 -71697 -206571 -38199 140504 -218330 177101 192034 -74644 -145161
19375 -145161 78982 -25832 41171 -342484 53892 -109294 85472 -147033 -203570 37437 -146352
19363 153589 -401179 -49274 -413642 131357 -18268 35585 131891 -224738 94418 89044 39800
19351 -184727 26517 24893 -213156 -137130 -151017 -142813 -7811 43611 16458 -106090 294555
19339 -270432 291316 -25874 52434 31178 -216469 -68529 -86965 97832 -63730 -165333 -155351
19328 -155351 35259 -3746 -51992 -171818 -109080 -387030 -154775 -127667 -4026 420168 -330893
19316 -98838 -90067 187083 -54550 43440 81225 -33076 -24163 -144338 -55424 -376600 -225066
19305 -225066 -162439 -109187 -65164 -133998 106434 -71141 -38117 169575 152554 -23119 -159533
19294 -159533 -32087 -219866 139363 -165277 -43948 -302309 -17537 -137317 -72055 13742
19283 155043 -59222 -310504 -139364 -275702 -31157 -163950 104477 -52207 -69880 -215855
19273 -215855 9642 462640 118048 -274548 16012 134197 -443013 -310336 -34655 31499
19262 -155533 -153624 1108 -166216 258294 -165910 -189924 -105971 4037 -238696 350606 102128
19250 -43963 37397 101064 -215060 -139454 186844 120096 -186505 183704 243549 198333 -111753
19238 -330226 10673 67609 -228094 -131813 117742 -107777 -218998 -49251 -404276 -52796
19227 99538 -30296 -79672 -111967 -120536 57298 117784 -39616 152499 62817 -239637 -88712
19215 -84870 198496 -42273 -324070 137813 -151066 178578 -183164 -33376 -214413 -202015
19205 -202015 -321572 -333318 -189869 254605 152168 27100 -71077 104572 -239577 70060
19194 117679 35484 -267806 -213972 7105 -343113 -418175 -36690 -154371 187998 -155086 100101
19182 -302556 -16782 -100597 -186616 -209241 -170408 -182857 -451860 50558 -144238 -38061 -84215
19171 -84215 49083 243174 -333090 -211072 44370 1107 -16295 27782 -51793 -220106 -423991
19160 -423991 -64106 -131852 -166137 -348083 -48682 -19498 -10154 -48074 81697 -5953 -106934
19149 -106934 -56549 32608 -41699 -37947 -59273 -128506 -23539 66198 -2928 23250 -321718 -244383
19137 -244383 117647 -255574 63302 -141767 205120 -165508 158951 -211892 23877 252708
19127 252708 -52042 -132574 -318327 137551 30751 -258723 112333 -34265 -180424 150635
19116 28538 -237211 212575 -5576 217722 161083 -100485 208746 -234157 -102986 65967
19105 -36832 197639 240697 95789 -61057 -320849 -338082 -47149 47413 -256339 106100 109185
19094 109185 81210 136300 -6695 -309956 -63226 59988 -26259 -281086 -142981 -187926 124829
19082 71410 -90216 -160534 218913 -126072 -375615 -155058 -218474 -199885 52280 -199241 99862
19070 -188254 57688 -139689 -78855 -56814 79066 -19132 52322 -222628 -41625 -225390 70915
19058 214594 -45626 -315008 26212 19922 -140521 157125 -70529 37129 -211026 43551 -52612
19046 25157 -97705 -174203 -301277 -233780 166958 -73387 -64028 53905 -73082 -163957 -6266 142873
19033 -309795 -40265 15354 -171279 142495 -124439 213783 17618 167173 307706 127541
19022 48982 34150 180944 372321 -196905 80539 -143176 236761 -165285 -65118 -178295
19012 -178295 -218312 244913 -46307 -243007 -73799 -102372 -50799 153631 -124296 261065
19001 -322131 -72284 218471 -269769 105999 -122580 -57094 -238612 7322 -214956 160439
18990 106759 -195509 251898 -39209 -24801 33155 41055 124104 -229777 -47365 134845 -392790
18978 -181978 -276914 7003 -35245 -396919 -71676 22756 41627 -431596 -445204 5934 51750
18967 51750 -42757 52419 -55656 -154119 -152905 253986 -51865 88885 202728 60309 48791
18956 48791 -49188 -39217 -97215 138373 -260436 -70205 -112918 -258359 -190792 272190 -91601
18944 276781 -99378 131083 -223072 65499 -69317 148035 19838 -182880 -126154 275682
18933 -190710 -108035 -84194 45443 -76150 45338 36185 100022 -511847 34947 132035 6490 -91628
18920 -291151 -348448 61593 -229234 120827 -105332 -225234 -366125 -207516 -156488 -42628
18909 -115685 14778 -148589 -538661 211636 -171875 63254 -230898 12756 -107394 -163594
18899 -163594 -50346 -63004 -208888 216215 -323179 279894 -201885 -111325 -219983 315222
18888 -200336 -215870 -60172 -143018 -52685 235196 -21848 -243280 -419031 45915 -48713 -223515
18877 -223515 -79213 -97387 -32987 64675 -5116 -190879 212465 -11208 -106980 -131195 184305
18865 -53508 -119007 -7761 67657 245908 -255100 -69567 -347449 -366233 -47474 60487 3843
18853 -87845 -170343 33978 52458 9562 -11618 -60179 -179685 287582 -101545 -192162 124762
18841 -173385 245724 -148597 -41761 -277619 -301283 120654 -122942 -482500 -27901 -437900
18831 -437900 138339 -290823 -85370 74344 211219 -199710 86616 109029 -105151 113034
18820 154071 -14263 74298 -242621 313191 -70773 -22738 543453 91561 280968 154294
18810 154294 -20696 -32229 242752 123034 211481 112578 485440 147562 -101197 45454
18799 39732 -28407 -33388 -60876 -56580 158260 -372602 18618 110275 -129906 27182 -28530
18787 56217 -195335 -116035 -301347 2900 -31386 232881 -295897 26990 -294276 -22914 -177126
18776 -177126 148666 -111574 -287479 -259838 -163224 -267307 -216945 3072 196794 -120600
18765 -35921 52529 -144783 98715 132072 39202 -316796 -21084 118565 68454 -352982 -141287
18753 -126299 -267056 -278179 -90788 28336 -243373 -228556 -56905 178984 -199039 -54929 57188
18741 -122955 110919 80853 -163575 -158066 -141903 -434482 -421328 -100660 31766 64027 -110202
18729 -131159 138045 -18774 -371217 108096 -17715 -413 -160314 -239139 -178793 179513 259831
18718 259831 -246043 -135182 80141 -56286 -131969 36120 -57092 -192347 31625 -229039 41016
18706 -249438 306712 -46691 -389247 91766 -153990 -349725 254727 -128682 -76960 -379682
18696 -379682 -71270 -12230 -55219 -74698 -195130 97505 -5714 -213895 153473 -24034 85314
18684 -265249 20868 49498 2834 -275674 69751 -429178 -210423 -222690 -282716 156077 -436072
18672 105564 -186161 -21125 6159 -324655 -40854 173214 -374192 -319186 -114367 -61541 45273
18660 -121267 -124678 -134835 210837 -154831 -19381 -34126 -34205 -66556 -77327 -33644 104215 -268673
18647 140681 -207394 -302574 -319238 51804 -111146 101577 53433 -319179 208815 296042
18637 296042 -194410 70488 -79591 45602 -322120 111574 -333285 -312530 -122928 -20233
18626 -208862 -82211 -90818 235976 26906 98763 5425 -38486 -84151 76751 -245766 4135 -320823
18613 -181381 -144639 -127128 -236329 9417 -28576 -209777 196229 124258 -396531 11076 -263487
18601 -84765 -89371 45270 -267247 -274728 -205130 -10719 -19907 -58930 -418950 78365 39287 -45572
18588 62061 -234703 -457914 -246940 16572 155094 -134915 87628 -239297 -44730 -125930
18578 -125930 143189 -167502 36907 137312 100197 -37985 -82416 -159351 -90679 -226885 69854
18566 52532 269992 103984 -416612 -261652 118896 11778 -261273 -43897 -48103 -398086
18556 -398086 -100841 -149544 90495 252566 15875 -50814 171351 -201644 166736 -11697
18545 -345571 -2279 -117740 -215546 -194511 105447 -157034 -285065 -220025 114597 -148146
18534 -352645 59116 -44723 202720 -380718 8387 50078 235665 94239 423931 -287872 -152552
18523 -152552 -302942 -142644 -54636 84039 156358 -120777 -71396 -264943 52928 -10242 -248785
18512 -248785 -117307 -88399 92612 116573 97456 -327261 104842 -257124 105157 8616 105946
18501 105946 254700 88876 -428942 -204023 172943 -84356 2587 -463071 -39177 93620 -161281
18489 36914 -123363 -116618 -37536 -214647 5126 -180649 -325174 -3493 131307 -239419 494087
18477 18360 120328 342738 -266262 -59407 -215589 202512 60956 57134 -240986 -83296 -63232
18466 -63232 200318 -206963 45453 165350 61641 88679 84132 -280529 -81131 -154626 -301900
18455 -301900 294 17666 -42419 -392306 -110799 148403 179443 113180 72277 39699 -19354
18443 -23882 -205145 118911 23894 96908 -135981 50792 -199618 -40119 153581 9623 -167868
18431 433525 -86200 -86832 -74701 -104286 -237700 -167656 -325350 -47532 -127724 53164 -117411
18419 78236 -119242 -316107 30418 -273131 -164250 295502 14860 -245175 -191489 280793
18408 -32930 25648 37789 -230551 -59374 183763 71435 124986 -110614 409048 -30563 167095
18396 -224363 -132604 -336894 103339 174998 61057 -26802 -51345 -205144 -273479 137183 -51544
18384 -186180 -188199 -282485 186960 -89117 64286 47643 27499 26112 -4968 -102978 31027 -380941
18371 -194397 -79478 -35688 44612 -22994 76047 110463 -253137 -47351 27472 -166986 -329620
18360 -329620 -163629 -31041 65864 120677 -66126 -14218 -215133 -444398 -40397 93781 -178328
18348 -334654 16607 -72108 -378952 -315578 -45458 546564 -40041 -336929 -289943 -121926 -7851
18336 -55471 183927 -242170 245389 -465576 -92892 -128328 134759 214839 -208297 -97971
18325 252894 -87716 -1464 104031 -59326 123099 9931 -86228 -124699 104905 -30840 -244349
18314 -244349 -508246 -10777 -91408 -176264 -186511 80376 70892 -194774 -56828 -47212 -85661
18303 -85661 51044 75294 -300504 74278 -61873 -88659 -15547 -157945 314322 98724 -83860
18291 -197016 40980 -36564 94500 -355147 -6304 108357 -13090 -20327 13612 357905 43780
18279 172394 -123696 121124 -37712 -77930 7676 35968 115840 -233265 -27990 -240628 -112041
18267 -334193 -138267 -49153 3169 -34922 -23105 26426 150551 95002 858 -393495 -139028
18255 -192440 61498 139301 -361340 -139685 -190692 -84126 -130301 -127794 -194898 298977 -310268
18243 -90519 -246104 199223 -204748 32424 119654 246048 -170055 -188889 -320608 -296917
18233 -296917 21683 -251168 -169187 -10374 -198458 -170680 55528 -169829 -272134 -88538 205727
18221 -85918 27557 38316 -9242 -143458 -184232 -305401 -175520 -106340 -345000 119646 -110682
18209 16283 1652 -18241 -113554 -14007 -188794 -65998 -65482 -277712 -8577 -457149 78358 -101000
18196 -181618 193499 178654 -201467 -77188 124946 -70197 133924 -169505 -398379 -187366
18185 186663 -71048 -57048 51534 -115422 258856 169782 -444843 -115584 251454 -224987
18174 -62869 143751 -78945 -186328 243699 172626 -24292 173457 36091 162923 -3649 -104570
18163 -104570 75366 -124351 -65280 -23641 -93323 140206 -44705 -122966 111715 -451203 386025
18151 -202840 -204110 -76210 70968 54728 -20527 -127971 378097 82709 225896 10592 117977
18140 117977 90173 162091 235890 119168 288494 27924 18734 -68222 -10290 -343567 -36779
18128 -65660 172728 226544 -64544 -55119 162562 -168271 -160353 133035 -263569 -237293 -170570
18117 -170570 -144228 -196353 2973 344243 -249229 -210657 -492155 -187929 104611 171080 -95127
18105 -69208 114312 -27061 -43612 -251310 -25228 264760 -105455 -117073 79772 208199 -256384
18093 -59599 -9677 -135341 -329238 -6583 360133 41490 -3432 -118026 -374780 -33501 112450
18081 -67416 20379 -23809 -191353 -307672 -195870 -18514 72479 -169279 259712 -80088 53838
18069 -124913 97054 -181294 -64519 -33184 309353 -38302 -15643 119067 118833 -30400 -82274
18058 -82274 -131553 -29020 -112842 -163419 91414 71664 166218 -91099 84368 277764 -75577
18046 161107 69417 65939 -163037 -80478 -296815 -220863 82571 -236074 29314 -317017 -121004
18034 -2447 -78928 -164246 -189543 -324524 32655 -4058 -226349 293455 187921 75561 81366
18023 81366 -216910 -349996 -52131 -78399 -79758 -76807 -154070 -204617 69964 -126145 -38894
18011 -168903 -94778 9788 -76803 -36887 98386 -103385 -161097 -72270 -119978 104392 -269748
17999 219375 -45192 -347580 -56184 184535 25602 44608 36168 13292 -31057 -211169 8281
17987 -36133 118955 -22122 -228158 -120241 -71110 195164 -49638 -164821 -112845 5576 118673
17976 118673 -125547 147216 -74775 132542 -101122 21036 590 -151359 -81515 -30037 101599
17964 -54400 60118 141524 -231455 -162068 135819 -334077 91100 194954 173865 -269107 -24749
17952 -32506 -98644 170516 154496 54672 6617 79713 7048 164166 -38406 35426 218997
17941 218997 -4444 -385667 -23613 -246358 54943 -483594 -123117 47361 66792 -189458 -22248
17929 -111697 -82804 54983 44647 -158474 6105 -3693 -42330 -128184 318596 -33101 -94483
17918 -94483 -25177 156333 -27652 81530 -84360 104039 -390993 -1229 -297702 72868 -165576
17906 -61073 -174859 13763 91380 -35153 101051 33978 -136279 -160974 -116937 72200 34790
17894 -108668 98180 -178573 194504 263880 -12811 258053 -46367 35285 -5374 230662 -273582
17882 23464 -107128 -432980 203290 -70373 -121942 -225905 -315395 -77353 434137 106450
17871 -161312 -15574 59229 -167810 202285 -137924 -155770 -272284 111991 19518 201054
17861 201054 163576 -37290 -192653 126162 -113860 181922 12128 192289 160210 -158198
17850 -115546 -138941 96017 228767 10308 1436 -325603 -62058 205033 -14483 18766 11902
17839 11902 -366680 -253621 -303773 13689 153087 -64639 -69305 35399 -149227 76744 291949
17828 291949 124583 -252004 -34619 -167109 92873 -48550 49633 -210113 257389 -146163
17817 356460 -244046 15596 -221091 62022 -235334 102480 86935 -122857 -34534 76557
17806 86757 -269346 1780 -25387 -60351 66538 104307 -404030 118101 -303001 149672 -76802
17794 298835 -183726 -450356 112059 -7629 242351 26061 -44740 95319 -48304 -98952 209500
17782 -324716 -76471 -110474 269246 74808 -15419 127245 133314 218509 -11587 239189 -135649
17770 -300553 -227322 154424 -52572 -105156 254255 341499 244078 170855 123182 -286327 -259
17758 90643 107351 95024 -206709 2270 69296 -133569 -80870 161129 -151425 -71629 52911
17746 86751 -186137 23744 -391950 250230 30842 -265195 -194270 46580 -24031 -65832 4080
17734 -85180 -460900 -32654 -17756 1441 545 114109 87986 -115031 -306526 -194303 237621
17722 -171028 -487457 -110425 146631 -83941 73644 46148 76214 165620 -95075 -321684 -223306
17711 -223306 -77788 -38968 -170262 -219921 72609 212447 -190772 204459 66760 -203886
17700 189060 128866 129474 -88406 -134469 79513 264742 -86765 -119814 -348283 -18441 70708
17688 178982 -246430 -105503 -51145 -12310 73133 -25522 -78466 -147071 -407678 455859 17564
17676 -344617 144638 -163361 -288465 -312052 220751 5150 275417 -106201 409390 12451
17665 76119 80156 132015 -99573 296801 -178113 117667 99520 -259357 -31151 -233763 85878
17653 -176896 329175 191931 13522 66782 72567 -377996 50465 -51841 86055 304066 -59604
17641 -60640 54415 -442792 -121930 -192297 280203 -201921 62222 -85827 107290 -209544
17630 -174429 281902 -111670 -115356 -73976 -250364 39023 191229 -126508 117775 -109998
17619 191496 149809 -145415 98095 193242 -130964 124439 57982 -137783 -384056 172625
17608 24046 248749 -80654 145149 232717 -153953 -411399 33464 312517 2225 -13281 186048
17596 238712 147766 34845 264804 195801 -262526 193151 -136414 163683 -165914 164653
17585 -37783 -93473 17881 206800 -263912 474978 -206587 -202923 4346 -81440 -127292 262034
17573 49683 21424 174702 372317 -159721 -36466 271494 217933 83121 -19827 43887 -76362
17561 -67978 160681 -126134 -27583 -105268 -9048 164392 20602 -117007 251985 17440 273490
17550 273490 130409 293939 -168309 218912 -250850 291183 -56683 -20236 -278683 -81534
17539 107360 231772 94070 273538 377180 116679 -210500 156830 90010 102331 133602
17529 133602 142926 -30159 -32359 -9451 115826 -238925 133383 194456 -50842 15494 147463
17518 147463 216612 -147049 132912 229469 -22710 44679 -37737 -164835 421921 -209632
17507 137799 196006 122840 -94630 53905 290757 22354 370188 194761 88761 253059 -256251
17495 304169 30797 318094 560378 -155707 209859 318848 -193224 156608 110678 243720
17485 243720 -52912 51071 143356 186822 409761 156713 343018 408030 170045 268986 31292
17473 366626 132442 165873 113886 -91294 64301 308293 148232 304364 -174504 -184728
17463 -184728 117380 97938 326758 470756 -8711 252426 -108417 -130322 79478 423515
17453 423515 191711 168766 362124 337358 409716 170569 57298 167306 166061 -198236 122045
17441 306337 113972 337592 -5483 231367 -6598 86233 220374 346474 134241 493735
17431 493735 449927 334070 -82702 432002 511955 90533 388051 344758 -62841 257997 295159
17420 295159 196429 68806 432626 -59329 208322 102243 432936 318493 314419 276188 31630
17408 245875 452070 311512 214122 349314 167866 127741 85988 142574 148097 56313 149748
17397 149748 167704 74291 69843 89415 19164 -4719 224984 263564 -8303 -79234 5523 -39783
17384 48877 -75240 -82330 79457 175371 347705 289067 -212804 205620 315487 165261 -14731
17372 109529 21993 62210 663929 390521 190098 130478 80132 108880 -204744 -8006 59528
17360 193140 -58103 234674 127308 -327107 -26580 209753 199870 380356 177952 -177049
17349 255512 422501 359006 336858 132106 222533 -123009 -170853 322936 -106505 269528
17338 -13624 502997 430746 333636 -45653 115044 278804 534263 144004 117660 440943
17328 440943 46600 94048 101807 49111 115279 63991 128774 435578 266616 -49887 -67255
17317 -67255 -36115 -57663 155014 498255 267799 142197 -70626 29876 314697 186801
17307 186801 234624 -1942 245090 9171 151677 489705 -65915 51595 175966 112671 -32154
17295 412137 10617 244065 26013 228266 700549 287299 508364 233629 151772 66512
17284 389770 320958 101884 300371 520306 11097 53567 195064 76910 103348 28396 430571
17273 430571 461223 273994 212821 -62133 398364 349516 259823 143011 139116 133337 217070
17262 217070 56335 211548 44118 -25107 -71221 150529 280668 310874 282484 75960 499789
17251 499789 182358 237711 204080 233745 117148 49939 136544 475343 387226 303151 307472
17240 307472 26614 264509 329657 153433 434962 375879 88904 275073 285577 358067 -53145
17228 254971 351812 130810 174945 114875 327495 234057 -2447 146755 228273 364061 -1321
17216 228691 36818 361177 220243 233671 520466 -124604 228576 -37331 301302 345579
17206 345579 453530 461423 77061 357224 291962 250739 450315 146776 55467 580774 150687
17194 457658 99987 231669 119001 -35327 231074 261124 358868 258572 450942 475483
17184 475483 339271 160992 281105 419835 373509 321588 123426 253652 402055 405922
17174 405922 -64047 324254 306766 527275 186402 165490 368004 162059 11831 363193
17164 363193 230995 85706 156547 148494 323464 271313 193287 235977 118402 417176 254982
17153 254982 415284 485380 212470 308457 291216 464838 379538 364441 416916 636305 287639
17141 -91593 131832 252607 207118 166789 307699 232188 413313 251490 435457 64495
17130 668053 450400 528407 379349 754543 478504 241509 649543 221681 401511 109127
17119 329061 392530 475610 309494 617502 399965 291846 44002 325877 278382 682245
17109 682245 426791 354803 380366 524277 539224 756257 512270 208575 283690 736511
17099 736511 504958 588123 176953 529008 177924 214364 362466 636562 555926 374478
17089 374478 534162 597814 413667 353130 416063 286672 354727 344131 251434 523440 361240
17078 361240 543479 486790 600723 599781 372883 363945 607650 716384 395218 513136 416280
17067 416280 736756 745062 458697 890255 818143 574724 637945 667076 507443 384925
17057 384925 532170 263313 472103 344059 460880 764709 400444 409504 678098 607372
17047 607372 687934 523136 509801 345458 474686 658234 556400 1079373 548658 855177
17037 855177 619260 792961 672961 789028 644998 441986 829510 522893 612607 863953
17027 863953 863348 674099 627452 467245 708616 727828 1063787 1007490 834609 855699 914632
17016 914632 425417 672495 846344 728591 1004260 521371 940630 1015694 933893 481485
17006 481485 885991 695453 678581 709610 1168593 654988 931223 686882 725994 880336
16996 880336 1063693 825186 1123685 1076548 640924 1114328 789079 824450 1006615 958919
16986 958919 882387 756520 968777 1067424 1019684 1026596 797708 737851 1125535 846896 1090417
16975 1090417 865229 837357 902039 929396 1038871 874944 999395 1124063 942612 1065076
16965 1065076 963281 1093033 1570901 945269 945055 1026961 1307288 1188198 968176 897990
16955 897990 1276533 962281 1279249 1072628 1292385 1380598 1477639 1177594 1303033 1517317
16945 1517317 1598927 1348125 1388509 952708 1369303 1124688 1292599 1377715 1140618 1428805
16935 1428805 1509252 1131999 1422324 1775983 1520891 1407193 1609537 1669043 1454488 1522246
16925 1522246 1549074 1628957 1780196 1669349 1704332 1555507 1633931 1588008 1480389 1785789
16915 1785789 1645217 1513065 1830272 1509747 1985696 1799479 1988902 2070556 1803735 1809944
16905 1809944 1944226 1729499 2061689 1898336 1824360 1708813 2109405 1841251 2315959 1979565
16895 1979565 1786280 2022831 2006394 2227691 1876274 2025492 2531244 2307069 2356045 2321925
16885 2321925 2438969 2545474 2746884 2260045 2659471 2514226 2596353 2552628 2535187 2776584
16875 2776584 2652986 3000219 3148350 2698398 2606957 2731963 2565508 3109516 2635218 3044515
16865 3044515 3259584 3240368 3421907 3452266 3174112 3332002 3370284 3397684 3458502 3479044
16855 3479044 3448629 3369221 3518222 3696105 3398866 3912069 3687101 4084278 4014953 3977267
16845 3977267 3953158 3836600 4359270 4131206 4188958 4875179 4654795 4481728 4648925 4623667
16835 4623667 4935216 4695117 5107131 5143540 5134268 5515684 5323633 4944616 5423146 5393219
16825 5393219 5630512 5979914 5919599 6212478 6154648 6246119 6305329 6454876 6839708 6752837
16815 6752837 6503755 6892728 7302852 7171619 7477813 7556668 7717825 8001701 7975750 8306945
16805 8306945 8188425 8818096 8909786 9088389 9494206 9533830 9747786 9506595 10367700 10442113
16795 10442113 10521261 11124336 11260134 11535263 11707764 11801454 12192896 12845422 13189623 13425244
16785 13425244 13782243 14109520 14680182 15191958 15529605 16168884 16291230 17145125 17222984
16776 17222984 18003039 18591543 19247854 20029875 20447093 21412211 22091867 23132487 23549610
16767 23549610 24400630 25312915 26075020 27284889 28628783 29200457 30377990 31671794 32861641
16758 32861641 34449153 35975568 37184682 38646566 40722670 42375033 44481136 46579143
16750 46579143 48433830 50881020 53568296 55599078 58562075 61884681 64629193 67579173
16742 67579173 71495576 74745806 78823891 82705834 87268265 91617851 96152001 101125641
16734 101125641 106326942 111844036 116904677 122602338 128287463 133611517 139100393 144365784
16726 144365784 149508730 154163154 158195033 162065472 164942561 167191884 168741157 169031032
16718 169031032 169107737 167889049 165738103 163257002 159630050 155944579 151026031 145739439
16710 145739439 140705151 135394771 129451490 123802132 118115535 112760601 106780487 101499533
16702 101499533 96399538 91196638 86637695 82458098 77822296 73902302 70046403 66877579
16694 66877579 63394082 60143394 56863538 53943789 51770248 49207943 46726043 44808762
16686 44808762 42723116 40633911 38740180 37090688 35479902 34083287 32433107 31509969
16678 31509969 30054097 28833214 27538436 26652793 25468083 24533491 23725124 22677578
16670 22677578 21984082 20898687 20529727 19828750 19344500 18587945 17588362 17145145 16678572
16661 16678572 16273810 15203969 15312629 14644026 13991737 13706386 13567743 13303771 12708158
16652 12708158 12205608 11787533 11689883 11229792 11235559 10577415 10357908 9827900 9897669 9586866
16642 9586866 9286176 9105264 8843530 8546293 8660997 8296830 8037711 7952610 7404943 7357017
16632 7357017 7781836 7047300 6707233 7187960 6734138 6651430 6662406 6213818 5909230 6184149
16622 6184149 5745095 5718461 5455005 5675185 5403454 5434304 5226476 5183763 4799008 5025511
16612 5025511 5032472 4473276 5018855 4550630 3849863 4629358 4269880 4071228 4386282 3823057
16602 3823057 4362539 3951397 4066972 3895381 3684115 3333100 3529102 3549561 3440617 3460728
16592 3460728 3282155 3355067 3413173 3415663 3105874 3235266 2975544 3125065 3024426 3107758
16582 3107758 2730173 3051140 2973793 2808496 2861313 2987150 2482130 2590822 2742413 2087570
16572 2087570 2501034 2478331 2513979 2066570 2484591 2253809 2474882 2443946 2017268 2225733
16562 2225733 2009427 2262806 1898880 2191189 1829016 1925045 2045779 1942974 1868095 2118295
16552 2118295 1894785 1791061 1764160 2087067 1831750 1715080 1654122 1592042 1676577 1601575
16542 1601575 1827120 1579890 1804463 1382056 1747515 1792001 1355714 1648660 1481471 1586330
16532 1586330 1370106 1476392 1548910 1623152 1508246 1348166 1500676 1155134 1298350 1388842
16522 1388842 1225206 1619178 1683089 1238749 1303579 1447177 1101384 1067077 1186618 1348571
16512 1348571 1416227 1166951 939698 1369175 1177408 1075289 1019622 1170800 1179269 1111884
16502 1111884 1196490 908030 1151381 1145071 1096775 1097983 985265 889993 1193507 810436 1384622
16491 1384622 1008277 1128678 1057075 903612 1107372 890292 943512 771998 886297 940158
16481 940158 700045 645872 1120877 999964 912993 636603 863436 663274 547186 635437
16471 635437 821928 974041 632156 742083 698784 687463 577561 949736 762408 895995
16461 895995 592013 817084 953039 732072 795659 410645 401624 652435 1001559 915268
16451 915268 557409 840872 617598 672957 483392 108136 572615 744780 722007 613800
16441 613800 872851 800456 577115 438333 592882 598908 584661 454027 818130 561729
16431 561729 357254 427943 646903 656801 465468 508171 535721 590581 376120 354174 722192
16420 722192 593247 709688 845238 578257 464601 507382 403405 724358 859178 656177
16410 656177 487972 662654 207272 358609 -80970 296706 377681 451859 628781 507273
16400 507273 334470 694759 445055 239721 75836 360936 484387 499761 460195 374032
16390 374032 172731 487061 275325 70793 300094 494619 124753 382362 295904 587904
16380 587904 185497 285915 426174 520048 468377 405243 219303 -7259 423543 642646
16370 642646 446054 478221 191744 23365 338764 289153 270271 296796 306549 398840 392638
16359 392638 165743 364786 186289 97990 -34571 221904 171785 96567 142412 190575 672853
16348 672853 431087 269871 363868 682450 -74116 471148 626046 530720 124032 268563
16338 268563 223887 149257 471811 160848 107053 137873 358638 481129 63623 270387
16328 270387 229117 298574 431356 473462 140759 337298 410576 192321 542584 290754
16318 290754 55105 275393 -59834 61339 345999 589482 27710 193701 50540 -56668 258762
16306 122823 236472 241689 -28430 43312 223263 155661 -67829 -21506 -127206 99737 317824
16295 317824 364190 -368716 597887 -4317 513020 297 1129 185677 6868 270487 -99924 33956
16282 337171 144949 -127739 -44783 40651 70849 163117 -8173 132131 89973 213586 -28001
16270 461703 302076 -55160 348146 19322 -33173 -178 126076 209357 -140828 15907 215184
16259 215184 121403 292181 -77587 265690 115173 51451 147836 128963 482004 274963
16249 274963 208695 3574 -1651 185797 61148 -24246 157731 390485 155310 -329659 -292479
16238 -292479 -36167 243343 253225 129280 -175069 276351 -162970 443367 280650 414378
16228 414378 191816 88624 131664 259763 40441 -157596 62851 -32974 288646 23341 100462
16217 100462 174145 77999 182600 -63187 71293 208985 52488 306899 119925 171504 78896
16205 -208530 179067 33989 -9267 -59041 -188392 183790 113188 -35313 324103 77528 234894
16194 234894 118400 14267 89983 20931 2859 164190 60799 -363850 -106742 -36816 60172
16182 170472 -25113 244705 -85137 156928 -209042 -17994 95105 -46259 257132 -230590
16171 171727 126460 97119 111274 429434 168729 206781 369568 -145566 -50653 -284872
16161 -284872 -48528 13926 -7410 61760 33175 -165316 -73149 248373 14227 86948 200551
16150 200551 -36043 186672 138118 -264299 214311 84252 -154326 129133 270405 -30304
16139 -66710 198146 -112184 228544 209166 -81576 515942 -31869 31875 -11754 -196896 175829
16127 -49719 320446 223029 149069 67541 80118 -408482 141425 -121568 206424 -253336
16116 -271330 82816 96472 -4070 28798 288422 467439 166038 361550 -278182 7924 159560
16105 159560 20548 90298 164801 464518 131854 188274 69947 30685 61280 171059 -302759
16093 -105155 317027 4732 60598 -237026 -58059 143362 79383 -82186 14007 3156 -156258
16081 -130893 131323 -306150 -371854 -376681 46476 -190722 242898 -121771 76076 223211
16071 223211 -70336 -152386 -69680 -178923 -3851 184436 -106059 228540 -26851 38608 -103247
16059 -196437 232756 74507 -36010 -301715 167175 -553093 80835 187387 279163 31289
16048 125497 -89089 251654 -5953 -490671 -29952 70192 -73802 -56734 -198417 47156 41139
16037 41139 -36785 -9135 243265 -105300 -80295 80439 -13942 -61551 115716 78198 -159969
16025 123675 124155 55589 -14548 -104234 -249319 -256314 136703 -90123 312654 201753 -195297
16013 16412 -167396 -183927 -192627 -30783 11095 166340 225323 129842 190733 -36871 -128159
16002 -128159 -62499 207751 -243914 -431627 -50614 56697 72087 288594 -83208 18439 265036
15991 265036 221903 21540 -73442 259058 124870 184351 -36266 187243 92294 42670 1622
15979 344605 184471 303233 15998 221225 86424 -56510 -201558 14712 -232421 29382
15968 -202448 147325 245115 268314 17505 -131795 -219054 -70499 272873 183264 -209425 -99524
15956 190222 -73879 -174344 -194171 117222 -319070 102651 -58177 -208739 34797 -212786
15945 -291764 12915 -118300 -381190 193344 39839 143164 -10480 254587 -176030 165721
15934 26327 -180203 -360137 -128851 -175222 -59783 -106046 -92368 108045 -39749 58092 78863
15923 78863 254714 76137 20551 -41946 -103272 30259 -253588 -4617 -113895 160076 -24442
15911 -339523 -92733 -179461 -116917 354974 -203841 -367870 -19007 31295 55911 -26837 248458
15899 6900 135645 -300893 166802 -241303 96120 -84975 88578 -58561 -31577 136563 -359888
15887 -370334 -68475 -184401 -85537 15339 -75106 -27295 34109 81234 -246666 6831 25892
15876 25892 326278 -279565 -213417 -243747 19582 -137014 213732 397430 -226385 29840
15865 -85516 92562 -214442 -334028 -41966 -33168 -114981 -245363 270782 55800 76194 235969
15854 235969 233124 -33576 29861 -177343 304659 126574 86742 138284 -121959 -120550 319048
15842 4516 -63649 220582 -234550 -47864 -1866 253615 -66528 -17975 -16051 -98735 186579
15830 -42279 -61034 228706 -130758 -230393 -208907 -138288 -25318 528055 -228942 -241121 157049
15818 284987 -51099 67534 -170447 -21825 -204057 -173557 59195 -308239 -96534 -171047 125959
15806 -56474 -158348 64301 -75138 8806 191875 -177991 -61404 -85551 -83352 -461640 97568
15794 -16868 66783 -55300 -125756 73604 69176 31897 66603 79862 183480 64778 -234276
15782 95837 -38002 109642 -75851 -2941 -168811 -354398 98593 -73665 -225050 -36758 -261487
15771 -261487 -194594 -101067 -68027 -332607 -14107 84547 156147 -150671 -353747 -331634 -96075
15759 284883 42033 157216 516648 29270 -203678 -16147 -82085 -237282 -253195 39485 -13069
15747 303892 36653 -123912 371534 -88611 26439 -210133 266652 -565434 -132148 64469
15736 -51839 147690 -98633 348098 -177592 94347 61361 148817 245487 -61174 -343106 67638
15724 -25623 -364429 271028 -94854 864 -13739 69134 -15938 -57093 -81915 136238 159715
15713 159715 -235945 20245 -88548 -58293 -221637 -232169 -387262 407560 -218072 53244
15702 35949 234549 -174079 -63022 43073 -48235 -99751 292017 152967 -349442 267263
15691 -10325 34942 -159685 178520 -20731 -39525 187806 41090 -238445 -111281 -97396 -3418
15679 107047 -172822 128177 192537 15347 -147176 -105639 131972 98953 -361245 216691
15668 29541 145668 -65018 -48717 52513 -26134 54774 -154676 -263083 105916 -154318 -52044
15656 99256 67172 -275806 383409 -113586 49122 101634 122819 -226099 -55275 -141764 -94392
15645 -94392 -256233 3573 -322428 27863 -12416 -90328 -89401 34411 -40730 -69879 -101681 -236456
15633 -236456 -57101 136624 -318044 -171697 53640 107086 587669 63078 -252349 157336
15622 -106178 222731 -142906 216406 -191537 -802 -59937 -69908 -249302 47831 122194 -28371
15610 10079 -152948 -225025 -121228 -115789 -94431 -376633 12048 -92693 -153158 -443123 -97551
15598 -289669 395083 -18707 91465 -262112 -36851 -201924 -200997 156352 -19614 139416 -12903
15586 373482 -111251 41260 -99301 -102396 -179159 53985 62966 -40157 -113959 -218727 18976
15574 -144308 370334 -76891 161535 -37787 225362 -250793 -94160 89232 -153875 -64109
15563 68239 -130181 -70072 251472 73955 148462 -82147 -53695 -192284 -67394 156608 148854
15552 148854 -74840 64485 -333999 387540 31788 -6253 66857 -47412 -59973 207869 -55547
15540 51704 -71824 273162 -118387 -29816 89716 -86506 94155 86927 78112 -212422 17130
15528 8559 116461 223620 -28362 -119949 -237650 180233 124135 -120373 -171043 -138860 51007
15516 258633 461456 140044 162640 71674 -133113 65713 -160575 39746 29008 179654
15506 179654 370077 60654 -273014 16501 -34445 -196365 79293 387856 252585 209240
15496 209240 180129 -13226 80154 -99681 72340 -209411 -6923 -139945 346988 4437 249672
15485 249672 180598 38778 41861 -49928 -179829 107880 -179450 78653 -176003 159293 14677
15473 -140172 85381 -57363 -192978 59400 -27789 -140994 -255974 201905 19430 17340 -261932
15461 79338 -29040 53751 222510 187373 134151 -72208 130290 271588 76240 267187 61495
15449 -26620 118834 -426269 -151974 133154 90463 190878 -302743 -78659 58423 -183985
15438 51565 187892 -79646 -26267 -59973 -303044 20079 -180843 -161954 -113479 -145316 -92408
15427 -92408 -300425 -383098 -19549 30580 -30601 221043 -25334 -30921 71923 -177298 -16781
15415 63326 245894 -44266 -234154 -203512 73754 91670 -164522 31587 241962 129596 233960
15404 233960 -348427 201177 -128509 52310 -62857 75676 152605 -152021 -112557 -3923 69737
15392 231139 -145131 22211 176679 61587 -45736 -92097 378392 111157 153836 151303 -209488
15380 294 -156389 224 161100 -173210 -130911 -232575 -113749 -167386 -268685 -205648 220647
15368 -79551 17166 190419 326264 -123889 -188885 140310 -98281 -396680 -9429 -201058 203696
15356 -175501 -260509 37389 3630 225272 -98910 198129 -359916 -202421 -350931 -274738 205388
15344 -578040 -233300 -77847 -86322 8243 -14188 6234 16855 -319621 190447 -128004 250304
15332 -159333 -223201 121506 142550 -354966 -120831 228989 27882 281553 206992 43096
15321 -314516 29784 200726 -11251 64818 86148 -64532 93795 490216 -41127 -83132 146200
15309 8676 51279 100438 385091 25791 -3821 -38857 -137303 -25208 61740 -134319 64073 41903
15297 41903 494806 119217 -89752 37386 6476 -237467 187745 98279 -97374 -117267 97418
15285 -443754 134943 201523 68668 272513 48141 109275 48005 101718 158824 56084 172687
15274 172687 105692 30825 24711 -75272 101419 90725 -167599 420171 -24360 -320499 321892
15262 -194220 415167 214846 -137369 -14527 193699 282063 -16060 100960 257553 2889
15251 81041 12333 61972 284666 238919 413196 727516 1425906 1600387 1714136 1626833
15241 1626833 1365972 801564 510982 63322 -253481 440214 -109257 112535 -46456 70475
15230 206734 -78630 400711 -129440 -25767 -19463 170529 -7296 189306 -127829 47604 -65335
15218 -176490 194442 268418 24224 167863 -31627 240194 91049 -92000 45466 -54235 334908
15206 -95048 100407 84841 321663 287667 -170234 128368 119278 -61122 116634 421158 -121518
15194 -261744 126438 108509 4530 223963 17998 321725 79508 93807 242618 -89378 -172237
15183 -172237 -123612 -20646 203006 447928 214298 438278 240854 327514 -56008 -124190
15173 -124190 -132146 98804 49155 42778 8189 102533 58541 -155096 -139625 -92029 32271 319482
15161 319482 46829 163842 -106562 270256 201330 23640 351186 54554 98527 -113515
15150 -66125 79439 340803 416132 -20163 -119333 313916 -102651 -165855 -53898 -101738 186158
15138 25509 231914 246169 -147565 381007 175355 -57029 -109072 -217778 -77783 -134130 47903
15126 38250 61395 127714 165651 252340 -51228 151504 133729 185596 128271 89483 352442
15115 352442 -88123 8399 194011 551171 188989 -63345 -178306 -32284 30154 50220 181708
15104 181708 261145 -18304 377637 11113 186236 146814 76353 -274173 2684 -144519 -21349
15092 -74963 -82229 167692 59538 64030 42688 341476 15071 -138228 346546 185783 158231
15081 158231 250467 -24056 284931 146567 174947 -30422 24842 146348 79257 130562 42143
15069 19083 55849 309603 -106081 290677 164577 -20773 -91364 405836 340864 299937 -16604
15057 172062 186973 124871 166794 308110 203846 407564 78371 -148085 603919 31884
15046 -15919 192412 -32583 138679 37709 -218553 187387 279923 212979 183565 -465477 214561
15034 370729 163033 126798 180048 -45905 189268 11515 207183 -197151 324798 264385
15024 264385 301175 100073 463127 -45394 426463 267584 21633 258807 388973 173490
15013 144918 91862 -98802 -62403 239990 4680 234629 -97256 255391 394515 -3554 393813
15001 219328 263983 70821 203191 419883 151394 346753 336103 174166 280163 222804
14991 222804 334588 132505 134707 258611 323450 359635 261487 499236 346621 261503 245980
14980 245980 -51492 49433 351889 84012 70087 184051 386600 79313 499791 119304
14969 124583 158789 63337 256867 219221 4967 457381 449838 4564 -72572 338955 334263 327965
14957 327965 185609 332605 148742 388452 101134 282193 155281 464335 -81015 581123
14946 260500 362724 185889 473731 363218 258875 363822 370868 129164 459930 427938
14936 427938 357560 483370 -12520 313963 437854 646560 38763 199609 155798 255169
14926 255169 473746 248146 218951 -44464 541498 505077 346311 530730 162500 345629
14916 345629 28035 176430 52781 259821 525389 290796 6417 260914 517103 714633
14906 714633 257196 -18611 289574 574901 210250 449040 308755 291279 180195 465321
14896 465321 263446 311488 467833 455126 186612 402906 156059 253487 281415 204280
14886 204280 394159 86938 31208 485116 349300 418182 356019 57340 383539 423517 433085
14875 433085 194506 705151 309720 321363 406882 536450 414484 453362 202123 527182
14865 527182 911992 360526 161128 -201486 551616 448443 339221 484855 288160 394982
14855 394982 583779 392063 528705 459624 617480 177622 424069 434090 148550 -9890
14844 347748 297469 560516 148880 613080 95814 213410 310586 449826 381582 538209
14834 538209 278183 402653 411792 369498 540116 217558 217747 407958 302123 87759 456629
14823 456629 420194 401181 309198 209742 716307 435361 455707 197596 490258 746636
14813 746636 700627 698870 383827 423098 462303 428397 620316 473575 580427 316402 583947
14802 583947 477511 235384 288921 374839 444391 885460 456862 821988 666947 656107
14792 656107 345353 495408 351904 564224 527129 416308 630982 540739 285856 522565
14782 522565 395004 643559 611749 759362 435426 728019 845629 406361 687090 731782
14772 731782 307737 676558 703817 593124 547215 396766 549848 796999 546590 713616
14762 713616 471531 240791 658388 372854 527764 394126 345524 318854 451340 980290
14752 980290 561885 566971 712777 536334 370304 543964 456734 622355 660400 570982
14742 570982 336722 581911 897241 605828 753007 823548 685861 801459 311611 698200
14732 698200 489737 657986 674890 468110 400788 736507 885241 869728 764718 832732
14722 832732 719278 838371 1042314 1009407 848550 787101 471052 892325 593047 578665
14712 578665 827148 817347 1181852 681275 944630 808858 606254 606501 529115 532791 909970
14701 909970 743385 785419 956837 664985 794114 1015960 942008 831730 747228 1035005
14691 1035005 1019707 841209 1035113 906590 1080333 1075764 844778 702106 673770 810797
14681 810797 859335 1329853 1358704 668057 1139350 729737 684595 1057598 892124 595672
14671 595672 861922 1262322 1133909 1158470 791092 970374 945908 695862 1128924 912135
14661 912135 1216524 1368898 1306214 1153094 642707 1289475 852323 1154070 1082029 1056142
14651 1056142 849509 1312810 1343653 1170305 1280503 861125 850146 1367774 1073343 1288747
14641 1288747 1101114 1201070 1048173 1478546 1417533 1145798 1034241 1289752 812240 1236652
14631 1236652 1134099 1134557 1373836 988873 1316803 1580461 1185641 1445039 1464836 1372503
14621 1372503 1290927 1461462 1451902 1383482 1276676 1475396 1371086 1717581 1353924 1683993
14611 1683993 1711593 1404467 2060615 1367669 1433915 1412366 1735323 1516517 1541756 1353789
14601 1353789 1614287 1620358 1059940 1183820 1754241 1643756 1225599 1878841 1739612 1797042
14591 1797042 1746638 1524385 1895422 1989425 1883831 1960248 1769501 1787709 1689756 2120453
14581 2120453 1975632 1804183 2087249 1903561 1783447 1904518 1949058 2076136 2031152 1966088
14571 1966088 1866166 2067512 1995385 2080245 2516635 2676499 2590695 2749117 2068764 2599517
14561 2599517 2353014 2658795 2770487 2839326 2762085 3077596 3141707 3494348 3641088 3939291
14551 3939291 4770472 5804417 8516840 13471069 22386793 38001944 37138333 21136029
14543 21136029 10117059 5681069 5294948 4041774 2634066 2063233 2141401 1830689 1933504
14534 1933504 1774944 1966352 1746495 2067424 2085430 2124815 2337378 2294231 2218311 2443817
14524 2443817 2540613 2153996 2063600 2443852 2424571 2626392 2278925 2454615 2638680 2525378
14514 2525378 2536460 2555679 2631369 2172506 2698125 2608444 2841204 2842884 2644301 2851232
14504 2851232 2587021 2798577 3016749 3065698 2928457 3256332 2632423 3221528 3311065 3369016
14494 3369016 3257466 3235452 3573709 3179371 3203306 3602611 3385392 3605538 3599046 3458832
14484 3458832 3562848 3558346 3945819 3412064 3641182 3590214 3831749 3940131 3929719 3651540
14474 3651540 3916698 4021601 4060431 3897302 4420843 4158064 3901761 4204851 4472668 4267456
14464 4267456 4694292 4443207 4702197 4213868 4697653 4638565 4727553 4710060 4752407 4857858
14454 4857858 4813988 4828492 5396096 5523292 5044029 5452669 5380964 5726397 5445082 5883780
14444 5883780 5470773 5496310 5657803 5615373 5618240 5909402 5977285 6269787 6246376 6046144
14434 6046144 6099398 6573564 6508942 6475079 6691634 6665809 7153932 6854999 7145473 6817334
14424 6817334 7245505 7064426 7148004 7900888 7802916 7320010 7958489 8055562 8491450 8048865
14414 8048865 8414759 8430449 8710775 8497586 8853465 8686726 8957694 9225534 9126177 9352678
14404 9352678 9855058 9724267 9933541 10044188 10127024 10266925 10568946 10602507 10768662 10771584
14394 10771584 11438661 11526333 11656299 11744913 12129389 12068111 12084327 12337638 12757372 13335442
14384 13335442 13040805 13390043 13859979 14133931 14288131 14512144 14879660 14827452 15077608
14375 15077608 15878975 15920530 16270227 16353068 17125506 16885423 17822168 17828660 18007872 18705529
14365 18705529 18693228 19623842 19728602 20418383 20806333 20887285 21593941 22331010 22776436 23286016
14355 23286016 23726195 24038635 24856299 25264044 26125353 26696459 27068164 27823142 28769163
14346 28769163 29376783 30355566 30896117 31813136 32646294 33424711 34777018 35285308 36533511
14337 36533511 37546581 38186316 39798132 40874157 42168148 43223536 44331961 45784728
14329 45784728 47374078 48995499 50409984 52642144 53988398 55984761 58004691 59682417
14321 59682417 61830883 64141633 66631971 69399072 72079593 74876541 77768978 81025263
14313 81025263 84002974 86910893 90747599 94535877 98431659 102679960 106911375 111668970
14305 111668970 116740810 122147082 127348138 133453962 139456288 145906532 153536580 160637077
14297 160637077 168689669 177369382 186040819 195362493 205533329 215845607 226360446
14290 226360446 238038381 249816893 262468530 275466007 289236824 303094560 317601531
14283 317601531 332328069 347402045 362120435 376876129 391506167 405777859 419523383
14276 419523383 432085479 443568226 452630112 456734765 457203420 458140168 456345197 454064829
14268 454064829 457479410 454335208 452916541 445127336 434017068 420898276 406494141
14261 406494141 390912801 374924353 358710000 342705078 326336303 310597308 295103995
14254 295103995 280370197 266170652 253092895 241074051 228983271 217264518 206026649
14247 206026649 196013724 185918340 176981136 168620956 160425286 153124567 145213141 138901457
14239 138901457 132829585 126690306 121552894 115789687 110905810 106291939 101579443 97559132
14231 97559132 93979325 90057555 86750133 82859377 80011080 76867463 73886726 71219980
14223 71219980 68864852 66238446 64165709 61600110 59680766 57547049 55475969 53721942
14215 53721942 52398815 50793069 49033862 47876969 46558759 44681692 43372434 42662346
14207 42662346 41597524 40493881 38929616 37869717 36817485 35899344 34985969 34236123
14199 34236123 32920327 32007448 31405397 30641398 29638085 29394094 28372762 27692151 27039387
14190 27039387 26077455 25806424 25333945 24688099 23923484 23410318 22845274 22394775 21881991
14181 21881991 21146227 21169113 20495030 20120917 19673695 19562650 19096490 18589528 18226679
14172 18226679 18041570 17620478 17209810 16843453 16628366 16088482 15691587 15601527 15279886
14163 15279886 15121263 14884403 14540574 13892650 14078759 13867928 13621650 13405472 13172657
14154 13172657 13049019 12766050 12610774 12135834 12405332 11941809 11780784 11347166 11395242
14145 11395242 11272716 11037891 10723171 10787846 10677435 10016493 10075565 9932779 9786233 9674113
14135 9674113 9408085 9344119 9160162 9245053 8970895 8750893 8766474 8816319 8430668 8270470
14125 8270470 8216464 8361472 8015431 8134310 7679707 8113843 7923714 7700518 7743112 7272064
14115 7272064 7317285 7442763 6866326 6932831 6762856 6834194 6823326 6698745 6471291 6361850
14105 6361850 6352407 6382348 6123541 6222988 6151022 5857951 5852444 5726919 6040255 5608693 5658712
14094 5658712 5512943 5615795 5584975 5635428 5164116 5454229 4940390 5278603 5212464 5091800
14084 5091800 4827674 5164777 4716510 4631568 4667507 4489466 4710732 4891986 4512524 4414910
14074 4414910 4667638 4418469 4576814 4219919 4300512 4220680 4302643 4277874 4172169 3930858
14064 3930858 3707812 3939162 4248598 4068266 3936913 3866210 3703157 3723393 3571631 3801008
14054 3801008 3492257 3452081 3719086 3551700 3421964 3560680 3342424 3626164 3201609 3087438
14044 3087438 3484357 3355875 3298543 3186342 3602766 3723378 3087882 3081571 3075591 3092371
14034 3092371 2726916 3086078 2840236 3336155 2908557 3116219 3192685 3000675 2702439 3135821
14024 3135821 2723821 2953557 2732316 3044878 2645483 2755384 2876926 2539487 2538128 2419484
14014 2419484 2740867 2263201 2517009 2426994 2352525 2317541 2400426 2649054 2400798 2311436
14004 2311436 2304333 1951417 2017993 2302618 2230979 2291387 2268465 2386728 2028530 1935405 2386043
13993 2386043 1907167 2192393 2268762 2976728 3995237 8110970 15721880 32589575 39147203
13984 39147203 27823530 15059609 8489261 5649873 4515181 3966809 3342900 3611673
13976 3611673 2946889 2710214 2768587 2735215 2692094 2508577 2206497 2450233 2427571 2594399
13966 2594399 2551322 2374316 2235521 2149765 2385706 2143493 2027447 2322495 2005888 1969307
13956 1969307 2071087 1615068 2121974 2285154 1893874 1795799 1847158 2191821 1808182 1705561
13946 1705561 2019765 1698458 1611731 1907820 1767822 1789684 1760345 1800406 1674963 2141379
13936 2141379 1608159 1871068 1782701 1699237 1682514 1853589 1859217 1985498 2023574 1671786
13926 1671786 1281821 1371165 1428008 1661444 1303217 1671757 1469824 1856498 1557284 1539290
13916 1539290 1687852 1576025 1315957 1125472 1506096 1724017 1511205 1503285 1298980 1730196
13906 1730196 1534231 1578354 1368423 1406731 1478767 1671591 1469355 1133720 1311248 1365352
13896 1365352 1228339 1439454 1034368 1196233 1347530 1181458 975407 1089118 1299364
13887 1299364 1478228 1077537 1137046 1387319 1384399 1209527 1200562 1194916 1322950 1244165 1306092
13876 1306092 1396692 953353 1163097 820108 1062638 1230910 1007074 1019002 1266267 864434
13866 864434 883430 1214711 1053660 974683 1181528 1098600 1166155 1345608 866367 899858
13856 899858 952833 1009752 877198 1373636 1102396 984618 1349836 951688 1108741 1135266
13846 1135266 714318 901861 942815 1079831 892164 1217144 1060964 983184 1134796 1069134
13836 1069134 984723 787101 1275065 992482 783561 1000808 828593 981346 1040964 915317
13826 915317 1057209 1089790 835424 798056 899456 710817 699115 1006322 778311 869738
13816 869738 785385 800018 1092280 1018108 580468 785393 680291 887726 930882 881846
13806 881846 805092 847384 899915 1005811 787804 743675 808892 581448 786884 681047
13796 681047 441622 930826 706331 851917 841968 698793 924991 980061 889156 673337
13786 673337 924822 812887 741943 748762 562705 596826 658912 883986 676288 1077889
13776 1077889 599025 627166 827967 770923 781880 795322 671940 640864 345541 559904
13766 559904 522597 644918 671525 467485 815873 904850 922626 619512 649636 472824
13756 472824 743280 558500 759774 575004 643406 583350 799021 720486 670758 778300
13746 778300 550715 826879 901587 750640 1034844 645929 454766 492930 471812 426288
13736 426288 522641 690762 636131 763545 526584 744788 513305 416846 775876 656489
13726 656489 486216 585796 312773 567545 534408 646350 529030 292415 375677 592914
13716 592914 616553 607342 281206 409341 1113158 497973 672220 450175 482003 514928
13706 514928 422966 288476 619623 513731 388687 839283 489004 634099 758900 439911
13696 439911 754671 462538 548848 805429 488935 484250 544336 692256 554968 595852
13686 595852 620046 883737 225168 640023 548232 412381 483411 241003 371633 378872
13676 378872 253514 698783 361139 489903 168304 482095 662853 420042 939341 552043
13666 552043 334185 461750 320108 507969 636369 274671 672699 641388 717957 176027
13655 384319 472576 163964 388122 671861 170758 588546 526117 399641 272369 252147
13645 252147 375919 441570 293841 342392 331154 339236 321662 237451 316810 228615 518493
13634 518493 228930 175004 281261 232817 495727 503950 452193 486550 392498 546483 293871
13623 293871 533854 555695 287206 351214 371047 502610 238684 487244 393020 312139
13613 312139 578703 568157 195718 158081 444590 578402 504579 266360 266552 647768 129710
13601 27906 163503 466607 327423 259752 319370 487736 488067 279076 580412 279789 406074
13590 406074 211567 552100 526581 704671 128922 582605 272885 227173 167855 739988
13580 739988 -2475 548253 235016 176454 397115 250227 536512 213089 127662 419799
13570 419799 279085 510272 524630 622894 102574 72777 851667 -12639 264557 340469
13560 340469 528672 266148 203211 359631 413498 77248 331247 497926 351401 327978
13550 327978 249381 168597 109538 248139 -130713 128113 488930 443152 354235 150580
13539 228968 -250833 304433 -48929 511903 175445 673666 205885 15831 -143796 365307
13528 346662 292400 145265 370187 305458 135643 256884 514639 530358 454082 353973
13518 353973 519992 454194 337095 260071 207949 131375 47065 265929 265498 552091 164983
13506 464504 202320 151638 -51946 313424 146868 166986 512101 212580 246691 383072
13496 383072 13483 443709 540044 375544 186692 354572 145386 339786 246677 245206
13486 245206 211551 235607 134567 346850 366665 5617 16902 9879 197029 699603 144966
13474 443297 151516 113979 278637 -90594 104713 146965 93636 219632 423743 164682
13463 447408 228936 270445 107798 286182 81719 415642 293628 36441 328964 180908
13453 180908 681092 228933 -52531 -106239 608381 434486 302324 123319 396662 259037
13443 259037 26271 149814 380169 387570 398877 399408 81546 287881 411897 200712 158065
13432 158065 206148 675192 419628 106788 190990 -21674 391083 156587 323051 278546
13422 278546 208733 212005 181930 177674 300298 71346 -160086 406781 210505 80039 150113
13411 150113 327214 339144 375561 -103028 336912 -48971 79213 264028 85726 63162 -63724
13399 138435 165314 85441 475051 -43640 283586 478186 374031 237218 109133 484304
13389 484304 270758 143707 160919 -56202 214079 278839 -56092 161010 -97580 -23793 222336
13377 300611 318001 458926 264208 26237 157246 324482 45348 258423 431249 394997
13367 394997 360329 -32161 216573 216996 544970 25015 293428 102661 -29669 121947 496495
13356 496495 -19980 70256 313167 201306 151455 538216 -220036 -62003 535915 335749
13346 335749 269402 484719 143836 -13729 714456 535614 462953 440795 125895 107165
13336 107165 232536 251452 321862 234996 119058 228604 16087 164701 711 32015 291638
13325 291638 1184 359982 249377 296659 152380 -150871 320977 184984 199602 423334
13315 423334 461702 110645 291123 144514 223621 427913 73345 314190 450280 67718
13304 50813 467274 267894 129681 -95673 319362 287973 303149 -108032 -42488 -136842 380869
13292 -82406 354289 -67653 23257 352105 427353 215198 -5725 41650 -117809 235886 111201
13280 656727 -222104 244453 -42405 251171 189340 203212 422845 101147 74069 -173734
13269 204906 69009 -184655 149118 250701 87497 175760 94203 322780 -114346 274775
13258 253125 -2105 117879 151740 215431 346540 98143 -48169 -17108 -2846 -303130 209365
13246 340888 16527 37262 -21535 -127146 219538 357628 383282 321725 126973 81215 230008
13235 230008 142089 110808 9318 134727 -25596 -93866 497483 -169977 -41070 56665 150489
13224 150489 397177 -47290 -130154 71449 -46014 54174 324518 -154188 216698 162987 362630
13213 362630 59014 195181 -242257 478492 409308 288426 386002 331432 39224 145501
13203 145501 32426 21492 112635 232638 115044 202611 57145 483877 8843 75528 -90301
13191 206971 103587 -28268 8005 159969 393019 -93498 120608 -251821 215921 143032
13181 143032 375764 276105 -31343 179475 396321 -27725 -99996 -26620 -117257 -192734 -82064
13169 126845 52525 -122950 279074 219829 159123 5343 90485 -79380 -218226 282896 38364
13157 -22352 5515 252334 83891 -243436 -49789 -3593 2861 108400 319695 -153817 413221
13145 -1207 64030 -341528 252707 65227 85265 155298 157368 122539 153964 -24064 378103
13133 23684 -53038 -43977 48694 -84874 446547 191472 -296303 -10979 19475 -43800 40255
13121 223992 34540 451053 128953 51545 318161 505290 8721 -86169 -56248 -178501 34238
13109 34208 138378 26954 286724 56649 171195 63671 -398706 215647 -119656 91939
13098 424037 -163382 5130 143552 152055 312377 -15002 74492 78133 135017 -65698 2062 13656
13086 13656 138184 207795 266943 -35209 127319 413310 9988 -2482 -72584 344190 -94030
13074 137695 239854 160838 133127 180301 130411 -18855 -296725 90225 -9311 254150 289037
13063 289037 14177 -110990 180306 371729 300377 36846 -188396 3981 12137 115107 168236
13052 168236 -157222 94651 37117 473258 180818 -16112 -77725 122641 242842 -34113
13041 -126995 -27126 112971 -39458 -56956 -332756 255807 5650 179778 220097 22732 102326
13030 102326 -52684 -63554 264743 147641 213541 -168892 330945 -40426 -46548 256376 137797
13019 137797 -79063 -31133 -413301 -8442 204559 66542 147974 59764 -58148 193639 347723
13008 347723 93538 61035 122775 -16478 -35384 306726 13940 208662 -6162 -32937 187486
12996 70096 247051 112553 -59055 -129228 229046 -109467 445287 -39831 -159720 337141
12985 -119187 -37319 -85864 277765 99576 -98860 180296 -51717 -194492 108925 245660
12975 245660 75739 35489 140633 144284 -83739 124996 121016 50743 35407 245314 139677
12964 139677 -136078 285534 -250723 -207131 -18892 117577 -158647 142102 49115 302571
12954 302571 -198580 293249 -185827 -161933 -243111 221419 8553 78931 -277941 137553
12943 170450 276499 215397 210534 296357 -26268 107045 40558 143191 119499 -148479 -222752
12932 -222752 216547 209194 -76581 314441 -102703 4014 421589 -71911 -11056 -23584 286345
12920 102033 58948 29123 -16552 247752 433670 92764 38073 114255 -643584 60510 -59798
12908 127766 18354 -10672 145029 510620 144781 142245 169694 167508 -181363 -8077 230501
12896 -143708 78473 297198 -177367 27132 202806 106151 -337381 188474 71253 200591
12886 200591 159235 396608 191146 -21668 -34056 101410 481301 49830 234823 30017
12875 -52290 -121346 21551 -265873 -73384 233553 187360 9480 -5340 -312377 205146 101382
12863 -197562 -2290 108765 47450 92795 -72344 -13766 -180493 48811 14009 64470 46214
12852 46214 -473560 291621 -207899 -134689 142236 -37303 -4978 228605 518036 167915
12841 170204 173792 150722 -173448 109192 -74105 -27704 -125757 62231 -20985 -145400 -73176
12830 -73176 218743 172146 139338 -285533 48104 -51882 195367 64078 222499 169469 108821
12819 108821 184252 -102803 38237 -41838 336928 187247 126532 165664 83458 349700 -354701
12807 250688 -201780 366791 223947 -105939 -13485 -35533 -70668 -365460 355309 63665
12796 -141777 238171 49959 -50035 -80660 267904 22362 88265 76032 108521 98449 337724
12785 337724 264875 276645 -15879 -225218 -48200 7864 51993 132271 202658 188883 -89797
12773 82855 -94090 -101959 240370 77323 -43164 144597 -177323 -255961 342644 100413 -282228
12761 -6750 143546 -164817 -101291 307358 -7422 -140694 110147 -280356 298121 103613
12750 57074 -24410 274236 87913 -193040 57438 -342476 150556 177174 -232438 230631
12739 106029 442035 185451 470902 144852 59398 -80085 -70157 -247376 144302 44107
12728 179667 -30001 85172 -261690 -90556 -27725 259731 -65174 -57870 -188624 -119663 -7002
12716 -35428 232101 128497 -68486 -49793 -90075 127940 -28595 127131 151016 420295 -140347
12704 164748 38838 -39831 222592 432208 194430 111159 -70007 50538 -107420 -265487
12694 -265487 179631 73988 324008 84948 98893 176756 343691 55406 -314316 -304417 182626
12682 126003 146922 463038 230598 277318 -101908 -74168 183050 202179 184320 14582 191069
12671 191069 168311 60134 -26361 222666 4710 311159 352053 151288 367065 91646 59318
12660 59318 512206 125718 100557 21255 -75004 -86902 159775 129812 195395 177845 137839
12649 137839 224870 206943 -132848 217243 75763 243354 192365 -111547 215260 185758
12639 185758 -218997 242332 -77426 122627 -15901 -199438 28774 90673 -298737 -225911
12629 -225911 77352 69606 678016 498354 -23140 257623 9544 262237 101326 17765 79019
12618 79019 94359 316597 13208 -29410 -1055 7572 27250 -149339 161274 -9260 -114551
12607 -114551 240717 105091 -232159 51744 -106057 191141 -32185 308241 167122 324450
12597 324450 287223 160678 -17603 237052 281105 196690 121150 295092 -41825 -285798 -35246
12585 -35207 -289785 -56153 -175896 122838 97010 153705 -27765 91224 -105006 -21875 -31891
12574 -31891 181434 -110022 264156 130792 -57270 77028 138902 53287 296654 4278 -417517
12562 185269 -80439 288278 186524 73497 32121 -210676 270400 116596 235862 -112977
12551 64757 -308992 -27441 -190107 238885 -64246 -31146 -4376 -134168 -52544 104301 -121342
12539 279222 355791 -45180 125711 -17579 -85153 216390 -112659 -15928 80734 79393 -55901
12527 142007 93010 -87846 -212124 -27522 -142924 86014 -148504 58070 319779 -173435
12516 22528 -285195 152582 30188 132814 -47832 301382 266366 409334 321699 194520
12506 194520 186474 356671 124286 455021 -19524 -77187 -72393 117012 315493 -85242 -101818
12495 -101818 -169513 -60126 283805 -40775 35172 29028 36519 171837 -101910 -270720 33933
12483 12602 -111840 -201657 -34495 46088 15441 105662 234374 80212 214927 328180 -188878
12471 -197357 365304 84611 -111343 -233697 138513 11138 2878 247233 12492 44409 -53710
12459 -5422 -45822 -110493 113196 -56114 375761 -243554 19219 -18253 -47900 90577 284146
12448 284146 108847 -5942 -38763 73292 402286 -94331 191033 42010 237393 -47179 278825
12436 -81506 143315 -225681 -121513 125465 25020 147174 -76228 120997 -25658 119766
12425 -328024 -32387 1198 285837 -5522 -34643 49775 -154007 -128796 169524 -221874 69938
12413 -264624 105453 51501 -131212 132244 -21506 59240 332883 -184714 57345 -96011
12402 101801 -275163 -82234 -318812 99973 244847 69563 -11303 244030 17238 98595 37371
12390 395924 -9176 -274136 -168468 -80254 -145644 303714 236230 112766 -194780 23120 -21230
12378 164628 -41829 -58967 -218674 39255 -139122 -63851 62774 61450 14679 114497 -107206
12366 109093 -8930 -215660 47581 82988 329740 198030 -47159 61106 23015 -133912 241931
12354 61922 164378 161207 -216883 134406 8904 -7254 73806 -171351 209064 237682 -108632
12342 -123910 -81373 81759 -125756 296197 141230 91154 105995 25046 145523 270130
12332 270130 -319160 26806 -3492 9518 -50165 163031 304834 83156 66631 19802 42786
12321 42786 197547 -225431 99999 -228857 -25556 40458 -137179 323624 214488 -43107
12310 102033 60118 -308646 -75033 130391 -42644 -42497 -81669 31550 66071 143550 -70702
12298 199224 -331017 -418811 -220048 -84270 -165307 -34298 -30368 1250 361996 35274 -237233
12286 253803 -80078 81220 -226233 37297 143135 374577 138267 148709 197021 -111984
12275 77253 289712 283753 279415 -18686 -15521 189782 -179916 331160 292658 -21368 -123553
12264 -123553 -81619 -3091 61864 206115 423640 367316 63158 -9504 83873 156660 136367
12253 136367 398207 131740 310534 -12691 169504 125379 -138856 78391 33117 -108088
12242 -181645 302633 410608 -39060 251689 -264689 231522 148850 110222 -26969 179983
12231 65676 -301834 112843 288303 27218 163834 226963 335731 60139 160767 609491
12221 609491 391421 341373 62086 288620 419702 292191 303512 377552 85790 5278 165416
12210 165416 281933 93241 -83453 226356 41951 404783 219529 138155 256591 323310
12200 323310 155748 332838 -71062 -109658 188544 -4956 346811 68401 -80241 246942 159353
12189 159353 -192333 85325 51003 194251 226395 278271 39755 390775 -162832 121016
12178 79598 25544 106990 397120 77416 364266 -66477 -117401 -215576 250639 -1836 234293
12166 -227221 201864 30053 244063 648412 181094 259322 202330 34560 217853 -49865
12155 71878 71065 -55976 274668 84522 510952 10266 481690 307044 157945 451020 -250551
12143 82643 83654 177424 142247 143019 44865 153703 5258 165554 167008 118434 -94488 -173353
12131 -173353 67413 367835 110178 10140 95690 -48667 93323 80379 -32612 -131552 58823
12119 143679 -129032 123779 -59412 347634 -53474 -50942 8595 132682 -16370 11490 59117
12108 59117 -196104 64918 -10568 -41057 105694 199993 -57988 144590 -98806 -76917 254278
12096 -136113 367426 -30262 117934 -201141 328893 -141636 -8767 -90087 57807 -60148 -28130
12084 188861 -37292 144960 -281498 276491 33744 68760 262783 112413 -138556 260682
12073 95063 -75458 32322 -321921 23650 271376 -3595 289492 -282076 236511 29522 -189161
12061 76495 60326 18214 244355 -178215 132415 -990 194755 -251336 80102 -212266 354956
12049 620222 978875 1703659 1132059 444819 473997 389952 -129934 229580 -111890 -176137
12039 -176137 -98903 26254 -2085 91677 95817 -94718 -167377 -4931 -169016 -52449 -376538 29426
12026 -324129 -183458 26593 -217012 176617 -102210 378801 128721 -50685 -136944 -218226
12016 -218226 15254 96860 274645 337261 63187 -291288 58366 299440 317834 96723 164158
12005 164158 264018 65037 -30606 -56585 152012 -138998 -332225 6541 -263028 357076 -44604
11993 -6431 312303 -234164 46286 -159336 -145926 -212214 -55544 300751 -208865 -205768 534174
11981 96210 -251921 89844 22396 -175237 -26586 -126446 -196799 -5791 -299107 -30894 -254668
11970 -254668 144827 83857 -46566 -308859 -187513 403659 28639 -62293 -34572 124378
11959 -14902 -116357 32683 11352 21445 -18350 -219544 302144 -269467 27973 35377 -95770
11947 233052 -73436 28177 219365 45495 154037 -82435 -239098 -158743 38994 -193248 136797
11935 21700 345665 -87782 201645 -130938 1992 115198 108562 57018 -291124 132649 97620
11924 97620 204370 126181 71053 -51659 110361 -39896 271288 78203 160972 -52730 184353
11912 618 -70548 -106430 92092 273408 187240 -3887 -79614 219833 284013 -261954 -13925 10564
11899 191795 -191885 173103 219903 -8171 241670 50749 -106684 -56826 -390592 291741
11888 -163102 -143823 283061 -44745 220273 -84519 -65245 -45031 171559 -205818 48169 15882
11876 -1696 122821 -218139 54677 77982 93859 130646 -140356 -284671 -267170 82371 -188223
11864 86606 123744 -245172 -109332 39364 8800 -4242 238594 -36081 -90952 -131882 207398
11852 123972 -85881 155422 -109214 -214772 94005 -374359 -303416 213130 -72494 -81260 -183622
11841 -183622 -52278 -401141 213858 -237831 -101282 81600 303884 99058 -82717 45566
11830 -98707 -237682 -131492 251737 -321819 142761 -105513 -243387 23234 -28939 -565833
11820 -565833 -187805 243458 60795 61292 -173835 1813 182962 -67506 -40080 63307 50084
11809 50084 86612 -117708 -175941 -30147 -26225 396849 435356 253483 -315344 -292627 306594
11797 -78777 158204 78544 -3472 215413 -395400 17113 -380843 133873 109544 -6508 10250
11785 -71857 -74274 -12526 62145 216313 -475673 76972 25978 -80749 -99993 131658 163178
11774 163178 -84876 -117291 141443 130930 62719 267216 168796 -154591 46320 -100186 -198383
11763 -198383 -22386 61544 -189529 18195 -41827 59046 43968 220810 106851 58416 47168
11752 47168 -117854 -149261 98562 -228761 -77341 197067 -48352 84855 28903 -361962 -183429
11741 -183429 329779 192719 189593 152946 161595 260411 -151124 -243492 139922 264094 146655
11730 146655 149017 233948 118009 -41805 189364 -116379 293130 76869 224391 191070 -77809
11718 35529 138187 -6103 40370 -117829 199688 183495 289024 186545 -31654 -97406 157675
11706 -14845 115826 -161712 276192 113473 -180998 -14979 -116451 -98946 -6634 -18646 -76934
11695 -76934 185868 -417318 64423 -47560 -394219 105395 74956 228509 16877 -626 -371044
11684 -371044 142375 484045 81315 -9069 89821 -39119 665 187626 118071 -95790 -76792
11673 -76792 273722 -60587 116939 98689 -28195 222954 -130031 68708 2119 -15116 366204
11661 -76744 -134046 80690 -157624 15294 449252 -40466 192583 37590 51592 -48246 177464
11649 -120914 221263 252418 439016 -9549 226068 163805 139363 -93604 154212 62872 78112
11638 78112 81243 53089 183288 193191 53207 -32841 -6581 266043 321738 -68622 253583 -130900
11625 32539 39384 18331 -144431 260916 1859 296144 66821 -109496 278256 87058 136014
11614 136014 321753 7473 93651 95967 97194 -20905 -15085 -46506 232465 -60055 -105515 330612
11601 351682 -20091 48943 309551 32210 167672 461725 -147789 148499 -28445 -31419 359286
11589 13712 122673 99346 -267632 -80532 -427195 214706 39498 262993 60105 -69410 -16304
11577 259194 178355 -33443 181421 145935 104717 73416 5594 323320 -63124 329028 258578
11566 258578 88991 -148655 36548 503019 51988 -78242 571629 -155686 136203 175827
11556 175827 198721 312460 84097 -29702 10259 -78754 285752 115133 -175673 67268 -153286
11544 235958 209101 391608 -62848 349972 300843 178387 -8763 75055 28804 -43224 113743
11532 -171920 -233757 327555 79239 13552 469792 -130898 208229 466405 264766 236651
11522 236651 -299516 238481 -162722 -160992 77580 56517 -22657 236539 -31890 -42957 -149
11510 431588 231097 257454 -25249 245460 497459 129751 438869 49935 109136 218220
11500 218220 131922 255957 173243 -106350 -248376 -30150 161212 180923 145683 200340 -167171
11488 -37013 113922 69060 226941 292686 28113 -23932 -4651 345329 -22430 120881 324271
11477 324271 185273 -8838 483889 -74828 40824 423287 150851 178296 233035 79991 69841
11466 69841 192849 357837 -28219 26294 483343 428192 -138077 162465 119721 169214 297489
11455 297489 25687 -73796 116926 245558 135833 98048 287113 183344 133767 257068
11445 257068 414023 61730 162907 224700 206324 250312 80705 186188 161983 -70589 -57632
11434 -57632 141761 196772 39628 65340 252857 71425 99863 236478 29345 -26932 78506
11422 111289 -89026 -22333 -83508 120283 -113803 233161 214969 32381 -91995 156615 -263977
11410 125410 96608 13494 -21815 92507 -56326 219608 115161 495104 397330 -144172 -282638
11399 -282638 -236146 42947 123671 -147596 -126700 273254 -88301 22318 -67325 205136 -46789
11387 -210535 -129663 -110759 -6229 -13802 -144043 393835 111557 -90885 28609 143736 -287176
11375 318460 128700 145684 161738 -203284 145883 48883 93110 -39412 -61348 -59088 339411
11363 90005 92160 -205771 202684 124583 -222366 -91511 -143664 84199 200033 500284 117031
11351 -188761 230616 292632 89566 25080 -656 27155 -133369 178985 198610 -92241 44140
11339 45774 93945 -86727 -7840 -338436 -41168 -215481 -215768 -68547 -302428 -7059 168560 -128120
11326 214201 148562 123860 145671 -66039 -51157 -181520 419021 280164 159800 -85378 -125447
11315 -125447 -352176 58316 131327 -90518 54342 107009 145563 -67611 -52549 -71068 125048
11303 -42815 -42616 -306369 -348 52431 4527 -8647 -42619 203462 6333 3582 143724 25783 -24603
11289 212189 69437 90955 -121857 138619 -49209 -213084 149324 -58791 -163537 -219643
11279 -219643 -271123 231941 -48033 -143291 -86258 -253535 -52363 -2657 190703 -172278 74456
11267 -128402 -14378 -179573 -63120 26114 45227 -191708 1369 -197601 -116262 -196083 -73393
11255 -167897 72650 -8511 -28384 207612 49384 -52796 -164326 20533 -17095 29484 -29317
11243 -59576 -2874 10210 187593 182072 240702 -212106 -170910 306009 -192934 296125 201265
11232 201265 -101902 78445 -104986 -18058 370577 189797 -244110 -137513 -205723 154986
11221 23378 -126492 -119001 61524 -11039 249075 -4931 30377 195467 -22473 212937 -23200
11209 -82228 29508 -193934 -144775 -6418 194159 14186 -43880 -7106 -148159 305075 262248
11198 262248 165412 12348 -176706 230474 -139084 -180910 -53837 -116291 -146917 -42667 195110
11186 -99803 -25864 -28323 59014 -264819 167740 63914 184573 -190941 78984 -232117 -165229
11175 -165229 -136310 223171 -164907 16746 -525485 -106665 -109712 -37752 -97272 168307 -37671
11163 -292357 219866 86764 27624 -134148 177507 -136817 -325463 -93676 168468 327051
11153 327051 59796 -202258 27300 -418518 -252235 14281 70049 -130174 -41599 -84181 -2971
11141 12669 -50799 -192705 130225 -4875 109366 -54033 166983 11537 -8261 130439 -10943
11129 75388 321090 -148795 -160621 329208 -111856 -121183 79703 -110494 58051 129964 206836
11118 206836 19816 -150467 -95930 -9020 -129414 383138 -83693 451232 -22390 -67512 37268
11106 251939 211275 36467 358749 183288 290888 40729 35471 75995 63818 568070 181773
11094 371227 99630 360724 259689 362240 286070 -164860 463962 279560 435300 330488
11084 330488 387636 329428 -9326 204081 197450 88661 584735 244173 262334 331605 127386
11072 401315 420579 460546 248112 708336 335807 294070 333924 410473 711510 558045
11062 558045 336091 747520 739231 632207 352960 865153 685127 506732 936444 866587
11052 866587 880997 751218 773268 873586 1160227 936746 737319 1076853 978113 789463
11042 789463 1110637 1028833 890992 1155637 834704 893379 677495 932039 793829 1315204
11032 1315204 651798 873999 943210 1122445 1107358 868461 830079 1260564 835666 777821
11022 777821 1059621 817908 511125 853966 749257 898936 892090 706314 778722 797655
11012 797655 1102225 1017667 737080 809314 648295 884629 604754 676023 1220104 891396
11002 891396 714020 621212 1035931 796049 656288 820833 1138150 833502 1074465 782336
10992 782336 926946 565727 646067 1171058 845352 1007559 1279106 1002905 1115092 1365729
10982 1365729 1263962 1169660 1226603 1693369 1510507 1841140 2104708 2184769 2674766 2721576
10972 2721576 3306647 3507677 3737258 3730130 3800513 4392115 4334767 3994096 3356815 3146969
10962 3146969 2926039 2406772 2151468 2163005 2324830 2136696 2067397 1828684 2178390 1852339
10952 1852339 1718931 1683243 1125450 985552 1027596 725320 773877 459877 311670 647625
10942 647625 484667 303256 194215 565060 41357 150754 425463 304546 183772 343911
10932 343911 270964 37021 395374 131519 330440 236353 72779 -125239 25555 132204
10922 132204 366900 182322 39842 -183564 -134983 61092 167202 -186980 -155538 15219
10911 -65272 -60301 92903 -111177 82937 -20022 -217419 -131150 175242 437015 172086 -409975
10899 79622 67664 -160155 172286 -133575 -204038 -147663 -28614 363753 20216 -312040 13759
10887 -205156 159917 158695 257492 2651 129964 -14986 -100981 -374646 -345207 -114114 50383
10875 -336647 -296558 -372454 205690 315107 91675 243425 117533 -3567 -120500 -276529
10865 -276529 11277 164359 -70408 -184951 -80219 108088 311690 190358 -69674 -107636
10855 -107636 230728 108464 181731 -195364 -113411 6744 -188685 205202 166276 -96340 -72881
10844 -72881 -265598 44076 -17822 -93925 -162913 -256022 139928 -250715 151917 -8456 -105538
10833 -105538 357845 -387918 -111890 24163 129083 -114081 -18292 -49600 217640 -50854
10822 -198419 185266 -32628 73585 87930 90261 -338322 -103690 90317 206054 -36355 195404
10810 88157 5657 120927 26688 -180364 231599 -332358 -6641 -19676 -80554 69930 -150116
10798 82720 236087 -275389 -170216 234037 135770 247476 -244806 96360 -28142 -138888
10788 -138888 53463 85240 222108 127276 283417 185437 -261734 48345 164208 -87700 -95886
10777 -95886 96583 75225 -163843 55291 -59260 -39551 126183 53936 87821 -27009 -262355
10766 -262355 -157784 -190198 -304309 110945 8142 177521 -207374 29730 17414 -36486 -63327
10755 -63327 52133 -239304 70310 -25453 -275347 86693 -56116 95878 -181666 -38156 29500
10743 167358 175643 69177 211097 -309209 -129568 -108721 111765 27002 77607 -291150 62553
10731 -261409 -288368 -68960 -168398 -259340 -11763 58139 -28605 49468 -7903 -107542 263453
10719 -529039 -113249 -173703 18396 -85390 -142186 -220542 -10370 7149 -72584 49780 135341
10708 135341 50687 79054 -185784 247892 -248123 27221 -58510 -394037 -516577 -3799 -138718
10697 -138718 75695 115970 178283 -23334 -119317 114739 -250030 -166096 -209970 41448 7943
10685 37994 -57920 118042 -135884 -26722 -146332 -498205 199653 49644 -15151 -69997 -232812
10674 -232812 67576 123175 210974 19336 35965 -41985 -163992 -70735 176209 -447152 -97261
10662 -426008 100900 -50198 20227 207532 103865 173015 -78240 -221478 33719 -148334
10651 -331821 14747 -234022 -152213 -37232 -138434 -63718 70135 150544 -359479 -23096 81619
10639 -305811 -333909 -216174 108242 -375389 -83711 31451 -215848 12915 -283985 -112999
10628 -60790 31251 98385 194085 -3650 -189154 -620288 -11517 92333 142231 17908 2380 6978
10616 6978 137039 -96636 -121781 159723 -276159 -333604 -96963 -231858 -47480 -152283 -222853
10605 -222853 -367198 -142180 -186015 -102995 19268 -124922 -142339 -304545 -180594 -79923
10594 -43619 -82899 -265753 -332916 109135 -62872 -15385 -15262 -607952 92354 -12406 -8199 266971
10581 -217975 40489 -101431 -184196 -55165 -334210 1370 107129 328322 -286661 141708
10570 -47182 -69637 -184051 77606 216102 54039 -20710 -110012 -849 -8711 307907 43464 7044
10557 -1265 36262 -24182 -20033 58954 -88461 -179486 -30171 265044 -10821 -23929 45315 326739
10545 326739 134046 11175 -2251 -118906 98559 225947 -92125 -59334 143237 211667 222776
10534 222776 110051 -149930 246839 -295 -218818 -57844 5272 115585 377908 -355430 -52973
10522 46345 -71389 -294592 13556 122546 -223358 -380786 335585 -155280 -134104 199133
10511 158045 -108524 136654 87822 145167 -70111 397229 76610 224469 -1595 214511 -208511
10499 -96884 63605 -253207 -212013 -35182 -12035 -184208 98667 55442 270483 227734 -281165
10487 -264250 -314681 14187 -114608 -89851 410879 -54849 95569 288614 199761 410179 447977
10476 447977 -39667 607396 253554 312307 119439 113269 46724 90942 -12842 -37955 241243
10464 -95977 -160800 79664 112888 288200 95816 43109 189135 124946 -144872 183030 52742
10452 174743 -19505 272339 -51639 -76941 -127083 57099 -102257 229652 -66636 151874 -215108
10440 -150069 -255357 -28610 -28813 135662 -8758 -62881 -62715 -320179 -19802 217988 207457 -208188
10427 44141 -21689 -10205 6932 -223339 134239 49601 313551 -156800 106369 -166405 58886
10415 -131255 295235 133357 -2125 -52698 -117478 -160262 69421 -28597 209746 -292505 -126008
10403 346092 -198408 -200174 -52196 -134773 -243295 -19420 -121200 89518 273226 168935 355390
10392 355390 103379 245206 454594 230109 247990 201515 221424 173562 179939 156460 79811
10381 79811 -31513 79525 196978 306103 198467 299548 330602 336626 250275 673792 10086
10369 266829 286349 257268 432159 437032 512097 307198 386353 756259 664552 144103 277474
10358 277474 127100 120191 239477 512048 855158 236810 286470 354017 786284 568891
10348 568891 534119 413884 561187 218518 325019 415970 415211 442859 178135 289799 279311
10337 279311 149691 91375 313758 338386 90122 203135 -68056 168062 70285 313272
10327 313272 -233171 -2792 85998 208502 99231 80489 267645 154021 -162249 -77652 41499
10315 281221 124660 228171 -197447 48619 186134 21787 147303 -212855 -316064 114802
10304 -279342 151707 143315 329489 -29791 51508 -20712 229015 244063 109433 -180231 261708
10292 339941 134948 4005 282842 163110 104340 90909 -15939 -241428 202934 37996 -38880
10280 265337 -145949 49172 -132587 -71768 167145 -166992 -4961 123716 142023 30626 81584
10269 81584 282511 -187088 -15413 35279 246530 -285500 -171573 -304307 -145793 -209588
10259 -209588 36365 207010 530700 511630 549371 110712 198772 454171 32636 177395
10249 177395 390896 253025 -39128 3303 -296637 -480802 -135541 -370706 -342668 210489
10238 8197 -49967 172572 37375 -142872 -161855 110492 290800 64248 -107107 29754 294555
10227 294555 84193 122394 -127802 -16258 174830 247210 152423 63504 -82553 284291 -29004
10215 74468 -204904 -39203 95782 -398820 -171285 -275224 325069 -149704 -302870 -309263
10205 -309263 -12123 -85165 82045 -110063 5329 -146254 -19494 268389 -187161 -177876 -969
10193 -223053 -1614 -96707 241106 84208 81099 -352797 -267962 -43217 -210099 92293 -44455
10181 -99763 -416319 -127880 27318 -11062 -116753 -24458 -286821 -34033 -97008 -117869 -163014
10170 -163014 -121326 -58 2693 -27138 -82879 -197954 -109927 -212016 -67465 157451 -150109
10158 -329939 45175 -68938 -76157 103342 58254 -188924 -157430 56996 -198697 -68846 143953
10146 -430680 4408 -161196 -57909 -386719 -65767 -100693 -523807 -184782 286137 -102623
10135 50298 -363572 -41071 -28168 38864 -84565 25575 -75264 57890 -112306 -213370 -170943
10124 -170943 7696 -191684 227355 -59821 -83287 222460 -98577 -174198 -328063 -210626 -235755
10113 -235755 163229 185650 56787 -310412 -166005 -59396 193680 40231 -267638 -68319
10102 -119048 196145 114136 137905 -288946 164598 -45114 -19945 -19740 177914 -197775 -35166
10090 -257198 67695 -3668 -151988 -3781 -120775 223588 -125154 -59548 130989 -64760 -168932
10079 -168932 44226 -572357 122091 -108239 -4678 -322516 -300062 210347 -312154 70270
10068 -172174 -88914 -227536 -203828 -194051 -286659 -308233 -56769 49916 -18480 43665 -430800
10056 -75073 159177 -102364 -332805 -41897 -197908 123100 18452 -61776 176111 -52292
10045 -193156 74570 -84043 157290 112968 2211 -67899 -43218 -24084 20703 -251858 -50937
10033 -147218 -83869 -180396 -299706 65494 -138786 -346654 -84965 -3884 -285236 84874 106468
10022 106468 -55331 -368065 140490 182357 -95036 15264 -186596 108261 -337596 -62347
10011 103962 -180239 -54723 425524 -116501 -278805 243966 -201692 -69124 43736 -148166
10000 150169 -69147 -62364 62209 126321 -68461 -129454 317969 -19561 -56464 -247144 16092
9988 -200370 -7994 -284120 -199719 -142023 -16128 -8740 -13765 -85022 -207612 55063 16549 71266
9976 71266 -195 -7285 -88552 -291736 -22144 219909 76975 -178597 -6142 181469 -36006 -100297
9964 -100297 -77993 -41262 58076 41667 -283903 62695 32765 185914 -72058 -54559 134723
9952 -485159 15650 -83111 399694 -31496 -261647 -55832 -72033 -331307 -48616 -225194 340206
9940 -10938 -217101 225655 -153819 -215336 -133863 131451 -220820 -45708 -109349 -71810 -49383
9929 -49383 -114513 -66374 -99155 -403551 -286002 329680 -71385 -167577 -102789 -67624 -109511
9918 -109511 -21620 130374 -381739 -98789 35293 -1881 -52235 -219135 -158397 81560 -346731
9906 70332 86871 -326326 -329664 120022 -20839 -309738 -274398 19916 -101950 -221916 70642
9894 20868 65351 -345941 -102650 -307156 -195767 -26641 129550 320169 -74148 -75107 -26132
9882 -145296 56698 -225452 -332865 -145052 -301276 -99814 97896 -148170 -161928 -190892 -123880
9871 -123880 -157817 72087 124528 -213556 -5152 -315367 -343602 74009 191495 273852 44553
9859 -83758 -243546 43064 180576 -6010 -183023 -804 -24348 -310790 282617 -226819 -839 -122012
9847 -122012 75725 -322774 -243443 239140 -183942 -13663 -251706 -293601 -296141 -290534 186345
9835 -31048 -20505 -79123 101677 238722 -202418 -12740 -145837 137640 -56625 -146530 -115491
9824 -115491 -102907 -24971 13418 307082 258170 -462516 121969 -240935 7863 121689 -143401
9812 -126888 -201404 -292401 -57050 -106139 -180359 -153982 -257375 -195530 -135928 -40438 -84450
9801 -84450 -371658 -466401 -87758 -50986 -199234 430935 -202911 -96430 -565932 -296923 -273547
9790 -273547 23828 -207367 -188965 86284 8139 62023 -321124 -224032 -121955 380377 103057
9778 177358 -64814 -70739 25365 46583 -143955 150315 202637 -143123 -253 -56841 -155549 124365
9765 81071 131367 -461074 -37208 88333 -137411 -161197 -33916 -145093 -119018 135420 225068
9754 225068 -29503 -67058 -155280 119983 -79886 -309321 -140163 -73912 -296852 -481729 68788
9742 315878 -73870 -158557 -283333 18597 6356 -154293 -230433 -5375 -134020 -176755 13609
9730 135324 43140 -93613 -85731 -51544 -71566 47813 11674 -273199 -218386 -387007 -313420
9719 -313420 -411308 51424 130102 -33481 -123826 83318 -363000 243964 52565 -151562 -58297
9707 222287 -50041 96872 -273007 -228776 279087 -104837 -125507 -315954 9967 -181762 -175012
9696 -175012 -347872 -45393 -17484 -158846 107217 -16448 -70753 -206118 70910 -125403 -25520
9684 120339 -41611 -369863 -296244 -89430 -31561 248716 -125445 -282024 -53668 -58363 21968
9672 -290188 -46888 -187838 65265 -11003 -40358 35926 -67912 -114613 -168169 -144661 -365345
9661 -365345 -39137 41960 -212797 5574 -151641 -189078 22912 -29116 237848 -36936 -75965
9650 -75965 27820 -76963 -194061 -112915 -516160 -11682 -32253 -235662 -4348 162325 -254806
9638 -275361 164831 -96201 -176058 89075 484588 -72639 160769 37802 -73248 33289 -125158
9626 -250026 -121168 274728 47893 142162 -38869 -348628 -219510 -9027 40430 -287989 -301936
9615 -301936 -11559 -433938 -101650 -75404 -179932 -46706 -150605 61523 -337798 -138664
9604 -298293 45737 119886 -41203 -131409 -34076 -330654 -40261 -204668 -63024 21570 -188093
9592 51801 -557116 -239870 -153866 318830 -66388 -504977 69238 87900 83918 -117891 -421015
9581 -421015 -329155 -80028 61652 -158049 192872 246335 259646 -87084 -285458 -207297 40990
9569 74577 177221 312229 64834 46567 -45249 -168419 -220857 9204 283319 51868 -168984
9557 328543 -69374 -248589 -210610 86968 -73896 -88146 -284300 -207386 -46938 80397 65024
9546 65024 -385713 -28444 -188676 172554 98326 -217192 -380677 -287690 -317813 8478 -344708
9534 -239500 -257642 -178258 150203 42068 -101756 56129 185951 -53679 -93775 -108872 -49364
9522 169483 115619 -222164 -178099 -684316 -130640 198778 -81780 280808 -28948 -225904
9512 -225904 -388863 -208253 -40410 -45116 -105410 -41447 158932 -311457 371986 -347761 -167699
9500 -134915 -23187 -271175 -237626 24883 -64806 -536283 58658 -183450 -263297 -393398 63597
9488 67662 -209367 -163166 183333 -21480 72520 -111280 -161813 -241646 135937 -76934 -96233
9477 -96233 189316 -229360 123550 -58287 -413930 -126771 -351146 -94017 -104144 91565 -308958
9465 -113274 -13806 -204299 -309440 -190922 180246 -186643 -365285 131667 -124184 -63180
9455 -63180 -350637 180925 150929 -41190 -111166 40737 -328683 -135274 -60479 -4311 -210578
9444 -210578 -109578 -148009 235350 1536 247362 235821 33530 -23313 23597 186 -127178
9432 -41335 -277894 -37812 -67435 -275140 -116306 138287 19592 38933 40786 -71879 -118037
9421 -118037 -232268 -4395 -177239 -224538 -183928 -219438 -10626 34848 96033 -148669 277898
9409 45143 -10316 -124642 140484 -382755 104430 242734 -11014 46403 30547 -230955 240035
9397 -7433 54367 31207 352866 253772 8512 3531 -174661 -113272 -61420 112402 -234863 61192
9384 -285471 74016 49501 -263944 -153625 -66721 -150576 303551 32844 -1438 35143 57909
9373 57909 174472 -86293 -182392 -75495 -419361 91764 -71607 -249582 285424 82317 9014
9361 179163 -242477 -92257 -92301 -19023 -233975 -19062 -487890 -115435 -282274 -22279 76193
9349 -242609 206716 103308 -111633 262632 25412 -94832 -83710 -151703 56190 28689 -164896
9337 -173388 -24743 -107366 -213820 -121643 -321143 234837 -200938 -82969 -322643 167978
9326 86891 -245234 39092 133705 -40129 -118599 -267785 -196540 12364 95621 -6952 23251 -80902
9313 -152857 -192523 -54961 -224609 -368835 -36098 159971 397493 -102247 19595 -207472
9302 331965 -2840 -261732 -145063 23708 67433 269187 114757 -291124 -260559 -71257 135943
9290 158352 -227962 105158 101726 -24349 -181508 -38091 -122622 -290719 -327510 -119338 157985
9278 -52759 -108349 94707 -87717 -225001 -46260 -278345 -432436 -5747 77061 -459641 -122792
9266 -200974 -65059 79794 -168714 -116063 -166850 -280697 -284867 -156602 -399819 -193893 -100839
9255 -100839 -321764 179837 -77794 -163249 -112949 87472 -161495 35533 2696 221557 130064
9244 130064 -9204 18068 -162616 -268452 122357 86899 -131417 -301821 -65382 -20380 -8367
9232 5691 288857 35542 -85169 4647 294587 -118157 -35873 -119156 123922 83766 -52186
9220 -254987 -174500 -119657 -105457 -35276 -126738 -75793 90124 175364 -331804 -340842 166539
9208 -353173 -138296 -125402 125414 -343532 -205710 -313499 -149929 -114926 -201559 112235
9197 -115308 34466 -315931 50922 -94533 96698 -133653 138319 -129196 -92121 -174023 -11199
9185 292420 61714 177788 -87598 -53429 -77818 -205316 46289 108912 -83240 -173028 -10684
9173 -131135 97778 -462051 46917 -272151 129165 -124353 221701 74648 -246679 292902
9162 -80307 31415 -26631 -49305 111162 207713 -270959 -223399 75948 165515 -92705 52089
9150 -102109 -79681 -84500 -136888 85351 -362473 -87666 -346605 -183921 76861 -177343 -264736
9139 -264736 -91220 -121553 -72232 -8357 -181416 -28663 -203654 275059 -200345 -153369 160928
9127 -435674 -204331 94394 76024 -171076 388355 365730 190687 -422609 98394 -139169
9116 -115788 -285492 -112179 -245655 69335 -131976 454195 120723 128322 18754 -157338
9105 260569 30839 -66372 -124203 -327082 -140923 -69442 155850 167169 87033 -219213 -436680
9094 -436680 -250086 -214540 -54368 46907 155123 -167473 -41119 34952 135302 -215685 233511
9082 4452 156517 -153881 15269 -416090 -97771 -204793 -73537 1220 -128265 589 -11228 175799
9069 -4154 -23479 -207110 3913 -13202 -1810 -135688 -300628 -109540 -110141 -191382 -124500 -109857
9057 -109857 -284592 197779 82420 -270587 116240 -209500 -103497 -198917 -512634 -287563
9047 -287563 241035 134467 19176 96280 4866 302053 -395981 -314258 204363 -161732 99512
9035 -175962 -131903 -106825 97951 -74166 -37668 107804 77408 -555595 42635 185439 15775
9023 142263 126093 -135335 43075 -269008 -62572 -227921 -317691 -168738 -42242 -367486 -110664
9011 -209767 98182 234798 -80093 -156512 10502 13688 -481820 -149956 -125974 -290784 165691
8999 409 -99607 -415443 -151606 -81655 -32185 -46187 -240675 -115110 -9691 -90093 60 108665
8987 108665 -7095 -233987 133195 12547 -235518 -165582 2572 300515 -132077 -110344 87318
8975 -271093 40618 213397 -57832 -254748 -47173 231213 44221 -46208 -221602 202827 93980
8963 -479262 -285608 84933 -100464 246766 -113236 87121 -199563 44127 13262 129913
8953 129913 135647 -38327 -116227 -83723 -382659 -98897 -179824 180642 -73175 -4408 60698 -116929
8940 -108576 335326 255652 -185524 94547 -111755 242909 -114805 150266 88930 185833
8930 185833 -81261 226823 164302 -228127 -256371 54858 582966 1134786 2947104 4912867
8920 4912867 3100516 1203535 454183 106359 -169389 -308186 3946 -9918 -64951 -312787
8910 -312787 -8126 -6002 97071 2280 -51087 -147852 -321943 7137 88209 56387 -176803 -355163
8898 -355163 -333350 -5570 427969 -137534 -118630 -199206 -156814 236515 124469 118236 -132337
8886 241780 -160285 -330514 -188115 25929 -156560 -172464 80434 39166 -8454 23458 -306835
8874 101659 -113268 -133095 -493563 25008 388770 60497 -77567 -261933 199121 -305235
8863 23548 172788 134855 -90599 31759 -199035 164725 -133918 -1059 107825 -237418 74535
8851 -380616 -249868 -91248 -63040 -9178 15171 -111803 245533 -481251 7723 -43327 -80658
8840 -80658 -192013 263878 -261379 -138978 -166212 -26384 -352773 -125990 76328 -312107
8829 -28737 -63001 -340524 107598 -80638 23470 151637 -266579 -271359 39190 -42016 -220912
8818 -220912 51051 77324 -154691 -165079 11823 19458 -203489 159890 -147915 -168640 -172333
8807 -172333 -62078 -22126 86841 110764 93420 -35427 -100526 172223 -153034 -104858 -217026
8796 -217026 -37184 81151 153450 155098 -118166 -202139 259169 -224890 -184492 332205 -319419
8784 -291764 -135792 279306 211311 -448195 -112130 -76015 -206968 -53394 -232428 -189062
8774 -189062 -26988 -88395 20719 -71823 67656 5701 -60512 -215826 -295578 -171387 -297380
8763 -297380 176766 -151283 121537 -106970 -142051 -97353 104830 38343 -98601 63339 -504714
8751 81089 -115625 -72560 -282277 296177 -190778 -306882 -145135 -228521 -112901 196553
8740 -64406 61322 -95401 201778 -424929 -226423 -30726 10140 131512 10688 -75958 -150268
8729 -150268 149588 -42681 55866 -52565 -380594 -56529 105010 -319501 101814 49162 -38869
8717 -210215 -218987 -4296 -191756 248358 342119 217005 1929 -207109 -13010 -205694 52116
8705 51887 -124066 48033 137669 -184276 -90683 -389100 -199218 39651 174322 169047 67039
8693 100994 24627 39856 56361 -287577 23186 -302629 45829 146133 114659 -106096 -121241
8682 -121241 -205000 209173 -108335 157181 -70886 19257 -95731 112503 199427 58185 -82481
8670 -113831 164693 -205868 -13586 -111214 153994 -269915 135778 -183047 250546 -372788
8659 114596 -164263 137866 118782 15205 -117925 -216133 98036 -133264 -287361 -1940 -287641
8648 -287641 -30019 -279031 -221024 -331869 6771 108080 256774 -39553 -302660 -91270 -29521
8636 -237660 -168272 -51752 -350701 43796 23944 -17425 176447 97092 -198214 -35323 -118867
8625 -118867 -81099 191215 -61308 -30617 -395359 56485 -35785 -94150 142326 -63669 62022
8613 -67546 -151814 191288 -96966 354884 -24304 243795 79923 -26735 121465 -142660 -107384
8602 -107384 15640 -148555 66462 -325153 -245916 209671 123770 -115129 -186330 -296286 -93409
8590 -219363 40181 125355 184456 135838 -200485 -140507 -267789 -569425 -25144 -287652 115250
8578 -218840 -55550 -63915 176216 15295 -193196 111501 60418 3787 25884 -88158 -185567
8567 -185567 -98682 -176087 70344 92468 -247883 -291731 -147057 22677 -328725 177688 -11348
8555 -114530 133877 -140986 319491 -421549 -85863 -183206 147336 -188672 66132 161583
8545 161583 -80152 -71710 -32644 -30175 -55604 -156554 -439250 198238 -293359 -328770 -124685
8533 -180004 -413405 27412 -283739 31661 -31846 -1587 -472203 -351618 -215902 43512 -320122
8521 -198789 -76425 210176 -28736 267858 -109205 172115 -124529 77707 -7255 -199417 20609
8509 -199831 -141698 -424136 164406 -191048 54069 105339 -126381 -178451 -203347 193708 -64220
8497 -91207 -161887 21935 -212723 -520704 -323022 77731 -147970 -171260 48837 204271 -47108
8485 186695 -199599 291868 -42457 7577 -17294 -249789 -94251 -144512 181941 -155666 -65463
8473 -11397 -118120 -247573 -44229 26460 268097 -126883 -43112 165649 -260585 -70416 31426
8461 -312271 29569 100565 -114461 208522 203316 -279622 306812 -237296 155651 70292 -91202
8449 342319 255258 -181104 50379 -27818 85685 -10974 -34962 274692 -154436 -108818 -198856
8438 -198856 -325036 -8805 19916 -230132 -135250 84608 -30426 58112 -307599 -308259 130083
8426 -187005 206481 25862 -93113 -149230 82444 -320345 14660 -20068 -287085 249938 43672
8414 -307919 -108707 -203140 -23181 127729 91623 78478 -30458 151177 -185978 -330265 57026
8402 -7552 220441 -22801 -228743 36241 -97032 -43280 70784 -419201 49364 38193 17997
8390 -86344 15511 28604 -62084 -32934 -299220 -348785 58274 -134922 19755 -41118 -194145
8379 -194145 -125423 208154 -174980 121287 65194 -163036 82186 -262640 -77576 53988 17133
8367 -144910 -161074 -185733 -96562 -169524 226314 -152825 -250536 -112510 -155785 -164719 94435
8355 -369179 120217 -199419 17444 -472433 -336483 -231138 -268054 343298 -15790 -1476 3626
8343 -47819 -215520 113730 122522 -16993 16793 -299833 26280 146063 -198793 -58026 75903
8331 134374 -86942 -84254 -283768 32195 -139526 -414829 160851 56753 90113 -26744 84455
8319 -17416 58283 -23032 286137 -147173 283369 -189046 -349284 -27890 -230493 -89117 -198742
8308 -198742 128325 15523 140368 -296836 37415 -421642 -119127 -5643 -177666 90234 -29387
8296 45424 -104470 -286850 -182951 60055 -14150 -248032 126961 -194092 -490814 -170290
8285 63036 351764 25993 -51372 -84462 29997 -152913 204651 185910 -25667 -163296 131803
8273 217695 -122800 93494 124964 -232682 33148 -16034 -293412 -318489 31171 125674 -369878
8261 -175625 -266351 -488769 269310 -347631 -46491 184496 -261349 -547701 263069 -51289
8250 -242167 -121902 129725 -252607 -221049 11507 149513 -89378 171256 -107372 -212756
8240 -212756 73471 -82291 -79668 141154 348345 74812 63095 -218754 73266 -334755 -163589
8228 -227675 -13626 40043 174388 -172250 119665 523 54868 281644 -128536 279344 -3649
8216 -49060 -80762 -16739 118251 -283647 -212920 -46239 139961 -153047 -114188 -77730 6530
8204 -124632 -682 -6927 -186214 2307 -49597 -160840 168504 145946 228990 -166477 -183345 -57430
8191 252019 -572185 -13920 112906 282923 -57444 -138777 -58755 -143667 94360 106603 -82763
8179 240910 53218 -149863 -59224 -512942 184729 -84465 -179406 92675 101837 -77608 -201306
8168 -201306 -157992 290658 -38079 -246274 152043 111796 -223147 -181712 -120659 -275311 170186
8156 -32603 -145439 30685 -194127 44795 153517 -116905 37126 -217802 43467 21186 -459611
8144 35581 -8132 -286565 203305 -98688 353230 35193 58706 -284818 -19956 -84009 -3868
8132 -174583 182586 -353985 22634 -46209 15670 36060 -386352 13293 268825 18476 30389
8121 30389 -238335 -94792 31852 -55218 -153345 -30351 -75923 21445 -121111 -181417 -79274
8109 -125398 129513 13351 -57296 -130076 47361 94308 37073 88966 -7492 49086 -120858
8097 169643 -55285 2645 382130 -290317 -126154 -103577 53747 14805 -417495 163183 50670
8085 -39001 -176850 251737 337911 -52642 -123897 256821 53928 -143594 -23529 145216 105888
8074 105888 104599 -57350 -15108 464853 -59998 -266382 104841 -111579 43636 -159629 84204
8062 -39536 90074 404152 -230339 -186472 -313 -13324 -123989 -40852 -293686 -306538 -101992
8050 -19913 -54832 -118395 -30994 -192550 -104466 -566126 -164970 97534 152082 -187091 299284
8038 3876 -81836 -293858 -38382 -159925 100434 27705 -69045 -146524 -47885 -156568 37825
8026 -131231 -118374 42846 -316581 -392190 21893 -130084 193287 27989 335164 -244390 -174134
8015 -174134 -55663 395072 -84393 138152 223738 -435271 102539 -172040 -365942 -116799
8004 -80633 -31787 85499 -319231 3824 49747 -329435 24802 -94948 -42322 184722 -92938
7992 -17014 86338 -11228 -200143 -126370 -39434 -79119 86094 -65695 -43311 -119266 145941
7980 -56389 -74235 -373042 176391 -250751 -429038 -110500 -9715 -10847 159482 -9232 -104620
7969 -104620 -162212 23631 -175885 302318 -243566 79181 -127357 -124340 -153819 -171874 196849
7957 -145650 6571 39187 -75635 148338 -61118 8630 -272641 129234 -316727 -88042 -87822 -293410
7945 -293410 -168587 -262801 234789 -117461 -267772 -328176 -72508 -387403 -284697 -52142
7934 38953 156455 40366 112524 212696 164837 -161693 24903 -191441 59601 57752 -60486
7922 -337127 -197135 254092 -120054 -49809 208150 -222353 -332733 -23648 139536 -121010
7911 -299485 -41855 -37479 -96844 -157204 317538 -27709 -176277 -216855 -331872 -59859 9996
7899 -306144 -41179 -134340 -9245 -157104 60668 -248480 -104222 -45115 -87840 -61181 100447
7887 -104461 -143892 32917 -364673 -160538 -186329 31455 -199067 11765 -114182 -169848 -170117
7876 -170117 -10126 -15374 -133016 15642 -24723 32271 -412490 203115 -142854 -328023 -66396
7864 -37307 74423 -202958 154980 221875 -36413 156387 -168788 -30509 -380981 -19511 -323056
7853 -323056 -1372 -75448 -76514 161995 -196052 -494097 -393504 24217 20984 -96138 -49650
7842 -49650 -9108 155488 143935 134976 -126308 35382 -35068 -91498 -85679 172913 -133153 261039
7829 -146284 -16580 -146722 108960 -169529 12915 114650 -197700 -322190 -41082 25950
7818 228979 -5273 -65134 320688 -416772 -128798 -119684 11866 -102476 -220778 56707 119923
7807 119923 96097 -131470 -359983 -58201 166192 82091 123782 28227 -221352 -35610 -107332
7796 -107332 -225292 57907 -110545 -17841 -182663 -104750 219871 -310946 445582 -285227
7785 -272876 -60879 69800 195258 -99419 34404 -320777 178199 8004 333656 -59134 -114869
7774 -114869 162551 -77078 43421 -97925 -57731 -258517 -91631 -199014 8301 101521 -171139
7762 -224814 -181054 -309949 -8666 -28517 -98439 45788 236471 -96040 108621 -41961 201659
7750 -260974 -99284 81244 12800 -135913 -96326 -102123 122927 -377071 -22748 2652 463033
7739 463033 -191662 -301340 435796 -67433 -113154 6606 23838 214032 -194867 447575 36528
7727 101259 -162686 160670 -2361 -86558 -45951 -256462 -311349 66813 41957 -146423 -20774
7715 134710 265907 10147 -1983 168897 -139296 -164392 94809 -127165 -164125 -190736 -19650
7703 -245829 12594 -169017 121585 -86189 -174215 -290621 -402292 208071 211812 -259878 -48904
7691 -184467 -274852 -105270 76495 -160649 55791 2302 -309269 -244412 95660 83906 14077
7679 161033 -187687 226052 -22324 -126000 47665 20471 -112816 11706 -29986 -11438 42144
7667 4589 216900 444150 -106546 21753 129838 -2869 -252086 31700 194007 84803 35131
7655 -28634 110601 -72505 114477 16305 -91482 -206936 14412 35512 -191325 -340964 -70894
7643 -74600 436037 84594 -68122 -14145 -178987 -82046 493202 -314054 9585 -59466 -225295
7632 -225295 16050 112592 102958 -35620 30067 -168024 -71151 -269249 -155002 -139739 -283700
7621 -283700 -473520 -22587 -93989 138448 61039 194714 103552 -200549 -282449 -109990 -63347
7610 -63347 -179456 -77763 -161804 -121000 119830 44874 31279 -416823 -73950 -126034 -224579
7599 -224579 18898 53276 -75329 123294 234007 12448 8915 -187310 -21757 -299074 29481
7587 164795 -187596 337616 -251176 -106733 287168 -250568 49284 369249 197756 33860
7576 -219406 140621 -43477 123927 -125909 -230980 -255579 -72656 -348726 53471 -111011
7565 -161918 153829 -171662 93473 343978 -340274 -64205 6449 134233 -127573 -217486 321974
7553 -68827 28885 -87842 -120500 -144440 -95377 -266210 103743 9633 -205414 -169678 148491
7541 280097 -4336 -136156 1985 512889 -43134 162128 372738 -347082 -281498 -51263 111143
7529 58889 -315527 -226865 -79504 26937 -15469 -291859 -69707 -285411 62157 232985 -190439
7517 158098 135194 -209034 85349 177518 -158386 -200226 -339464 -172963 55583 -12771 112363
7505 49589 -126545 45836 26695 97509 405495 -292137 -117153 -29388 33487 778 10283 -41421
7492 -28457 -248699 -132529 -62931 96527 -2826 102735 128434 34007 -185500 -37210 -23454
7481 -23454 -202105 36026 -177688 -537095 112734 -431072 -219013 -62256 -207952 36084
7470 209407 -11567 148186 -125793 -13063 101738 81441 -117654 -233843 140952 198444
7460 198444 -81866 -158025 -51049 104305 155757 113859 14543 -14352 -147201 70531 206659
7449 206659 192783 -197874 -21482 -113930 -142110 137900 -336339 -83407 -73559 371423 -77271
7437 -51165 58186 -3900 -2356 -47663 -27999 -190631 126208 -78519 -81923 -116273 -57031 -4373
7424 -158071 -81495 21238 132221 -38508 -186734 22355 287050 -66771 -40224 82903 -133
7412 -208039 93255 -129054 -245731 -91492 -103015 -170012 -36332 -58497 166979 126327 -255151
7400 7837 44239 11172 201462 -114875 -514261 278256 -191549 18055 -131963 147589 -329305
7388 129170 -24886 -145370 -150674 -148813 -330230 185270 -131069 273564 169995 66011 7321
7376 -174973 54047 36690 -179568 110254 -214998 -39862 -78283 206724 -132380 151816
7365 -350600 -35944 -550242 -48992 -62000 125652 120628 -138183 -203795 134901 92176 8379
7353 114627 61726 124339 -149077 -377517 -182490 153812 -113659 -290861 -14815 -154183
7343 -154183 59152 -177214 98237 -99768 -19052 97632 -158720 -99352 -90153 -87883 -173581 266805
7330 161105 -4998 -52490 -104901 103595 -70695 62715 -12186 78540 88213 -180636 -405262
7319 -405262 -106106 2478 -169570 52794 152108 -214661 -208110 -86987 -161333 16979 -190300
7307 -97460 -179717 52255 78514 -114757 -20072 -231435 -9986 13825 -244651 130229 -174329
7295 251117 -104491 -152691 -127130 -16 170890 -333603 -26338 10542 -32782 -194049 -98777
7284 -98777 91813 -83367 9729 -22133 -239707 262240 -28866 -4938 -15317 -97273 267045 -67258
7271 -92888 134506 -34932 -17091 -416295 -540 89982 611 -81647 161313 -68873 21269 17283
7259 17283 -174242 133158 -263028 173264 124239 30096 62738 54553 155066 -128333 -302860
7248 -302860 -190414 234439 321232 14029 -217938 -107931 79991 170658 -243918 208338
7237 71398 228004 -251584 -18180 -177625 -148205 -256259 182429 -162377 78241 281483
7227 281483 -24020 199691 93320 489576 -91321 -158479 12967 -67376 112471 168119 212958
7216 212958 13400 -243055 -257300 76052 102555 -73377 193863 56866 -285575 -99656 -125115
7205 -125115 -125299 -121398 -115163 -191971 -17957 2815 -422829 32309 -13109 -131743 -92990 96773
7192 99428 266259 -145693 96726 67140 -269749 289028 -96125 90697 -235098 9384 -154402
7180 -66911 -80536 6527 79201 -203728 -16777 188574 -165666 -217419 46120 -15552 -201754
7169 -201754 -106166 -97009 85558 -317700 -238138 32953 -195223 -2091 40583 -60309 -172012
7158 -172012 33694 -108857 48307 183042 92413 252629 -101680 22437 -200157 -82878 61295
7146 -281834 -301449 -38087 53715 24094 -60230 73208 -293347 77039 -86733 -113932 100278
7134 222660 -214698 -29766 -93799 -178816 -222793 54717 -444871 330729 57577 -6704 -39519
7123 -39519 85164 315780 -24852 150424 -80375 -211825 1832 -309746 -40766 35674 107768
7112 107768 98973 -11437 -138093 -120370 -210268 47955 214559 -382181 138337 33624 -21092
7100 -155417 2272 -8229 76225 107176 -57784 -190053 -378514 -160980 -67146 -50167 -105727
7089 -105727 -71314 58707 -29241 141739 -82479 217922 -8326 97206 113588 -121058 -123499
7078 -123499 -11367 200637 186090 -6770 -53956 -72757 100854 -272465 118885 -47343 61116
7066 -40760 307928 -7843 10989 -53575 -213873 -333258 -233840 16873 -49338 204981 -141430
7054 -352146 -432715 11354 199277 -60994 -11119 -184904 -192384 177311 -218204 218231 -236486
7042 23647 -94071 -120796 38519 28921 100655 -205565 97457 -97944 -172551 -305574 21108 -281129
7029 189876 -64571 203094 -122097 226614 153543 -70425 -388072 -80359 197918 -226891
7018 -237223 115341 13446 -16368 117023 118606 -14325 -266531 -121972 34406 137373 -91851
7006 80447 250926 -47708 41715 -228365 -67997 -98020 -218239 163061 -10248 167662 -97538
6994 127873 -17926 8588 40245 -155091 -67864 -376571 -69572 -105808 -289417 138686 -36322
6982 37101 -134911 -33266 -216451 262417 -85933 155116 103235 70461 -38641 -119361 -282010
6971 -282010 -245868 196051 -90814 12827 -59048 162205 13996 87166 -328322 122586 -85423
6959 -186168 -57609 353001 -73364 -117807 -27873 -118372 385329 99510 -277196 -294637 122494
6947 72346 -234090 333422 -158900 -132434 -9109 -320409 -40812 -70779 -130116 25416 25955 -20477
6934 43961 -55807 10547 37896 -263736 -11038 13213 -218276 -182693 153472 95834 85141
6923 85141 148317 210343 10664 2715 -21423 -51563 -185198 -32719 306747 -105046 130719
6911 84399 -10079 41448 -156262 -38532 -29722 -41899 -80289 -60421 51486 17515 -14859 -82886
6899 -82886 46010 -187039 -34227 -148854 -51533 -20314 -445218 -88216 -33716 -106371 -123145
6888 -123145 -10283 131051 -244729 -343330 -475449 71141 -116283 -259099 -428631 -10954
6877 147304 -187737 118640 23257 -134574 75161 -225804 -198484 -60084 -75945 -2282 -200682
6866 -200682 -111185 205760 -67913 37454 -203466 255923 -141937 -11618 279895 27245 -54840
6854 178202 191845 -55338 164545 -249146 -169448 8694 260034 74033 254658 55676 -270566
6842 -303382 138236 -117168 139697 161011 -128776 -150784 76030 155402 -229966 -114802
6831 81394 -96709 -197267 -178048 -135666 -312929 -225735 -430944 178001 60367 -32471 -84839
6820 -84839 184090 -208294 297351 409628 -181908 -94593 75607 209998 35413 -43993 61952
6808 150418 -43675 -243841 210196 10221 67649 -187833 140776 -174657 -152726 -51633 -114956
6797 -114956 -115393 -16480 -327301 3422 298034 280319 -81338 318002 9032 -140821 13771 -73741
6784 197470 -199885 394130 -141771 189638 153466 -63969 94889 -94503 -8393 -77796 75084
6772 58901 197573 -17252 131032 -26856 -210872 19489 46901 -38676 -39501 9550 -67059 295560
6759 -89481 172859 257371 150175 -301616 164739 -120418 36235 -94820 202750 -22300 77839
6747 -59439 46686 113439 33609 -309369 -73604 -110487 -183711 110986 -77515 -47830 -192939
6736 -192939 18077 20144 -68626 274148 -105760 -21876 78662 -212770 138185 9185 -145819
6724 92185 108643 -191555 -391460 148030 20610 192014 -254093 135667 427857 -270358
6713 -224753 -166361 10216 100787 -139037 262328 39129 95504 57545 185583 -67546 -61860
6702 -61860 -131083 -2702 -216017 71359 380673 -286202 -165483 90708 -184904 -501492 -37304
6690 -27963 135918 -328445 24649 140849 93853 -114305 73466 56258 181803 286681 85232
6678 78850 -40520 -418887 -93208 -231654 297409 15961 -211054 62268 -5531 -270741 139841
6666 55014 -190109 -239390 -135480 -127870 32357 -345068 -314943 31921 363212 -121950 -235653
6655 -235653 18613 -265297 -111607 -17204 -427864 384080 120008 199536 79047 -259558
6644 44717 -69984 -88645 119428 3150 99407 216612 -22478 178910 -147087 3967 -175807
6632 -17185 96764 53969 -65743 21593 63142 -185252 38377 122652 20523 -60750 -103804 72492
6619 -55612 -208810 -157513 112429 -197314 -3489 -34592 83516 -25477 -51400 89470 -298906
6607 22802 -141801 -101485 15113 -204415 -104843 -80904 -433460 161547 -156295 -189826 508142
6595 2812 124871 -10646 -122279 -110635 -96024 -149470 -109093 171191 -17389 -153922 249799
6583 23213 61230 -24924 -124532 47400 73290 19286 -257556 97063 -290428 25092 -175440
6571 50468 97711 -138286 28371 -72945 -25700 123049 -51102 194644 -109088 -42491 -99115
6560 -99115 -115410 -254366 207412 -99960 -32480 116042 164251 27340 -49805 228383 43946
6548 77715 36978 -120470 -253147 -449247 -80256 -98830 -249089 -405854 -222832 188631
6537 -83988 -17363 -75486 -217630 36724 -335325 -35855 100161 -232350 116494 -236960 -2547
6525 114985 -95301 31141 -39481 -126904 95624 -191580 225059 -69236 -61922 -68140 -145848 -125008
6513 -125008 -135219 289015 350264 -54301 -129326 -28794 8125 -7602 -131993 -193664 271192
6501 -37918 -60215 -161814 125829 -458835 401995 29875 -60581 9993 -249335 54125 38914
6490 38914 25230 83568 145486 -48118 -165430 -141441 272368 -330441 25334 76781 -149069
6478 45031 -215035 -145316 -15553 1564 -19964 209427 107256 -93682 -14426 -274329 -135745
6466 140592 -2715 -228952 63658 -233934 313390 77562 -41970 -55460 -449228 -237663 337668
6454 186973 6354 208387 155639 -232744 104628 133965 81384 -238041 202467 69638 -135692
6442 126632 158145 54298 -380234 174770 -74100 -27196 78709 -291404 39847 70319 -95365
6430 -2688 -40169 69875 152330 92374 -26619 -309322 116191 137011 374028 -137802 59524
6418 50262 243181 -61370 -117024 53422 -169281 -328502 232904 -8117 55501 -25852 -6434
6406 2589 -195975 32577 167803 -50514 -54929 149682 -90706 134089 -130275 -149479 -76408
6395 -76408 39169 -233998 -126591 -195008 -677 166630 -97369 -281701 -145841 -44714 -119539
6384 -119539 -239832 -27527 149191 97119 267427 198595 25154 -94663 72047 -214146 20103
6372 157102 -121052 -199670 -197322 -90030 -144044 19819 96173 69679 -173606 -122964 -226455
6361 -226455 -431284 -52340 139531 -119187 -46096 47949 90359 30793 114538 -315984 282055
6349 340559 -302948 61078 -116756 -83860 -170250 270529 -106301 83070 -61732 10934 81673
6338 81673 27177 -114290 23018 -136940 -197733 -398130 325260 248171 183322 -224219 -90138
6326 -131279 27060 -46583 -58853 -48119 -286163 -103056 204419 139827 -13140 94680 -136952
6314 126789 86360 205463 -113718 -48050 -75023 -263779 33841 41173 -85901 226015 176413
6303 176413 -46123 -241505 -252886 -192891 71301 -158525 11039 -88971 -100858 -270244 70568
6291 69460 -12633 -92744 144427 -255519 128992 -59353 -56784 118562 167214 -47118 87895
6279 -18253 167758 -104342 -138339 285097 -57066 -11231 -211541 -218798 163579 -166612 -190808
6268 -190808 -330085 -178490 -33943 167379 47652 37549 213402 -151876 -171897 95640 159933
6257 159933 -238544 118986 168207 31087 87485 -101496 259663 -189623 -60838 120104
6246 -249172 -285429 134502 -171889 32686 163821 -47255 125332 -61863 475283 -255193
6235 74966 -106245 42232 -230833 273855 96117 -513969 -173314 -189995 -42428 61935 121359
6224 121359 13039 113736 -76884 -142695 72478 -418107 -223713 108071 59952 97339 -99576
6212 183043 19174 -82434 -69152 -62852 -82050 -131538 -99311 39249 -112625 161367 36681
6200 -219745 -97634 -105521 -172987 58090 180230 -111281 113200 -223997 182052 128222 183520
6189 183520 109230 162916 -104904 66766 189789 -52446 -84969 120350 152291 -77845 -264286
6178 -264286 -113356 30064 357594 -195245 -208149 -12911 225402 270105 -110297 -25983 45495
6166 25289 363424 73294 -27839 352559 -58946 169867 410017 35844 271951 -98264 234620
6154 33079 -329318 27021 -335663 -219595 -5903 -124282 -88528 18834 -50289 167961 -162375
6142 205369 144963 -128488 -257123 199349 141670 -155898 35333 16013 63071 -168552 -83274
6130 150644 -147693 150745 -260902 20902 -31900 -17821 6860 -249421 -120778 327885 20334
6118 -189 -106986 125376 51241 -42955 19 156644 148114 -328405 197433 12020 -134298 -175271
6106 -175271 456574 -250569 42723 -106185 -77135 61367 269106 9477 -225958 -373095 267132
6094 -140135 78990 -56785 -62683 -203868 73790 -112004 -43071 166218 119838 -33791 -155237
6083 -155237 -84122 19818 57148 246126 52810 -102056 61601 -263954 -49688 92939 253652
6072 253652 37373 127158 24558 -499050 301073 121778 211998 60008 -6030 -202875 143134
6060 22729 -147210 140081 26853 -235482 284528 141053 -76671 -137709 37969 -89574 -58810
6049 -58810 -188915 -130693 -137273 142795 133738 -96263 -16555 -66498 123186 -103757 -34920
6037 -81334 -360910 -178305 -94665 1260 -113216 -202793 -38600 -65774 -229598 28713 -137382
6025 21633 -29469 -17424 45532 -40288 -4242 -162137 91172 244528 -124565 -30965 163521
6013 -63867 -55310 -59494 71192 -37700 -219006 -79182 224072 -121005 -243407 202172 -46643
6001 211269 -53747 -20684 -43967 -44868 55542 368615 41077 -296512 30390 -197632 -156697
5990 -156697 335312 388228 -25395 -55948 164845 113119 275024 -223479 16946 40733 182746
5979 182746 -211635 116130 252943 23841 -473615 -214571 -43672 121560 145489 -11699
5968 158006 -279836 -60167 -144135 184878 42249 -12792 -156039 103857 107402 181030 -70284
5956 -145378 -425671 106430 -21494 -41690 -432112 -105533 -45461 329771 -103519 -162856
5946 -162856 -169344 -158452 -18371 -164727 -190897 291671 128584 11519 -54925 1237 -72604
5934 -18225 -231433 422883 -115235 -453308 89617 163542 141129 -91235 106142 340408 -160629
5922 -125991 39623 191673 220497 141949 145151 -228208 114448 -50972 4917 -386702 61555
5910 305648 -161541 -115631 -25140 17407 4434 -550742 -75742 -17573 51073 -120447 -86362
5899 -86362 5351 84420 220705 -158519 178793 -150171 -30435 -74053 -111022 137789 123315
5888 123315 -66127 35680 266092 685 96603 -55782 239375 320207 -24803 195671 241028
5877 241028 -228686 -338149 -86053 -207982 -128725 -266771 174150 -152251 -7829 278094
5866 -51646 2922 326837 -102029 75748 -67285 38044 -215989 -331569 -293111 192148 -316694
5854 -199280 -92903 148394 -176851 142599 150763 -104536 113046 -139291 -157576 -165119 16554
5842 -17743 224863 187344 18063 168649 -208586 179741 -145280 -156869 256621 46346 -225431
5830 220251 -58773 8500 210770 -62059 -124411 -176258 -382996 34950 -125757 262360 -67040
5818 -267617 -13036 -106352 28142 240918 -59082 -31045 -31049 -168828 111884 106202 -26091 336340
5805 -20667 20499 16396 -4933 -171145 26291 -9916 -42168 287036 -53323 86128 146598 39301
5792 -83939 3782 -72207 -95242 78546 54926 339078 213089 347560 -36751 -58496 -192122
5781 -192122 175917 -23240 381337 -262698 103155 -81625 263554 -142241 218263 -254806
5770 -204227 -183268 345022 -13311 77745 -210616 -432319 -117318 -29993 40176 -42663 -1326
5758 -147261 477935 8187 -300556 56694 -21312 -86178 -91582 247573 -45133 -117473 238271
5746 78981 34563 -187946 46814 -130650 -185340 95693 45448 -112287 -88 263781 36336 -42767
5733 313087 -34329 -112028 -285213 -118088 -14312 161944 -64885 139132 -19804 37117 -223858
5721 60944 -333027 -80063 86924 43679 498148 187826 239832 181640 -273753 -61580 -184984
5710 -184984 -156284 -258475 176959 213426 129542 121115 28492 -151111 -211641 -197432 -81562
5698 3872 -216953 14732 76332 -25422 76557 -146904 66118 -94578 -146646 275086 -29532
5686 158627 -207252 -73878 -117633 -235731 149701 16147 -296668 162552 119058 -216081
5675 300406 -182621 -35311 -185992 -198440 56597 17816 116171 142004 56369 -95759 -239956
5664 -239956 -158213 -23039 186532 172549 162530 -340252 -134502 28176 407561 5982 -352167
5652 137899 -396847 68688 47920 -46954 -136071 135681 -178072 107534 80957 93398 14830
5640 65154 -499100 1910 85614 140896 149690 -65847 104857 113556 182501 -115620 -348899 -150389
5627 -5637 -34597 -152502 -149942 71157 141192 228098 38344 121172 20656 17606 -153892 233646
5614 -292741 221353 168645 150109 98263 445472 -146791 -60047 -242242 63145 -71 72690
5602 -411740 79338 -108938 -2474 -129949 434495 -59375 8351 4585 158109 -165642 -133220
5591 -133220 -208567 -25487 378332 -64307 112477 -286177 -344014 198323 218693 -259103 -75395
5579 -124968 139413 69320 228551 -89530 16488 27915 -265283 -130901 -224955 -164613 29271
5567 50737 17853 -99109 494610 -183282 104863 -156973 5518 124615 -30056 -171109 -121961
5556 -121961 -37646 -123477 -61304 168619 -159929 -64503 108234 -5837 -289282 34967 -16728
5544 358658 -67137 403315 -4966 -38105 151620 -41987 29951 236982 -81910 92012 -135511
5532 -12734 103763 -168982 -181051 86792 -118358 224129 93703 30780 -49393 -183057 2466
5520 84858 33714 220424 -180289 21511 251783 -253852 -12570 123425 -169911 122810
5509 82591 -49798 237975 -334655 3736 -377489 233570 55357 135713 -113735 95751 223063
5498 223063 -147565 43070 128650 -117102 -151639 -310243 -148399 -59701 -280886 197494
5487 -86204 -114645 -5447 -34059 -309687 174584 3895 -223714 32684 74845 -330748 5630 -37694
5474 292058 -62842 -37273 -102025 20588 107837 -194107 -133144 -27278 83587 -14487 141143
5462 -88067 176269 -9418 36761 122821 -110514 -266102 -125137 -95692 -247278 -272513 -211293
5451 -211293 -110629 -106377 355910 -210020 -269173 20608 5053 120713 47383 -52899 -370260
5440 -370260 -62775 54317 -55769 -37259 162747 121255 381390 -264449 299326 -104477 -225201
5429 -225201 120067 -331612 -100262 150718 37158 2753 294788 -219290 87957 63160 99922
5418 99922 -118753 106750 -47484 -154910 91466 33572 -47391 -133385 -22915 124280 -167775
5406 25132 13850 -101061 127224 6304 136639 96749 -307031 15272 389888 62631 -80765
5394 -25388 -195691 11886 116213 179286 -15204 -267783 -84452 -181835 372366 447871 -150806
5382 12982 304914 172189 -194689 -103524 -210190 -91483 160303 153495 45697 103560 260014
5371 260014 203931 119033 -288291 324839 209104 -112680 303899 268194 72855 308871
5361 308871 -27926 -91039 338324 145882 -200428 -23172 30293 -113727 -223695 288968
5350 269307 225479 111985 163651 -32946 217870 -54483 -113094 75543 80759 -372385 -131641
5338 -53837 53726 2280 -328467 108396 28699 -185574 -361250 -347758 47997 -61250 -76084
5327 -76084 430980 -209 263972 99258 427548 -89903 318738 59122 -272468 -108772 270703
5315 -254986 -105075 85137 108989 -26110 -166507 -13089 90364 -155411 84552 37410 137363
5304 137363 166478 182166 -60947 62254 -96353 -124156 120625 79031 -142760 130332 90824
5293 90824 -215911 156360 81343 73149 220442 -237825 72961 284892 -110844 29316 -350435
5281 91836 -41875 11681 201445 269579 130030 27415 217684 40223 -56616 -85869 120804
5269 338826 -21340 -119353 -123015 67880 -290850 -210341 60949 32222 176854 -16841 23156
5257 142074 313802 170571 14020 45436 10309 -15023 285575 -151487 -157937 -106246 -258878
5246 -258878 -33182 151245 248882 106316 295646 -218247 -82000 133283 -64920 125704
5235 -131014 35836 -154992 -289906 5472 -50231 -100417 -69954 -121686 -129287 201393 -20331
5223 -12184 -230682 253698 -292209 -142942 -180156 -123639 167570 199217 -92166 18686 -144972
5211 329840 245582 -245441 330582 1359 -384458 -104890 7937 -73209 183226 -274308 -4531
5199 808 101106 39224 -37804 -294971 -117597 -301074 -282009 -108942 133943 -234236 -150507
5188 -150507 23793 -90700 -248178 4828 82029 -125136 -127427 196144 -171464 9174 12780 -224630
5175 -60370 -233974 55809 102062 -121852 -15923 42623 205264 -85505 87501 105791 69942
5164 69942 65329 -15551 157006 18192 -722 -4739 -172530 -64884 -124566 -71739 -144148 385365
5151 151949 -43925 -67842 -243289 272310 -159201 82995 -58064 158416 112401 263508 171175
5140 171175 67642 37060 344795 180047 -201451 5945 -30258 341805 -77857 12041 -199640
5128 -124225 95728 -95105 -198219 -41870 -97640 234862 75168 -146323 -69012 -134178 16535
5116 43095 -66935 76765 241509 195155 248589 -58881 52938 152474 -33994 171212 -24974
5104 159061 139857 -269278 131726 -86867 -125369 -85693 -166462 -74273 -94766 -183572 -64092
5092 -34502 -115796 6341 -378053 -138039 -193732 -127718 -108519 71748 -209682 110394 -277298
5080 102610 -103918 168923 58598 114647 -23144 -126000 17403 58883 -2322 -70918 378773
5068 190476 -267280 27590 129327 161792 -303456 -141312 159017 101431 -126968 59689
5057 347672 -109323 -163663 -54646 -40873 -384022 212121 -331011 12144 -15705 -214772 -292166
5046 -292166 23057 -25779 -70863 -557095 -27637 20215 -172102 -282322 69898 95279 15701
5034 74296 -32662 364304 387762 90296 -17741 47796 -32099 178244 -97728 -22047 -138325
5023 -138325 69162 197581 55481 218507 237045 -187346 -95608 219415 -12587 170112 358724
5012 358724 -282521 145323 295232 -55799 88725 30143 -69704 -255797 102297 -65963 351350
5000 300947 -133183 -286597 -45861 -42339 165379 167193 -39588 -35642 -173795 -139242 -103102
4989 -103102 -72158 202301 -85626 24293 -174056 164368 -140697 -212468 67832 -173033 96534
4977 138607 -172247 98315 -498799 49325 180104 -87152 91045 -5437 23808 -208760 -71339
4965 -14938 -116100 -144328 535809 -137159 175195 367233 -161146 -148015 -47717 59240 -88136
4953 -79813 -229379 -268316 -69162 248189 326474 -170663 194412 -154729 197665 -129800
4942 119567 -266397 -260546 6441 -51566 156607 276831 71633 -196202 217268 119963 -116208
4930 29540 49602 417111 249668 100560 -23880 246321 -181311 -86965 -134069 180769 73733
4918 -60756 -166428 -138493 -114937 41350 -207295 -13712 -130243 282146 25137 -157601 23670
4906 -94055 200161 -138951 -1759 237831 135798 94297 -65353 177578 110623 -306917 79354
4894 324437 -206878 30859 81902 224807 -194231 -205505 176325 -48180 46791 -18661 -377430
4883 -377430 282768 -74300 3714 114878 217204 32234 -110622 -153015 -86563 325171 -111738
4871 174889 -126988 27618 -124645 -190667 -259520 -40610 82943 390993 -42166 107612 -9852
4859 97228 -78190 115864 -36808 95824 46796 89124 10872 -145323 113159 -59358 159200
4847 19774 -47981 -64305 -141932 259537 290338 134550 -58382 126256 -215997 -41763 20903
4835 257373 -156074 -189891 229597 -4924 260802 -37071 38850 -189468 156961 -280937 131890
4823 -14962 75504 46578 -288584 181624 -156352 -414907 -84853 -193194 -130238 242514 -322603
4811 -289291 244981 -147639 334583 7419 -22912 8091 72823 238985 -75701 123995 130675
4800 130675 215807 284164 171975 22592 -284233 -326431 130519 -306660 218692 67923 117712
4789 117712 19578 -148781 77430 -373815 -38547 -186176 129775 106767 -377395 -147491
4778 189443 77936 215320 -130837 -103462 91577 55336 124791 19240 276743 73637 -95855
4766 -58843 -162927 -99853 95216 -198668 -180900 146538 -119544 14570 -354080 146570 62918
4754 63341 103556 382942 103354 67106 3143 2285 33976 -213090 47497 126774 161256 -33032
4741 112310 131779 -30259 -15196 19905 -71322 147784 -321485 -35017 280711 -51552 250000
4729 24342 178345 5878 92104 210406 -42875 3549 182243 -280890 280521 267380 -314454
4717 120134 -300556 -214788 -38770 288902 150327 47821 -91291 -10715 -53182 119621 -42688
4705 87017 -124699 163739 -49437 33783 63474 263911 207578 -117455 190629 -268063 105910
4693 -309235 223049 259685 -92492 301536 -203334 149641 233941 98216 -211557 259868
4682 170237 9582 -63913 -30275 144625 35002 136518 -38572 -43994 -52958 217337 80383 -87085
4669 29494 25232 77937 159077 -376661 86830 449685 13895 15834 125795 36263 -112513
4657 159938 -277241 -269316 119794 218636 2013 -64086 -37389 52868 -31196 -32930 -175833 52356
4644 39756 -39429 11895 -191343 201497 346062 -139114 83239 83690 126147 8174 -13307 132968
4631 -49155 -249916 -207480 322695 51602 178993 -162142 412725 -113126 65601 -108805
4620 305672 -66893 -144710 4225 92669 -56478 -87906 108387 -377519 -39444 69245 65853 26772
4607 142148 -127150 -281465 34707 176694 -242491 125872 71533 342299 216739 -179189
4596 214741 371112 306272 153741 6201 118665 359541 10246 17279 152844 9866 -261844
4584 -146246 -39343 -152673 -221190 147629 124582 24828 53575 2498 41147 -104543 118367
4572 31996 86978 -142892 -100671 69849 8073 -257774 -67152 112036 -57193 -164523 -66337
4560 40744 -72444 20504 115591 249947 55116 334647 -359996 -365108 -84249 -284219 -121677
4548 10772 -143841 -143809 -6355 -108471 -114399 -68705 184563 143583 -13700 -8641 176420 121599
4536 121599 199051 -54545 -199201 46182 31141 68851 156326 -141541 71195 22400 24205
4525 24205 -165807 -9760 109866 236931 -81818 29014 -83207 -151962 330291 188103 156290
4514 156290 146993 -37993 -131634 417592 169649 31831 -21475 55414 -20421 -224909 23807
4502 299743 14535 157268 -60792 81718 28283 -114300 53972 -250754 3378 -48803 193086
4490 -36903 45087 -92505 35578 -65170 12836 170174 194364 69582 -381769 -165841 -58256
$$ [...]
##END NTUPLES=NMR SPECTRUM
##END=
