##TITLE=AC1681_2977_8571555_gdJ5YHvhbD
##JCAMPDX= 6.0         $$ Bruker NMR JCAMP-DX V2.0
##DATA TYPE= NMR SPECTRUM
##DATA CLASS= NTUPLES
##ORIGIN= BRUKER
##OWNER= Administrator
$$ 1.72 TOPSPIN		Version 2.1
$$ 2014-04-11 20:15:31.979 -0700  Administrator@X
$$ Compression mode = diff/dup
##.OBSERVE FREQUENCY= 400.02188249412
##.OBSERVE NUCLEUS= ^1H
##.ACQUISITION MODE= SIMULTANEOUS (DQD)
##.ACQUISITION SCHEME= undefined
##.AVERAGES= 64
##.DIGITISER RES= 22
##SPECTROMETER/DATA SYSTEM= spect
##.PULSE SEQUENCE= noesygpps1d.comp
##.SOLVENT NAME= COFFEE_meoh
##.SHIFT REFERENCE= INTERNAL, COFFEE_meoh, 1, 14.96147
##AUDIT TRAIL= $$ (NUMBER, WHEN, WHO, WHERE, PROCESS, VERSION, WHAT)
$$ ##TITLE= Audit trail, TOPSPIN		Version 2.1
$$ ##JCAMPDX= 5.01
$$ ##ORIGIN= Bruker BioSpin GmbH
$$ ##OWNER= Administrator
$$ $$ E:\/data/COFFEE/nmr/AC1681_2977_8571555_gdJ5YHvhbD/32/pdata/1/auditp.txt
$$ ##AUDIT TRAIL=  $$ (NUMBER, WHEN, WHO, WHERE, PROCESS, VERSION, WHAT)
(   1,<2014-04-11 20:15:26.714 -0700>,<Administrator>,<X>,<go>,<TOPSPIN 2.1>,
      <created by zg
	started at 2014-04-11 20:03:56.979 -0700,
	POWCHK enabled, PULCHK disabled,
       configuration hash MD5:
       C8 4E 4E 5D D3 5C D8 9E 9F 52 82 E0 59 8A DE 15
       data hash MD5: 64K
       BB 5A 04 99 7A 35 8E 1E 88 73 BA 44 F9 A4 24 E1>)
(   2,<2014-04-11 20:15:29.761 -0700>,<Administrator>,<X>,<proc1d>,<TOPSPIN 2.1>,
      <Start of raw data processing
       efp LB = 0.3 FT_mod = 6 PKNL = 1 PHC0 = 0 PHC1 = 0 SI = 128K 
       data hash MD5: 128K
       5D E2 7F 8B 5F C8 40 97 32 8D 0A 4D 0B 5D F7 F8>)
(   3,<2014-04-11 20:15:30.886 -0700>,<Administrator>,<X>,<proc1d>,<TOPSPIN 2.1>,
      <pk PHC0 = -81.83167 PHC1 = 0 
       data hash MD5: 128K
       30 43 92 2E 04 1C 43 72 C9 CF DB BA 26 22 78 17>)
(   4,<2014-04-11 20:15:31.354 -0700>,<Administrator>,<X>,<proc1d>,<TOPSPIN 2.1>,
      <abs ABSG = 1 
       data hash MD5: 128K
       FA 7A 27 38 4B 3E 0C 68 EC 07 19 E8 F4 9C DD 3A>)
(   5,<2014-04-11 20:15:31.479 -0700>,<Administrator>,<X>,<proc1d>,<TOPSPIN 2.1>,
      <abs ABSG = 2 
       data hash MD5: 128K
       8C 04 91 3C C5 3A CB D3 E1 D2 B5 19 43 EA B8 AB>)
(   6,<2014-04-11 20:15:31.589 -0700>,<Administrator>,<X>,<proc1d>,<TOPSPIN 2.1>,
      <abs ABSG = 3 
       data hash MD5: 128K
       D4 F2 F3 11 8B 29 1D 9B AD 00 C8 2A 13 C0 4B 4B>)
(   7,<2014-04-11 20:15:31.682 -0700>,<Administrator>,<X>,<proc1d>,<TOPSPIN 2.1>,
      <abs ABSG = 4 
       data hash MD5: 128K
       DC 30 8F A6 C0 3A 4B DB 9B 33 1A C4 3B 23 FB 87>)
(   8,<2014-04-11 20:15:31.761 -0700>,<Administrator>,<X>,<proc1d>,<TOPSPIN 2.1>,
      <abs ABSG = 5 
       data hash MD5: 128K
       2D 40 5C 0D BB F4 B4 C7 0D 93 92 0E 15 95 75 32>)
$$ ##END=
$$ 
$$ $$ hash MD5
$$ $$ A9 E0 67 6B 66 81 72 13 F6 FF 8C B6 4D 38 14 59
##$RELAX= 
##$RELAX= 
##$RELAX= 
##$RELAX= 
##$RELAX= 
##$RELAX= 
##$RELAX= 
##$RELAX= 
$$ Bruker specific parameters
$$ --------------------------
##$DU= <E:\>
##$EXPNO= 32
$$ [...]
##$TP07= 0
##$TPNAME0= <>
##$TPNAME1= <>
##$TPNAME2= <>
##$TPNAME3= <>
##$TPNAME4= <>
##$TPNAME5= <>
##$TPNAME6= <>
##$TPNAME7= <>
##$TPOAL= (0..7)
0.5 0.5 0.5 0.5 0.5 0.5 0.5 0.5
##$TPOFFS= (0..7)
0 0 0 0 0 0 0 0
##$TUNHIN= 0
##$TUNHOUT= 0
##$TUNXOUT= 0
##$USERA1= <user>
##$USERA2= <user>
##$USERA3= <user>
##$USERA4= <user>
##$USERA5= <user>
##$V9= 5
##$VALIST= <valist>
##$VCLIST= <CCCCCCCCCCCCCCC>
##$VD= 0
##$VDLIST= <DDDDDDDDDDDDDDD>
##$VPLIST= <PPPPPPPPPPPPPPP>
##$VTLIST= <TTTTTTTTTTTTTTT>
##$WBST= 1024
##$WBSW= 4
##$XGAIN= (0..3)
0 0 0 0
##$XL= 0
##$YL= 0
##$YMAX_a= 12531398
##$YMIN_a= -13268887
##$ZGOPTNS= <>
##$ZL1= 120
##$ZL2= 120
##$ZL3= 120
##$ZL4= 120
##$ABSF1= 14.96147
##$ABSF2= -5.596712
##$ABSG= 5
##$ABSL= 3
##$ALPHA= 0
##$AQORDER= 0
##$ASSFAC= 0
##$ASSFACI= 0
##$ASSFACX= 0
##$ASSWID= 0
##$AUNMP= <proc_prof1d_extract.lims>
##$AXLEFT= 0
##$AXNAME= <>
##$AXNUC= <1H>
##$AXRIGHT= 0
##$AXTYPE= 0
##$AXUNIT= <>
##$AZFE= 0.1
##$AZFW= 0.1
##$BCFW= 0
##$BC_mod= 0
##$BYTORDP= 0
##$COROFFS= 0
##$CY= 15
##$DATMOD= 1
##$DC= 0
##$DFILT= <>
##$DTYPP= 0
##$F1P= 0
##$F2P= 0
##$FCOR= 0.5
##$FTSIZE= 131072
##$FT_mod= 6
##$GAMMA= 0
##$GB= 0
##$INTBC= 1
##$INTSCL= 1
##$ISEN= 128
##$LB= 0.3
##$LEV0= 0
##$LPBIN= 0
##$MAXI= 10000
##$MC2= 0
##$MEAN= 0
##$ME_mod= 0
##$MI= 0
##$NCOEF= 0
##$NC_proc= -1
##$NLEV= 6
##$NOISF1= 0
##$NOISF2= 0
##$NSP= 0
##$NTH_PI= 0
##$NZP= 0
##$OFFSET= 14.96147
##$PC= 1
##$PHC0= -81.83167
##$PHC1= 0
##$PH_mod= 1
##$PKNL= yes
##$PPARMOD= 0
##$PPDIAG= 0
##$PPIPTYP= 0
##$PPMPNUM= 2147483647
##$PPRESOL= 1
##$PSCAL= 4
##$PSIGN= 0
##$PYNMP= <proc.py>
##$REVERSE= no
##$SF= 400.020009449489
##$SI= 131072
##$SIGF1= 0
##$SIGF2= 0
##$SINO= 400
##$SIOLD= 131072
##$SPECTYP= <>
##$SREGLST= <1H.CDCl3>
##$SSB= 0
##$STSI= 131072
##$STSR= 0
##$SW_p= 8223.68421052631
##$SYMM= 0
##$S_DEV= 0
##$TDeff= 65536
##$TDoff= 0
##$TI= <>
##$TILT= no
##$TM1= 0
##$TM2= 0
##$TOPLEV= 0
##$USERP1= <user>
##$USERP2= <user>
##$USERP3= <user>
##$USERP4= <user>
##$USERP5= <user>
##$WDW= 1
##$XDIM= 131072
##$YMAX_p= 105669338
##$YMIN_p= -415719093
##$CURPLOT= <Network HP LaserJet P1505>
##$CURPRIN= <$Network HP LaserJet P1505>
##$DFORMAT= <normdp>
##$LAYOUT= <+/1D_H.xwp>
##$LFORMAT= <normlp>
##$PFORMAT= <normpl>
##$SURQMSG= 1
$$ End of Bruker specific parameters
$$ ---------------------------------
##NTUPLES= NMR SPECTRUM
##VAR_NAME=  FREQUENCY,     SPECTRUM/REAL,   SPECTRUM/IMAG
##SYMBOL=    X,             R,               I
##VAR_TYPE=  INDEPENDENT,   DEPENDENT,       DEPENDENT
##VAR_FORM=  AFFN,          ASDF,            ASDF
##VAR_DIM=   131072,        131072,          131072
##UNITS=     HZ,            ARBITRARY UNITS, ARBITRARY UNITS
##FACTOR=    0.0627417313425164, 1,          1
##FIRST=     8223.62146879497, 1647,         -26549
##LAST=      0,             2153,            -26476
##MIN=       0,             -415719093,      0
##MAX=       8223.62146879497, 105669338,    0
$$ Real data points
##PAGE= N=1
##DATA TABLE= (X++(R..R)), XYDATA
$$ [...]
$$ plain form
62907 313573 312954 312652 312831 313200 313397 313393 313408 313524 313592 313507 313371 313291 313174 312883 312473 312140 311996 312063 312424 313173 314208
62886 314208 315245 316114 316879 317589 318108 318309 318316 318345 318378 318217 317831 317426 317129 316767 316098 315124 314041 312991 311992
62867 311992 311028 310042 308903 307518 306010 304598 303316 301982 300487 298952 297531 296222 294973 293838 292905
62852 292905 292140 291448 290820 290312 289939 289711 289728 290111 290826 291687 292485 293056 293319 293403 293676 294436 295542 296538 297182
62833 297182 297680 298348 299247 300263 301348 302499 303573 304370 304898 305430 306278 307582 309317 311351 313441 315294
62817 315294 316746 317901 319034 320346 321817 323313 324807 326498 328691 331549 334935 338478 341833 344894
62803 344894 347795 350690 353600 356515 359621 363264 367678 372839 378663 385159 392281 399812 407630 415996
62789 415996 425336 435786 447215 459656 473404 488588 504951 522233 540526 560121 581231 604094
$$ packed form
62907C13573o19l02J79L69J97mJ5J16O8q5j36q0j17k91m10l33j44O7L61P49J035
62886C14208J037Q69P65P10N19K01PK9L3j61l86m05k97l62o69r74j083j050r99
62867C11992r64r86j139j385j508j412j282j334j495j535j421j309j249j135r33
62852B92905p65o92o28n08l73k28J7L83P15Q61P98N71K63Q4K73P60J106R96O44
62833B97182M98O68Q99J016J085J151J074P97N28N32Q48J304J735K034K090J853
62817C15294J452J155J133J312J471J496J494J691K193K858L386L543L355L061
62803C44894K901K895K910K915L106L643M414N161N824O496P122P531P818Q366
62789D15996R340J0450J1429J2441J3748J5184J6363J7282J8293J9595K1110K2863
$$ plain form
62777 604094 629076 656325 685388 715478 746097 777205 808836 840776 872586 903649 933168
62766 933168 960357 984679 1005789 1023276 1036684 1045808 1050704 1051346 1047475 1038860 1025524 1007685 985779
62753 985779 960653 933425 904854 875023 843829 811647 779249 747179 715553 684481 654408
62742 654408 625961 599635 575667 554031 534393 516267 499395 483927 470075 457675 446241
62731 446241 435499 425709 417338 410511 404886 400047 395882 392528 390066 388401 387398 386991 387162 387922 389374
62716 389374 391700 394985 399105 403858 409214 415360 422500 430637 439590 449237 459753 471539 484873
62703 484873 499682 515761 533224 552594 574379 598634 625021 653196 682948 714025 746002
62692 746002 778459 811157 843900 876267 907593 937293 965056 990616 1013360 1032332 1046691
$$ packed form
62777F04094K4982K7249K9063L0090L0619L1108L1631L1940L1810L1063K9519
62766I33168K7189K4322K1110J7487J3408R124M896O42l871q615j3336j7839k1906
62753I85779k5126k7228k8571k9831l1194l2182l2398l2070l1626l1072l0073
62742F54408k8447k6326k3968k1636j9638j8126j6872j5468j3852j2400j1434
62731D46241j0742r790q371o827n625m839m165l354k462j665j003m07J71P60J452
62716C89374K326L285M120M753N356O146P140Q137Q953R647J0516J1786J3334
62703D84873J4809J6079J7463J9370K1785K4255K6387K8175K9752L1077L1977
62692G46002L2457L2698L2743L2367L1326K9700K7763K5560K2744J8972J4359
$$ plain form
62681 1046691 1056131 1060796 1060891 1056460 1047490 1034100 1016557 995196 970372 942491 912099 879942 846901
62668 846901 813708 780728 748046 715794 684329 654127 625596 598974 574269 551301 529948
62657 529948 510343 492667 476683 461723 447322 433738 421643 411345 402470 394402 386863 380043
62645 380043 374263 369569 365615 361948 358392 355098 352220 349685 347359 345234 343292 341354 339345 337581
62631 337581 336473 335896 335177 333836 332080 330425 329052 327746 326331 324906 323728 322982 322665 322513 322130 321335
62615 321335 320404 319831 319853 320291 320827 321307 321781 322429 323502 325210 327545 330303 333355 336853 341078 346111
62599 346111 351777 357951 364860 372958 382542 393562 405831 419246 433681 448750 463925 478971
62587 478971 494086 509457 524826 539627 553430 566004 577066 586256 593483 598996 602932 604978
$$ packed form
62681A046691R440M665R5m431q970j3390j7543k1361k4824k7881l0392l2157l3041
62668H46901l3193l2980l2682l2252l1465l0202k8531k6622k4705k2968k1353
62657E29948j9605j7676j5984j4960j4401j3584j2095j0298q875q068p539o820
62645C80043n780m694l954l667l556l294k878k535k326k125j942j938k009j764
62631C37581j108n77p19j341j756j655j373j306j415j425j178p46l17j52l83p95
62615C21335r31n73K2M38N36M80M74O48J073J708K335K758L052L498M225N033
62599C46111N666O174O909Q098R584J1020J2269J3415J4435J5069J5175J5046
62587D78971J5115J5371J5369J4801J3803J2574J1062R190P227N513L936K046
$$ plain form
62575 604978 604658 601810 596605 589203 579730 568548 556248 543226 529472 514925 499864 484811 470131
62562 470131 455967 442430 429649 417614 406184 395349 385327 376361 368527 361798 356123 351336
62550 351336 347098 343150 339575 336664 334491 332770 331114 329352 327568 325946 324644 323713 323075 322618 322379
62535 322379 322559 323294 324476 325856 327271 328726 330302 332115 334365 337292 341017 345494 350649 356489 363061
62520 363061 370406 378653 388106 399055 411477 425039 439472 454885 471618 489883 509629 530666
62508 530666 552772 575637 598906 622345 645867 669309 692274 714326 735279 755208 774231
62497 774231 792365 809531 825539 840122 853120 864578 874509 882589 888357 891759 893250 893171 891223
62484 891223 886790 879625 869995 858208 844260 828011 809512 789054 767011 743691 719272 693825
$$ packed form
62575F04978l20k848n205p402r473j1182j2300j3022j3754j4547j5061j5053j4680
62562D70131j4164j3537j2781j2035j1430j0835j0022q966p834o729n675m787
62550C51336m238l948l575k911k173j721j656j762j784j622j302r31o38m57k39
62535C22379J80P35J182J380J415J455J576J813K250K927L725M477N155N840O572
62520C63061P345Q247R453J0949J2422J3562J4433J5413J6733J8265J9746K1037
62508E30666K2106K2865K3269K3439K3522K3442K2965K2052K0953J9929J9023
62497G74231J8134J7166J6008J4583J2998J1458R931Q080N768L402J491p9j948
62484H91223m433p165r630j1787j3948j6249j8499k0458k2043k3320k4419k5447
$$ plain form
62472 693825 667475 640534 613431 586523 560109 534551 510242 487388 465965 445947 427440
62461 427440 410509 395057 381009 368491 357644 348337 340261 333240 327274 322250 317833 313762 310101
62448 310101 307092 304804 303048 301549 300155 298897 297945 297471 297452 297592 297525 297119 296549 296024 295544 294981 294346
62431 294346 293810 293425 292945 292070 290798 289440 288253 287188 286026 284632 283051 281445 280035 278982 278217
62416 278217 277476 276617 275821 275346 275145 274910 274493 274096 274028 274430 275261 276338 277379 278207 279058 280492 282845 285888
62398 285888 289182 292601 296293 300264 304328 308481 313008 318110 323596 329088 334416 339682 345021 350404
62384 350404 355602 360272 364130 367174 369731 372222 374860 377578 380209 382692 385107 387575 390161 392934
62370 392934 396097 399987 404806 410448 416745 423893 432470 442941 455304 469309 484872 502080 520865
$$ packed form
62472F93825k6350k6941k7103k6908k6414k5558k4309k2854k1423k0018j8507
62461D27440j6931j5452j4048j2518j0847r307q076p021n966n024m417m071l661
62448C10101l009k288j756j499j394j258r52m74j9J40o7m06n70n25m80n63o35
62431B94346n36l85m80q75j272j358j187j065j162j394j581j606j410j053p65
62416B78217p41q59p96m75k01k35m17l97o8M02Q31J077J041Q28Q51J434K353L043
62398B85888L294L419L692L971M064M153M527N102N486N492N328N266N339N383
62384C50404N198M670L858L044K557K491K638K718K631K483K415K468K586K773
62370C92934L163L890M819N642O297P148Q577J0471J2363J4005J5563J7208J8785
$$ plain form
62357 520865 540893 561829 583528 605910 628707 651427 673573 694880 715326 734882 753265
62346 753265 769955 784440 796312 805148 810480 812079 810184 805302 797843 788024 776037 762077 746228
62333 746228 728550 709329 689081 668264 647138 625894 604737 583790 563157 543210 524537
62322 524537 507394 491406 476050 461378 447973 436234 425977 416784 408493 401184 394872 389428
62310 389428 384782 381055 378418 376857 376094 375777 375713 375913 376408 377093 377798 378456 379144 380011 381184 382641 384072
62293 384072 384951 384900 383954 382435 380635 378755 376960 375273 373489 371450 369404 367754 366455 364966 362935
62278 362935 360637 358547 356830 355480 354690 354708 355481 356804 358779 361781 365975 371190 377350 384722 393625
62263 393625 404098 415965 429119 443621 459619 477195 496178 516084 536359 556678 576842
$$ packed form
62357E20865K0028K0936K1699K2382K2797K2720K2146K1307K0446J9556J8383
62346G53265J6690J4485J1872Q836N332J599j895m882p459r819j1987j3960j5849
62333G46228j7678j9221k0248k0817k1126k1244k1157k0947k0633j9947j8673
62322E24537j7143j5988j5356j4672j3405j1739j0257r193q291p309o312n444
62310C89428m646l727k637j561p63l17o4K00M95O85P05O58O88Q67J173J457J431
62293C84072Q79n1r46j519j800j880j795j687j784k039k046j650j299j489k031
62278C62935k298k090j717j350p90J8P73J323J975L002M194N215O160P372Q903
62263C93625J0473J1867J3154J4502J5998J7576J8983J9906K0275K0319K0164
$$ plain form
62252 576842 596471 615065 632379 648477 663304 676435 687319 695565 700915 703206 702529 699207 693453
62239 693453 685297 674964 662985 649685 634860 618319 600531 582298 563987 545539 527152 509418
62227 509418 492705 476887 461873 447964 435422 424043 413483 403742 395010 387175 379876 372986
62215 372986 366742 361356 356761 352822 349614 347311 345856 344896 344029 343106 342222 341514 341036 340882 341273 342349
62199 342349 343935 345711 347624 349943 352861 356230 359780 363450 367360 371552 375929 380397 384939 389561
62185 389561 394220 398785 403050 406861 410283 413535 416720 419734 422502 425178 428057 431413 435487 440440
62171 440440 446208 452591 459664 467900 477649 488664 500421 512747 525742 539193 552522 565424
62159 565424 578104 590624 602353 612406 620449 626723 631390 634199 634826 633221 629502 623793 616342
$$ packed form
62252E76842J9629J8594J7314J6098J4827J3131J0884Q246N350K291o77l322n754
62239F93453q156j0333j1979j3300j4825j6541j7788j8233j8311j8448j8387j7734
62227E09418j6713j5818j5014j3909j2542j1379j0560r741q732p835p299o890
62215C72986o244n386m595l939l208k303j455r60q67r23q84p08m78j54L91J076
62199C42349J586J776J913K319K918L369L550L670L910M192M377M468M542M622
62185C89561M659M565M265L811L422L252L185L014K768K676K879L356M074M953
62171D40440N768O383P073Q236R749J1015J1757J2326J2995J3451J3329J2902
62159E65424J2680J2520J1729J0053Q043O274M667K809O27j605l719n709p451
$$ plain form
62146 616342 607647 598190 588104 577343 566145 555093 544578 534454 524466 514928 506630 500018 494734
62133 494734 490197 486425 484043 483530 484730 487167 490617 495238 501281 508822 517771 528021 539451 551821
62119 551821 564720 577743 590701 603596 616397 628979 641307 653450 665257 676202 685821 694254
62107 694254 702062 709453 715980 721143 725080 728477 731937 735652 739569 743643 747842 752072 756227 760274
62093 760274 764305 768464 772830 777326 781801 786220 790691 795255 799728 803962 808225 813135 819079 825835
62079 825835 832906 840127 847744 855966 864705 873808 883257 892968 902591 911770 920495 928929 936965 944240
62065 944240 950540 955900 960279 963512 965694 967265 968524 969352 969610 969511 969280 968650 967065 964254 960302 955335
62049 955335 949444 942779 935287 926486 915912 903742 890569 876562 861305 844509 826401 807276
$$ packed form
62146F16342q695r457j0086j0761j1198j1052j0515j0124r988r538q298o612n284
62133D94734m537l772k382n13J200K437L450M621O043P541Q949J0250J1430J2370
62119E51821J2899J3023J2958J2895J2801J2582J2328J2143J1807J0945R619Q433
62107F94254P808P391O527N163L937L397L460L715L917M074M199M230M155M047
62093G60274M031M159M366M496M475M419M471M564M473M234M263M910N944O756
62079H25835P071P221P617Q222Q739R103R449R711R623R179Q725Q434Q036P275
62065I44240O300N360M379L233K182J571J259Q28K58r9k31o30j585k811l952m967
62049I55335n891o665p492q801j0574j2170j3173j4007j5257j6796j8108j9125
$$ plain form
62037 807276 787131 766006 744309 722522 700867 679464 658508 638024 617768 597678 578190
62026 578190 559791 542523 526179 510749 496326 482829 470217 458782 448793 439943 431615 423694
62014 423694 416685 410987 406394 402433 398908 396005 394072 393380 393888 395196 396826 398545 400242 401679 402684
61999 402684 403526 404686 406185 407497 408210 408386 408119 407114 404958 401604 397312 392342 386961 381555 376422
61984 376422 371491 366477 361320 356241 351405 346710 342000 337348 333053 329378 326317 323654 321240 319165
61970 319165 317559 316317 315166 314010 312991 312215 311605 311172 311206 312012 313565 315531 317589 319611 321642 323863
61954 323863 326492 329636 333307 337641 342949 349427 356966 365431 374967 385759 397610 410030 422778
61941 422778 436037 450004 464551 479368 494259 509104 523728 537972 551822 565322 578394
$$ packed form
62037H07276k0145k1125k1697k1787k1655k1403k0956k0484k0256k0090j9488
62026E78190j8399j7268j6344j5430j4423j3497j2612j1435r989q850q328p921
62014D23694p009n698m593l961l525k903j933o92N08J308J630J719J697J437J005
61999D02684Q42J160J499J312P13J76k67j005k156l354m292m970n381n406n133
61984C76422m931n014n157n079m836m695m710m652m295l675l061k663k414k075
61970C19165j606j242j151j156j019p76o10m33L4Q06J553J966K058K022K031K221
61954C23863K629L144L671M334N308O478P539Q465R536J0792J1851J2420J2748
61941D22778J3259J3967J4547J4817J4891J4845J4624J4244J3850J3500J3072
$$ plain form
61930 578394 590807 602324 612768 621988 629816 636089 640672 643563 645027 645606 645884 646200 646600 647042 647605
61915 647605 648541 650197 652865 656653 661434 666973 673066 679568 686277 692907 699210 705064 710358 714794
61901 714794 717902 719258 718712 716423 712698 707753 701540 693807 684402 673569 661892 649891 637694
61888 637694 625141 612148 598878 585629 572670 560236 548571 537812 527855 518431 509403 500951
61876 500951 493339 486490 479959 473483 467466 462716 459632 457855 456849 456583 457466 459743 463289 468010 474153
61861 474153 482020 491591 502653 515243 529701 546255 564694 584539 605450 627362 650277 674044
61849 674044 698336 722708 746632 769547 791015 810812 828827 844944 859091 871309 881618
61838 881618 889880 895993 900246 903248 905469 907042 908096 909022 910206 911698 913363 915183 917175 919132
$$ packed form
61930E78394J2413J1517J0444R220P828O273M583K891J464N79K78L16M00M42N63
61915F47605R36J656K668L788M781N539O093O502O709O630O303N854N294M436
61901G14794L108J356n46k289l725m945o213p733r405j0833j1677j2001j2197
61888F37694j2553j2993j3270j3249j2959j2434j1665j0759r957r424r028q452
61876E00951p612o849o531o476o017m750l084j777j006k66Q83K277L546M721O143
61861D74153P867R571J1062J2590J4458J6554J8439J9845K0911K1912K2915K3767
61849F74044K4292K4372K3924K2915K1468J9797J8015J6117J4147J2218J0309
61838H81618Q262O113M253L002K221J573J054R26J184J492J665J820J992J957
$$ plain form
61824 919132 920784 922048 922846 922716 920974 917312 911931 905031 896481 886096 873877 859819 843794 825867
61810 825867 806555 786486 765970 745109 724202 703742 684093 665383 647687 631137 615816
61799 615816 601690 588653 576545 565178 554501 544681 535890 527995 520605 513459 506635 500371 494749
61786 494749 489625 484787 480133 475700 471573 467807 464444 461558 459286 457783 457164 457407 458270 459407 460628
61771 460628 461949 463328 464534 465503 466606 468283 470471 472769 475089 477729 480744 483760 486570 489439
61757 489439 492524 495441 497739 499473 500906 501963 502458 502611 502782 502810 502167 500724 498839 496672 493960 490632
61741 490632 487190 484270 482100 480530 479320 478246 477233 476496 476329 476662 477115 477564 478309 479595 481334 483428
61725 483428 485974 488870 491582 493642 495138 496398 497446 498120 498504 498826 499007 498719 497914 496939 496087 495286
$$ packed form
61824I19132J652J264P98j30j742l662n381o900q550j0385j2219j4058j6025j7927
61810H25867j9312k0069k0516k0861k0907k0460j9649j8710j7696j6550j5321
61799F15816j4126j3037j2108j1367j0677r820q791p895p390p146o824o264n622
61786D94749n124m838m654m433m127l766l363k886k272j503o19K43Q63J137J221
61771D60628J321J379J206R69J103J677K188K298K320K640L015L016K810K869
61757D89439L085K917K298J734J433J057M95J53J71K8o43j443j885k167k712l328
61741D90632l442k920k170j570j210j074j013p37j67L33M53M49P45J286J739K094
61725D83428K546K896K712K060J496J260J048O74L84L22J81k88q05r75q52q01
$$ plain form
61709 495286 494226 492611 490264 487277 484110 481320 479051 476923 474502 471786 469150 466922 465069 463244
61695 463244 461140 458859 456911 455755 455341 455212 455031 454886 455084 455775 456847 458097 459391 460679 461892 462907
61679 462907 463663 464299 465109 466342 468063 470206 472614 474979 476930 478351 479550 480958 482733 484725 486737
61664 486737 488647 490305 491515 492170 492293 491933 491132 489985 488607 487035 485251 483342 481494 479803 478156
61649 478156 476379 474446 472508 470710 469011 467225 465224 463082 460940 458761 456349 453618 450686 447655
61635 447655 444506 441325 438365 435655 432788 429429 425919 422948 420685 418633 416401 414163 412183 410323
61621 410323 408363 406519 405228 404525 403964 403107 401798 399991 397661 394961 392202 389519 386686 383387 379562
61606 379562 375410 371130 366770 362321 357844 353501 349472 345854 342643 339831 337411 335257 333052 330487
$$ packed form
61709D95286j060j615k347k987l167k790k269k128k421k716k636k228j853j825
61695D63244k104k281j948j156m14j29j81j45J98O91J072J250J294J288J213J015
61679D62907P56O36Q10J233J721K143K408K365J951J421J199J408J775J992K012
61664D86737J910J658J210O55J23l60q01j147j378j572j784j909j848j691j647
61649D78156j777j933j938j798j699j786k001k142k142k179k412k731k932l031
61635D47655l149l181k960k710k867l359l510k971k263k052k232k238j980j860
61621D10323j960j844j291p03n61q57j309j807k330k700k759k683k833l299l825
61606C79562m152m280m360m449m477m343m029l618l211k812k420k154k205k565
$$ plain form
61592 330487 327528 324425 321452 318734 316291 314128 312196 310401 308713 307200 305876 304639 303408 302253
61578 302253 301247 300288 299187 297907 296560 295178 293696 292211 291040 290370 290008 289603 288999 288191 287074 285573
61562 285573 284016 282994 282693 282615 282210 281582 281274 281491 281905 282213 282479 282787 282901 282535 281810 281168 280916 281072
61544 281072 281601 282521 283719 284924 285961 286883 287740 288338 288422 288034 287496 287042 286568 285816 284681 283242 281583
61527 281583 279703 277628 275508 273587 272043 270848 269741 268389 266688 264890 263372 262269 261415 260628 259883
61512 259883 259156 258285 257109 255706 254301 253006 251750 250462 249206 248157 247502 247320 247460 247606 247607 247681 248131
61495 248131 248914 249677 250209 250627 251115 251709 252443 253407 254506 255367 255696 255578 255268 254843 254309 253914 254058 254845
61477 254845 255933 256812 257142 256865 256214 255631 255504 255867 256401 256725 256665 256357 256210 256648 257681 258795 259440 259573
$$ packed form
61592C30487k959l103k973k718k443k163j932j795j688j513j324j237j231j155
61578C02253j006r59j101j280j347j382j482j485j171o70l62m05o04q08j117j501
61562B85573j557j022l01p8m05o28l08K17M14L08K66L08J14l66p25o42k52J56
61544B81072N29R20J198J205J037R22Q57N98Q4l88n38m54m74p52j135j439j659
61527B81583j880k075k120j921j544j195j107j352j701j798j518j103q54p87p45
61512B59883p27q71j176j403j405j295j256j288j256j049o55j82J40J46JP4M50
61495B48131P83P63N32M18M88N94P34R64J099Q61L29j18l10m25n34l95J44P87
61477B54845J088Q79L30k77o51n83j27L63N34L24o0l08j47M38J033J114O45J33
$$ plain form
61459 259573 259546 259573 259607 259674 259953 260471 261044 261652 262527 263725 264916 265846 266727 267900 269302 270593 271681 272798
61441 272798 274096 275459 276759 278051 279507 281270 283375 285683 287917 289929 291857 293868 295800 297291
61427 297291 298234 298866 299439 300025 300694 301584 302669 303620 304090 304033 303682 303297 302970 302576 301849 300610 298978 297240
61409 297240 295507 293646 291563 289379 287219 285022 282670 280197 277737 275359 273086 270969 269046 267306
61395 267306 265831 264830 264393 264265 264043 263589 263101 262805 262696 262601 262432 262318 262544 263311 264507 265744 266707 267434
61377 267434 268173 269059 270038 271107 272414 274051 275843 277465 278803 280097 281656 283494 285343 287110 289132
61362 289132 291809 295023 298178 300891 303446 306495 310453 315300 320779 326594 332555 338729 345401 352746
61348 352746 360594 368653 376794 384920 392684 399623 405586 410780 415385 419329 422504 424977 426891 428268
$$ packed form
61459B59573k7K7L4O7K79N18N73O08Q75J198J191R30Q81J173J402J291J088J117
61441B72798J298J363J300J292J456J763K105K308K234K012J928K011J932J491
61427B97291R43O32N73N86O69Q90J085R51M70n7l51l85l27l94p27j239j632j738
61409B97240j733j861k083k184k160k197k352k473k460k378k273k117j923j740
61395B67306j475j001m37j28k22m54m88k96j09r5j69j14K26P67J196J237R63P27
61377B67434P39Q86R79J069J307J637J792J622J338J294J559J838J849J767K022
61362B89132K677L214L155K713K555L049L958M847N479N815N961O174O672P345
61348C52746P848Q059Q141Q126P764O939N963N194M605L944L175K473J914J377
$$ plain form
61334 428268 428948 428611 426891 423695 419448 414849 410305 405774 401184 396754 392773 389264 386057 383079 380426
61319 380426 378195 376383 374897 373558 372200 370843 369747 369208 369369 370250 371834 374037 376737 379916 383698
61304 383698 388122 392980 397969 402877 407486 411491 414765 417614 420448 423172 425152 425924 425735 425230 424709
61289 424709 423883 422329 420014 417306 414599 412063 409763 407828 406365 405260 404293 403466 403102 403548 404915
61274 404915 407123 410056 413558 417454 421741 426656 432359 438679 445389 452663 460989 470557 480965 491615
61260 491615 502249 512944 523716 534264 544079 552692 559830 565432 569559 572281 573599 573467 571853
61247 571853 568808 564519 559273 553313 546730 539546 531893 524062 516357 508967 502026 495727 490321 485981
61233 485981 482698 480324 478716 477802 477514 477743 478452 479803 481986 484891 488057 491052 493813 496511 499206
$$ packed form
61334D28268O80l37j720l196m247m599m544m531m590m430l981l509l207k978k653
61319C80426k231j812j486j339j358j357j096n39J61Q81J584K203K700L179L782
61304C83698M424M858M989M908M609M005L274K849K834K724J980P72j89n05n21
61289D24709q26j554k315k708k707k536k300j935j463j105r67q27l64M46J367
61274D04915K208K933L502L896M287M915N703O320O710P274Q326R568J0408J0650
61260D91615J0634J0695J0772J0548R815Q613P138N602M127K722J318j32j614
61247E71853l045m289n246n960o583p184p653p831p705p390o941o299n406m340
61233D85981l283k374j608r14k88K29P09J351K183K905L166K995K761K698K695
$$ plain form
61218 499206 501823 504406 507183 510353 513933 517851 522054 526483 531027 535624 540389 545604 551615 558665
61204 558665 566763 575682 585168 595132 605654 616815 628662 641266 654666 668749 683221 697758
61192 697758 712137 726254 740109 753689 766751 778771 789303 798375 806341 813316 818981 822932
61180 822932 824977 824935 822465 817364 809943 800850 790579 779282 766964 753627 739258 723940 708006
61167 708006 691895 675795 659620 643411 627541 612432 598205 584795 572300 560976 550895
61156 550895 541828 533571 526263 520246 515674 512401 510246 509247 509530 511019 513401 516392 519907 523903 528198
61141 528198 532580 537154 542398 548802 556444 565018 574224 584041 594565 605743 617478 629973 643716
61128 643716 658959 675371 692414 709997 728467 747979 768180 788656 809362 830281 850850
$$ packed form
61218D99206K617K583K777L170L580L918M203M429M544M597M765N215O011P050
61204E58665Q098Q919R486R964J0522J1161J1847J2604J3400J4083J4472J4537
61192F97758J4379J4117J3855J3580J3062J2020J0532R072P966O975N665L951
61180H22932K045m2k470n101p421r093j0271j1297j2318j3337j4369j5318j5934
61167G08006j6111j6100j6175j6209j5870j5109j4227j3410j2495j1324j0081
61156E50895r067q257p308o017m572l273k155r99K83J489K382K991L515L996M295
61141E28198M382M574N244O404P642Q574R206R817J0524J1178J1735J2495J3743
61128F43716J5243J6412J7043J7583J8470J9512K0201K0476K0706K0919K0569
$$ plain form
61117 850850 870160 887796 904150 919727 934366 947385 958316 967233 974318 979398 982019 981879 979046
61104 979046 973822 966502 957273 946201 933225 918211 901132 882231 861975 840838 819158 797178
61092 797178 775113 753088 731091 709135 687452 666427 646302 627095 608820 591632 575628
61081 575628 560673 546647 533820 522698 513460 505722 498946 492939 487810 483603 480223 477638 475940
61068 475940 475129 475010 475384 476284 477955 480692 484687 489946 496270 503419 511336 520194 530159 541152 552905
61053 552905 565188 577976 591426 605743 621014 637081 653614 670334 687150 704012 720717
61042 720717 736897 752226 766563 779915 792289 803591 813679 822482 830053 836454 841671 845737
61030 845737 848903 851542 853870 855899 857664 859334 861035 862786 864786 867620 871952 878090 886001 895673
$$ packed form
61117H50850J9310J7636J6354J5577J4639J3019J0931Q917P085N080K621j40k833
61104I79046n224p320r229j1072j2976j5014j7079j8901k0256k1137k1680k1980
61092G97178k2065k2025k1997k1956k1683k1025k0125j9207j8275j7188j6004
61081E75628j4955j4026j2827j1122r238p738o776o007n129m207l380k585j698
61068D75940q11j19L74R00J671K737L995N259O324P149P917Q858R965J0993J1753
61053E52905J2283J2788J3450J4317J5271J6067J6533J6720J6816J6862J6705
61042G20717J6180J5329J4337J3352J2374J1302J0088Q803P571O401N217M066
61030H45737L166K639K328K029J765J670J701J751K000K834M332O138P911R672
$$ plain form
61016 895673 907324 921281 937870 957402 980093 1005987 1035119 1067810 1104625 1146042 1192298
61005 1192298 1243630 1300593 1364220 1436116 1518540 1614274 1726396 1858327 2014265 2199568
60995 2199568 2420710 2685088 3001057 3377841 3824424 4346567 4942320 5598106 6288597
60986 6288597 6982416 7652067 8283098 8877495 9450010 10020114 10603449 11204803 11812679
60977 11812679 12396107 12906760 13289637 13500881 13524264 13376289 13096929 12732889 12323517
60968 12323517 11894007 11453808 10997315 10507417 9963726 9353724 8681154 7966766 7241441
60959 7241441 6536231 5874513 5268961 4722934 4234096 3797861 3409401 3064337 2758903
60950 2758903 2489995 2254935 2050975 1874956 1723375 1592625 1479171 1379823 1292094 1214195
$$ packed form
61016H95673J1651J3957J6589J9532K2691K5894K9132L2691L6815M1417M6256
61005A192298N1332N6963O3627P1896Q2424R5734J12122J31931J55938J85303
60995B199568K21142K64378L15969L76784M46583N22143N95753O55786O90491
60986F288597O93819O69651O31031N94397N72515N70104N83335O01354O07876
60977A1812679N83428N10653L82877K11244K3383j47975k79360l64040m09372
60968A2323517m29510m40199m56493m89898n43691o10002o72570p14388p25325
60959G241441p05210o61718o05552n46027m88838m36235l88460l45064l05434
60950B758903k68908k35060k03960j76019j51581j30750j13454r9348q7729p7899
$$ plain form
60940 1214195 1144565 1081589 1023987 971253 923375 880148 841023 805467 773053 743258 715561
60929 715561 689846 666301 644836 624959 606395 589417 574333 561011 549167 538774 529841 522043
60917 522043 514953 508489 502750 497564 492584 487732 483177 478925 474738 470490 466258 462104 458038 454204
60903 454204 450739 447427 443868 440051 436424 433238 430159 426755 423104 419650 416637 413978 411537 409293
60889 409293 407232 405334 403701 402517 401801 401307 400727 399918 398885 397622 396114 394475 392956 391671 390408
60874 390408 388843 386942 384987 383195 381492 379767 378177 377001 376286 375792 375225 374429 373405 372367 371711
60859 371711 371777 372641 374180 376250 378667 381180 383702 386482 389804 393570 397401 401088 404701 408336 412062
60844 412062 416070 420438 424709 428098 430342 432004 433763 435651 437304 438629 439887 441182 442250 442753
$$ packed form
60940A214195o9630o2976n7602n2734m7878m3227l9125l5556l2414k9795k7697
60929G15561k5715k3545k1465j9877j8564j6978j5084j3322j1844j0393q933p798
60917E22043p090o464n739n186m980m852m555m252m187m248m232m154m066l834
60903D54204l465l312l559l817l627l186l079l404l651l454l013k659k441k244
60889D09293k061j898j633j184p16m94n80q09j033j263j508j639j519j285j263
60874C90408j565j901j955j792j703j725j590j176p15m94n67p96j024j038o56
60859C71711O6Q64J539K070K417K513K522K780L322L766L831L687L613L635L726
60844D12062M008M368M271L389K244J662J759J888J653J325J258J295J068N03
$$ plain form
60830 442753 442579 441850 440842 439918 439327 438965 438373 437053 434850 432125 429530 427489 425825 424005 421754 419260
60814 419260 416748 414083 410973 407361 403383 399085 394412 389470 384534 379819 375367 371134 367007 362805
60800 362805 358489 354397 351020 348477 346361 344203 341939 339830 338074 336668 335562 334756 334228 333888 333670
60785 333670 333596 333710 334013 334487 335192 336228 337631 339333 341243 343274 345342 347434 349694 352308 355241 358221
60769 358221 361117 364207 367891 372216 376833 381367 385637 389581 393269 396979 400971 405099 408899 412117
60755 412117 414910 417417 419493 421063 422468 424131 426027 427728 428863 429292 428960 427870 426186 424163 421960
60740 421960 419673 417405 415125 412520 409264 405385 401172 396823 392438 388247 384484 381011 377432 373672
60726 373672 370106 366991 364099 361127 358235 355827 353957 352270 350527 348942 347918 347591 347709 347913 348084
$$ packed form
60830D42753j74p29j008r24n91l62n92j320k203k725k595k041j664j820k251k494
60814D19260k512k665l110l612l978m298m673m942m936m715m452m233m127m202
60800C62805m316m092l377k543k116k158k264k109j756j406j106q06n28l40k18
60785C33670p4J14L03M74P05J036J403J702J910K031K068K092K260K614K933K980
60769C58221K896L090L684M325M617M534M270L944L688L710L992M128L800L218
60755D12117K793K507K076J570J405J663J896J701J135M29l32j090j684k023k203
60740D21960k287k268k280k605l256l879m213m349m385m191l763l473l579l760
60726C73672l566l115k892k972k892k408j870j687j743j585j024l27J18K04J71
$$ plain form
60711 348084 348447 349351 350982 353290 356122 359291 362530 365558 368316 371047 374020 377237 380490 383624 386626
60696 386626 389493 392176 394637 396861 398774 400278 401423 402452 403565 404678 405511 405893 405899 405685 405330 404889
60680 404889 404505 404360 404546 405052 405830 406804 407916 409273 411164 413756 416835 420046 423337 426932 430893 435029
60664 435029 439317 444029 449306 454946 460872 467447 474936 482903 490638 498098 505961 514783 524500 534778
60650 534778 545337 555828 565846 575360 584822 594559 604310 613632 622506 631218 639780 647852 655193
60637 655193 661873 667998 673433 677915 681338 683829 685586 686676 687013 686516 685230 683245 680544 677064 672810
60622 672810 667778 661844 655000 647627 640198 632640 624399 615316 606003 597059 588230 578788 568489 557763
60608 557763 547093 536692 526712 517273 508198 499161 490234 481931 474539 467730 461036 454405 448061 442051
$$ packed form
60711C48084L63R04J631K308K832L169L239L028K758K731K973L217L253L134L002
60696C86626K867K683K461K224J913J504J145J029J113J113Q33L82Ok14l55m41
60680D04889l84j45J86N06P78R74J112J357J891K592L079L211L291L595L961M136
60664D35029M288M712N277N640N926O575P489P967P735P460P863Q822R717J0278
60650E34778J0559J0491J0018R514R462R737R751R322Q874Q712Q562Q072P341
60637F55193O680O125N435M482L423K491J757J090L37m97j286j985k701l480m254
60622F72810n032n934o844p373p429p558q241r083r313q944q829r442j0299j0726
60608E57763j0670j0401r980r439r075r037q927q303p392o809o694o631o344o010
$$ plain form
60594 442051 436235 430575 425178 420119 415419 411152 407392 404068 401000 398069 395277 392686 390310 388040
60580 388040 385656 383081 380626 378785 377698 377008 376371 375850 375620 375592 375668 376193 377680 380118 382915 385614
60564 385614 388374 391668 395810 400850 406582 412461 417829 422452 426628 430613 434189 437052 439307 441249
60550 441249 442818 443700 443840 443471 442698 441470 440022 438893 438383 438328 438540 439158 440382 442218 444699 448032
60534 448032 452214 456757 461100 465129 468967 472526 475644 478491 481317 483800 485171 485095 484076 482826 481567
60519 481567 480090 478151 475555 472187 468288 464574 461778 460091 459221 458838 458792 459029 459590 460745 462882 466203
60503 466203 470566 475614 481066 486986 493878 502404 512866 525068 538750 554021 571162 590124 610424
60490 610424 631464 652754 673824 694175 713367 731029 746730 759972 770333 777532 781411 781929
$$ packed form
60594D42051n816n660n397n059m700m267l760l324l068k931k792k591k376k270
60580C88040k384k575k455j841j087o90o37n21k30k8P6N25J487K438K797K699
60564C85614K760L294M142N040N732N879N368M623M176L985L576K863K255J942
60550D41249J569Q82J40l69p73j228j448j129n10n5K12O18J224J836K481L333
60534D48032M182M543M343M029L838L559L118K847K826K483J371p6j019j250j259
60519D81567j477j939k596l368l899l714k796j687q70l83m6K37N61J155K137L321
60503D66203M363N048N452N920O892Q526J0462J2202J3682J5271J7141J8962K0300
60490F10424K1040K1290K1070K0351J9192J7662J5701J3242J0361P199L879N18
$$ plain form
60478 781929 779146 773100 763743 751123 735548 717467 697294 675516 652824 629855 606859 583911
60466 583911 561416 540083 520346 502137 485321 470051 456538 444725 434393 425333 417263 409737
60454 409737 402422 395357 388799 382930 377816 373461 369703 366201 362732 359388 356352 353640 351251 349343
60440 349343 347990 346910 345718 344334 342865 341259 339425 337631 336342 335623 335091 334500 334025 333812 333664 333400
60424 333400 333222 333428 333925 334331 334482 334603 335014 335825 336889 337904 338604 338910 338904 338672 338316 338129 338498 339510
60406 339510 340834 342131 343425 344869 346344 347564 348459 349229 350073 351069 352246 353542 354737 355695 356623 357843
60390 357843 359331 360742 361884 362880 363804 364519 364975 365366 365829 366295 366822 367800 369461 371381 372838 373592 374033
60373 374033 374604 375432 376546 378050 379873 381611 382898 383781 384537 385253 385802 386209 386698 387398 388208 389057 390054
$$ packed form
60478G81929k783o046r357j2620j5575j8081k0173k1778k2692k2969k2996k2948
60466E83911k2495k1333j9737j8209j6816j5270j3513j1813j0332r060q070p526
60454D09737p315p065o558n869n114m355l758l502l469l344l036k712k389j908
60440C49343j353j080j192j384j469j606j834j794j289p19n32n91m75k13j48k64
60424C33400j78K06M97M06J51J21M11Q11J064J015P00L06ok32l56j87L69J012
60406C39510J324J297J294J444J475J220Q95P70Q44R96J177J296J195R58R28J220
60390C57843J488J411J142R96R24P15M56L91M63M66N27R78J661J920J457P54M41
60373C74033N71Q28J114J504J823J738J287Q83P56P16N49M07M89P00Q10Q49R97
$$ plain form
60356 390054 391253 392469 393552 394720 396299 398222 400081 401762 403653 406072 408747 411167 413307 415635
60342 415635 418450 421543 424601 427650 430899 434345 437703 440649 442921 444273 444564 443970 442967 442003 441188
60327 441188 440324 439217 437894 436471 434881 432869 430341 427599 425068 422820 420596 418344 416471 415395
60313 415395 415041 415019 415245 416120 418063 421152 425308 430611 437172 444792 453017 461558 470417 479490 488279
60298 488279 496256 503400 510060 516291 521656 525753 528632 530460 531059 530101 527624 523989 519388 513761 507202
60283 507202 500107 492832 485542 478514 472230 466954 462461 458442 454957 452206 450014 447848 445326 442507
60269 442507 439750 437378 435385 433333 430654 427223 423511 420030 416805 413588 410349 407216 404103 400816
60255 400816 397523 394690 392530 390801 389208 387670 386150 384595 383236 382585 382874 383721 384575 385327 386227 387373
$$ packed form
60356C90054J199J216J083J168J579J923J859J681J891K419K675K420K140K328
60342D15635K815L093L058L049L249L446L358K946K272J352K91n94j003r64q15
60327D41188q64j107j323j423j590k012k528k742k531k248k224k252j873j076
60313D15395l54k2K26Q75J943L089M156N303O561P620Q225Q541Q859R073Q789
60298D88279P977P144O660O231N365M097K879J828N99r58k477l635m601n627o559
60283E07202p095p275p290p028o284n276m493m019l485k751k192k166k522k819
60269D42507k757k372j993k052k679l431l712l481l225l217l239l133l113l287
60255D00816l293k833k160j729j593j538j520j555j359o51K89Q47Q54P52R00J146
$$ plain form
60239 387373 388586 389716 390820 391961 393097 394253 395684 397662 400102 402536 404578 406378 408454 411044
60225 411044 413783 416177 418179 420127 422277 424659 427278 430096 432834 435132 436996 438769 440603 442319
60211 442319 443911 445754 448087 450594 452824 454773 456693 458500 459797 460420 460609 460594 460334 459738 458941 458194
60195 458194 457586 456952 456023 454682 453097 451578 450265 449071 447959 447132 446804 446889 447113 447319 447511 447687 447844
60178 447844 448115 448714 449713 451002 452446 453948 455403 456742 458039 459426 460907 462330 463529 464444 465129
60163 465129 465778 466668 467980 469691 471690 473865 476010 477819 479164 480275 481495 482940 484538 486247 488011
60148 488011 489639 490981 492150 493355 494639 496045 497885 500485 503715 507153 510660 514384 518196 521618
60134 521618 524486 527244 530323 533536 536370 538600 540352 541758 542874 543770 544395 544449 543619 541912 539575
$$ packed form
60239C87373J213J130J104J141J136J156J431J978K440K434K042J800K076K590
60225D11044K739K394K002J948K150K382K619K818K738K298J864J773J834J716
60211D42319J592J843K333K507K230J949J920J807J297O23J89j5k60n96p97p47
60195D58194o08o34r29j341j585j519j313j194j112q27l28Q5K24K06J92J76J57
60178D47844K71N99R99J289J444J502J455J339J297J387J481J423J199R15O85
60163D65129O49Q90J312J711J999K175K145J809J345J111J220J445J598J709J764
60148D88011J628J342J169J205J284J406J840K600L230L438L507L724L812L422
60134E21618K868K758L079L213K834K230J752J406J116Q96O25N4q30j707k337
$$ plain form
60119 539575 536776 533545 529957 526156 522208 518109 513964 510006 506427 503199 500115 496967 493771 490823
60105 490823 488473 486861 485916 485557 485712 486192 486828 487752 489266 491363 493693 496130 499031 502718 507023 511634
60089 511634 516621 522222 528271 534235 539733 544673 548944 552371 554971 556943 558331 558979 558808 557873 556083
60074 556083 553157 548966 543754 537960 531916 525706 519158 512054 504539 497239 490699 484794 478948 472884
60060 472884 466823 461059 455818 451554 448768 447303 446246 444870 443366 442387 442238 442797 443865 445132 446107
60045 446107 446541 446837 447607 448890 450165 451061 451648 452051 452182 451934 451324 450364 449021 447306 445176 442403 438884
60028 438884 435042 431520 428401 425145 421379 417322 413232 408911 404154 399326 395007 391242 387576 383782
60014 383782 380163 377116 374741 372915 371452 370088 368590 367046 365876 365418 365629 366246 367106 368221 369656
$$ packed form
60119E39575k799l231l588l801l948m099m145l958l579l228l084l148l196k948
60105D90823k350j612r45l59J55M80O36R24J514K097K330K437K901L687M305M611
60089E11634M987N601O049N964N498M940M271L427K600J972J388O48j71r35j790
60074E56083k926m191n212n794o044o210o548p104p515p300o540n905n846o064
60060D72884o061n764n241m264k786j465j057j376j504r79j49N59J068J267R75
60045D46107M34K96P70J283J275Q96N87M03J31k48o10r60j343j715k130k773l519
60028D38884l842l522l119l256l766m057m090m321m757m828m319l765l666l794
60014C83782l619l047k375j826j463j364j498j544j170m58K11O17Q60J115J435
$$ plain form
59999 369656 371453 373592 375965 378425 380939 383617 386531 389562 392489 395170 397604 399854 401985 404045
59985 404045 406035 407846 409284 410183 410536 410510 410292 409901 409195 408091 406732 405363 404113 402961 401888 400945
59969 400945 400223 399813 399791 400108 400546 400931 401366 402094 403118 404094 404702 404916 404868 404601 404154 403706 403438 403277 402946
59950 402946 402273 401304 400138 398816 397411 396090 394941 393824 392491 390902 389366 388276 387704 387325 386789
59935 386789 386113 385615 385526 385834 386423 387155 387785 388050 387987 387969 388287 388870 389567 390481 391793 393402 395068 396795
59917 396795 398780 400985 403122 405099 407146 409400 411647 413662 415564 417632 419940 422362 424806 427208
59903 427208 429359 430991 432054 432787 433485 434293 435233 436364 437823 439725 442033 444571 447188 449900 452840
59888 452840 456137 459881 464095 468588 472944 476870 480563 484480 488679 492674 496022 498803 501302 503508
$$ packed form
59999C69656J797K139K373K460K514K678K914L031K927K681K434K250K131K060
59985D04045J990J811J438Q99L53k6k18l91p06j104j359j369j250j152j073r43
59969D00945p22m10k2L17M38L85M35P28J024R76O08K14m8k67m47m48k68j61l31
59950D02946o73r69j166j322j405j321j149j117j333j589j536j090n72l79n36
59935C86789o76m98q9L08N89P32O30K65o3j8L18N83O97R14J312J609J666J727
59917C96795J985K205K137J977K047K254K247K015J902K068K308K422K444K402
59903D27208K151J632J063P33O98Q08R40J131J459J902K308K538K617K712K940
59888D52840L297L744M214M493M356L926L693L917M199L995L348K781K499K206
$$ plain form
59874 503508 505146 506059 506233 505559 503905 501397 498346 494827 490608 485567 480004 474389 468959 463665 458394
59859 458394 453142 448012 443185 438853 435125 431980 429337 427153 425469 424360 423828 423743 423918 424280 424922 425980
59843 425980 427527 429597 432171 435078 438064 441135 444677 449013 453873 458557 462591 466045 469216 472269
59829 472269 475237 478125 480800 482908 484052 484023 482812 480548 477444 473682 469277 464143 458400 452462 446717
59814 446717 441220 435826 430514 425483 420997 417238 414226 411768 409555 407409 405333 403284 401036 398486
59800 398486 395932 393795 392085 390406 388523 386610 384844 383014 380839 378523 376672 375560 374742 373581
59786 373581 372063 370840 370467 370765 371103 371140 371127 371511 372466 373860 375473 377101 378582 379917 381343 383147
59770 383147 385401 387977 390805 393962 397487 401222 404955 408672 412598 416929 421563 426171 430535 434764
$$ packed form
59874E03508J638R13J74o74j654k508l051l519m219n041n563n615n430n294n271
59859D58394n252n130m827m332l728l145k643k184j684j109n32q5J75L62O42J058
59843D25980J547K070K574K907K986L071L542M336M860M684M034L454L171L053
59829D72269K968K888K675K108J144k9j211k264l104l762m405n134n743n938n745
59814D46717n497n394n312n031m486l759l012k458k213k146k076k049k248k550
59800C98486k554k137j710j679j883j913j766j830k175k316j851j112q18j161
59786C73581j518j223l73K98L38L7j3L84R55J394J613J628J481J335J426J804
59770C83147K254K576K828L157L525L735L733L717L926M331M634M608M364M229
$$ plain form
59756 434764 439091 443510 447751 451642 455326 459026 462689 465986 468643 470678 472326 473827 475247 476436
59742 476436 477183 477454 477414 477172 476637 475694 474430 473020 471531 469959 468405 466967 465552 464068 462796 462268
59726 462268 462635 463397 463913 464040 464116 464458 465075 465831 466704 467846 469415 471371 473467 475506 477593 479968 482617
59709 482617 485284 487900 490732 493913 497056 499666 501802 504007 506590 509291 511699 513677 515273 516437
59695 516437 517117 517472 517757 517995 517951 517462 516645 515686 514532 512938 510852 508588 506513 504602 502515 500100
59679 500100 497609 495329 493199 490970 488595 486222 483881 481466 479018 476756 474719 472609 470125 467314
59665 467314 464466 461807 459413 457298 455417 453628 451780 449854 447969 446327 445168 444614 444426 444050 443088
59650 443088 441676 440254 439052 437972 436870 435754 434670 433624 432639 431690 430544 428908 426862 424956 423630
$$ packed form
59756D34764M327M419M241L891L684L700L663L297K657K035J648J501J420J189
59742D76436P47K71m0k42n35r43j264j410j489j572j554j438j415j484j272n28
59726D62268L67P62N16J27P6L42O17P56Q73J142J569J956K096K039K087K375K649
59709D82617K667K616K832L181L143K610K136K205K583K701K408J978J596J164
59695E16437O80L55K85K38m4m89q17r59j154j594k086k264k075j911k087k415
59679E00100k491k280k130k229k375k373k341k415k448k262k037k110k484k811
59665D67314k848k659k394k115j881j789j848j926j885j642j159n54j88l76r62
59650D43088j412j422j202j080j102j116j084j046r85r49j146j636k046j906j326
$$ plain form
59635 423630 422696 421601 420140 418655 417491 416569 415603 414547 413618 412964 412566 412391 412447 412619 412674 412514 412298 412232
59617 412232 412362 412698 413396 414611 416217 417845 419190 420187 420927 421584 422392 423465 424622 425572 426296 427044 427905
59600 427905 428654 429161 429692 430583 431770 432887 433714 434285 434630 434677 434398 433837 432971 431765 430383 429176 428363
59583 428363 427860 427418 426824 425960 424825 423513 422060 420388 418512 416771 415550 414789 414060 413185 412491 412288
59567 412288 412333 412096 411374 410418 409535 408823 408306 408096 408332 409019 409974 410853 411352 411470 411604 412246 413568 415342
59549 415342 417213 419064 421158 424003 428015 433191 439166 445590 452392 459582 467015 474515 482159 490226
59535 490226 498856 507979 517521 527433 537446 547041 555809 563644 570470 575989 579991 582759 584861 586461
59521 586461 587068 586049 583261 579085 574011 568335 562120 555312 547897 540069 532168 524342 516395 508188
$$ packed form
59635D23630r34j095j461j485j164r22r66j056r29o54l98j75N6J72N5j60k16o6
59617D12232J30L36O98J215J606J628J345R97P40O57Q08J073J157R50P24P48Q61
59600D27905P49N07N31Q91J187J117Q27N71L45M7k79n61q66j206j382j207q13
59583D28363n03m42n94q64j135j312j453j672j876j741j221p61p29q75o94k03
59567D12288M5k37p22r56q83p12n17k10K36O87R55Q79M99J18J34O42J322J774
59549D15342J871J851K094K845M012N176N975O424O802P190P433P500P644Q067
59535D90226Q630R123R542R912J0013R595Q768P835O826N519M002K768K102J600
59521E86461O07j019k788m176n074n676o215o808p415p828p901p826p947q207
$$ plain form
59507 508188 500122 492931 486909 481644 476646 471994 468140 465296 463279 461802 460559 459171 457448 455772
59493 455772 454856 454999 455819 456787 457747 458792 460025 461654 464049 467387 471428 475918 480975 486732 492802
59478 492802 498534 503774 508923 514202 519294 523926 528405 533261 538536 543767 548631 553325 558265 563616
59464 563616 569200 574785 580356 586090 592149 598574 605365 612576 620252 628292 636477 644618 652574 660133
59450 660133 666949 672612 676744 679051 679407 677956 675038 670986 665984 660105 653432 646082 638194 629899
59436 629899 621349 612752 604391 596574 589537 583478 578706 575610 574365 574709 576160 578397 581309 584787
59422 584787 588689 593007 597879 603332 609167 615117 620927 626185 630286 632724 633357 632290 629642 625605
59408 625605 620642 615470 610761 606892 603830 601067 597650 592543 585237 576119 566208 556493 547462 539186
$$ packed form
59507E08188q066p191o022n265m998m652l854k844k017j477j243j388j723j676
59493D55772r16J43Q20R68R60J045J233J629K395L338M041M490N057N757O070
59478D92802N732N240N149N279N092M632M479M856N275N231M864M694M940N351
59464E63616N584N585N571N734O059O425O791P211P676Q040Q185Q141P956P559
59450F60133O816N663M132K307L56j451k918m052n002n879o673p350p888q295
59436F29899q550q597q361p817p037o059m772l096j245L44J451K237K912L478
59422E84787L902M318M872N453N835N950N810N258M101K438O33j067k648m037
59408F25605m963n172m709l869l062k763l417n107p306r118r911r715r031q276
$$ plain form
59394 539186 531671 524967 518923 513045 506763 499816 492328 484612 477048 470050 463902 458572 453828 449585
59380 449585 445962 442987 440462 438257 436554 435633 435515 435988 436866 438092 439634 441499 443821 446761 450307
59365 450307 454330 458923 464511 471542 480071 489790 500441 512099 524972 538980 553668 568600 583706
59352 583706 599173 615038 630988 646547 661260 674738 686643 696749 704915 710990 714871 716653
59340 716653 716533 714420 709863 702558 692881 681698 669701 657091 643908 630378 616843 603472 590231
59327 590231 577137 564412 552380 541283 531260 522413 514768 508119 502097 496491 491445 487171 483555
59314 483555 480262 477244 474855 473338 472408 471530 470469 469355 468353 467535 467024 466982 467404 468077 468870 469908
59298 469908 471403 473443 476020 479236 483337 488568 494992 502473 510803 519796 529251 538890 548486 558093
$$ packed form
59394E39186p515o704o044n878o282o947p488p716p564o998o148n330m744m243
59380D49585l623k975k525k205j703r21j18M73Q78J226J542J865K322K940L546
59365D50307M023M593N588P031Q529R719J0651J1658J2873J4008J4688J4932J5106
59352E83706J5467J5865J5950J5559J4713J3478J1905J0106Q166O075L881J782
59340G16653j20k113m557p305r677j1183j1997j2610j3183j3530j3535j3371j3241
59327E90231j3094j2725j2032j1097j0023q847p645o649o022n606n046m274l616
59314D83555l293l018k389j517r30q78j061j114j002q18n11m2M22O73P93J038
59298D69908J495K040K577L216M101N231O424P481Q330Q993R455R639R596R607
$$ plain form
59284 558093 568013 578415 589083 599674 610117 620571 631044 641236 650774 659417 666970 673200
59272 673200 678007 681636 684590 687250 689503 690728 690229 687819 683960 679255 673843 667432 659863 651419
59258 651419 642535 633406 624013 614431 604925 595822 587393 579805 573104 567275 562404 558749 556559 555802
59244 555802 556136 557111 558383 559739 561005 562022 562742 563289 563823 564211 563868 562076 558548 553616 547842 541541
59228 541541 534734 527386 519512 511094 502097 492664 483156 473939 465195 457005 449516 442921 437300 432544
59214 432544 428453 424852 421671 418985 416996 415874 415544 415738 416239 417032 418144 419472 420921 422592 424637
59199 424637 426932 429123 431060 432999 435297 438041 441091 444297 447539 450713 453890 457385 461426 465837
59185 465837 470269 474704 479448 484636 490069 495639 501643 508401 515828 523648 531891 540839 550426 560010
$$ packed form
59284E58093R920J0402J0668J0591J0443J0454J0473J0192R538Q643P553O230
59272F73200M807L629K954K660K253J225m99k410l859m705n412o411p569q444
59258F51419q884r129r393r582r506r103q429p588o701n829m871l655k190p57
59244E55802L34R75J272J356J266J017P20N47N34L88l43j792l528m932n774o301
59228E41541o807p348p874q418q997r433r508r217q744q190p489o595n621m756
59214D32544m091l601l181k686j989j122l30J94N01P93J112J328J449J671K045
59199D24637K295K191J937J939K298K744L050L206L242L174L177L495M041M411
59185D65837M432M435M744N188N433N570O004O758P427P820Q243Q948R587R584
$$ plain form
59171 560010 568872 576794 584008 590670 596552 601232 604446 606248 606879 606536 605215 602731 598900 593744 587538
59156 587538 580670 573432 565949 558210 550147 541733 533116 524706 517001 510268 504415 499188 494422 490069
59142 490069 486089 482485 479387 476978 475280 474138 473442 473260 473720 474813 476384 478304 480635 483638 487598
59127 487598 492584 498384 504701 511440 518764 526883 535805 545315 555158 565226 575562 586189 596988
59114 596988 607806 618629 629469 640084 649982 658811 666580 673361 678984 683231 686177 688006 688610
59101 688610 687735 685510 682467 678944 674813 669930 664510 658871 653030 646849 640380 633827 627296 620774
59087 620774 614217 607462 600266 592656 585111 578101 571532 564920 558018 550997 544103 537466 531225 525497
59073 525497 520176 515033 510071 505541 501556 497944 494544 491393 488477 485614 482707 479865 477136 474364
$$ packed form
59171E60010Q862P922P214O662N882M680L214J802O31l43j321k484l831n156o206
59156E87538o868p238p483p739q063q414q617q410p705o733n853n227m766m353
59142D90069l980l604l098k409j698j142o96j82M60J093J571J920K331L003L960
59127D87598M986N800O317O739P324Q119Q922R510R843J0068J0336J0627J0799
59114E96988J0818J0823J0840J0615R898Q829P769O781N623M247K946J829O04
59101F88610q75k225l043l523m131m883n420n639n841o181o469o553o531o522
59087F20774o557o755p196p610p545p010o569o612o902p021o894o637o241n728
59073E25497n321n143m962m530l985l612l400l151k916k863k907k842k729k772
$$ plain form
59059 474364 471497 468786 466433 464220 461789 459182 456806 454941 453541 452483 451744 451299 451132 451372 452262
59044 452262 453886 456077 458616 461378 464286 467284 470457 474045 478234 483067 488557 494798 501851 509644
59030 509644 518029 526846 535823 544545 552659 560090 566934 573211 578809 583663 587836 591370 594173 596165
59016 596165 597529 598684 599916 601094 601882 602323 603058 604780 607540 610733 613812 616823 620195 624222 628901
59001 628901 634078 639519 644893 649936 654612 658930 662565 664880 665466 664534 662685 660364 657637 654346 650285
58986 650285 645281 639323 632693 625841 619092 612540 606313 600769 596327 593166 591250 590628 591522 594072 598155
58971 598155 603553 610187 618033 626860 636255 645868 655529 665037 674004 681934 688435 693307 696544 698223
58957 698223 698347 696777 693428 688531 682499 675501 667378 658135 648285 638519 629148 620124 611509 603634
$$ packed form
59059D74364k867k711k353k213k431k607k376j865j400j058p39m45j67K40Q90
59044D52262J624K191K539K762K908K998L173L588M189M833N490O241P053P793
59030E09644Q385Q817Q977Q722Q114P431O844O277N598M854M173L534K803J992
59016E96165J364J155J232J178P88M41P35J722K760L193L079L011L372M027M679
59001F28901N177N441N374N043M676M318L635K315N86r32j849k321k727l291m061
58986F50285n004n958o630o852o749o552o227n544m442l161j916o22Q94K550M083
58971E98155N398O634P846Q827R395R613R661R508Q967P930O501M872L237J679
58957F98223J24j570l349m897o032o998q123r243r850r766r371r024q615p875
$$ plain form
58943 603634 596750 590780 585461 580525 575701 570749 565647 560625 555840 551154 546310 541270 536209 531240
58929 531240 526259 521079 515604 509882 504061 498320 492823 487725 483175 479303 476241 474170 473275 473518 474501
58914 474501 475680 476822 478168 480192 483237 487375 492422 498124 504434 511662 520205 530136 541236 553443
58900 553443 567022 582210 598918 616950 636289 656944 678677 701084 723833 746626 769022
58889 769022 790541 810878 829836 847080 862122 874533 884001 890253 893058 892298 887954 880149 869339
58876 869339 856322 841796 825969 808813 790554 771645 752400 733081 714329 697033 681592
58865 681592 667612 654516 642179 630751 620172 610173 600638 591653 583263 575362 567795 560383 552886
58852 552886 545134 537225 529492 522232 515461 508898 502177 495138 487963 480990 474385 468097 462127 456660
$$ packed form
58943F03634o884n970n319m936m824m952n102n022m785m686m844n040n061m969
58929E31240m981n180n475n722n821n741n497n098m550l872l062k071q95K43R83
58914D74501J179J142J346K024L045M138N047N702O310P228Q543R931J1100J2207
58900E53443J3579J5188J6708J8032J9339K0655K1733K2407K2749K2793K2396
58889G69022K1519K0337J8958J7244J5042J2411R468O252K805p60m344p805j0810
58876H69339j3017j4526j5827j7156j8259j8909j9245j9319j8752j7296j5441
58865F81592j3980j3096j2337j1428j0579r999r535q985q390p901p567p412p497
58852E52886p752p909p733p260o771o563o721p039p175o973o605o288n970n467
$$ plain form
58838 456660 451884 447794 444290 441352 439030 437367 436381 435995 435961 436016 436180 436687 437485 438077 438069 437675 437391 437326
58820 437326 437148 436651 435989 435334 434613 433695 432582 431257 429532 427263 424622 422025 419810 418050 416592 415214
58804 415214 413780 412377 411264 410626 410385 410273 410118 409989 410105 410661 411741 413359 415504 418143 421189 424521
58788 424521 427989 431426 434716 437934 441342 445119 449106 452946 456434 459567 462239 464140 465137 465550 465894
58773 465894 466403 467009 467645 468339 469015 469502 469809 470200 470858 471542 471758 471277 470462 470058 470638 472207 474333 476605
58755 476605 478885 481188 483541 486059 488972 492409 496270 500518 505455 511512 518812 527188 536474 546523
58741 546523 556999 567489 577897 588379 598859 608939 618411 627493 636337 644626 651984 658509 664546
58728 664546 670042 674537 677723 679675 680544 680354 679189 677289 674814 671720 667933 663497 658453 652766 646486
$$ packed form
58838D56660m776m090l504k938k322j663r86l86l4N5J64N07P98N92ql94k84o5
58820D37326j78m97o62o55p21r18j113j325j725k269k641k597k215j760j458j378
58804D15214j434j403j113o38k41j12j55j29J16N56J080J618K145K639L046L332
58788D24521L468L437L290L218L408L777L987L840L488L133K672J901R97M13L44
58773D65894N09O06O36O94O76M87L07L91O58O84K16m81q15m04N80J569K126K272
58755D76605K280K303K353K518K913L437L861M248M937O057P300Q376R286J0049
58741E46523J0476J0490J0408J0482J0480J0080R472R082Q844Q289P358O525O037
58728F64546N496M495L186J952Q69j90j165j900k475l094l787m436n044n687o280
$$ plain form
58713 646486 639797 632777 625269 617142 608498 599452 589846 579441 568351 557043 545882 534867 523857
58700 523857 512865 501999 491232 480446 469685 459287 449670 440990 433037 425527 418449 412052 406429
58687 406429 401292 396280 391436 387159 383692 380873 378483 376617 375550 375381 376017 377459 379884 383462 388234
58672 388234 394146 401044 408612 416480 424431 432344 439907 446570 451948 456148 459586 462532 464907 466438
58658 466438 466865 466054 464042 461013 457174 452692 447774 442754 437983 433684 429940 426775 424130 421816 419623
58643 419623 417463 415357 413341 411543 410247 409626 409379 408919 408026 407098 406566 406264 405702 404840 404290 404693 406171
58626 406171 408478 411485 415330 420195 426105 432882 440181 447627 455050 462517 470061 477438 484295 490493
58612 490493 496087 501050 505259 508758 511744 514169 515579 515556 514215 512118 509757 507340 504992 502956 501556
$$ packed form
58713F46486o689p020p508q127q644r046r606j0405j1090j1308j1161j1015j1010
58700E23857j0992j0866j0767j0786j0761j0398r617q680p953p510p078o397n623
58687D06429n137n012m844m277l467k819k390j866j067j69O36J442K425L578M772
58672C88234N912O898P568P868P951P913P563O663N378M200L438K946K375J531
58658D66438M27q11k012l029l839m482m918n020m771m299l744l165k645k314k193
58643D19623k160k106k016j798j296o21k47m60q93r28n32l02n62q62n50M03J478
58626D06171K307L007L845M865N910O777P299P446P423P467P544P377O857O198
58612D90493N594M963M209L499K986K425J410k3j341k097k361k417k348k036j400
$$ plain form
58597 501556 501052 501578 503114 505571 508957 513406 518913 525151 531721 538520 545637 552947 560069 566792 573261
58582 573261 579605 585642 591199 596476 601842 607345 612773 618130 623783 629992 636604 643378 650481 658423
58568 658423 667521 677602 688239 699126 710111 720965 731327 740892 749501 756944 762790 766605 768302
58555 768302 768106 766168 762395 756713 749334 740620 730824 720089 708591 696483 683772 670470 656886
58542 656886 643577 630910 618819 607059 595616 584719 574554 565136 556537 549037 542926 538175
58530 538175 534470 531622 529802 529261 529873 531151 532681 534438 536648 539474 542854 546497 549950 552811 555026
58515 555026 556897 558730 560521 562070 563296 564246 564890 565102 564923 564628 564434 564264 563901 563276 562488 561580 560452
58498 560452 559032 557402 555754 554270 553088 552295 551886 551845 552319 553631 555973 559120 562593 566069 569497
$$ packed form
58597E01556n04N26J536K457L386M449N507O238O570O799P117P310P122O723O469
58582E73261O344O037N557N277N366N503N428N357N653O209O612O774P103P942
58568F58423R098J0081J0637J0887J0985J0854J0362R565Q609P443N846L815J697
58555G68302j96j938l773n682p379q714r796j0735j1498j2108j2711j3302j3584
58542F56886j3309j2667j2091j1760j1443j0897j0165r418q599p500o111m751
58530E38175l705k848j820n41O12J278J530J757K210K826L380L643L453K861K215
58515E55026J871J833J791J549J226R50O44K12j79k95j94j70l63o25p88r08j128
58498E60452j420j630j648j484j182p93m09m1M74J312K342L147L473L476L428
$$ plain form
58483 569497 572809 575737 578022 579642 580721 581283 581231 580458 578850 576238 572472 567522 561469 554452 546716
58468 546716 538584 530297 522008 514033 506935 501124 496503 492705 489539 486999 484973 483283 481959 481122
58454 481122 480626 480123 479543 479149 479050 479007 478774 478346 477745 476880 475794 474761 473978 473418 473118 473314 474133 475476
58436 475476 477422 480362 484406 488951 493220 497046 500743 504458 508104 511805 515878 520292 524561 528326
58422 528326 531705 534911 537798 540036 541585 542730 543654 544102 543585 541922 539472 536786 534082 531222 528157
58407 528157 525139 522382 519734 516856 513561 509835 505684 501187 496588 492137 487910 483884 480081 476476
58393 476476 472868 469003 464748 460045 454844 449263 443674 438435 433621 429157 425113 421721 419173 417543
58379 417543 416766 416613 416831 417479 418949 421514 425057 429351 434346 439971 445926 451938 458015 464192 470272
$$ packed form
58483E69497L312K928K285J620J079N62n2p73j608k612l766m950o053p017p736
58468E46716q132q287q289p975p098n811m621l798l166k540k026j690j324q37
58454D81122m96n03n80l94r9m3k33m28o01q65j086j033p83n60l00J96Q19J343
58436D75476J946K940M044M545M269L826L697L715L646L701M073M414M269L765
58422E28326L379L206K887K238J549J145R24M48n17j663k450k686k704k860l065
58407E28157l018k757k648k878l295l726m151m497m599m451m227m026l803l605
58393D76476l608l865m255m703n201n581n589n239m814m464m044l392k548j630
58379D17543p77j53K18O48J470K565L543M294M995N625N955O012O077O177O080
$$ plain form
58364 470272 476098 481798 487404 492527 496810 500490 503998 507131 509152 509705 509216 508406 507809 507729 508235 509085
58348 509085 509994 511045 512609 514932 518049 522006 526757 531905 536949 541814 546801 552021 557232 562219
58334 562219 566948 571328 575195 578530 581402 583683 585217 586226 587167 588129 588801 589040 589100 589240 589532 590078
58318 590078 591005 592209 593519 595175 597691 601147 605053 608996 612994 617120 621290 625577 630236 635178
58304 635178 639877 644029 647936 651982 656154 660332 664671 669331 674127 678789 683354 688075 693125 698602
58290 698602 704627 711240 718367 726042 734475 743776 753824 764502 775861 788020 801126 815426 831123
58277 831123 848059 865828 884222 903324 923219 943923 965578 988279 1011677 1035162 1058465
58266 1058465 1081699 1104808 1127436 1149360 1170588 1191016 1210496 1229305 1247999 1266746 1285328
$$ packed form
58364D70272N826N700N606N123M283L680L508L133K021N53m89q10n97q0N06Q50
58348E09085R09J051J564K323L117L957M751N148N044M865M987N220N211M987
58334E62219M729M380L867L335K872K281J534J009R41R62O72K39O0J40K92N46
58318E90078R27J204J310J656K516L456L906L943L998M126M170M287M659M942
58304F35178M699M152L907M046M172M178M339M660M796M662M565M721N050N477
58290F98602O025O613P127P675Q433R301J0048J0678J1359J2159J3106J4300J5697
58277H31123J6936J7769J8394J9102J9895K0704K1655K2701K3398K3485K3303
58266A058465K3234K3109K2628K1924K1228K0428J9480J8809J8694J8747J8582
$$ plain form
58255 1285328 1303877 1322989 1343026 1363916 1385834 1409414 1435064 1462670 1492196 1524012 1558373
58244 1558373 1595177 1634475 1676698 1722099 1770487 1821735 1876083 1933777 1994977 2060070 2129491
58233 2129491 2203184 2280948 2363310 2451258 2545116 2644690 2750673 2864790 2988327 3121587
58223 3121587 3265138 3420429 3588789 3770996 3968377 4183255 4417903 4674217 4954875
58214 4954875 5263612 5604005 5979592 6395790 6860427 7382259 7971274 8641453 9411808
58205 9411808 10305000 11348777 12581142 14053090 15827327 17978905 20597062 23779792
58197 23779792 27628134 32263340 37858099 44612948 52617745 61653661 71101408 80081345
58189 80081345 87772811 93713626 97902178 100677619 102494698 103738103 104645220 105306171
$$ packed form
58255A285328J8549J9112K0037K0890K1918K3580K5650K7606K9526L1816L4361
58244A558373L6804L9298M2223M5401M8388N1248N4348N7694O1200O5093O9421
58233B129491P3693P7764Q2362Q7948R3858R9574J05983J14117J23537J33260
58223C121587J43551J55291J68360J82207J97381K14878K34648K56314K80658
58214D954875L08737L40393L75587M16198M64637N21832N89015O70179P70355
58205I411808Q93192J043777J232365J471948J774237K151578K618157L182730
58197B3779792L848342M635206N594759O754849Q004797R035916R447747Q979937
58189H0081345P691466N940815M188552K775441J817079J243405R07117O60951
$$ plain form
58181 105306171 105669338 105526231 104525319 102278014 98542214 93376024 87149755 80402124
58173 80402124 73637031 67183942 61178340 55629753 50505937 45784062 41462888 37553803
58165 37553803 34067526 31003765 28344756 26050812 24057223 22277218 20617802 19006001
58157 19006001 17410068 15840483 14331686 12919488 11627243 10462868 9422287 8495099
58149 8495099 7669556 6935091 6282694 5704943 5195946 4750336 4361827 4023204 3727627
58140 3727627 3469253 3242532 3041863 2862400 2700730 2554484 2421672 2300574 2189721
58131 2189721 2087695 1993207 1905456 1824076 1748659 1678641 1613643 1553452 1497531 1444953 1394979
58120 1394979 1347407 1302267 1259472 1218851 1180217 1143319 1107882 1073798 1041138 1010019 980571
$$ packed form
58181A05306171L63167j43107j000912k247305l735800n166190o226269o747631
58173H0402124o765093o453089o005602n548587n123816m721875m321174l909085
58165C7553803l486277l063761k659009k293944j993589j780005j659416j611801
58157A9006001j595933j569585j508797j412198j292245j164375j040581r27188
58149H495099q25543p34465o52397n77751n08997m45610l88509l38623k95577
58140C727627k58374k26721k00669j79463j61670j46246j32812j21098j10853
58131B189721j02026r4488q7751q1380p5417p0018o4998o0191n5921n2578m9974
58120A394979m7572m5140m2795m0621l8634l6898l5437l4084l2660l1119k9448
$$ plain form
58109 980571 952854 926590 901201 876371 852407 829751 808365 788000 768815 751223 735254
58098 735254 720574 707073 694947 684154 674277 665005 656353 648307 640560 632790 624943 617213 609830
58085 609830 602838 595930 588631 580841 572997 565466 557987 550031 541477 532575 523461 514199 505155 496815
58071 496815 489218 481984 474868 467945 461315 455038 449300 444272 439787 435551 431589 428153 425223 422520
58057 422520 419978 417770 415875 414002 411983 409888 407716 405325 402652 399746 396635 393460 390597 388278
58043 388278 386175 383795 381194 378818 376712 374404 371571 368334 364840 361102 357319 353896 350922 348096
58029 348096 345266 342675 340508 338606 336779 335033 333321 331456 329450 327639 326244 325080 323897 322781
58015 322781 322084 322124 323031 324663 326630 328590 330562 332791 335414 338541 342451 347262 352510 357557 362438
$$ packed form
58109I80571k7717k6264k5389k4830k3964k2656k1386k0365j9185j7592j5969
58098G35254j4680j3501j2126j0793r877r272q652q046p747p770p847p730p383
58085F09830o992o908p299p790p844p531p479p956q554q902r114r262r044q340
58071D96815p597p234p116o923o630o277n738n028m485m236l962l436k930k703
58057D22520k542k208j895j873k019k095k172k391k673k906l111l175k863k319
58043C88278k103k380k601k376k106k308k833l237l494l738l783l423k974k826
58029C48096k830k591k167j902j827j746j712j865k006j811j395j164j183j116
58015C22781o97M0R07J632J967J960J972K229K623L127L910M811N248N047M881
$$ plain form
58000 362438 367780 373812 380014 385859 391354 396608 401392 405456 408900 411915 414432 416330 417665 418495
57986 418495 418722 418303 417309 415630 412954 409284 405112 400889 396612 392148 387533 382713 377426 371737 366342
57971 366342 361872 358120 354382 350345 346215 342169 338240 334698 332028 330379 329339 328373 327244 325939
57957 325939 324493 323063 321994 321572 321727 322135 322612 323339 324601 326377 328292 330032 331660 333426 335395
57942 335395 337474 339705 342320 345459 349007 352716 356319 359580 362401 364928 367371 369706 371685 373109
57928 373109 373918 374086 373635 372702 371326 369257 366253 362497 358387 353940 348790 342856 336592 330469 324543
57913 324543 318664 312790 306931 301098 295465 290284 285496 280745 275951 271501 267617 263900 259835 255499
57899 255499 251434 247984 245117 242744 240848 239322 238040 237106 236790 237134 237774 238256 238402 238394 238539 238986 239643
$$ packed form
58000C62438N342O032O202N845N495N254M784M064L444L015K517J898J335Q30
57986D18495K27m19r94j679k676l670m172m223m277m464m615m820n287n689n395
57971C66342m470l752l738m037m130m046l929l542k670j649j040r66j129j305
57957C25939j446j430j069m22J55M08M77P27J262J776J915J740J628J766J969
57942C35395K079K231K615L139L548L709L603L261K821K527K443K335J979J424
57928C73109Q09J68m51r33j376k069l004l756m110m447n150n934o264o123n926
57913C24543n879n874n859n833n633n181m788m751m794m450l884l717m065m336
57899B55499m065l450k867k373j896j526j282r34l16L44O40M82J46qJ45M47O57
$$ plain form
57882 239643 240353 241135 242202 243755 245837 248362 251170 254071 256898 259517 261749 263436 264733 266149 268030
57867 268030 270109 271835 273075 274152 275240 276142 276736 277272 278062 279189 280666 282579 284908 287377 289646
57852 289646 291498 292840 293760 294626 295853 297446 298975 300034 300460 300151 299038 297367 295629 294037 292354
57837 292354 290380 288288 286296 284314 282164 279888 277638 275473 273477 271852 270723 270014 269609 269432 269344
57822 269344 269250 269382 270108 271344 272559 273524 274612 276131 277772 279055 279980 280852 281735 282452 282882 282864 282008
57805 282008 280042 277251 274263 271410 268524 265258 261400 256926 251957 246638 240994 235031 229003 223350
57791 223350 218257 213547 209110 205149 201831 199039 196659 194813 193522 192456 191281 190072 189150 188762 189064
57776 189064 190105 191589 192966 194015 195038 196263 197472 198487 199554 200827 201884 202259 202117 201847 201327
$$ packed form
57882B39643P10P82J067J553K082K525K808K901K827K619K232J687J297J416J881
57867B68030K079J726J240J077J088R02N94N36P90J127J477J913K329K469K269
57852B89646J852J342R20Q66J227J593J529J059M26l09j113j671j738j592j683
57837B92354j974k092j992j982k150k276k250k165j996j625j129p09m05j77q8
57822B69344r4J32P26J236J215R65J088J519J641J283R25Q72Q83P17M30j8q56
57805B82008j966k791k988k853k886l266l858m474m969n319n644n963o028n653
57791B23350n093m710m437l961l318k792k380j846j291j066j175j209r22l88L02
57776A89064J041J484J377J049J023J225J209J015J067J273J057L75j42k70n20
$$ plain form
57761 201327 200146 198338 196293 194086 191521 188736 186192 184028 181963 179857 177889 176132 174405 172632
57747 172632 170931 169324 167709 166174 164956 164061 163255 162448 161719 160983 160045 159012 158267 157906 157602 157111 156587
57730 156587 156232 155980 155667 155271 154818 154259 153584 152904 152333 151933 151787 151972 152432 153032 153671 154176 154185 153483 152391
57711 152391 151521 151111 150918 150769 150846 151276 151800 152037 151889 151516 151087 150720 150496 150413 150413 150560 151050 151962 153105 154239
57691 154239 155361 156652 158198 159869 161537 163378 165842 169316 173886 179570 186658 195650 206895 220610
57677 220610 237199 257229 280958 308220 338824 372573 408565 444862 479246 510147 536676
57666 536676 558218 574522 586004 593339 596765 595993 590581 580001 563570 541002 513078 481479
57654 481479 447913 413741 380251 348715 319934 294010 270655 249575 230679 214164 200343
$$ packed form
57761B01327j181j808k045k207k565k785k544k164k065k106j968j757j727j773
57747A72632j701j607j615j535j218q95q06q07p29p36r38j033p45l61l04m91n24
57730A56587l55k52l13l96m53n59o75o80n71m00j46J85M60O00O39N05Rp02j092
57711A52391q70m10j93j49P7M30N24K37j48l73m29l67k24q3%J47M90R12J143J134
57691A54239J122J291J546J671J668J841K464L474M570N684P088Q992J1245J3715
57677B20610J6589K0030K3729K7262L0604L3749L5992L6297L4384L0901K6529
57666E36676K1542J6304J1482P335L426p72n412j0580j6431k2568k7924l1599
57654D81479l3566l4172l3490l1536k8781k5924k3355k1080j8896j6515j3821
$$ plain form
57643 200343 189087 179608 171074 163295 156475 150549 145298 140950 138000 136333 135084 133530 131736 130192
57629 130192 129193 128659 128200 127299 125762 124033 122742 121941 121163 120164 119158 118264 117269 116095 114987 114057 113060
57612 113060 111867 110733 109873 109155 108442 107908 107717 107673 107429 106814 105811 104467 103029 101878 101166 100675 100201
57595 100201 99752 99261 98431 97102 95520 94008 92607 91221 89886 88676 87525 86316 84985 83457 81724
57580 81724 80041 78755 77803 76682 75072 73211 71473 69910 68423 67087 66024 65182 64454 63809 63117 62132
57564 62132 60905 59906 59424 59119 58493 57591 56845 56431 56246 56371 57012 57916 58314 57727 56534 55552 55201 55336
57546 55336 55687 56201 56919 57764 58605 59426 60263 61010 61411 61298 60720 59856 58945 58281 58063 58138 58108 57794 57421 57200
57526 57200 57012 56685 56310 56008 55627 55047 54516 54290 54147 53698 53055 52670 52633 52643 52627 52798 53110 53211 53080 53156
$$ packed form
57643B00343j1256r479q534p779o820n926n251m348k950j667j249j554j794j544
57629A30192r99n34m59r01j537j729j291q01p78r99j006q94r95j174j108r30r97
57612A13060j193j134q60p18p13n34j91m4k44o15j003j344j438j151p12m91m74
57595A00201m49m91q30j329j582j512j401j386j335j210j151j209j331j528j733
57580H1724j683j286r52j121j610j861j738j563j487j336j063q42p28o45o92r85
57564F2132j227r99m82l05o26r02p46m14j85J25O41R04L98n87j193r82l51J35
57546E5336L51N14P18Q45Q41Q21Q37P47M01j13n78q64r11o64k18P5l0l14l73k21
57526E7200j88l27l75l02l81n80n31k26j43m49o43l85l7J0j6J71L12J01j31P6
$$ plain form
57506 53156 53664 54278 54641 54743 54597 54039 53144 52393 52098 52005 51704 51077 50081 48482 46180 43534 41031 38862
57488 38862 37032 35536 34157 32455 30356 28472 27394 26928 26398 25546 24670 24000 23387 22628 21703 20620
57472 20620 19300 17795 16432 15593 15360 15412 15305 14874 14355 14040 13909 13731 13453 13205 12999 12682 12239 11847
57454 11847 11557 11215 10784 10445 10301 10267 10323 10571 10910 10994 10657 10059 9348 8518 7735 7373 7459 7420 6694 5354
57434 5354 3910 2790 2203 2201 2561 2815 2694 2286 1680 746 -442 -1377 -1649 -1510 -1551 -2025 -2768 -3573 -4316 -4887
57414 -4887 -5346 -6022 -7208 -8828 -10603 -12352 -13918 -15044 -15640 -16042 -16727 -17836 -19193 -20639 -22105 -23497
57398 -23497 -24702 -25675 -26415 -26976 -27594 -28558 -29842 -31134 -32312 -33593 -35036 -36258 -36895 -37060 -37076 -37066 -37096 -37391
57380 -37391 -38028 -38639 -38824 -38726 -38847 -39430 -40280 -41128 -41855 -42469 -43120 -44059 -45380 -46886 -48337 -49683 -50936 -52032
$$ packed form
57506E3156N08O14L63J02j46n58q95p51k95r3l01o27r96j599k302k646k503k169
57488C8862j830j496j379j702k099j884j078m66n30q52q76o70o13p59r25j083
57472B0620j320j505j363q39k33N2j07m31n19l15j31j78k78k48k06l17m43l92
57454A1847k90l42m31l39j44l4N6K48L39Q4l37n98p11q30p83l62Q6l9p26j340
57434E354j444j120n87kL60K54j21m08o06G46d42r35k72J39m1m74p43q05p43n71
57414d887m59o76j186j620j775j749j566j126n96m02o85j109j357j446j466j392
57398b3497j205r73p40n61o18r64j284j292j178j281j443j222o37j65j6J0l0k95
57380c7391o37o11j85R8j21n83q50q48p27o14o51r39j321j506j451j346j253j096
$$ plain form
57362 -52032 -53000 -54033 -55215 -56409 -57522 -58609 -59585 -60211 -60560 -61072 -61888 -62515 -62509 -62100 -61794 -61745 -61959 -62702
57344 -62702 -64128 -65770 -66993 -67790 -68547 -69271 -69638 -69778 -70341 -71692 -73530 -75436 -77329 -79192 -80790 -81917
57328 -81917 -82706 -83475 -84376 -85351 -86337 -87412 -88728 -90271 -91741 -92735 -93133 -93172 -93164 -93297 -93741 -94653 -95962 -97363
57310 -97363 -98648 -99850 -100984 -101935 -102689 -103375 -103978 -104339 -104594 -105243 -106545 -108173 -109670 -110886 -111757 -112026 -111529
57293 -111529 -110449 -108976 -107011 -104437 -101408 -98075 -94275 -89735 -84320 -77928 -70519 -62469 -54464 -46779
57279 -46779 -39013 -30815 -22432 -14265 -6361 1316 8595 15431 22211 29230 36333 43412 50827 58918
57265 58918 67575 76789 87115 98994 111988 125219 138126 150222 160578 168256 173124 175729 176648
57252 176648 176438 175834 175331 174775 173844 172611 171162 169095 166060 162524 159433 157394 156721 157875 161194 166359
$$ packed form
57362e2032r68j033j182j194j113j087r76o26l49n12q16o27OM09L06M9k14p43
57344f2702j426j642j223p97p57p24l67j40n63j351j838j906j893j863j598j127
57328h1917p89p69r01r75r86j075j316j543j470r94l98l9Qj33m44r12j309j401
57310i7363j285j202j134r51p54o86o03l61k55o49j302j628j497j216q71k69M97
57293a11529J080J473J965K574L029L333L800M540N415O392P409Q050Q005P685
57279d6779P766Q198Q383Q167f361A316P279O836O780P019P103P079P415Q091
57265E8918Q657R214J0326J1879J2994J3231J2907J2096J0356P678M868K605R19
57252A76648k10o04n03n56r31j233j449k067l035l536l091k039o73J154L319N165
$$ plain form
57236 166359 172712 179821 187205 193919 199059 202403 204047 203802 201654 198354 194832 191289 187561 184012
57222 184012 181300 179561 178580 178514 179686 181914 184792 188356 192734 197398 201560 205110 208403 211373 213701
57207 213701 215658 217947 220833 224155 227977 232477 237324 241925 246176 250301 254193 257573 260534 263252
57193 263252 265467 266952 268120 269365 270222 270014 268944 267692 266338 264630 262924 261865 261445 261375 262012 263873
57177 263873 266585 269303 271878 274607 277255 279433 281445 283588 285093 285124 284399 284281 284491 283259 279720
57162 279720 274665 268917 262355 254633 245482 234086 219269 200363 176811 146955 108307 58921
57150 58921 -2520 -77549 -167444 -272041 -390123 -520645 -662329 -812624 -968699 -1129251
57140 -1129251 -1294052 -1462300 -1633131 -1807267 -1986343 -2170959 -2361125 -2558089 -2763776
$$ packed form
57236A66359O353P109P384O714N140L344J644k45k148l300l522l543l728l549
57222A84012k712j739r81o6J172K228K878L564M378M664M162L550L293K970K328
57207B13701J957K289K886L322L822M500M847M601M251M125L892L380K961K718
57193B63252K215J485J168J245Q57k08j070j252j354j708j706j059m20p0O37J861
57177B63873K712K718K575K729K648K178K012K143J505L1p25j18K10j232l539
57162B79720n055n748o562p722r151j1396j4817j8906k3552k9856l8648m9386
57150E8921b520p5029q9895j04597j18082j30522j41684j50295j56075j60552
57140a129251j64801j68248j70831j74136j79076j84616j90166j96964k05687
$$ plain form
57131 -2763776 -2978923 -3203957 -3441397 -3695199 -3967957 -4260923 -4576309 -4917169 -5285300
57122 -5285300 -5681832 -6109721 -6573206 -7075125 -7617551 -8204913 -8843836 -9540293 -10300065
57113 -10300065 -11132070 -12048583 -13062935 -14190852 -15454404 -16882131 -18507053 -20370131
57105 -20370131 -22527527 -25053346 -28039767 -31604105 -35900989 -41128996 -47532292 -55405314
57097 -55405314 -65092418 -76964518 -91375745 -108619257 -128876783 -152131763 -178049511
57090 -178049511 -205892131 -234553035 -262746768 -289312536 -313509148 -335130748 -354342421
57083 -354342421 -371337734 -386076263 -398268272 -407520485 -413449624 -415719093 -414112644
57076 -414112644 -408692830 -399918524 -388581331 -375582309 -361691190 -347398055 -332882392
$$ packed form
57131b763776k15147k25034k37440k53802k72758k92966l15386l40860l68131
57122e285300l96532m27889m63485n01919n42426n87362o38923o96457p59772
57113a0300065q32005r16513j014352j127917j263552j427727j624922j863078
57105b0370131k157396k525819k986421l564338m296884n228007o403296p873022
57097e5405314r687104j1872100j4411227j7243512k0257526k3254980k5917748
57090a78049511k7842620k8660904k8193733k6565768k4196612k1621600j9211673
57083c54342421j6995313j4738529j2192009r252213n929139k269469J606449
57076d14112644N419814Q774306J1337193J2999022J3891119J4293135J4515663
$$ plain form
57069 -332882392 -318084093 -302837926 -287001067 -270512544 -253389493 -235710668 -217612794
57062 -217612794 -199285985 -180960295 -162896472 -145382952 -128720403 -113186447 -98998526
57055 -98998526 -86292258 -75114654 -65428273 -57128941 -50073706 -44105451 -39066793 -34808963
57047 -34808963 -31200129 -28128882 -25501310 -23238134 -21275152 -19562272 -18058941 -16731007
57039 -16731007 -15551259 -14499052 -13556968 -12709027 -11942272 -11247333 -10615947 -10039589 -9511175
57030 -9511175 -9025948 -8579611 -8167229 -7784813 -7430166 -7101250 -6795159 -6509416 -6242816
57021 -6242816 -5994366 -5762745 -5547256 -5347657 -5162326 -4987968 -4821798 -4662856 -4510831
57012 -4510831 -4364990 -4224693 -4089494 -3958101 -3828504 -3699794 -3572871 -3449109 -3329606
$$ packed form
57069c32882392J4798299J5246167J5836859J6488523J7123051J7678825J8097874
57062b17612794J8326809J8325690J8063823J7513520J6662549J5533956J4187921
57055i8998526J2706268J1177604R686381Q299332P055235N968255N038658M257830
57047c4808963L608834L071247K627572K263176J962982J712880J503331J327934
57039a6731007J179748J052207R42084Q47941P66755O94939O31386N76358N28414
57030i511175M85227M46337M12382L82416L54647L28916L06091K85743K66600
57021f242816K48450K31621K15489J99599J85331J74358J66170J58942J52025
57012d510831J45841J40297J35199J31393J29597J28710J26923J23762J19503
$$ plain form
57003 -3329606 -3215956 -3110122 -3012706 -2922333 -2837300 -2756795 -2680274 -2606968 -2536672 -2469871 -2406557
56992 -2406557 -2345904 -2287610 -2232427 -2180806 -2132019 -2085202 -2040303 -1997419 -1956044 -1915608 -1876013
56981 -1876013 -1837230 -1799059 -1761610 -1725252 -1689868 -1654960 -1620739 -1588134 -1557470 -1528064 -1499402
56970 -1499402 -1471695 -1444921 -1418410 -1391905 -1366046 -1341274 -1317160 -1293364 -1270293 -1248178 -1226376
56959 -1226376 -1204313 -1182374 -1161186 -1140665 -1120448 -1100654 -1081519 -1062760 -1043935 -1025093 -1006620
56948 -1006620 -988832 -972074 -956743 -942764 -929431 -916130 -902820 -889596 -876311 -862906 -849573
56937 -849573 -836247 -822495 -808195 -793855 -779965 -766557 -753637 -741439 -729931 -718713 -707750
56926 -707750 -697614 -688571 -680058 -671490 -663107 -655516 -648867 -642914 -637485 -632427 -627436 -622380 -617464 -612772
$$ packed form
57003c329606J13650J05834R7416R0373Q5033Q0505P6521P3306P0296O6801O3314
56992b406557O0653N8294N5183N1621M8787M6817M4899M2884M1375M0436L9595
56981a876013L8783L8171L7449L6358L5384L4908L4221L2605L0664K9406K8662
56970a499402K7707K6774K6511K6505K5859K4772K4114K3796K3071K2115K1802
56959a226376K2063K1939K1188K0521K0217J9794J9135J8759J8825J8842J8473
56948a006620J7788J6758J5331J3979J3333J3301J3310J3224J3285J3405J3333
56937h49573J3326J3752J4300J4340J3890J3408J2920J2198J1508J1218J0963
56926g07750J0136R043Q513Q568Q383P591O649N953N429N058M991N056M916M692
$$ plain form
56912 -612772 -607983 -602828 -597491 -592281 -587232 -582283 -577468 -572688 -567697 -562540 -557657 -553398 -549789 -546854
56898 -546854 -544598 -542491 -539624 -535644 -531007 -526006 -520165 -513001 -504819 -496309 -487788 -479250 -470703 -462023
56884 -462023 -452865 -443133 -433190 -423315 -413401 -403583 -394630 -387206 -381073 -375476 -370001 -364592 -359075 -353220
56870 -353220 -347070 -340719 -333882 -326088 -317239 -307709 -298013 -288572 -279644 -271253 -263325 -255957 -249319 -243247
56856 -243247 -237315 -231463 -226131 -221650 -217939 -214982 -213061 -212195 -211814 -211324 -210565 -209358 -207103 -203281 -197980
56841 -197980 -191500 -183776 -174717 -164787 -154757 -145047 -135711 -126829 -118514 -110740 -103529 -97135 -91742 -87221
56827 -87221 -83564 -81292 -81043 -82950 -86724 -92052 -98484 -105125 -110961 -115452 -118520 -120151 -120293 -118978 -116219
56812 -116219 -111937 -106346 -100178 -94186 -88579 -83238 -78304 -74121 -70810 -68278 -66547 -65702 -65666 -66449 -68482
$$ packed form
56912f12772M789N155N337N210N049M949M815M780M991N157M883M259L609K935
56898e46854K256K107K867L980M637N001N841P164Q182Q510Q521Q538Q547Q680
56884d62023R158R732R943R875R914R818Q953P424O133N597N475N409N517N855
56870c53220O150O351O837P794Q849R530R696R441Q928Q391P928P368O638O072
56856b43247N932N852N332M481L711K957J921Q66L81M90P59J207K255L822N301
56841a97980O480P724R059R930J0030R710R336Q882Q315P774P211O394N393M521
56827h7221L657K272K49j907l774n328o432o641n836m491l068j631j42J315K759
56812a16219M282N591O168N992N607N341M934M183L311K532J731Q45L6p83k033
$$ plain form
56797 -68482 -72278 -77719 -84052 -90538 -96768 -102398 -106986 -110233 -112129 -112744 -112116 -110370 -107784 -104667 -101321
56782 -101321 -98093 -95288 -92996 -91119 -89536 -88196 -87091 -86307 -86091 -86738 -88401 -90977 -94170 -97651 -101272
56767 -101272 -105040 -108840 -112280 -115087 -117509 -119964 -122351 -124122 -125097 -125741 -126479 -127177 -127506 -127408 -126941 -126052
56751 -126052 -124847 -123734 -122956 -122253 -121331 -120382 -119777 -119456 -119040 -118389 -117714 -117229 -117017 -117097 -117353 -117472 -117227 -116708
56733 -116708 -116105 -115412 -114506 -113382 -112104 -110701 -109299 -108093 -107035 -105770 -104147 -102469 -100972 -99398 -97427
56718 -97427 -95268 -93382 -91831 -90317 -88754 -87344 -86194 -85192 -84237 -83287 -82243 -81062 -79870 -78740 -77509
56703 -77509 -76084 -74762 -73871 -73222 -72285 -70848 -69160 -67509 -65998 -64719 -63788 -63150 -62605 -62074 -61642 -61373 -61239
56686 -61239 -61186 -61127 -60968 -60782 -60866 -61444 -62442 -63668 -64985 -66179 -66915 -67094 -67044 -67050 -66922 -66274 -65079 -63646 -62274
$$ packed form
56797f8482l796n441o333o486o230n630m588l247j896o15O28J746K586L117L346
56782a01321L228K805K292J877J583J340J105P84K16o47j663k576l193l481l621
56767a01272l768l800l440k807k422k455k387j771r75o44p38o98l29R8M67Q89
56751a26052J205J113P78P03R22R49O05L21M16O51O75M85K12q0k56j19K45N19
56733a16708O03O93R06J124J278J403J402J206J058J265J623J678J497J574J971
56718i7427K159J886J551J514J563J410J150J002R55R50J044J181J192J130J231
56703g7509J425J322Q91O49R37J437J688J651J511J279R31O38N45N31M32K69J34
56686f1239N3N9J59J86q4n78r98j226j317j194p36j79N0oJ28O48J195J433J372
$$ plain form
56667 -62274 -61219 -60727 -60716 -60603 -59868 -58655 -57504 -56615 -55756 -54721 -53481 -52032 -50487 -49192 -48364 -47731 -46920
56650 -46920 -46034 -45400 -44897 -44110 -43058 -42198 -41689 -41213 -40602 -40081 -39736 -39271 -38544 -37899 -37663 -37629 -37350 -36725 -36045
56631 -36045 -35611 -35496 -35597 -35740 -35776 -35662 -35410 -35027 -34574 -34191 -33898 -33476 -32698 -31569 -30184 -28536 -26721 -25125
56613 -25125 -24021 -23107 -21830 -20112 -18387 -16967 -15756 -14566 -13296 -11810 -10062 -8401 -7307 -6743 -6129
56598 -6129 -5067 -3738 -2513 -1535 -843 -496 -388 -251 -23 43 -201 -534 -631 -425 -31 430 818 979 917 800
56578 800 751 808 1081 1700 2547 3318 3923 4575 5454 6542 7831 9393 11141 12861 14601 16709 19349 22265
56560 22265 25196 28236 31570 35111 38604 41933 45153 48387 51833 55655 59685 63400 66348 68530
56546 68530 70274 71876 73428 74816 75772 76099 75892 75407 74706 73671 72352 71012 69697 68084 65921 63377
$$ packed form
56667f2274J055M92J1J13P35J213J151Q89Q59J035J240J449J545J295Q28O33Q11
56650d6920Q86O34N03P87J052Q60N09M76O11N21L45M65P27O45K36L4K79O25O80
56631c6045M34J15j01j43l6J14K52L83M53L83K93M22P78J129J385J648J815J596
56613b5125J104R14J277J718J725J420J211J190J270J486J748J661J094N64O14
56598f129J062J329J225R78O92L47J08J37b3D3b01l33r7K06c1D30L88J61o2j17
56578H00m9N7K73O19Q47P71O05O52Q79J088J289J562J748J720J740K108K640K916
56560B2265K931L040L334L541L493L329L220L234L446L822M030L715K948K182
56546F8530J744J602J552J388R56L27k07m85p01j035j319j340j315j613k163k544
$$ plain form
56530 63377 60807 58367 55970 53412 50448 47008 43472 40457 38141 36028 33568 30763 28001 25588
56516 25588 23680 22400 21641 20909 19705 18028 16268 14662 13150 11712 10528 9736 9245 8907 8753 8924
56500 8924 9381 9794 9827 9548 9415 9734 10242 10414 10112 9671 9365 9122 8819 8546 8416 8346 8204 8018 7913 7986
56480 7986 8349 9087 10093 11087 11932 12771 13743 14773 15673 16302 16535 16349 16051 16160 16876 17837 18566 18934 19071
56461 19071 19067 18997 18981 19025 18942 18668 18458 18589 19059 19771 20761 21967 22979 23372 23217 22975 22969 23177 23482 23838 24195
56440 24195 24503 24788 25106 25449 25821 26291 26843 27306 27570 27732 27880 27909 27804 27871 28407 29276 30115 30861 31718 32714
56420 32714 33637 34365 34912 35123 34736 33828 32891 32348 32221 32377 32792 33422 34037 34418 34601 34787 35107 35548 36013
56401 36013 36366 36535 36672 37062 37776 38525 38951 38977 38770 38472 38136 37838 37700 37771 37976 38222 38513 38955 39656 40607
$$ packed form
56530F3377k570k440k397k558k964l440l536l015k316k113k460k805k762k413
56516B5588j908j280p59p32j204j677j760j606j512j438j184p92m91l38j54J71
56500H924M57M13L3k79j33L19N08J72l02m41l06k43l03k73j30p0j42j86j05P3
56480G986L63P38J006R94Q45Q39R72J030R00O29K33j86k98J09P16R61P29L68J37
56461A9071mp0j6M4q3k74k10J31M70P12R90J206J012L93j55k42oK08L05L56L57
56440B4195L08K85L18L43L72M70N52M63K64J62J48K9j05O7N36Q69Q39P46Q57R96
56420C2714R23P28N47K11l87r08r37n43j27J56M15O30O15L81J83J86L20M41M65
56401C6013L53J69J37L90P14P49M26K6k07k98l36k98j38P1K05K46K91M42P01R51
$$ plain form
56381 40607 41646 42550 43193 43607 43922 44252 44668 45193 45779 46313 46686 46896 47071 47370 47835 48349 48750 49007 49245
56362 49245 49586 50005 50375 50596 50663 50639 50615 50673 50864 51200 51668 52253 52923 53598 54141 54389 54276 53987 53896 54246 54898
56341 54898 55525 56006 56548 57353 58364 59352 60175 60846 61413 61872 62159 62218 62130 62168 62632 63537 64537 65235 65525
56322 65525 65607 65742 66051 66500 67017 67606 68355 69289 70219 70821 70927 70688 70456 70495 70827 71293 71762 72302 73113 74302
56302 74302 75765 77324 78862 80243 81291 82038 82855 84114 85765 87489 89196 91062 93104 95037 96699
56287 96699 98299 100108 102057 103834 105220 106239 107107 108133 109556 111358 113329 115328 117359 119422 121481
56272 121481 123573 125731 127779 129537 131252 133491 136444 139673 142731 145756 149166 153055 157193 161445
56258 161445 165905 170698 175925 181724 188200 195375 203301 212093 221756 232220 243618 256202 269797
$$ packed form
56381D0607J039R04O43M14L15L30M16N25N86N34L73K10J75K99M65N14M01K57K38
56362D9245L41M19L70K21O7k4k4N8J91L36M68N85O70O75N43K48j13k89r1L50O52
56341E4898O27M81N42Q05J011R88Q23O71N67M59K87N9q8L8M64R05J000O98K90
56322F5525Q2J35L09M49N17N89P49R34R30O02J06k39k32L9L32M66M69N40Q11J189
56302G4302J463J559J538J381J048P47Q17J259J651J724J707J866K042J933J662
56287I6699J600J809J949J777J386J019Q68J026J423J802J971J999K031K063K059
56272A21481K092K158K048J758J715K239K953L229L058L025L410L889M138M252
56258A61445M460M793N227N799O476P175P926Q792R663J0464J1398J2584J3595
$$ plain form
56245 269797 283669 297306 311012 325314 339998 354198 367319 379415 390668 400995 410212 418193
56233 418193 424727 429498 432339 433309 432492 429918 425681 419900 412573 403710 393634 382870 371768 360454
56219 360454 349073 337759 326376 314687 302860 291433 280692 270420 260416 250913 242217 234250
56207 234250 226760 219786 213589 208191 203307 198708 194433 190594 187155 184005 181121 178559 176311 174259
56193 174259 172329 170656 169481 168828 168362 167681 166713 165719 164968 164550 164451 164636 165004 165417 165843 166394 167186 168206
56175 168206 169292 170189 170709 170944 171256 171910 172820 173774 174825 176208 177939 179793 181682 183774 186171 188744
56159 188744 191403 194285 197516 201009 204686 208694 213172 217923 222555 226944 231368 236190 241587 247644
56145 247644 254585 262756 272370 283335 295459 308837 323996 341604 362125 385821 412886 443390
$$ packed form
56245B69797J3872J3637J3706J4302J4684J4200J3121J2096J1253J0327R217P981
56233D18193O534M771K841R70q17k574m237n781p327q863j0076j0764j1102j1314
56219C60454j1381j1314j1383j1689j1827j1427j0741j0272j0004r503q696p967
56207B34250p490o974o197n398m884m599m275l839l439l150k884k562k248k052
56193A74259j930j673j175o53m66o81r68r94p51m18r9J85L68M13M26N51P92J020
56175A68206J086Q97N20K35L12O54R10R54J051J383J731J854J889K092K397K573
56159A88744K659K882L231L493L677M008M478M751M632M389M424M822N397O057
56145B47644O941Q171R614J0965J2124J3378J5159J7608K0521K3696K7065L0504
$$ plain form
56133 443390 477129 513808 553334 595706 640537 686966 734220 782138 830981 880763 930793
56122 930793 979721 1025948 1068128 1105447 1137495 1163952 1184591 1199594 1209604 1215306 1217055 1214926
56110 1214926 1208818 1198285 1182574 1161279 1134961 1104794 1071619 1035651 997133 956835 915616
56099 915616 873746 831021 787502 743873 701114 660076 621442 585855 553872 525817 501713
56088 501713 481285 464049 449533 437502 427880 420442 414756 410527 407785 406607 406779 407921 409803
56075 409803 412307 415183 418103 420934 423709 426343 428641 430586 432330 433887 435107 436026 436909 437871 438733
56060 438733 439423 440200 441290 442621 444199 446418 449659 453727 458105 462644 467673 473451 479844 486615 493737
56045 493737 501307 509280 517432 525598 533938 542946 553014 563956 575144 586213 597429 609279 621940
$$ packed form
56133D43390L3739L6679L9526M2372M4831M6429M7254M7918M8843M9782N0030
56122I30793M8928M6227M2180L7319L2048K6457K0639J5003J0010N702J749k129
56110A214926o108j0533j5711k1295k6318l0167l3175l5968l8518m0298m1219
56099I15616m1870m2725m3519m3629m2759m1038l8634l5587l1983k8055k4104
56088E01713k0428j7236j4516j2031r622p438n686m229k742j178J72J142J882
56075D09803K504K876K920K831K775K634K298J945J744J557J220R19Q83R62Q62
56060D38733O90P77J090J331J578K219L241M068M378M539N029N778O393O771P122
56045D93737P570P973Q152Q166Q340R008J0068J0942J1188J1069J1216J1850J2661
$$ plain form
56032 621940 635330 649369 663888 678541 693172 708163 724022 740732 757823 775018 792460
56021 792460 810366 828828 847981 868035 889042 910854 933396 956799 981275 1007046 1034342
56010 1034342 1063287 1093803 1125869 1159784 1195934 1234344 1274712 1316888 1361064 1407545 1456528
55999 1456528 1508102 1562247 1618870 1678047 1740188 1805797 1875174 1948526 2026200 2108537 2195710
55988 2195710 2288001 2386115 2490933 2603125 2723318 2852483 2991772 3142194 3304891 3481600
55978 3481600 3674439 3885364 4116227 4369279 4647311 4953620 5292338 5668626 6088359
55969 6088359 6558312 7087593 7688896 8378327 9175434 10105461 11202447 12510977 14087825
55960 14087825 16005509 18354859 21242357 24784616 29105155 34326717 40538958 47730843
$$ packed form
56032F21940J3390J4039J4519J4653J4631J4991J5859J6710J7091J7195J7442
56021G92460J7906J8462J9153K0054K1007K1812K2542K3403K4476K5771K7296
56010A034342K8945L0516L2066L3915L6150L8410M0368M2176M4176M6481M8983
55999A456528N1574N4145N6623N9177O2141O5609O9377P3352P7674Q2337Q7173
55988B195710R2291R8114J04818J12192J20193J29165J39289J50422J62697J76709
55978C481600J92839K10925K30863K53052K78032L06309L38718L76288M19733
55969F088359M69953N29281O01303O89431P97107R30027J096986J308530J576848
55960A4087825J917684K349350K887498L542259M320539N221562O212241P191885
$$ plain form
55952 47730843 55711912 64077698 72268420 79717805 86019987 91014261 94741061 97326132
55944 97326132 98903083 99621488 99672037 99230576 98325545 96752364 94148940 90208733 84884622
55935 84884622 78446523 71373585 64171498 57226735 50754556 44828407 39442788 34567364
55927 34567364 30175513 26251058 22783267 19758304 17152671 14931657 13052334 11468244
55919 11468244 10133468 9005677 8048129 7230361 6527683 5920245 5392083 4930282 4524374
55910 4524374 4166086 3848978 3567662 3317133 3092845 2891161 2709323 2544962 2395885
55901 2395885 2260224 2136456 2023167 1918987 1822809 1733897 1651733 1575802 1505502 1440143
55891 1440143 1379091 1322021 1268945 1219900 1174694 1133064 1094912 1060155 1028441 999277 972424
$$ packed form
55952D7730843P981069Q365786Q190722P449385O302182M994274L726800K585071
55944I7326132J576951P18405N0549m41461r05031j573181k603424l940207n324111
55935H4884622o438099p072938p202087o944763o472179n926149n385619m875424
55927C4567364m391851l924455l467791l024963k605633k221014j879323j584090
55919A1468244j334776j127791r57548q17768p02678o07438n28162m61801m05908
55910D524374l58288l17108k81316k50529k24288k01684j81838j64361j49077
55901B395885j35661j23768j13289j04180r6178q8912q2164p5931p0300o5359
55891A440143o1052n7070n3076m9045m5206m1630l8152l4757l1714k9164k6853
$$ plain form
55880 972424 947974 926010 906392 888913 873442 859798 847528 835995 824703 813490 802333
55869 802333 790954 778792 765480 751253 736643 721774 706217 689611 672115 654086 635570
55858 635570 616427 596788 577090 557709 538850 520760 503756 487968 473257 459472 446626
55847 446626 434756 423766 413489 403803 394615 385817 377352 369247 361558 354327 347667 341797 336850
55834 336850 332617 328603 324407 320063 315937 312318 309195 306453 304141 302403 301205 300335 299672 299279 299211
55819 299211 299393 299821 300709 302271 304401 306692 308777 310571 312172 313637 314868 315689 316048 316060 315814 315139
55803 315139 313664 311180 307831 303920 299603 294836 289553 283827 277867 271938 266226 260802 255788 251494
55789 251494 248255 246111 244781 244018 243779 243966 244243 244370 244560 245206 246273 247220 247585 247411 247036 246607 245945
$$ packed form
55880I72424k4450k1964j9618j7479j5471j3644j2270j1533j1292j1213j1157
55869H02333j1379j2162j3312j4227j4610j4869j5557j6606j7496j8029j8516
55858F35570j9143j9639j9698j9381j8859j8090j7004j5788j4711j3785j2846
55847D46626j1870j0990j0277r686r188q798q465q105p689p231o660n870m947
55834C36850m233m014m196m344m126l619l123k742k312j738j198q70o63l93o8
55819B99211J82M28Q88J562K130K291K085J794J601J465J231Q21L59J2k46o75
55803C15139j475k484l349l911m317m767n283n726n960n929n712n424n014m294
55789B51494l239k144j330p63k39J87K77J27J90O46J067R47L65j74l75m29o62
$$ plain form
55772 245945 244766 242905 240417 237528 234491 231397 228125 224515 220544 216349 212152 208192 204656 201553
55758 201553 198621 195452 191781 187707 183630 179953 176802 173977 171172 168259 165365 162682 160222 157819
55744 157819 155396 153149 151354 150017 148838 147561 146271 145208 144431 143761 143015 142116 141054 139897 138870
55729 138870 138184 137725 137095 136079 134945 134145 133813 133706 133531 133156 132552 131700 130677 129697 128998 128673 128649 128803
55711 128803 129109 129636 130356 130987 131129 130629 129774 129031 128646 128544 128556 128610 128721 128872 128967 128876 128555 128149 127914 127965
55691 127965 128157 128285 128355 128555 128975 129510 130083 130819 131899 133286 134743 136089 137366 138725 140212 141705
55675 141705 143052 144186 145151 146045 146990 148056 149151 150016 150455 150565 150669 151010 151608 152389 153264 153990 154164
55658 154164 153568 152427 151124 149703 147889 145606 143175 140902 138688 136230 133456 130572 127787 125198
$$ packed form
55772B45945j179j861k488k889l037l094l272l610l971m195m197l960l536l103
55758B01553k932l169l671m074m077l677l151k825k805k913k894k683k460k403
55744A57819k423k247j795j337j179j277j290j063p77o70p46q99j062j157j027
55729A38870o86m59o30j016j134q00l32j07j75l75o04q52j023r80o99l25k4J54
55711A28803L06N27P20O31J42n00q55p43l85j02J2N4J11J51R5r1l21m06k35N1
55691A27965J92J28P0K00M20N35N73P36J080J387J457J346J277J359J487J493
55675A41705J347J134R65Q94R45J066J095Q65M39J10J04L41N98P81Q75P26J74
55658A54164n96j141j303j421j814k283k431k273k214k458k774k884k785k589
$$ plain form
55644 125198 122867 120788 118747 116465 113925 111441 109298 107500 105939 104627 103616 102795 101963 101047 100133
55629 100133 99285 98473 97613 96561 95148 93385 91653 90476 90040 90045 90086 90051 90100 90387 90869 91285 91275 90633 89531
55610 89531 88420 87629 87190 87078 87335 87839 88140 87859 87161 86542 86174 85728 84911 83901 83132 82835 82918 83128 83179
55591 83179 82860 82247 81721 81622 81859 82024 81871 81546 81310 81239 81276 81454 81831 82295 82618 82778 83030 83535 84088 84374
55571 84374 84410 84521 84918 85530 86234 86970 87635 88127 88590 89324 90305 91153 91733 92481 93723 94984 95455 95050 94516
55552 94516 94474 94831 95240 95649 96140 96565 96695 96564 96412 96372 96445 96641 96962 97279 97382 97184 96779 96350 96036 95800
55532 95800 95386 94498 93086 91371 89594 87882 86397 85351 84739 84205 83352 82117 80750 79511 78485 77595
55516 77595 76673 75617 74587 73936 73881 74267 74720 74921 74734 74256 73793 73600 73563 73331 72888 72695 73103 73870 74530
$$ packed form
55644A25198k331k079k041k282k540k484k143j798j561j312j011q21q32r16r14
55629A00133q48q12q60j052j413j763j732j177m36NM1l5M9K87M82M16j0o42j102
55610H9531j111p91m39j12K57N04L01k81o98o19l68m46q17j010p69k97Q3K10N1
55591H3179l19o13n26r9K37J65j53l25k36p1L7J78L77M64L23J60K52N05N53K86
55571H4374L6J11L97O12P04P36O65M92M63P34R81Q48N80P48J242J261M71m05n34
55552I4516m2L57M09M09M91M25J30j31j52m0P3J96L21L17J03j98m05m29l14k36
55532I5800m14q88j412j715j777j712j485j046o12n34q53j235j367j239j026q90
55516G7595r22j056j030o51n5L86M53K01j87m78m63j93l7k32m43j93M08P67O60
$$ plain form
55497 74530 75013 75530 76014 76074 75560 74799 74200 73861 73676 73592 73615 73683 73714 73716 73786 73962 74092 73928 73394 72782 72485 72516
55475 72516 72480 72124 71706 71614 71843 72116 72360 72748 73311 73845 74201 74375 74348 74085 73757 73606 73576 73338 72762 72069
55455 72069 71479 71011 70733 70842 71280 71594 71459 71119 71051 71331 71633 71704 71558 71290 71006 70870 70975 71138 71048 70664
55435 70664 70286 70186 70360 70659 70994 71326 71583 71686 71640 71608 71874 72657 73854 75060 75980 76733 77578 78470 79118
55416 79118 79468 79826 80391 80973 81313 81502 81792 82179 82430 82508 82679 83153 83743 84011 83664 82778 81693 80740 79985
55397 79985 79210 78161 76826 75422 74166 73133 72348 71867 71679 71653 71632 71529 71310 70984 70705 70732 71126 71520
55379 71520 71425 70805 70203 70199 70822 71580 71981 71911 71554 71110 70730 70613 70935 71569 72020 71857 71208 70630 70457 70469 70329
55358 70329 70072 69965 70048 70130 70182 70375 70692 70825 70611 70298 70203 70300 70347 70246 70053 69759 69315 68886 68813 69271 70049
$$ packed form
55497G4530M83N17M84O0n14p61n99l39j85q4K3O8L1KP0J76J30j64n34o12k97L1
55475G2516l6l56m18r2K29K73K44L88N63N34L56J74k7k63l28j51l0k38n76o93
55455G2069n90m68k78J09M38L14j35l40o8K80L02P1j46k68k84j36J05J63r0l84
55435G0664l78j00J74K99L35L32K57J03m6l2K66P83J197J206R20P53Q45Q92O48
55416G9118L50L58N65N82L40J89K90L87K51P8J71M74N90K68l47q86j085r53p55
55397G9985p75j049j335j404j256j033p85m81j88k6k1j03k19l26k79K7L94L94
55379G1520r5o20o02mO23P58M01p0l57m44l80j17L22O34M51j63o49n78j73J2j40
55358G0329k57j07Q3Q2N2J93L17J33k14l13r5R7M7j01j93k94m44m29p3M58P78
$$ plain form
55337 70049 70758 71174 71356 71485 71640 71725 71643 71486 71453 71573 71648 71505 71214 70976 70901 70966 71063 71015 70680 70149 69737 69659
55315 69659 69853 70209 70750 71422 71890 71866 71523 71315 71380 71447 71311 71134 71193 71565 72114 72614 72792 72477 71807 71187
55295 71187 70904 70888 70901 70834 70766 70795 70938 71131 71302 71454 71649 71862 71975 71974 72043 72288 72499 72438 72240 72238 72423 72462 72257
55272 72257 72133 72348 72737 73005 73076 72961 72611 72121 71814 71879 72104 72239 72378 72701 73038 73015 72591 72112 71913 72087
55252 72087 72563 73119 73415 73325 73190 73435 73970 74311 74263 74110 74077 74045 73918 73894 74083 74181 73840 73183 72657 72473 72518
55231 72518 72722 73181 73866 74515 74927 75227 75660 76221 76609 76542 76035 75360 74827 74633 74829 75324 75838 76005 75685
55212 75685 75176 74983 75332 76002 76636 77112 77535 77999 78480 78889 79149 79247 79246 79178 78904 78225 77274 76623 76765 77527
55192 77527 78205 78326 78069 77938 78206 78755 79260 79388 79004 78396 78128 78445 78901 78848 78233 77626 77426 77399 77178 76932
$$ packed form
55337G0049P09M16J82J29J55Q5q2j57l3J20P5j43k91k38p5O5R7m8l35n31m12p8
55315F9659J94L56N41O72M68k4l43k08O5O7j36j77N9L72N49N00J78l15o70o20
55295G1187k83j6J3o7o8K9J43J93J71J52J95K13J13jO9K45K11o1j98kJ85L9k05
55272G2257j24K15L89K68P1j15l50m90l07O5K25J35J39L23L37k3m24m79j99J74
55252G2087M76N56K96r0j35K45N35L41m8j53l3l2j27k4J89R8l41o57n26j84M5
55231G2518K04M59O85O49M12L00M33N61L88o7n07o75n33j94J96M95N14J67l20
55212G5685n09j93L49O70O34M76M23M64M81M09K60R8jo8k74o79r51o51J42P62
55192G7527O78J21k57j31K68N49N05J28l84o08k68L17M56n3o15o07k00k7k21k46
$$ plain form
55172 76932 77165 77963 78801 79151 79036 78858 78881 79086 79396 79831 80404 80994 81454 81791 82181 82753 83403 83825 83762 83222
55152 83222 82459 81753 81217 80778 80294 79682 78994 78365 77907 77634 77471 77347 77222 77062 76810 76439 76043 75829 75935
55133 75935 76233 76367 76121 75699 75564 75936 76554 76966 76972 76743 76604 76801 77383 78154 78782 79066 79103 79120 79204 79295 79353
55112 79353 79410 79473 79544 79732 80159 80730 81161 81316 81417 81829 82717 83912 85039 85747 85926 85763 85540 85372 85245
55093 85245 85219 85418 85822 86284 86790 87471 88259 88773 88703 88169 87550 87125 87008 87221 87619 87863 87731 87389 87162 87112
55073 87112 87026 86739 86277 85723 85174 84807 84784 85052 85406 85693 85835 85766 85537 85393 85471 85489 85013 84018 82885 81822
55053 81822 80709 79592 78945 79155 79995 80889 81523 81959 82308 82584 82811 83050 83294 83467 83520 83436 83238 83076 83183
55034 83183 83609 84110 84459 84734 85106 85457 85486 85122 84600 84126 83728 83442 83409 83689 84165 84692 85183 85519 85555 85336
$$ packed form
55172G6932K33P98Q38L50j15j78K3K05L10M35N73N90M60L37L90N72O50M22o3n40
55152H3222p63p06n36m39m84o12o88o29m58k73j63j24j25j60k52l71l96k14J06
55133G5935K98J34k46m22j35L72O18M12Ok29j39J97N82P71O28K84L7J7Q4R1N8
55112G9353N7O3P1J88M27N71M31J55J01M12Q88J195J127P08J79j63k23j68j27
55093H5245k6J99M04M62N06O81P88N14p0n34o19m25j17K13L98K44j32l42k27n0
55073H7112q6k87m62n54n49l67k3K68L54K87J42o9k29j44P8J8m76r95j133j063
55053H1822j113j117o47K10Q40Q94O34M36L49K76K27K39K44J73N3q4j98j62J07
55034H3183M26N01L49K75L72L51K9l64n22m74l98k86l3K80M76N27M91L36L6k19
$$ plain form
55014 85336 85124 85151 85422 85815 86207 86430 86330 85969 85644 85569 85678 85870 86266 87007 87905 88582 88951 89342 90040 90907
54994 90907 91566 91853 91976 92189 92438 92386 91829 90993 90348 90118 90159 90321 90689 91324 91953 92211 92139 92119 92312 92465
54974 92465 92379 92290 92547 93089 93501 93526 93294 93090 93069 93229 93503 93836 94221 94708 95318 95987 96645 97321 98074 98873
54954 98873 99657 100476 101469 102663 103896 104953 105707 106189 106639 107458 108899 110761 112550 114038 115527 117486
54938 117486 120101 123305 127071 131466 136468 141897 147489 152908 157785 161927 165457 168564 171158 173001
54924 173001 174099 174714 174936 174529 173304 171338 168698 165241 160965 156384 152173 148524 145109 141628 138116
54909 138116 134719 131486 128453 125696 123201 120896 118905 117537 116906 116740 116733 116918 117557 118811 120713 123334
54893 123334 126752 130899 135570 140538 145563 150409 154988 159384 163576 167246 170064 172054 173437 174190
$$ packed form
55014H5336k12K7K71L93L92K23j00l61l25p5J09J92L96P41Q98O77L69L91O98Q67
54994I0907O59K87J23K13K49n2n57q36o45k30M1J62L68O35O29K58p2k0J93J53
54974I2465q6q9K57N42M12K5k32k04k1J60K74L33L85M87O10O69O58O76P53P99
54954I8873P84Q19R93J194J233J057P54M82M50Q19J441J862J789J488J489J959
54938A17486K615L204L766M395N002N429N592N419M877M142L530L107K594J843
54924A73001J098O15K22m07j225j966k640l457m276m581m211l649l415l481l512
54909A38116l397l233l033k757k495k305j991j368o31j66pJ85O39J254J902K621
54893A23334L418M147M671M968N025M846M579M396M192L670K818J990J383P53
$$ plain form
54879 174190 174087 173135 171663 169887 167657 164726 161054 156723 151831 146601 141394 136447 131750 127324 123439
54864 123439 120319 117801 115500 113240 111091 109053 106993 104872 102836 101020 99468 98289 97714 97817 98252
54849 98252 98430 98016 97224 96576 96377 96415 96238 95670 95001 94688 94950 95608 96192 96205 95508 94532 93953 94017 94328 94415
54829 94415 94305 94356 94693 95060 95211 95176 95111 95057 94895 94472 93761 93022 92688 92991 93753 94658 95629 96734 97906 99007
54809 99007 100098 101293 102351 102794 102535 102083 101954 102130 102295 102345 102412 102547 102686 102885 103360 104218 105323 106429
54791 106429 107437 108467 109736 111339 113142 114953 116792 118933 121626 124902 128682 132949 137690 142711
54777 142711 147643 152185 156288 160113 163791 167220 170115 172293 173858 175051 175951 176384 176086 174872 172746
54762 172746 169945 166826 163543 159932 155846 151521 147361 143468 139651 135895 132520 129846 127964 126868
$$ packed form
54879A74190j03r52j472j776k230k931l672m331m892n230n207m947m697m426l885
54864A23439l120k518k301k260k149k038k060k121k036j816j552j179n75J03M35
54849I8252J78m14p92o48j99L8j77n68o69l13K62O58N84J3o97r76n79O4L11Q7
54829I4415j10N1L37L67J51l5o5n4j62m23p11p39l34L03P62R05R71J105J172J101
54809I9007J091J195J058M43k59m52j29J76J65N0O7J35J39J99M75Q58J105J106
54791A06429J008J030J269J603J803J811J839K141K693L276L780M267M741N021
54777A42711M932M542M103L825L678L429K895K178J565J193R00M33k98j214k126
54762A72746k801l119l283l611m086m325m160l893l817l756l375k674j882j096
$$ plain form
54748 126868 126484 126495 126481 126384 126554 127202 128148 129292 130959 133495 136764 140375 144190 148264 152484 156590 160443
54731 160443 163944 166854 169035 170740 172277 173472 173811 173100 171602 169580 167070 164130 160887 157262 153015
54716 153015 148266 143593 139422 135594 131757 127928 124415 121343 118580 116057 113916 112246 110869 109466
54702 109466 107895 106360 105232 104680 104493 104318 103991 103552 103021 102367 101687 101182 100889 100600 100183 99827 99819 100155
54684 100155 100473 100393 99859 99219 98990 99458 100430 101361 101790 101658 101251 100880 100649 100444 100147 99864 99880 100358 101155
54665 101155 101984 102675 103149 103250 102836 102006 101055 100190 99441 98853 98572 98674 99055 99528 99936 100131 100058 99885 99916
54646 99916 100273 100778 101188 101378 101270 100805 100095 99480 99266 99494 100009 100655 101294 101759 101918 101752 101340 100849 100513
54627 100513 100462 100500 100267 99738 99349 99480 99953 100280 100275 100191 100283 100511 100700 100790 100836 100895 101006 101202 101500 101891 102329 102670
$$ packed form
54748A26868l84J1j4r7J70O48R46J144J667K536L269L611L815M074M220M106L853
54731A60443L501K910K181J705J537J195L39p11j498k022k510k940l243l625m247
54716A53015m749m673m171l828l837l829l513l072k763k523k141j670j377j403
54702A09466j571j535j128n52j87j75l27m39n31o54o80n05k93k89m17l56qL36
54684A00155L18q0n34o40k29M68R72R31M29j32m07l71k31k05k97k83J6M78P97
54665A01155Q29O91M74J01m14q30r51q65p49n88k81J02L81M73M08J95p3j73L1
54646I9916L57N05M10J90j08m65p10o15k14K28N15O46O39M65J59j66m12m91l36
54627A00513n1L8k33n29l89J31M73L27nq4R2K28J89R0M6N9J11J96K98L91M38L41
$$ plain form
54605 102670 102683 102279 101715 101418 101551 101902 102243 102598 103057 103479 103678 103780 104104 104617 104840 104499 104022 104071 104684
54586 104684 105228 105212 104823 104528 104433 104276 103860 103263 102698 102344 102260 102313 102305 102257 102448 102975 103474 103542 103327 103366 103866 104427
54564 104427 104570 104273 103903 103813 104109 104679 105307 105847 106286 106597 106612 106221 105600 105046 104615 104187 103841 103811 104070 104288
54544 104288 104361 104635 105400 106433 107244 107603 107638 107575 107637 108029 108814 109830 110846 111712 112330 112672 112930 113408 114117
54525 114117 114636 114553 113934 113201 112754 112831 113487 114457 115210 115431 115359 115396 115576 115664 115638 115664 115664 115312 114530 113684 113151 112942
54503 112942 112862 112848 112944 113096 113095 112747 112040 111201 110576 110414 110690 111182 111700 112182 112661 113207 113893 114694 115453 115966
54483 115966 116140 116027 115787 115638 115750 116108 116550 116958 117369 117845 118382 118986 119670 120305 120672 120752 120804 121028 121332
54464 121332 121602 121941 122452 122932 123120 123078 123080 123189 123211 123003 122586 122025 121440 121031 120848 120638 120182 119712 119678 120130
$$ packed form
54605A02670J3m04n64k97J33L51L41L55M59M22J99J02L24N13K23l41m77M9O13
54586A04684N44j6l89k95r5j57m16n97n65l54q4N3qm8J91N27M99O8k15L9N00N61
54564A04427J43k97l70r0K96N70O28N40M39L11J5l91o21n54m31m28l46l0K59K18
54544A04288P3K74P65J033Q11L59L5o3O2L92P85J016J016Q66O18L42K58M78P09
54525A14117N19q3o19p33m47P7O56R70P53K21p2L7J80Q8k6K6%l52p82q46n33k09
54503A12942q0j4R6J52jl48p07q39o25j62K76M92N18M82M79N46O86Q01P59N13
54483A15966J74j13k40j49J12L58M42M08M11M76N37O04O84O35L67Q0N2K24L04
54464A21332K70L39N11M80J88m2KJ09K2k08m17n61n85m09j83k10m56m70l4M52
$$ plain form
54444 120130 120681 121025 121154 121093 120818 120478 120313 120214 119744 118751 117628 116806 116294 115949 115854 116126 116587 116950 117213
54425 117213 117604 118211 118925 119641 120324 120882 121200 121315 121403 121586 121796 121853 121628 121172 120702 120425 120333 120265 120112 119849
54405 119849 119433 118865 118388 118348 118775 119339 119790 120192 120585 120760 120663 120738 121486 122743 123780 124123 123975 123807 123835
54386 123835 124007 124248 124533 124790 124922 124902 124818 124803 124921 125058 124956 124447 123693 123059 122742 122588 122319 121844 121284 120773
54366 120773 120357 120077 120023 120268 120759 121376 122034 122698 123308 123777 124102 124366 124606 124786 124935 125175 125505 125699 125624
54347 125624 125504 125657 126017 126165 125871 125348 124912 124654 124491 124330 124060 123597 123106 122948 123274 123814 124261 124613 124957
54328 124957 125089 124736 124051 123563 123587 123952 124378 124851 125508 126278 126803 126719 125971 124904 124016 123558 123392 123266 123121
54309 123121 123011 122841 122438 121864 121421 121288 121331 121327 121218 121052 120901 120963 121522 122624 123894 124876 125450 125752 125797 125520
$$ packed form
54444A20130N51L44J29o1k75l40j65r9m70r93j123q22n12l45r5K72M61L63K63
54425A17213L91O07P14P16O83N58L18J15Q8J83K10N7k25m56m70k77r2o8j53k63
54405A19849m16n68m77m0M27N64M51M02L93J75r7P5P48J257J037L43j48j68K8
54386A23835J72K41K85K57J32k0q4j5J18J37j02n09p54o34l17j54k69m75n60n11
54366A20773m16k80n4K45M91O17O58O64O10M69L25K64K40J80J49K40L30J94p5
54347A25624j20J53L60J48k94n23m36k58j63j61k70m63m91j58L26N40M47L52L44
54328A24957J32l53o85m88K4L65M26M73O57P70N25q4p48j067q88m58j66j26j45
54309A23121j10j70m03n74m43j33M3mj09j66j51O2N59J102J270R82N74L02M5k77
$$ plain form
54289 125520 125136 125120 125647 126347 126758 126812 126705 126501 126207 126051 126314 126882 127325 127456 127500 127646 127806 127971 128385 129092
54269 129092 129619 129538 129129 129050 129455 129835 129692 128961 127839 126633 125826 125797 126296 126595 126349 125960 125861 125893 125690 125378
54249 125378 125417 125953 126658 127109 127035 126329 125211 124260 123929 124031 124023 123716 123372 123127 122763 122162 121590 121324 121250 121073
54229 121073 120760 120567 120731 121252 121932 122546 123031 123555 124276 125051 125541 125651 125619 125601 125418 124876 124154 123610 123309
54210 123309 123022 122630 122273 122093 122030 121964 121870 121736 121466 121009 120509 120169 120002 119808 119445 119033 118866 119145 119816 120620
54190 120620 121279 121658 121780 121709 121458 121028 120505 120017 119608 119251 118992 118929 119006 118985 118761 118557 118608 118797 118832 118694 118610
54169 118610 118579 118309 117721 117186 117023 117067 116992 116860 117010 117510 118053 118376 118516 118623 118711 118688 118435 117898 117209 116680
54149 116680 116523 116590 116554 116325 116095 116047 116261 116812 117707 118652 119254 119500 119761 120186 120456 120320 120054 120087 120395 120636
$$ packed form
54289A25520l84j6N27P00M11N4j07k04k94j56K63N68M43J31M4J46J60J65M14P07
54269A29092N27q1m09p9M05L80j43p31j122j206q07k9M99K99k46l89r9L2k03l12
54249A25378L9N36P05M51p4p06j118r51l31J02ql07l44k45l64o01n72k66p4j77
54229A21073l13j93J64N21O80O14M85N24P21P75M90J10l2j8j83n42p22n44l01
54210A23309k87l92l57j80o3o6r4j34k70m57n00l40j67j94l63m12j67K79O71Q04
54190A20620O59L79J22p1k51m30n23m88m09l57k59o3P7k1k24k04N1J89L5j38q4
54169A18610l1k70n88n35j63M4p5j32J50N00N43L23J40J07Q8k3k53n37o89n29
54149A16680j57O7l6k29k30m8K14N51Q95R45O02K46K61M25K70j36k66L3L08K41
$$ plain form
54129 120636 120753 121050 121704 122524 123299 124053 124852 125584 126100 126409 126602 126711 126839 127249 128158 129477 130962 132548
54111 132548 134305 136070 137402 138033 138160 138107 137875 137272 136386 135604 135138 134801 134380 134000 133917 134101 134230 134046
54093 134046 133599 133138 132877 132825 132764 132441 131847 131231 130786 130438 130045 129673 129472 129404 129290 129067 128813 128506 128036 127451
54073 127451 126967 126702 126554 126409 126290 126232 126192 126175 126314 126730 127418 128291 129204 129915 130227 130236 130285 130566 130947 131262 131583
54052 131583 132067 132712 133418 134143 134837 135387 135812 136353 137169 138060 138772 139476 140681 142639 145079 147509 149576
54035 149576 151157 152371 153584 155176 157158 159164 160907 162502 164212 166054 167839 169482 171069 172643
54021 172643 174108 175417 176724 178205 179738 180854 181083 180386 179237 178271 177812 177735 177667 177289 176456 175171 173526
54004 173526 171662 169757 168011 166574 165410 164294 163018 161604 160227 158973 157749 156456 155116 153799
$$ packed form
54129A20636J17K97O54Q20P75P54P99P32N16L09J93J09J28M10R09J319J485J586
54111A32548J757J765J332O31J27n3k32o03q86p82m66l37m21l80q3J84J29j84
54093A34046m47m61k61n2o1l23n94o16m45l48l93l72k01o8j14k23k54l07m70n85
54073A27451m84k65j48j45j19n8m0j7J39M16O88Q73R13P11L12RM9K81L81L15L21
54052A31583M84O45P06P25O94N50M25N41Q16Q91P12P04J205J958K440K430K067
54035A49576J581J214J213J592J982K006J743J595J710J842J785J643J587J574
54021A72643J465J309J307J481J533J116K29o97j149r66m59p7o8l78q33j285j645
54004A73526j864j905j746j437j164j116j276j414j377j254j224j293j340j317
$$ plain form
53990 153799 152546 151442 150610 150046 149559 149020 148588 148534 148859 149230 149356 149313 149448 150008 150861 151540 151607 151069 150415
53971 150415 150166 150377 150751 151159 151812 152848 154028 155061 156083 157544 159683 162338 165270 168468 172103
53956 172103 176408 181675 188227 196251 205743 216550 228349 240507 252183 262713 271822 279447 285544
53943 285544 290259 294089 297640 301129 304243 306453 307349 306711 304414 300425 294896 288245 281062 273812 266634
53928 266634 259509 252613 246352 241005 236508 232672 229382 226473 223635 220740 218103 216159 214954 214196
53914 214196 213746 213736 214205 214937 215726 216518 217280 217966 218725 219845 221344 222799 223766 224216 224420 224577 224721 224856
53896 224856 224983 225005 224711 223847 222221 219873 217204 214714 212528 210364 208040 205790 203884 202170 200251
53881 200251 197954 195360 192493 189315 186007 182953 180364 178148 176187 174506 173077 171659 170029 168285
$$ packed form
53990A53799j253j104q32n64m87n39m32n4L25L71J26m3J35N60Q53O79O7n38o54
53971A50415k49K11L74M08O53J036J180J033J022J461K139K655K932L198L635
53956A72103M305N267O552Q024R492J0807J1799J2158J1676J0530R109P625O097
53943B85544M715L830L551L489L114K210Q96o38k297l989n529o651p183p250p178
53928B66634p125o896o261n347m497l836l290k909k838k895k637j944j205p58
53914B14196m50j0M69P32P89P92P62O86P59J120J499J455R67M50K04J57J44J35
53896B24856J27K2k94q64j626k348k669k490k186k164k324k250j906j714j919
53881B00251k297k594k867l178l308l054k589k216j961j681j429j418j630j744
$$ plain form
53867 168285 166774 165722 164998 164264 163311 162224 161200 160287 159363 158349 157313 156311 155302 154288 153426 152862
53851 152862 152551 152359 152189 151928 151424 150717 150118 149844 149726 149556 149563 150126 151064 151673 151588 151208 151091 151271 151467 151664
53831 151664 152121 152928 153879 154733 155382 155791 155985 156083 156143 156025 155578 154949 154513 154506 154881 155481 156146 156667 156897 156994
53811 156994 157342 158061 158814 159248 159493 159995 160956 162179 163427 164680 165988 167288 168535 169859 171424 173213
53795 173213 175089 177010 179036 181146 183252 185359 187558 189760 191658 193082 194256 195532 196960 198292
53781 198292 199355 200215 200945 201463 201658 201577 201354 201081 200777 200425 199941 199232 198426 197987 198472 200129 202779 206063
53763 206063 209803 214190 219686 226672 235064 244216 253229 261340 268079 273210 276707 278773 279714 279733 278878
53748 278878 277236 275029 272428 269269 265055 259342 252183 244199 236131 228309 220621 213030 205956 199959
$$ packed form
53867A68285j511j052p24p34r53j087j024r13r24j014j036j002j009j014q62n64
53851A52862l11j92j70k61n04p07n99k74j18j70PN63R38O09q5l80j17J80J96J97
53831A51664M57Q07R51Q54O49M09J94R8O0j18m47o29m36pL75O00O65N21K30R7
53811A56994L48P19P53M34K45N02R61J223J248J253J308J300J247J324J565J789
53795A73213J876J921K026K110K106K107K199K202J898J424J174J276J428J332
53781A98292J063Q60P30N18J95q1k23k73l04l52m84p09q06m39M85J657K650L284
53763B06063L740M387N496O986Q392R152R013Q111O739N131L497K066R41J9q55
53748B78878j642k207k601l159m214n713p159p984q068p822p688p591p074n997
$$ plain form
53734 199959 195110 190904 186846 182962 179637 177121 175335 174055 173110 172450 172116 172104 172203 172111 171819 171786 172460
53717 172460 173706 174921 175718 176236 176753 177364 178157 179420 181331 183609 185745 187588 189477 191813 194687
53702 194687 197900 201176 204315 207320 210417 213802 217363 220769 223831 226615 229146 231255 232813 234008
53688 234008 235185 236470 237676 238534 238973 239120 239077 238703 237715 236079 234189 232505 231081 229660 228184 226889
53672 226889 225834 224697 223276 221864 220826 220011 218987 217744 216722 216128 215621 214837 213899 213167 212746 212432
53656 212432 212076 211700 211320 210851 210226 209517 208874 208355 207831 207062 205933 204624 203500 202828 202643 202865 203404 204100
53638 204100 204709 205036 205025 204669 203972 203115 202493 202411 202776 203265 203726 204260 204896 205437 205733 205950 206404 207244 208420
53619 208420 209884 211659 213724 215944 218158 220217 221971 223370 224619 226060 227780 229464 230822 232066
$$ packed form
53734A99959m849m206m058l884l325k516j786j280r45o60l34j2R9r2k92l3O74
53717A72460J246J215P97N18N17O11P93J263J911K278K136J843J889K336K874
53702A94687L213L276L139L005L097L385L561L406L062K784K531K109J558J195
53688B34008J177J285J206Q58M39J47m3l74r88j636j890j684j424j421j476j295
53672B26889j055j137j421j412j038q15j024j243j022n94n07p84r38p32m21l14
53656B12432l56l76l80m69o25p09o43n19n24p69j129j309j124o72j85K22N39O96
53638B04100O09L27j1l56o97q57o22q2L65M89M61N34O36N41K96K17M54Q40J176
53619B08420J464J775K065K220K214K059J754J399J249J441J720J684J358J244
$$ plain form
53605 232066 233743 236039 238471 240384 241635 242626 243787 245190 246672 248154 249736 251555 253671 256043
53591 256043 258526 260842 262667 263850 264533 264994 265351 265518 265475 265427 265568 265767 265730 265416 265089 264901 264642 264034
53573 264034 263080 261990 260902 259856 258894 258008 257059 255958 254878 254063 253492 252919 252226 251533 250933 250386 249873
53556 249873 249461 249073 248441 247429 246268 245348 244864 244794 245053 245492 245872 246061 246264 246867 248015 249460 250850
53539 250850 252060 253208 254410 255618 256743 257913 259520 261911 265003 268323 271459 274397 277394 280657
53525 280657 284312 288530 293472 299038 304867 310665 316477 322569 329136 336210 343795 351965 360807 370311
53511 370311 380392 390941 401790 412694 423480 434297 445579 457603 470155 482755 495216
53500 495216 507847 521072 534942 549063 562919 576236 589199 602374 616284 630920 645718
$$ packed form
53605B32066J677K296K432J913J251R91J161J403J482J482J582J819K116K372
53591B56043K483K316J825J183O83M61L57J67m3m8J41J99l7l14l27j88k59o08
53573B64034r54j090j088j046r62q86r49j101j080q15n71n73o93o93o00n47n13
53556B49873m12l88o32j012j161r20m84p0K59M39L80J89K03O03J148J445J390
53539B50850J210J148J202J208J125J170J607K391L092L320L136K938K997L263
53525B80657L655M218M942N566N829N798N812O092O567P074P585Q170Q842R504
53511C70311J0081J0549J0849J0904J0786J0817J1282J2024J2552J2600J2461
53500D95216J2631J3225J3870J4121J3856J3317J2963J3175J3910J4636J4798
$$ plain form
53489 645718 660112 674075 688058 702472 717336 732379 747283 761856 776054 789931 803541
53478 803541 816940 830248 843612 856955 869847 881782 892592 902493 911738 920372 928268 935215
53466 935215 940943 945216 948058 949760 950579 950476 949239 946763 943099 938302 932434 925718 918518 911051 903188
53451 903188 894634 885279 875299 864918 854162 842904 831104 818920 806571 794131 781534 768762
53439 768762 755964 743378 731160 719382 708145 697604 687843 678823 670542 663144 656723 651048 645743
53426 645743 640814 636805 634197 632806 632014 631589 631971 633670 636643 640456 644903 650215 656714 664455 673202
53411 673202 682642 692604 703201 714740 727398 740990 755170 769850 785295 801794 819413 838092
53399 838092 857811 878550 900211 922738 946260 970972 996881 1023796 1051583 1080346 1110299
$$ packed form
53489F45718J4394J3963J3983J4414J4864J5043J4904J4573J4198J3877J3610
53478H03541J3399J3308J3364J3343J2892J1935J0810R901R245Q634P896O947
53466I35215N728M273K842J702Q19j03j237k476l664m797n868o716p200p467p863
53451I03188q554r355r980j0381j0756j1258j1800j2184j2349j2440j2597j2772
53439G68762j2798j2586j2218j1778j1237j0541r761r020q281p398o421n675n305
53426F45743m929m009k608j391p92m25L82J699K973L813M447N312O499P741Q747
53411F73202R440R962J0597J1539J2658J3592J4180J4680J5445J6499J7619J8679
53399H38092J9719K0739K1661K2527K3522K4712K5909K6915K7787K8763K9953
$$ plain form
53388 1110299 1141538 1173916 1207110 1240740 1274452 1307976 1341157 1373929 1406252 1438040 1469152
53377 1469152 1499467 1528953 1557589 1585255 1611763 1637040 1661146 1684002 1705179 1724138 1740718
53366 1740718 1755153 1767525 1777356 1783979 1787204 1787400 1784897 1779612 1771370 1760315 1746720 1730530 1711430
53353 1711430 1689404 1664956 1638672 1610814 1581467 1550879 1519413 1487289 1454627 1421671 1388711
53342 1388711 1355780 1322689 1289494 1256702 1224877 1194146 1164231 1134825 1105795 1077131 1048960
53331 1048960 1021625 995532 970802 947210 924557 902982 882782 864022 846503 830067 814800
53320 814800 800892 788395 777155 766858 757126 747697 738606 730142 722528 715697 709439 703705 698624
53307 698624 694257 690521 687385 685011 683566 682983 683043 683739 685404 688404 692741 698036 703918 710357 717581
$$ packed form
53388A110299L1239L2378L3194L3630L3712L3524L3181L2772L2323L1788L1112
53377A469152L0315K9486K8636K7666K6508K5277K4106K2856K1177J8959J6580
53366A740718J4435J2372R831O623L225J96k503n285q242j1055j3595j6190j9100
53353A711430k2026k4448k6284k7858k9347l0588l1466l2124l2662l2956l2960
53342A388711l2931l3091l3195l2792l1825l0731k9915k9406k9030k8664k8171
53331A048960k7335k6093k4730k3592k2653k1575k0200j8760j7519j6436j5267
53320H14800j3908j2497j1240j0297r732r429r091q464p614o831o258n734n081
53307F98624m367l736l136k374j445n83O0O96J665L000M337N295N882O439P224
$$ plain form
53292 717581 725799 735082 745447 756857 769082 781743 794581 807619 820967 834590 848404 862469
53280 862469 876868 891408 905658 919302 932306 944733 956603 967943 978760 988829 997746 1005320
53268 1005320 1011728 1017080 1021069 1023303 1023894 1023363 1021919 1019093 1014222 1007152 998384 988599 978097 966656
53254 966656 953877 939709 924564 908864 892584 875404 857295 838764 820446 802647 785280
53243 785280 768066 750685 732928 714893 696972 679493 662428 645545 628759 612206 596019
53232 596019 580208 564763 549736 535204 521241 507900 495144 482818 470775 459090 447988
53221 447988 437548 427577 417865 408487 399720 391718 384320 377185 370056 362914 355901 349123 342527 336020
53207 336020 329672 323685 318084 312571 306815 300898 295297 290380 286049 281902 277621 273137 268570 264145
$$ packed form
53292G17581Q218R283J0365J1410J2225J2661J2838J3038J3348J3623J3814J4065
53280H62469J4399J4540J4250J3644J3004J2427J1870J1340J0817J0069Q917P574
53268A005320O408N352L989K234N91n31j444k826m871p070q768r785j0502j1441
53254I66656j2779j4168j5145j5700j6280j7180j8109j8531j8318j7799j7367
53243G85280j7214j7381j7757j8035j7921j7479j7065j6883j6786j6553j6187
53232E96019j5811j5445j5027j4532j3963j3341j2756j2326j2043j1685j1102
53221D47988j0440r971r712r378q767q002p398p135p129p142p013o778o596o507
53207C36020o348n987n601n513n756n917n601m917m331m147m281m484m567m425
$$ plain form
53193 264145 260068 256301 252513 248430 244215 240355 237108 234241 231372 228415 225624 223336 221746 220777
53179 220777 220054 219104 217760 216297 215053 214022 212988 211931 211048 210411 209876 209401 209163 209226 209288 208986 208307
53162 208307 207520 206818 206250 205917 205939 206168 206176 205704 204962 204355 204001 203684 203243 202800 202587 202678 202963 203274 203436 203341
53142 203341 203106 203088 203585 204480 205321 205814 206111 206567 207313 208151 208794 209088 209055 208867 208780 208975 209436 209992 210478 210795
53122 210795 210858 210605 210108 209574 209220 209126 209215 209343 209445 209627 210037 210569 210784 210312 209277 208146 207141 206034
53104 206034 204608 203045 201701 200632 199620 198559 197586 196803 196117 195422 194742 194128 193515 192820 192058 191283 190470
53087 190470 189554 188551 187549 186637 185897 185424 185227 185166 185073 184970 185043 185357 185699 185760 185430 184848 184204 183571 182959
53068 182959 182459 182271 182551 183185 183761 183861 183443 182911 182714 182918 183236 183433 183578 183877 184391 184987 185466 185681 185623
$$ packed form
53193B64145m077l767l788m083m215l860l247k867k869k957k791k288j590r69
53179B20777p23r50j344j463j244j031j034j057q83o37n35m75k38O3O2l02o79
53162B08307p87p02n68l33K2K29Qm72p42o07l54l17m41m43k13R1K85L11J62r5
53142B03341k35j8M97Q95Q41M93K97M56P46Q38O43K94l3j88q7J95M61N56M86L17
53122B10795O3k53m97n34l54r4Q9J28J02J82M10N32K15m72j035j131j005j107
53104B06034j426j563j344j069j012j061r73p83o86o95o80o14o13o95p62p75q13
53087A90470r16j003j002r12p40m73j97o1r3j03P3L14L42O1l30n82o44o33o12
53068A82959n00j88K80O34N76J00m18n32j97K04L18J97J45K99N14N96M79K15n8
$$ plain form
53049 185623 185497 185632 186187 186964 187641 188109 188469 188732 188758 188498 188151 188026 188338 189106 190087 190789 190838 190475 190448 191219
53029 191219 192399 193206 193313 193040 192839 192963 193558 194634 195791 196342 195993 195223 194796 194992 195534 196078 196510 196830
53011 196830 197051 197233 197449 197679 197883 198135 198507 198863 199014 199093 199483 200259 201014 201372 201468 201656 201979 202215 202332
52992 202332 202547 202924 203247 203380 203480 203701 203915 203931 203827 203867 204152 204555 204949 205318 205663 205982 206395 207104 208174
52973 208174 209424 210647 211803 212908 213813 214288 214330 214229 214257 214419 214596 214790 215062 215278 215200 214854 214645 214916
52955 214916 215536 216047 216125 215765 215111 214308 213532 212936 212496 212030 211435 210794 210220 209692 209113 208437 207667 206817 205943
52936 205943 205178 204672 204534 204796 205332 205793 205815 205409 205009 205012 205359 205655 205611 205244 204718 204189 203778 203561 203514 203538 203539
52915 203539 203481 203388 203340 203375 203389 203214 202857 202530 202371 202308 202325 202623 203256 203755 203529 202649 201898 201910 202493 202987 203062 202933
$$ packed form
53049A85623j26J35N55P77O77M68L60K63K6k60l47j25L12P68R81P02M9l63k7P71
53029A91219J180Q07J07k73k01J24N95J076J157N51l49p70m27J96N42N44M32L20
53011A96830K21J82K16K30K04K52L72L56J51P9L90P76P55L58R6J88L23K36J17
52992B02332K15L77L23J33J00K21K14J6j04M0K85M03L94L69L45L19M13P09J070
52973B08174J250J223J156J105R05M75M2j01K8J62J77J94K72K16p8l46k09K71
52955B14916O20N11P8l60o54q03p76n96m40m66n95o41n74n28n79o76p70q50q74
52936B05943p65n06j38K62N36M61K2m06m00LL47K96m4l67n26n29m11k17m7K4J
52915B03539n8r3m8L5J4j75l57l27j59o3J7K98O33M99k26q80p51J2N83M94P5j29
$$ plain form
52893 202933 202897 202958 202950 202829 202717 202665 202515 202072 201395 200770 200365 200013 199469 198782 198268 198129 198263 198420 198373 197959 197163
52872 197163 196237 195574 195376 195507 195729 195951 196243 196715 197420 198300 199158 199820 200296 200688 200954 200965 200798 200748 200951
52853 200951 201197 201228 201002 200582 199969 199240 198632 198289 198036 197623 197024 196310 195385 194113 192638 191274 190168 189308
52835 189308 188802 188827 189267 189713 189941 190113 190384 190587 190504 190260 190184 190345 190452 190241 189808 189567 189966 191238 193329
52816 193329 195984 198941 202021 204991 207459 209066 209846 210255 210758 211395 211861 211943 211686 211115 209990 208073
52800 208073 205536 202848 200267 197648 194848 192075 189644 187562 185634 183836 182320 181047 179769 178416
52786 178416 177276 176605 176277 176005 175743 175649 175740 175818 175752 175653 175740 176126 176774 177524 178175 178665 179175 179916 180783 181394
52766 181394 181564 181567 181734 181970 181916 181550 181280 181375 181606 181662 181696 182130 183026 183921 184371 184399 184341 184425 184643 184906 185138 185293
$$ packed form
52893B02933l6O1qj21j12n2j50m43o77o25m05l52n44o87n14j39J34J57m7m14p96
52872A97163r26o63j98J31K22K22K92M72P05Q80Q58O62M76L92K66J1j67n0K03
52853B00951K46L1k26m20o13p29o08l43k53m13n99p14r25j272j475j364j106q60
52835A89308n06K5M40M46K28J72K71K03q3k44p6J61J07k11m33k41L99J272K091
52816A93329K655K957L080K970K468J607P80M09N03O37M66Q2k57n71j125j917
52800B08073k537k688k581k619k800k773k431k082j928j798j516j273j278j353
52786A78416j140o71l28k72k62r4R1P8o6r9Q7L86O48P50O51M90N10P41Q67O11
52766A81394J70LJ67K36n4l66k70R5K31N6L4M34Q96Q95M50K8n8Q4K18K63K32J55
$$ plain form
52744 185293 185374 185451 185574 185695 185758 185835 186086 186532 186936 186996 186687 186363 186437 186948 187552 187965 188236 188488 188595 188381 188050
52723 188050 188026 188321 188412 187908 187069 186416 186068 185747 185306 184908 184710 184635 184535 184388 184282 184299 184469 184728 184929 185009
52703 185009 185075 185232 185384 185374 185295 185458 186008 186773 187525 188213 188836 189283 189466 189506 189627 189905 190236 190545 190911 191442
52683 191442 192116 192789 193345 193823 194376 195102 195938 196725 197355 197846 198277 198686 199009 199134 199054 198956 199082 199482 200015
52664 200015 200666 201673 203196 204916 206205 206722 206697 206643 206938 207689 208802 210030 211060 211695 211972 212049 211987 211694
52646 211694 211113 210398 209855 209615 209391 208710 207416 205882 204612 203750 203151 202770 202736 203033 203326 203249 202739 202027
52628 202027 201402 201024 200892 200910 201012 201232 201591 201985 202251 202364 202370 202195 201699 200967 200352 200123 200186 200264 200209 200059 199895
52607 199895 199800 199890 200227 200679 200975 200940 200691 200596 200991 201887 202938 203738 204117 204123 203856 203474 203271 203512 204123 204733
$$ packed form
52744A85293Q1P7J23J21O3P7K51M46M04O0l09l24P4N11O04M13K71K52J07k14l31
52723A88050k4K95R1n04q39o53l48l21m41l98j98p5j00j47j06J7J70K59K01Q0
52703A85009O6J57J52j0p9J63N50P65P52O88O23M47J83M0J21K78L31L09L66N31
52683A91442O74O73N56M78N53P26Q36P87O30M91M31M09L23J25q0r8J26M00N33
52664B00015O51J007J523J720J289N17k5n4K95P51J113J228J030O35K77P7o2k93
52646B11694n81p15n43k40k24o81j294j534j270q62n99l81l4K97K93p7n10p12
52628B02027o25l78j32J8J02K20L59L94K66J13Oj75m96p32o15k29O3P8n5j50j64
52607A99895r5R0L37M52K96l5k49r5L95Q96J051Q00L79Ok67l82k03K41O11O10
$$ plain form
52587 204733 205111 205371 205711 206153 206661 207314 208138 208871 209140 208865 208397 208223 208609 209440 210349 211026 211454 211829 212241
52568 212241 212583 212798 213035 213423 213849 214115 214237 214409 214739 215128 215395 215378 215008 214410 213846 213446 213059 212501 211852
52549 211852 211321 210946 210660 210570 210868 211473 212018 212318 212567 212946 213278 213270 212959 212625 212374 212041 211563 211255 211554 212570
52529 212570 213966 215253 216163 216746 217207 217730 218422 219336 220446 221640 222765 223711 224411 224808 224910 224898 225076
52512 225076 225618 226345 226836 226766 226106 225016 223603 221885 219943 217973 216121 214349 212565 210837 209343 208125
52496 208125 207041 205992 205047 204269 203597 203009 202702 202921 203617 204406 204925 205124 205221 205461 205980 206756 207602 208239
52478 208239 208506 208555 208798 209584 210918 212534 214215 215937 217621 218964 219698 219994 220362 221070 221895 222531 223016
52461 223016 223505 223817 223576 222792 221939 221317 220631 219450 217907 216593 215812 215264 214575 213828 213323 213014 212566 211907
$$ packed form
52587B04733L78K60L40M42N08O53Q24P33K69k75m68j74L86Q31R09O77M28L75M12
52568B12241L42K15K37L88M26K66J22J72L30L89K67j7l70n98n64m00l87n58o49
52549B11852n31l75k86r0K98O05N45L00K49L79L32ql11l34k51l33m78l08K99J016
52529B12570J396J287R10N83M61N23O92R14J110J194J125R46P00L97J02j2J78
52512B25076N42P27M91p0o60j090j413j718j942j970j852j772j784j728j494j218
52496B08125j084j049r45p78o72n88l07K19O96P89N19J99R7K40N19P76Q46O37
52478B08239K67M9K43P86J334J616J681J722J684J343P34K96L68P08Q25O36M85
52461B23016M89L12k41p84q53o22o86j181j543j314p81n48o89p47n05l09m48o59
$$ plain form
52443 211907 211383 211210 211112 210742 210215 209900 209806 209604 209234 209066 209286 209425 208843 207526 206145 205381 205404 205945 206672
52424 206672 207381 207974 208367 208488 208378 208251 208328 208612 208923 209181 209502 209987 210560 211155 211938 213158 214854 216855
52406 216855 219044 221488 224303 227467 230794 234021 236959 239526 241659 243244 244279 245013 245731 246366 246593
52391 246593 246358 246026 245862 245572 244611 242761 240258 237552 235166 233541 232725 232333 232058 232044 232470 232997 233047 232544
52373 232544 231934 231551 231347 231272 231411 231684 231828 231857 232141 232849 233636 234101 234225 234183 234032 233850 233911 234385 235042 235545
52353 235545 235905 236405 237216 238326 239707 241281 242775 243932 244842 245851 247138 248577 249998 251386 252841
52338 252841 254477 256395 258619 261047 263586 266287 269223 272257 275108 277622 279901 282160 284630 287503
52324 287503 290821 294375 297857 301173 304493 307995 311704 315643 319955 324742 329890 335156 340464 345979
$$ packed form
52443B11907n24j73r8l70n27l15r4k02l70j68K20J39n82j317j381p64K3N41P27
52424B06672P09N93L93J21j10j27P7K84L11K58L21M85N73N95P83J220J696K001
52406B16855K189K444K815L164L327L227K938K567K133J585J035P34P18O35K27
52391B46593k35l32j64k90r61j850k503k706k386j625q16l92k75j4M26N27N0n03
52373B32544o10l83k04p5J39K73J44K9K84P08P87M65J24m2j51j82O1M74O57N03
52353B35545L60N00Q11J110J381J574J494J157R10J009J287J439J421J388J455
52338B52841J636J918K224K428K539K701K936L034K851K514K279K259K470K873
52324B87503L318L554L482L316L320L502L709L939M312M787N148N266N308N515
$$ plain form
52310 345979 351916 358361 365342 372958 381285 390112 398909 407176 414866 422375 430151 438349 446809 455224
52296 455224 463312 470947 478198 485209 492025 498594 504936 511208 517554 523934 530183 536175 541947 547636
52282 547636 553267 558566 563146 566967 570484 574115 577705 580808 583416 586012 588844 591587 593874 595797
52268 595797 597620 599336 600835 602271 603884 605615 607222 608660 610050 611366 612510 613596 614851 616279
52254 616279 617764 619479 621824 624920 628495 632295 636268 640242 643852 646975 649999 653465 657603 662381
52240 662381 667730 673488 679306 684883 690214 695446 700616 705710 710868 716291 721973 727689 733185 738233
52226 738233 742601 746187 749132 751653 753783 755423 756602 757450 757931 757816 757003 755668 754062 752371 750852
52211 750852 749885 749646 749853 750089 750306 750803 751687 752639 753302 753723 754235 755041 756148 757603 759526 761870 764393
$$ packed form
52310C45979N937O445O981P616Q327Q827Q797Q267P690P509P776Q198Q460Q415
52296D55224Q088P635P251P011O816O569O342O272O346O380O249N992N772N689
52282E47636N631N299M580L821L517L631L590L103K608K596K832K743K287J923
52268E95797J823J716J499J436J613J731J607J438J390J316J144J086J255J428
52254F16279J485J715K345L096L575L800L973L974L610L123L024L466M138M778
52240F62381N349N758N818N577N331N232N170N094N158N423N682N716N496N048
52226G38233M368L586K945K521K130J640J179Q48M81j15q13j335j606j691j519
52211G50852r67k39K07K36K17M97Q84R52O63M21N12Q06J107J455J923K344K523
$$ plain form
52194 764393 766984 769836 773128 776655 779972 782841 785385 787838 790336 792926 795559 798009 799964 801349
52180 801349 802430 803474 804407 804922 804901 804575 804301 804303 804595 804991 805095 804441 802824 800487 797907 795412 793053
52163 793053 790782 788620 786592 784604 782483 780105 777498 774885 772670 771269 770799 770942 771197 771269 771210 771223
52147 771223 771449 771869 772309 772560 772606 772720 773222 774157 775350 776696 778199 779759 781163 782359 783532 784838
52131 784838 786282 787940 790035 792626 795381 797863 799860 801327 802236 802728 803236 804126 805315 806463 807465
52116 807465 808504 809755 811336 813455 816275 819699 823618 828315 834237 841322 848943 856620 864418 872558
52102 872558 881024 889735 898753 908056 917391 926582 935787 945197 954687 963985 972975 981568 989515 996674
52088 996674 1003346 1009978 1016596 1022845 1028514 1033710 1038479 1042617 1045961 1048639 1050852 1052532 1053359 1053093 1051871
$$ packed form
52194G64393K591K852L292L527L317K869K544K453K498K590K633K450J955J385
52180H01349J081J044R33N15k1l26k74KK92L96J04o54j617k337k580k495k359
52163G93053k271k162k028j988k121k378k607k613k215j401m70J43K55P2n9J3
52147G71223K26M20M40K51M6J14N02R35J193J346J503J560J404J196J173J306
52131G84838J444J658K095K591K755K482J997J467R09M92N08Q90J189J148J002
52116H07465J039J251J581K119K820L424L919M697N922P085P621P677P798Q140
52102H72558Q466Q711R018R303R335R191R205R410R490R298Q990Q593P947P159
52088I96674O672O632O618O249N669N196M769M138L344K678K213J680Q27k66j222
$$ plain form
52073 1051871 1050203 1048628 1047301 1045949 1044314 1042507 1040790 1039161 1037406 1035551 1033927 1032777 1032008 1031463
52059 1031463 1031221 1031477 1032284 1033528 1035088 1036905 1038992 1041450 1044380 1047726 1051294 1055017 1059066 1063544 1068137
52044 1068137 1072245 1075484 1077971 1080117 1082238 1084350 1086278 1087863 1089106 1090173 1091253 1092363 1093256 1093502
52030 1093502 1092764 1091085 1088952 1086997 1085573 1084603 1083827 1083119 1082554 1082244 1082250 1082628 1083409 1084442 1085312 1085524 1084762
52013 1084762 1082935 1080038 1076144 1071538 1066660 1061723 1056442 1050276 1042916 1034400 1024824 1014168 1002497
52000 1002497 990131 977443 964565 951407 937947 924349 910763 897092 883011 868260 852902
51989 852902 837280 821670 806020 790126 774041 758170 742951 728572 715027 702309 690418
51978 690418 679275 668760 658784 649344 640586 632774 626032 620040 614257 608503 603133 598456 594244 590033
$$ packed form
52073A051871j668j575j327j352j635j807j717j629j755j855j624j150p69n45
52059A031463k42K56Q07J244J560J817K087K458K930L346L568L723M049M478M593
52044A068137M108L239K487K146K121K112J928J585J243J067J080J110Q93K46
52030A093502p38j679k133j955j424r70p76p08n65l10OL78P81J033Q70K12p62
52013A084762j827k897l894m606m878m937n281o166p360q516r576j0656j1671
52000A002497j2366j2688j2878j3158j3460j3598j3586j3671j4081j4751j5358
51989H52902j5622j5610j5650j5894j6085j5871j5219j4379j3545j2718j1891
51978F90418j1143j0515r976r440q758p812o742n992n783n754n370m677m212m211
$$ plain form
51964 590033 585657 581200 576619 571786 566786 561790 556680 551192 545448 539977 535162 531046 527722 525478
51950 525478 524333 523815 523502 523531 524301 525861 527853 529863 531590 532829 533578 534064 534378 534231 533277 531575 529420
51933 529420 526803 523393 519084 514251 509333 504347 498962 492940 486456 480063 474312 469337 464836 460546
51919 460546 456705 453812 452040 451062 450518 450373 450736 451502 452361 453065 453557 453891 454111 454190 453992 453333 452093 450284
51901 450284 447983 445228 441965 438091 433563 428477 423023 417349 411585 406061 401356 397969 395969 395116
51887 395116 395255 396464 398874 402541 407421 413230 419307 424911 429748 434047 438067 441771 445043 447918
51873 447918 450363 452008 452405 451509 449750 447653 445435 442892 439588 435329 430569 426195 422730 419890 417084
51858 417084 414172 411432 408983 406636 404323 402277 400643 399189 397578 395771 394003 392489 391314 390468
$$ packed form
51964E90033m376m457m581m833n000m996n110n488n744n471m815m116l324k244
51950E25478j145n18l13K9P70J560J992K010J727J239P49M86L14j47r54j702k155
51933E29420k617l410m309m833m918m986n385o022o484o393n751m975m501m290
51919D60546l841k893j772r78n44j45L63P66Q59P04M92L34K20P9j98o59j240j809
51901D50284k301k755l263l874m528n086n454n674n764n524m705l387k000q53
51887C95116J39J209K410L667M880N809O077N604M837M299M020L704L272K875
51873D47918K445J645L97q96j759k097k218k543l304m259m760m374l465k840k806
51858D17084k912k740k449k347k313k046j634j454j611j807j768j514j175q46
$$ plain form
51844 390468 389911 389619 389680 390278 391537 393440 395915 398895 402309 406107 410400 415426 421382 428405 436689
51829 436689 446395 457310 468805 480277 491458 502143 511867 520180 527076 532757 536985 539112 538916
51816 538916 537009 534138 530288 524825 517396 508326 498113 486936 474843 462232 449827 438238 427694
51803 427694 418214 409817 402549 396419 391386 387328 383987 381090 378588 376636 375228 373980 372466 370737
51789 370737 369281 368474 368211 368136 368034 367956 368095 368672 369793 371292 372796 374072 375228 376494 377891 379234
51773 379234 380362 381232 381846 382219 382366 382210 381556 380347 378805 377146 375201 372605 369385 366058 363055 360331
51757 360331 357689 355207 353033 350943 348491 345659 343080 341475 341034 341439 342315 343499 344953 346623 348443
51742 348443 350356 352281 354104 355764 357302 358761 360074 361118 361854 362360 362704 362951 363269 363888 364832 365833
$$ packed form
51844C90468n57k92O1N98J259J903K475K980L414L798M293N026N956P023Q284
51829D36689R706J0915J1495J1472J1181J0685R724Q313O896N681M228K127j96
51816E38916j907k871l850n463p429r070j0213j1177j2093j2611j2405j1589j0544
51803D27694r480q397p268o130n033m058l341k897k502j952j408j248j514j729
51789C70737j456q07k63p5j02p8J39N77J121J499J504J276J156J266J397J343
51773C79234J128Q70O14L73J47j56o54j209j542j659j945k596l220l327l003k724
51757C60331k642k482k174k090k452k832k579j605m41M05Q76J184J454J670J820
51742C48443J913J925J823J660J538J459J313J044P36N06L44K47L18O19R44J001
$$ plain form
51726 365833 366657 367399 368256 369086 369497 369358 368999 368813 368924 369328 370094 371196 372363 373330 374158 375087 376211 377518
51708 377518 379118 381102 383218 385024 386397 387629 388952 390280 391549 393039 395099 397751 400747 403843
51694 403843 406795 409193 410599 410875 410240 409060 407706 406478 405386 403984 401708 398455 394658 390725 386617
51679 386617 382099 377212 372313 367716 363512 359636 355943 352239 348459 344888 342065 340373 339773 339995 340894
51664 340894 342504 344800 347540 350417 353315 356319 359449 362462 364990 366857 368165 369062 369531 369466 368866
51649 368866 367829 366424 364636 362463 359952 357163 354200 351263 348567 346188 344102 342292 340681 338985
51635 338985 336909 334570 332467 330860 329427 327802 326231 325296 325044 324803 323962 322591 321149 319880 318736
51620 318736 317674 316718 315826 314900 313907 312851 311695 310477 309361 308433 307505 306377 305209 304412 304151 304227 304441
$$ packed form
51726C65833Q24P42Q57Q30M11j39l59j86J11M04P66J102J167R67Q28R29J124J307
51708C77518J600J984K116J806J373J232J323J328J269J490K060K652K996L096
51694D03843K952K398J406K76o35j180j354j228j092j402k276l253l797l933m108
51679C86617m518m887m899m597m204l876l693l704l780l571k823j692o00K22Q99
51664C40894J610K296K740K877K898L004L130L013K528J867J308Q97M69o5o00
51649C68866j037j405j788k173k511k789k963k937k696k379k086j810j611j696
51635C38985k076k339k103j607j433j625j571r35k52k41q41j371j442j269j144
51620C18736j062r56q92r26r93j056j156j218j116r28r28j128j168p97k61P6K14
$$ plain form
51603 304441 304870 305711 307041 308827 310987 313392 315998 319020 322768 327153 331562 335391 338605 341637 344899
51588 344899 348613 352946 358005 363688 369730 375973 382451 389262 396570 404737 414245 425379 438131 452529
51574 452529 468920 487761 509163 532833 558456 586029 615750 647620 681263 716145 751863
51563 751863 788097 824277 859405 892253 921687 946824 967078 982233 992370 997565 997664 992536
51551 992536 982421 967839 949093 926113 898916 868042 834430 798964 762346 725322 688820
51540 688820 653763 620779 590132 561911 536255 513357 493257 475723 460414 447103 435641
51529 435641 425773 417208 409822 403620 398431 393888 389775 386136 382952 379953 376980 374239 371943 369862
51515 369862 367592 365132 362845 360859 358924 356888 354957 353336 351914 350480 349018 347599 346161 344610
$$ packed form
51603C04441M29Q41J330J786K160K405K606L022L748M385M409L829L214L032L262
51588C44899L714M333N059N683O042O243O478O811P308Q167R508J1134J2752J4398
51574D52529J6391J8841K1402K3670K5623K7573K9721L1870L3643L4882L5718
51563G51863L6234L6180L5128L2848K9434K5137K0254J5155J0137N195R9n128
51551I92536j0115j4582j8746k2980k7197l0874l3612l5466l6618l7024l6502
51540F88820l5057l2984l0647k8221k5656k2898k0100j7534j5309j3311j1462
51529D35641r868q565p386o202n189m543m113l639l184k999k973k741k296k081
51515C69862k270k460k287j986j935k036j931j621j422j434j462j419j438j551
$$ plain form
51501 344610 342985 341356 339671 337876 336087 334461 332989 331588 330271 329057 327795 326297 324616 322991
51487 322991 321529 320113 318598 316974 315319 313743 312333 311033 309607 307893 306062 304434 303079 301793
51473 301793 300486 299320 298384 297453 296201 294532 292613 290732 289250 288484 288458 288855 289357 289912 290529 291041 291325
51456 291325 291655 292484 293872 295498 297338 300013 304195 309821 316191 322752 329487 336482 343419 349764 355357
51441 355357 360599 366029 371849 377864 383703 388959 393239 396323 398286 399360 399594 398804 396920 394304 391568
51426 391568 389084 386714 384035 380740 376874 372762 368745 364986 361471 358208 355324 352922 350937 349261
51412 349261 348024 347591 348199 349682 351672 353999 356784 360104 363735 367373 371068 375255 380303 386168 392634
51397 392634 399838 408306 418424 430109 443219 458129 475619 496186 519753 546147 575577 608393
$$ packed form
51501C44610j625j629j685j795j789j626j472j401j317j214j262j498j681j625
51487C22991j462j416j515j624j655j576j410j300j426j714j831j628j355j286
51473C01793j307j166r36r31j252j669j919j881j482p66k6L97N02N55O17N12K84
51456B91325L30Q29J388J626J840K675M182N626O370O561O735O995O937O345N593
51441C55357N242N430N820O015N839N256M280L084J963J074K34p90j884k616k736
51426C91568k484k370k679l295l866m112m017l759l515l263k884k402j985j676
51412C49261j237m33O08J483J990K327K785L320L631L638L695M187N048N865O466
51397C92634P204Q468J0118J1685J3110J4910J7490K0567K3567K6394K9430L2816
$$ plain form
51385 608393 644470 683112 723556 765332 808086 851238 893890 934940 973145 1007199 1035994
51374 1035994 1058850 1075479 1085744 1089542 1086836 1077682 1062204 1040660 1013546 981541 945333 905623
51362 905623 863333 819648 775687 732197 689709 648942 610782 575806 543954 514839 488287
51351 488287 464449 443452 425132 409166 395323 383492 373518 365114 357903 351482 345484 339715 334235
51338 334235 329231 324772 320744 317057 313770 310939 308395 305853 303211 300627 298288 296230 294413 292847
51324 292847 291547 290452 289485 288620 287857 287193 286727 286679 287187 288114 289164 290210 291368 292780 294446 296307
51308 296307 298352 300566 302851 305072 307123 308926 310432 311668 312689 313452 313790 313587 312925 312010 311003
51293 311003 309983 308980 307977 306909 305754 304611 303625 302873 302372 302134 302108 302120 302003 301791 301681 301805 302144
$$ packed form
51385F08393L6077L8642M0444M1776M2754M3152M2652M1050L8205L4054K8795
51374A035994K2856J6629J0265L798k706r154j5478k1544k7114l2005l6208l9710
51362I05623m2290m3685m3961m3490m2488m0767l8160l4976l1852k9115k6552
51351D88287k3838k0997j8320j5966j3843j1831r974q404p211o421n998n769n480
51338C34235n004m459m028l687l287k831k544k542k642k584k339k058j817j566
51324B92847j300j095r67q65p63o64m66m8N08R27J050J046J158J412J666J861
51308B96307K045K214K285K221K051J803J506J236J021P63L38k03o62r15j007
51293C11003j020j003j003j068j155j143r86p52n01k38k6J2j17k12j10J24L39
$$ plain form
51276 302144 302656 303317 303988 304383 304321 303948 303553 303251 302941 302598 302401 302513 302866 303307 303884 304805 306087 307427
51258 307427 308542 309577 310978 312928 315054 316804 318008 318944 319869 320712 321302 321726 322253 322929 323456 323538 323202
51241 323202 322661 321993 321102 319936 318567 317032 315279 313327 311338 309450 307662 305973 304536 303504 302789
51226 302789 302139 301450 300870 300612 300739 301158 301686 302127 302395 302579 302825 303152 303503 303924 304593 305617 306976 308639
51208 308639 310554 312505 314225 315765 317530 319775 322234 324439 326309 328150 330207 332462 334867 337484
51194 337484 340301 343121 345736 348123 350402 352676 354935 356967 358319 358556 357700 356309 354994 353903 352805
51179 352805 351532 350124 348569 346680 344342 341724 339057 336271 333086 329457 325771 322454 319555 316832
51165 316832 314158 311693 309665 308162 307145 306562 306355 306488 306942 307591 308130 308329 308416 308979 310332 312157 313912
$$ packed form
51276C02144N12O61O71L95o2l73l95l02l10l43j97J12L53M41N77R21J282J340
51258C07427J115J035J401J950K126J750J204R36R25Q43N90M24N27O76N27Q2l36
51241C23202n41o68q91j166j369j535j753j952j989j888j788j689j437j032p15
51226C02789o50o89n80k58J27M19N28M41K68J84K46L27L51M21O69J024J359J663
51208C08639J915J951J720J540J765K245K459K205J870J841K057K255K405K617
51194C37484K817K820K615K387K279K274K259K032J352K37q56j391j315j091j098
51179C52805j273j408j555j889k338k618k667k786l185l629l686l317k899k723
51165C16832k674k465k028j503j017n83k07J33M54O49N39J99Q7N63J353J825J755
$$ plain form
51148 313912 315359 316468 317008 316703 315773 314931 314660 314747 314681 314254 313563 312634 311401 309990 308744 307886 307329 306896
51130 306896 306567 306425 306513 306893 307697 308938 310297 311327 311948 312613 313867 315814 318112 320351 322287 323803
51114 323803 324845 325516 326053 326631 327247 327803 328224 328511 328827 329503 330732 332197 333288 333794 334179 334968 336102
51097 336102 337132 337887 338620 339567 340663 341696 342501 342970 343118 343138 343239 343386 343364 343058 342497 341695 340702 339764
51079 339764 339137 338698 338046 337056 336070 335442 335165 335092 335266 335827 336767 337926 339119 340234 341355 342812 344840
51062 344840 347102 348909 350080 351262 353116 355496 357773 359731 361753 364255 367310 370793 374496 378120
51048 378120 381475 384740 388256 392047 395792 399317 402821 406532 410419 414390 418546 423026 427691 432101
51034 432101 435790 438522 440381 441627 442455 442884 442897 442600 442088 441256 439945 438246 436495 434955 433701 432799
$$ packed form
51148C13912J447J109N40l05r30q42k71Q7o6m27o91r29j233j411j246q58n57m33
51130C06896l29j42Q8L80Q04J241J359J030O21O65J254J947K298K239J936J516
51114C23803J042O71N37N78O16N56M21K87L16O76J229J465J091N06L85P89J134
51097C36102J030P55P33R47J096J033Q05M69J48K0J01J47k2l06n61q02r93r38
51079C39764o27m39o52r90r86o28k77p3J74N61R40J159J193J115J121J457K028
51062C44840K262J807J171J182J854K380K277J958K022K502L055L483L703L624
51048C78120L355L265L516L791L745L525L504L711L887L971M156M480M665M410
51034D32101L689K732J859J246Q28M29J3k97n12q32j311j699j751j540j254r02
$$ plain form
51018 432799 432314 432124 431976 431849 432048 432804 434024 435582 437621 440323 443520 446762 449740 452425 454857 457026
51002 457026 458979 460830 462579 464039 464994 465377 465285 464917 464573 464635 465470 467271 469986 473422 477473 482232
50986 482232 487844 494261 501310 509017 517698 527604 538612 550444 563063 576607 590989 605840 620946
50973 620946 636482 652739 669763 687421 705664 724526 743994 764051 784800 806308 828369
50962 828369 850660 873150 896122 919682 943475 967013 990063 1012530 1034162 1054652 1073975
50951 1073975 1092303 1109597 1125554 1140011 1153107 1164977 1175561 1184901 1193371 1201286 1208424 1214226
50939 1214226 1218445 1221372 1223364 1224391 1224147 1222402 1219139 1214373 1207920 1199365 1188273 1174549 1158583
50926 1158583 1140981 1122116 1101965 1080377 1057404 1033320 1008405 982813 956628 930041 903404
$$ packed form
51018D32799m85j90j48j27J99P56J220J558K039K702L197L242K978K685K432K169
51002D57026J953J851J749J460R55L83r2l68l44O2Q35J801K715L436M051M759
50986D82232N612O417P049P707Q681R906J1008J1832J2619J3544J4382J4851J5106
50973F20946J5536J6257J7024J7658J8243J8862J9468K0057K0749K1508K2061
50962H28369K2291K2490K2972K3560K3793K3538K3050K2467K1632K0490J9323
50951A073975J8328J7294J5957J4457J3096J1870J0584R340Q470P915P138N802
50939A214226M219K927J992J027k44j745l263m766o453q555j1092j3724j5966
50926A158583j7602j8865k0151k1588k2973k4084k4915k5592k6185k6587k6637
$$ plain form
50915 903404 877129 851521 826736 802875 780054 758358 737842 718632 700959 684988 670629
50904 670629 657604 645655 634645 624516 615302 607151 600206 594441 589658 585641 582229 579263 576608
50891 576608 574249 572250 570644 569426 568649 568407 568630 569064 569536 570196 571425 573548 576618 580398 584507 588638
50875 588638 592700 596795 601078 605711 610903 616867 623663 631147 639110 647498 656455 666237 677068 689094
50861 689094 702432 717304 734051 752988 774297 798118 824661 854107 886448 921615 959760
50850 959760 1001238 1046257 1094649 1146045 1200116 1256588 1315154 1375440 1436932 1498824 1560097
50839 1560097 1619890 1677716 1733186 1785612 1834146 1878294 1918072 1953619 1984873 2011795 2034729
50828 2034729 2054256 2070715 2084107 2094554 2102611 2108942 2113828 2117175 2118830 2118632 2116239 2111304 2103875
$$ packed form
50915I03404k6275k5608k4785k3861k2821k1696k0516j9210j7673j5971j4359
50904F70629j3025j1949j1010j0129r214q151o945n765m783m017l412k966k655
50891E76608k359j999j606j218p77k42K23M34M72O60J229K123L070L780M109M131
50875E88638M062M095M283M633N192N964O796P484P963Q388Q957R782J0831J2026
50861F89094J3338J4872J6747J8937K1309K3821K6543K9446L2341L5167L8145
50850I59760M1478M5019M8392N1396N4071N6472N8566O0286O1492O1892O1273
50839A560097N9793N7826N5470N2426M8534M4148L9778L5547L1254K6922K2934
50828B034729J9527J6459J3392J0447Q057O331M886L347J655j98k393m935p429
$$ plain form
50815 2103875 2094271 2082376 2067326 2048131 2024405 1996281 1963880 1927211 1886455 1842018 1794358
50804 1794358 1744036 1691861 1638647 1584897 1531041 1477921 1426653 1377972 1332077 1289169 1249789
50793 1249789 1214510 1183658 1157429 1135897 1118689 1105024 1094291 1086318 1080852 1077189 1074677 1073280
50781 1073280 1073216 1074204 1075450 1076253 1076221 1075004 1072246 1067913 1062341 1055829 1048311 1039461 1028961 1016716 1002993
50766 1002993 988299 972991 957044 940384 923328 906419 889901 873657 857681 842232 827461
50755 827461 813213 799406 786428 774935 765342 757620 751478 746600 742843 740376 739638 741056 744779
50742 744779 750723 758799 769009 781291 795405 811143 828693 848636 871377 896623 923606 951830
50730 951830 981424 1012672 1045476 1079427 1114147 1149313 1184477 1219142 1252889 1285179 1315180
$$ packed form
50815B103875r604j1895j5050j9195k3726k8124l2401l6669m0756m4437m7660
50804A794358n0322n2175n3214n3750n3856n3120n1268m8681m5895m2908l9380
50793A249789l5279l0852k6229k1532j7208j3665j0733p973n466l663k512j397
50781A073280o4R88J246Q03l2j217k758m333n572o512p518q850j0500j2245j3723
50766A002993j4694j5308j5947j6660j7056j6909j6518j6244j5976j5449j4771
50755H27461j4248j3807j2978j1493r593p722o142m878l757k467p38J418L723
50742G44779N944Q076J0210J2282J4114J5738J7550J9943K2741K5246K6983K8224
50730I51830K9594L1248L2804L3951L4720L5166L5164L4665L3747L2290L0001
$$ plain form
50719 1315180 1342105 1365768 1386526 1404720 1420440 1433816 1445175 1454760 1462508 1468244 1471974 1473918
50707 1473918 1474427 1473931 1472801 1471201 1469148 1466667 1463723 1460019 1455067 1448470 1439952 1429236 1416213 1401258
50693 1401258 1384967 1367501 1348487 1327667 1305290 1281686 1256890 1231084 1205121 1180213 1157200
50682 1157200 1136384 1117958 1102266 1089706 1080705 1075740 1075112 1078646 1085827 1096232 1109617 1125622
50670 1125622 1143707 1163478 1184889 1207913 1232134 1256776 1281131 1304898 1328032 1350301 1371051
50659 1371051 1389499 1405217 1418211 1428557 1436177 1441051 1443400 1443515 1441600 1437969 1433164 1427619 1421309
50646 1421309 1414041 1406025 1397901 1390234 1383227 1376948 1371544 1367162 1363897 1361910 1361467 1362755 1365781 1370437
50632 1370437 1376529 1383740 1391705 1400136 1408692 1416762 1423602 1428702 1431836 1432833 1431663 1428751 1424835 1420260
$$ packed form
50719A315180K6925K3663K0758J8194J5720J3376J1359R585P748N736L730J944
50707A473918N09m96j130j600k053k481k944l704m952o597q518j0716j3023j4955
50693A401258j6291j7466j9014k0820k2377k3604k4796k5806k5963k4908k3013
50682A157200k0816j8426j5692j2560r001m965o28L534P181J0405J3385J6005
50670A125622J8085J9771K1411K3024K4221K4642K4355K3767K3134K2269K0750
50659A371051J8448J5718J2994J0346P620M874K349J15j915l631m805n545o310
50646A421309p268q016q124p667p007o279n404m382l265j987m43J288L026M656
50632A370437O092P211P965Q431Q556Q070O840N100L134R97j170k912l916m575
$$ [...]
##END NTUPLES=NMR SPECTRUM
##END=
