##TITLE=AC1682_2981_8571508_A8kTSi5g7l
##JCAMPDX= 6.0         $$ Bruker NMR JCAMP-DX V2.0
##DATA TYPE= NMR SPECTRUM
##DATA CLASS= NTUPLES
##ORIGIN= BRUKER
##OWNER= Administrator
$$ 1.72 TOPSPIN		Version 2.1
$$ 2014-04-10 16:43:30.892 -0700  Administrator@X
$$ Compression mode = diff/dup
##.OBSERVE FREQUENCY= 400.02188249412
##.OBSERVE NUCLEUS= ^1H
##.ACQUISITION MODE= SIMULTANEOUS (DQD)
##.ACQUISITION SCHEME= undefined
##.AVERAGES= 8
##.DIGITISER RES= 22
##SPECTROMETER/DATA SYSTEM= spect
##.PULSE SEQUENCE= zg30
##.SOLVENT NAME= COFFEE_meoh
##.SHIFT REFERENCE= INTERNAL, COFFEE_meoh, 1, 14.98509
##AUDIT TRAIL= $$ (NUMBER, WHEN, WHO, WHERE, PROCESS, VERSION, WHAT)
$$ ##TITLE= Audit trail, TOPSPIN		Version 2.1
$$ ##JCAMPDX= 5.01
$$ ##ORIGIN= Bruker BioSpin GmbH
$$ ##OWNER= Administrator
$$ $$ E:\/data/COFFEE/nmr/AC1682_2981_8571508_A8kTSi5g7l/20/pdata/1/auditp.txt
$$ ##AUDIT TRAIL=  $$ (NUMBER, WHEN, WHO, WHERE, PROCESS, VERSION, WHAT)
(   1,<2014-04-10 16:43:23.220 -0700>,<Administrator>,<X>,<go>,<TOPSPIN 2.1>,
      <created by zg
	started at 2014-04-10 16:42:17.252 -0700,
	POWCHK enabled, PULCHK disabled,
       configuration hash MD5:
       C8 4E 4E 5D D3 5C D8 9E 9F 52 82 E0 59 8A DE 15
       data hash MD5: 64K
       A6 09 C6 63 09 42 94 A2 50 ED 8F 39 06 E9 A9 79>)
(   2,<2014-04-10 16:43:26.549 -0700>,<Administrator>,<X>,<proc1d>,<TOPSPIN 2.1>,
      <Start of raw data processing
       efp LB = 0 FT_mod = 6 PKNL = 1 PHC0 = 0 PHC1 = 0 SI = 32K 
       data hash MD5: 32K
       01 4C F1 7E 32 63 46 3E 00 04 E4 C7 FB 0C B4 7D>)
(   3,<2014-04-10 16:43:26.939 -0700>,<Administrator>,<X>,<proc1d>,<TOPSPIN 2.1>,
      <pk PHC0 = 96.86096 PHC1 = 0 
       data hash MD5: 32K
       42 08 E5 86 02 26 9B DA 66 90 30 D6 0D 23 4E 0D>)
(   4,<2014-04-10 16:43:27.236 -0700>,<Administrator>,<X>,<proc1d>,<TOPSPIN 2.1>,
      <abs ABSG = 1 
       data hash MD5: 32K
       53 BE 9E E8 32 F0 A1 78 3A CC 04 44 4F 8E A7 44>)
(   5,<2014-04-10 16:43:27.439 -0700>,<Administrator>,<X>,<proc1d>,<TOPSPIN 2.1>,
      <abs ABSG = 2 
       data hash MD5: 32K
       87 49 4B C4 09 A6 19 FA B2 5C 91 9C 38 CE 21 DA>)
(   6,<2014-04-10 16:43:27.549 -0700>,<Administrator>,<X>,<proc1d>,<TOPSPIN 2.1>,
      <abs ABSG = 3 
       data hash MD5: 32K
       B8 16 2F BD 50 C9 36 BC E1 E0 F7 2F D6 5B A1 77>)
(   7,<2014-04-10 16:43:27.642 -0700>,<Administrator>,<X>,<proc1d>,<TOPSPIN 2.1>,
      <abs ABSG = 4 
       data hash MD5: 32K
       1A 87 55 CA FC 6D 05 6C 00 E7 BF 36 B9 18 5E DD>)
(   8,<2014-04-10 16:43:27.720 -0700>,<Administrator>,<X>,<proc1d>,<TOPSPIN 2.1>,
      <abs ABSG = 5 
       data hash MD5: 32K
       44 46 86 FA 1C 6A 53 FB F5 F2 2A 88 33 33 44 04>)
$$ ##END=
$$ 
$$ $$ hash MD5
$$ $$ 0E C0 BE 2A 93 83 F5 B6 7B 04 A1 1B 41 AE B2 CC
##$RELAX= 
##$RELAX= 
##$RELAX= 
##$RELAX= 
##$RELAX= 
##$RELAX= 
##$RELAX= 
$$ Bruker specific parameters
$$ --------------------------
##$DU= <E:\>
##$EXPNO= 20
##$NAME= <AC1682_2981_8571508_A8kTSi5g7l>
##$PROCNO= 1
$$ [...]
##$TP= (0..7)
150 150 150 150 150 150 150 150
##$TP07= 0
##$TPNAME0= <>
##$TPNAME1= <>
##$TPNAME2= <>
##$TPNAME3= <>
##$TPNAME4= <>
##$TPNAME5= <>
##$TPNAME6= <>
##$TPNAME7= <>
##$TPOAL= (0..7)
0.5 0.5 0.5 0.5 0.5 0.5 0.5 0.5
##$TPOFFS= (0..7)
0 0 0 0 0 0 0 0
##$TUNHIN= 0
##$TUNHOUT= 0
##$TUNXOUT= 0
##$USERA1= <user>
##$USERA2= <user>
##$USERA3= <user>
##$USERA4= <user>
##$USERA5= <user>
##$V9= 5
##$VALIST= <valist>
##$VCLIST= <CCCCCCCCCCCCCCC>
##$VD= 0
##$VDLIST= <DDDDDDDDDDDDDDD>
##$VPLIST= <PPPPPPPPPPPPPPP>
##$VTLIST= <TTTTTTTTTTTTTTT>
##$WBST= 1024
##$WBSW= 4
##$XGAIN= (0..3)
0 0 0 0
##$XL= 0
##$YL= 0
##$YMAX_a= 590432
##$YMIN_a= -488075
##$ZGOPTNS= <>
##$ZL1= 120
##$ZL2= 120
##$ZL3= 120
##$ZL4= 120
##$ABSF1= 14.98509
##$ABSF2= -5.573092
##$ABSG= 5
##$ABSL= 3
##$ALPHA= 0
##$AQORDER= 0
##$ASSFAC= 0
##$ASSFACI= 0
##$ASSFACX= 0
##$ASSWID= 0
##$AUNMP= <proc_prof1d_extract_pilot.lims>
##$AXLEFT= 0
##$AXNAME= <>
##$AXNUC= <1H>
##$AXRIGHT= 0
##$AXTYPE= 0
##$AXUNIT= <>
##$AZFE= 0.1
##$AZFW= 0.1
##$BCFW= 0
##$BC_mod= 0
##$BYTORDP= 0
##$COROFFS= 0
##$CY= 15
##$DATMOD= 1
##$DC= 0
##$DFILT= <>
##$DTYPP= 0
##$F1P= 0
##$F2P= 0
##$FCOR= 0.5
##$FTSIZE= 32768
##$FT_mod= 6
##$GAMMA= 0
##$GB= 0
##$INTBC= 1
##$INTSCL= 1
##$ISEN= 128
##$LB= 0
##$LEV0= 0
##$LPBIN= 0
##$MAXI= 10000
##$MC2= 0
##$MEAN= 0
##$ME_mod= 0
##$MI= 0
##$NCOEF= 0
##$NC_proc= -8
##$NLEV= 6
##$NOISF1= 0
##$NOISF2= 0
##$NSP= 0
##$NTH_PI= 0
##$NZP= 0
##$OFFSET= 14.98509
##$PC= 1
##$PHC0= 96.86096
##$PHC1= 0
##$PH_mod= 1
##$PKNL= yes
##$PPARMOD= 0
##$PPDIAG= 0
##$PPIPTYP= 0
##$PPMPNUM= 2147483647
##$PPRESOL= 1
##$PSCAL= 4
##$PSIGN= 0
##$PYNMP= <proc.py>
##$REVERSE= no
##$SF= 400.02
##$SI= 32768
##$SIGF1= 0
##$SIGF2= 0
##$SINO= 400
##$SIOLD= 32768
##$SPECTYP= <>
##$SREGLST= <1H.CDCl3>
##$SSB= 0
##$STSI= 32768
##$STSR= 0
##$SW_p= 8223.68421052631
##$SYMM= 0
##$S_DEV= 0
##$TDeff= 65536
##$TDoff= 0
##$TI= <>
##$TILT= no
##$TM1= 0
##$TM2= 0
##$TOPLEV= 0
##$USERP1= <user>
##$USERP2= <user>
##$USERP3= <user>
##$USERP4= <user>
##$USERP5= <user>
##$WDW= 1
##$XDIM= 32768
##$YMAX_p= 453342793
##$YMIN_p= -721540
##$CURPLOT= <Network HP LaserJet P1505>
##$CURPRIN= <$Network HP LaserJet P1505>
##$DFORMAT= <normdp>
##$LAYOUT= <+/1D_H.xwp>
##$LFORMAT= <normlp>
##$PFORMAT= <normpl>
##$SURQMSG= 1
$$ End of Bruker specific parameters
$$ ---------------------------------
##NTUPLES= NMR SPECTRUM
##VAR_NAME=  FREQUENCY,     SPECTRUM/REAL,   SPECTRUM/IMAG
##SYMBOL=    X,             R,               I
##VAR_TYPE=  INDEPENDENT,   DEPENDENT,       DEPENDENT
##VAR_FORM=  AFFN,          ASDF,            ASDF
##VAR_DIM=   32768,         32768,           32768
##UNITS=     HZ,            ARBITRARY UNITS, ARBITRARY UNITS
##FACTOR=    0.250966925370066, 1,           1
##FIRST=     8223.43324360094, -124368,      -269505
##LAST=      0,             229248,          27644
##MIN=       0,             -721540,         0
##MAX=       8223.43324360094, 453342793,    0
$$ Real data points
##PAGE= N=1
##DATA TABLE= (X++(R..R)), XYDATA
$$ [...]
19451c1781A19777f7861j07705A9198J43164Q3142b57346a18648B25828o8595
19441A57233b9261j23176A71451c3362A58485j802a24397r36n4892A73450a80390
19429A5581a22330J3517A16237a93714K9827F7046K63720E9240N9198R1582A2823
19417d6898k12659J20951q0591j6332J14747I0175d4621A06940b95152j76120
19407d71272F7534e4773A80584a55345O9711j39264A46268F8151a20891N4440
19397f6451A66890g3489j03154A63553l3090f8035I9772b42423J4544B36037g4477
19385d64312A06071d3237q7203j5185f6215A33888i0871k0166L8482a9942k37534
19374b57476Q0200B077b03251A78064N4706j7433b4076a1885b841H7719a74061
$$ y = [-31781, 119777, -67861, -175566, 19198, 162362, 245504, -257346, -118648, 225828, 157233, -29261, -152437, 171451, -33362, 158485, 156683, -124397, -125333, -180225, 173450, -180390, 15581, -122330, -108813, 116237, -193714, -163887, 67046, 330766, 59240, 118438, 210020, 12823, -46898, -259557, -138606, -219197, -235529, -120782, 90175, -44621, 106940, -295152, -471272, 67534, -54773, 180584, -155345, -85634, -224898, 146268, 68151, -120891, -66451, 166890, -73489, -176643, 163553, 130463, -68035, 99772, -242423, -227879, 236037, -74477, -464312, 106071, -43237, -130440, -145625, -66215, 133888, -90871, -111037, -72555, -19942, -257476, -177276, 2077, -203251, 178064, 232770, 215337, -24076, -11885, -2841, 87719, -174061]
19362A02239Q8673a27471l5847k57198h5841A7495g3128j59099J23E749c79229
19350A89682C8374c1997l3549d911H5361b78450I2649O3180A2798J61625a34158
19338A50432n0210b6427j47062C3119g0681e102n1840r4990A66930c67122A43193
19326a53752l8528D12394a44091M1511k11857C3833a04559l57324C10212d7115
19315c68682B75735c31786a5836j37915j48013M480f9840b4996B3638g7865L6474
19304d1391m3610k9691k2739N2213l2563j34577N0827M5374L4694I584N6549a81367
19291b56839C29502E2711a34108j18862B7450e90526A61437c38127g7583j93150
19281b70733d6401A08509K8251a47420o3862B00725f030A40937c44022b7627B01928
$$ y = [102239, 190912, -127471, -163318, -420516, -85841, 17495, -73128, -232227, -232104, 5749, -379229, 189682, 38374, -31997, -65546, -4911, 85361, -278450, 92649, 155829, 12798, 174423, -134158, 150432, 100222, -26427, -173489, 33119, -70681, -5102, -56942, -151932, 166930, -367122, 143193, -153752, -192280, 412394, -144091, -102580, -314437, 33833, -104559, -461883, 310212, -47115, -368682, 275735, -331786, -15836, -153751, -301764, -297284, -69840, -24996, 23638, -77865, -41391, -85001, -114692, -137431, -85218, -117781, -252358, -201531, -156157, -121463, 9584, 66133, -181367, -256839, 329502, 52711, -134108, -252970, 27450, -590526, 161437, -338127, -77583, -270733, -46401, 108509, 136760, -147420, -211282, 200725, -6030, 140937, -344022, -27627, 201928]
19269a11145E0864b71912k03180B17412f4886A57139E104c27061a56412I7892
19258E7979b13636r9246Q6613c5460I8497f0327B72810d401k0808J277n9466A937
19245A2102b45552F7878c4405C0759d6206l32476i1292k4123K2389K7957E7339
19233A13235N0532i3581B20383b92229J43959A05692I395b34786L5139R9240E8379
19221i0258o5244k62305C14465b03872A21625P9891c17969J47195B998P7289h4070
19209a19113k78632B44097b9534A5551e4070B20679a07711L4963j66603G1031
19198E7025b50425B21982D8830L0321n651a28235l8030A16228k7137C6403J2708
19187D9111a67195A31766A7668O4251K36969E2727e79929b77839A11727d91193
$$ y = [-111145, 50864, -271912, -475092, 217412, -64886, 157139, 5104, -327061, -156412, 97892, 57979, -213636, -312882, -226269, -35460, 98497, -60327, 272810, -4401, -25209, -23932, -83398, 1937, 12102, -245552, 67878, -34405, 30759, -46206, -378682, -91292, -115415, -93026, -65069, 57339, 113235, 163767, -93581, 220383, -292229, -148270, 105692, 9395, -234786, -199647, -100407, 58379, -90258, -155502, -417807, 314465, -203872, 121625, 201516, -317969, -170774, 2998, 80287, -84070, -119113, -397745, 244097, -29534, 15551, -54070, 220679, -107711, -72748, -239351, 71031, 57025, -250425, 221982, 48830, 79151, 73500, -128235, -166265, 116228, 89091, 36403, 49111, -167195, 131766, 17668, 81919, 318888, 52727, -579929, -277839, 111727, -491193]
19176A88443j0871k4376F9811b31800E4146c73296A9290a51623B32990d38987
19165G741c4215j56837Q328c4740F8552b917A44860a37066d5430j43171C11213
19153b85815j27434P2581i1304E2406a19235k2349j33711A25043b59688A5397
19142A40622a30893k07848a30717J2946D4176j3481c99862C5652a50918n5366
19132b06284Q5770j41085C46548c9485B29228b54004m4578H7264a75875Q2507
19122i3368A54835B033J39728m4098a56271A73698b41416d349j99960d8446I0520
19110a98032G5495a60790I1678O0508b04709j85963A6755d8176A20308c7128D7919
19098A65949d8691a2806B4601G733a93733D5577f3961k14901O7517Q7840k3849
$$ y = [188443, 177572, 153196, 69811, -231800, 54146, -373296, 19290, -151623, 232990, -438987, 7741, -34215, -191052, -182724, -34740, 68552, -2917, 144860, -137066, -45430, -188601, 311213, -285815, -413249, -340668, -91304, 52406, -119235, -141584, -275295, 125043, -259688, 15397, 140622, -130893, -338741, -130717, -117771, 44176, 30695, -399862, 35652, -150918, -206284, -120514, -261599, 346548, -39485, 229228, -254004, -298582, 87264, -175875, -93368, 154835, 2033, 141761, 97663, -156271, 173698, -241416, -4349, -204309, -48446, 90520, -198032, 75495, -160790, 91678, 152186, -204709, -390672, 16755, -48176, 120308, -37128, 47919, 165949, -48691, -12806, 24601, 7733, -193733, 45577, -63961, -278862, -211345, -123505, -147354]
19087a47354B01633M2216B2744c29858f4015c754B11337c6927A75816C0269b12323
19075a01973D8861c4641j68932j21809M9024B54292h5653A56095B0476a14144
19064a49602j79793A05645i9622d2258n6472J2702k70196g3087A07409n259K20903
19053C23053b30681C0952J73226J05196a32431e4480A1710R4020E0845K1515a59387
19041d91217b01511P1759L7896j94585c5363E5433a22958D0493c03904R9613B4456
19029b57842A03139b91393L3411b5540H1780g097k09651g2920E1563A0451K35919
19018B46370c92240b2431q6172A36426i4123d702B64322F316L0193f1031q5360
19007a46391l60259F868c83128b690j32821A84565a70434c4675A44881a32960
$$ y = [-147354, 201633, 243849, 22744, -329858, -64015, -3754, 211337, -36927, 175816, 30269, -212323, -101973, 48861, -34641, -203573, -325382, -276358, 254292, -85653, 156095, 20476, -114144, -149602, -329395, 105645, -99622, -42258, -98730, -86028, -356224, -73087, 107409, 102150, 323053, -230681, 30952, 204178, 309374, -132431, -54480, 11710, 105730, 50845, 72360, -159387, -491217, -201511, -129752, -91856, -286441, -35363, 55433, -122958, 40493, -303904, -204291, 24456, -257842, 103139, -291393, -257982, -25540, 81780, -7097, -216748, -72920, 51563, 10451, 246370, -392240, -22431, -108603, 136426, -94123, -4702, 264322, 6316, 36509, -61031, -146391, -506650, 6868, -383128, -2690, -135511, 184565, -170434, -34675, 144881, -132960]
18996C0589Q7460a90521L2720F6707b46408j05284e0953n2614B7676A3614a08103
18984b46868a4058H7320a08925j26891C8806J22871a93799C23403B5966K6044
18974E2010L6046a05517j36041d0467B24544e7203B5778b14701A9111M7947i2342
18962a88007l6371a06331p4860p1277C3171b6683k0145l07252J3015N0167c966
18950a90779l9761P9418I773K49265K9091q6643l3996a5344j9559l47836E2097
18938i9640k83434a79065A18587b22620a822n2763F9373a04809J8433k78536J45916
18927b18996R6158J2300K4203b2990o7956c7523D4625P7350B3284N8068a13541
18915F5427d7170A26819c95641a71701B8151a01532J7913B2515d7091k717G8252
$$ y = [30589, 118049, -190521, -157801, 66707, -246408, -351692, -50953, -103567, 27676, 13614, -108103, -246868, -14058, 87320, -108925, -235816, 38806, 161677, -193799, 323403, 25966, 52010, 88056, -105517, -241558, -40467, 224544, -57203, 25778, -214701, 19111, 67058, -92342, -188007, -224378, -106331, -181191, -252468, 33171, -26683, -46828, -354080, -341065, -290898, -3966, -190779, -230540, -151122, 9773, 259038, 288129, 201486, 167490, -15344, -34903, -382739, 52097, -99640, -383074, -179065, 118587, -222620, -1822, -54585, 69373, -104809, -86376, -364912, -218996, -122838, -110538, -86335, -22990, -90946, -37523, 44625, 121975, 23284, 81352, -113541, 65427, -47170, 126819, -395641, -171701, 28151, -101532, -83619, 22515, -47091, -49808, 78252]
18903g3661m8589j9110A59671a7501l63260E9866a82275A369R1402K5169b31558
18891d1949A17198c15014a47700b6023H6141E683a26852B0630a46126G983g3465
18879c76359r9131a12367C4022a32233j65849i8677E481d42114H064a87069g4307
18867H931c1316H837g3764a5574k43962P6377F7919c05302B09285C9409j8457
18856B0952b45373k94505g336q1719G2928c33768B1479a83813b1014p0000A20137
18844B10371B3336d9218m5540B66695a75097O4826d2920F3287j2371f1194r9453
18833a60647j06081p7083H0334E454b5314C3872b40047A84808F6471b53636J02332
18822a51304k49195f3547j29789A68711B0381K27045A22590a16656B84740b90223
$$ y = [-73661, -122250, -141360, 159671, -17501, -380761, 59866, -182275, 1369, 92771, 117940, -231558, -41949, 117198, -315014, -147700, -26023, 86141, 5683, -126852, 20630, -146126, 7983, -73465, -376359, -475490, -112367, 34022, -132233, -298082, -98677, 5481, -442114, 8064, -187069, -74307, 8931, -31316, 8837, -73764, -15574, -259536, -183159, 67919, -305302, 209285, 39409, 20952, -245373, -539878, -7336, -89055, 72928, -333768, 21479, -183813, -21014, -91014, 120137, 210371, 23336, -49218, -94758, 266695, -175097, -110271, -42920, 63287, 50916, -61194, -160647, -266728, -343811, 80334, 5454, -25314, 33872, -240047, 184808, 66471, -253636, -151304, -400499, -63547, -193336, 168711, 20381, 247426, 122590, -116656, 284740, -290223]
18811i1551C11412a81753P9560c503l34737L302g2884B1731F388i8313C2511j2626
18799A9885c08749a11651K4023A18448J9476d2823A42761a11204H7923a27280
18788b29187g9423A26020K4596a26897N2443G9821b32625O5760A86774e7989Q821
18777d9168A44788D0097a95254B76080H8958a12120j08727A04854a5125j76330
18767a91455L4530a1996k5599k42725k52980J14854I7247a71863Q926j37230A11197
18755a52048c2474j23996E5078K6976L1798c65066A22150b85445B5944f3487k24774
18744b88261a32321j4193I0972C0961a29033K9981G8645j4786k9943d68249A59539
18732A9843J97190B8384O0398A9102J33205b43792a01186c9096k3646j75609C56538
$$ y = [-91551, 311412, -181753, -102193, -3503, -338240, -334938, -72884, 21731, 6388, -98313, 32511, 19885, -308749, -111651, -87628, 118448, 137924, -42823, 142761, -111204, 87923, -127280, -229187, -79423, 126020, 150616, -126897, -74454, 79821, -232625, -166865, 186774, -57989, -49168, 144788, 40097, -195254, 276080, 88958, -112120, -220847, 104854, -15125, -191455, -156925, -11996, -37595, -280320, -533300, -418446, 97247, -171863, -162937, -300167, 111197, -152048, -32474, -156470, 55078, 82054, 113852, -365066, 122150, -285445, 25944, -63487, -288261, -132321, -146514, 90972, 30961, -129033, -99052, 78645, 63859, 33916, -468249, 159539, 19843, 217033, 28384, 88782, 19102, 152307, -243792, -101186, -39096, -62742, -238351, 356538]
18720A40420J81413e372A41323a40603M4658A48718a90704o7702A6286J2155e1072
18708F5500c2531l9541j13286c4247k75817A78630G4393b23288b0153l6005m8559
18697a04717j30054A5453a02733A67746P5435a05507l49920A17522g6977P787
18687f9190K4917l07738f4768p6461o1841p1490i498B28365f2067l23438c3790
18675b62339N6050p4607B44220C9699b89328E0526J1616O9018a39810N9642j2303
18664i2471A08093a27024c2535j87412J04132k3474k81436a02279F6401c41555
18653C5458a30048n8401A96029b17232A32726K7112g0940H7101a81497P7704A99853
18641b06719A86898a47271j26275a04320I6422d9945k90181f0284A9321i905j13074
$$ y = [140420, 321833, -5372, 141323, -140603, -95945, 148718, -190704, -258406, 16286, 28441, -51072, 65500, -32531, -72072, -185358, -34247, -310064, 178630, 74393, -223288, -20153, -56158, -104717, -234771, 15453, -102733, 167746, 243181, -105507, -455427, 117522, -76977, -69190, -44273, -352011, -64768, -141229, -203070, -274560, -9498, 228365, -62067, -385505, -33790, -262339, -206289, -280896, 244220, 39699, -289328, 50526, 62142, 131160, -139810, -80168, -92471, 108093, -127024, -32535, -219947, -115815, -139289, -420725, -102279, 66401, -341555, 35458, -130048, -188449, 196029, -217232, 132726, 159838, -70940, 87101, -181497, -103793, 199853, -206719, 186898, -147271, -273546, -104320, 96422, -49945, -340126, -60284, 19321, -9905, -122979]
18630a22979j0962G1996M6858g4988C5851b40598J11643m8408C81779a15588c8594
18618a13658k12382N6678g1317Q458A69273H1373b8910j35163j67353A45753a48817
18606C2772b00406C51K03836c76616i454j19231A4253N3109J47883A1715a19768
18594c04611Q0966A02029c5367l87432J51387a25420B2270K4154a99653M0835
18584a58818A03551J29430a34735j409L1693G3784a15683o7343O9195C51555I2911
18572A07416J84029H5463a71208C1704K23804b4358G8861b4009I2721k6745j3181
18561E2795b56123A78413B0669o552c91909K4396a79511A28571a42070B8226c02793
18549A31806g9472D7524L2866M3132c01682I1251k6594m714a8251j15253l61551
$$ y = [-122979, -133941, 71996, 118854, -74988, 35851, -240598, -128955, -177363, 381779, -115588, -38594, -113658, -326040, -269362, -71317, -62859, 169273, 81373, -28910, -164073, -331426, 145753, -148817, 32772, -200406, 351, 204187, -376616, -9454, -128685, 14253, 67362, 215245, 11715, -119768, -304611, -223645, 102029, -35367, -422799, -271412, -125420, 22270, 46424, -199653, -158818, 103551, 232981, -134735, -136144, -104451, 73784, -115683, -183026, -113831, 351555, 92911, 107416, 291445, 85463, -171208, 31704, 255508, -24358, 78861, -24009, 92721, 65976, 52795, -256123, 178413, 20669, 14117, -391909, -367513, -179511, 128571, -142070, 28226, -302793, 131806, -79472, 47524, 80390, 123522, -301682, 91251, 64657, 59943, -18251, -133504, -495055]
18538d95055a6055k20531A43687d2092j58155L5061c3650k15353B4069c80990
18527f6767j33696J8385A65952d31207a85376K7074j482A78067b16352j90098
18517d06450g6125c6094A4273M40786c12868a01090c0617l22748a67227q3988
18507b51215C1917g3824q936C77520h1243A42781R2792h4522k94579B35045a04724
18495A42281P9808I4451k2666f800l7579H1761f8954A7308a71584d7339C67782
18483H1617d43721g9874B8596a40115E4228P3799j6753b08194A54914a3429H2066
18471B27197h3932A33390g3194l15873E52017b23643n1489P6395F1045a29773
18460A73873a74542L4652A8187c3658o8642A60848R6653c05181C1490M324d56405
$$ y = [-495055, -16055, -236586, 143687, -42092, -200247, -165186, -33650, -249003, 24069, -380990, -66767, -200463, -182078, 165952, -431207, -185376, -158302, -159784, 178067, -216352, -406450, -76125, -36094, 14273, 455059, -312868, -101090, -30617, -353365, -167227, -251215, 31917, -73824, -82760, 377520, -81243, 142781, 235573, -84522, -379101, 235045, -104724, 142281, 222089, 94451, 71785, -6800, -44379, 81761, -68954, 17308, -171584, -47339, 367782, 81617, -443721, -79874, 28596, -140115, 54228, 128027, 111274, -208194, 154914, -13429, 82066, 227197, -83932, 133390, -73194, -389067, 552017, -223643, -275132, -198737, 61045, -129773, 173873, -174542, -139890, 18187, -33658, -102300, 160848, 257501, -305181, 31490, 35814, -456405]
18448D8788K3688C519e0018j79576G6547a15436A33192k6740c32926B71467q1158
18437A90309a21855A62576N6143a156j75237G3907a5604m63130f9400k4842p6482
18426a70724B00604a05531K4795r3215A54434I823Q7999P3165a12444B89897e013
18414b43238a10150j14423B98431j1183G3593b87207E272h6132A5616J3838c06780
18402i7467j10168A64724B0878c6727P902B14008a16432A52944b52746C25809
18391a50554A55109F4666a44620N6336p5143A48803g2978A74292c06669H3307
18380a18427C07541b28416a10252L254d5255B3380f3852j05317b3833j78969A58051
18368A30426a77360J9883j36191J46705H3745d3053o5922A00905a09723j59915
$$ y = [48788, 72476, 3519, -50018, -229594, 76547, -115436, 133192, 106452, -332926, 271467, 190309, -121855, 162576, 218719, -1156, -176393, 73907, -15604, -478734, -69400, -94242, -170724, 200604, -105531, -80736, -173951, 154434, 9823, 97822, 170987, -112444, 289897, -5013, -243238, -110150, -224573, 298431, 287248, 73593, -287207, 5272, -86132, 15616, 29454, -306780, -97467, -207635, 164724, 20878, -36727, -28825, 214008, -116432, 152944, -252746, 325809, -150554, 155109, 64666, -144620, -88284, -163427, 148803, -72978, 174292, -306669, 83307, -118427, 307541, -228416, -110252, -106998, -45255, 23380, -63852, -169169, -23833, -202802, 158051, 130426, -177360, -157477, -293668, -146963, 83745, -43053, -108975, 100905, -109723, -269638]
18358b69638j4855k3214i8074K9656j6358A37698a59940m9939F1977A5182K41296
18347B56478a41530j9277M6920A11318g8443G2802c3972N149G031L37087n2594
18336B91524d1312l92051a35711J4524q5893B63067H4979L5613h0701R596k83927
18325c55032J72186k2695B81602A36354M35118H8609J39082B1948a23998B91323
18314d3066m4818j4965j30224a10034B2083J78341n6508g1056m6179A9380a27787
18302C6516P753a45442e3401o9750n2326A39631a10975j10142b3982C46892b12320
18290f1913B10352d67007i8385B41421e6047A89796J63186C7704K37036A28822
18279b07955B57448H9736b26838B97151b02977A81774B2975d6515A95654r2599
$$ y = [-269638, -284493, -307707, -98074, -68418, -84776, 137698, -159940, -209879, 61977, 15182, 256478, -141530, -160807, -113887, 111318, -78443, 72802, -33972, -28823, 7031, 344118, 291524, -41312, -433363, -135711, -121187, -207080, 263067, 84979, 120592, -80701, -71105, -355032, -182846, -205541, 281602, 136354, 571472, 88609, 227691, 21948, -123998, 291323, -43066, -87884, -102849, -233073, -110034, 22083, 200424, 143916, -71056, -117235, 19380, -127787, 36516, 44269, -145442, -53401, -123151, -175477, 139631, -110975, -221117, -23982, 346892, -212320, -61913, 210352, -467007, -98385, 241421, -56047, 189796, 352982, 37704, 274740, 128822, -207955, 257448, 89736, -226838, 297151, -202977, 181774, 22975, -46515, 195654, 103055]
18269A03055J7356K84124d10057J99365A7740P0825Q09n851b20671B26952l3653
18258A93299D6865b42354k31477B14601c852j38278C78548b23128B27001b81094
18247d4645o210j15332l08138i330q2901a7068A39665b56033G6438h1200D73991
18235c42206F25475d9597n3550K2124C07911A33371N5240a09796G9589i8248B22007
18223A37754E0255j0294J5432M69070F1621L18315G2073b02935K8534B70685B4475
18211H7135K69933E7217K51898d0700j81346H9359K5218a70869g1738B72338r0995
18200A81343c3743j82461d6745j12676j63078a52133G7322a13458C0910J42825
18190A73735c1156k04962a8809o3521b5347k90188A07623N1341a57479e5307p3677
$$ y = [103055, 120411, 404535, -410057, -210692, 17740, 88565, 89374, 83523, -220671, 226952, 193299, 46865, -242354, -473831, 214601, -3852, -142130, 378548, -223128, 227001, -281094, -44645, -50855, -166187, -474325, -9330, -92231, -17068, 139665, -256033, 76438, -81200, 473991, -342206, 625475, -49597, -103147, -81023, 307911, 133371, 188611, -109796, 79589, -98248, 222007, 137754, 50255, 39961, 55393, 524463, 61621, 379936, 72073, -202935, -174401, 270685, 24475, 87135, 357068, 57217, 309115, -40700, -222046, 89359, 114577, -170869, -71738, 272338, 181343, -33743, -216204, -46745, -159421, -322499, -152133, 77322, -113458, 30910, 173735, -31156, -236118, -18809, -82330, -25347, -315535, 107623, 158964, -157479, -55307, -128984]
18179a28984M1023A45383n9188J72051d7959A8221H406J34104D8834a28741A38491
18167A38116F950M2518J87378a05108A06439B3108K84282A27179g3805G034c5194
18155d2788j06798B0653b44717L4741a2291r1463A40068a52874q3425E8773c46978
18143A7225f2300B68986k3b17409a4102A51035m6693a82964A57666D6179b30878
18131b18256A87517d1577k65275B16931a67831B07642i7494k1068B97568p0453
18121B27115a44379H0816b50922A18007g134m7716K0461l6878E1640a28499l9125
18110a67624Q0987j3188C06076j10087c9426j99537G575b98251H5145K88370b5438
18098h8932j04102H2K3130h4205F1306k3328l949c4647A58582d39521g2078C4639
$$ y = [-128984, -87961, 145383, 86195, 258246, -47959, 18221, 8406, 142510, 48834, -128741, 138491, 138116, 6950, 49468, 236846, -105108, 106439, 23108, 307390, 127179, -73805, 7034, -35194, -42788, -149586, 20653, -244717, -209976, -12291, -103754, 140068, -152874, -236299, 58773, -346978, 17225, -62300, 268986, 268963, -217409, -14102, 151035, 104342, -182964, 157666, 46179, -230878, -218256, 187517, -41577, -306852, 216931, -167831, 207642, -97494, -118562, 297568, 227115, -144379, 80816, -250922, 118007, -7134, -54850, -34389, -71267, 51640, -128499, -167624, -86637, -99825, 306076, 195989, -39426, -238963, 7575, -298251, 85145, 373515, -25438, -88932, -193034, 82, 23212, -84205, 61306, 37978, 34029, -34647, 158582, -439521, -72078, 34639]
18085b113B32279c3171B52224A18368a24070B07265m8642J1893i796f30F2069
18073i2949A78041o1570c771B52305J40770A25190c08128B92577D5437c8122Q229
18062b9893A26029L7656a21064I3642C4659b43682A73278F3358j1033a54328F6268
18050B43271a3021A61129J55354b43022B71627b95710h4415l609C467b55008I7233
18038A5632M9711J49041a760n1193I7318N5977k7803J93166h627j26053a5529
18026g5265k3465B24110C6064K2316c18203b9413m9002D4108P6608a66487E131
18014A04465C817J31346a6582A16096J15011I7072L07752A54452m0986J16195
18004B29661h9149L6172A00406K31365f7341A31284F0604a63843P0137B21025
$$ y = [-2113, 232279, -33171, 252224, 118368, -124070, 207265, 158623, 170516, -9796, -630, 62069, -92949, 178041, 116471, -3771, 252305, 393075, 125190, -308128, 292577, 45437, -38122, -29893, 126029, 163685, -121064, 93642, 34659, -243682, 173278, 63358, 52325, -154328, 66268, 243271, -13021, 161129, 316483, -243022, 271627, -295710, -84415, -88024, 3467, -255008, 97233, 15632, 65343, 214384, -1760, -52953, 97318, 153295, 125492, 318658, -8627, -134680, -15529, -75265, -98730, 224110, 36064, 58380, -318203, -29413, -78415, 44108, 120716, -166487, 5131, 104465, 3817, 135163, -16582, 116096, 231107, 97072, 404824, 154452, 113466, 229661, -89149, -52977, 100406, 331771, -67341, 131284, 60604, -163843, -93706, 221025]
17993B84041j26738c51319e1479j40336A0976e5324k9817B49922B9197i0170C84552
17981E9747M3208k0035J43998b17852B39077j6299b3349H238M5973k5255N0189
17970G9145a92360A70657b22615A49834A1780K97672E3862j1688J32896a65163
17959d2492g340B37701a07034j8254A58798A3049a77700C90784a87627M5619F2208
17947B25758I0897k3985a7780B4435Q3158l3980g2809A84536J42593I8862F029
17935A03776a25230A6007K59208K3124j06078K4836d36607A02989J28439a00668
17924B17781a98384R0672P609D986J11011K87547j00088J20465E295P4668K64896
17913C44859A30518J3931E0706e4311j64394B28916j2757a07997r6622A1796c54937
$$ y = [284041, 157303, -351319, -51479, -191815, 10976, -55324, -85141, 249922, 29197, -90170, 384552, 59747, 102955, 82920, 226918, -217852, 239077, 222778, -23349, 8238, 54211, 28956, 79145, -192360, 170657, -222615, 149834, 11780, 309452, 53862, 42174, 175070, -165163, -42492, -7340, 237701, -107034, -125288, 158798, 13049, -177700, 390784, -187627, -142008, 62208, 225758, 90897, 66912, -17780, 24435, 107593, 73613, -72809, 184536, 327129, 98862, 6029, 103776, -125230, 16007, 275215, 298339, 192261, 217097, -436607, 102989, 231428, -100668, 217781, -198384, -107712, -100103, 4986, 115997, 403544, 303456, 423921, 5295, 79963, 344859, 130518, 144449, 50706, -54311, -218705, 228916, 216159, -107997, -204619, 11796, -354937]
17901G3496a79855B45054a61422J9166C97505C71L51356c6112A60119i493j14812
17890a24305D05302b16271C20346e298B62623D7566K80097P5567D1965a39796
17879B48395H4118m866c9923B94840k073A13069g1873C974J38460L2077J31085
17868C05596o6022C1215J34176e9614A58075p8345a57375f0253G9580a62359C4261
17856B4737L8457P2110K18073A51819n4682K7551D3665i8018B35629E5106a21265
17844B97497A3922R9392i2599l8072C20437g9522j7160a1017j68207F16313I6896
17832a05453A2052b22353A47602c8646C23350D1795b2902B87284c5185B65645
17821a22166B62096j10545J78976H2830C9902a28199A12616O0122K25559j64204
$$ y = [73496, -179855, 245054, -161422, -142256, 397505, 371, 351727, -36112, 160119, -9493, -124305, 405302, -216271, 320346, -5298, 262623, 47566, 327663, 403230, 41965, -139796, 248395, 84118, 79252, -39923, 294840, 292767, 113069, -71873, 3974, 142434, 174511, 305596, 239574, 31215, 165391, -59614, 158075, 79730, -157375, -60253, 79580, -162359, 34261, 24737, 63194, 135304, 353377, 151819, 97137, 124688, 43665, -98018, 235629, 55106, -121265, 297497, 13922, 113314, -92599, -130671, 320437, -79522, -96682, -11017, -179224, 616313, 96896, -105453, 12052, -222353, 147602, -38646, 323350, 41795, -22902, 287284, -35185, 265645, -122166, 262096, 151551, 330527, 82830, 39902, -128199, 112616, 172738, 398297, 234093]
17811B34093p1841A2404J0868K45479F4428J63618A10269L5816L5309m8844E6460
17799B92045h1048A13970a9752j36158F6783K4617a91827o5533B88166a50747
17788A31809J35249A28297c9727A85787B0368K39978R3529p1791l634e172C10064
17776A92949A4804h5520A90076B5244J9062b40059C32905e3870B98372J49654
17766D48026j19548p5208o2232n9301b01079A57054b1360I4060K8274m3622a23986
17754C92917j22570l0743H4145j7607K36524A3661M07442D1426J03761Q2909B0565
17742A31587e1756A7732g5375E9869k0525N5638q620g5685C96642b8396I4702
17730A91924b48987E5439J58040e7694A37891B5880a06430A13993J41789a72440
$$ y = [234093, 162252, 12404, 23272, 268751, 64428, 228046, 110269, 146085, 181394, 132550, 56460, 292045, -81048, 113970, -19752, -155910, 66783, 91400, -191827, -257360, 288166, -150747, 131809, 267058, 128297, -39727, 185787, 20368, 260346, 353875, 282084, 278450, -5172, 310064, 192949, 14804, -85520, 190076, 25244, 44306, -240059, 332905, -53870, 298372, 448026, 328478, 253270, 191038, 131737, -201079, 157054, -21360, 94060, 122334, 78712, -123986, 392917, 270347, 239604, 84145, 66538, 303062, 13661, 421103, 41426, 145187, 228096, 20565, 131587, -51756, 17732, -75375, 59869, 39344, 94982, 86362, -75685, 396642, -28396, 94702, 191924, -248987, 55439, 213479, -57694, 137891, 25880, -106430, 113993, 255782, -172440]
17719A50671J8015B1140f1477a3023C12335R5951A2513K95682a96365B37398n699
17708B31699C7644M7900K1129J70120a2172A95019M6901g4980A37997K14511A15345
17696D13299j32557c61278a5775F6928J44135N4795A02120C6326i6096d6537B19749
17684b9876p6663L547A83048m6786a9621G1494j5678k2289J30214m2926M6269
17673A67084a94867A51375j0427b491A79557j597b99865A54817R5392G7234j6901
17662F0333K32914I9560e4909A01946J49283m8598M7991j07039a77626j02692
17652b80318A65287O9534a83638A07164J82750G487b46306B19896C5844M1343
17642G7187P105L5406C3524a12794B46771d1791A59231N4931f2975E71284B10996
$$ y = [150671, 168686, 21140, -61477, -13023, 312335, 408286, 12513, 308195, -196365, 237398, 231699, 37644, 85544, 106673, 276793, -12172, 195019, 241920, -74980, 137997, 352508, 115345, 413299, 280742, -361278, -15775, 66928, 211063, 265858, 102120, 36326, -96096, -46537, 219749, -29876, -106539, -102992, 183048, 136262, -19621, 71494, 55816, 33527, 163741, 120815, 167084, -194867, 151375, 140948, -2491, 179557, 177960, -299865, 154817, 250209, 77234, 60333, 293247, 99560, -54909, 101946, 251229, 202631, 250622, 143583, -177626, -280318, 165287, 234821, -183638, 107164, 289914, 7487, -246306, 219896, 35844, 77187, 84292, 119698, 33524, -112794, 246771, -41791, 159231, 214162, -62975, 571284, 210996]
17630a14449A48803J6774c9020I5103M770C995K20122n5688Q2702D1383c5930
17618E4201a54920B22163m571L0683i8128B84917j31367J5253M3025J2618J4271
17607B38717j9451i188j25193D36006E4471K62933g9507E57464B49693H043J64632
17596A72675J04813a29378B04697J12113M7462j54906r1395n2221M25841H9687
17585B38275J8471d0970e090q3776A23788P3458o3378l1479K63905j60712Q6668
17574B92250P3500Q4421C1630K21164j21732K26200H8702j592J06838L06142I4416
17562B92322A862K76332C137J58573B1372a03090a4627C58568q4650P7931c1480
17550C22515f5864C2239M0533M1740i2627D43730i0916H8936J28157e6609A73411
$$ y = [-114449, 148803, 165577, -39020, 95103, 99873, 3995, 224117, 168429, 251131, 41383, -35930, 54201, -154920, 222163, 217592, 248275, -98128, 284917, 153550, 168803, 211828, 224446, 238717, 219266, -9188, -134381, 436006, 54471, 317404, -79507, 557464, 249693, 8043, 172675, 277488, -129378, 204697, 316810, 364272, 209366, 117971, 65750, 491591, 89687, 238275, 256746, -40970, -5090, -88866, 123788, 197246, 133868, 102389, 366294, 205582, 292250, 365750, 450171, 31630, 252794, 131062, 357262, 88702, 87110, 193948, 500090, 94416, 292322, 1862, 278194, 3137, 161710, 21372, -103090, -14627, 358568, 273918, 351849, -31480, 322515, -65864, 32239, 72772, 114512, -92627, 443730, -90916, 88936, 217093, -56609, 173411]
17538A76678J31866C9960N7209Q2049m1312J55664E7417J69454o5566R5607j12910
17527A44002d5339A41775J68424O5275j01317Q9325f0686C26751K15433A55341
17516H8451a79279A07742c11338C96038A56443K35092I52J60577e6690A27021
17505D73549A79527o9580K13973F9691L20307L616B5686K18632c9966B03772J16054
17494C19826d451E28710k26496A47584M07781H753K15208j11778K40970j5730
17484C37423A5862R8141K86254r0834b95683D20909j10313j49167L04165b9928
17473D89762j99028m4473J88172q4182D6009J65078a02666C25678G1624j5312
17463E6312I654b183A32669a80651A97464J54000K2809E5112L01086G1253P4852
$$ y = [176678, 308544, 39960, 97169, 179218, 137906, 293570, 57417, 226871, 161305, 256912, 144002, -45339, 141775, 310199, 375474, 274157, 363482, -60686, 326751, 542184, 155341, 88451, -179279, 107742, -311338, 396038, 156443, 391535, 952, 161529, -56690, 127021, 473549, 179527, 109947, 323920, 69691, 389998, 393614, 25686, 244318, -39966, 203772, 319826, -4451, 528710, 302214, 147584, 555365, 8753, 223961, 112183, 353153, 337423, 15862, 114003, 400257, 309423, -295683, 420909, 310596, 161429, 465594, -29928, 489762, 290734, 246261, 434433, 350251, 46009, 211087, -102666, 325678, 71624, 56312, 9654, -2183, 132669, -180651, 197464, 351464, 374273, 55112, 356198, 71253, 146105]
17452A46105J61658Q4469J28837k42539j17286K68676j03242J20257j09974r4879
17442B42082O57220l49376k67230K4833N1484j66196Q9128K16423J32727B85964
17431C47660J37651J0637j30161j43459F4005K15007Q1204r8843N583K1364K17753
17420E06073r4499j15830M00125k65427P2799L0803k42459K85976j72984j08811
17410B95766J64709k29451n0349J62394K03818B69970A17364J08946K270n7439
17400A71141J0236J80377A12265O7703J98317H6492J58548J72173j71917N8452
17390C03748q6564I3593N2484J26618H6189M75129j17913I8404L97424j93953
17380C01875F2292O03762k58466A20029L3235O9054K33210p4193A75754K82750
$$ y = [146105, 307763, 392232, 521069, 278530, 161244, 429920, 326678, 446935, 336961, 242082, 899302, 549926, 282696, 307529, 359013, 192817, 281945, 498368, 631095, 285964, 347660, 485311, 495948, 365787, 222328, 64005, 279012, 360216, 261373, 266956, 288320, 506073, 411574, 295744, 695869, 430442, 503241, 534044, 291585, 577561, 404577, 295766, 460475, 231024, 180675, 343069, 546887, 269970, 117364, 226310, 228580, 171141, 181377, 361754, 112265, 179968, 378285, 86492, 245040, 417213, 245296, 303748, 217184, 93593, 146077, 272695, 86189, 561318, 443405, 98404, 495828, 301875, 62292, 666054, 407588, 120029, 153264, 222318, 455528, 381335, 175754, 458504]
17370D58504j37616j35264L05849m951A68180L1068b0075B75283J1953k6360L2391
17359B93267l6568J62250l7144n742j07106j01145R7948j0812Q2343L08557k69492
17348C76356N6282J18669m543B40088K80996n6822j27429R974m2688m904N5844
17337C55059D556J03314K53503O7118p8619a1120D47787n9351E7924K07108r9477
17326A65555L5686A3475Q4224A5235J27602J55088J96969C8959L98506A56532
17315A21826J95453L7667A45016L20040B13850J18341K1212a54285H8273L85112
17305D73385H8053J06405D3599K22283q1595J1930o5505C2875L24815m4102j48251
17294A65337n1723R4211k7767F6682J0623L39113H0592K70806j26580M3643J75271
$$ y = [458504, 320888, 185624, 491473, 486522, 168180, 199248, -20075, 275283, 287236, 260876, 293267, 256699, 418949, 381805, 376063, 268957, 167812, 265760, 254948, 337291, 645848, 376356, 432638, 551307, 546764, 240088, 521084, 464262, 336833, 346807, 304119, 299215, 355059, 4556, 107870, 361373, 428491, 349872, -11120, 447787, 388436, 57924, 265032, 165555, 201241, 13475, 97699, 15235, 142837, 297925, 494894, 38959, 437465, 156532, 121826, 317279, 354946, 145016, 465056, 213850, 332191, 353403, -154285, 88273, 473385, 88053, 194458, 43599, 265882, 184287, 196217, 130712, 32875, 357690, 313588, 165337, 113614, 207825, 180058, 66682, 77305, 416418, 80592, 351398, 224818, 268461, 443732]
17283D43732I7578N8173L40059k08536j42186L34169h9849B12395J92831l9825
17273C65401h422L848B04625L05687B49949g3210B53114J57986j88323J51075
17263C73852J38521E0489J59394G5190K32190K17921k38063K13813c7084C16045
17252D19511k08899J8387P2667J63935j45476n9907j8161K01610j45499J92543
17242D90711n6831A01460L06629P0123A54583J82555M67310B14980J91102J80048
17232E86130j40449j81327l4724K35294k27348K488L8097L18261B22216O2240
17222B84456R9774l3156A8909N14511B39638j2298N256p9499K32339J65486k54704
17211B96218r2039p1049K54389E4253L38673l6737R2989K618K1820k19736A16390
$$ y = [443732, 97578, 155751, 495810, 287274, 145088, 479257, -89849, 212395, 405226, 365401, -8422, -4574, 204625, 510312, 249949, -73210, 253114, 411100, 222777, 373852, 512373, 50489, 209883, 75190, 307380, 525301, 287238, 501051, -37084, 316045, 419511, 210612, 228999, 301666, 465601, 320125, 260218, 242057, 443667, 298168, 490711, 433880, 101460, 408089, 478212, 154583, 337138, 804448, 214980, 406082, 586130, 445681, 264354, 229630, 464924, 237576, 240064, 278161, 596422, 222216, 284456, 384230, 351074, 18909, 533420, 239638, 227340, 232596, 153097, 385436, 550922, 296218, 204179, 133130, 387519, 54253, 392926, 356189, 449178, 451796, 473616, 253880, 116390]
17199F76688k67449j8480K13138j00040A83558N6878Q389L1839K7432j23692N5754
17188B40158E4879L13444J94000K11747l78989L7152n0830L63315l31498M52916
17178H66136D30575j7515G0089J46353L33538A84138M98804j02702J87163C23648
17167E2627M62477B04830N78348r2530k75550R5252P2247B37574J1810K88384
17157E37768L18098l01420o7304L00978k49593L6812j229O5362j92627K46485
17147F93330k80475p7435K02162j9585J10567q7426j7486j35793L9389k0535R8549
17136E05262O0862j48727J11191o9423j36295J07103K11918j0369j2438j01672
17126E17412o4158N4592M7654k24966L09743k72200J66414k53194o5766J95002
$$ y = [676688, 409239, 390759, 603897, 503857, 183558, 240436, 248825, 280664, 308096, 184404, 240158, 54879, 368323, 562323, 774070, 395081, 432233, 381403, 744718, 413220, 866136, 430575, 413060, 70089, 216442, 549980, 184138, 682942, 580240, 767403, 323648, 52627, 515104, 204830, 783178, 690648, 415098, 510350, 582597, 237574, 249384, 537768, 855866, 554446, 487142, 788120, 538527, 575339, 574110, 639472, 446845, 693330, 412855, 335420, 537582, 517997, 628564, 541138, 523652, 387859, 427248, 406713, 505262, 566124, 417397, 528588, 459165, 322870, 429973, 641891, 631522, 619084, 517412, 453254, 507846, 555500, 330534, 640277, 368077, 534491, 281297, 215531, 410533]
17116D10533M9289L53635C82810K21367k17441K79422j28190J93182l41962j3798
17106C75390K48647n2581P4609k40385n7956M45810n7574j39163J3038J82241
17096G92076C73326M53861l73762K94802k50809K87976M9069j51765O7666j82799
17086E67565K92294C32120L22481j07094L20898J55680k7913J09749k65270L3407
17076H74058k99385K50300p8193J17j79179J65568k85262L76936n990Q8241J86975
17065A094186P2481j19552j59628J80499j28256O5195k07957o0080k14995L59471
17055H81364r3055L3114J3427j51149J56173j11142k84779J18854J30253j64038
17045E29022L42724l96661J84864N6984k3329R5645K95636l56728o3580K77335
$$ y = [410533, 459822, 813457, 382810, 604177, 386736, 666158, 537968, 731150, 389188, 375390, 624037, 571456, 646065, 405680, 347724, 793534, 735960, 596797, 609835, 792076, 373326, 827187, 453425, 748227, 497418, 785394, 834463, 682698, 750364, 567565, 859859, 332120, 654601, 547507, 868405, 1024085, 996172, 1105921, 840651, 874058, 574673, 824973, 746780, 746897, 567718, 733286, 448024, 824960, 818970, 907211, 1094186, 1166667, 1047115, 887487, 1067986, 939730, 1004925, 796968, 736888, 521893, 881364, 788309, 821423, 834850, 683701, 839874, 728732, 443953, 562807, 693060, 529022, 871746, 475085, 659949, 716933, 693604, 789249, 1084885, 728157, 664577, 941912]
17035I41912K69185m36585q4627L09875j64831K5051l42145L14029M9927j26715
17025G55076K71416l82278L38283j7255j73345j1581j49442J90271K76551m32377
17015F65319L70828l26234L85218m63667K2968L78203J04637j93142K89595k54157
17005I79568j10899J64965k31975K24874k10483P0664r5067K16913K6520P7504
16995A112584q1981K80416q3696j82685m9935j78002N26278n02637L43127o6251
16985A117218K0559j9330j61525L7567K04050j01652k68796J65536K39097l04856
16975I27868P9508K11815Q6434Q6286l48217K58023k40866K02807l34733L09540
16965A238465N630J80913j90734j42805L61817J48735m94368K50377k61458J99496
$$ y = [941912, 1211097, 774512, 689885, 999760, 834929, 859980, 517835, 831864, 881791, 755076, 1026492, 644214, 982497, 965242, 791897, 780316, 630874, 821145, 1097696, 665319, 1036147, 709913, 1095131, 631464, 654432, 1032635, 1137272, 944130, 1233725, 979568, 868669, 1033634, 801659, 1026533, 816050, 886714, 791647, 1008560, 1035080, 1112584, 1030603, 1311019, 1227323, 1044638, 994703, 816701, 1342979, 840342, 1183469, 1117218, 1137777, 1118447, 956922, 994489, 1198539, 1096887, 828091, 993627, 1232724, 927868, 1007376, 1219191, 1305625, 1391911, 1043694, 1301717, 1060851, 1263658, 928925, 1238465, 1244095, 1425008, 1234274, 1091469, 1453286, 1602021, 1107653, 1358030, 1096572, 1296068]
16955A296068p2294N88713m97365n4272o506L04178n5264j22470M46864n00912
16945A326740J99850j81128P8465J58505r7844k95166L50605j29783L8988J77073
16935A626305j66873k69587L50435m8817K72271O2956k32458n905m0984N5644
16925A602987L1826k77633K91221J79874j7983j88981L70159q4670J12597k09655
16915A809742q3140J57458J196Q6330k0869l9346P7509l5106J11785l60533M09014
16904B114040N186L81327n54012r5206K63582K97848n3912j8914r4643j24185
16894B121111M2063q4198k25335M93638j80342K94894j19974j23998N67443k01100
16884B584202k96585K530L40979j29766j01985P0955L93966p828j01334j01353
$$ y = [1296068, 1223774, 1812487, 1315122, 1260850, 1254344, 1558522, 1503258, 1380788, 1827652, 1326740, 1526590, 1345462, 1423927, 1582432, 1484588, 1189422, 1540027, 1410244, 1449232, 1626305, 1459432, 1189845, 1540280, 1491463, 1763734, 1826690, 1594232, 1588327, 1547343, 1602987, 1634813, 1357180, 1648401, 1828275, 1810292, 1621311, 1991470, 1906800, 2019397, 1809742, 1726602, 1884060, 1885256, 1971586, 1950717, 1911371, 1988880, 1953774, 2065559, 1705026, 2114040, 2119226, 2500553, 1946541, 1851335, 2114917, 2412765, 2358853, 2339939, 2245296, 2121111, 2163174, 2078976, 1853641, 2347279, 2166937, 2461831, 2341857, 2217859, 2785302, 2584202, 2287617, 2290147, 2631126, 2501360, 2399375, 2470330, 2864296, 2856468, 2755134, 2653781]
16874B653781N20639m64020P6309J16269j22485n1895L70611j15247k6937L97345
16864C354370r366j68957k44988M87518o0455r1361p9922J68084N5526o2779L16495
16853C664165m319J40101k07659L38308j5102n990J67566r8442j67375J92509
16843D003762o7480K87889L3092M00135j13120o28794P22847l72234L65791J41684
16833D773572j11333M03211l51636L57232k2060J7882K34821n2666M16641k81846
16823E383818N4705p5273L95623O8179L22081J12370j77238K76605j76682O86808
16813F870996o2671L891M9023l4088K94296R6890K60822J36997l3420L86313l4589
16802G934460L47557J66337l25672M07405K26774L45167K85689k50589M88981
$$ y = [2653781, 3174420, 2710400, 2786709, 2902978, 2780493, 2728598, 3099209, 2983962, 2957025, 3354370, 3345004, 3176047, 2931059, 3418577, 3358122, 3266761, 3186839, 3354923, 3410449, 3347670, 3664165, 3659846, 3799947, 3592288, 3930596, 3915494, 3909504, 4077070, 3978628, 3811253, 4003762, 3936282, 4224171, 4257263, 4657398, 4544278, 3915484, 4638331, 4266097, 4631888, 4773572, 4662239, 5065450, 4713814, 5071046, 5048986, 5066868, 5301689, 5249023, 5665664, 5383818, 5438523, 5363250, 5758873, 5827052, 6149133, 6261503, 6084265, 6360870, 6184188, 6870996, 6808325, 6812216, 6861239, 6827151, 7121447, 7218337, 7479159, 7616156, 7582736, 7969049, 7934460, 8282017, 8448354, 8122682, 8530087, 8756861, 9102028, 9387717, 9137128, 9626109]
16793I626109l9169J37697M30940R1792L46260J78542L31798K18231M33559N62822
16783A2318581q2783L4483M27175N21597M04651r9558M41430M56718N31045K90918
16773A5244257K08206M25124O04388M55719L89089O97712J90976O57955M76754
16764A9350180M17058O13213P56562P62159J154925j32083P67100Q95580N68357
16755B5153051R91881J088925N95145O81841R23104J432338Q72370J357112J081499
16746C4177266J146232J126291J208249J396089J674120J520069J482785J939496
16738D5670597J496291J631867K038444J921780K120601J752429K432654K375736
16730F1440399K053243K724737K309173K790211K518276K478739K833087K855515
$$ y = [9626109, 9586940, 9724637, 10155577, 10247369, 10593629, 10772171, 11103969, 11322200, 11755759, 12318581, 12235798, 12270281, 12697456, 13219053, 13623704, 13524146, 13965576, 14422294, 14953339, 15244257, 15452463, 15877587, 16481975, 16937694, 17326783, 18024495, 18215471, 18873426, 19350180, 19767238, 20380451, 21137013, 21899172, 23054097, 22922014, 23689114, 24584694, 25153051, 26144932, 27233857, 27829002, 28510843, 29433947, 30866285, 31738655, 33095767, 34177266, 35323498, 36449789, 37658038, 39054127, 40728247, 42248316, 43731101, 45670597, 47166888, 48798755, 50837199, 52758979, 54879580, 56632009, 59064663, 61440399, 63493642, 66218379, 68527552, 71317763, 73836039, 76314778, 79147865, 82003380]
16722H2003380K591054K506277K961766K479359K530953K774115K158482K172637
16714A02178023K066673J916834K019965Q55610J103511R37257M49212K31136
16706A11758221K07813n84796o39352r08576j622773j332841j860377j777829
16698A03239490k089525k287630k670130j887582k862263l280905k430282k475792
16690H3255381k991588k481948k592890k496886k415578k637411k664228k364421
16682F2610431k203997k187349j830879k491727j872859k187233j483265j643628
16674D6709494j790260j644807j250527j652242j522686j597400j174605j266239
16666C4810728j258384r47336j196945q12151j041833q31477j286502m51336j086325
$$ y = [82003380, 84594434, 87100711, 90062477, 92541836, 95072789, 97846904, 100005386, 102178023, 104244696, 106161530, 108181495, 109037105, 110140616, 111077873, 111527085, 111758221, 111966034, 111381238, 110741886, 109833310, 108210537, 106877696, 105017319, 103239490, 101149965, 98862335, 96192205, 94304623, 91442360, 88161455, 85731173, 83255381, 80263793, 77781845, 75188955, 72692069, 70276491, 67639080, 64974852, 62610431, 60406434, 58219085, 56388206, 53896479, 52023620, 49836387, 48353122, 46709494, 44919234, 43274427, 42023900, 40371658, 38848972, 37251572, 36076967, 34810728, 33552344, 32605008, 31408063, 30595912, 29554079, 28722602, 27436100, 26984764, 25898439]
16657B5898439r14530m60628p80829n02946j187214o03979l34512q85888k64561
16648A9963352p40044n62554n29988q3029q09873m06340n34730k35239m94683
16639A5566872j86191m55988o29741j31940p69701r5815j88461m15976l96475
16630A2296584j05931o23650J87542o21748j71823l29806o5695l13243l04483
16621I947747j97613K59461j97245n68229k02791l3187m37226K2940j91908q3812
16611H318137m28426M6107m74602K67599l77011J93664l65009j36408j71361j99637
16601F673053m0375k83306N0441m7161j21910J02460j31168l32345p3095r5799
16591E700795K67997n00665K9839k50383O275J25681k92631N9742l31114j54702
$$ y = [25898439, 24983909, 24523281, 23742452, 23239506, 22052292, 21448313, 21113801, 20227913, 19963352, 19223308, 18660754, 18130766, 18047737, 17237864, 16831524, 16296794, 16061555, 15566872, 15380681, 14924693, 14294952, 14163012, 13393311, 13297496, 13109035, 12693059, 12296584, 12190653, 11567003, 11754545, 11132797, 10960974, 10631168, 10565473, 10252230, 9947747, 9750134, 10009595, 9812350, 9244121, 9041330, 9008143, 8570917, 8593857, 8401949, 8318137, 7889711, 7935818, 7461216, 7728815, 7351804, 7545468, 7180459, 7044051, 6872690, 6673053, 6632678, 6349372, 6399813, 6352652, 6230742, 6333202, 6202034, 5869689, 5796594, 5700795, 5968792, 5468127, 5497966, 5247583, 5253858, 5379539, 5086908, 5146650, 4815536, 4660834]
16581D660834J03953r9917J82024k38715k80019O7483Q6308K53125l09684j41182
16571D284210j03423R6677k68520j01933l79864M58161j00433l55905n5653J82218
16561C655535l1999K32049l55067M4586L36141j38298l16043k81511L13624m87180
16551B971837J68264K50269j52407m7626j25081J11153q1923l33995J32721P11
16541B893923j94993N4832o8018K35730q9955j20946l09212J00242O0211j27424
16531B434390k59919N02017k00236J81713J16271k68828j08731K8492R5846n01209
16521B019806K84887K6309J74409k20719J74405k41562N1678j48321M4114m07277
16511A757729J33197L24489r5525j22608J04759l52093N56719m20481L47135m70234
$$ y = [4660834, 4764787, 4664870, 4846894, 4608179, 4328160, 4395643, 4481951, 4735076, 4425392, 4284210, 4180787, 4277464, 4008944, 3907011, 3527147, 3985308, 3884875, 3528970, 3473317, 3655535, 3623536, 3855585, 3500518, 3545104, 3881245, 3742947, 3426904, 3145393, 3459017, 2971837, 3140101, 3390370, 3237963, 3190337, 3065256, 3176409, 3094486, 2760491, 2893212, 2893923, 2698930, 2753762, 2685744, 2921474, 2831519, 2710573, 2401361, 2501603, 2561814, 2434390, 2174471, 2676488, 2476252, 2657965, 2774236, 2505408, 2396677, 2425169, 2521015, 2019806, 2304693, 2331002, 2505411, 2284692, 2459097, 2217535, 2269213, 2120892, 2165006, 1757729, 1890926, 2215415, 2119890, 1997282, 2102041, 1749948, 2306667, 1886186, 2233321, 1763087]
16501A763087M27136j37409p933j73126K34766q0632k88687p6590J80338l21663
16491A519287K06388K98697k82023N5207Q4366k87023J11468j59070m1643o5028
16481A440626j92319K07229M00249m15576N22837m09770J8336k94657J99005J32395
16471A608355l9364l36598P2771J23790m9423K16289j90502m07195L23371J81879
16461A503373J55076n7392j34927k62539K59545l55547J88811j20326K42561k24655
16451A193980q7066J28706N42538p04842N81489k36932k72634J63725j72043P4591
16441A211512N4742P0650J05973l56102j07654L62272l38243J72960N908o926
16431A175092k51581m7451L3828J90404j04222L04376k65052r3283l0272K33458
$$ y = [1763087, 2190223, 2052814, 2044881, 1871755, 2106521, 2025889, 1737202, 1660612, 1840950, 1519287, 1725675, 2024372, 1742349, 1797556, 1881922, 1594899, 1706367, 1547297, 1505654, 1440626, 1248307, 1455536, 1855785, 1440209, 1963046, 1553276, 1571612, 1276955, 1475960, 1608355, 1568991, 1232393, 1305164, 1428954, 1379531, 1595820, 1405318, 998123, 1321494, 1503373, 1658449, 1601057, 1466130, 1203591, 1463136, 1107589, 1296400, 1176074, 1418635, 1193980, 1106914, 1235620, 1778158, 1073316, 1654805, 1417873, 1145239, 1308964, 1136921, 1211512, 1266254, 1336904, 1442877, 1086775, 979121, 1341393, 1003150, 1176110, 1182018, 1175092, 923511, 876060, 909888, 1100292, 996070, 1300446, 1035394, 942111, 911839, 1145297]
16421A145297j21297l10279K13230R0146M05177n00084q3247K35720j78998O6237
16411I61902J03056j61146k283J41817J50254k52863L579K2452j13628J22926
16401I76066j22881K37064p9949k59549J37122J95361J940l56432J8583K35249
16391I82574j86189j88969J18210J15214j0126j42665J89575R132J25309l08452
16381G03613k38693N45017k19312k98076M50506l01767K6397r2550M55797j21808
16371I09124M4690J7151m38898K29854K28511m41116L94825L01291E83255J25355
16361G08610J60708j14319j04905L30229l19615n6823N01699l12106j03374o7691
16351F22413L63652m09271r1705N29025n4112j81647j40782J34990p2444M0502
$$ y = [1145297, 1024000, 713721, 926951, 1017097, 1422274, 922190, 838943, 1074663, 895665, 961902, 1064958, 903812, 901529, 1043346, 1193600, 940737, 944316, 966768, 853140, 976066, 853185, 1090249, 1010300, 750751, 887873, 1083234, 1085174, 728742, 747325, 982574, 796385, 607416, 725626, 840840, 830714, 688049, 877624, 886756, 1012065, 703613, 464920, 1009937, 790625, 492549, 943055, 641288, 667685, 575135, 1030932, 909124, 953814, 970965, 532067, 761921, 990432, 549316, 944141, 1245432, 583255, 708610, 869318, 754999, 650094, 980323, 660708, 603885, 1105584, 793478, 690104, 622413, 986065, 576794, 485089, 1014114, 960002, 778355, 637573, 772563, 700119, 740621]
16341G40621p6665j26676M2895J17234k33027J66862J6690J26880j95882l0701
16331E48231K0278k55649L31629p3794J89113j55405J87596n2561J274j77120
16321E63592l7256J26724j49125J80806J36931r4400j66491K98758j28983j17934
16311F12622n1550M42693l91091k42870K63035k43060K58662k89351M213K66619
16301F29922r4900Q9031L3515K35678C52832j3987M86024k12642n2451J44526
16291G04302K31944B76307K66821J55408J100K77366J26954j02429D54792J00068
16281E54860K69072l02908j66569N1112k0505M8990n5870m1297j00978L16803
16271E52710j8479k54205k599J22975j09287K50772j08070J22696j26496A65656
$$ y = [740621, 663956, 537280, 580175, 697409, 464382, 631244, 647934, 774814, 578932, 548231, 568509, 312860, 644489, 570695, 759808, 604403, 791999, 739438, 740712, 563592, 526336, 653060, 503935, 684741, 821672, 727272, 560781, 859539, 730556, 612622, 561072, 1003765, 612674, 369804, 632839, 389779, 648441, 359090, 363303, 629922, 535022, 624053, 657568, 893246, 352832, 338845, 824869, 612227, 559776, 704302, 936246, 276307, 543128, 698536, 699636, 977002, 1103956, 1001527, 454792, 554860, 823932, 521024, 354455, 405567, 385062, 434052, 378182, 336885, 235907, 552710, 534231, 280026, 277427, 400402, 291115, 541887, 433817, 556513, 430017, 165656]
16260E53081k33955K53313J61854k89465A32489M13470j243B60159R2003l6025
16250C16137N8346K9994j37337J4076A03580K66447K5210j17895J2380L17280
16240F07002B94073F8307L85971L4355A40774M09961k62842J00618J09226A20524
16229A78038H3119K07625j29798J87075J09950l9486J30140J38132k36033k4547
16219D26177A70830J19873L21369B53162J78116j35278j29965M34883A20846J29236
16209B50082G9842L48565j6702J41284j89076O2805O6678J27448E3539J33480
16199A87019M78548l11748A21170L48525p1824A30318K90643j45575F7372K81233
16189C48605o9083J73743k74K35191A11882J81505N83767C54527L7891j48329
$$ y = [553081, 319126, 572439, 734293, 444828, 132489, 545959, 544716, 260159, 352162, 316137, 374483, 404477, 267140, 281216, 103580, 370027, 395237, 277342, 289722, 607002, 294073, 68307, 454278, 488633, 140774, 550735, 287893, 388511, 497737, 120524, 178038, 83119, 290744, 160946, 348021, 457971, 418485, 548625, 686757, 450724, 426177, 170830, 290703, 612072, 253162, 431278, 296000, 166035, 600918, 120846, 250082, 79842, 428407, 411705, 552989, 363913, 426718, 493396, 620844, 53539, 187019, 665567, 353819, 121170, 469695, 397871, 130318, 420961, 275386, 67372, 348605, 279522, 453265, 452991, 688182, 111882, 293387, 877154, 354527, 392418, 244089]
16179B44089l4421J1356i0991A51827L22629R2931B16157J70741j73801P8854
16169B91951j33568J0311J17404Q6461c7910A192K28674K64360E6770J04261L9191
16158B00222H6479l5436J73748J17839e0940B31493c6779E8330M28032j69358
16148C17004F459M0727K50181m7653K18318j39200A36867J069J83718A34475L03028
16137D37503R8014B25322M8992j4987O5802n242H0847K80962b5970o5893A05693
16125B44140O708C4704M36224k21369B5982H844L45929j419j65948R8830A05122
16113A79322c3438C46672I2747J35885J06631A54172K97905k02565K06197J39004
16103E94713B58919L3305R8479j50716J60849m6173G2021K33803b03610E73342
$$ y = [244089, 209668, 221024, -90991, 151827, 474456, 567387, 216157, 386898, 213097, 291951, 158383, 168694, 286098, 372559, -37910, 1192, 229866, 494226, 56770, 161031, 200222, 86479, 51043, 224791, 342630, -50940, 231493, -36779, 58330, 486362, 317004, 6459, 47186, 297367, 249714, 468032, 328832, 136867, 137936, 321654, 134475, 437503, 535517, 225322, 274314, 259327, 325129, 319887, 80847, 361809, -25970, -91863, 105693, 244140, 250848, 34704, 470928, 249559, 25982, 8844, 354773, 353354, 187406, 286236, 105122, 179322, -33438, 346672, 92747, 228632, 335263, 154172, 452077, 249512, 455709, 594713, 258919, 292224, 390703, 239987, 400836, 354663, 72021, 305824, -203610, 573342]
16092a04216B61181R9300K29479B56940A26868A4509M553b30523B22461K52799
16082D75260k6690L20763j38955j46417j07289L8376F7913J2324N0907J69461
16072C00605A0055O8640a86540f8378j72979C80442A7677g4896C81847j42074
16062B39773D4581K57812H1131i3327J8658A07327K95151B1878K42708J13385
16052C77971j52035L76429J59304l07021O4189k6704p56B20693P7869k2276J89177
16041D65463A2701f0618C24220m7947P1163A62649K24426A25640M8923J28121
16031C02684A21398b9150f766k723F5652Q1781J52037a62226C75998J14915E1657
16019A30274p829J93746b35858R4141H8297b2408A23650J89449A15624N4519a182
$$ y = [-104216, 261181, 360481, 589960, 256940, 126868, 14509, 19062, -230523, 222461, 475260, 448570, 769333, 630378, 483961, 376672, 415048, 67913, 80237, 131144, 300605, 10055, 78695, -186540, -68378, -241357, 380442, 17677, -74896, 381847, 239773, 44581, 302393, 81131, -93327, -74669, 107327, 402478, 21878, 264586, 377971, 225936, 602365, 761669, 454648, 518837, 492133, 491377, 220693, 298562, 276286, 465463, 12701, -60618, 324220, 276273, 347436, 162649, 387075, 125640, 174563, 302684, 121398, -29150, -6766, -9489, 65652, 147433, 299470, -162226, 375998, 490913, 51657, 130274, 122445, 316191, -235858, -141717, 88297, -22408, 123650, 313099, 115624, 170143, -1182]
16007B45004B4395J2404J42233a38684e5790B5942b21085B21096A05343L33891
15997D39234a2178A57936L7147L9359I8017K37532O2417P0330A88812I1393J76386
15986B67779I7125a16600M8870N4c101A93090a35242A54258b5174A90101O7594
15975B57695k976P79h1764C8179J0094a43027C22050j29886G9451J41198a60319
15963A53479F0440J5563l4327o416c91171a41633A52801K2325H5922b0089A71752
15951a55319C85689b2439A74905O9033A4956c7565B89867d36075I6007b71619
15940b06575C6006O3662K7942L10277D3378a9094m4395B28770b4692A21373a45130
15928I4242B5035J53243a66608E1822q481J97873f8909B91873C9988b30666O0989
$$ y = [245004, 24395, 36799, 179032, -138684, -55790, 25942, -221085, 221096, 105343, 439234, -12178, 157936, 195083, 234442, 98017, 335549, 397966, 468296, 188812, 91393, 267779, 97125, -116600, -67730, -67676, -3101, 193090, -135242, 154258, -25174, 190101, 257695, 254719, 255498, -81764, 38179, 48273, -143027, 322050, 192164, 79451, 220649, -160319, 153479, 60440, 76003, 41676, 35260, -391171, -141633, 152801, 175126, 85922, -20089, 171752, -155319, 385689, -22439, 174905, 243938, 14956, -37565, 289867, -436075, 96007, -271619, -206575, 36006, 99668, 127610, 437887, 43378, -19094, -63489, 228770, -24692, 121373, -145130, 94242, 25035, 178278, -166608, 51822, 43341, 241214, -68909, 291873, 39988, -230666, -169677]
15917a69677A24099a87262I5844K33692A49642k6181a14622L0382A13019P2036
15907A85055B2136f2561B86000F5378j7307K86039C86J08340D8623J72796A04472
15895B3042J73632H0835N4353P6347B5808J91154A8733J01030K07350b5759C41296
15883a38546A40187b28624B07672C4668a55184e2499P967A22906a93309B74713
15872d9888E5025a45740A0962Q3547j3357c75039C96943C2404J61737b70717b4843
15860b1503k25790A36349a42208r7507B5155N3686J6023b41375D4401Q6577a60251
15848A12876A9302K8547j1291d2362j42275C55531A24093c3054B87607K6405R6425
15837D10437c23709B3822J59359J44292a07042A75557a20493l2917M6185B24332
$$ y = [-169677, 124099, -187262, 95844, 329536, 149642, 123461, -114622, -84240, 113019, 185055, 22136, -62561, 286000, 65378, 48071, 334110, 386, 108726, 48623, 221419, 104472, 23042, 196674, 80835, 135188, 211535, 25808, 216962, 18733, 119763, 327113, -25759, 341296, -138546, 140187, -228624, 207672, 34668, -155184, -52499, -44532, 122906, -193309, 274713, -49888, 55025, -145740, 10962, 94509, 81152, -375039, 396943, 32404, 194141, -270717, -24843, -21503, -247293, 136349, -142208, -239715, 25155, 78841, 94864, -241375, 44401, 130978, -160251, 112876, 19302, 47849, 36558, -42362, -184637, 355531, 124093, -33054, 287607, 314012, 410437, -323709, 23822, 183181, 327473, -107042, 175557, -120493, -153410, -107225, 224332]
15826A28621P2586a60460a7334D3336r618M23753c6295m2615k73753F2459A0146
15814F8287K44563i6982A48912f7089A60252N0745a93767e9010k37211c074A70110
15802D131L07045b11772b8948j35728D0759a28194a5711H9440O088M7219h5503
15790F4090a67267g8585F798R2394L44810b1541A12678n1694J72286F4738j9374
15779D5364J70801f3122j36762i2056A1894e8593B87070a18301C62i9155C08151
15767b69446j47881A97226m186a94493B52387d1182A65681d2364p660K157k16782
15756b64649A35209d8889A65890Q7001H7417a68241b0833B08053H4302B7620J48855
15745A76475B9483J44990j6085n166M6760H3654g535j41129A26476J42314J43556
$$ y = [128621, 201207, -160460, -17334, 43336, 33718, 457471, -36295, -78910, -352663, 62459, 10146, 68287, 312850, -96982, 148912, -67089, 160252, 210997, -193767, -59010, -296221, -3074, 170110, 4131, 311176, -211772, -28948, -164676, 40759, -128194, -15711, 89440, 95528, 142747, -85503, 64090, -167267, -78585, 6798, 99192, 444002, -21541, 112678, 60984, 233270, 64738, 45364, 216165, -63122, -199884, -92056, 11894, -58593, 287070, -118301, 362, -99155, 308151, -269446, -417327, 197226, 193040, -194493, 252387, -41182, 165681, -42364, -50024, -47867, -264649, 135209, -48889, 165890, 252891, 87417, -168241, -20833, 208053, 84302, 27620, 176475, 29483, 174473, 158388, 153222, 199982, 83654, -7535, -148664, 126476, 268790, 412346]
15734D12346a66127j63436A897J54571E6558b56382i3441B70527r0048D1057a2537
15722b11891M897e2992A10812e8986I3703J32831F3796a8469n5374c53k380A73597
15709A29237E0595b20215i3761L1131j37774F6850g6618a2877k19755c1225b417
15697B6391c57841H6947J21149b32332B73909M0688A290M14625A39908K27573
15687C67481c9099C93553N4362A05551K61912j77439G2852K44071A26531a37116
15676A54457B5683K458a04333B45033K94497A16890k0873C9317d3392C05399A00844
15664B63162q3118H7890b0442B14216J913J3940a45637A23674l249L6306a70493
15652B79194a13488b1514A76386J46913A29946b460E1392Q3212F0638J39083Q3159
$$ y = [412346, -166127, -329563, 1897, 156468, 56558, -256382, -93441, 270527, 180479, 41057, -12537, -211891, -206994, -52992, 110812, -58986, 93703, 226534, 63796, -18469, -73843, -353, -2733, 173597, 129237, 50595, -220215, -93761, -62630, -200404, 66850, -76618, -12877, -232632, -31225, -2417, 26391, -357841, 86947, 208096, -232332, 273909, 314597, 1290, 415915, 139908, 367481, -39099, 393553, 447915, 105551, 367463, 190024, 72852, 316923, 126531, -137116, 154457, 25683, 28141, -104333, 245033, 539530, 116890, 96017, 39317, -43392, 305399, 100844, 263162, 180044, 87890, -20442, 214216, 216129, 230069, -145637, 123674, 120425, 156731, -170493, 279194, -113488, -21514, 176386, 323299, 129946, -2460, 51392, 134604, 60638, 199721, 282880]
15641B82880P6716G6244J03556M4944a39157G6528A4547J3332K41142p6699G6731
15629A23995e4502B59457j4267M9265j01585G4450j0408e2752D2094K79395f8920
15617A39299J33512q8340G3746J89288A24717l0714M1918I575a35699D0090a6405
15605C37964A23337K26693j53945a69399p1048B54329o2802D8292d8578C20676
15594B41694f5474A5480J96935N0326H2906J95770R2653J55962A89208J3729a09001
15582a95275A82333Q800a63406a1396E08170c93402d0485a6725B56852J44053
15572D00905A73439b62218h3732B27382P4271A19860J67236F3879P3444a62104
15561A6007K96635d4945A7958a55608A99084E9432f4153A40249e9547A45904E1052
$$ y = [282880, 359596, 76244, 179800, 224744, -139157, 76528, 14547, 27879, 269021, 192322, 76731, 123995, -54502, 259457, 245190, 294455, 192870, 74450, 64042, -52752, 42094, 321489, -68920, 139299, 272811, 184471, 73746, 263034, 124717, 94003, 135921, 9575, -135699, 40090, -16405, 337964, 123337, 350030, 196085, -169399, -240447, 254329, 191527, 48292, -48578, 320676, 241694, -65474, 15480, 212415, 262741, 82906, 278676, 371329, 527291, 189208, 202937, -109001, -195275, 182333, 191133, -163406, -11396, 508170, -393402, -40485, -16725, 256852, 400905, 173439, -262218, -83732, 227382, 301653, 119860, 287096, 63879, 137323, -162104, 16007, 312642, -44945, 17958, -155608, 199084, 59432, -64153, 140249, -59547, 145904, 51052]
15549A97461P279C9936N48828k85537j36283J94186B780K49019j62f014B04717
15537A81956F9618A0619J09184C9530a00387A000J35656a29733G1673a21177B59103
15525B67498A28629J20136I386J98069D5170L0064K82344b33851B20770J53954
15515C74724K4131j96323g4071C68356c436H1523l9624J06891j2927n6005k0610
15504E9248o065b60415B13312J43410J37143I2924K59027F4879A7921b5093n2622
15493g7715A44089l2457d6668C01570F3732L36214f763j27747C69927I9024J49680
15482B48704r3660o6112N5621h2257C82523J08708C2656h799A47510c62411B48314
15470a69464A19881J26972A19925N618J06829a42001E01880A29079L9059H2938
$$ y = [197461, 204740, 39936, 588764, 303227, 166944, 361130, 2780, 251799, 251637, -6014, 204717, 181956, 69618, 10619, 119803, 39530, -100387, 1000, 136656, -129733, 71673, -121177, 259103, 267498, 128629, 248765, 9386, 207455, 45170, 75234, 357578, -233851, 220770, 374724, 398855, 202532, -74071, 368356, -3436, 81523, 41899, 148790, 135863, 79858, 59248, 53183, -260415, 213312, 356722, 493865, 92924, 351951, 64879, 17921, -25093, -77715, 144089, 111632, -46668, 301570, 63732, 399946, -6763, -134510, 369927, 99024, 248704, 155044, 88932, 144553, -82257, 382523, 491231, 32656, -8799, 147510, -362411, 248314, -169464, 119881, 246853, 119925, 125543, 232372, -142001, 501880, 129079, 168138, 82938]
15459A61016C8610c5754G6118J59226a6658C15985h8196E19645b44548g6212D07322
15447A21488J22734k014b26005B03662M8013A4971J3721a90823I6237L76697j57586
15436C15348j42170g1908C57166K20155A1057J89076N8969I6134g8779B79810
15425F7512K15490a72336J350A71537K71706j12442j65251O0649J35146a41155
15414B02913J36248p6406i4589A31566i7788J3824B36483J39114A67771K34902
15404D02673A76933q7707M22158A08629a34965B192J60631b22956B16966P2521
15394B89487p5454j8733k5799J33414D7327J56936f0935C58250L1368n1083j41096
15383A97439N1013J93787A27726J24950A20618L80753K1162j29686c3063B58668
$$ y = [161016, 38610, -35754, 76118, 235344, -16658, 315985, -88196, 519645, -244548, -76212, 407322, 121488, 244222, 242208, -226005, 203662, 251675, 14971, 28692, -190823, 96237, 472934, 315348, 173178, -71908, 357166, 577321, 11057, 200133, 259102, 96134, -78779, 279810, 67512, 283002, -172336, -170986, 171537, 443243, 330801, 165550, 226199, 361345, -141155, 202913, 339161, 262755, -94589, 131566, -97788, -83964, 236483, 375597, 167771, 402673, 176933, 89226, 511384, 108629, -134965, 2192, 162823, -222956, 216966, 289487, 214033, 195300, 169501, 302915, 47327, 204263, -60935, 358250, 389618, 338535, 197439, 248452, 442239, 127726, 252676, 120618, 501371, 522533, 392847, -33063, 258668]
15372F7633J11076P9057o2869P3560J3247m9444J78634N8300D4243L14264M916
15361C63423l4714q8565N7808I1939K15312J40969j48186P1729k0727J34747J9769
15350E05552j19371I1065J87753k5906Q5513j02723I7565L25654j60344q08n6174
15339B05893J3481J74777j09444Q5300A46745R0287k2363K89127A77095N0153
15329B27248o7920L7936M231J621J65274k6416j26845J59494n6527G9924L45500
15318D25424M0409k32532k1101o0371N52615j92415B47740j10941J78209J52006
15308D67014J73575k67256p4186K78576j82645K36747j97185A34637k4570K84613
15298C94680n5784j31627P8914K88397j61947p022A20778M58474j62988r9416
$$ y = [67633, 178709, 257766, 194897, 268457, 281704, 232260, 410894, 469194, 44243, 358507, 363423, 328709, 240144, 297952, 91939, 307251, 448220, 300034, 371763, 351036, 485783, 505552, 386181, 91065, 278818, 252912, 338425, 235702, 97565, 423219, 262875, 262067, 205893, 219374, 394151, 284707, 370007, 146745, 237032, 214669, 503796, 177095, 227248, 159328, 197264, 201495, 203116, 368390, 341974, 215129, 374623, 318096, 79924, 425424, 465833, 233301, 212200, 151829, 704444, 512029, 247740, 136799, 315008, 467014, 640589, 373333, 299147, 577723, 395078, 631825, 434640, 134637, 110067, 394680, 338896, 207269, 286183, 574580, 412633, 405611, 120778, 579252, 416264, 316848]
15288C16848o2599R9554K78062L7006k14491L2763A13733K97303a24560B53649
15277C83675j33018N8223R0013a27151C25681A56758J06693n0723p2229L28979
15267D69478R391A86192m0433M41815C7471L89960o1647J02983K53671l34990
15257C87448J47529l0151r265n7141J8354J99798J69986K31883L72860P1106J32067
15246A634474k42927o00788l78812r72p3811J24053j12810r98m7941A5875L91035
15235D06910J88007J841A51297J94930H8320P7128N4684a36795D10529A99467
15224a14674A6866P7345J90123L3558k5096K83519B49416J06521j8177A0151K47489
15213B57640e425A37362J0883j1185O0970K65849j22121m6766A30670K19895b4221
$$ y = [316848, 254249, 353803, 631865, 668871, 454380, 487143, 113733, 411036, -124560, 253649, 383675, 250657, 308880, 398893, -127151, 325681, 156758, 263451, 212728, 140499, 469478, 478869, 186192, 145759, 587574, 37471, 427431, 365784, 468767, 722438, 387448, 534977, 504826, 495561, 438420, 456774, 656572, 826558, 1058441, 1431301, 1502407, 1634474, 1391547, 790759, 411947, 410975, 337164, 461217, 348407, 347409, 299468, 15875, 406910, 594917, 596758, 151297, 346227, 88320, 165448, 220132, -136795, 410529, 199467, -114674, 16866, 94211, 284334, 317892, 292796, 576315, 249416, 355937, 337760, 10151, 257640, -5425, 137362, 148245, 137060, 198030, 463879, 341758, 294992, 130670, 350565, -24221]
15201E11045R4575G6902K66714C4432K66175m7407p2502J60525a72458C24176
15190C18365d5047g92D28070j52398o9507P4514E4477M8570b661C23132j48976
15179A74156L26887J81659C02093n2372L5254J08466J24267A30454A1649K86178
15169B97827N6184j32403J99508n03J6078J69621E3167L21244M70009l12949B38037
15157D57223l4960J89423k60508A06747K68398J13170j35670A33762a7274C93474
15146A69667P7032M738K39948M8705m6296k41516N63153C82381N7852k05585J3574
15135B48222p5432o4051M44925J09301k26263l3617A97343J60131A10132M28616
15125E38748j06912B07198K53586p2216a16657C00465K05830k16755J68327m8141
$$ y = [511045, 605620, 76902, 343616, 34432, 300607, 253200, 180698, 341223, -172458, 324176, 318365, -45047, -792, 428070, 275672, 206165, 280679, 54477, 103047, -2661, 323132, 174156, 501043, 682702, 302093, 249721, 284975, 393441, 517708, 130454, 11649, 297827, 354011, 221608, 421116, 420613, 436691, 606312, 53167, 374411, 844420, 531471, 238037, 457223, 422263, 611686, 351178, 106747, 375145, 488315, 352645, 133762, -17274, 393474, 169667, 246699, 251437, 491385, 540090, 493794, 252278, 815431, 382381, 440233, 234648, 248222, 172790, 108739, 553664, 662965, 436702, 403085, 197343, 357474, 110132, 538748, 431836, 207198, 460784, 388568, -116657, 300465, 506295, 289540, 457867, 409726]
15115D09726A28832O0686J3392k7568L49565l0785j25058o5144M26365l39267
15105C91018K99991M6158J30945C26344J51984j17293M72718j92093j75133O3647
15095E30174K78779l9360p5270k3225j20407j42247L51496j27688C01126P8363
15085C79489k0895O5773Q4783r7342Q8093L04827n8524j73977H5898M07342J25507
15074F18747J33917B33347K21378R5563m3474A48079K13511m7008P0890K29844
15064F15316r1733o2718p4992M415L46818C09488R0446L58724k05402r1071J24425
15053E86610J19813J13668Q2394j68728M27245l12740n0988k92988J31594M95482
15043A131362j20372m00715L41814k93147p8646M53504m19902l6671k9845j00832
$$ y = [409726, 128832, 189518, 202910, 175342, 524907, 494122, 369064, 303920, 730285, 391018, 691009, 737167, 868112, 326344, 478328, 361035, 833753, 641660, 466527, 530174, 808953, 769593, 694323, 671098, 550691, 408444, 759940, 632252, 301126, 379489, 358594, 424367, 509150, 411808, 499901, 804728, 746204, 572227, 85898, 493240, 618747, 752664, 233347, 454725, 550288, 506814, 148079, 361590, 314582, 385472, 615316, 523583, 460865, 385873, 390288, 737106, 309488, 399934, 758658, 553256, 462185, 586610, 706423, 820091, 902485, 733757, 1161002, 848262, 797274, 504286, 635880, 1131362, 1010990, 610275, 952089, 658942, 580296, 1033800, 613898, 577227, 547382, 446550]
15033D46550j12913k0341L7227J30893K8015J54003k77186L43744J4819B23082
15022D76035k31681K8269K99288A34247J21423l6362M12726B91022M09364N2482
15012G52868k54014j52815K56718O1768k83024l5800J42654J55205P8599l03727
15002D18432l7804K14627B40743N16502p8135O7839j72629J12955K93755l67751
14992F13279J32255k27243j12209J77420R9839j07714B45714N25874L7375l0054
14982G78909P4437j6610j27219k81703J51271P31B38613J28259L00684l04565
14972C62991O08609k35509K395R4604o9093O148k20989J06664j93408N8825J89995
14961G11232M173m4365L73548P1489n57067O0681j3893O9112n941k40129L25273
$$ y = [446550, 333637, 313296, 350523, 481416, 509431, 663434, 386248, 729992, 744811, 223082, 476035, 244354, 272623, 571911, 134247, 255670, 219308, 632034, 291022, 700386, 752868, 498854, 346039, 602757, 664525, 381501, 345701, 488355, 643560, 722159, 418432, 380628, 595255, 240743, 757245, 679110, 746949, 574320, 687275, 981030, 613279, 745534, 518291, 406082, 583502, 683341, 575627, 245714, 771588, 808963, 778909, 853346, 836736, 709517, 427814, 579085, 579816, 238613, 366872, 667556, 362991, 971600, 736091, 738486, 833090, 763997, 770145, 549156, 655820, 462412, 521237, 711232, 715405, 671040, 1044588, 1116077, 559010, 619691, 605798, 674910, 668969, 428840, 754113]
14950G54113j47478k3971K15120k40171p3898O04101L3802k36853j3319n8295
14940H13151n0306J17265j83219K16034k40340L64972Q9623l54899m3783J29277
14930H57775l70555J33410J09881k18654p0757M70990j20181M7955l44773M68743
14920I63834j68489n0731l7230K1613r8555J63288J50426l30794J92117j06258
14910F99221j49308j66389Q9990K14213m6149Q6698k67128J78184J9490k13952
14900D44870K63401r9330j25035L93694D00332L87115q4587r5642P4298j1779
14890F69737J21414k08034j21207K57801l42474K65745N1309j60519o4336K00275
14880F69711j2112B95359M67753j90127j53622K09519L4579J41942R0235l81865
$$ y = [754113, 606635, 582664, 797784, 557613, 483715, 1087816, 1121618, 884765, 871446, 813151, 762845, 880110, 696891, 912925, 672585, 1037557, 1127180, 772281, 728498, 857775, 487220, 620630, 730511, 511857, 441100, 912090, 791909, 839864, 495091, 963834, 795345, 744614, 707384, 728997, 630442, 793730, 944156, 613362, 805479, 699221, 549913, 383524, 473514, 687727, 641578, 728276, 461148, 639332, 658822, 444870, 708271, 608941, 483906, 877600, 400332, 787447, 702860, 607218, 681516, 669737, 791151, 583117, 461910, 719711, 377237, 642982, 694291, 533772, 469436, 669711, 657599, 295359, 763112, 572985, 419363, 628882, 663461, 805403, 895638, 513773]
14870E13773m6688K21853Q0067o490J16688j26677q881j80056J39749n9860L1909
14859F75387k18760M20794r8138k05454n496k23581P16220l35919K19524k44651
14849F99926N8239L864J78818Q1145J67232k89007K54216E63969L32800j03819
14839G92950j05276j4859L11439l89568L47355k58138J94267k25329O5951L55609
14829A074401k58932L28626j48152K6011L04940k38678k10904M61376m47597Q6793
14819I77884J05141k00561Q0407n9109N5775K45668k90298r1468K4256j4744O511
14808H39462q7261J86971j18111Q1934K46382k45126J23726l67229N83310q6372
14798A157686k54183K10288O937k43189K1234K95540k37340O8133Q9914k7475
$$ y = [513773, 467085, 688938, 769005, 762515, 879203, 752526, 743645, 563589, 703338, 643478, 675387, 456627, 877421, 779283, 573829, 568333, 344752, 1060972, 725053, 944577, 699926, 758165, 762029, 940847, 1021992, 1189224, 900217, 1154433, 563969, 896769, 792950, 687674, 672815, 984254, 594686, 942041, 683903, 878170, 652841, 718792, 1074401, 815469, 1144095, 995943, 1021954, 1326894, 1088216, 877312, 1338688, 891091, 977884, 1083025, 882464, 962871, 903762, 959537, 1205205, 914907, 823439, 847695, 832951, 839462, 752201, 939172, 821061, 902995, 1149377, 904251, 1027977, 660748, 1244058, 1157686, 903503, 1113791, 1120728, 877539, 898773, 1194313, 956973, 1025106, 1115020, 1087545]
14788A087545k0171j48823K33139M28104l22864l3554J93070j09258J32649n77966
14778H61871J5085J49535L42567l11407j54776J86861R3435j32308O376j29031
14768I28208K87228K09065m91146L10607k36171K27232k87992P3303j02343j39424
14758G78567M13769l00981q8360L09988j62266K7992J56686q3793j15616K26443
14748A162429k74022L88946N6769K76196k93337k9491l6025O3925m93659r4308
14738G27423K15655J61375k06673J75595m1527j6586J02195k53009K89446j28837
14728A025057R0460L3015k26908K68160J10311K28236m20163l7230K38770k52847
14718A056861L07844r0129o8140m0281K30199o33049L37234J55952k00900l33529
$$ y = [1087545, 1067374, 918551, 1151690, 1579794, 1256930, 1223376, 1416446, 1307188, 1439837, 861871, 876956, 1026491, 1369058, 1057651, 902875, 1089736, 1183171, 1050863, 1057239, 928208, 1215436, 1424501, 933355, 1243962, 1007791, 1235023, 947031, 1020334, 917991, 778567, 1192336, 891355, 802995, 1112983, 950717, 978709, 1135395, 1051602, 935986, 1162429, 888407, 1277353, 1334122, 1610318, 1316981, 1287490, 1251465, 1315390, 821731, 727423, 943078, 1104453, 897780, 1073375, 1031848, 1015262, 1117457, 864448, 1153894, 1025057, 1115517, 1148532, 921624, 1189784, 1300095, 1528331, 1108168, 1070938, 1309708, 1056861, 1364705, 1274576, 1206436, 1166155, 1396354, 763305, 1100539, 1256491, 1055591, 722062]
14708G22062N62372k98879O7637j6473J02431n05297K80421L95503l1942l03626
14698I74209J8191L52035n8042k8292J88837n57331K36467l49593K48213r5782
14688I28912R5025o3393k34579L79004j11817j2027J4960Q3356p2398J16646j28715
14677I94974m3404J63666j3778L7042J8495j84135J70950M465j35062k34084K20837
14666I99966q7595J78841j13024O9994K8351J61328j73353J15493j76319L2410
14656A036092l4618J26402k07620O7067q8839J91669J59115k96269J55289J27147
14646A235435k09938R7529K18023l24166K58739j66554J01047k92498L44012M6796
14636A308425k48858k3339L355N5829M85169l94015l19608J42125n8684l1647
$$ y = [722062, 1284434, 985555, 1053192, 1036719, 1139150, 633853, 914274, 1309777, 1277835, 974209, 992400, 1344435, 1286393, 1258101, 1446938, 889607, 1126074, 776481, 1024694, 928912, 1023937, 960544, 725965, 1104969, 993152, 981125, 996085, 1079441, 1007043, 1123689, 994974, 951570, 1115236, 1101458, 1138500, 1156995, 972860, 1143810, 1148275, 1013213, 779129, 999966, 912371, 1091212, 978188, 1048182, 1076533, 1237861, 1064508, 1180001, 1003682, 1036092, 1001474, 1127876, 920256, 987323, 898484, 1090153, 1249268, 952999, 1108288, 1235435, 1025497, 1123026, 1341049, 1016883, 1275622, 1109068, 1210115, 917617, 1261629, 1308425, 1059567, 1036228, 1039583, 1095412, 1580581, 1186566, 866958, 1009083, 950399, 918752]
14626I18752K89108n9933j37759M43451k47197k28202K64809m22681O47644j20191
14616A347801k40949L1758j51630L56966n58948M49449r1990K41987o86650M62218
14606A160012M2824j33019J24900j27197K1554m7252r8924L67647p4946L53879
14596A589478n16532J93610L3654K62238M2065j71543j22903O69078n64661J01656
14586A516140o4852N8063k2561J4085k35847K32698K99923J7143l55914j15032
14576A343846O42858R4679n52329L4933K88475n3851l8800K45479J3408k55433
14566A763265j7965k22913M73013k4920Q8918j99640O3K52949K39030J97417l25255
14555B223962J44606N20059j21723N40095M36109Q02350J453948L291595R101680
$$ y = [918752, 1207860, 1147927, 1010168, 1453619, 1206422, 978220, 1243029, 820348, 1467992, 1347801, 1106852, 1138610, 986980, 1343946, 784998, 1234447, 1142457, 1384444, 697794, 1160012, 1202836, 1069817, 1194717, 1067520, 1089074, 1041822, 942898, 1310545, 1235599, 1589478, 1072946, 1266556, 1300210, 1562448, 1604513, 1432970, 1310067, 1979145, 1414484, 1516140, 1451288, 1509351, 1486790, 1500875, 1265028, 1497726, 1797649, 1814792, 1458878, 1343846, 1986704, 2081383, 1529054, 1563987, 1852462, 1798611, 1759811, 2005290, 2018698, 1763265, 1745300, 1522387, 1995400, 1970480, 2059398, 1859758, 1859821, 2112770, 2351800, 2549217, 2223962, 2368568, 2888627, 2766904, 3306999, 3743108, 4545458, 5999406, 9291001, 18392681]
14546A8392681J6758356P93450j5360766r688141m855560k338874p29948p44013
14538B227185l68404l51659J33308P5836j00777j02728K51771K57354l43405J31223
14528A809704K2217k59088M19577j84128J8657K79655J55029m73950K3200j54499
14518A656374J79240J03810j02363J98307o5106J29439j24953M26175l31057Q5605
14508B155471M05525k34427o8993Q1420Q0896K50165m75846N48516R2089m645
14498B830171k52664K12548J96459l44186L83966n3668l53641K71280m4457K8611
14488B874419L06356l5981m38385M73849O9476j91452M63492k68097j85710j23158
14478B944809M03304j02958K5440L389L1973J04293J43375J6995Q6960J68515
$$ y = [18392681, 35151037, 35944487, 20583721, 10895580, 6040020, 3701146, 2971198, 2227185, 1858781, 1507122, 1640430, 1716266, 1615489, 1512761, 1764532, 2021886, 1678481, 1809704, 1831921, 1572833, 1992410, 1808282, 1826939, 2106594, 2261623, 1787673, 1810873, 1656374, 1835614, 1939424, 1837061, 2035368, 1970262, 2099701, 1974748, 2400923, 2069866, 2155471, 2560996, 2326569, 2257576, 2338996, 2419892, 2670057, 2194211, 2742727, 2834816, 2830171, 2577507, 2790055, 2986514, 2642328, 3026294, 2972626, 2618985, 2890265, 2845808, 2874419, 3180775, 3144794, 2706409, 3180258, 3249734, 3058282, 3521774, 3253677, 3067967, 2944809, 3348113, 3245155, 3270595, 3273984, 3305957, 3410250, 3553625, 3570620, 3657580, 3826095]
14468C826095j03936j95063M19263k73050J58060K5162J78139l85411L64840n5804
14458C958295j8901k04576K07425k63887N0681M22358J77323j00592J4814P8333
14448D321273l89765O11346q7181K46302l37160K01720J62359k78410O79373l59952
14438D769905L28068k36017K80070N0841q3973J72204Q2602m0518K49704L2709
14428E605595k48843L62024J45232O2362n5212K71596r6216j8396K23477L23019
14418F574638l02781M54799p4056o1681J52752j11192J30292J43386L08777J25373
14408G340307J54921l68148L34753j5329R9437L73520n4397L76L65120J10174
14398H340734J84530j29065L31026J40527n0751K98387J43502L95760L60227j97537
$$ y = [3826095, 3722159, 3527096, 3946359, 3673309, 3831369, 3856531, 4034670, 3649259, 4014099, 3958295, 3939394, 3734818, 3942243, 3678356, 3729037, 4151395, 4328718, 4228126, 4242940, 4321273, 3931508, 4542854, 4455673, 4701975, 4364815, 4566535, 4728894, 4450484, 5129857, 4769905, 5097973, 4861956, 5142026, 5192867, 5108894, 5281098, 5363700, 5323182, 5572886, 5605595, 5356752, 5718776, 5864008, 5926370, 5871158, 6142754, 6046538, 6028142, 6251619, 6574638, 6271857, 6726656, 6652600, 6590919, 6743671, 6632479, 6762771, 6906157, 7214934, 7340307, 7495228, 7127080, 7461833, 7446504, 7545941, 7919461, 7865064, 7865440, 8230560, 8340734, 8525264, 8396199, 8727225, 8867752, 8817001, 9115388, 9258890, 9654650, 10014877, 9817340]
14388I817340K34527M1972M38950J28391K46112k33194N24001N171N17536r83
14378A1719823j19445N22927L84884m5446M83974k9218M41333M41960K17299K16482
14368A4234573k2533L67075P10047L7440K57507O64669r4036Q37208R0324L66713
14358A7448987N21540O54289q0519N94821M16212K31617O87261J55058Q65821
14349B1495087J54152N74059O86952M62356P79625N78761M64742O14526J020356
14340B6830616Q23379O02614Q96743P12155J136735P93376O89426R28869J071538
14331C4485451J111757R01591R11566J829488Q32099J475892J592490J349122
14323D4489456J066884J762515J498143K066558J531514K106028K201962K208585
$$ y = [9817340, 10051867, 10093839, 10532789, 10661180, 10907292, 10674098, 11198099, 11203270, 11720806, 11719823, 11600378, 12123305, 12508189, 12462743, 12946717, 12917499, 13358832, 13800792, 14018091, 14234573, 14212040, 14579115, 15289162, 15326602, 15584109, 16248778, 16154742, 16991950, 17082274, 17448987, 17970527, 18624816, 18544297, 19139118, 19555330, 19786947, 20474208, 20629266, 21495087, 21649239, 22223298, 22910250, 23372606, 24152231, 24730992, 25195734, 25810260, 26830616, 27653995, 28256609, 29153352, 29865507, 31002242, 31795618, 32485044, 33413913, 34485451, 35597208, 36498799, 37410365, 39239853, 40071952, 41547844, 43140334, 44489456, 45556340, 47318855, 48816998, 50883556, 52415070, 54521098, 56723060, 58931645]
14315E8931645K466696J989095K851173K772814K940880K842873L611121L003381
14307H1409678L724043L722443M048147M533789M388070M963872N248017N744397
14299A17782456O000640O440483O835780P884545P687175Q164540Q914682R811182
14291A79521483J0009985J0798761J1648442J2496517J2886537J3958163J4385354
14284B65705242J5114154J5745456J6336665J6857072J6672915J7308756J6537922
14277C80278182J5840223J5544001J4152301J2125573R867619N013623N21271
14270D53342793j771256l075839m077636k440839p171805o920557p295815j0335352
14262D10253694j3400061j4878525j5895437j6051780j6877383j7115877j6941725
$$ y = [58931645, 61398341, 63387436, 66238609, 69011423, 71952303, 74795176, 78406297, 81409678, 85133721, 88856164, 92904311, 97438100, 101826170, 106790042, 112038059, 117782456, 123783096, 130223579, 137059359, 144943904, 152631079, 160795619, 169710301, 179521483, 189531468, 200330229, 211978671, 224475188, 237361725, 251319888, 265705242, 280819396, 296564852, 312901517, 329758589, 346431504, 363740260, 380278182, 396118405, 411662406, 425814707, 437940280, 447807899, 452821522, 453342793, 451571537, 448495698, 444418062, 441977223, 434805418, 427884861, 420589046, 410253694, 396853633, 381975108, 366079671, 350027891, 333150508, 316034631, 299092906]
14255B99092906j5404036j5157842j4995912j3909599j3051159j2382996j1452380
14248B02738982j1273047j0194513r816098q715806q244301p941074p257210p048515
14240A32248418o085804o401799n301004n141415n440642m321255m476847m003798
14232I1075854l879004l609910l372460l328754k935662k860388k946563k878978
14224F5264135k040366k595048k180025k436511j658929j919338j801713j880270
14216D8751935j722298j165755j483607j222510j445709j459373j394034j130164
14208C7728485j003924n96877j040227j136536j261194o68382r56507n91402o96445
14199B9776991p56716j080133p65762n18142m77656n70091o46784j071908m77378
$$ y = [299092906, 283688870, 268531028, 253535116, 239625517, 226574358, 214191362, 202738982, 191465935, 181271422, 171455324, 162739518, 154495217, 146554143, 139296933, 132248418, 126162614, 119760815, 114459811, 109318396, 103877754, 99556499, 95079652, 91075854, 87196850, 83586940, 80214480, 76885726, 73950064, 71089676, 68143113, 65264135, 63223769, 60628721, 58448696, 56012185, 54353256, 52433918, 50632205, 48751935, 47029637, 45863882, 44380275, 43157765, 41712056, 40252683, 38858649, 37728485, 36724561, 36127684, 35087457, 33950921, 32689727, 32021345, 31064838, 30473436, 29776991, 29020275, 27940142, 27174380, 26656238, 26178582, 25608491, 24961707, 23889799, 23412421]
14190B3412421r89590l77378j92805q98630m06266n18763l50738n33521k50965
14181A8893765p33384n16457j35503l45482l40786k64534L5269m98774o31637
14172A5462477k01173p9671l01384l47033L00729n27781j01875q12568k44295
14163A3147426k13158j9071m24088J8878l2042n75384N3370l75521k06844l46079
14153A1027487K73552p05324j44128K252k04817k0049k03199K8385l07861k7586
14143I718712j44216l18031j41919j63436L255l09105k71163j38983p2711j07081
14133H055322N9258n16477R8321n6746m80501J50386k54376j99925J75495j97357
14123F833400J95590j47163l22204M3357P6586j53845k04090q6910J66648p1969
$$ y = [23412421, 22422831, 22045453, 21852648, 20954018, 20547752, 20028989, 19678251, 19144730, 18893765, 18160381, 17643924, 17508421, 17162939, 16822153, 16557619, 16592888, 16094114, 15462477, 15261304, 15181633, 14880249, 14533216, 14833945, 14306164, 14204289, 13391721, 13147426, 12934268, 12915197, 12491109, 12509987, 12477945, 11902561, 11955931, 11580410, 11373566, 11027487, 11301039, 10595715, 10451587, 10453839, 10249022, 10228973, 10025774, 10054159, 9746298, 9718712, 9574496, 9256465, 9114546, 8951110, 8954365, 8645260, 8374097, 8235114, 8162403, 8055322, 8114580, 7598103, 7696424, 7639678, 7159177, 7309563, 7055187, 6855262, 7030757, 6833400, 7028990, 6881827, 6559623, 6602980, 6679566, 6525721, 6321631, 6234721, 6401369, 6329400]
14113F329400l60343j58109J23662j47652K6415L7043L1571n45452j9361J49172
14103E466346Q2468l02413n1620J22637j96732o7339J6615m5796k13159q8239
14093D722768l5556J5362p7179j08567J7929R8017k1083m80877J60943L8839j27561
14082D203035o87R1085k30342j5265j628M7535p6107l92473J50232J5652P6338
14071C867375l43038K16151q6258k52361K4513k47618M05715k20543J56876k86407
14061C234405K20696L3108j52279l84068L82658l78381r0198K04517k08224O5340
14051B927574R5275l12627K19146J0401q5187k30198J18467l3877K2755O376j08969
14040B629136M3618Q4632r7130j24368m7992J17450j26039J68239p4520k29333
$$ y = [6329400, 5969057, 5810948, 5934610, 5786958, 5813373, 5850416, 5881987, 5336535, 5317174, 5466346, 5548814, 5246401, 5194781, 5317418, 5120686, 5053347, 5069962, 5024166, 4811007, 4722768, 4687212, 4702574, 4625395, 4516828, 4534757, 4632774, 4611691, 4130814, 4291757, 4330596, 4203035, 4202348, 4293433, 4063091, 4047826, 4046198, 4093733, 4017626, 3625153, 3775385, 3791037, 3867375, 3524337, 3740488, 3654230, 3401869, 3426382, 3178764, 3584479, 3363936, 3520812, 3234405, 3455101, 3488209, 3335930, 2951862, 3334520, 2956139, 2865941, 3070458, 2862234, 2927574, 3022849, 2710222, 2929368, 2939769, 2854582, 2624384, 2742851, 2708974, 2731729, 2738105, 2629136, 2672754, 2757386, 2660256, 2535888, 2487896, 2605346, 2479307, 2647546, 2573026, 2343693]
14030B343693K29901L4539N7556l23952o3493L5184j69421O3857J20550q3242
14020B245172r6345L91354k18519j32253l11883M353J99902J0890l58715L28992
14010B062948j41403j47858Q9268K91568p5644l46790J64235k30442K01352K3286
14000A890520l14305l9409J63402j07454O3559j08501p516J4914O8386L39867
13990A963463J90605K86934K215606N712892J5160881J1681310j1836815r680584
13982A5694292o022122k754656k301598o14674m33994q27770m4195L17119n55164
13973B457238l47535m8431o5968P4871n6996r3161K04420k36790J10447j63551
13963A834544O518J09509p4971j01294M81339l14147j27211k06649r2685K96076
$$ y = [2343693, 2573594, 2608133, 2665689, 2341737, 2278244, 2313428, 2144007, 2207864, 2328414, 2245172, 2148827, 2540181, 2321662, 2189409, 1877526, 1881879, 2081781, 2092671, 1733956, 2062948, 1921545, 1773687, 1862955, 2154523, 2078879, 1732089, 1896324, 1665882, 1867234, 1890520, 1576215, 1536806, 1700208, 1592754, 1656313, 1547812, 1540296, 1555210, 1623596, 1963463, 2154068, 2441002, 4656608, 10369500, 25530381, 37211691, 25374876, 15694292, 9672170, 6917514, 4615916, 4001242, 3567248, 2739478, 2695283, 3012402, 2457238, 2109703, 2061272, 1995304, 2070175, 2013179, 1920018, 2124438, 1887648, 1998095, 1834544, 1841062, 1950571, 1875600, 1774306, 2255645, 1941498, 1814287, 1607638, 1514953, 1811029]
13953A811029Q8j46324J80780k61563R9464k8309O4406j2452l8572K61218k33057
13942A696708j39570j57728N63367m10559o7896L63936k07358p3230j47563J35056
13932A555163K4508j79924q9402m14298M46836L64893j80971j23669J65621l66849
13922A201908K77136j68303k4917K56872k90866k36622M61205M25253l75774j23252
13912A402640j05316J03355J11987K00956j69210k93810K11964n61965M82931
13903A383532j73445K40136Q7467m47738J11683j23894J3066J54077J22495o304
13893A361075l55121p2495K4968k8941M00888n1184m29838K59665n0453j35456
13883I23108K84463j87623P4535J42415k5151l3184k53008K17174j42147N3348
$$ y = [1811029, 1811117, 1664793, 1845573, 1584010, 1683474, 1655165, 1719571, 1707119, 1668547, 1929765, 1696708, 1557138, 1399410, 1962777, 1552218, 1484322, 1848258, 1640900, 1567670, 1420107, 1555163, 1579671, 1399747, 1310345, 896047, 1342883, 1707776, 1526805, 1403136, 1568757, 1201908, 1479044, 1310741, 1285824, 1542696, 1251830, 1015208, 1476413, 1901666, 1525892, 1402640, 1297324, 1400679, 1512666, 1713622, 1544412, 1250602, 1462566, 900601, 1383532, 1210087, 1450223, 1537690, 1089952, 1201635, 1077741, 1090807, 1244884, 1367379, 1361075, 1005954, 933459, 958427, 929486, 1330374, 1279190, 849352, 1109017, 1058564, 923108, 1207571, 1019948, 1094483, 1236898, 1211747, 1178563, 925555, 1142729, 1000582, 1053930]
13873A053930m16231J79455K32504R4889k73919R0960J55430m9562j67721l5789
13863H63946Q3985J16838k66641K55972l47053K04539J3244l09570J93426K8583
13853H37269n9165l23371J75990K14036j43572j24001K56814J74025J58185K36759
13843A402969m83234l55111J85205m0868R3584N9636n057k959n8054q6824k702
13832G06585L86598j98897k52854o933K77648J38398l91400k32928N26451k37237
13822G15431O883p648Q3523l13159L37121R6502m39759K11065r0338J81780j11405
13811F69996n4855J1869J45666k50722L7545n0334O01836m44312A97390M61033
13801F58423J81463D11092r154K72344j34215K98768l81657N3326n1686J41692
$$ y = [1053930, 637699, 817154, 1049658, 1144547, 870628, 961588, 1117018, 1067456, 899735, 863946, 947931, 1064769, 798128, 1054100, 707047, 911586, 924830, 615260, 808686, 837269, 778104, 454733, 630723, 844759, 701187, 577186, 834000, 1008025, 1166210, 1402969, 919735, 564624, 749829, 708961, 802545, 862181, 857124, 854165, 796111, 709287, 706585, 1093183, 894286, 641432, 634499, 912147, 1050545, 659145, 426217, 952668, 715431, 722314, 714666, 798189, 485030, 822151, 918653, 478894, 689959, 599621, 781401, 669996, 615141, 627010, 772676, 521954, 559499, 509165, 1111001, 666689, 197390, 658423, 839886, 411092, 401938, 674282, 540067, 838835, 457178, 510504, 458818, 600510]
13791F00510J33726J3526k32072K4006l1454k8000K15246j44425N8614P9680B29991
13779G04157O5487J8358j06452p0002o6569N3232j7758P7913j6470k5809k19141
13768C96946K22079n198j66416J33345R6298j86491J4132j8419J34952k7998o8863
13757E24367J22562O934r2329q3820K30178k52951J74899M8911k87956N4912N3440
13746D99147j81769M60091o3315A01859K4085J30717J35850L6584r1797K5021
13736C62319K96663j29766P2423j26483J35316j32842j80421L48879j46332K72149
13726G71905l04172A98438O4396D0887N46245J55286A36586N79610k7219j67345
13716E21632A81798L72277B49457J02350Q1652A24278M17065K9217J25439j29572
$$ y = [600510, 734236, 747762, 515690, 539696, 508242, 480242, 695488, 551063, 609677, 689357, 229991, 704157, 769644, 788002, 681550, 611548, 544979, 598211, 580453, 658366, 641896, 616087, 396946, 619025, 613827, 447411, 580756, 677054, 490563, 504695, 486276, 621228, 593230, 524367, 646929, 653863, 561534, 477714, 707892, 454941, 629840, 678751, 390795, 445707, 499147, 317378, 777469, 714154, 101859, 125944, 256661, 392511, 429095, 337298, 362319, 658982, 529216, 601639, 475156, 610472, 477630, 297209, 646088, 499756, 771905, 467733, 198438, 262834, 40887, 587132, 742418, 136586, 716196, 688977, 521632, 181798, 554075, 249457, 351807, 433459, 124278, 541343, 570560, 695999, 566427]
13706E66427k25283j38883K97791C8291M32199O3992k23405G6544M09298P1640
13696E57482J52325C34208K46506J42385C03504J64662J39704k75619n9793K26767
13686D99225p997j65507A60291K72105p670o0000j46653Q7934k4901Q5442j07994
13675B58554p6503o4955J94777o2613F0705J89233J30662R9483k10105K57314
13665E27292j32179A01948P70408l00760j92518P4054M4419Q8296q2952j63723
13655C39172J14028j51011G045M59839k09788m2791J70279q9174M04600C05044
13644F27950C03676M2678k8153A22314K56254J04109f404C78138J60084j7573
13634E20649j4463B41918k5786J60160E5985L22045J70037B63742p2491J74294
$$ y = [566427, 341144, 202261, 500052, 38291, 470490, 534482, 311077, 76544, 485842, 557482, 709807, 334208, 580714, 723099, 303504, 468166, 607870, 332251, 272458, 499225, 491228, 325721, 160291, 432396, 424726, 364726, 218073, 306007, 281106, 366548, 258554, 182051, 117096, 311873, 249260, 60705, 249938, 380600, 480083, 269978, 527292, 395113, 101948, 872356, 571596, 379078, 453132, 497551, 585847, 502895, 339172, 453200, 302189, 7045, 466884, 257096, 214305, 384584, 295410, 700010, 305044, 627950, 303676, 346354, 318201, 122314, 378568, 482677, -6404, 378138, 538222, 520649, 506186, 241918, 216132, 376292, 55985, 378030, 548067, 263742, 191251, 365545]
13624C65545N2895O5650N8999I9767L03531j37372M29574C11106J64346l9085
13614D36367A41801K33262B4626M76933k04434l8642H9267M93688j08995I0852
13603A25875J20590B6117M36803A11362J12009J05643j8121b0781F6852N56759
13593F23611k32495P8677J94393B40633l3096p5126K18828j58631L69110B77038
13582A1621K07593L18293A48512p2436M83L12946O2342B11440L349k9499J61469
13571C46759G2377J62745H6271C1009L18068A30598K09576g6294C61745R242A50223
13559d7302D90182A7221K64829K3929j32526J7910b24245A53528J15186L02404
13549E71118B71922j09780K26034N1989A71589l1552K33517k8661J8333A80844
$$ y = [365545, 418440, 484090, 543089, 99767, 403298, 265926, 695500, 311106, 475452, 436367, 141801, 375063, 24626, 501559, 297125, 258483, 89267, 582955, 473960, 90852, 125875, 246465, 26117, 462920, 111362, 223371, 329014, 310893, -20781, 66852, 623611, 391116, 469793, 664186, 240633, 207537, 132411, 351239, 192608, 561718, 277038, 11621, 219214, 537507, 148512, 76076, 76559, 389505, 451847, 211440, 214789, 185290, 346759, 72377, 235122, 86271, 31009, 349077, 130598, 340174, -76294, 361745, 370987, 150223, -47302, 490182, 17221, 282050, 305979, 173453, 191363, -224245, 153528, 268714, 571118, 271922, 162142, 388176, 440165, 171589, 140037, 373554, 344893, 363226, 180844]
13538D11344q6314A27777K32114i6164G4347K57171a23962D02461A66893J3679
13528A80572K71532B24096J13564P137j37896G2007K1030K30973o2499A27425
13517E11507H0223R4283K09404n5066K11331A00237O3257j3110J8161J95389M8832
13506D12766A72784J54110n0369a8060A14636D2345K24274J01341a33394B06232
13495B52650A20465E9992N2799O4447Q0740p7073M86122A49610K32963n0478L2425
13484C64520l0557q4033m9201l672k8185J17840A14802e0914A4928a26951B9200
13472B02406L40473F3833K12544j34250l8183Q2403J43525j52373M01220A57317
13461a56125C28754K3067h594q064B43248l1416k772o4624J64430a0191B15647
$$ y = [411344, 325030, 127777, 359891, -96164, 74347, 331518, -123962, 402461, 166893, 180572, 452104, 224096, 337660, 344797, 206901, 72007, 93037, 324010, 261511, 127425, 511507, 80223, 174506, 383910, 328844, 540175, 100237, 163494, 150384, 168545, 363934, 412766, 172784, 326894, 276525, -18060, 114636, 42345, 266619, 367960, -133394, 206232, 252650, 120465, 59992, 112791, 177238, 257978, 180905, 667027, 149610, 382573, 332095, 364520, 333963, 249930, 200729, 197057, 168872, 286712, 114802, -50914, 14928, -126951, 29200, 202406, 542879, 63833, 276377, 142127, 103944, 186347, 329872, 177499, 578719, 157317, -156125, 328754, 351821, -8594, -16658, 243248, 211832, 209060, 144436, 308866, -10191, 215647]
13449D38571j62438j08157D83K30401J86084P0365A94911K25709j95439A6097
13438C01704D3174L50001j65856A12525J50613j00551K11167A0687K35503h0062
13427A61511l1242J92114j05862K35990j53189B8680L68741A95779O9518n0666
13417B14631R0354a85036i0255C55650i859I7589l6301a12407C16584j36817B9482
13405B56771j24928K56403A86156K1398j625J87774A28339L2696J17657N8953
13395C37645J55154G8931c7490A35084P9858h5282j01124A05772Q0819F4744k6874
13384C7870a96723C83040a33404r4178G3292R7518J7707K19504A24401J12341
13374B36742a42201I9625D5595L9292a89042E8630J18403M812E8801K40774D3562
$$ y = [438571, 276133, 167976, 483, 230884, 416968, 487333, 194911, 420620, 225181, 16097, 301704, 43174, 393175, 227319, 112525, 263138, 162587, 373754, 10687, 246190, -80062, 161511, 130269, 322383, 216521, 452511, 299322, 28680, 397421, 195779, 265297, 214631, 304985, -185036, -90255, 355650, -9859, 97589, 61288, -112407, 316584, 179767, 29482, 256771, 131843, 388246, 186156, 207554, 205929, 393703, 128339, 161035, 278692, 337645, 492799, 78931, -37490, 135084, 214942, -85282, -186406, 105772, 186591, 64744, 37870, -196723, 383040, -133404, -227582, 73292, 170810, 188517, 408021, 124401, 236742, -142201, 99625, 45595, 84887, -189042, 58630, 177033, 181845, 58801, 299575, 43562]
13362B03208G7607A8823L40013A2808K37231J3038b79273C42987a98547A04894
13351I3335J57946J02060o9448f7948j7476C96632A48844l5052O7986m6161K45535
13340C81152j51059a01443A47041b358A93608O4995q7530N9674b4683f410A77367
13328B17658E451N12751B43122j5931J17906A02284J42885D9269L2528l9122k1182
13317B1493L3647P6337m8156k9914N1389O6994M183k8925l7412h1468j01919A46046
13304E6554g1684J6948D2371N5876J09134A03356Q2706Q7395A9162g6052C94725
13292F4853f9349o1961A44319C715J19145K49602a76000O3975A2294b1874C21593
13280A93258n9523M0956o807a42390B81451a47168A30478J4960d303k147l389
$$ y = [203208, 77607, 18823, 358836, 12808, 250039, 263077, -279273, 342987, -198547, 104894, 93335, 251281, 353341, 283893, -67948, -85424, 396632, 148844, 113792, 181778, 135617, 381152, 230093, -101443, 147041, -2358, 193608, 258603, 171073, 230747, -24683, -6410, 177367, 217658, 5451, 518202, 243122, 227191, 345097, 102284, 245169, 49269, 81797, 42675, 21493, 55140, 131477, 83321, 53407, 104796, 171790, 175973, 147048, 109636, -81468, -183387, 146046, 56554, -71684, -54736, 42371, 98247, 207381, 103356, 186062, 273457, 19162, -76052, 394725, 64853, -69349, -131310, 144319, 3715, 122860, 372462, -176000, -112025, 12294, -21874, 321593, 193258, 133735, 174691, 167884, -142390, 281451, -147168, 130478, 145438, -4303, -6450, -9839]
13269i839k630A4662K7270b75893E17016B32287l0174n4691J22122j11878f0753
13257B70527A09419j079J66445a14005A86070c913E3986N5699d0942A33774a96942
13245D7541J60668b05720B72132E9853M56778j92010e756p9948A13825B1341K82126
13234C03467B7331K25857A4572J66031a66382A00900M7044l9213j2580K66645
13224C62796A14922C0411Q7662b36389C2997g8061a5900j17382A68284m8044j0360
13213A09880d7688C2576K9065J5591P8208N5686a62511E0389f6839I7668c2085
13201A31262K55598G5576M6674E5223b35103b8844i86j15127d9524j61341A749
13189A69026i5020j9949B01911l929h7339N031L162A17843f7017G5232l5006q501
$$ y = [-9839, -12469, 14662, 41932, -275893, 517016, 232287, 202113, 147422, 269544, 157666, -60753, 270527, 109419, 108340, 274785, -114005, 186070, -3913, 53986, 109685, -40942, 133774, -196942, 47541, 208209, -205720, 272132, 59853, 516631, 324621, -5756, -85704, 113825, 21341, 303467, 27331, 253188, 14572, 180603, -166382, 100900, 147944, 108731, 96151, 362796, 114922, 30411, 118073, -236389, 32997, -78061, -15900, -133282, 168284, 120240, 109880, -47688, 32576, 61641, 77232, 155440, 211126, -162511, 50389, -66839, 97668, -32085, 131262, 386860, 75576, 122250, 55223, -235103, -28844, -986, -116113, -49524, -210865, 1749, 169026, -95020, -114969, 201911, 197982, -87339, -82308, -79146, 117843, -67017, 75232, 40226, 31725]
13177C1725a09099B99663f4906K1338j88633B44922C9985b10778B0188a37864
13166a7249k97427A84817n5838C7919J01185L09423a18088M058j45063A01793
13155B828J53636a33267B20504a35668D2631K39501n6911j4791F2000a19066F3928
13143H8705B7286K08063B1920a1792j55246C63466A77583J09032A9950J94194
13133B14144E283j833e1753B33321A6742J58748k0066J5220q840q103C7854J09166
13121A47020b28590E4546b5398D676K04163a74397B41166f6653f004k29535a02053
13109B18546j826a34234A62308a37691c8300A01027J51600F8590d1540F8987B017
13097a05152J1658C9834h9844A51052J95244A17292M8077m7890m8200Q7485e2378
$$ y = [31725, -109099, 299663, -64906, -43568, -232201, 244922, 39985, -210778, 20188, -137864, -17249, -314676, 184817, 128979, 37919, 139104, 448527, -118088, -114030, -259093, 101793, 2828, 156464, -133267, 220504, -135668, 42631, 282132, 225221, 210430, 62000, -119066, 63928, 88705, 27286, 235349, 21920, -11792, -167038, 363466, 177583, 286615, 19950, 214144, 5283, 3450, -51753, 233321, 16742, 175490, 155424, 170644, 161804, 153701, 37854, 147020, -228590, 54546, -25398, 4676, 208839, -174397, 241166, -66653, -6004, -235539, -102053, 218546, 216720, -134234, 162308, -137691, -38300, 101027, 252627, 68590, -41540, 68987, 2017, -105152, -93494, 39834, -89844, 151052, 346296, 117292, 165369, 117479, 69279, 156764, -52378]
13085B24214b00588D02J52306a88583B0406K18944n7496C6305a13308h606r5613
13074a04219B84366C4495A0733h9326D6570J07091d1041B93487a8601A27605M163
13063A31768g1170j78467C6224J21672g417j64888G4677a93274L8052o382A26965
13051g1260B33919J53042G8617P0231E0796c14298g7674A41321J64700h9169D44820
13039a0324D67461f196j38896A02443b13802A91795b5431B18630K09867j07740
13029C20757c5886E5181f7758r0709B30561c6981E1196K56985q9110h7595C31722
13017D94769d9782A71024P4845f2882a0533A29600e6321B11485l3500c5969A21767
13005A52935c26902G51118B24317J30323h0576B57097a63661g250j99479A48213
$$ y = [224214, -200588, 402, 152708, -188583, 20406, 239350, 181854, 36305, -113308, -8606, -104219, 284366, 34495, 10733, -89326, 46570, 153661, -41041, 293487, -18601, 127605, 131768, -71170, -249637, 36224, 157896, -7417, -172305, 74677, -193274, -155222, -161604, 126965, -71260, 233919, 386961, 78617, 148848, 50796, -314298, -77674, 141321, 306021, -89169, 444820, -10324, 467461, -6196, -145092, 102443, -213802, 191795, -25431, 218630, 428497, 320757, -35886, 55181, -67758, -158467, 230561, -36981, 51196, 308181, 219071, -87595, 331722, 494769, -49782, 171024, 245869, -62882, -10533, 129600, -56321, 211485, 177985, -35969, 121767, 152935, -326902, 751118, 224317, 354640, -80576, 257097, -163661, -7250, -206729, 148213]
12994i0184B24591p1904a9570A071P5300K73361a92986R894f1389B530O9206b11662
12981f5881k10874l5706c7194D74766D2514a39008f5827l16748A60070a0010j6881
12970b6891C2452A2215a59221f6243B312K31411a59743e4171A66926B1115f4581
12958I0516J52063D5916M48675a77192B9580a46262G2018B2468b10511O5420j75769
12947c20860f918q4939E104b6291q6031b7654j09015B87739a0818A55979O4093
12936B20072a46143A49806P0304g6558q9164A23193b6058A40339D7292K25583
12926B72875b40304a3787d791B00545n4392C6223R8956c0023k522j3749j11874
12915a58168L8804A62249h4634a5723o086r0026a3700B46714g4870a7647k37321
$$ y = [-90184, 224591, 152687, -19570, 1071, 76371, 349732, -192986, -183092, -61389, 2530, 71736, -211662, -65881, -276755, -312461, -37194, 474766, 42514, -139008, -65827, -382575, 160070, -10010, -26891, 32452, 12215, -159221, -66243, 2312, 233723, -159743, -54171, 166926, 21115, -64581, 90516, 242579, 45916, 494591, -177192, 29580, -146262, 72018, 22468, -210511, -145091, -320860, -6918, -91857, 5104, -26291, -112322, -27654, -136669, 287739, -10818, 155979, 220072, -146143, 149806, 220110, -76558, -165722, 123193, -26058, 140339, 47292, 272875, -240304, -13787, -4791, 200545, 146153, 36223, 135179, -30023, -32545, -46294, -158168, -119364, 162249, -84634, -15723, -21809, -111835, -13700, 246714, -74870, -17647, -254968]
12904b54968B79683I5320h2993A67983p0036j115a79493j39014E27031a21444
12893A4427M7088f8170J2608D2245j1667J39198i6757L7943j10719A40106J9639
12882A59745b79185D8393J38486o621p7968d0087j6515k98580F4463b20600B0897
12870I4302l5939L9194D3610a86261b8796A60363K32212A17170a55405o3669E893
12858b8627A6419R0445c5596o9305C33795H6195g6608A57546C6640K07663E2943
12846B22304b01019G2985e9906k06729B65029o1752a45398j18528A05050b23818
12835b09453e6025j20031a931j02110A25264K1969a59469A29571B4789J93964
12825B18753L7354b71505a01667A80522A984K54572b34125o3765J00530Q8565
$$ y = [-254968, 279683, 95320, -82993, 167983, 97947, 96832, -179493, -318507, 527031, -121444, 14427, 61515, -68170, -55562, 42245, 30578, 169776, -96757, -58814, -169533, 140106, 159745, -279185, 48393, 186879, 180258, 102290, -40087, -56602, -355182, 64463, -220600, 20897, 94302, 58363, 97557, 43610, -186261, -28796, 160363, 392575, 117170, -155405, -219074, 5893, -28627, 16419, 106864, -35596, -104901, 333795, 86195, -76608, 157546, 36640, 244303, 52943, 222304, -201019, 72985, -59906, -266635, 265029, 203277, -145398, -263926, 105050, -223818, -209453, -56025, -176056, -1931, -104041, 125264, 147233, -159469, 129571, 24789, 218753, 256107, -271505, -101667, 180522, 1984, 256556, -234125, -297890, -197360, -108795]
12815a08795J6767i840j80249E1492P0190O9343d2196J9855j220B75576h0346
12803B10339I2950M3154a04880d9320p6552A0482f5769r4384c85j92490d4912
12791e3189k66336D9994a4930k39697f7066D2992b28158F2812a90752a2064I5819
12779B55620b56710C45817p4953G6885K49472d0676M818J3578l34088J33756H4784
12767B4977K66860a43887G3848M13144a43164D1802K12910c30r3383D8223c61130
12755E6155i5078A3829K5672b67486F7102M11873k38948c9942A57387b2150l16374
12744c38524b686E607e6591B67128G9664J18472b3235r5502a8216j54282G6584
12732D2615J07313E8024K2174K108a96107B94923b39434l4081B49127a34707M9448
$$ y = [-108795, -92028, -9840, -190089, 51492, 121682, 191025, -42196, -22341, -23561, 275576, -80346, 210339, 92950, 136104, -104880, -49320, -125872, 10482, -65769, -160153, -385, -192875, -44912, -53189, -319525, 49994, -14930, -254627, -67066, 42992, -228158, 62812, -190752, -12064, 95819, 255620, -256710, 345817, 270864, 76885, 326357, -40676, -35858, -22280, -356368, -222612, 84784, 24977, 291837, -143887, 73848, 486992, -143164, 41802, 254712, -330, -93713, 48223, -361130, 56155, -95078, 13829, 39501, -267486, 67102, 478975, 240027, -39942, 157387, -22150, -338524, -2686, 5607, -56591, 267128, 79664, 198136, -23235, -118737, -18216, -172498, 76584, 42615, 149928, 58024, 80198, 82306, -196107, 294923, -239434, -273515, 249127, -134707, -85259]
12721h5259o3857b604C6211J29329c56226D23376j16046a48164I8209A0859b80365
12709C18402G1830k1729a92976I0189J70246m2431J7929D967R2654J43866B7477
12697h8496a5904j50285g3782H5214a5046m271o252k35356c5987m09876A81717
12685B12130k6217a0880B59907A5913a04445L7054B2831L4282J56492A03543A6982
12673d7390n8283P056B8929L2762r226M05453q5668o2358K20000a71571Q2776
12662h8795m8987C09506b3698k62953O92A99546c971B14310a32148K6943H5258
12650D04534G4293J43939a95716f9690L109c0171n4647A63338G1935f7748j5685
12639h3433B1097b1289F9217b09897j0610O8895p0771C8962g4828B47104A17649
$$ y = [-85259, -149116, -2604, 36211, 165540, -356226, 423376, 307330, -148164, 98209, 10859, -280365, 318402, 71830, 50101, -192976, 90189, 260435, 218004, 235933, 4967, 97621, 241487, 27477, -88496, -15904, -166189, -73782, 85214, -15046, -19317, -25569, -260925, -35987, -445863, 181717, 212130, 185913, -10880, 259907, 15913, -104445, -67391, 22831, 57113, 213605, 103543, 16982, -47390, -105673, -98617, 28929, 61691, 52465, 457918, 372250, 309892, 529892, -171571, -88795, -137782, 309506, -23698, -286651, -285959, 199546, -3971, 214310, -132148, -105205, 85258, 404534, 74293, 218232, -195716, -69690, -66581, -30171, -84818, 163338, 71935, -67748, -83433, 21097, -21289, 69217, -209897, -220507, -151612, -222383, 38962, -74828, 247104, 117649]
12627A517J70604f949A14906d01007A49089d6735C02431E1982J2369D622a13811
12615a45985E2840b0785B66660D2247K207a46069K9777I4379a79651A17997g3515
12603c5420j36351D2299a55639F5385P2580j4957f2305B18722I5852b71039d5251
12591g4392k2803j33999A63421O2474C5772J55954n3895b0611q1727A62755b8944
12579A80036i4554A09211c28160b7499J0713n2526k8812E7380J94304J29650a79139
12567a7792r0413N2179j25058g5382A27529b0873j12120j68736A58916a51940
12556A11882a12633n689c6303F6721i5664H1084O5968L8590d0168G6460M4760
12545A21220b20159C2768G032a13538B18749c92003J86449c721k25089N70r351
$$ y = [1517, 172121, -6949, 114906, -401007, 149089, -46735, 302431, 51982, 64351, 4622, -113811, -145985, 52840, -20785, 266660, 42247, 44454, -146069, -116292, 94379, -179651, 117997, -73515, -35420, -171771, 42299, -155639, 65385, 137965, 123008, -62305, 218722, 95852, -271039, -45251, -74392, -97195, -231194, 163421, 225895, 35772, 191726, 137831, -20611, -102338, 162755, -28944, 180036, -94554, 109211, -328160, -27499, -16786, -69312, -98124, 57380, 251684, 381334, -179139, -17792, -108205, -56026, -181084, -75382, 127529, -20873, -132993, -301729, 158916, -151940, 111882, -112633, -118322, -36303, 66721, -95664, 81084, 147052, 185642, -40168, 76460, 121220, -220159, 32768, 7032, -113538, 218749, -392003, -205554, -3721, -228810, -228240, -237591]
12534b37591B25336L07422j49927b03511C19447j16167J67480a58160b677q6551
12524h9228A87029c23246L049J31872L9820B25930A10211a18923A08593B1161
12513A26813l8421d1326E4273L36j8580d1894j89383B24538a60135l6292A88204
12501A2976L39285A43213a04082A00889R2148j2243n1488L68628b18503i0465
12490A45125B087Q0342L67787A8543K00435a16705m2523J8495b2032I2758a39680
12478f3239j1305f240n1500C5626J37261a3483k19867A37473b37010D33951a80177
12466a72984F1645F13L9138J32877c53356B84720b1601B25443d0136A47932b54636
12454b92869B16650B3549b82965Q1554P5800E6066M86443b96444g2862k40341
$$ y = [-237591, 225336, 532758, 382831, -203511, 319447, 203280, 370760, -158160, -2677, -89228, 187029, -323246, -320197, -188325, -148505, 225930, 110211, -118923, 108593, 21161, 126813, 88392, -41326, 54273, 54609, 36029, -41894, -231277, 224538, -160135, -196427, 188204, 12976, 352261, 143213, -104082, 100889, 193037, 180794, 129306, 497934, -218503, -90465, 145125, 2087, 82429, 450216, 18543, 218978, -116705, -159228, -140733, -22032, 92758, -139680, -63239, -74544, -6240, -57740, 35626, 172887, -13483, -233350, 137473, -237010, 433951, -180177, -172984, 61645, 613, 39751, 172628, -353356, 284720, -21601, 225443, -40136, 147932, -254636, -292869, 216650, 23549, -282965, -201411, -125611, 56066, 542509, -296444, -72862, -313203]
12444c13203A15199c42288b1770j2843a931j47930e7819A3149J19498A091Q0127
12433H1218K39058j36680K54753A42141O1687b18870Q2058C60673a19075l07557
12423d26632B30324m7191b44573c5159j75417P5426A43300J8246a15377j44289
12413b59666H9835b61034i9350l0295j23964C4970M9195K1729O8220e7864C1830
12401A89648b82316A4621K22413F8906j4490j2691b86580A68455C5357a21461
12390A67978f8324m1933L5862o0468A44325Q7736g5596E0772a80133A9219Q6704
12379A05923i3693p7160E3471K14463a0421l20406J59471D657a62238P3446h955
12367A13018e76603A42097c0912I5514f0881A80615j2076b42774J1153F0516R6448
$$ y = [-313203, 115199, -342288, -21770, -34613, -1931, -149861, -57819, 13149, 132647, 1091, 81218, 320276, 183596, 438349, 142141, 203828, -218870, -136812, 360673, -119075, -426632, 230324, 183133, -244573, -35159, -210576, -135150, 143300, 161546, -115377, -259666, 89835, -261034, -99350, -129645, -253609, 34970, 84165, 105894, 174114, -57864, 31830, 189648, -282316, 14621, 237034, 68906, 54416, 41725, -286580, 168455, 35357, -121461, 167978, -68324, -110257, -74395, -134863, 144325, 232061, -75596, 50772, -180133, 19219, 105923, -93693, -170853, 53471, 267934, -10421, -330827, -171356, 4657, -162238, -88792, -8955, 113018, -576603, 142097, -30912, 95514, -60881, 180615, 168539, -242774, -231621, 60516, 156964]
12356A56964p6284l5781K59949G6608o60b73429q6122A70158q4556d6398j7811
12345f4209k01352K4954O2650D3925b18865B04930A00125a4419H193a08754e3759
12333A83511a46009K2532B6573O584a05729G5663c32201b3047B6134L38290h4381
12321g4555E0085b14973j6412H1320a02701B9065b1326j13114N3954k46389d3530
12309H6445M6132a63924H5105B6378i866l1416C30000B7325J58675a2220C43402
12297A20601J9735O9378c7582B07255a09020A59752i8472b1324j67457K4481B9887
12285a47099B56862B2674J85733f8736B69254h392j90493A78817a69291P936K5360
12274a35995N4769a210j89209B76926I2890d5045C39284B0827N3796a64934E9750
$$ y = [156964, 80680, 44899, 304848, 76608, 75948, -273429, -359551, 170158, 85602, -46398, -64209, -265561, -240607, -177957, 43925, -218865, 204930, 100125, -14419, 8193, -108754, -53759, 183511, -146009, -123477, 26573, 33157, -105729, 75663, -332201, -23047, 26134, 364424, -84381, -74555, 50085, -214973, -231385, 81320, -102701, 29065, -21326, -134440, -80486, -326875, -43530, 86445, 132577, -163924, 85105, 26378, -9866, -41282, 330000, 27325, 186000, -12220, 343402, 120601, 140336, 209714, -37582, 207255, -109020, 159752, -98472, -21324, -188781, -164300, 29887, -147099, 256862, 22674, 208407, -68736, 269254, -8392, -198885, 178817, -169291, -161355, -135995, -81226, -1210, -190419, 276926, 92890, -45045, 339284, 20827, 74623, -164934, 59750]
12262A09017b5896l71585B54786J62518g6854k70263A90313G4589A123M5349a01194
12250B17898a50317o4397F8536J62445J8504h5877I8577J64322E2590K28724n2512
12239B28802k2511a46632C07161D1072N3173c17399a11466n0067e6080k6311F9671
12227b57113C4545L98326p2785A70530C8505K56982m5037J86594B07915m8928
12217A58987L5604a01888n6111I3782c55402A27031J7043j5497f2997B45287e3461
12205a56944r0697h8399A26713g37j2053j02736a1540j67543F833J90472a10271
12193B58249A3221L74276A3203L77528I6735f5177D0869C908K75966J17076A58374
12181c1352G0710h8798k87759A45539K07768A020a6006D00719A35997R5907K40777
$$ y = [109017, -25896, -397481, 254786, 417304, -76854, -347117, 190313, 74589, 1123, 46472, -101194, 217898, -150317, -214714, 68536, 230981, 249485, -85877, 98577, 262899, 52590, 281314, 228802, 206291, -146632, 307161, 41072, 94245, -317399, -111466, -161533, -56080, -82391, 69671, -257113, 34545, 432871, 360086, 170530, 38505, 295487, 250450, 437044, 207915, 158987, 194591, -101888, -157999, 93782, -355402, 127031, 144074, 128577, -62997, 245287, -53461, -156944, -247641, -88399, 126713, -737, -12790, -115526, -11540, -179083, 6833, 197305, -110271, 258249, 13221, 387497, 13203, 390731, 96735, -65177, 40869, 3908, 279874, 396950, 158374, -31352, 70710, -88798, -376557, 145539, 353307, 1020, -16006, 400719, 135997, 231904, 472681]
12170D72681k18788j24203J84337o9196F5253B9398e961p8734A70640n0576m4466
12159G5598b891A39020J43154C5218a09626D5376a10931j2157B56995b33298f0468
12147B10836n7034n0617b990C15073a99163a5337A01992a95426A16119E367a6556
12135E53677D0970a44957A20014e037C6074b8550A37878b8700j02398b4004B48996
12123c89461D1185e4972j93354d9128m5875d2560A62390c6103j3918j8495Q345
12112f0171I7284g9904L2270J3258C16547A11796l2871h8243A29901e4874k0349
12101g5223K5193e504C3660D219a30620j34111K7196i929l8474E4458a80405c9156
12088e1706A70929c2250j45353N5899b9266A45848a30805K8302D2638b4017j5722
$$ y = [472681, 253893, 129690, 314027, 244831, 65253, 29398, -5961, -84695, 170640, 120064, 75598, -2891, 139020, 282174, 35218, -109626, 45376, -110931, -123088, 256995, -233298, -60468, 210836, 153802, 103185, -2990, 315073, -199163, -15337, 101992, -195426, 116119, 5367, -16556, 553677, 40970, -144957, 120014, -5037, 36074, -28550, 137878, -28700, -131098, -24004, 248996, -389461, 41185, -54972, -248326, -49128, -95003, -42560, 162390, -36103, -50021, -68516, -60171, 97284, -79904, -47634, -34376, 316547, 111796, 78925, -88243, 129901, -54874, -75223, -50030, -5504, 33660, 4219, -130620, -264731, -237535, -9929, -48403, 54458, -180405, -39156, -51706, 170929, -32250, -177603, -121704, -29266, 145848, -130805, -102503, 42638, -24017, -39739]
12077c9739A13232a81836Q219m8778r5990a05761f656r6285L3746G0690B1557
12065D1495b90258C93837A46474C7714c8251j15355J0896B20507e8686J0000A67829
12053I0052Q0066g5251K1225j04968j79967e9631k34300A95218I1262C3013J77960
12042B10973M2053O80678L36919o16575C23117A00074J88870H6717c20601A45752
12031a17686j34377h8877A4442a93005C9940J22632a83819M928R465A87738a14272
12019a2176k0449k40150A06917M7409a0105p9910m9602n9149A20949k6044C5187
12007E7186a3591A27792g3785q650c8827C9998b05451D2174L6697a9386l5232
11996e4618l71217b06119l56923e5671O193N085E04630G2106b9228B39669J89483
$$ y = [-39739, 113232, -181836, -173617, -222395, -318385, -105761, -6656, -102941, -69195, 70690, 21557, 41495, -290258, 393837, 146474, 37714, -38251, -153606, -142710, 220507, -58686, -48686, 167829, 90052, 170118, -75251, -54026, -158994, -338961, -59631, -293931, 195218, 91262, 33013, 210973, 253026, 933704, 1270623, 654048, 323117, 100074, 288944, 86717, -320601, 145752, -117686, -252063, -88877, 14442, -193005, 39940, 162572, -183819, -178891, -169426, 187738, -114272, -12176, -32625, -272775, 106917, 154326, -10105, -90015, -139617, -198766, 120949, 94905, 35187, 57186, -13591, 127792, -73785, -82435, -38827, 39998, -205451, 42174, 78871, -19386, -54618, -425835, -206119, -563042, -55671, -49478, -44393, 504630, 72106, -29228, 239669, 429152]
11985D29152b36820h2671L8708D7796b65701l4771j17211A2076Q2772a88954i296
11973d9839B0068J73927I2595i6258b1385A5334i6070D4149A4702B726b3520r8561
11961a22081A38443M0157b42011E1751d6175A95334d1410D7783J23170J22494
11951B93447r1311l2145a91236A24958h8181I5873A3754a67920j1633J840B3684
11939e2843m2889A53552f9668l6791C6112c0644j36347A4513a56472A12035R7176
11928B09211A01105J68129a46414e4427o1417n5618F9051a64149P2351a5063A77451
11916a95919k6100B9598f129A3775e8917p5102d7538p3687H7445B0106K85216
11905C05322a47352k9496j6759L3321A44054a69746j63684A39900a20992c0267
$$ y = [429152, -236820, -82671, -43963, 47796, -265701, -300472, -417683, 12076, 94848, -188954, -9296, -49839, 20068, 193995, 92595, -96258, -21385, 15334, -96070, 44149, 14702, 2726, -23520, -122081, 138443, 178600, -242011, 51751, -46175, 195334, -41410, 47783, 170953, 293447, 202136, 169991, -191236, 124958, -88181, 95873, 13754, -167920, -179553, -177713, 23684, -52843, -95732, 153552, -69668, -106459, 36112, -30644, -166991, 14513, -156472, 112035, 209211, 101105, 269234, -146414, -54427, -115844, -171462, 69051, -164149, -91798, -15063, 177451, -195919, -222019, 29598, -6129, 13775, -58917, -134019, -47538, -121225, 87445, 20106, 305322, -147352, -176848, -193607, -160286, 144054, -169746, -333430, 139900, -120992, -30267]
11894f6886a247l15579a19938o8101E2582c08691a1072D7974c39038B04752a79046
11882H3269e8699p9431O5357H1116J18011d17301a19933J1831A6163b22406G4363
11870A6970i7962K4185I831N55a38654b182k1957G9445a18602K5328C1208d6360
11857b00804r1351C34224d3893H1469c58873A2763J69581a3496H2331f8690B50
11845b85766B48423a73686c9659G4308a38143k26128a63312B39250I6739e2614
11834F7763b09111J5436K7971G0243a72786a9071B11267b71027i793n2392j18266
11823a80451A97137B8410K29759e9626K5879n8457o3089n7113A04547a16579j76574
11812b93153B21980b54763A86578p4726a120E9124d718C2346a58370d1245C9637
$$ y = [-66886, -1247, -316826, -119938, -188039, 52582, -308691, -11072, 47974, -339038, 204752, -179046, 83269, -58699, -138130, -72773, 81116, 199127, -417301, -119933, -108102, 16163, -222406, 74363, 16970, -97962, -73777, 9831, 10386, -138654, -2182, -24139, 79445, -118602, -93274, 31208, -46360, -200804, -292155, 334224, -43893, 81469, -358873, 12763, 182344, -13496, 82331, -68690, 250, -285766, 248423, -173686, -39659, 74308, -138143, -364271, -163312, 239250, 96739, -52614, 67763, -209111, -193675, -165704, 70243, -172786, -19071, 211267, -271027, -9793, -62185, -180451, 197137, 28410, 258169, -59626, -33747, -92204, -155293, -212406, 104547, -116579, -293153, 221980, -254763, 186578, 111852, -1120, 59124, -4718, 32346, -158370, -41245, 39637]
11800c96163G0002a83866B72753H3984a77414h0651n5474B878b52334R5125J6446
11789a40763A9914H986K9256N54562b04800k05334a44442A04164a6304l26871
11779c43175A6754a64708C05389c03180I4501a7228j20922a2686F9791h3043A56076
11767b37619F9682K0464J23091c366D5009K97514F3061K43215A05237m4459J08052
11756A68830f7565l96752a99162E8934b90532J08986k668A32397m5465j8507R7567
11745A65992E3933a81982C1674O5816D0273f3517k10264h0439D9104Q5874J32539
11734B67517j28235D3595h2290B16028c33002h7180c6003m0262c544l0824j68531
11723b02899A72146a4055A29715e1692D7002f8720J9328j18962J230j89671C2692
$$ y = [-396163, 70002, -183866, 272753, 83984, -177414, -80651, -136125, 2878, -252334, -157209, -140763, 19914, 8986, 38242, 592804, -204800, -410134, -144442, 104164, -16304, -343175, 16754, -164708, 305389, -303180, 94501, -17228, -138150, -12686, 69791, -83043, 156076, -237619, 69682, 90146, 213237, -3366, 45009, 342523, 63061, 306276, 105237, 60778, 168830, -67565, -464317, -199162, 58934, -290532, -181546, -184214, 132397, 86932, 68425, 165992, 53933, -181982, 31674, 97490, 40273, -63517, -273781, -80439, 49104, 134978, 267517, 139282, 43595, -82290, 216028, -333002, -87180, -36003, -76265, -3544, -34368, -202899, 172146, -14055, 129715, -51692, 47002, -68720, -49392, -168354, -167124, -356795, 32692]
11711c0712k65190A80489a4398j37567j25380a23151A76496B6131J2843c3195
11700g6811K0761B4244N4012H130a30995j87791K2421l5a6225j86687g1112r8588
11688a69700A02477c3646D17067a25994B5302b17122f0953B37840b62156c8499
11677I7983O0152a48791f7578A34600A0165c2720B26527a07167k6383M5477A22557
11665A24768e9866j60205H7529a16030D699a78084b6423p9184G0765J49027a6193
11653g0471j23297A44079N9877i1746d3643l49751h2287j93930Q4747g3493l5801
11642a09294B13181a66069A94140b40736B86495j05274j1807J9862e7055I8422
11631B26673A05975c8978B82386c24085b3096C06118a75037A7498R1065c7337
$$ y = [-30712, -295902, 180489, -14398, -151965, -277345, -123151, 176496, 26131, 38974, -33195, -76811, -56050, 24244, 78256, 8130, -130995, -318786, -296365, -296400, -16225, -202912, -71112, -169700, 102477, -33646, 417067, -125994, 25302, -217122, -60953, 237840, -262156, -38499, 97983, 158135, -148791, -67578, 134600, 10165, -32720, 226527, -107167, -133550, -88073, 122557, 124768, -59866, -220071, 87529, -116030, 4699, -178084, -26423, -105607, 70765, 219792, -16193, -70471, -193768, 144079, 203956, -91746, -43643, -393394, -82287, -276217, -191470, -73493, -109294, 213181, -166069, 194140, -240736, 286495, 181221, 169414, 189276, -57055, 98422, 226673, 105975, -38978, 282386, -324085, -23096, 306118, -175037, 17498, 108563, -37337]
11620F6673A6251K54534l6795I943O818J26504A2976K3025K6080K13828a41676
11608a35491a6849F8371Q6955a21042k29323a04571m5071c8828m9321b7190E7971
11596A23721g1784J9864G5226i2299A14521k9203G330K51789F1884b31634G5997
11584a94729f7122B88699q2401o7632n8076J67641C2403J21473P9212G2648j8445
11573E4203j5334J36695q4115B1051J82283a69410M1798I5540b09010b4108A98011
11561H8113J09634P9899q4261a90748C936L51297a82772c7767a8539k63936R6492
11550a85983p3570a21824I8253l989k7163A9806a05623a5706E7906c31172a13080
11538d4734G8357R6534l568D0333i4686C84384j58298m1611E84a15078C5400J73412
$$ y = [66673, 16251, 270785, 233990, 9943, 16761, 143265, 12976, 36001, 62081, 275909, -141676, -135491, -16849, 68371, 155326, -121042, -350365, -104571, -149642, -38828, -88149, -27190, 57971, 123721, -71784, -51920, 75226, -92299, 114521, 85318, 7330, 259119, 61884, -231634, 75997, -194729, -67122, 288699, 206298, 138666, 80590, 248231, 32403, 153876, 233088, 72648, 54203, 38869, 175564, 91449, 21051, 203334, -169410, -127612, 95540, -209010, -24108, 198011, 88113, 197747, 277646, 193385, -190748, 3936, 355233, -182772, -37767, -18539, -282475, -185983, -259553, -121824, 98253, 94264, 67101, 19806, -105623, -15706, 57906, -331172, -113080, -44734, 78357, 174891, 171323, 40333, -94686, 384384, 226086, 184475, 584, -115078, 35400, 208812]
11526B08812h8552k09890f2461B47480N1329H6278h4824A9462J66569a86494m3200
11515b29694G3290N4293n4177a10357H6875a23380C78511A74524f694o3617B93053
11503h4484o6428B1290a46788A14026D7657a07884J6959M2304K4062A59639M9006
11492B08645a4968j05920N754D2700c0047A33597K87672j88020J9544R4780b8275
11480F463L37693L9593e4233A98339A5389e0760E0738c12495a21450j8890p2776
11469b13116R3456E6358K78413m8210A43040j5597J77968I8751d953j58327A82017
11457G2528e4333A32002J31674C6995a40429C61046j43636I0953J9821M2437E9548
11445I9706b0908A89152i3791A2018b10183n4602e3728a2042k13890b1931A06772
$$ y = [208812, -88552, -298442, -62461, 247480, 298809, 86278, -84824, 19462, 186031, -186494, -229694, 73290, 127583, 73406, -110357, 86875, -123380, 378511, 174524, -6694, -70311, 293053, -84484, -150912, 21290, -146788, 114026, 47657, -107884, -90925, -48621, -24559, 159639, 208645, -14968, -120888, -115134, 42700, -30047, 133597, 421269, 233249, 252793, 347573, -28275, 6463, 344156, 383749, -54233, 198339, 15389, -50760, 50738, -312495, -121450, -140340, -213116, -119660, 56358, 334771, 286561, 143040, 127443, 305411, 98751, -4953, -163280, 182017, 72528, -54333, 132002, 263676, 36995, -140429, 361046, 217410, 90953, 110774, 153211, 59548, 99706, -20908, 189152, -93791, 12018, -210183, -264785, -53728, -12042, -225932, -21931, 106772]
11433A59872A7814J66599a66001j93097a67460H2785M9693a07378B37918a06660
11422a52546l9983C46f6413F2154a63333A2527K17975b845B61208c23771B06239
11410G0006b24701q8389a02846b6427B53291a1549j18098A25548O7668b6553j02279
11399a28832A12630a18235B05671G2686b21821J09786b696l94117a23181A53143
11388e8223I9526K0190f9631A68411a54967E063i91j80249Q0174A10457L23287
11377D33744e0869j49303F9388a91451L8340j22115a07092J5651A30714a7976
11366a75639B78016E9183e0485k03742h9535A33488F5918a15390A50556b1651
11355B3419K3902a81865h0415o9A55661i1774G0741g062j66089O4430B11851a43184
$$ y = [159872, 17814, 184413, -166001, -359098, -167460, 82785, 132478, -107378, 237918, -106660, -152546, -192529, 346, -66413, 62154, -163333, 12527, 230502, -2845, 261208, -323771, 206239, 70006, -224701, -313090, -102846, -26427, 253291, -11549, -129647, 125548, 193216, -26553, -128832, 112630, -118235, 205671, 72686, -221821, -112035, -2696, -396813, -123181, 153143, -58223, 99526, 119716, -69631, 168411, -154967, 5063, -991, -181240, -101066, 110457, 433744, -50869, -200172, 69388, -191451, -153111, -275226, -107092, -91441, 130714, -17976, -175639, 278016, 59183, -50485, -254227, -89535, 133488, 65918, -115390, 150556, -21651, 23419, 47321, -181865, -80415, -80484, 155661, -91774, 70741, -7062, -173151, -108721, 211851, -143184]
11342A4276M34683e54324B01780c39492J13483i5827h772j28064j13616F0870
11331A98114b75277B43158o7506a45507A2925g5004C47446c23235a59501P0419
11321h9082c7685n908B24494C3317a78336B38845A00493d2240A20337b2638A46627
11309c23709J4727B00041J38390i0657A39412J22898E8806B476b9722o8835C36519
11297a89117M9972O2669n0075J1672N2051E7161f2964a369k3693F00002c19941
11285C6542O5824h1848A58613h8911J3443l04347B39979D6853a46297B41941d05875
11273B8189a93119Q8916A9758a55222j47306a28209m405C042i2327B0187f7760
11261A81434c69862J3563A57247d417r9619k70655B07696B2209J58494a78393
$$ y = [14276, 448959, -554324, 201780, -339492, -226009, -95827, -8772, -136836, -250452, 60870, 198114, -275277, 243158, 175652, -145507, 12925, -75004, 347446, -323235, -159501, -89082, -37685, -43593, 224494, 33317, -178336, 238845, 100493, -42240, 120337, -22638, 146627, -323709, -308982, 200041, 338431, -90657, 139412, 262310, 58806, 2476, -29722, -98557, 336519, -189117, -139145, -76476, -126551, -114879, -62828, 57161, -62964, -1369, -25062, 600002, -319941, 36542, 102366, -81848, 158613, -88911, -75468, -379815, 239979, 46853, -146297, 241941, -405875, 28189, -193119, -104203, 19758, -155222, -302528, -128209, -132614, 3042, -92327, 20187, -67760, 181434, -369862, -356299, 157247, -4417, -104036, -374691, 207696, 22209, 180703, -178393]
11250A33649c38714a25901j02138B0073c12774A9972h9831n6895A08137c28481
11239c01025e4672B21531e3337o2340e4161m23444B60071A9728K18592b22044
11228a43795k63756G029L29918a17498F5963b64077a7146A3910P2783k7889g8849
11216h7613q993j1188F0344b18930h2116m2718J6582m08615a30648B32326d0636
11204C8875a6116A8670C620a97764k069m7411J23214k81676A50310a18976D47001
11192b9626k37232A67716A1170b75880a28319b7459p5914A46911b04615h1614
11181H6287K4158c9373j48807B33196M915i5050B53684E6963J99518a42808M5467
11170i7341p1160m338H7107a46559B17817G7448k1690a13292H6350j1384i3715
$$ y = [133649, -338714, -125901, -228039, 20073, -312774, 19972, -89831, -146726, 108137, -328481, -301025, -54672, 221531, -53337, -115677, -54161, -477605, 260071, 19728, 238320, -222044, -143795, -407551, 7029, 336947, -117498, 65963, -264077, -17146, 13910, 86693, 58804, -78849, -87613, -96606, -107794, 60344, -218930, -82116, -124834, -108252, -516867, -130648, 232326, -40636, 38875, -16116, 18670, 3620, -197764, -199833, -247244, -124030, -405706, 150310, -118976, 447001, -29626, -266858, 167716, 11170, -275880, -128319, -27459, -103373, 146911, -204615, -81614, 86287, 110445, -39373, -188180, 233196, 238111, -95050, 253684, 56963, 256481, -142808, -97341, -168501, -172839, 87107, -146559, 217817, 77448, 55758, -113292, 86350, 74966, -93715]
11158b15888G9208J6179d20673a16195a363k21482D6128e1426j82581a04052J2243
11147i1809j7914R134b9080A12806h333A62814P0509b62456A40045a05878G3045
11135i5131A63388E5688b78904B4552J2719a59119j43049i2513A76499a24260
11124B78893f3185B61755b14629g5392A36934l2198i5065G2394a48614F8950e3215
11112A136J31357g8403q8747I4246a12429j4932C2813b53793f2826A26637E4655
11100A36642K38579j34909Q8058i9226b6168B49434E5181K79541o7308Q94a21071
11088A86856K14179G6345M02434H5028C8549K36386J13019a3292A97680i5994
11077H5157J81650b0870B51959B7178a530B18974J39766B1293g1953d270A76065
$$ y = [-215888, 79208, 95387, -420673, -116195, -1363, -222845, 46128, -51426, -234007, -104052, -91809, -109723, -100589, -29080, 112806, -8333, 162814, 233323, -262456, 140045, -105878, 73045, -95131, 163388, 55688, -278904, 24552, 37271, -159119, -302168, -92513, 176499, -124260, 278893, -63185, 261755, -214629, -75392, 136934, 104736, -95065, 72394, -148614, 68950, -53215, 1136, 132493, -78403, -167150, 94246, -112429, -127361, 32813, -253793, -62826, 126637, 54655, 136642, 375221, 240312, 328370, -99226, -26168, 249434, 55181, 334722, 267414, 268308, -121071, 186856, 401035, 76345, 478779, 85028, 38549, 274935, 387954, -13292, 197680, -95994, 85157, 266807, -20870, 251959, 27178, -1530, 218974, 358740, 21293, -71953, -4270, 176065]
11065A91659D8347L26120l9626j9680A44237K20545P8023B16139J60322J03012
11055D79473j68830R8453j53367M83190j24110j55855L42328B65669L70186B85798
11044G40105j60289k5990J89423k61205M40340C99206K13496j53772K25313k1558
11034F62685k30490J02276J11204B23606L16226A78808K85541r7848j5578K42600
11024E93523K48250k93290p7913K3394j48937J76258l2624J76167j03235j62708
11014C98885M24832C09190l6213M45719k80483l8160J99292P0162k91069M4138
11004D22576P5363L94660l83465K17067G9265M50113L4745j16735j02917J22294
10994D66765J12320r138J3390L7541J00525p60B95218J44960J64871k15832j50423
$$ y = [191659, 48347, 374467, 334841, 315161, 144237, 364782, 442805, 216139, 376461, 479473, 310643, 409096, 255729, 738919, 614809, 458954, 801282, 265669, 635855, 285798, 740105, 579816, 553826, 743249, 482044, 922384, 399206, 612702, 458930, 684243, 662685, 432195, 534471, 645675, 223606, 539832, 178808, 464349, 366501, 350923, 593523, 841773, 548483, 470570, 493964, 345027, 521285, 488661, 664828, 561593, 398885, 823717, 309190, 272977, 718696, 438213, 400053, 599345, 669507, 378438, 422576, 497939, 892599, 509134, 726201, 79265, 529378, 564123, 447388, 344471, 466765, 579085, 569947, 583337, 620878, 721403, 720643, 295218, 440178, 605049, 389217, 238794]
10983B38794L05523K70537k34597J82866L15297k98865J9848L10640J6780q5270
10973A041553j14390O24931O0966L0732L89772k54479L70587L13299J32096J6548
10963B611615P4412n14776k00911l01798q1454j30948k93491M64111k92919j87290
10953A146551l3751J9795p9522j99766J95815m35355j3940j61089M34699k61278
10943F12159m8528p7190j61861L3120q2250r2532J7384b22609A46476o4050K646
10932H5072a60907j40220A67301f4725B47201E4812b44874D5a93028B11424K5147
10921B36571f8591n3968J5999B23187b2783j59457F048a64000A35349a7814A21928
10909a43525e6760l43095J54138A37607P565l8479M5753E2385Q6995b677A02869
$$ y = [238794, 544317, 814854, 580257, 763123, 1078420, 779555, 799403, 1110043, 1126823, 1041553, 927163, 1552094, 1613060, 1643792, 2033564, 1779085, 2149672, 2462971, 2595067, 2611615, 2686027, 2171251, 1970340, 1668542, 1587088, 1456140, 1162649, 1626760, 1333841, 1146551, 1112800, 1132595, 1053073, 853307, 1049122, 613767, 599827, 438738, 873437, 612159, 563631, 486441, 324580, 357700, 275450, 182918, 200302, -222609, 146476, 82426, 85072, -160907, -301127, 167301, -64725, 247201, 54812, -244874, 45, -193028, 211424, 236571, -68591, -122559, -106560, 223187, -22783, -182240, 6048, -164000, 135349, -17814, 121928, -143525, -56760, -399855, -245717, 137607, 145172, 106693, 152446, 52385, 139380, -2677, 102869]
10897a21771M0789l4451A08266J04874I3434j7022b1059k95218O9546J02341o1458
10886b05848I243b12082O5025C2990a69899C8422c3034o380j72539f558B15908
10874D7533J06490a2892o2512C62551C6803a07479A92515G1518P6342a17172k7806
10863a44978K5164M0298b1097A72249c4054A30615e0068D1520a55476a5912k2208
10852c8120E0780H683h3349A25585C5493K25658c5875k99238p8275a29998j4032
10841a44030p5557l8212D67471i769j24919M9081j0058j24589M2973H9548b88584
10829a21950B0268O029L9658A4499c446k06481A14966B900b08323a1383B58656
10817b48928J7782B11919a79684j69644B5387b20042B23011I0008J09072a97605
$$ y = [-121771, -80982, -115433, 108266, 213140, 93434, 76412, -21059, -316277, -246731, -144390, -205848, 9243, -212082, -147057, 32990, -169899, 38422, -33034, -39414, -211953, -6558, 215908, 47533, 154023, -12892, -75404, 362551, 36803, -107479, 192515, 71518, 147860, -117172, -144978, -119814, -79516, -21097, 172249, -34054, 130615, -50068, 41520, -155476, -15912, -38120, 50780, 8683, -83349, 125585, 35493, 261151, -35875, -335113, -413388, -129998, -144030, -219587, -257799, 467471, -9769, -134688, -85607, -95665, -220254, -177281, 89548, -288584, -121950, 20268, 26297, 65955, 14499, -3446, -209927, 114966, 2900, -208323, -11383, 258656, -248928, -231146, 211919, -179684, -349328, 25387, -220042, 223011, 90008, 199080, -197605]
10806h8056B8610M9269J09350g6535k18241N7324a5898b812j3365k79348A6494
10794c79575G8921k2181a10344a0996k48016A14216b79221O3667E5575J05816
10784A61391c08752A46926D3927a10523G3166h9973k22188A29605K5653a62860
10773c31053A18399K18062e79977b12125C58786a00937b3619B3391d4882i726
10762b03632B6737a44333c3698A09349b32321e5921j45003f1382k01488a2790
10751c78349a24519D0099e728j01575A07216e8276j13352e3434Q348q4567B33827
10739e3512k7027A19013E9318a00924A94884b38019o9849B1075K0410L1676h6397
10727A68005c57882a67017b5061j18741j95848J17538A13410O2177J22464B0281
$$ y = [-88056, 28610, 77879, 187229, -76535, -294776, -237452, -15898, -2812, -16177, -295525, 16494, -379575, 78921, 56740, -110344, -10996, -259012, 114216, -279221, -215554, 55575, 161391, -308752, 146926, 43927, -110523, 73166, -89973, -312161, 129605, 155258, -162860, -331053, 118399, 336461, -579977, -212125, 358786, -100937, -23619, 23391, -44882, -9726, -203632, 26737, -144333, -33698, 109349, -232321, -55921, -200924, -61382, -262870, -12790, -378349, -124519, 40099, -5728, -107303, 107216, -58276, -171628, -53434, -45086, -129653, 233827, -53512, -80539, 119013, 59318, -100924, 194884, -238019, -307868, 21075, 41485, 73161, -86397, 168005, -357882, -167017, -25061, -143802, -339650, -222112, 113410, 175587, 298051, 20281]
10716d36173B47965e8096r728c3764k1716q9301K1047L4531J0149B42250a8312
10704C88937b83937l5120F5201f3886A43308a26748j87472c7712m86886A13389
10693A5774J62870F7239E580a41864B57421P6914a50782b4795E5575i4691q8639
10682a83330j58772B33031b1167l98369F1486a86310N7987n2695F095J15245b23776
10670h1617A42012J13694E8185F246c05722Q3642a09572F1515a22503J7862A89256
10658b39281A60263a29885J0341j01545A43640c78814a87853M8089l6057C87214
10647I3576a88621a0842o9546p671j4940B1647k721R5404d76262b6722A63170
10635h6999c9980A00026a22193B16716i7857A74326o3882g857k42640f4232j21321
$$ y = [-436173, 247965, -58096, -67824, -33764, -55480, -144781, -123734, -89203, -79054, 242250, -18312, 388937, -283937, -319057, 65201, -63886, 143308, -126748, -314220, -37712, -524598, 113389, 15774, 178644, 67239, 5580, -141864, 257421, 334335, -150782, -24795, 55575, -94691, -183330, -342102, 233031, -21167, -419536, 61486, -186310, -128323, -181018, 6095, 121340, -223776, -81617, 142012, 255706, 58185, 6246, -305722, -222080, -109572, 61515, -122503, -104641, 189256, -239281, 160263, -129885, -119544, -221089, 143640, -378814, -187853, -139764, -175821, 387214, 93576, -188621, -10842, -80388, -88059, -102999, 21647, 18926, 114330, -476262, -26722, 163170, -86999, -39980, 100026, -122193, 216716, -97857, 174326, 110444, -7857, -250497, -64232, -185553]
10624a85553A64780a21495C3073a64613j59028a12045k97586J05238L5968A16618
10613a73002e547k06970e1557A75173a01534j61538k20723H8524M4839a42707
10602d87A38353D4841a43788k2380B74113b15692L0391C9114c7797k13744i7249
10590F9718a25157C6819J48278H6804h4508C46586a27365L1133k82637f3450j78181
10579b41631C7575L7287K72944d60017c3307l36534A030a61908A78259b51476
10568C83651A25459a60418F0944i1764j82346h1541E7726a55416b7030E497K21236
10557B26733f7596g911q3461p6519P6826A57673a47278e9214l5416j57920f0391
10545C8728K14743b7472E5952a08307I6075M6138a44455B93189p3647a49875J4642
$$ y = [-185553, 164780, -121495, 33073, -164613, -323641, -112045, -409631, -304393, -268425, 116618, -173002, -5547, -212517, -51557, 175173, -101534, -263072, -483795, 88524, 133363, -142707, -487, 138353, 44841, -143788, -166168, 274113, -215692, -185301, 39114, -37797, -251541, -97249, 69718, -125157, 36819, 185097, 86804, -84508, 346586, -127365, -96232, -378869, -63450, -241631, 37575, 74862, 347806, -460017, -33307, -369841, 1030, -161908, 178259, -251476, 383651, 125459, -160418, 60944, -91764, -274110, -81541, 57726, -155416, -27030, 5497, 226733, -67596, -7911, -91372, -167891, -91065, 157673, -147278, -59214, -94630, -252550, -60391, 38728, 253471, -27472, 55952, -108307, 96075, 142213, -144455, 293189, 219542, -149875, -135233]
10534a35233e1842A13519a61340G5888C197N3550a62518n0489f4465j18100B79512
10522b26890P9603D31074d1804E5954J2856a39210j3027n2321A57901a71475a2011
10510f1188E3139j9065i4218n4274A58287b6423l06970J12289g3616g321A56102
10498c5926n655k50580h8467A03030n1288J61843a52316L6968j26299J14499m4725
10487a71873o0856c6805B38258q0514a14578A18717a10674d7612B79321C5513
10476A41669M38628B88997r3435p3922d672j42230B11909o7905d0326B9120a41392
10464g7155B57K84149E6808R6829b04959H0965c17152a14761D9180f450k03668
10453b10118g609A11202a19974L4379H6711M5410a61310K7940E3221f6025E8957
$$ y = [-135233, -51842, 113519, -161340, 75888, 3197, 56747, -162518, -213007, -64465, -182565, 279512, -226890, -147287, 431074, -41804, 55954, 68810, -139210, -152237, -204558, 157901, -171475, -12011, -61188, 53139, 34074, -94218, -148492, 158287, -26423, -333393, -221104, -73616, -7321, 156102, -35926, -41581, -292161, -88467, 103030, 51742, 213585, -152316, -115348, -241647, -127148, -171873, -232729, -36805, 238258, 157744, -114578, 118717, -110674, -47612, 279321, 35513, 141669, 580297, 288997, 195562, 121640, -4672, -146902, 211909, 144004, -40326, 29120, -141392, -77155, 257, 284406, 56808, 153637, -204959, 80965, -317152, -114761, 49180, -6450, -210118, -7609, 111202, -119974, -85595, 86711, 132121, -161310, -133370, 53221, -66025, 58957]
10441A67117o0624D8887b7837J3627j43364P6133c4961A4176a56203B7675J90271
10430B17946e7954m7614k10194F0465I69g162j74088g0711A749a91264B52358
10418A51J365K02026o5685b67654A65752K1769a37647A50570E267h2508A06227
10406A58407c40082h1905m5911k24714a19973N0493j90517a07114C03170b24100
10395a81422E824J00694a79709P7645r7576O6372D7516d8221M182n4611E3296
10383B32887l0432a04229a079D6094a26668j1505f6205A91497F7187b598A27676
10371A21905J77702j12892f4453K0930A97843m9960J35760Q0239n7150A22968
10360E01312J21957k18481j83414O6364H4649N8729o7083L60632g8535o9290A81703
$$ y = [167117, 106493, 48887, -27837, -14210, -157574, -81441, -34961, 14176, -156203, 27675, 217946, -57954, -105568, -315762, 60465, 969, -7162, -181250, -70711, 1749, -191264, 252358, 151, 1516, 203542, 137857, -267654, 165752, 187521, -137647, 150570, 5267, -82508, 106227, 158407, -340082, -81905, -127816, -352530, -119973, -69480, -259997, -107114, 303170, -224100, -181422, 5824, 106518, -179709, -102064, -199640, -133268, 47516, -48221, -44039, -98650, 53296, 232887, 202455, -104229, -1079, 46094, -126668, -138173, -66205, 191497, 67187, -2598, 127676, 121905, 299607, 186715, -64453, -43523, 197843, 147883, 283643, 363882, 306732, 122968, 501312, 623269, 404788, 221374, 287738, 84649, 143378, 76295, 436927, -78535, -147825, 181703]
10348D13112K29376k13206J24311R2740G1303f8832C7376L22238B3916M5563G594
10336C68172j16276J72635R0861A24931K4315J4270F0349c61299F1261L5315g5693
10324b90443A51979C3246f5272A39410J20959f1096j30858E0243L22568D0190
10313E0672J23356c8440E8589a50676L1272c1723E2577b6084B51752a39661D22947
10301H6546Q2858i8129D4855J7467a96246q9299a05152M3633j80818b3986l37509
10290c61495C2848J03470a57629D8098a88297A01847a82523A16603J0487J79002
10280C06092F3364a98124i5188B32670k0905a62039A12959b26520I3891a1822
10269a67240A4725N8722a61848l9442B9307f596J068k79876a34716e738C1772
$$ y = [413112, 642488, 429282, 553593, 646333, 71303, -68832, 37376, 359614, 23916, 69479, 7594, 368172, 251896, 424531, 515392, 124931, 149246, 163516, 60349, -361299, 61261, 96576, -75693, -290443, 151979, 33246, -65272, 139410, 260369, -61096, -191954, 50243, 372811, 40190, 50672, 174028, -38440, 58589, -150676, -119404, -31723, 52577, -26084, 251752, -139661, 422947, 86546, 169404, -98129, 44855, 62322, -196246, -285545, -105152, -61519, -242337, -23986, -361495, 32848, 136318, -157629, 48098, -188297, 101847, -182523, 116603, 127090, 306092, 63364, -198124, -95188, 232670, 211765, -162039, 112959, -226520, 93891, -11822, -167240, 14725, 73447, -161848, -201290, 29307, -6596, -5528, -285404, -134716, -5738, 31772]
10257b01305A01238l4643K46908o6862c0536B00579G8749K14128p9841K6601c88910
10245A37511J40858a21655K7055b3676I4901l0974C75i9688E7244J25864I0876
10233a43653B9119J46615b1675H9957a0976j86995C7795a70586M125p271J1017
10222a62715M6300c6763B44241g6130I2084B8166f5781j2581j08524A39355c40836
10210A35669b88754g2650A71244o5475c10635A539b9480k45539E2839K9203J39297
10199B21339q1158a02810A11668Q943a0404j7912j07910N20A09459c56596e8715
10187h1319j71677i0635m328A75860b85811p0222a17294b1021E8020e3867A80027
10175A52329b90016J7676i6067l9708C4671b9230E6323c15782a05284B69814c43429
$$ y = [-201305, 101238, 66595, 313503, 246641, -30536, 200579, 78749, 292877, 213036, 239637, -388910, 137511, 278369, -121655, -94600, -23676, 94901, 63927, 375, -99688, 57244, 183108, 90876, -143653, 29119, 175734, -21675, 89957, -10976, -197971, 37795, -170586, -166461, -173732, -162715, -116415, -36763, 244241, -76130, 92084, 28166, -65781, -78362, -186886, 139355, -340836, 135669, -288754, -72650, 171244, 105769, -310635, 1539, -29480, -275019, 52839, 82042, 221339, 140181, -102810, 111668, 120611, -10404, -28316, -136226, -135706, 109459, -356596, -58715, -81319, -252996, -90635, -94963, 175860, -285811, -356033, -117294, -21021, 58020, -53867, 180027, 152329, -290016, -272340, -96067, -135775, 34671, -29230, 56323, -315782, -105284, 269814, -343429]
10163b15194N9170G4563B2262b13760j3062j438h2138B05259F5606J52217a07632
10151b12670P6191j09756i7836A11179a15675j42326B5140r882J94866c77455
10140h3047m0680B12669h065E25c23643i4873A7473c14405J50758j29519i1150
10128a30122A05036O220a63383l2368P2930p983C7975h6580d2684l3912q3146
10117a59742A66651L201b27588A40027c438o3117j46742h2761A14800n5075c46037
10105A35207b60419A39413e3626k00486E6970b96685i1178l2882k49017D9751
10094b9575A42232c3234j58092k18307J87764A19196a19316A21423J81175g6937
10083B40632b75499p6814F1675a75747L993M6931B58367h2876A2064J93755p5312
$$ y = [-215194, -156024, 74563, 22262, -213760, -226822, -228260, -82138, 205259, 65606, 217823, -107632, -212670, -136479, -246235, -97836, 111179, -115675, -258001, 25140, 15258, 210124, -377455, -83047, -123727, 212669, -8065, 525, -323643, -94873, 17473, -314405, -163647, -293166, -91150, -130122, 105036, 111256, -163383, -195751, -122821, -130804, 37975, -86580, -42684, -76596, -159742, 166651, 169852, -227588, 140027, -3438, -66555, -213297, -82761, 114800, 59725, -346037, 135207, -260419, 139413, -53626, -254112, 56970, -296685, -91178, -124060, -373077, 49751, -29575, 142232, -33234, -191326, -409633, -221869, 119196, -119316, 121423, 302598, -76937, 240632, -275499, -352313, 61675, -175747, -171754, -124823, 258367, -82876, 12064, 205819, 130507]
10072A30507a23207k75141i2896l2735j78455B52691b6023l332R415o9861p8434
10061a68235D9414a81384M2255H324c2292A46063b61711M7866a6492B53298C4802
10049a51262k3577K7210F1014k7525c92761J65757M7753B7591R2175d26324B80281
10037b02152N860f2420j58534E1573b52090k86736f496j14862e546A2570J45277
10026A57847c05017A4810C273R3816J40033a68440A84892C9190J16667J35445
10016B91302A07738d05482E1588h2897n3099D2446L1279b67053e6259F1813B3958
10004A20530a9296j47292B47082b51421l1013F3445e0976K4048r5422k4033B4518
9992B0209p523i1526a377A48818b36093a14874k475K4527E7618N6062b80176f048
$$ y = [130507, -123207, -398348, -92896, -125631, -304086, 252691, -26023, -29355, -19940, -89801, -168235, 49414, -181384, -139129, 8324, -32292, 146063, -261711, -213845, -16492, 253298, 34802, -151262, -174839, -147629, 61014, 33489, -392761, -227004, -179251, 27591, 119766, -426324, 280281, -202152, -196292, -62420, -220954, 51573, -252090, -538826, -6496, -121358, -5546, 12570, 157847, -305017, 14810, 3273, 97089, 237122, -168440, 184892, 39190, 155857, 291302, 107738, -405482, 51588, -82897, -135996, 42446, 73725, -267053, -56259, 61813, 23958, 120530, -19296, -166588, 247082, -251421, -282434, 63445, -50976, -26928, -122350, -146383, 24518, 20209, 12686, -91526, -1377, 148818, -236093, -114874, -117349, -92822, 57618, 113680, -280176, -6048]
9979A6820b23328A17985J9860a09679j02282c5852I6055O9527a17185G5905d78184
9967h7979L2307k57340c6307k64564J20563O333F1865b37025N8631N2939b4945
9955a33680M1092A84811m4699c51637A08155K00832o5437f5124k66432j72569
9945e04125A07310m3042f0531C2113Q1442N1235a44884A66960a18023f691p4188
9934h0879J0183K8350j9362q4010C1957J51980c1808k27486i9429l00132J59064
9923b40497A18885d45891B38292J7706b28001g4699F9093a6730k83833A03979
9912B102M6982I763d20013h2506j00831C22332a35333l4606d8987j82262R3521
9901a37728r43k4021B06508a62121k50255a14931l13940a49255A43360f6884j87547
$$ y = [16820, -223328, 117985, 137845, -109679, -211961, -35852, 96055, 165582, -117185, 75905, -478184, -87979, -55672, -313012, -36307, -300871, -180308, -173975, 61865, -237025, -178394, -125455, -24945, -133680, -92588, 184811, 140112, -351637, 108155, 308987, 243550, -65124, -331556, -504125, 107310, 64268, -60531, 32113, 113555, 164790, -144884, 166960, -118023, -6691, -80879, -70696, -42346, -61708, -145718, 31957, 183937, -31808, -259294, -99429, -399561, -240497, 118885, -445891, 238292, 255998, -228001, -74699, 69093, -16730, -300563, 103979, 2102, 49084, 9763, -420013, -82506, -183337, 322332, -135333, -169939, -48987, -231249, -137728, -138671, -162692, 206508, -162121, -412376, -114931, -428871, -149255, 143360, -66884, -254431]
9890b54431H5651A1040a9214o9031j63266A30152i186l3448H4335j7472J84338
9879B51201C6723N4133d23030R6653G5514i6859n8809l1782B8399K31652q8824
9868A71227o3031f3507l60603f3163j9818E1073f0253i62G6650k3553e7537F9402
9855d6215j86685a06456F6892P6118J08381C8458M4291c03339H1633a78170B56852
9843b05995L3161P8734K1825k5500B63755E4307g7951k54326A93716n2782n0101
9832I0833b09157E4394c4212j97399B89i8467k05964n9561a39735A34462a26042
9820h4071l44784I2263J14423o9358b43901l6660C50777a97681A14746l186c2172
9808a98070A81912a22745C7511a76913E4761J04410g4809j03280A51217g1845
$$ y = [-254431, 85651, 11040, -19214, -88245, -251511, 130152, -9186, -42634, 84335, 66863, 251201, 36723, 90856, -423030, -326377, 75514, -96859, -155668, -187450, 28399, 260051, 171227, 108196, -63507, -424110, -63163, -82981, 51073, -60253, -962, 76650, 53097, -57537, 69402, -46215, -232900, -106456, 66892, 143010, 251391, 38458, 82749, -303339, 81633, -178170, 256852, -205995, -172834, -94100, -72275, -97775, 263755, 54307, -77951, -332277, 193716, 140934, 90833, -209157, 54394, -34212, -231611, 289, -98467, -304431, -363992, -139735, 134462, -126042, -84071, -428855, 92263, 206686, 137328, -243901, -280561, 350777, -197681, 114746, 111560, -32172, -198070, 181912, -122745, 37511, -176913, 54761, 159171, -74809, -178089, 151217, -71845]
9797d74272a29290j45672a30447k91924f7839B15743D5902N2195a34166c2720
9786a10159E4824a6935E5230l612a5857C3990i8175q4403d9798k87292h8172J0250
9774g7922L663C72939A28994h4083k33716c9487m8277j22596P5056C32882b06483
9762b57134B62026A27197h2537c289k72005g1514A95224b20001A07077d5645H2381
9750H5730j974J64798I4680a93747k52101a92941H8757a31307d1039n11449K47679
9739c04809J47175q7182I416b66502e2254B23777a95091k18315e2795B53855C336
9727I9446b06752A65462b52856G2180a10314o7381b0386j38474J8068I9770b47702
9715E0974a79462b7707A6151a69071f2143j07157q9400A5932c8222A59057a26592
$$ y = [-474272, -129290, -274962, -130447, -422371, -67839, 215743, 45902, 98097, -134166, -32720, -110159, 54824, -16935, 55230, 51618, -15857, 33990, -98175, -182578, -49798, -337090, -88172, -77922, -74259, 372939, 128994, -84083, -317799, -39487, -87764, -210360, -135304, 332882, -206483, -257134, 262026, 127197, -82537, -3289, -275294, -71514, 195224, -220001, 107077, -45645, 82381, 85730, 83756, 248554, 94680, -193747, -445848, -192941, 88757, -131307, -41039, -552488, -304809, -157634, -244816, 9416, -266502, -52254, 223777, -195091, -413406, -52795, 253855, 3336, 99446, -206752, 165462, -252856, 72180, -110314, -177695, -20386, -158860, -140792, 99770, -247702, 50974, -179462, -27707, 16151, -169071, -62143, -169300, -258700, 15932, -38222, 159057, -126592]
9703A02322d4177j17573G8124J9976k9138J71704b8672C8436a08191k8298F5244
9691a18323q2736F3451m759d05962a45511N0751k35761A49894a76224d1705j52233
9680a93938g2683k7396n2793C27230c23573J39960A61567c7172n0326J4137p2634
9669a45995l61531d6853j93132j71355d1891o6444k52692k9539d0410D2206a12157
9657i6441B62012a34566l3803O9827b7874N677j27055I7708E54a01036d3903F1425
9644A30547h268k29672a739k39887a00562A32542E2690e1150l2215j41806c4012
9632F2601a0504r9974k73554E90J00828B865d0231k07805n2069G8703J10824p9475
9620A10052n0700N3758J24689d63304a12330G0461b17565a995j95584A1920a97100
$$ y = [102322, -44177, -161750, 78124, 98100, 68962, 240666, -28672, 38436, -108191, -136489, 65244, -118323, -201059, 63451, 58692, -405962, -145511, -94760, -330521, 149894, -176224, -41705, -193938, -72683, -100079, -152872, 327230, -323573, -183613, 161567, -37172, -87498, -73361, -145995, -507526, -46853, -239985, -411340, -41891, -108335, -361027, -390566, -40410, 42206, -112157, -96441, 262012, -134566, -168369, -98542, -27874, -22197, -149252, 97708, 554, -101036, -43903, 61425, 130547, -8268, -237940, -1739, -241626, -100562, 132542, 52690, -51150, -83365, -225171, -34012, 62601, -10504, -110478, -384032, 590, 101418, 2865, -40231, -248036, -300105, 78703, 189527, 110052, 59352, 113110, 237799, -463304, -112330, 70461, -217565, -1995, -197579, 11920, -197100]
9608c26915J47473B8546K04036i18k1566C8823A8526R7127K41836h5756A9003
9596a25245n3384A35477i8721p6420j5857Q2427e1554k61414L5226c1284I012
9584a14152d8289A94490c06929E6068J0518A0414a08826A40328i2843j63782A8604
9572A2298h2719j32388g1431B89799d0110a4018D1859A0086M06675D0597a71660
9560e4019j08377j18101c5182c897j16344A7925R4927D9734b4123j2161k2014
9549e8298o7266j48063g7616L6054n2381j00882f491j52521g1763B42692a51659
9537A55250e1896l44644b3304j25581A76768c60651a38108E1747b66499D7121
9526a67342A52554d38823h4185B20491l2011j2172h2999d156j46991j10162a1191
$$ y = [-326915, -179442, 28546, 232582, -918, -22484, 38823, 18526, 115653, 357489, -85756, 19003, -125245, -178629, 135477, -98721, -175141, -190998, -108571, -51554, -312968, -277742, -31284, 9012, -114152, -48289, 194490, -306929, 56068, 66586, 10414, -108826, 140328, -92843, -256625, 18604, 12298, -82719, -215107, -71431, 289799, -40110, -14018, 41859, 10086, 416761, 40597, -171660, -54019, -162396, -280497, -35182, -3897, -120241, 17925, 112852, 49734, -24123, -36284, -58298, -125564, -273627, -77616, -41562, -93943, -194825, -6491, -159012, -71763, 242692, -151659, 155250, -51896, -396540, -23304, -148885, 176768, -360651, -138108, 51747, -266499, 47121, -167342, 152554, -438823, -84185, 220491, 188480, 176308, -82999, -4156, -151147, -261309, -11191]
9514b38261E0779J0643K2942b1207r839A97557c0683k16645B43152h8928B5587
9502e3160A76419a26865j03354J8014o2006A25135b02240A98123c20537c3054
9491a46192L5922j32152a06782K4258B38651g0424D7325c01014H1588g2043A13076
9479I9326L523c28440J56773Q0324K9639E5863b27738p7306I4837a07853a8968
9467C04507b00378j95538J52356G6727K00534c8146j37483j15758F7390J84688
9457B52078h4207k0795j15987k2393r5661a35586O2731j5462o3328O7302k48484
9446c32827A00538a72694p6201J06381C6581c495A52137b55699c436C8589c3002
9434B24375B3205K08732A9095f1956l24061a04829b1583A88278a63437q7967H7132
$$ y = [-238261, 50779, 61422, 84364, -21207, -31046, 197557, -30683, -247328, 243152, -88928, 25587, -53160, 176419, -126865, -230219, -212205, -274211, 125135, -202240, 198123, -320537, -33054, -146192, -110270, -242422, -106782, -82524, 238651, -70424, 47325, -301014, 81588, -72043, 113076, 99326, 102849, -328440, -171667, -91343, -61704, 55863, -227738, -305044, 94837, -107853, -18968, 304507, -200378, -395916, -243560, 76727, 277261, -38146, -175629, -291387, 67390, 252078, -84207, -105002, -220989, -243382, -339043, -135586, -72855, -88317, -151645, -84343, -332827, 100538, -172694, -248895, -142514, 36581, -3495, 152137, -255699, -3436, 38589, -33002, 224375, 23205, 231937, 19095, -61956, -386017, -104829, -21583, 188278, -163437, -251404, 87132]
9422c4728k82434B13765o3774M6430D8962a62154A07152m5618m797a47743I5370
9410A02076a54937R484A70938f0398k24584J424g7620k54691F5254b62885A84498
9398B39874L6161a77253L4310E116R6614c01084M2012E4545a08621D7450a76606
9386A32055c3994A26197e6761k3281B35712b42757L1297M1676C25310j18303a64056
9374b64688f9242q4746M2910B8114O8094b99270C07682j23474c78733J15977F8743
9362h0995B1220b21108b6058l2724b5713A3751O1242i8366A04532b0064r7901
9351a17965A83891B5724c68570a62571O8479I7581J2274b59949L4366q954P329
9340b27208D1319a33988H5981R1796d0666j06461q4406b5194C1019O8870c08510
$$ y = [-34728, -317162, 213765, 149991, 196421, 48962, -162154, 107152, 61534, 56737, -147743, 95370, 102076, -154937, -145453, 170938, -60398, -284982, -283558, -77620, -332311, 65254, -262885, 184498, 239874, 276035, -177253, -142943, 5116, 101730, -301084, -259072, 54545, -108621, 47450, -176606, 132055, -33994, 126197, -56761, -80042, 235712, -242757, -211460, -169784, 325310, 207007, -164056, -264688, -69242, -153988, -111078, 28114, 96208, -299270, 307682, 184208, -378733, -262756, 68743, -80995, 21220, -221108, -26058, -58782, -25713, 13751, 74993, -98366, 104532, -20064, -117965, 183891, 25724, -368570, -162571, -94092, 97581, 109855, -259949, -225583, -234537, -227208, 41319, -133988, 85981, 177777, -40666, -147127, -231533, -25194, 31019, 99889, -308510]
9328H7104B9769I302i6182m07687a44064C5268a56315A35162o3213d21170B48776
9316A27865i5661A67256J93366a04051A69359a54332j41311l5971d7999B129J946
9305D075a34782k1212q4539A5537J2824b7878E6399b00717C54918a88448q3403
9294b71851E7046K13772a59945f722o2786q686j56778H7885a95347j47340L9025
9283c03662j8609A38084c3185A33505N6494C2983D768b28716J90C12683a53025
9271g9709k7904k37020o3760a87452O3220O436p8228A00226a0007m17210C0619
9259a72528d7004q3210E927J7978h6214B13610f6834a5171p1095n047M1922e915
9246F0510e6904I0574K9162b3353j86011D1536c15175d8574l35946d4655C16976
$$ y = [87104, 29769, 9302, -96182, -503869, -144064, 35268, -156315, 135162, 71949, -421170, 248776, 127865, -95661, 167256, 360622, -104051, 169359, -154332, -295643, -331614, -47999, 2129, 4075, -134782, -155994, -240533, 15537, 28361, -27878, 56399, -200717, 354918, -188448, -271851, 57046, 270818, -159945, -6722, -69508, -78194, -234972, 87885, -195347, -342687, -303662, -322271, 138084, -33185, 133505, 189999, 32983, 4768, -228716, -228526, 312683, -153025, -79709, -107613, -344633, -408393, -187452, -124232, -117796, -196024, 100226, -10007, -427217, 30619, -172528, -47004, -130214, 5927, 23905, -86214, 213610, -66834, -15171, -86266, -91313, -49391, -5915, 60510, -56904, 90574, 119736, -23353, -209364, 41536, -315175, -48574, -384520, -44655, 316976]
9234b11595d0685k77000B0175d2416K0l31810h7970o6580c3657j32928P9351B7487
9221F5894i8715q9494N5544a7888p3201C09492g7038k0152D13591f457k07583
9210b14040A16663b11626c7152q9383D5465I002A351c4202F1809A5350Q2622a22019
9197b58134a9642l29072a34513k41321A8081g8597j94814B32681c98876A42386
9186A07997l0741c05799J51655J4738J4169K0462j56118B34724g5414L2833l8435
9175h1016F4843g4862a2431j43262d9654m8353j13297k76514f7244B68113C9472
9163a03581k16399h0712A90987e9721B9406g4861E6628g6498j03809M2608j18571
9152b56270B47041a44598j85337e3262D6311c24975I8918a70039A35839b18562
$$ y = [-211595, -40685, -317685, 20175, -42416, -42396, -374206, -87970, -154550, -33657, -166585, -87234, 27487, 65894, -98715, -188209, -132665, -17888, -91089, 309492, -77038, -97190, 413591, -6457, -214040, 116663, -211626, -37152, -126535, 45465, 9002, 1351, -34202, 61809, 15350, 97972, -122019, -258134, -19642, -348714, -134513, -375834, 18081, -78597, -273411, 232681, -398876, 142386, 107997, 77256, -305799, -154144, -139406, -125237, -104775, -260893, 234724, -75414, -42581, -81016, 64843, -74862, -12431, -155693, -49654, -98007, -211304, -487818, -67244, 268113, 39472, -103581, -319980, -80712, 190987, -59721, 29406, -74861, 56628, -76498, -180307, -137699, -256270, 247041, -144598, -329935, -53262, 46311, -324975, 98918, -170039, 135839, -218562]
9141b38835E3925R7399b70458C7415d20445h4292A66588a87387l058j62539a38684
9129d35403d3761j68456b5346j66967C9446e2104k233H2338g2989n08260C18948
9117e2329A40228l3015g4045p2387l1374j97167P0853a45691A36327a28089m2381
9106a70470j8915j48945e4396E2569A9547M8441E688a23395a6273A5621c5317
9094D2528a04023A00385a85361f2210A78030d25251E1319a6319C11051q8066b8926
9082a65573j08914F9339c3684F2490a92704Q061c0518p3634I2031b56679d808
9070g6703A35551h6205b424o4505k22958H5778b32523L4724B5959b13663D9535
9058H5101b19753G7441e1976K849B85033B9074a95841k0334e7694k8816k1499
$$ y = [-238835, 53925, 151324, -270458, 37415, -420445, -84292, 166588, -187387, -190445, -352984, -138684, -435403, -43761, -212217, -25346, -192313, 39446, -52104, -54337, 82338, -72989, -581249, 318948, -52329, 140228, 107213, -74045, -146432, -177806, -374973, -304120, -145691, 136327, -128089, -170470, -189385, -338330, -54396, 52569, 19547, 67988, 5688, -123395, -16273, 15621, -35317, 42528, -104023, 100385, -185361, -62210, 178030, -425251, 51319, -16319, 311051, 222985, -28926, -165573, -274487, 69339, -33684, 62490, -192704, -184643, -30518, -104152, 92031, -256679, -4808, -76703, 135551, -86205, -2424, -66929, -289887, 85778, -232523, -197799, 25959, -213663, 49535, 85101, -219753, 77441, -51976, -49127, 285033, 29074, -195841, -216175, -57694, -86510, -108009]
9047a08009A31263B8042b0645j3002j58447B83129j40814a20135M3448D2505a77793
9035g6938I177C445b67231J03205c6252J2108j45817g2759C28324c04506J32992
9024a71514I6157a76741P6065A7335L359J07690a0512j66004H720c5232A51178
9012b26149A0638b09160h3611J3734K2309k30485B04546J16785G3308a27131B1233
9000A28522a09921e3235B7214i4102L010A44370b44029A87223a12372B33006p0900
8989A62106e1218j17190j09578A29151b13757J05363A11415b44724o032R6313
8979a54443d9034c494m23268J98486R6038C8680a79339E9323h484A28377E8057
8967F8825b63679I2288a94935Q4703j04078g1893G787a55212f8289H7009l8337
$$ y = [-108009, 131263, 28042, -20645, -33647, -192094, 283129, 142315, -120135, -76687, 42505, -177793, -76938, 9177, 3445, -267231, -164026, -36252, -24144, -169961, -72759, 328324, -304506, -171514, 96157, -176741, -100676, 17335, 20694, 128384, -10512, -176516, 8720, -35232, 151178, -226149, 10638, -209160, -83611, -69877, -47568, -278053, 204546, 321331, 73308, -127131, 21233, 128522, -109921, -53235, 27214, -94102, -91092, 144370, -244029, 187223, -112372, 233006, 162106, -51218, -168408, -277986, 129151, -213757, -108394, 111415, -244724, -250756, -154443, -49034, -3494, -426762, -228276, -132238, 38680, -179339, 59323, -8484, 128377, 58057, 68825, -263679, 92288, -194935, -110232, -214310, -71893, 7787, -155212, -68289, 87009, 48672]
8956D8672A4360K06982a68737C9725a13964C6668c2152k26204a8007m7358r5576
8945a60941G2954f2021A25373f8722E9285b55954g9751j23149o3792N3402b4841
8933A15975J5039K8172a656A84375p4442a4043B27538a1814j51226g1441G3448
8921A15884K76650K863605L893938C261888j622919E07650k2727n0721c3845H2551
8910a12990a3102I6131c22640B27681B6558c34258C5134a99567B18754I5909N2858
8899A48767a58382E19396b78868g8257D49404c95534A02203f2496J6040B21963
8888d8105E569b88829a34341B74180b15473B2509J7683j9057b40587A90713d26035
8876c61433J08002g3077F9809O8942B1964a3179E7332O6264a961k17008R8972
$$ y = [48672, 14360, 221342, -168737, 39725, -113964, 36668, -32152, -258356, -18007, -65365, -160941, 72954, -62021, 125373, -68722, 59285, -255954, -79751, -202900, -266692, -213290, -24841, 115975, 131014, 159186, -1656, 184375, 109933, -14043, 227538, -11814, -163040, -71441, 73448, 115884, 392534, 3256139, 7150077, 3261888, 1638969, 507650, 484923, 434202, -33845, 82551, -112990, -13102, 96131, -322640, 227681, 26558, -334258, 35134, -199567, 218754, 95909, 148767, -158382, 519396, -278868, -78257, 449404, -395534, 102203, -62496, -46456, 221963, -48105, 5569, -288829, -134341, 274180, -215473, 22509, 40192, 21135, -240587, 190713, -426035, -361433, -253431, -73077, 69809, 138751, 21964, -13179, 57332, 123596, -1961, -218969, -119997]
8865a19997A96202C7015j3047a13402A13485J2742b06382D1452a25052d2194B17997
8853a5561p6941b5465n0698B48822F0860a95362A32575a1156j53256A6054b10345
8841G6934a01434l4343p805K916H7354a42944B49407b4104r993k4196k05190g1440
8828b41251R9175B1221h9011l55812J96047A51809F2633F971a239j88413A74428
8816b03982F6579c0845D23071b64892C42933a28500d3916m9372A69677A1982K40741
8805B52723a45887r9162a04971d1167H5410c445A37799b7977f65k6218k99284
$$ y = [-119997, 196202, 37015, 23968, -113402, 113485, 126227, -206382, 41452, -125052, -42194, 217997, -15561, -92502, -25465, -76163, 248822, 60860, -195362, 132575, -11156, -164412, 16054, -210345, 76934, -101434, -135777, -143582, -140666, 87354, -142944, 249407, -24104, -34097, -58293, -263483, -71440, -241251, -142076, 21221, -89011, -444823, -248776, 151809, 62633, 6971, -1239, -189652, 174428, -203982, 66579, -30845, 423071, -264892, 342933, -128500, -43916, -93288, 169677, 11982, 252723, -145887, -245049, -104971, -41167, 85410, -3445, 137799, -27977, -665, -26883, -326167]
$$ [...]
##END NTUPLES=NMR SPECTRUM
##END=
