##TITLE=AC1682_2981_8571508_A8kTSi5g7l
##JCAMPDX= 6.0         $$ Bruker NMR JCAMP-DX V2.0
##DATA TYPE= NMR SPECTRUM
##DATA CLASS= NTUPLES
##ORIGIN= BRUKER
##OWNER= Administrator
$$ 1.72 TOPSPIN		Version 2.1
$$ 2014-04-10 16:56:32.611 -0700  Administrator@X
$$ Compression mode = diff/dup
##.OBSERVE FREQUENCY= 400.02188249412
##.OBSERVE NUCLEUS= ^1H
##.ACQUISITION MODE= SIMULTANEOUS (DQD)
##.ACQUISITION SCHEME= undefined
##.AVERAGES= 64
##.DIGITISER RES= 22
##SPECTROMETER/DATA SYSTEM= spect
##.PULSE SEQUENCE= noesygpps1d.comp
##.SOLVENT NAME= COFFEE_meoh
##.SHIFT REFERENCE= INTERNAL, COFFEE_meoh, 1, 14.96249
##AUDIT TRAIL= $$ (NUMBER, WHEN, WHO, WHERE, PROCESS, VERSION, WHAT)
$$ ##TITLE= Audit trail, TOPSPIN		Version 2.1
$$ ##JCAMPDX= 5.01
$$ ##ORIGIN= Bruker BioSpin GmbH
$$ ##OWNER= Administrator
$$ $$ E:\/data/COFFEE/nmr/AC1682_2981_8571508_A8kTSi5g7l/22/pdata/1/auditp.txt
$$ ##AUDIT TRAIL=  $$ (NUMBER, WHEN, WHO, WHERE, PROCESS, VERSION, WHAT)
(   1,<2014-04-10 16:56:26.095 -0700>,<Administrator>,<X>,<go>,<TOPSPIN 2.1>,
      <created by zg
	started at 2014-04-10 16:44:55.642 -0700,
	POWCHK enabled, PULCHK disabled,
       configuration hash MD5:
       C8 4E 4E 5D D3 5C D8 9E 9F 52 82 E0 59 8A DE 15
       data hash MD5: 64K
       BC 8A 90 BD 65 67 C1 A2 6D 33 31 33 D5 8B 3E 94>)
(   2,<2014-04-10 16:56:29.533 -0700>,<Administrator>,<X>,<proc1d>,<TOPSPIN 2.1>,
      <Start of raw data processing
       efp LB = 0.3 FT_mod = 6 PKNL = 1 PHC0 = 0 PHC1 = 0 SI = 128K 
       data hash MD5: 128K
       3E 2C 11 9E E1 58 15 6D 2E 4F F3 93 CC F1 15 38>)
(   3,<2014-04-10 16:56:30.689 -0700>,<Administrator>,<X>,<proc1d>,<TOPSPIN 2.1>,
      <pk PHC0 = -80.63965 PHC1 = 0 
       data hash MD5: 128K
       03 A2 AB 62 5D 50 E9 C3 A6 46 1A EC 21 E3 27 D4>)
(   4,<2014-04-10 16:56:31.502 -0700>,<Administrator>,<X>,<proc1d>,<TOPSPIN 2.1>,
      <abs ABSG = 1 
       data hash MD5: 128K
       C0 07 EA 8E F4 70 22 A4 FB 87 C8 87 B6 CC 74 46>)
(   5,<2014-04-10 16:56:31.736 -0700>,<Administrator>,<X>,<proc1d>,<TOPSPIN 2.1>,
      <abs ABSG = 2 
       data hash MD5: 128K
       6B 35 EA B0 AD F8 8B 5F 83 4C E9 A1 FB 8A 6D 51>)
(   6,<2014-04-10 16:56:31.924 -0700>,<Administrator>,<X>,<proc1d>,<TOPSPIN 2.1>,
      <abs ABSG = 3 
       data hash MD5: 128K
       A5 A4 8B 1D A9 FA 00 F6 95 A4 38 BF 65 95 C8 FE>)
(   7,<2014-04-10 16:56:32.033 -0700>,<Administrator>,<X>,<proc1d>,<TOPSPIN 2.1>,
      <abs ABSG = 4 
       data hash MD5: 128K
       49 30 A9 3E C5 4B AB 47 BE 8A EC 59 DC 19 E5 5E>)
(   8,<2014-04-10 16:56:32.189 -0700>,<Administrator>,<X>,<proc1d>,<TOPSPIN 2.1>,
      <abs ABSG = 5 
       data hash MD5: 128K
       29 53 8E 4F 7C AF B7 07 85 1D 28 22 08 C9 07 A2>)
$$ ##END=
$$ 
$$ $$ hash MD5
$$ $$ 22 55 C3 7F DC BA 72 31 03 27 D1 5F CD 72 5E A0
##$RELAX= 
##$RELAX= 
##$RELAX= 
##$RELAX= 
##$RELAX= 
##$RELAX= 
##$RELAX= 
##$RELAX= 
$$ Bruker specific parameters
$$ --------------------------
##$DU= <E:\>
##$EXPNO= 22
$$ [...]
##$TP07= 0
##$TPNAME0= <>
##$TPNAME1= <>
##$TPNAME2= <>
##$TPNAME3= <>
##$TPNAME4= <>
##$TPNAME5= <>
##$TPNAME6= <>
##$TPNAME7= <>
##$TPOAL= (0..7)
0.5 0.5 0.5 0.5 0.5 0.5 0.5 0.5
##$TPOFFS= (0..7)
0 0 0 0 0 0 0 0
##$TUNHIN= 0
##$TUNHOUT= 0
##$TUNXOUT= 0
##$USERA1= <user>
##$USERA2= <user>
##$USERA3= <user>
##$USERA4= <user>
##$USERA5= <user>
##$V9= 5
##$VALIST= <valist>
##$VCLIST= <CCCCCCCCCCCCCCC>
##$VD= 0
##$VDLIST= <DDDDDDDDDDDDDDD>
##$VPLIST= <PPPPPPPPPPPPPPP>
##$VTLIST= <TTTTTTTTTTTTTTT>
##$WBST= 1024
##$WBSW= 4
##$XGAIN= (0..3)
0 0 0 0
##$XL= 0
##$YL= 0
##$YMAX_a= 9805633
##$YMIN_a= -22956071
##$ZGOPTNS= <>
##$ZL1= 120
##$ZL2= 120
##$ZL3= 120
##$ZL4= 120
##$ABSF1= 14.96249
##$ABSF2= -5.595692
##$ABSG= 5
##$ABSL= 3
##$ALPHA= 0
##$AQORDER= 0
##$ASSFAC= 0
##$ASSFACI= 0
##$ASSFACX= 0
##$ASSWID= 0
##$AUNMP= <proc_prof1d_extract.lims>
##$AXLEFT= 0
##$AXNAME= <>
##$AXNUC= <1H>
##$AXRIGHT= 0
##$AXTYPE= 0
##$AXUNIT= <>
##$AZFE= 0.1
##$AZFW= 0.1
##$BCFW= 0
##$BC_mod= 0
##$BYTORDP= 0
##$COROFFS= 0
##$CY= 15
##$DATMOD= 1
##$DC= 0
##$DFILT= <>
##$DTYPP= 0
##$F1P= 0
##$F2P= 0
##$FCOR= 0.5
##$FTSIZE= 131072
##$FT_mod= 6
##$GAMMA= 0
##$GB= 0
##$INTBC= 1
##$INTSCL= 1
##$ISEN= 128
##$LB= 0.3
##$LEV0= 0
##$LPBIN= 0
##$MAXI= 10000
##$MC2= 0
##$MEAN= 0
##$ME_mod= 0
##$MI= 0
##$NCOEF= 0
##$NC_proc= -2
##$NLEV= 6
##$NOISF1= 0
##$NOISF2= 0
##$NSP= 0
##$NTH_PI= 0
##$NZP= 0
##$OFFSET= 14.96249
##$PC= 1
##$PHC0= -80.63965
##$PHC1= 0
##$PH_mod= 1
##$PKNL= yes
##$PPARMOD= 0
##$PPDIAG= 0
##$PPIPTYP= 0
##$PPMPNUM= 2147483647
##$PPRESOL= 1
##$PSCAL= 4
##$PSIGN= 0
##$PYNMP= <proc.py>
##$REVERSE= no
##$SF= 400.020009041668
##$SI= 131072
##$SIGF1= 0
##$SIGF2= 0
##$SINO= 400
##$SIOLD= 131072
##$SPECTYP= <>
##$SREGLST= <1H.CDCl3>
##$SSB= 0
##$STSI= 131072
##$STSR= 0
##$SW_p= 8223.68421052631
##$SYMM= 0
##$S_DEV= 0
##$TDeff= 65536
##$TDoff= 0
##$TI= <>
##$TILT= no
##$TM1= 0
##$TM2= 0
##$TOPLEV= 0
##$USERP1= <user>
##$USERP2= <user>
##$USERP3= <user>
##$USERP4= <user>
##$USERP5= <user>
##$WDW= 1
##$XDIM= 131072
##$YMAX_p= 321131452
##$YMIN_p= -12213
##$CURPLOT= <Network HP LaserJet P1505>
##$CURPRIN= <$Network HP LaserJet P1505>
##$DFORMAT= <normdp>
##$LAYOUT= <+/1D_H.xwp>
##$LFORMAT= <normlp>
##$PFORMAT= <normpl>
##$SURQMSG= 1
$$ End of Bruker specific parameters
$$ ---------------------------------
##NTUPLES= NMR SPECTRUM
##VAR_NAME=  FREQUENCY,     SPECTRUM/REAL,   SPECTRUM/IMAG
##SYMBOL=    X,             R,               I
##VAR_TYPE=  INDEPENDENT,   DEPENDENT,       DEPENDENT
##VAR_FORM=  AFFN,          ASDF,            ASDF
##VAR_DIM=   131072,        131072,          131072
##UNITS=     HZ,            ARBITRARY UNITS, ARBITRARY UNITS
##FACTOR=    0.0627417313425164, 1,          1
##FIRST=     8223.62146879497, -2132,        -62201
##LAST=      0,             -677,            -63734
##MIN=       0,             -12213,          0
##MAX=       8223.62146879497, 321131452,    0
$$ Real data points
##PAGE= N=1
##DATA TABLE= (X++(R..R)), XYDATA
$$ [...]
60769E152617K4970K5851K7191K8587K9728L0900L2614L5180L8708M3026M7655
$$ 5152617 5177587 5203438 5230629 5259216 5288944 5319844 5352458 5387638 5426346 5469372 5517027
60758E517027N2198N6749O1495O6144P0158P3249P5035P4490P0583O3375N3785
$$ 5517027 5569225 5625974 5687469 5753613 5823771 5897020 5972055 6046545 6117128 6180503 6234288
60747F234288M2383K9321J5450K445q433j6950k3096k6652k7904k7816k6879k4584
$$ 6234288 6276671 6305992 6321442 6323887 6315454 6298504 6275408 6248756 6220852 6193036 6166157 6141573
60735F141573k0640j5915j1361o680j004N502J1682J6825K1263K5480K9395L2681
$$ 6141573 6120933 6105018 6093657 6086977 6085973 6091475 6103157 6119982 6141245 6166725 6196120 6228801
60723F228801L5271L7457L9761M2769M6806N1777N7447O3657P0113P6355Q2288
$$ 6228801 6264072 6301529 6341290 6384059 6430865 6482642 6540089 6603746 6673859 6750214 6832502
60712F832502Q8383R4849J01004J06028J10119J14200J18478J21866J22907J20689
$$ 6832502 6920885 7015734 7116738 7222766 7332885 7447085 7565563 7687429 7810336 7931025
60702G931025J14837J05104R1328P3648N2792L0337Q518j0663k6267l8226m6495
$$ 7931025 8045862 8150966 8242294 8315942 8368734 8399071 8407589 8396926 8370659 8332433 8285938
60691H285938n0859n1452m8997m4381l8381l1808k5531k0180j6008j3177j1832
$$ 8285938 8235079 8183627 8134630 8090249 8051868 8020060 7994529 7974349 7958341 7945164 7933332
60680G933332j1916j3128j5098j7364j9243k0048j9498j7539j3794p629J061J1515
$$ 7933332 7921416 7908288 7893190 7875826 7856583 7836535 7817037 7799498 7785704 7778075 7779136 7790651
60668G790651K2798L4592M7106O0412P4098Q7452R9925J11565J22913J34352J45486
$$ 7790651 7813449 7848041 7895147 7955559 8029657 8117109 8217034 8328599 8451512 8585864 8731350
60657H731350J55503J64094J71582J77934J81937J81741J75976J64197J46525
$$ 8731350 8886853 9050947 9222529 9400463 9582400 9764141 9940117 10104314 10250839
60648A0250839J23407R5840O5531L4529M648k2835m7090o7537q3748r5479j02588
$$ 10250839 10374246 10470086 10535617 10570146 10574794 10551959 10504869 10437332 10353584 10258105 10155517
60637A0155517j04922j02496r5873q6225p4880o3018n1950m3371l8733l8386m1640
$$ 10155517 10050595 9948099 9852226 9766001 9691121 9628103 9576153 9532782 9494049 9455663 9414023
60626I414023m7741n6308o6706p7552q7408r5840j03463j10894j18002j24182
$$ 9414023 9366282 9309974 9243268 9165716 9078308 8982468 8879005 8768111 8650109 8525927
60616H525927j29099j32848j35383j36064j34120j29596j23553j17012j09931
$$ 8525927 8396828 8263980 8128597 7992533 7858413 7728817 7605264 7488252 7378321
60607G378321j01636r2130q2488p3780o6047n8632n1166m3719l6280k8625k0865
$$ 7378321 7276685 7184555 7102067 7028287 6962240 6903608 6852442 6808723 6772443 6743818 6722953
60596F722953j3556o986o15O386J4066K1616K8429L4929M2019M9860N7658O4681
$$ 6722953 6709397 6702411 6701796 6708182 6722248 6743864 6772293 6807222 6849241 6899101 6956759 7021440
60584G021440P1096P7511Q3935Q9451R2824R3168R0146Q4038P5777O6700N7887
$$ 7021440 7092536 7170047 7253982 7343433 7436257 7529425 7619571 7703609 7779386 7846086 7903973
60573G903973M9684M1884L4329K7181K0521J3741N642m545j6231k7748l7652m5534
$$ 7903973 7953657 7995541 8029870 8057051 8077572 8091313 8096955 8092410 8076179 8048431 8010779 7965245
60561G965245n1604n5967n8572n9592n9339n7943n5363n1643m6763m0378l2124
$$ 7965245 7913641 7857674 7799102 7739510 7680171 7622228 7566865 7515222 7468459 7428081 7395957
60550G395957k2220j1454n22J0352K1263L2463M4237N6415O7970P7517Q4331Q8355
$$ 7395957 7373737 7362283 7361761 7372113 7393376 7425839 7470076 7526491 7594461 7671978 7756309 7844664
60538G844664Q9202Q5957P8426O7927N6232M4119L1753K0056J0580L810j593p298
$$ 7844664 7933866 8019823 8098249 8166176 8222408 8266527 8298280 8318336 8328916 8332726 8331133 8323835
60526H323835j3505j9016k2683k4223k3850k1824j8523j4448r853m535J705Q542
$$ 8323835 8310330 8291314 8268631 8244408 8220558 8198734 8180211 8165763 8155910 8151375 8153080 8161622
60514H161622J5276K1385K6668L0911L3798L5258L5724L5876L6264L7188L8887
$$ 8161622 8176898 8198283 8224951 8255862 8289660 8324918 8360642 8396518 8432782 8469970 8508857
60503H508857M1663M5927N2063O0044O9089P7952Q5697R1935R6210R7563R5222
$$ 8508857 8550520 8596447 8648510 8708554 8777643 8855595 8941292 9033227 9129437 9227000 9322222
60492I322222Q9601Q2026P3424O3701N2533M0385K8406J7511P879q36r120j7391
$$ 9322222 9411823 9493849 9567273 9630974 9683507 9723892 9752298 9769809 9777688 9776852 9767732 9750341
60480I750341k5810l4077m1621m8246n4510o1204o8331p4820p9435q1850q2535
$$ 9750341 9724531 9690454 9648833 9600587 9546077 9484873 9416542 9341722 9262287 9180437 9097902
60469I097902q1852p9773p6477p2609o8605o4195n8960n3001m6559l9204l0143
$$ 9097902 9016050 8936277 8859800 8787191 8718586 8654391 8595431 8542430 8495871 8456667 8426524
60458H426524j9340p783L506J4367K5326L6889M9090O1372P2753Q2357Q9939R5612
$$ 8426524 8407184 8399401 8402907 8417274 8442600 8479489 8528579 8589951 8662704 8745061 8835000 8930612
60446H930612R9125R9735R6974R1190Q3232P3891O3927N4203M5490L8214L2616
$$ 8930612 9029737 9129472 9226446 9317636 9400868 9474759 9538686 9592889 9638379 9676593 9709209
60435I709209K8884K6850K5696K4226K1509J7280J1969O554K147o33j919k112
$$ 9709209 9738093 9764943 9790639 9814865 9836374 9853654 9865623 9872177 9874324 9873691 9871772 9869660
60423I869660j188J338N845J2142J9410K6450L2171L6121L8694M0655M2473M4203
$$ 9869660 9868472 9869810 9875655 9887797 9907207 9933657 9965828 10001949 10040643 10081298 10123771 10167974
60411A0167974M5965M8377N2287N8194O5925P5033Q5464R7689J12015J27819J43587
$$ 10167974 10213939 10262316 10314603 10372797 10438722 10513755 10599219 10696908 10808923 10936742 11080329
60400A1080329J57639J68576J75007J75301J68107J53167J31530J04963P5431
$$ 11080329 11237968 11406544 11581551 11756852 11924959 12078126 12209656 12314619 12390050
60391A2390050M5053J6177r002k9083m3673n3001n7584n8276n6426n3540n0760
$$ 12390050 12435103 12451280 12442278 12413195 12369522 12316521 12258937 12200661 12144235 12090695 12039935
60380A2039935m8772m8010m8545m9790n0711n0563m9115m6179m1397l4855k7404
$$ 12039935 11991163 11943153 11894608 11844818 11794107 11743544 11694429 11648250 11606853 11571998 11544594
60369A1544594k0006j3152p403l989m243q528j6356k7339m1258n7266p3709q8863
$$ 11544594 11524588 11511436 11504033 11500044 11495801 11487273 11470917 11443578 11402320 11345054 11271345 11182482
60357A1182482j01313j09791j13648j13741j12003j09664j06583j02656r8993
$$ 11182482 11081169 10971378 10857730 10743989 10631986 10522322 10415739 10313083 10214090
60348A0214090r6966r6626r6986r7498r8409r9746j00747j00490r8641r5475r1544
$$ 10214090 10117124 10020498 9923512 9826014 9727605 9627859 9527112 9426622 9327981 9232506 9140962
60337I140962q7360q3031p8146p2274o5620n8903n2621m6737m1085l5723l0732
$$ 9140962 9053602 8970571 8892425 8820151 8754531 8695628 8643007 8596270 8555185 8519462 8488730
60326H488730k5935k1125j6526j2770j0221q376o179l131K9K067K688K860L699
$$ 8488730 8462795 8441670 8425144 8412374 8402153 8393777 8387598 8384467 8384496 8386563 8389251 8392111 8395810
60313H395810N439P671J0087J2549J4825J6889J9371K3088K7964L2830L6437L8446
$$ 8395810 8401249 8408920 8419007 8431556 8446381 8463270 8482641 8505729 8533693 8566523 8602960 8641406
60301H641406L9265L9216L8005L4933K9443K1602J2148K018q165j8070k7147l4449
$$ 8641406 8680671 8719887 8757892 8792825 8822268 8843870 8856018 8858036 8849871 8831801 8804654 8770205
60289H770205l9213m1418m1633m0327l7700l4137l0388k6902k3300j8939j3889
$$ 8770205 8730992 8689574 8647941 8607614 8569914 8535777 8505389 8478487 8455187 8436248 8422359
60278H422359q858m251O5M004P028R067J0903J3094J5093J6177J6772J7871J9567
$$ 8422359 8413501 8409250 8409315 8413319 8420347 8429414 8440317 8453411 8468504 8484681 8501453 8519324 8538891
60265H538891K1179K2641K4596K7027K9015L0290L1910L4820L8593M2201M5298
$$ 8538891 8560070 8582711 8607307 8634334 8663349 8693639 8725549 8760369 8798962 8841163 8886461
60254H886461M8129N0849N3601N6677N9959O2729O4589O6060O7692O9229P0238
$$ 8886461 8934590 8985439 9039040 9095717 9155676 9218405 9282994 9349054 9416746 9485975 9556213
60243I556213P0792P0709O8965O5036O0247N6554N4382N2898N2129N3182N6388
$$ 9556213 9627005 9697714 9766679 9831715 9891962 9948516 10002898 10055796 10107925 10161107 10217495
60232A0217495O0796O5947P2689Q1583R1795J02547J14546J28821J44882J61267
$$ 10217495 10278291 10344238 10416927 10498510 10590305 10692852 10807398 10936219 11081101 11242368
60222A1242368J77613J94922K13783K33238K51706K68222K82547K94512L03677
$$ 11242368 11419981 11614903 11828686 12061924 12313630 12581852 12864399 13158911 13462588
60213A3462588L09290L10487L06755K98402K86256K70702K51388K28092K01570
$$ 13462588 13771878 14082365 14389120 14687522 14973778 15244480 15495868 15723960 15925530
60204A5925530J73075J43321J12500Q1372N1598K4654R46j9506l6068m8088n6247
$$ 15925530 16098605 16241926 16354426 16435798 16487396 16512050 16512996 16493490 16457422 16409334 16353087
60193A6353087o2362o7557p1430p3407p4125p4864p6111p7442p8479p9289p9940
$$ 16353087 16290725 16223168 16151738 16078331 16004206 15929342 15853231 15775789 15697310 15618021 15538081
60182A5538081q0296q0308q0194q0403q1697q5009r0827r8752j07935j17800j27944
$$ 15538081 15457785 15377477 15297283 15216880 15135183 15050174 14959347 14860595 14752660 14634860 14506916
60171A4506916j37602j45666j51186j53724j53484j51392j48677j45973j43237
$$ 14506916 14369314 14223648 14072462 13918738 13765254 13613862 13465185 13319212 13175975
60162A3175975j40868j40082j41426j43456j43964j42133j38514j33190j25434
$$ 13175975 13035107 12895025 12753599 12610143 12466179 12324046 12185532 12052342 11926908
60153A1926908j15258j04107r3555q4383p7203p2853p1528p2367p4641p8669q4866
$$ 11926908 11811650 11707543 11613988 11529605 11452402 11379549 11308021 11235654 11161013 11082344 10997478
60142A0997478r2557j00461j07875j14714j20751j25453j28359j29040j27019
$$ 10997478 10904921 10804460 10696585 10581871 10461120 10335667 10207308 10078268 9951249
60133I951249j22252j15477j07623r9141r0163q0910p1351o0903m9161l6579k3944
$$ 9951249 9828997 9713520 9605897 9506756 9416593 9335683 9264332 9203429 9154268 9117689 9093745
60122I093745j1401J278J3655K4658L3646M0639M5406M7091M5161M0242L3494
$$ 9093745 9082344 9083622 9097277 9121935 9155581 9196220 9241626 9288717 9333878 9374120 9407614
60111I407614K5435J5836M638p399j9111k9768l9384m8333n6795o4543p1023p5576
$$ 9407614 9433049 9448885 9453523 9446124 9427013 9397245 9357861 9309528 9252733 9188190 9117167 9041591
60099I041591p7824p8091p7245p5822p3429o9417o3974n8065n2344m6718m1159
$$ 9041591 8963767 8885676 8808431 8732609 8659180 8589763 8525789 8467724 8415380 8368662 8327503
60088H327503l6242l2540k9880k7630k5294k2602j9339j5531j1535p634l774J86
$$ 8327503 8291261 8258721 8228841 8201211 8175917 8153315 8133976 8118445 8106910 8099276 8095502 8095688
60076H095688M452R617J6353K4306L1983L8327M3803M9210N4099N7320N8634N8602
$$ 8095688 8100140 8109757 8126110 8150416 8182399 8220726 8264529 8313739 8367838 8425158 8483792 8542394
60064H542394N7139N3505M7837M1469L5365K9343K3214J7555J2733Q169L451o17
$$ 8542394 8599533 8653038 8700875 8742344 8777709 8807052 8830266 8847821 8860554 8868723 8872174 8871557
60052H871557l097m436n815p318p910p085n446l439o84L035O848R500J0427R681
$$ 8871557 8868460 8864024 8858209 8850891 8842981 8835896 8830450 8827011 8826327 8829362 8836210 8845710 8856137 8865818
60038H865818P273L309j536o358j0859j5323j9765k3527k5858k6448k5286k2399
$$ 8865818 8873091 8876400 8874864 8868506 8857647 8842324 8822559 8799032 8773174 8746726 8721440 8699041
60026H699041j8050j3054q553n432m008m105n260o925q619j0008j0807j0731r628
$$ 8699041 8680991 8667937 8659384 8653952 8649944 8645839 8640579 8633654 8625035 8615027 8604220 8593489 8583861
60013H583861p606m928j896J189M039O518Q715J0809J2793J4441J5480J5783J5465
$$ 8583861 8576255 8571327 8569431 8570620 8574659 8581177 8589892 8600701 8613494 8627935 8643415 8659198 8674663
60000H674663J4913J4606J4874J5746J7045J8534K0005K1505K3560K7034L2491
$$ 8674663 8689576 8704182 8719056 8734802 8751847 8770381 8790386 8811891 8835451 8862485 8894976
59989H894976L9793M8407N7998O8486P9621R0780J01297J10754J18731J24377
$$ 8894976 8934769 8983176 9041174 9109660 9189281 9280061 9381358 9492112 9610843 9735220
59979I735220J26476J24227J17915J08567R6905Q2898O6654M9370L2928J8517
$$ 9735220 9861696 9985923 10103838 10212405 10309310 10392208 10458862 10508232 10541160 10559677
59969A0559677O138m510j3317k0081k4975k8230k9765k9437k7314k3337j7171
$$ 10559677 10565815 10561305 10547988 10527907 10502932 10474702 10444937 10415500 10388186 10364849 10347678
59958A0347678q847Q72J1197K2006L3224M4022N3433O1509O9086P6653Q4405R3325
$$ 10347678 10338831 10339703 10350900 10372906 10406130 10450152 10503585 10565094 10634180 10710833 10795238 10888563
59946A0888563J05037J20171J37652J55923J74194J92027K08353K21432K29432
$$ 10888563 10993600 11113771 11251423 11407346 11581540 11773567 11981920 12203352 12432784
59937A2432784K30721K24046K09016J86268J57045J22913Q5913M8352J1947k2482
$$ 12432784 12663505 12887551 13096567 13282835 13439880 13562793 13648706 13697058 13709005 13686523
59927A3686523n4369q3119j08805j32417j54637j74733j91351k04040k13161k18378
$$ 13686523 13632154 13549035 13440230 13307813 13153176 12978443 12787092 12583052 12369891 12151513
59917A2151513k18289k11983k00444j85953j70324j54048j36882j18724r9749
$$ 12151513 11933224 11721241 11520797 11334844 11164520 11010472 10873590 10754866 10655117
59908A0655117q0014n9247l7157j3800J0371L4664N8313Q0668J01360J20079J36097
$$ 10655117 10575103 10515856 10478699 10464899 10475270 10509934 10568247 10648915 10750275 10870354 11006451
59897A1006451J48319J56080J59758J60353J58759J55752J52245J48976J45986
$$ 11006451 11154770 11310850 11470608 11630961 11789720 11945472 12097717 12246693 12392679
59888A2392679J42896J39387J34892J28061J17425J02572Q4006O1943L6236P663
$$ 12392679 12535575 12674962 12809854 12937915 13055340 13157912 13241918 13303861 13340097 13347760
59878A3347760k1492m8551p1558q9290j01127j07405j09312j08098j04818j00867
$$ 13347760 13326268 13277717 13206159 13116869 13015742 12908337 12799025 12690927 12586109 12485242
59868A2485242r7764r6039r5063r4394r4344r4903r5125r4298r2672r0164q5214
$$ 12485242 12387478 12291439 12196376 12101982 12007638 11912735 11817610 11723312 11630640 11540476 11455262
59857A1455262p6053o2519m5563k5550k208K4106N2237Q1130J09933J37336J61916
$$ 11455262 11379209 11316690 11271127 11245577 11243369 11267475 11319712 11400842 11510775 11648111 11810027
59846A1810027J83103K00972K15088K24485K28800K28483K23705K13806J98080
$$ 11810027 11993130 12194102 12409190 12633675 12862475 13090958 13314663 13528469 13726549
59837A3726549J76583J50213J20672R0479O2226L7542J7005Q87j0747j8560k3732
$$ 13726549 13903132 14053345 14174017 14264496 14326722 14364264 14381269 14382156 14371409 14352849 14329117
59826A4329117k6994k8420k8349k7775k7533k7582k7423k6942k6613k7102k8685
$$ 14329117 14302123 14273703 14245354 14217579 14190046 14162464 14135041 14108099 14081486 14054384 14025699
59815A4025699l0800l2321l2655l2480l3159l5599l9990m6216n3786o1694o9020
$$ 14025699 13994899 13962578 13929923 13897443 13864284 13828685 13788695 13742479 13688693 13626999 13557979
59804A3557979p5599q1429q5699q7325q6328q3816q0597p6750p2467o8160o3370
$$ 13557979 13482380 13400951 13315252 13227927 13141599 13057783 12977186 12900436 12827969 12759809 12696439
59793A2696439n6515m6149l1843j3660Q241L2955N8706Q3922J07821J29486J47312
$$ 12696439 12639924 12593775 12561932 12548272 12556513 12589468 12648174 12732096 12839917 12969403 13116715
59782A3116715J60182J68652J74188J77567J78691J77672J75260J72144J68206
$$ 13116715 13276897 13445549 13619737 13797304 13975995 14153667 14328927 14501071 14669277
59773A4669277J62390J53145J39327J20978R9232P5555N1538K9408J1865Q27l268
$$ 14669277 14831667 14984812 15124139 15245117 15344349 15419904 15471442 15500850 15512715 15513542 15510274
59762A5510274p18Q176K2612M0718O0185P9178R6156J09425J17623J20342J17577
$$ 15510274 15509556 15517732 15540344 15581062 15641247 15720425 15816581 15926006 16043629 16163971 16281548
59751A6281548J08950R4272P4575N1632K6314j802l3105o6975j02315j38380j74663
$$ 16281548 16390498 16484770 16559345 16610977 16637291 16635489 16602384 16535409 16433094 16294714 16120051
59740A6120051k10368k44370k75492l02527l24225l39660l48662l51817l49991
$$ 16120051 15909683 15665313 15389821 15087294 14763069 14423409 14074747 13722930 13372939
59731A3372939l43888l34053l21255l06665k91386k75706k59125k41240k22383
$$ 13372939 13029051 12694998 12373743 12067078 11775692 11499986 11240861 10999621 10777238
59722A0777238k03201j83843j63982j43516j22900j02717q3175o4149m5629k7940
$$ 10777238 10574037 10390194 10226212 10082696 9959796 9857079 9773904 9709755 9664126 9636186
59712I636186j1476L765J8184L1868M4143N4280O2698P0829P9556Q8265R5874
$$ 9636186 9624710 9628475 9646659 9678527 9722670 9776950 9839648 9910477 9990033 10078298 10174172
59701A0174172J02432J09028J16317J23830J30730J36721J41899J46201J49283
$$ 10174172 10276604 10385632 10501949 10625779 10756509 10893230 11035129 11181330 11330613
59692A1330613J50661J49559J44879J35759J22438J06381Q9506P3308N8754M6616
$$ 11330613 11481274 11630833 11775712 11911471 12033909 12140290 12229796 12303104 12361858 12408474
59682A2408474L7517L1466K7700K5109K2749J9888J6056J1510P467N276N133N841
$$ 12408474 12445991 12477457 12505157 12530266 12553015 12572903 12588959 12600469 12607936 12613212 12618345 12624186
59670A2624186N873M322P37n385j4538k6684m1011n6092p0152q1352q8217r0016
$$ 12624186 12630059 12634381 12635118 12629733 12615195 12588511 12547500 12491408 12421256 12339904 12251687 12161671
59658A2161671q6864p9597o9535n8147m6885l7161l0284k7101k7764l1945l9063
$$ 12161671 12074807 11995210 11925675 11867528 11820643 11783482 11753198 11726097 11698333 11666388 11627325
59647A1627325m8152n7860o7196p6196q5432r4922j04169j13158j22537j32530
$$ 11627325 11579173 11521313 11454117 11377921 11292489 11197567 11093398 10980240 10857703 10725173
59637A0725173j42210j50230j55813j58654j58400j54904j48882j41826j35170
$$ 10725173 10582963 10432733 10276920 10118266 9959866 9804962 9656080 9514254 9379084
59628I379084j29508j24525j19615j14695j10359j06972j03765r9362r3236q6058
$$ 9379084 9249576 9125051 9005436 8890741 8780382 8673410 8569645 8470283 8377047 8290989
59618H290989p8513p0490o1742n2688m3960l5545k6861j7441p309K990J2454K0313
$$ 8290989 8212476 8141986 8080244 8027556 7983596 7948051 7921190 7903749 7896440 7899430 7911884 7932197
59606G932197K6863L3062L8871M2706M3208M0920L7560L4154L0746K7458K4690
$$ 7932197 7959060 7992122 8030993 8073699 8116907 8157827 8195387 8229541 8260287 8287745 8312435
59595H312435K2428K0388J8892J8604J9291J9639J8753J7084J5556J4259J2405
$$ 8312435 8334863 8355251 8374143 8392747 8412038 8431677 8450430 8467514 8483070 8497329 8509734
59584H509734R306N055M67l550o758r699j2827j5703j7438j7732j6831j4685j0898
$$ 8509734 8519040 8524095 8524562 8521012 8514254 8504555 8491728 8476025 8458587 8440855 8424024 8409339 8398441
59571H398441n556P00P624J5565K4434L3220M1018M7812N3776N8450O1365O2934
$$ 8398441 8392885 8393585 8401209 8416774 8441208 8474428 8515446 8563258 8617034 8675484 8736849 8799783
59559H799783O3902O4173O3049O0523N7459N4422N1022M6686M1510L5995L0362
$$ 8799783 8863685 8927858 8990907 9051430 9108889 9163311 9214333 9261019 9302529 9338524 9368886
59548I368886K4487J8221J1497M179l894j2734k2091l1481m0392m8686n6640o4301
$$ 9368886 9393373 9411594 9423091 9427270 9423376 9410642 9388551 9357070 9316678 9267992 9211352 9147051
59536I147051p0842p5159p7290p8710q0791q3384q5383q6325q6660q6520q5121
$$ 9147051 9076209 9001050 8923760 8845050 8764259 8680875 8595492 8509167 8422507 8335987 8250866
59525H250866q1730p6695p0976o5014n8454n0846m2218l3032k3990j5783q659
$$ 8250866 8169136 8092441 8021465 7956451 7897997 7847151 7804933 7771901 7747911 7732128 7723469
59514G723469k216M178J0610J6448K0954K3943K5828K7131K7972K8049K7092K5341
$$ 7723469 7721253 7725431 7736041 7752489 7773443 7797386 7823214 7850345 7878317 7906366 7933458 7958799
59502G958799K3316K1203J8775J6183J4306J3968J4927J6174J7119J8032J9372
$$ 7958799 7982115 8003318 8022093 8038276 8052582 8066550 8081477 8097651 8114770 8132802 8152174
59491H152174K1123K3009K5008K7492L0905L5390M0674M6428N2807O0358O9259
$$ 8152174 8173297 8196306 8221314 8248806 8279711 8315101 8355775 8402203 8455010 8515368 8584627
59480H584627P9005Q9040R9309J09667J19241J26983J32497J35548J35161J30179
$$ 8584627 8663632 8752672 8851981 8961648 9080889 9207872 9340369 9475917 9611078 9741257
59470I741257J20707J07992R2906P5603N6841L8462K2093Q282k648r978j3520
$$ 9741257 9861964 9969956 10062862 10138465 10195306 10233768 10255861 10264143 10261495 10251517 10237997
59459A0237997j4353j3824j2449j0493q873q600r886j2604j7032k3178k9982l6233
$$ 10237997 10223644 10209820 10197371 10186878 10178005 10169405 10159519 10146915 10129883 10106705 10076723 10040490
59447A0040490m1898m7378n1822n3625n2564n0185m7755m5021m1356l6995l2482
$$ 10040490 9998592 9951214 9899392 9845767 9793203 9743018 9695263 9650242 9608886 9571891 9539409
59436I539409k7795k2781j7878j3588r656n496j179K655N736Q497J1491J4889
$$ 9539409 9511614 9488833 9470955 9457367 9447711 9442215 9441036 9443691 9449427 9457924 9469415 9484304
59424I484304J8558K2309K6161L0677L6923M5505N5580O5194P2823P8040Q0553
$$ 9484304 9502862 9525171 9551332 9582009 9618932 9664437 9720017 9785211 9858034 9936074 10016627
59413A0016627P9315P3769O5866N9958O0102O7902Q2884J03739J28184J52548
$$ 10016627 10095942 10169711 10235577 10295535 10355637 10423539 10506423 10610162 10738346 10890894
59403A0890894J73158J88328J98071K02207K00230J93328J84870J77736J71993
$$ 10890894 11064052 11252380 11450451 11652658 11852888 12046216 12231086 12408822 12580815
59394A2580815J65871J57994J47645J33854J15949R4920P3054N2145L2752J4950
$$ 12580815 12746686 12904680 13052325 13186179 13302128 13397048 13470102 13522247 13554999 13569949
59384A3569949j290j6312l0431m3252n4142o3372p1864p9682q5674q8906q9665
$$ 13569949 13568659 13552347 13521916 13478664 13424522 13361150 13289286 13209604 13123930 13035024 12945359
59373A2945359q8803q6864q4277q1751p9955p9111p9145p9902q1003q1971q2688
$$ 12945359 12856556 12769692 12685415 12603664 12523709 12444598 12365453 12285551 12204548 12122577 12039889
59362A2039889q3357q3797q3231q1004p7210p2336o6569n9716n1645m2742l3940
$$ 12039889 11956532 11872735 11789504 11708500 11631290 11558954 11492385 11432669 11381024 11338282 11304342
59351A1304342k6167j9552j3462p593k732J06R18M05j195m024p506j0452j2575
$$ 11304342 11278175 11258623 11245161 11237568 11234836 11234942 11235860 11236265 11235070 11231046 11223540 11213088 11200513
59338A1200513j4899j8236k2000k4969k6577k7003k6656k6149k6171k6769k7098
$$ 11200513 11185614 11167378 11145378 11120409 11093832 11066829 11040173 11014024 10987853 10961084 10933986
59327A0933986k6310k4306k1219j6643r918q70J0144K2633L6052M9830O3681P7649
$$ 10933986 10907676 10883370 10862151 10845508 10835590 10834720 10844864 10867497 10903549 10953379 11017060 11094709
59315A1094709R1609J05188J18428J31866J45557J58595J70213J80770J90925
$$ 11094709 11186318 11291506 11409934 11541800 11687357 11845952 12016165 12196935 12387860
59306A2387860K00156K07013K10445K10047K05222J95281J80755J63772J46721
$$ 12387860 12588016 12795029 13005474 13215521 13420743 13616024 13796779 13960551 14107272
59297A4107272J31041J17663J08007J03713J05343J11650J20273J28980J36239
$$ 14107272 14238313 14355976 14463983 14567696 14673039 14784689 14904962 15033942 15170181
59288A5170181J40776J41041J35590J24032J07234Q6374O2053L4661N176k4894
$$ 15170181 15310957 15451998 15587588 15711620 15818854 15905228 15967281 16001942 16007118 15982224
59278A5982224n4231q1828j06504j26894j42164j52413j58287j60521j60082j58203
$$ 15982224 15927993 15846165 15739661 15612767 15470603 15318190 15159903 14999382 14839300 14681097
59268A4681097j55905j53559j51108j48591j46208j43957j41459j38235j34079
$$ 14681097 14525192 14371633 14220525 14071934 13925726 13781769 13640310 13502075 13367996
59259A3367996j29249j24329j19794j15607j11330j06777j02395r8739r5686r2482
$$ 13367996 13238747 13114418 12994624 12879017 12767687 12660910 12558515 12459776 12364090 12271608
59249A2271608q8649q4501q0507p6541p2106o7157o2213n7635n3231m8750m4359
$$ 12271608 12182959 12098458 12017951 11941410 11869304 11802147 11739934 11682299 11629068 11580318 11535959
59238A1535959m0295l6349l1975k6862k1082j4843q307j597N259J2379J9853K7609
$$ 11535959 11495664 11459315 11427340 11400478 11379396 11364553 11356246 11354649 11359908 11372287 11392140 11419749
59226A1419749L5547M3647N1740N9337O5893P1194P5358P8695Q1756Q5186Q9154
$$ 11419749 11455296 11498943 11550683 11610020 11675913 11747107 11822465 11901160 11982916 12068102 12157256
59215A2157256R3173R6906J00865J05794J11555J17224J22201J26547J30125J32258
$$ 12157256 12250429 12347335 12448200 12553994 12665549 12782773 12904974 13031521 13161646 13293904
59205A3293904J32530J31314J28993J24992J18116J07661R3779P6941N7590L6389
$$ 13293904 13426434 13557748 13686741 13811733 13929849 14037510 14131289 14208230 14265820 14302209
59195A4302209J4481o853k6798m5129o1632p5588q6175r3419r8296j01557j02831
$$ 14302209 14316690 14309837 14283039 14237910 14176278 14100690 14014515 13921096 13822800 13721243 13618412
59184A3618412j01344r7162r1059q3304p3368o1055m7114l2341j6579Q79K0246
$$ 13618412 13517068 13419906 13328847 13245543 13172175 13111120 13064006 13031665 13015086 13015965 13036211
59173A3036211M1037O2702Q4924J07373J29351J49838J67727J82016J91885J96624
$$ 13036211 13077248 13139950 13224874 13332247 13461598 13611436 13779163 13961179 14153064 14349688
59163A4349688J95800J89798J79999J68024J54829J40960J27638J16819J09848
$$ 14349688 14545488 14735286 14915285 15083309 15238138 15379098 15506736 15623555 15733403
59154A5733403J06658J06817J10998J20719J36606J57410J80775K04536K27086
$$ 15733403 15840061 15946878 16057876 16178595 16315201 16472611 16653386 16857922 17085008
59145A7085008K46876K62200K71829K75679K74516K68872K58440K42573K20886
$$ 17085008 17331884 17594084 17865913 18141592 18416108 18684980 18943420 19185993 19406879
59136A9406879J93191J59280J19576P5869L0816j3497n6171r6809j34880j69877
$$ 19406879 19600070 19759350 19878926 19954795 19985611 19972114 19915943 19819134 19684254 19514377
59126A9514377k01467k29010k51259k66888k75213k76308k70764k59663k44543
$$ 19514377 19312910 19083900 18832641 18565753 18290540 18014232 17743468 17483805 17239262
59117A7239262k27026k08407j89578j71135j53518j37245j23063j11624j02970
$$ 17239262 17012236 16803829 16614251 16443116 16289598 16152353 16029290 15917666 15814696
59108A5814696r6573r1945q8952q7542q7308q7371q6577q4099q0169p5926p1964
$$ 15814696 15718123 15626178 15537226 15449684 15362376 15275005 15188428 15104329 15024160 14948234 14876270
59097A4876270o7225o0005m9981l8412k6256j3009K095J8547L4917N0227O4259
$$ 14876270 14809045 14749040 14699059 14660647 14634391 14621382 14623477 14642024 14676941 14727168 14791427
59086A4791427P6542Q5777R0471Q9931Q4664P5906O4771N1818L7432K2452Q072
$$ 14791427 14867969 14953746 15044217 15134148 15218812 15294718 15359489 15411307 15448739 15471191 15479263
59075A5479263m876j6255k6243l4816m1660m6466m9400n1617n5022o1235p0784
$$ 15479263 15474387 15458132 15431889 15397073 15355413 15308947 15259547 15207930 15152908 15091673 15020889
59064A5020889q3437r8667j15284j31267j45011j56469j66204j73738j78117j79921
$$ 15020889 14937452 14838785 14723501 14592234 14447223 14290754 14124550 13950812 13772695 13592774
59054A3592774j81032j82165j82033j79559j75472j70888j65648j59127j51719
$$ 13592774 13411742 13229577 13047544 12867985 12692513 12521625 12355977 12196850 12045131
59045A2045131j44292j36877j28945j20422j11465j01820r1414q1046p1429o2007
$$ 12045131 11900839 11763962 11635017 11514595 11403130 11301310 11209896 11128850 11057421 10995414
59035A0995414n1869m1473l2217k4447j7091r341j632N218J0848J5024J7436J8287
$$ 10995414 10943545 10902072 10869855 10845408 10828317 10818976 10817344 10822562 10833410 10848434 10865870 10884157
59023A0884157J8457J8643J8722J8319J7724J7864J9551K2907K7400L2410L7855
$$ 10884157 10902614 10921257 10939979 10958298 10976022 10993886 11013437 11036344 11063744 11096154 11134009
59012A1134009M4269N2181O1539P1908Q3016R4954J07997J22384J38140J55013
$$ 11134009 11178278 11230459 11291998 11363906 11446922 11541876 11649873 11772257 11910397 12065410
59002A2065410J72887J92299K14142K38625K64843K91471L17170L40046L57342
$$ 12065410 12238297 12430596 12644738 12883363 13148206 13439677 13756847 14096893 14454235
58993A4454235L66384L65541L54018L31395K98018K55395K05397J49331Q8361
$$ 14454235 14820619 15186160 15540178 15871573 16169591 16424986 16630383 16779714 16868075
58984A6868075K4488l9490j00711j56235k02709k36959k57339k64351k60366k48979
$$ 16868075 16892563 16853073 16752362 16596127 16393418 16156459 15899120 15634769 15374403 15125424
58974A5125424k33978k17967k01991j86812j74074j65515j61492j61066j63259
$$ 15125424 14891446 14673479 14471488 14284676 14110602 13945087 13783595 13622529 13459270
58965A3459270j67315j72110j76399j79825j82795j85239j86207j84777j80590
$$ 13459270 13291955 13119845 12943446 12763621 12580826 12395587 12209380 12024603 11844013
58956A1844013j73334j62421j47594j29406j08854q6854o4143m1309j8840K688
$$ 11844013 11670679 11508258 11360664 11231258 11122404 11035550 10971407 10930098 10911258 10913946
58946A0913946K2557M0330N6047O9507P9689Q5510Q7110Q5661Q1895P5469O5864
$$ 10913946 10936503 10976833 11032880 11102387 11182076 11267586 11354696 11440357 11522252 11597721 11663585
58935A1663585N3285L8499K2381N939r475k2394l1651l6679l7587l4870k9044
$$ 11663585 11716870 11755369 11777750 11783689 11774214 11751820 11720169 11683490 11645903 11611033 11581989
58924A1581989k0689j0834o95R298J9766L1271M3492N6045O9404Q4290J00521
$$ 11581989 11561300 11550466 11549771 11559069 11578835 11610106 11653598 11709643 11779047 11863337 11963858
58913A1963858J17373J34731J52942J71664J89710K05912K19283K28395K31584
$$ 11963858 12081231 12215962 12368904 12540568 12730278 12936190 13155473 13383868 13615452
58904A3615452K27946K17430K00048J75923J46343J13919Q1244M9763J9987p827
$$ 13615452 13843398 14060828 14260876 14436799 14583142 14697061 14778305 14828068 14848055 14840228
58894A4840228l3449n6660p7191r4962j10352j23827j35327j44311j50227j52579
$$ 14840228 14806779 14750119 14672928 14577966 14467614 14343787 14208460 14064149 13913922 13761343
58884A3761343j50879j45223j36799j27206j17497j08323j00700r5744r3857r4786
$$ 13761343 13610464 13465241 13328442 13201236 13083739 12975416 12874716 12778972 12685115 12590329
58874A2590329r8191j03349j08786j13324j17413j22233j27636j32225j35473
$$ 12590329 12492138 12388789 12280003 12166679 12049266 11927033 11799397 11667172 11531699
58865A1531699j38298j41170j42945j42400j39883j36706j33613j30670j28081
$$ 11531699 11393401 11252231 11109286 10966886 10827003 10690297 10556684 10426014 10297933
58856A0297933j26334j25692j25957j26499j26408j25011j22422j19196j15384
$$ 10297933 10171599 10045907 9919950 9793451 9667043 9542032 9419610 9300414 9185030
58847I185030j10516j04529r8014r1278q3916p5584o6648n7698m8985m0601l2765
$$ 9185030 9074514 8969985 8871971 8780693 8696777 8621193 8554545 8496847 8447862 8407261 8374496
58836H374496k5656j9378j4252j0627q286o480m643k563Q7L639P741J1501J4433
$$ 8374496 8348840 8329462 8315210 8304583 8296297 8289817 8285174 8282611 8282698 8286337 8294078 8305579 8320012
58823H320012J6677J8197J8607J7948J6886J5943J5184J4839J5351J6635J8106
$$ 8320012 8336689 8354886 8373493 8391441 8408327 8424270 8439454 8454293 8469644 8486279 8504385
58812H504385J9774K2419K6372L0959L5581M0621M6887N4879O4924P7187R1061
$$ 8504385 8524159 8546578 8572950 8603909 8639490 8680111 8726998 8781877 8846801 8923988 9015049
58801I015049J05275J19078J32662J46055J58375J68462J75426J78186J75732
$$ 9015049 9120324 9239402 9372064 9518119 9676494 9844956 10020382 10198568 10374300
58792A0374300J68568J59148J49916J41626J34107J27822J23624J21548J20833
$$ 10374300 10542868 10702016 10851932 10993558 11127665 11255487 11379111 11500659 11621492
58783A1621492J20652J20033J17607J12354J04342R3898Q0395O2757M0878J5675
$$ 11621492 11742144 11862177 11979784 12092138 12196480 12290378 12370773 12433530 12474408 12490083
58773A2490083j2135m2345p4350j06674j37598j65774j90180k09976k24532k33426
$$ 12490083 12477948 12435603 12361253 12254579 12116981 11951207 11761027 11551051 11326519 11093093
58763A1093093k36555k34558k28878k20909k11161j99606j86696j73576j61315
$$ 11093093 10856538 10621980 10393102 10172193 9961032 9761426 9574730 9401154 9239839
58754I239839j50291j40329j31049j21977j12676j02968r2983q2807p2048n9943
$$ 9239839 9089548 8949219 8818170 8696193 8583517 8480549 8387566 8304759 8232711 8172768
58744H172768m6140l1495j7726o224K522Q174R985P444J049q143j9197l0809m0860
$$ 8172768 8126628 8095133 8077407 8071183 8073705 8081879 8091864 8099308 8100357 8092214 8073017 8042208 8001348
58731H001348m7689n1625n4141n5747n5934n4893n3631n2221m9548m5293m0692
$$ 8001348 7953659 7902034 7847893 7792146 7736212 7681319 7627688 7575467 7525919 7480626 7439934
58720G439934l6604l2271k6848k0934j5597j0935o579k689N13L253N250N115J772
$$ 7439934 7403330 7371059 7344211 7323277 7307680 7296745 7290166 7287477 7287990 7291243 7296493 7301608 7303380
58707G303380m269j2113k1943l3976m6556n6903o3630o7303o8637o7438o3397
$$ 7303380 7299111 7286998 7265055 7231079 7184523 7127620 7063990 6996687 6928050 6860612 6797215
58696F797215n6856m8385l8300k6838j4356j249J2045K5062L7553M9530O0808
$$ 6797215 6740359 6691974 6653674 6626836 6612480 6611231 6623276 6648338 6685891 6735421 6796229
58685F796229P0889P9523Q6873R2758R6313R6856R4484Q9362Q1122O9631N5761
$$ 6796229 6867118 6946641 7033514 7126272 7222585 7319441 7413925 7503287 7584409 7654040 7709801
58674G709801M0558K4220O711j1089k7725m2314n4649o4626p2405p8763q4410
$$ 7709801 7750359 7774579 7781290 7770201 7742476 7700162 7645513 7580887 7508482 7429719 7345309
58663G345309q9208r2751r5329r7478r8886r8785r7240r5062r2497q8906q3893
$$ 7345309 7256101 7163350 7068021 6970543 6871657 6772872 6675632 6580570 6488073 6399167 6315274
58652F315274p7981p2022o6470o1449n7083n3577n1142m9702m8645m7258m5654
$$ 6315274 6237293 6165271 6098801 6037352 5980269 5926692 5875550 5825848 5777203 5729945 5684291
58641E684291m4699m4661m4556m3404m1525l9802l8267l6238l3485l0320k6771
$$ 5684291 5639592 5594931 5550375 5506971 5465446 5425644 5387377 5351139 5317654 5287334 5260563
58630E260563k2604j8082j3863j0111o379k344J879O048R899J3116J5817J8847
$$ 5260563 5237959 5219877 5206014 5195903 5189524 5187180 5189059 5195107 5205006 5218122 5233939 5252786
58618E252786K3049K8313L3900L9483M5298N1391N7410O3061O8235P2721P6250
$$ 5252786 5275835 5304148 5338048 5377531 5422829 5474220 5531630 5594691 5662926 5735647 5811897
58607E811897P8759Q0332Q1023Q1089Q1142Q1690Q2675Q3782Q4945Q6251Q7664
$$ 5811897 5890656 5970988 6052011 6133100 6214242 6295932 6378607 6462389 6547334 6633585 6721249
58596F721249Q9125R0469R0975Q9519Q5656Q0080P3624O6323N7940M8784L9403
$$ 6721249 6810374 6900843 6991818 7081337 7166993 7247073 7320697 7387020 7444960 7493744 7533147
58585G533147K9843J9847R427j257j2237k3464l4594m5398n5959o6184p5569q3750
$$ 7533147 7562990 7582837 7592264 7591007 7578770 7555306 7520712 7475314 7419355 7353171 7277602 7193852
58573G193852r0639r5797r8504r8889r8122r7066r5585r3555r1446q9307q6452
$$ 7193852 7103213 7007416 6908912 6810023 6711901 6614835 6519250 6425695 6334249 6244942 6158490
58562F158490q2942q0241p9392p9604p9639p9493p9541p9239p8044p6626p5602
$$ 6158490 6075548 5995307 5915915 5836311 5756672 5677179 5597638 5518399 5440355 5363729 5288127
58551E288127p3994p0495o5609o0788n6053n0260m3329l6517l0555k5062j9759
$$ 5288127 5214133 5143638 5078029 5017241 4961188 4910928 4867599 4831082 4800527 4775465 4755706
58540D755706j5029j1216q536p450q032r259j0126j1106j3298j6468j9298k1144
$$ 4755706 4740677 4729461 4720925 4713475 4705443 4696184 4686058 4674952 4661654 4645186 4625888 4604744
58528D604744k2225k2410k1420k0000j9268j9005j8010j6118j4401j3363j2400
$$ 4604744 4582519 4560109 4538689 4518689 4499421 4480416 4462406 4446288 4431887 4418524 4406124
58517D406124j1080r516p378l986M68N039R564J4654K0049K4399K6995K8540K9903
$$ 4406124 4395044 4385528 4378150 4374164 4374632 4379671 4389235 4403889 4423938 4448337 4475332 4503872 4533775
58504D533775L1259L2696L4499L6522L8298L9984M2193M4690M6326M6348M4853
$$ 4533775 4565034 4597730 4632229 4668751 4707049 4747033 4789226 4833916 4880242 4926590 4971443
58493D971443M1904L7236L0997K3807J6089Q225J143m369q749j2940j6746j9196
$$ 4971443 5013347 5050583 5081580 5105387 5121476 5129701 5130844 5126475 5117726 5104786 5088040 5068844
58481E068844k0377k1476k3071k4716k6343k8594l1570l4600l7522m0925m4923
$$ 5068844 5048467 5026991 5003920 4979204 4952861 4924267 4892697 4858097 4820575 4779650 4734727
58470D734727m8811n2184n5252n7860n9308n9403n8676n7547n6252n5338n5048
$$ 4734727 4685916 4633732 4578480 4520620 4461312 4401909 4343233 4285686 4229434 4174096 4119048
58459D119048n4402n2351m9675m8294m8640m9281m9227m8927m8706m7810m5613
$$ 4119048 4064646 4012295 3962620 3914326 3865686 3816405 3767178 3718251 3669545 3621735 3576122
58448C576122m2510l9102l5558l2041k8789k5644k2381j9413j7142j5009j2491
$$ 3576122 3533612 3494510 3458952 3426911 3398122 3372478 3350097 3330684 3313542 3298533 3286042
58437C286042j0465r884r550p316l355q3J295J950K783K867J389q91l098n539
$$ 3286042 3275577 3265693 3256143 3248827 3245472 3245389 3246684 3248634 3251417 3254284 3255673 3254782 3251684 3246145
58423C246145q472j0996j2057j1593j0107q201o775o466o540n683m024k928k671
$$ 3246145 3237673 3226677 3214620 3203027 3192920 3184719 3177944 3171478 3164938 3159255 3155231 3152303 3149632
58410C149632j958o9K226M220O107P851Q874R300R980J0970J1528J1762J2592
$$ 3149632 3147674 3147605 3149831 3154051 3160158 3168009 3176883 3186183 3196163 3207133 3218661 3230423 3243015
58397C243015J3945J4873J5454J6558J7538J6568J3650J0960R532Q033N459K613
$$ 3243015 3256960 3271833 3287287 3303845 3321383 3337951 3351601 3362561 3372093 3380126 3385585 3388198
58385C388198M7k966o357q549r118r822j1682j3272j3344j2933j3266j3620j3054
$$ 3388198 3388245 3385279 3378922 3370373 3361255 3351433 3339751 3326479 3313135 3300202 3286936 3273316 3260262
58372C260262j2426j2901j3948j4541j4927j5696j6398j6485j6431j6681j6677
$$ 3260262 3247836 3234935 3220987 3206446 3191519 3175823 3159425 3142940 3126509 3109828 3093151
58361C093151j5983j5064j4047j2200r518p224n737l825p20K750N912R281J2840
$$ 3093151 3077168 3062104 3048057 3035857 3026339 3019115 3013378 3009553 3008833 3011583 3017495 3026776 3039616
58348C039616J5392J6721J8329K0894K3122K4348K6000K8969L1813L3205L4042
$$ 3039616 3055008 3071729 3090058 3110952 3134074 3158422 3184422 3213391 3245204 3278409 3312451
58337C312451L5353L6268L5875L5104L4894L4265L2131K9223K6441K3086J8559
$$ 3312451 3347804 3384072 3419947 3455051 3489945 3524210 3556341 3585564 3612005 3635091 3653650
58326C653650J3978J0269O397J384l683p563j1017j5069j8802k0880k1801k2720
$$ 3653650 3667628 3677897 3684294 3685678 3681995 3674432 3663415 3648346 3629544 3608664 3586863 3564143
58314C564143k3449k3332k2735k2079k0840j8941j7454j6717j5598j3819j2758
$$ 3564143 3540694 3517362 3494627 3472548 3451708 3432767 3415313 3398596 3382998 3369179 3356421
58303C356421j2605j1352q171n189l946k864m22J920K491K567M098O507Q380J0085
$$ 3356421 3343816 3332464 3324293 3319104 3315158 3312294 3311872 3313792 3316283 3318850 3322948 3329455 3337835 3347920
58289C347920J2170J3343J2727J2039J2929J4265J4500J4458J5118J5045J2909
$$ 3347920 3360090 3373433 3386160 3398199 3411128 3425393 3439893 3454351 3469469 3484514 3497423
58278C497423J0334R354R174Q329P843R315J1949J4413J7436K1795K5881K8142
$$ 3497423 3507757 3517111 3526285 3534614 3542457 3551772 3563721 3578134 3595570 3617365 3643246 3671388
58266C671388K9717L1979L3910L4698L6133L9452M2643M4038M5597M9313N3415
$$ 3671388 3701105 3733084 3766994 3801692 3837825 3877277 3919920 3963958 4009555 4058868 4112283
58255D112283N5669N7389O0477O3592O5138O6890P0663P4490P6240P7773Q1334
$$ 4112283 4167952 4225341 4285818 4349410 4414548 4481438 4552101 4626591 4702831 4780604 4861938
58244D861938Q5193Q7206Q9249R3541R8211J01325J05412J12891J20941J26409
$$ 4861938 4947131 5034337 5123586 5217127 5315338 5416663 5522075 5634966 5755907 5882316
58234E882316J31887J41051J52003J61383J71115J84552J99760K13384K27356
$$ 5882316 6014203 6155254 6307257 6468640 6639755 6824307 7024067 7237451 7464807
58225G464807K44819K63458K80117K98075L22131L50479L79188M10500M48766
$$ 7464807 7709626 7973084 8253201 8551276 8873407 9223886 9603074 10013574 10462340
58216A0462340M92478N38764N91040O53602P23728P98288Q82569R82962J097556
$$ 10462340 10954818 11493582 12084622 12738224 13461952 14260240 15142809 16125771 17223327
58207A7223327J224791J374644J560042J785653K058658K402043K842372L393088
$$ 17223327 18448118 19822762 21382804 23168457 25227115 27629158 30471530 33864618
58199C3864618M065140M883156N874498P058361Q469415J0176071J2245414J4701451
$$ 33864618 37929758 42812914 48687412 55745773 64215188 74391259 86636673 101338124
58191A01338124J7533694K0686884K3945632K6822494K8645758K8803139K6881004
$$ 101338124 118871818 139558702 163504334 190326828 218972586 247775725 274656729
58184B74656729K2639922J6085662P749139j170793r170181j5112410j8631003
$$ 274656729 297296651 313382313 321131452 319960659 310790478 295678068 277047065
58177B77047065k0012880j9856781j8843197j7606166j6574209j5847059j5259593
$$ 277047065 257034185 237177404 218334207 200728041 184153832 168306773 153047180
58170A53047180j4590062j3719356j2651662j1464487j0260271r125983q105055
$$ 153047180 138457118 124737762 112086100 100621613 90361342 81235359 73130304
58163G3130304p202491o410553n719124n110150m562768m066980l621959l223125
$$ 73130304 65927813 59517260 53798136 48687986 44125218 40058238 36436279 33213154
58155C3213154k862075k536669k249403j997045j771790j571022j396533j245698
$$ 33213154 30351079 27814410 25565007 23567962 21796172 20225150 18828617 17582919
58147A7582919j112183r93840q91803q03500p24373o54753n97623n51318n11436
$$ 17582919 16470736 15476896 14585093 13781593 13057220 12402467 11804844 11253526 10742090
58138A0742090m77875m52794m33524m14594l95230l78080l62158l43845l23601
$$ 10742090 10264215 9811421 9377897 8963303 8568073 8189993 7827835 7483990 7160389
58129G160389l04991k87952k69359k49365k31168k15034j98424j81543j67296
$$ 7160389 6855398 6567446 6298087 6048722 5817554 5602520 5404096 5222553 5055257
58120E055257j56058j45575j35542j27398j20214j11603j02271r4983q9559q3480
$$ 5055257 4899199 4753624 4618082 4490684 4370470 4258867 4156596 4061613 3972054 3888574
58110C888574p6784p1704o7933o2952n6816n2139m9433m6753m3781m2032m1053
$$ 3888574 3811790 3740086 3672153 3609201 3552385 3500246 3450813 3404060 3360279 3318247 3277194
58099C277194l8681l5281l3662l4461l5354l5226l5456l6586l7189l6791l6768
$$ 3277194 3238513 3203232 3169570 3135109 3099755 3064529 3029073 2992487 2955298 2918507 2881739
58088B881739l7671l8384l8450l8685l9085l8564l7015l5484l4198l2513l0632
$$ 2881739 2844068 2805684 2767234 2728549 2689464 2650900 2613885 2578401 2544203 2511690 2481058
58077B481058k9290k8046k6027k3803k2440k1301j9145j6611j5152j4219j2181
$$ 2481058 2451768 2423722 2397695 2373892 2351452 2330151 2311006 2294395 2279243 2265024 2252843
58066B252843r417p704o990n595l271j430m61N00J356J198M90N95J285J231P21
$$ 2252843 2243426 2235722 2228732 2223137 2219866 2218436 2217975 2218475 2219831 2221029 2221519 2222114 2223399 2224630 2225351
58051B225351J334L004M006L935M201N405O543P028P341P587P407P271P834Q235
$$ 2225351 2226685 2229689 2233695 2237630 2241831 2247236 2253779 2260807 2268148 2275735 2283142 2290413 2298247 2306482
58037B306482P171N377M771N448N782N381N333N711N397M559M765O241P421P668
$$ 2306482 2313653 2319030 2323801 2329249 2335031 2340412 2345745 2351456 2356853 2361412 2366177 2372418 2379839 2387507
58023B387507Q166R631J1230J2390J3735J5722J8032K0729K4290K8232L1420L3973
$$ 2387507 2395673 2405304 2416534 2428924 2442659 2458381 2476413 2497142 2521432 2549664 2581084 2615057
58011B615057L7137M1140M4904M8078N1587N5975O0943O6787P4454Q3900R3985
$$ 2615057 2652194 2693334 2738238 2786316 2837903 2893878 2954821 3021608 3096062 3179962 3273947
58000C273947J04273J15464J27865J40901J54103J67063J78418J86457J90567
$$ 3273947 3378220 3493684 3621549 3762450 3916553 4083616 4262034 4448491 4639058
57991D639058J90600J85151J72340J52038J25555R3630N7026J8806j6528m6551
$$ 4639058 4829658 5014809 5187149 5339187 5464742 5558372 5615398 5634204 5617676 5571125
57981E571125p1517r1558j05689j13937j17981j19000j16871j11978j05668r8450
$$ 5571125 5499608 5408050 5302361 5188424 5070443 4951443 4834572 4722594 4616926 4518476
57971D518476q9727p9821p0210o1278n2025m2531l4394k7892k1027j2571m100
$$ 4518476 4428749 4348928 4278718 4217440 4165415 4122884 4088490 4060598 4039571 4027000 4022900
57960D022900K249O221Q507R004P378M078k72n380j0411j3953j5574j6131j5968
$$ 4022900 4025149 4031370 4039877 4048881 4056259 4060337 4060065 4054685 4044274 4030321 4014747 3998616 3982648
57947C982648j4272j0812o694k502K646R338J6683K3773L0949L8584M5945N2218
$$ 3982648 3968376 3957564 3950870 3948368 3951014 3960352 3977035 4000808 4031757 4070341 4116286 4168504
57935D168504N7288O0626O0616N6070M7331L5188J9867J959j6961l5520n3168
$$ 4168504 4225792 4286418 4347034 4403104 4450435 4485623 4505490 4507449 4490488 4454968 4401800
57924D401800o9016q1368q9427r4207r6860r7275r5210r1466q6927q1497p5022
$$ 4401800 4332784 4251416 4161989 4067782 3970922 3873647 3778437 3686971 3600044 3518547 3443525
57913C443525o8187o1587n4840m7532m0047l2747k5295j7543r916k382N692J4035
$$ 3443525 3375338 3313751 3258911 3211379 3171332 3138585 3113290 3095747 3085831 3083449 3089141 3103176
57901C103176K1316K7246L3216L9798M5271M8000M8734M8956M8332M5552M0583
$$ 3103176 3124492 3151738 3184954 3224752 3270023 3318023 3366757 3415713 3464045 3509597 3550180
57890C550180L4371K7130J8722J0020K138n256j3304k1960l0101l7237m3733m9496
$$ 3550180 3584551 3611681 3630403 3640423 3642561 3637305 3624001 3602041 3571940 3534703 3490970 3441474
57878C441474n3890n6865n9035o0661o1632o2328o3497o5187o6648o7207o6614
$$ 3441474 3387584 3330719 3271684 3211023 3149391 3087063 3023566 2958379 2891731 2824524 2757910
57867B757910o4816o2106n9204n6475n3325m9092m4236l9925l6677l4147l1877
$$ 2757910 2693094 2630988 2571784 2515309 2461984 2412892 2368656 2328731 2292054 2257907 2226030
57856B226030k9640k7237k4628k2005j9368j6423j3337j0926r475q127o185m292
$$ 2226030 2196390 2169153 2144525 2122520 2103152 2086729 2073392 2062466 2052991 2044864 2038679 2034387
57844B034387l406l189k488j001N85J805K707L144K803J944J332J381J967K944
$$ 2034387 2030981 2027792 2025304 2024303 2024888 2026693 2029400 2032544 2035347 2037291 2038623 2040004 2041971 2044915
57830B044915M220N569O927Q770J1506J4755J7905K1174K5400L0860L6988M3244
$$ 2044915 2049135 2054704 2061631 2070401 2081907 2096662 2114567 2135741 2161141 2192001 2228989 2272233
57818B272233M9671N6447O3368O9800P4896P7793P7816P4423O7048N5399M0140
$$ 2272233 2321904 2378351 2441719 2511519 2586415 2664208 2742024 2816447 2883495 2938894 2979034
57807B979034K2920N531j0643k4476l5206m2970m8546n2274n3886n3562n2192
$$ 2979034 3001954 3007485 2996842 2972366 2937160 2894190 2845644 2793370 2739484 2685922 2633730
57796B633730n0134m6759m1907l6865l3010l0284k7826k5354k2940k0241j7086
$$ 2633730 2583596 2536837 2494930 2458065 2425055 2394771 2366945 2341591 2318651 2298410 2281324
57785B281324j4278j2685j1905j0908r718r344j0174j1482j2470j2928j2984j2996
$$ 2281324 2267046 2254361 2242456 2231548 2221830 2212486 2202312 2190830 2178360 2165432 2152448 2139452
57773B139452j3602j5132j7032j8498j9457k0255k0717k0458j9767j9280j8833
$$ 2139452 2125850 2110718 2093686 2075188 2055731 2035476 2014759 1994301 1974534 1955254 1936421
57762A936421j7691j5788j3857j2257j0577q538o381m223j853O09K544L701M541
$$ 1936421 1918730 1902942 1889085 1876828 1866251 1857713 1851332 1847109 1845256 1845865 1848409 1852110 1856651
57749A856651N489O320O556O099N101L571J290j896n764r578j2516j4414j5820
$$ 1856651 1862140 1868460 1875016 1881115 1886216 1889787 1891077 1889181 1883417 1873839 1861323 1846909 1831089
57736A831089j7026j7536j6905j5594j4312j2842j0380o859l135K14L439O974
$$ 1831089 1814063 1796527 1779622 1764028 1749716 1736874 1726494 1719635 1716500 1716714 1720153 1727127
57724A727127J0893J5227K0121K5486L0975L6548M2516M8854N4864N9924O4222
$$ 1727127 1738020 1753247 1773368 1798854 1829829 1866377 1908893 1957747 2012611 2072535 2136757
57713B136757O8337P2196P4728P4752P2154O7946O2992N6940M8880L8998K8814
$$ 2136757 2205094 2277290 2352018 2426770 2498924 2566870 2629862 2686802 2735682 2774680 2803494
57702B803494J9456J0435O43r942k0235k9331l7142m3922m9728n4291n6995n7202
$$ 2803494 2822950 2833385 2834028 2824086 2803851 2774520 2737378 2693456 2643728 2589437 2532442 2475240
57690B475240n4961n1165m6650m1557l5996l0737k6509k2987j9217j4778r835
$$ 2475240 2420279 2369114 2322464 2280907 2244911 2214174 2187665 2164678 2145461 2130683 2120848
57679B120848m285K203R397J6460K2689K7524K9838K7970K0764Q358p878k5579
$$ 2120848 2116563 2118766 2128163 2144623 2167312 2194836 2224674 2252644 2273408 2281766 2273888 2248309
57667B248309m1702n3516n9852o1350n9667n6643n3788n1791n0386m9050m7634
$$ 2248309 2206607 2153091 2093239 2031889 1972222 1915579 1861791 1810000 1759614 1710564 1662930
57656A662930m6048m3829m0652l7029l3827l1318k9265k7649k6498k5351k3680
$$ 1662930 1616882 1573053 1532401 1495372 1461545 1430227 1400962 1373313 1346815 1321464 1297784
57645A297784k1799k0412j9419j8041j6136j4417j3263j2259j1059r876q848p780
$$ 1297784 1275985 1255573 1236154 1218113 1201977 1187560 1174297 1162038 1150979 1141103 1132255 1124475
57633A124475o812o483o748o688n728m437l620l193k568j624o91J36R99J790K115
$$ 1124475 1117663 1111180 1104432 1097744 1092016 1087579 1083959 1080766 1078198 1076574 1075883 1076019 1077018 1078808 1080923
57618A080923J803J171P35P06Q32O76J73k61l33l29o15r44p62j26L01J37l55q02
$$ 1080923 1082726 1083897 1084632 1085338 1086170 1086846 1087019 1086758 1086425 1086096 1085481 1084537 1083775 1083649 1083950 1084087 1083732 1082930
57600A082930j054r68m25K52M61L6o13j188j789k374k584k333k106k289k629k624
$$ 1082930 1081876 1080908 1080483 1080735 1081196 1081232 1080619 1079431 1077642 1075268 1072684 1070351 1068245 1065956 1063327 1060703
57584A060703k094j183r8R18J675K225K716L021K906K607K685L148L277K620J617
$$ 1060703 1058609 1057426 1057328 1058246 1059921 1062146 1064862 1067883 1070789 1073396 1076081 1079229 1082506 1085126 1086743
57569A086743Q91L19o42j969k956l094k685k489k917l732m475n007n447n619n087
$$ 1086743 1087634 1087953 1087311 1085342 1082386 1079292 1076607 1074118 1071201 1067469 1062994 1057987 1052540 1046921 1041834
57554A041834l864k710k198j928j180q3N57M83L14O25J420K483L677M601M661
$$ 1041834 1037970 1035260 1033062 1031134 1029954 1029871 1030428 1030911 1031225 1031850 1033270 1035753 1039430 1044031 1048692
57539A048692L727K278O91j119l153m926n930o187o110o106o350o613o341n246
$$ 1048692 1052419 1054697 1055388 1054269 1051116 1046190 1040260 1034073 1027963 1021857 1015507 1008894 1002553 997307
57525I97307l855k964k652k309j621q17k0R09J750K065K083K630L797M623M529
$$ 997307 993452 990488 987836 985527 983906 983089 983069 983978 985728 987793 989876 992506 996303 1000926 1005455
57510A005455M272M867O268P814R230J0434J0942J0399R395Q867Q903Q961R016
$$ 1005455 1009727 1014594 1020862 1028676 1037906 1048340 1059282 1069681 1079076 1087943 1096846 1105807 1114823
57497A114823R649J0909J1907J1830J0845R708Q867Q166P264O125N061M370L895
$$ 1114823 1124472 1135381 1147288 1159118 1169963 1179671 1188538 1196704 1203968 1210093 1215154 1219524 1223419
57484A223419L152J945O95o2l48o81j448k549l599m383n035n775o449o486n517
$$ 1223419 1226571 1228516 1229211 1229149 1228801 1228120 1226672 1224123 1220524 1216141 1211106 1205331 1198882 1192396 1186879
57469A186879l892k285r48K31J104J200L61j098k889m854o592p548p661p308o531
$$ 1186879 1182987 1180702 1179754 1179985 1181089 1182289 1182650 1181552 1178663 1173809 1167217 1159669 1152008 1144700 1138169
57454A138169n002k932j227l44L10J440L038M852O846Q607R210Q389P056N729
$$ 1138169 1133167 1130235 1129008 1128664 1128974 1130414 1133452 1138304 1145150 1153757 1162967 1171356 1178412 1184141
57440A184141L290j442p449j2311j5032j6680j8146j8809j7975j6397j5396j5190
$$ 1184141 1187431 1185989 1178540 1166229 1151197 1134517 1116371 1097562 1079587 1063190 1047794 1032604
57428A032604j4955j4085j2623j0757q601o494m776l196j013K095N566Q756J1902
$$ 1032604 1017649 1003564 990941 980184 971583 965089 960313 957117 956104 958199 963765 972521 984423
57415I84423J5791K0448K4544K6498K5774K2792J7861J0972K609n936j3422j9322
$$ 984423 1000214 1020662 1045206 1071704 1097478 1120270 1138131 1149103 1151712 1145776 1132354 1113032
57403A113032k3375k5162k4714k3049k1458k0337j9222j7796j6293j4974j3792
$$ 1113032 1089657 1064495 1039781 1016732 995274 974937 955715 937919 921626 906652 892860
57392H92860j2615j1443j0336r328q458p720p080o644o532o439n751m439l448
$$ 892860 880245 868802 858466 849138 840680 832960 825880 819236 812704 806265 800514 796075 792627
57379G92627l735n157o748p803q160p806o901o038n781o044o367o649o925o754
$$ 792627 788892 783735 776987 769184 761024 753218 746317 740279 734498 728454 722087 715438 708513 701759
57365G01759n671m198l422l484l446k834k328k441k553j996j303j396k037k109
$$ 701759 696088 691890 688468 684984 681538 678704 676376 673935 671382 669386 668083 666687 664650 662541
57351F62541j287m44l05m64j56O10J067O33m62j411j571j032n60q61j864k826
$$ 662541 661254 660810 660505 660041 659885 660495 661562 662195 661733 660322 658751 657719 657159 656298 654434 651608
57335F51608l134k819k326j998j962k251k745l007k555j436k54M70Q55J313J897
$$ 651608 648474 645655 643329 641331 639369 637118 634373 631366 628811 627375 627121 627591 628446 629759 631656
57320F31656K368K787L590M941O379P338P803Q227Q907R599R631Q450O315M383
$$ 631656 634024 636811 640401 645342 651721 659059 666862 675089 683996 693595 703226 711676 717991 722374
57306G22374L674L827L457J878q7j402k267l527n201o505p157p768q821r969j0578
$$ 722374 726048 729875 733332 735210 735123 733721 731454 727927 722726 716221 709064 701296 692475 682506 671928
57291F71928j0395r558q460p702p650p837p428o387n651n818o300o189n486m871
$$ 671928 661533 651975 643515 635813 628163 620326 612898 606511 600860 595042 588742 582553 577067 572196
57277E72196m649m467l990l380k987k903k849k451j611o35J63R40K064L409M379
$$ 572196 567547 563080 559090 555710 552723 549820 546971 544520 542909 542274 542437 543377 545441 548850 553229
57262E53229M771N076N644O195O512P119Q552J0312J1399J1700J2021J2725J3205
$$ 553229 558000 563076 568720 574915 581427 588546 597098 607410 618809 630509 642530 655255 668460
57249F68460J2939J2278J1740J1112R845P892N527K669q97m699p667r297j0189
$$ 668460 681399 693677 705417 716529 726374 734266 739793 742462 741565 736866 729199 719902 709713
57236G09713j1163j2225j2769j2526j1910j1440j1160j0693r685q189o745n980
$$ 709713 698550 686325 673556 661030 649120 637680 626520 615827 606142 597953 591208 585228
57224E85228o024o276n962m882l497k349j575j028n74k10KMj59l36n16r33j723
$$ 585228 579204 572928 566966 562084 558587 556238 554663 553635 553061 552851 552853 552857 552698 552362 551846 550913 549190
57207E49190k511k727k293j630q56N31K908N834Q474J0389J1651J2494J3242J4300
$$ 549190 546679 543952 541659 540029 539173 539704 542612 548446 556920 567309 578960 591454 604696 618996
57193F18996J5667J6632J6513J5584J4774J4437J4002J2865J1043Q751N851K156
$$ 618996 634663 651295 667808 683392 698166 712603 726605 739470 750513 759264 765115 767271
57181G67271j923n458p683q525q609q821r701j1061j2279j2961j3219j3316j3304
$$ 767271 765348 759890 752207 743682 735073 726252 716551 705490 693211 680250 667031 653715 640411
57168F40411j3065j2533j1682j0444q793o847m869l145j740k90J712M285O737
$$ 640411 627346 614813 603131 592687 583894 577047 572178 569033 567293 567003 568715 573000 579737
57155E79737Q409R455J0549J1989J3534J5022J6598J8265J9770K1068K2425K3847
$$ 579737 588146 597601 608150 620139 633673 648695 665293 683558 703328 724396 746821 770668
57143G70668K4946K5601K6304K7514K9059L0531L1895L3272L4493L5323L5963
$$ 770668 795614 821215 847519 875033 904092 934623 966518 999790 1034283 1069606 1105569
57132A105569L6851L8110L9584M1293M3384M5743M8009N0011N1865N3670N5444
$$ 1105569 1142420 1180530 1220114 1261407 1304791 1350534 1398543 1448554 1500419 1554089 1609533
57121A609533N7352N9667O2492O5775O9562P3945P8769Q3693Q8722R4408J01431
$$ 1609533 1666885 1726552 1789044 1854819 1924381 1998326 2077095 2160788 2249510 2343918 2445349
57110B445349J10153J20611J32776J46794J63157J82811K06926K36608K72985
$$ 2445349 2555502 2676113 2808889 2955683 3118840 3301651 3508577 3745185 4018170
57101D018170L17612L72589M40216N22853O23332P45163Q91694J064700J263699
$$ 4018170 4335782 4708371 5148587 5671440 6294772 7039935 7931629 8996329 10260028
57092A0260028J486608J730738J992808K267808K547674K820785L072770L289419
$$ 10260028 11746636 13477374 15470182 17737990 20285664 23106449 26179219 29468638
57084B9468638L461881L590846L683001L736471L723995L591138L278487K755286
$$ 29468638 32930519 36521365 40204366 43940837 47664832 51255970 54534457 57289743
57076E7289743K039267J189285K81983o05780j400740k034888k458330k659706
$$ 57289743 59329010 60518295 60800278 60194498 58793758 56758870 54300540 51640834
57068E1640834k676356k581226k452170k342646k270147k224621k186460k140843
$$ 51640834 48964478 46383252 43931082 41588436 39318289 37093668 34907208 32766365
57060C2766365k082142k011030j930643j844767j756762j668033j577458j483149
$$ 32766365 30684223 28673193 26742550 24897783 23141021 21472988 19895530 18412381
57052A8412381j384796j283900j182142j080574r80464q83976p93465p10541o36051
$$ 18412381 17027585 15743685 14561543 13480969 12500505 11616529 10823064 10112523 9476472
57043I476472n70402n13424m64251m21768l85036l53133l25007k99949k77836
$$ 9476472 8906070 8392646 7928395 7506627 7121591 6768458 6443451 6143502 5865666
57034E865666k58571k41466k25687k10984j97525j85162j73457j62507j53304
$$ 5865666 5607095 5365629 5139942 4928958 4731433 4546271 4372814 4210307 4057003
57025D057003j47220j45393j48374j55698j65395j74188j78674j76686j68048
$$ 4057003 3909783 3764390 3616016 3460318 3294923 3120735 2942061 2765375 2597327
57016B597327j54462j38667j23185j09375r7443q7144p8348p0994o4812n9337
$$ 2597327 2442865 2304198 2181013 2071638 1974195 1887051 1808703 1737709 1672897 1613560
57006A613560n4211m9475m5550m2818m1210m0270l9578l8960l8304l7473l6433
$$ 1613560 1559349 1509874 1464324 1421506 1380296 1340026 1300448 1261488 1223184 1185711 1149278
56995A149278l5249l3853l2145l0275k8427k6296k3290j9424j5332j1159o294
$$ 1149278 1114029 1080176 1048031 1017756 989329 963033 939743 920319 904987 893828 887534
56984H87534p59L984O510P105O915N992L558M6k621l183k324j298l42R34K509
$$ 887534 886775 890759 897269 904374 911289 917281 920839 920885 918264 915081 912757 911459 911117 912051 914560
56969I14560M159O041Q279J0388J1776J2649J3746J5479J7705K0023K1826K2440
$$ 914560 918719 924760 933039 943427 955203 967852 981598 997077 1014782 1034805 1056631 1079071
56957A079071K1823K0803K0002J8742J5760J0927N667J657l13k80J460M499Q311
$$ 1079071 1100894 1121697 1141699 1160441 1176201 1187128 1192795 1194452 1194139 1193859 1195319 1199818 1208129
56944A208129J2389J6369K0080K3557K6881K9779L1639L2205L2068L1969L1770
$$ 1208129 1220518 1236887 1256967 1280524 1307405 1337184 1368823 1401028 1433096 1465065 1496835
56933A496835L0632K8164K4837K1183J7056J1978N861q01p176j2345j5621j6864
$$ 1496835 1527467 1555631 1580468 1601651 1618707 1630685 1636546 1635745 1628569 1616224 1600603 1583739
56921A583739j6423j4742j2305j0004r114j0545j4149j8914k3765k8091l1648
$$ 1583739 1567316 1552574 1540269 1530265 1521151 1510606 1496457 1477543 1453778 1425687 1394039
56910A394039l4245l5615l5588l4378l2649l1135l0132k9321k8142k6293k3959
$$ 1394039 1359794 1324179 1288591 1254213 1221564 1190429 1160297 1130976 1102834 1076541 1052582
56899A052582k1608j9568j7753j5810j3537j0995q254n288k211O76L309O011Q909
$$ 1052582 1030974 1011406 993653 977843 964306 953311 945057 939769 937558 938234 941543 947554 956463
56886I56463J1406J2662J2458J1077Q607M923M44l746o770q491r008q252o404
$$ 956463 967869 980531 992989 1004066 1012673 1017596 1018040 1014294 1007524 999033 990025 981773 975369
56873I75369m255k494r61R72L488O284R304J2889J7194K2002K7180L2791L8449
$$ 975369 971114 968620 967659 968631 972119 978403 987707 1000596 1017790 1039792 1066972 1099763 1138212
56860A138212M3016M5336M4988M1989L6098K7084J5824M476m724j0730j3577j3604
$$ 1138212 1181228 1226564 1271552 1313541 1349639 1376723 1392547 1397023 1392299 1381569 1367992 1354388
56848A354388j1298p755m413j942L81L849R091J5752K3188L1098L9591M8943N9208
$$ 1354388 1343090 1335335 1330922 1328980 1329361 1333210 1342301 1358053 1381241 1412339 1451930 1500873 1560081
56835A560081O9783P9266Q5899Q8232Q5320P6684O2573M4508K5289Q153m437j1627
$$ 1560081 1629864 1709130 1795029 1883261 1968581 2045265 2107838 2152346 2177635 2185788 2181351 2169724
56823B169724j4273j4271j3354j2263j0936r272p449n521l120L24N179J1504J9056
$$ 2169724 2155451 2141180 2127826 2115563 2104627 2095355 2087906 2082385 2079265 2079589 2084768 2096272 2115328
56810B115328K7257L5238M2057M6828M8667M6772M0708L0768J8161M925o635j4850
$$ 2115328 2142585 2177823 2219880 2266708 2315375 2362147 2402855 2433623 2451784 2456709 2450074 2435224
56798B435224j9207k0049j8049j4286j0339p562o037m791l093j033J243M101P793
$$ 2435224 2416017 2395968 2377919 2363633 2353294 2345732 2339695 2334904 2331811 2330778 2332021 2336122 2343915
56785B343915J1856J5712J9313K2555K4425K3509J9236J1905J734j1119k5452
$$ 2343915 2355771 2371483 2390796 2413351 2437776 2461285 2480521 2492426 2494160 2483041 2457589
56774B457589l8877m9391n6609o1113o3240o3151o1594n9678n7824n5551n2439
$$ 2457589 2418712 2369321 2312712 2251599 2188359 2125208 2063614 2003936 1946112 1890561 1838122
56763A838122m8788m5199m1877l8646l5314l1870k8491k5547k3338k1630j9769
$$ 1838122 1789334 1744135 1702258 1663612 1628298 1596428 1567937 1542390 1519052 1497422 1477653
56752A477653j7453j5137j3354j1932j0347q701p678p471p314o348m582k715j329
$$ 1477653 1460200 1445063 1431709 1419777 1409430 1400729 1393051 1385580 1378266 1371918 1367336 1364621 1363292
56739A363292n90m03m82l66K59J229K109K698L111L596M411N822P881J0248J2449
$$ 1363292 1362702 1362299 1361817 1361451 1361710 1362939 1365048 1367746 1370857 1374453 1378864 1384686 1392567 1402815 1415264
56724A415264J4340J6217J8586K1875K6181L1126L6229M1600M7909N5384O3303
$$ 1415264 1429604 1445821 1464407 1486282 1512463 1543589 1579818 1621418 1669327 1724711 1788014
56713A788014P0955P8727Q7515R7251J06728J14844J21285J25824J27751J26324
$$ 1788014 1858969 1937696 2025211 2122462 2229190 2344034 2465319 2591143 2718894 2845218
56703B845218J21304J12816J01267Q7767P4128O2015N2216M4772L9396L5502L2392
$$ 2845218 2966522 3079338 3180605 3268372 3342500 3404515 3456731 3501503 3540899 3576401 3608793
56692C608793K9767K7798K6521K5652K5176K5549K6940K8696L0001L0491K9811
$$ 3608793 3638560 3666358 3692879 3718531 3743707 3769256 3796196 3824892 3854893 3885384 3915195
56681C915195K7153K1942J4718O586j972j1202k1159l1410m1574n1417o0337o7428
$$ 3915195 3942348 3964290 3979008 3985594 3983622 3972420 3951261 3919851 3878277 3826860 3766523 3699095
56669C699095p2214p4954p5984p5181p2239o7272o1004n4520m8886m4683m1796
$$ 3699095 3626881 3551927 3475943 3400762 3328523 3261251 3200247 3145727 3096841 3052158 3010362
56658C010362l9665l7760l5802l3681l1440k9100k6342k2516j7249j0840l834
$$ 3010362 2970697 2932937 2897135 2863454 2832014 2802914 2776572 2754056 2736807 2725967 2722133
56647B722133L588J1401J9135K5898L0920L3770L4232L2435K8980K4546J9466
$$ 2722133 2725721 2737122 2756257 2782155 2813075 2846845 2881077 2913512 2942492 2967038 2986504
56636B986504J4020Q810M372N54l111o608r712j2850j6789k1359k5388k8246l0499
$$ 2986504 3000524 3009334 3013706 3014260 3011149 3004541 2994829 2981979 2965190 2943831 2918443 2890197 2859698
56623B859698l2565l3491l1884k7593k1719j5295q616j698N340J2390J9237K5274
$$ 2859698 2827133 2793642 2761758 2734165 2712446 2697151 2688535 2686837 2692177 2704567 2723804 2749078
56611B749078K9790L2656L4283L4856L3997L1443K7616K3351J9296J5811J3084
$$ 2749078 2778868 2811524 2845807 2880663 2914660 2946103 2973719 2997070 3016366 3032177 3045261
56600C045261J1003R118P146N465M725M944N397N441N061M353K965M93k744n967
$$ 3045261 3056264 3065382 3072528 3077993 3082718 3087662 3093059 3098500 3103561 3107914 3110879 3111372 3108628 3102661
56586C102661q881j1844j4931j7447j8678j8808j8612j8452j8005j6981j5751
$$ 3102661 3093780 3081936 3067005 3049558 3030880 3012072 2993460 2975008 2957003 2940022 2924271
56575B924271j5084j5341j6138j6973j8192k1033k6369l3486m0597m6553n1584
$$ 2924271 2909187 2893846 2877708 2860735 2842543 2821510 2795141 2761655 2721058 2674505 2622921
56564B622921n6349o0796o4356o6694o7845o7930o7162o5965o4632o3101o1271
$$ 2622921 2566572 2505776 2441420 2374726 2306881 2238951 2171789 2105824 2041192 1978091 1916820
56553A916820n9308n7363n5312n3145n1254m9837m8383m6242m3495m0708l8106
$$ 1916820 1857512 1800149 1744837 1691692 1640438 1590601 1542218 1495976 1452481 1411773 1373667
56542A373667l5553l3124l1023k9074k6890k4595k2676k1179j9643j7904j6317
$$ 1373667 1338114 1304990 1273967 1244893 1218003 1193408 1170732 1149553 1129910 1112006 1095689
56531A095689j5070j3906j2693j1729j1205j0826j0264r648r350r473r729r685
$$ 1095689 1080619 1066713 1054020 1042291 1031086 1020260 1009996 1000348 990998 981525 971796 962111
56519I62111r062q010p062o669o799p136p409p326o552n284m478m822n713n934
$$ 962111 953049 945039 937977 931308 924509 917373 909964 902638 896086 890802 886324 881502 875789 869855
56505H69855n221m376l836l173k133j266j001r03l77M23R67J234J613K179K551
$$ 869855 864634 860258 856422 853249 851116 849850 848849 847946 847569 847992 848959 850193 851806 853985 856536
56490H56536K432J929J344Q56L50m16j451k370k808k838k727k428j676n30O46
$$ 856536 858968 860897 862241 863097 863447 863031 861580 859210 856402 853564 850837 848409 846733 846203 846849
56475H46849J628K352K631K415K219K682L725M762N649O686P691P955P354O646
$$ 846849 848477 850829 853460 855875 858094 860776 864501 869263 874912 881598 889289 897244 904598 911244
56461I11244O370O173N638N046M798M675M178L245K184J242N25K2m94j172j632
$$ 911244 917614 923787 929425 934471 939269 943944 948122 951367 953551 954793 955318 955340 954846 953674 952042
56446I52042j325m75L9q5j43M46J337J940K161K096J627Q88M04K50k21j299k228
$$ 952042 950717 950242 950281 950196 950053 950499 951836 953776 955937 958033 959660 960548 960952 961202 960981 959682 957454
56429I57454k287j940k107k853l567m041m483m829m774m435m276m480m838n118
$$ 957454 955167 953227 951120 948267 944700 940659 936176 931347 926573 922138 917862 913382 908544 903426
56415I03426n119m635l771l033k729k634k566k826l574m323m596m559m514m237
$$ 903426 898307 893672 889901 886868 884139 881505 878939 876113 872539 868216 863620 859061 854547 850310
56401H50310l563l063l309l865l849l273k876k811k430j433m62k41p10j169r92
$$ 850310 846747 843684 840375 836510 832661 829388 826512 823701 821271 819838 819376 819135 818425 817256 816264
56386H16264j57P54J162J238J681K600L211L069K811L113L536L346K918L222M236
$$ 816264 816107 816861 818023 819261 820942 823542 826753 829822 832633 835746 839282 842628 845546 848768 853004
56371H53004M973M989M833M888M843M488M158M040L786L162K468J977J476O51
$$ 853004 857977 862966 867799 872687 877530 882018 886176 890216 894002 897164 899632 901609 903085 903736
56357I03736m14j473k430l230l648l458k672j609p66n34q84j406j731j711j202
$$ 903736 903322 901849 899419 896189 892541 889083 886411 884802 884036 883502 882618 881212 879481 877770 876568
56342H76568q6J206J826J488R04Q37J280K011L250N026O507O848O362N916N628
$$ 876568 876482 877688 879514 881002 881906 882743 884023 886034 889284 894310 900817 907665 914027 919943 925571
56327I25571N062M355M039L898L234K197J704J924J961J377Q85J092J554J701
$$ 925571 930633 934988 939027 942925 946159 948356 950060 951984 953945 955322 956207 957299 958853 960554
56313I60554J898K764M002M624M237L462L241L928N099N979O154N911N855O234
$$ 960554 962452 965216 969218 973842 978079 981541 984782 988710 993809 999788 1005942 1011853 1017708 1023942
56299A023942O819P272P340O805N688M424L575L342L508L670L359K296R21K27
$$ 1023942 1030761 1038033 1045373 1052178 1057866 1062290 1065865 1069207 1072715 1076385 1079744 1082040 1082961 1083188
56285A083188N70J073P38j69o54n25o04j398k440l010k886k300j608j092n87M78
$$ 1083188 1083758 1084831 1085569 1085400 1084746 1084221 1083617 1082219 1079779 1076769 1073883 1071583 1069975 1068883 1068296 1068774
56269A068774K224L757M108L542L211L768M976O547Q436J0352J1916J3340J5131
$$ 1068774 1070998 1074755 1078863 1082405 1085616 1089384 1094360 1100907 1109343 1119695 1131611 1144951 1160082
56256A160082J7065J8248J8378J8143J8100J7931J7077J5578J3896J2334J0770
$$ 1160082 1177147 1195395 1213773 1231916 1250016 1267947 1285024 1300602 1314498 1326832 1337602
56245A337602Q731N765K169r48k855m256o398r308j1827j3293j4214j5101j5643
$$ 1337602 1346333 1352098 1354267 1353319 1350464 1346208 1339810 1330502 1318675 1305382 1291168 1276067 1260424
56232A260424j5447j4893j4694j4961j5085j4397j2863j1295j0592j0539r867
$$ 1260424 1244977 1230084 1215390 1200429 1185344 1170947 1158084 1146789 1136197 1125658 1115791
56221A115791p984o085n628o257o383n487m526m121l739k944k136j561p49M17
$$ 1115791 1107807 1101722 1096094 1089837 1083454 1077967 1073441 1069320 1065581 1062637 1060501 1058940 1058191 1058608
56207A058608J101O68l00q63r71j207j736k187k358k480k832l342l584l208k458
$$ 1058608 1059709 1060377 1060077 1059214 1058243 1057036 1055300 1053113 1050755 1048275 1045443 1042101 1038517 1035309 1032851
56192A032851k023k155k253j736q71k13K69P92R08J28r86j390j084j015j523j971
$$ 1032851 1030828 1028673 1026420 1024684 1023813 1023600 1023869 1024661 1025569 1025697 1024711 1023321 1022237 1021222 1019699 1017728
56176A017728j905j570j150n53J9K70O60J924L678M627M402M101M706N955P122
$$ 1017728 1015823 1014253 1013103 1012550 1012569 1012839 1013499 1015423 1019101 1023728 1028130 1032231 1036937 1042892 1050014
56161A050014P976Q545Q796Q903R239R864J0600J1586J3050J4721J6295J8226
$$ 1050014 1057990 1066535 1075331 1084234 1093473 1103337 1113937 1125523 1138573 1153294 1169589 1187815
56149A187815K1071K4350K7327L0661L5796M2653M9491N5311O0876O6888P2604
$$ 1187815 1208886 1233236 1260563 1291224 1327020 1369673 1419164 1474475 1535351 1602239 1674843
56138A674843P6837P9124P9364P7423P3690O9114O4279N9257N4441N0390M6710
$$ 1674843 1751680 1830804 1910168 1987591 2061281 2130395 2194674 2253931 2308372 2358762 2405472
56127B405472M2244L6635L0518K4179J7322J0376M378p31o296j3090k0687k8974
$$ 2405472 2447716 2484351 2514869 2539048 2556370 2566746 2571124 2570393 2564097 2551007 2530320 2501346
56115B501346l8525m8972n8568o6000p1134p3611p2578o8635o4248o1122n8534
$$ 2501346 2462821 2413849 2355281 2289281 2218147 2144536 2071958 2003323 1939075 1877953 1819419
56104A819419n5140n0951m6565m1994l7362l3504l0760k8232k5185k2118j9605
$$ 1819419 1764279 1713328 1666763 1624769 1587407 1553903 1523143 1494911 1469726 1447608 1428003
56093A428003j7348j5112j3406j2316j0976r063p496o851o267m963l517k683k121
$$ 1428003 1410655 1395543 1382137 1369821 1358845 1349782 1342286 1335435 1329168 1324205 1320688 1318005 1315884
56080A315884j322o01k77J91J236K428L378M419N725O796P454Q244R376J0416
$$ 1315884 1314562 1313961 1313684 1313875 1315111 1317539 1320917 1325336 1331061 1337857 1345311 1353555 1362931 1373347
56066A373347J1385J2782J4215J4625J4136J4034J4593J4702J4047J3561J3280
$$ 1373347 1384732 1397514 1411729 1426354 1440490 1454524 1469117 1483819 1497866 1511427 1524707
56055A524707J2085J0194R526J0680J1906J2067J2166J2897J3243J2801J3011
$$ 1524707 1536792 1546986 1556512 1567192 1579098 1591165 1603331 1616228 1629471 1642272 1655283
56044A655283J4504J5659J5348J4781J4967J4747J3179J1535J1090J1036J0513
$$ 1655283 1669787 1685446 1700794 1715575 1730542 1745289 1758468 1770003 1781093 1792129 1802642
56033A802642J0547J2160J4507J6657J9231K2602K5661K8047L1233L5742L9633
$$ 1802642 1813189 1825349 1839856 1856513 1875744 1898346 1924007 1952054 1983287 2019029 2058662
56022B058662M1620M3160M5623M7994M9366N0944N3523N5626N6461N7887O1182
$$ 2058662 2100282 2143442 2189065 2237059 2286425 2337369 2390892 2446518 2502979 2560866 2622048
56011B622048O4554O6315O7790P0617P3998P7003Q0733Q5659Q9850R2425R5724
$$ 2622048 2686602 2752917 2820707 2891324 2965322 3042325 3123058 3208717 3298567 3390992 3486716
56000C486716J01360J07379J11995J16781J23304J30118J36012J42608J50776
$$ 3486716 3588076 3695455 3807450 3924231 4047535 4177653 4313665 4456273 4607049
55991D607049J58357J64482J72014J82510J93279K02858K14422K30030K46703
$$ 4607049 4765406 4929888 5101902 5284412 5477691 5680549 5894971 6125001 6371704
55982F371704K62468K80839L04648L31132L58169L89440M27777M69632N12195
$$ 6371704 6634172 6915011 7219659 7550791 7908960 8298400 8726177 9195809 9708004
55973I708004N59863O17204O82197P53306Q36278R36629J052876J185305J343759
$$ 9708004 10267867 10885071 11567268 12320574 13156852 14093481 15146357 16331662 17675421
55964A7675421J538648J773618K056950K410601K857377L409233M079103M892064
$$ 17675421 19214069 20987687 23044637 25455238 28312615 31721848 35800951 40693015
55956D0693015N873592P044283Q443302J0138430J2190151J4618987J7412953
$$ 40693015 46566607 53610890 62054192 72192622 84382773 99001760 116414713
55949A16414713K0502031K3643172K6336895K7933859K7857502K5719801K1318820
$$ 116414713 136916744 160559916 186896811 214830670 242688172 268407973 289726793
55942B89726793J4741450O605119j895287r387577j4909349j8189270j9497939
$$ 289726793 304468243 311073362 309178075 299790498 284881149 266691879 247193940
55935B47193940j9368632j8427988j7271854j6290798j5556781j4908252j4156150
$$ 247193940 227825308 209397320 192125466 175834668 160277887 145369635 131213485
55928A31213485j3218760j2122111j0946045r781709q700055p732174o877378
$$ 131213485 117994725 105872614 94926569 85144860 76444805 68712631 61835253
55921F1835253o125858n466449m882358m356547l881789l456818l076100k732294
$$ 61835253 55709395 50242946 45360588 41004041 37122252 33665434 30589334 27857040
55913B7857040k424400k153964j916504j705054j518519j358288j219969j096597
$$ 27857040 25432640 23278676 21362172 19657118 18138599 16780311 15560342 14463745
55905A4463745r86913q92809q11442p37407o70222o12482n62611n16241m73076
$$ 14463745 13476832 12584023 11772581 11035174 10364952 9752470 9189859 8673618 8200542
55896H200542m35985m04665l75934l48982l25003l02987k80759k58880k39050
$$ 8200542 7764557 7359892 6983958 6634976 6309973 6006986 5726227 5467347 5228297
55887E228297k20110j99859j79155j60218j42626j24988j08544r5088q3187p0463
$$ 5228297 5008187 4808328 4629173 4468955 4326329 4201341 4092797 3997709 3914522 3844059
55877C844059n7756m7121l7821k8339k0416j7018j8011k1744k8901m0524n3877
$$ 3844059 3786303 3739182 3701361 3673022 3652606 3635588 3617577 3595833 3566932 3526408 3472531
55866C472531o4631p2071p8283q3465q5962q5919q5081q3753q1356p8937p7861
$$ 3472531 3407900 3335829 3257546 3174081 3088119 3002200 2917119 2833366 2752010 2673073 2595212
55855B595212p7072p4781p1672o9271o6609o1959n6534n2849n0532m7351m3395
$$ 2595212 2518140 2443359 2371687 2302416 2235807 2173848 2117314 2064465 2013933 1966582 1923187
55844A923187m0657l9194l7218l4456l2111l0071k7265k4295k2677k2001k0656
$$ 1923187 1882530 1843336 1806118 1771662 1739551 1709480 1682215 1657920 1635243 1613242 1592586
55833A592586j8730j7323j5859j3077r883q158p433n776l310j661o70J163L430
$$ 1592586 1573856 1556533 1540674 1527597 1517714 1509556 1502123 1496347 1493037 1491376 1490706 1491869 1495299
55820A495299M308L957M249N436O268P084R463J2902J5149J6003J7566K0535K3401
$$ 1495299 1499607 1503564 1507813 1513249 1519517 1526601 1536064 1548966 1564115 1580118 1597684 1618219 1641620
55807A641620K5727K9087L4122L9569M5007N1813O0656P0553Q1199R3891J09234
$$ 1641620 1667347 1696434 1730556 1770125 1815132 1866945 1927601 1998154 2079353 2173244 2282478
55796B282478J26234J44461J64974J88146K12554K36759K60252K81596K97179
$$ 2282478 2408712 2553173 2718147 2906293 3118847 3355606 3615858 3897454 4194633
55787D194633L02840K95729K74427K38877J90944J34007P1780Q353n1289j02765
$$ 4194633 4497473 4793202 5067629 5306506 5497450 5631457 5703237 5711590 5660301 5557536
55777E557536j44548j77316k01416k16700k24410k26977k25693k20490k12112
$$ 5557536 5412988 5235672 5034256 4817556 4593146 4366169 4140476 3919986 3707874
55768C707874k02406j92180j80765j68225j55997j44810j33791j22300j11050
$$ 3707874 3505468 3313288 3132523 2964298 2808301 2663491 2529700 2407400 2296350
55759B296350j00807r1449q2902p5549o9190o2995n6988n2189m8866m5926m2578
$$ 2296350 2195543 2104094 2021192 1945643 1876453 1813458 1756470 1704281 1655415 1609489 1566911
55748A566911l9346l6962l5306l3881l2450l0895k9334k8273k7796k6910k4827
$$ 1566911 1527565 1490603 1455297 1421416 1388966 1358071 1328737 1300464 1272668 1245758 1220931
55737A220931k2457k1232k0823j9676j7558j5762j4857j4065j3008j2260j1905
$$ 1220931 1198474 1177242 1156419 1136743 1119185 1103423 1088566 1074501 1061493 1049233 1037328
55726A037328j1180r978r195r211r398r351r212q720p341n489m132l182j750Q3
$$ 1037328 1026148 1016170 1006975 997764 988366 979015 969803 961083 953742 948253 944121 940939 939189 939272
55712I39272J377K185L477N218O406P158Q695J0963J2406J2506J2612J3491J4129
$$ 939272 940649 942834 946311 951529 957935 965093 973788 984751 997157 1009663 1022275 1035766 1049895
55699A049895J3622J2498J1340R967Q779R113J1286J3902J5979J8121K0752K3064
$$ 1049895 1063517 1076015 1087355 1097322 1106101 1115214 1126500 1140402 1156381 1174502 1195254 1218318
55687A218318K4788K7249L1317L5880L9707M3481M8489N4621O1101O8170P6576
$$ 1218318 1243106 1270355 1301672 1337552 1377259 1420740 1469229 1523850 1584951 1653121 1729697
55676A729697Q6317R7247J10124J25731J43601J62821J83620K06948K32802K59740
$$ 1729697 1816014 1913261 2023385 2149116 2292717 2455538 2639158 2846106 3078908 3338648
55666C338648K85504L07339L22159L27300L20952L01809K69440K25670J74887
$$ 3338648 3624152 3931491 4253650 4580950 4901902 5203711 5473151 5698821 5873708
55657E873708J22194P1874K7690o752k9314m0326m1475l4329k0598k835J6262
$$ 5873708 5995902 6067776 6095466 6088714 6059400 6019074 5977599 5943270 5922672 5919837 5936099
55646E936099L4825N1242O3102O7531O2263M5978J8279j9762o5254j14104j61818
$$ 5936099 5970924 6022166 6085268 6152799 6215062 6261040 6279319 6259557 6194303 6080199 5918381
55635E918381k03941k36892k59263k71853k76240k73896k66624k56509k44705
$$ 5918381 5714440 5477548 5218285 4946432 4670192 4396296 4129672 3873163 3628458
55626C628458k31281k16717k02459j89292j76363j62802j49321j37123j26093
$$ 3628458 3397177 3180460 2978001 2788709 2612346 2449544 2300223 2163100 2037007
55617B037007j15250j04486r4637q6159p8664p1671o5081n9073n3895m9597m5723
$$ 2037007 1921757 1817271 1722634 1636475 1557811 1486140 1421059 1361986 1308091 1258494 1212771
55606A212771m1700l7641l4196l1449k8856k6457k5018k4585k4017k2669k1323
$$ 1212771 1171071 1133430 1099234 1067785 1038929 1012472 987454 962869 938852 916183 894860
55595H94860k0693k0125j8825j7347j6626j6320j5385j3764j2318j1437j0806
$$ 894860 874167 854042 835217 817870 801244 784924 769539 755775 743457 732020 721214
55584G21214j0255r847r383q659p925p328o357m609k756j769j574j268m87M10
$$ 721214 710959 701112 691729 683070 675145 667817 661460 656851 654095 652326 650752 649484 648997 649407
55570F49407J293K451L862N012N595N836O013O083N784M942L750K880K896L471
$$ 649407 650700 653151 657013 662025 667620 673456 679469 685552 691336 696278 700028 702908 705804 709275
55556G09275L669L203K777K926L307L633M468O306Q564J0297J1513J2968J5058
$$ 709275 712944 716147 718924 721850 725157 728790 733258 739564 748128 758425 769938 782906 797964
55543G97964J7681K0748K4162K7562L0846L4657L9732M6046N3178O1203P0600
$$ 797964 815645 836393 860555 888117 918963 953620 993352 1039398 1092576 1153779 1224379
55532A224379Q1549R3901J07655J22870J39356J56836J75168J93924K12024K28026
$$ 1224379 1305928 1399829 1507484 1630354 1769710 1926546 2101714 2295638 2507662 2735688
55522B735688K40373K47061K45736K34736K13655J82646J41988R2962L8512j7583
$$ 2735688 2976061 3223122 3468858 3703594 3917249 4099895 4241883 4334845 4373357 4355774
55512D355774p1648j19874j58477j85456k01824k10167k12430k09858k04121j96892
$$ 4355774 4284126 4164252 4005775 3820319 3618495 3408328 3195898 2986040 2781919 2585027
55502B585027j88452j78075j65863j53114j40782j28638j16324j04301r3459q4220
$$ 2585027 2396575 2218500 2052637 1899523 1758741 1630103 1513779 1409478 1316019 1231799
55492A231799p6374o9353o2642n6132n0144m4857m0025l5509l1646k8668k6182
$$ 1231799 1155425 1086072 1023430 967298 917154 872297 832272 796763 765117 736449 710267
55481G10267k3810k1788k0319j8876j6965j5161j4439j4774j5291j5511j5479
$$ 710267 686457 664669 644350 625474 608509 593348 578909 564135 548844 533333 517854
55470E17854j4945j3531j1718j0588j0410j0428j0159r940r911r427q085o636
$$ 517854 502909 489378 477660 467072 456662 446234 436075 426135 416224 406797 398712 392076
55458C92076o220p002q006q182p361o266n684n646n539n032m493m257m022l458
$$ 392076 385856 378854 370848 362666 355305 349039 343355 337709 332170 327138 322645 318388 314366 310908
55444C10908k905k796k801k357j806k003k908l557l492l274l310l135k357j456
$$ 310908 308003 305207 302406 300049 298243 296240 293332 289775 286283 283009 279699 276564 274207 272751
55430B72751j119j294j498j650j965k329k333j949j594j514j355o64M10J149J061
$$ 272751 271632 270338 268840 267190 265225 262896 260563 258614 257020 255506 254151 253487 253897 255046 256107
55415B56107M55j2j70l58p04q60o44m30n67p84o38k24l2k67o99j037j157j139
$$ 256107 256562 256550 256380 256022 255318 254458 253814 253384 252817 252033 251395 251171 251139 250872 250173 249136 247979 246840
55397B46840j339k124l176l513k630j309p53j145j673j725j402r52m07J31L64
$$ 246840 245501 243377 240201 236688 234058 232749 231996 230851 229178 227453 226051 225099 224692 224823 225187
55382B25187K12k0l6J21J29l45j343k379k664j866n25N21R46R19O44K43l4J1K58
$$ 225187 225399 225379 225343 225464 225593 225248 223905 221526 218862 216996 216471 216992 217938 218857 219501 219744 219710 219721 219979
55363B19979M51N42O24O94O99O14L55j31n23l42K45M29j30p22n79J30Q01J263
$$ 219979 220430 220972 221596 222290 222989 223603 223958 223827 223304 222962 223207 223636 223506 222784 222205 222335 223136 224399
55345B24399J511J163P7r46j023m70k60m88l78K56O39L01k64m63l92l33k11J35
$$ 224399 225910 227073 227150 226204 225181 224711 224451 223963 223585 223841 224480 224781 224517 224054 223662 223329 223118 223253
55327B23253N47Q19R99J176J268J179R46O03J45k89m95m77m73o50r65j261j378
$$ 223253 223800 224619 225618 226794 228062 229241 230187 230790 230935 230646 230151 229674 229201 228551 227586 226325 224947
55310B24947j228q84m53J61R98J546J130j8p30m52l4l91j011p49L82J196R33l9
$$ 224947 223719 222835 222382 222543 223541 225087 226217 226199 225469 225017 224983 224592 223581 222832 223214 224410 225343 225304
55292B25304j018j628j740j485j319j509j662j313p32m63m05j67J0m42j264j556
$$ 225304 224286 222658 220918 219433 218114 216605 214943 213630 212898 212435 212030 211863 211873 211431 210167 208611
55276B08611j096n76n15q20j349k012k269j556l13L58J95j0J87L03J9k13j03j10
$$ 208611 207515 206939 206424 205604 204255 202243 199974 198418 198105 198463 198658 198648 198835 199138 199157 198944 198841 198731
55258A98731n36q45n02J96N93N01O6n56j021q61j47M79P16R42J342J396P41j88
$$ 198731 198195 197350 196848 197044 197637 198138 198204 197648 196627 195766 195619 196098 196814 197756 199098 200494 201235 201047
55240B01047q96j541k324k760k327j384p70p04p64o40l52J17Q03J429J627J408
$$ 201047 200151 198610 196286 193526 191199 189815 189045 188341 187577 186937 186585 186702 187505 188934 190561 191969
55224A91969J128R72P66K59n67j347j455n73O78J125L62p03r35l20K33J97j6K26
$$ 191969 193097 194069 194835 195094 194527 193180 191725 191152 191830 192955 193317 192614 191679 191359 191592 191789 191773 191999
55206A91999R43J555J600J204Q94R18R62O07j7m08m21m07o20q93j034j143j263
$$ 191999 192942 194497 196097 197301 198195 199113 200075 200682 200665 200257 199836 199429 198809 197916 196882 195739 194476
55189A94476j084l20P51J493J560J184R09J094J675K248K419K102J496Q98N82
$$ 194476 193392 193072 193823 195316 196876 198060 198969 200063 201738 203986 206405 208507 210003 210901 211483
55174B11483O32Q15P72M84K86K71R0m15q12o96l50k22j86O1K65L8k35J23Q40Q44
$$ 211483 212115 212930 213702 214186 214472 214743 214833 214418 213606 212910 212560 212338 212152 212213 212478 212516 212281 212404 213244 214088
55154B14088j98j387j803j493j008o56n10n18m14k8J91l67j377j750j177o59j085
$$ 214088 213890 212503 210700 209207 208199 207543 207033 206515 206101 206073 206264 205897 204520 202770 201593 200934 199849
55137A99849j942k056j084K72J187J294O66k93j029j223r45m18J22L96K37q3j33
$$ 199849 197907 195851 194767 195039 196226 197520 198186 197893 196864 195641 194696 194278 194400 194796 195033 194950 194817
55120A94817Q4K13J97L53P29R61Q33N12J66r8k3M71Q35N74K33P60J790J795K79
$$ 194817 194901 195114 195311 195664 196393 197354 198187 198699 198865 198767 198744 199215 200050 200624 200857 201617 203407 205202 205481
55101B05481j336j630r74n79o72n94q5M97Q94J091R74N05J2k21m21q71j328j370
$$ 205481 204145 202515 201541 200962 200290 199696 199611 200108 201002 202093 203067 203572 203584 203363 202942 202071 200743 199373
55083A99373j047o98m29j87o5o0J91Q78J522J481P84N7k81l82o29j144j597j478
$$ 199373 198326 197628 197199 197012 196947 196887 197078 197956 199478 200959 201743 201800 201519 201137 200508 199364 197767 196289
55065A96289p54j06o8j63L74J175J029j96j135q14Q2N28O41R52J138O00l09p27
$$ 196289 195535 195429 195361 195198 195572 196747 197776 197580 196445 195631 195713 196241 196882 197834 198972 199572 199263 198536
55047A98536n67l91k92J04P64J225J361J334J051L25n25r65r51p72m80r7K0k82
$$ 198536 197969 197578 197286 197390 198154 199379 200740 202074 203125 203450 202925 201960 201009 200237 199757 199660 199680 199398
55029A99398m03J61Q22O88J6j26M75J010J053J029J113P82j25q39p06o9L75N20
$$ 199398 198995 199156 199978 200666 200682 200556 201031 202041 203094 204123 205236 206018 205893 205054 204348 204279 204654 205174
55011B05174O72Q89R85R52R23Q68O03K2p27j250j186o23j02N5J43M76P08L13m61
$$ 205174 205846 206735 207720 208672 209595 210463 211066 211088 210361 209111 207925 207302 207200 207255 207398 207874 208582 208895 208434
54992B08434q20m90O6N47J139J813J954J154o8p06k64R05J983K287J755R87P03
$$ 208434 207614 207124 207190 207737 208876 210689 212643 213797 213729 213023 212759 213664 215647 217934 219689 220676 221379
54975B21379J092J788K441K947L336L684M229N108O023O506O580O780P371P890
$$ 221379 222471 224259 226700 229647 232983 236667 240896 246004 252027 258533 265113 271893 279264 287154
54961B87154P680O654N354M282L312J826m91l042m783n356n405n581n747n482
$$ 287154 294834 301488 306842 311124 314436 316262 315771 312729 307946 302590 297185 291604 285857 280375
54947B80375m985m793m910m855m468m052l696l170k506k105k017j740r68j25K06
$$ 280375 275390 270597 265687 260832 256364 252312 248616 245446 242940 240835 238818 237078 236110 235985 236191
54932B36191R1J43P46J663K368K600K608K874L605M530N263N710O032O349O681
$$ 236191 236282 236425 237171 238834 241202 243802 246410 249284 252889 257419 262682 268392 274424 280773 287454
54917B87454O928O723N568L434J065p45j987l201m516n447n666n466n308n281
$$ 287454 294382 301105 306673 310107 311172 310427 308440 305239 300723 295276 289610 284144 278836 273555
54903B73555n235n137n084n028m715l946k855j931j595j784k041k102k136k336
$$ 273555 268320 263183 258099 253071 248356 244410 241555 239624 238029 236245 234204 232102 229966 227630
54889B27630k538k475k151j714j187n88j65j29l08l56k20j60l12n10n03k78j04
$$ 227630 225092 222617 220466 218752 217565 216977 216812 216683 216375 216019 215799 215639 215327 214817 214314 214036 213932
54872B13932k68o42p15l01k3n30j381j449n29L53N13N53J139J746J462M71k65
$$ 213932 213664 213022 212307 212006 211983 211453 210072 208623 208094 208447 208960 209513 210652 212398 213860 214331 214066
54855B14066l90l22l14k41j77l47n80n05j78P0K47M96M66k71j311j712j249o29
$$ 214066 213676 213354 213040 212799 212622 212275 211695 211190 211012 211082 211329 211825 212291 212020 210709 208997 207748 207119
54837B07119m06m00k96j21O6M03R25J480K015K501K583J777K34j158j511o47Q91
$$ 207119 206713 206313 206017 205896 205962 206365 207290 208770 210785 213286 215869 217646 217880 216722 215211 214564 215455
54820B15455K237K814K845L035L566L838L560L491M368N738O609O858P007P081
$$ 215455 217692 220506 223351 226386 229952 233790 237350 240841 245209 250947 257556 264414 271421 278502
54806B78502O678N907N142M069K126k51k016l082m169n144m983l684k699k870
$$ 278502 285180 291087 296229 300298 302424 302173 300157 297075 292906 287762 282779 279095 276396 273526
54792B73526l317l111k767l109l723l628k821k067j699j497j409j535j617j254
$$ 273526 270209 267098 264331 261222 257499 253871 251050 248983 247284 245787 244378 242843 241226 239972
54778B39972m33N54J456J976J817J313J444K724M428N507N819N952O207O399O379
$$ 239972 239539 240093 241549 243525 245342 246655 248099 250823 255251 260758 266577 272529 278736 285135 291514
54763B91514O135N607M848M159L593K640Q91j222k860l771m365m989n613o110
$$ 291514 297649 303256 308104 312263 315856 318496 319387 318165 315305 311534 307169 302180 296567 290457
54749B90457o382o248n619m776m153l863l656l267k624j863j323j344j849k257
$$ 290457 284075 277827 272208 267432 263279 259416 255760 252493 249869 248006 246683 245339 243490 241233
54735B41233k079j475j034j080j388j477j109n21j81k18k38J17N78N75m4r45j833
$$ 241233 239154 237679 236645 235565 234177 232700 231591 231070 230889 230671 230433 230550 231128 231703 231659 230714 228881
54718B28881k484k490j644n16K5o7q4K39L92J17j25o1q8m16n38j29K14j96j103
$$ 228881 226397 223907 222263 221747 221772 221705 221621 221860 222252 222369 222244 222183 222095 221679 221141 221012 221226 221030 219927
54699B19927j675j548r59k56K80M97N33O03M39l74j405j576p74k33o84j193o31
$$ 219927 218252 216704 215745 215489 215769 216266 216799 217402 217841 217467 216062 214486 213712 213479 212795 211602 210971
54682B10971N94J367J596J851J885R73n23j341j041m08l3L61R47J269J050P42
$$ 210971 211565 212932 214528 216379 218264 219237 218714 217373 216332 215924 215891 216252 217199 218468 219518 220260
54666B20260Q13J096J148P89R4o58r45m14N31J071R32N76L24n9p78j570k022j905
$$ 220260 221073 222169 223317 224106 224200 223542 222597 222183 222714 223785 224717 225293 225617 225558 224780 223210 221188 219283
54648B19283j130J86J449J965J694J260J096J006P11K56j56l30N0J112K234K395
$$ 219283 218153 218339 219788 221753 223447 224707 225803 226809 227520 227776 227620 227290 227340 228452 230686 233081
54632B33081J414L31K50J182K322K959K816J921O52l80r14j275j763k083j774
$$ 233081 234495 234826 235076 236258 238580 241539 244355 246276 246928 246548 245634 244359 242596 240513 238739
54617B38739r73k37J71L85M05o0j056k053k355j712n07N76J015Q32N21N16O80
$$ 238739 237766 237529 237700 238085 238490 238430 237374 235321 232966 231254 230747 231323 232338 233170 233691 234207 234887
54600B34887N22j14q13j126j154j265j436j208m29L76O15M07L47O21P87N00L8
$$ 234887 235409 235295 234482 233356 232202 230937 229501 228293 227864 228240 228855 229262 229609 230230 231017 231517 231555
54583B31555j62j37k20m00l64j29j74p89j520j617q82J92J048J550J780J687J197
$$ 231555 231393 231256 231036 230636 230272 230143 229969 229180 227660 226043 225161 225353 226401 227951 229731 231418 232615
54566B32615N42R3j05l72q73j349j450j131n09L12J107J423J018L00oL94J132
$$ 232615 233157 233250 233145 232773 231900 230551 229101 227970 227461 227773 228880 230303 231321 231621 231615 232009 233141
54549B33141J576J306L86o19j042p92m06k24N9O82J169J031P00R14J447J393O81
$$ 233141 234717 236023 236409 235790 234748 233956 233550 233326 233385 234067 235236 236267 236967 237881 239328 240721 241402
54532B41402L05P79J335J059J47n58o78n10m95q35j393j681j320m97L13J052J902
$$ 241402 241707 242486 243821 244880 245027 244469 243791 243281 242786 241951 240558 238877 237557 237060 237373 238425 240327
54515B40327K537K405J803J676K069J914Q32N0O93K105K832K567K090J827J489
$$ 240327 242864 245269 247072 248748 250817 252731 253563 253613 254306 256411 259243 261810 263900 265727 267216
54500B67216R14L14j37l29n3N66Q76N37J71M64J113J422J489J848K297K102J188
$$ 267216 268130 268444 268307 267978 267925 268491 269367 269904 270075 270539 271652 273074 274563 276411 278708 280810 281998
54483B81998J81o05j293j750j732j626k003k464j981n35N94M67m91j388j907k067
$$ 281998 282179 281574 280281 278531 276799 275173 273170 270706 268725 268190 268784 269251 268760 267372 265465 263398
54467B63398j766j072l96j2J78J76j54n15k74N10Q62J54j052j797j854j524r38
$$ 263398 261632 260560 260164 260152 260330 260506 260352 259837 259563 260073 260935 261089 260037 258240 256386 254862 253924
54450B53924k12J77j18o87q35n30l51n87r35j064r77p40k70M01R08Q46J87o23
$$ 253924 253712 253889 253771 253084 252249 251719 251368 250781 249846 248782 247805 247065 246795 247196 248104 248950 249137 248514
54432B48514r91o68J4M07K23j44j00L99P73N97J88J67N87Q44N64J72K69P23Q48
$$ 248514 247523 246855 246869 247276 247499 247355 247255 247654 248427 249024 249212 249379 249966 250810 251374 251546 251815 252538 253386
54413B53386L87j78l77l53m88p78q54m33L63J000Q22k78j503j853j247m48P2N34
$$ 253386 253773 253595 253218 252865 252377 251599 250745 250312 250675 251675 252497 252219 250716 248863 247616 247168 247240 247774
54395B47774R87R17J50n61n22n5J50J06K16L41P8l40k98K22O44P28P88R89J106
$$ 247774 248761 249678 249828 249267 248745 248690 248840 248946 249162 249503 249581 249241 248943 249165 249809 250537 251325 252314 253420
54376B53420J043J018J097J046P11K33j50k27J39P87J251J261J093J082J086Q20
$$ 253420 254463 255481 256578 257624 258335 258568 258418 258191 258330 259117 260368 261629 262722 263804 264890 265710
54360B65710M01J38lk29n47q75j203j295p04M17J122Q34J25k63m57p92q40j82
$$ 265710 266111 266249 266246 266017 265470 264595 263392 262097 261393 261810 262932 263766 263891 263628 263171 262379 261539 261357
54342B61357N18L67k86m65k38m33j007j067m74k4o5j92l62r46j649j682j197j164
$$ 261357 261875 262242 261956 261491 261253 260820 259813 258746 258272 258248 258183 257991 257629 256683 255034 253352 252155 250991
54324B50991j653j630q19k68n52q67n34j10j65k52P5L20J8k49K70J371K337K788
$$ 250991 249338 247708 246889 246621 246069 245202 244668 244558 244393 244141 244216 244536 244554 244305 244575 245946 248283 251071
54306B51071K475J131p46j857j660j125j215j497j135l32K01M94R12J193Q96L52
$$ 251071 253546 254677 253931 252074 250414 249289 248074 246577 245442 245110 245311 245805 246717 247910 248806 249158
54290B49158K13M10M55L19K16o3p07j234j082m69N3M47P88O54j53q56o52nJ01
$$ 249158 249371 249781 250236 250555 250771 250708 250001 248767 247685 247216 247269 247716 248504 249158 249005 248149 247497 247492 247593
54271B47593k58k67P4k8o56r88p09m88p67j041o75K73J284J849J605O30l66o98
$$ 247593 247335 247068 247142 247114 246458 245470 244761 244273 243506 242465 241790 242063 243347 245196 246801 247431 247065 246367
54253B46367n71o55q99o47N1K34n28j335j125oJ017J312J086Q85R33R22L44q16
$$ 246367 245796 245141 244242 243595 243646 243880 243352 242017 240892 240886 241903 243215 244301 245186 246119 247041 247385 246569
54235B46569j832k021j597j295j191o22N81J530J431O67J98K19J02m36q53o66
$$ 246569 244737 242716 241119 239824 238633 238011 238592 240122 241553 242220 242418 242637 242739 242303 241450 240784
54219B40784k41k94r03j444j480j184q19l16M29J155J556J650J510R59K4o16l73
$$ 240784 240543 240249 239346 237902 236422 235238 234419 234103 234532 235687 237243 238893 240403 241362 241386 240770 240397
54202B40397L01M52L3j32K56N17J77l71p97j393k115j996m25J560K186R37j036
$$ 240397 240698 241150 241183 241051 241307 241824 242001 241630 240833 239440 237325 235329 234904 236464 238650 239587 238551
54185B38551k235k082j070k29k58q52j082n99P2M89Q72J302J175J81r11j185q36
$$ 238551 236316 234234 233164 232935 232677 231825 230743 230144 230216 230705 231577 232879 234054 234235 233324 232139 231303
54168B31303o54p81p11k27M96J372K256K579J880N40o02j127j033l87M44O96J89
$$ 231303 230649 229868 229157 228930 229426 230798 233054 235633 237513 238053 237451 236324 235291 234904 235348 236044 236233
54151B36233j27O25J902K529K322K011J912J729J393J038L96o88j424q93M12J090
$$ 236233 236106 236731 238633 241162 243484 245495 247407 249136 250529 251567 251963 251275 249851 248958 249370 250460
54135B50460P67L52L47K24l33q31r90j243j752j966j604j182j006n52N44J633
$$ 250460 251227 251579 251926 252150 251817 250986 249996 248753 247001 245035 243431 242249 241243 240691 241235 242868
54119B42868J833J145K15m79p91o59j75L08N00L58n8n64p41k90M71J007J314J747
$$ 242868 244701 245846 246061 245582 244791 244132 243957 244265 244765 245123 245065 244501 243760 243470 243941 244948 246262 248009
54101B48009K135J893R71j7o80j123j331j124q03r33j310j106j98N43N64K70P8
$$ 248009 250144 252037 253008 252991 252311 251188 249857 248733 247930 246997 245687 244581 244383 244926 245490 245760 245838
54084B45838j66m15j90L99L86n76j432j174k36L46L92L24J54k64m94m1O98Q54
$$ 245838 245672 245257 245067 245466 245852 245276 243844 242670 242434 242780 243172 243496 243650 243386 242892 242851 243549 244403
54066B44403L04k67l58l9M45Q47Q58L61k26l48J06Q60J587J930J631R49N43O19
$$ 244403 244707 244440 244082 244043 244488 245335 246193 246554 246328 245980 246086 246946 248533 250463 252094 253043 253586 254205
54048B54205O45L11L1N9j26q42j251m65R20J505J044O56J058J687J842J728J930
$$ 254205 254850 255161 255192 255251 255125 254283 253032 252567 253487 254992 256036 256692 257750 259437 261279 263007 264937
54031B64937K442K762K627K328K343K782L155K815J835J148J486K397K784K273
$$ 264937 267379 270141 272768 275096 277439 280221 283376 286191 288026 289174 290660 293057 295841 298114
54017B98114J442Q87O58O73J004J496J651J194M96P7Ll5l03r21j995l374m411
$$ 298114 299556 300443 301101 301774 302778 304274 305925 307119 307615 307692 307695 307660 307357 306436 304441 301067 296656
54000B96656m333l070j548q27j039j386j201o62l14k58k17j24j62l15l38j98q5
$$ 296656 292323 289253 287705 286878 285839 284453 283252 282590 282276 282018 281801 281677 281515 281200 280862 280664 280579
53983B80579j6J09J15k40o88o93l42k30l96j60O00J003M69l11m32q7L0JM21J187
$$ 280579 280563 280672 280787 280547 279859 279166 278824 278594 278198 278038 278638 279641 280110 279799 279367 279280 279310 279311 279732 280919
53963B80919J614J580J725K442L406M164M540M441L937L505L586L879L646K764
$$ 280919 282533 284113 285838 288280 291686 295850 300390 304831 308768 312273 315859 319738 323384 326148
53949C26148J867J331Q36J27l62j21O45J183J076O59P19J873M067O602Q688J0042
$$ 326148 328015 329346 330182 330309 329947 329826 330471 331654 332730 333389 334108 335981 340048 346650 355338 365380
53933C65380J0869J1436J1821J1933J1499J0137P681M413Q26k639n407o839o924
$$ 365380 376249 387685 399506 411439 422938 433075 440756 445169 445995 443356 437949 431110 424186
53920D24186o640o918p427p041n491l771k821k504k227j886j704j581j181n03
$$ 424186 417546 410628 403201 396160 390669 386898 384077 381573 379346 377460 375756 374175 372994 372491
53906C72491P5K73J33j91o02r71j107q32j86M75O30L7r39j613j648j349j218j380
$$ 372491 372566 372839 372972 372781 372179 371208 370101 369269 369083 369558 370188 370225 369286 367673 366025 364676 363458 362078
53888C62078j558j539j511j829k500l045l041k718k767l483m340m563l884k688
$$ 362078 360520 358981 357470 355641 353141 350096 347055 344337 341570 338087 333747 329184 325300 322612
53874C22612j661j448k232l355l679k750j380p01r06j310j459j538j758j947j910
$$ 322612 320951 319503 317271 313916 310237 307487 306107 305406 304500 303190 301731 300193 298435 296488 294578
53859B94578j753j653j569j371j058p59o36p78j057j206j138j066j111j066p72
$$ 294578 292825 291172 289603 288232 287174 286415 285779 285001 283944 282738 281600 280534 279423 278357 277585
53844B77585m61l57k54Q5L92L20J02J93M64M79L94P45J369J519J105Q66J048Q98
$$ 277585 277124 276767 276513 276598 276990 277310 277412 277605 278069 278548 278942 279687 281056 282575 283680 284546 285594 286492
53826B86492M7o12j14J192K192K385J939R50l81j222q45J53L42o81j719j588n47
$$ 286492 286539 285927 285813 287005 289197 291582 293521 294471 294090 292868 292023 292176 292518 291837 290118 288530 287983
53809B87983K89M39M07Q45J795K702K901K182J036L40N91J488K258K412K081J715
$$ 287983 288272 288711 289118 289963 291758 294460 297361 299543 300579 300919 301510 302998 305256 307668 309749 311464
53793C11464J608J718J942K330K902L343L204K509J860J727J815J486N69m44j008
$$ 311464 313072 314790 316732 319062 321964 325307 328511 331020 332880 334607 336422 337908 338477 338033 337025
53778C37025r30k90O22J270J195N46po2J54L26O51J443K446K995K887K754L411
$$ 337025 336095 335805 336427 337697 338892 339438 339431 339369 339523 339849 340500 341943 344389 347384 350271 353025 356436
53761C56436N068P239R265J0743J1657J2202J2465J2222J1076Q872N860K352j584
$$ 356436 361504 368743 378008 388751 400408 412610 425075 437297 448373 457245 463105 465457 463873
53748D63873n798r536j1669j1723j0518r457r137r008q415p561p091o933o218
$$ 463873 458075 448539 436870 425147 414629 405172 396035 387027 378612 371051 363960 357027 350809
53735C50809m524k710k051k710l584l670l116k704k670k457j549k05P80Q63K43
$$ 350809 346285 343575 341524 338814 335230 331560 328444 325740 323070 320613 319064 318859 319639 320502 320745
53720C20745l96n55l50k37l55l42O2N03L91l13j013j259j280j568k168k575k234
$$ 320745 320349 319794 319444 319207 318852 318510 318572 319075 319466 319153 318140 316881 315601 314033 311865 309290 307056
53703C07056j000P43K276L007K945K693K806L165L199K683K066J897K162K346
$$ 307056 306056 306799 309075 312082 315027 317720 320526 323691 326890 329573 331639 333536 335698 338044
53689C38044K110J656J397J509J866K261K483K334J806J294J239J542J590J067
$$ 338044 340154 341810 343207 344716 346582 348843 351326 353660 355466 356760 357999 359541 361131 362198
53675C62198M48M02R46J540J830J854J539O16p39j607j180K46J503J828J562J469
$$ 362198 362646 363048 363994 365534 367364 369218 370757 371373 370634 369027 367847 368093 369596 371424 372986 374455
53659C74455J704J773J408J020J088J410J360P33n2n68p36n02K86J414K205K313
$$ 374455 376159 377932 379340 380360 381448 382858 384218 384951 384899 384331 383595 383093 383379 384793 386998 389311
53643C89311K239K568L055L042K525K101J984J788J284O87J08o46j526k075k116
$$ 389311 391550 394118 397173 400215 402740 404841 406825 408613 409897 410584 410692 410046 408520 406445 404329
53628D04329k042k260k687l052l221l085k598k112k141k553k556j788q77n33o17
$$ 404329 402287 400027 397340 394288 391067 387982 385384 383272 381131 378578 376022 374234 373357 372824 372207
53613C72207n97l47k4M13R16J027M71j47P2J180K365K994L090K887K461J885J431
$$ 372207 371610 371263 371239 371652 372568 373595 374066 373919 373991 375171 377536 380530 383620 386507 388968 390853 392284
53596C92284J416K006K968L607L302K385J957K492L099K744J740J236J578K072
$$ 392284 393700 395706 398674 402281 405583 407968 409925 412417 415516 418260 420000 421236 422814 424886
53582D24886K235K349K656K834K549J972J422R70O08L99K82N6k65m29l53k29j86
$$ 424886 427121 429470 432126 434960 437509 439481 440903 441873 442481 442880 443162 443218 442953 442524 442171 441942 441756
53565D41756k18l90p56j039r25o43p48j240j473j114n92l42k01Q9K75l6p59j476
$$ 441756 441538 441148 440392 439353 438428 437785 437037 435797 434324 433210 432618 432276 432075 432164 432439 432403 431644 430168
53547D30168j953k070j571l92Q40J218N26n16j087j089j012j192j434j354q83
$$ 430168 428215 426145 424574 424182 425022 426240 426766 426250 425163 424074 423062 421870 420436 419082 418199
53532D18199l53m3J56N27J088J475J377R65Q12J331K284K932K791K220J986K339
$$ 418199 417846 417803 417959 418486 419574 421049 422426 423391 424203 425534 427818 430750 433541 435761 437747 440086
53516D40086K799K932K961L373M272N389O492P447Q150Q656R165R634R747R581
$$ 440086 442885 445817 448778 452151 456423 461812 468304 475751 483901 492557 501722 511356 521103 530684
53502E30684R869J1125J2814J3941J4211J4147J4320J5042J6500J8452K0037K0610
$$ 530684 540553 551678 564492 578433 592644 606791 621111 636153 652653 671105 691142 711752
53490G11752K0601K0790K0956K0226J8714J7574J7220J6745J5630J4896J5673
$$ 711752 732353 753143 774099 794325 813039 830613 847833 864578 880208 895104 910777
53479I10777J7397J8486J8404J8014J8063J8218J7845J7066J6586J6736J6989
$$ 910777 928174 946660 965064 983078 1001141 1019359 1037204 1054270 1070856 1087592 1104581
53468A104581J6546J5260J3815J2965J2810J3049J3540J4110J4133J3058J1344
$$ 1104581 1121127 1136387 1150202 1163167 1175977 1189026 1202566 1216676 1230809 1243867 1255211
53457A255211J0106R667R237Q254P211O649O129M838K739M90j398k748l546m164
$$ 1255211 1265317 1274984 1284221 1292475 1299686 1306335 1312464 1317302 1320041 1320531 1319133 1316385 1312839 1308675
53443A308675n374p438r465j0454j0760j1666j3548j5323j6009j6069j6651j7963
$$ 1308675 1303301 1295863 1286398 1275944 1265184 1253518 1239970 1224647 1208638 1192569 1175918 1157955
53431A157955j8988j8843j7909j7327j7573j7946j7569j6533j5616j5112j4576
$$ 1157955 1138967 1120124 1102215 1084888 1067315 1049369 1031800 1015267 999651 984539 969963
53420I69963j3740j2978j2571j2066j0867r034p153n609m439l520k506r09J257
$$ 969963 956223 943245 930674 918608 907741 898707 891554 885945 881506 877986 875480 874571 875828
53407H75828L255M491N340O507P882Q779R196R984J1613J3471J4746J5486J6302
$$ 875828 879083 883574 888914 895421 903303 912082 921278 931262 942875 956346 971092 986578 1002880
53394A002880J7434J8587J9580K0666K2141K3898K5579K7041K8458K9960L1382
$$ 1002880 1020314 1038901 1058481 1079147 1101288 1125186 1150765 1177806 1206264 1236224 1267606
53383A267606L2531L3623L5100L7032L8974M0560M1929M3395M4882M5917M6111
$$ 1267606 1300137 1333760 1368860 1405892 1444866 1485426 1527355 1570750 1615632 1661549 1707660
53372A707660M5545M4768M4424M4642M4765M3943M2067L9840L7887L6188L4483
$$ 1707660 1753205 1797973 1842397 1887039 1931804 1975747 2017814 2057654 2095541 2131729 2166212
53361B166212L2779L1158K9523K7896K6547K5416K3821K1237J8095J5210J2627
$$ 2166212 2198991 2230149 2259672 2287568 2314115 2339531 2363352 2384589 2402684 2417894 2430521
53350B430521R599N605P88m544j0216j5858k0881k5042k8727l2403l5964l8784
$$ 2430521 2440120 2445725 2446513 2441969 2431753 2415895 2395014 2369972 2341245 2308842 2272878 2234094
53338B234094m0386m0959m1250m1860m2607m2825m2383m2061m2569m3629m4399
$$ 2234094 2193708 2152749 2111499 2069639 2027032 1984207 1941824 1899763 1857194 1813565 1769166
53327A769166m4591m4555m4471m4095m3334m2414m1349l9849l7936l6170l4934
$$ 1769166 1724575 1680020 1635549 1591454 1548120 1505706 1464357 1424508 1386572 1350402 1315468
53316A315468l3881l2362l0152k7490k4723k2155k0010j8300j6915j5956j5672
$$ 1315468 1281587 1249225 1219073 1191583 1166860 1144705 1124695 1106395 1089480 1073524 1057852
53305A057852j5800j5437j3951j1835j0110r117q378p533o714n877m608k969j793
$$ 1057852 1042052 1026615 1012664 1000829 990719 981602 973224 965691 958977 953100 948492 945523 943730
53292I43730j523j256R1K005K928K702L146N576Q849J0853J1190J1195J1758J2565
$$ 943730 942207 940951 941042 943047 945975 948677 951823 957399 966248 977101 988291 999486 1011244 1023809
53278A023809J3437J4942J7200J9266K0353K0781K1069K0984K0321J9812K0219
$$ 1023809 1037246 1052188 1069388 1088654 1109007 1129788 1150857 1171841 1192162 1211974 1232193
53267A232193K0957K0704J9212J7527J6488J5847J5048J4023J2953J1819J0532
$$ 1232193 1253150 1273854 1293066 1310593 1327081 1342928 1357976 1371999 1384952 1396771 1407303
53256A407303R132P606N831L808J730k78k228m080n793p585r813j2447j4970j6926
$$ 1407303 1416435 1424041 1429872 1433680 1435410 1435132 1432904 1428824 1423031 1415446 1405633 1393186 1378216 1361290
53242A361290j8380j9697k1094k2446k3469k3995k4166k4372k4818k5202k4962
$$ 1361290 1342910 1323213 1302119 1279673 1256204 1232209 1208043 1183671 1158853 1133651 1108689
53231A108689k3920k2617k1871k2034k2669k3076k3125k3328k3962k4438k4046
$$ 1108689 1084769 1062152 1040281 1018247 995578 972502 949377 926049 902087 877649 853603
53220H53603k3049k2335k2059k1430k0054j8611j7737j7059j5955j4579j3407
$$ 853603 830554 808219 786160 764730 744676 726065 708328 691269 675314 660735 647328
53209F47328j2392j1374j0763j0877j1068j0513r602r360r694r463q433p812q407
$$ 647328 634936 623562 612799 601922 590854 580341 570739 561379 551685 542222 533789 525977 517570
53196E17570r368r452q706q066p891p689p083o288n688n412n347n305n149m875
$$ 517570 508202 498750 490044 481978 474087 466398 459315 453027 447339 441927 436580 431275 426126 421251
53182D21251m580m307m076m000m109m142l809l270k983l053l111k936k776k894
$$ 421251 416671 412364 408288 404288 400179 396037 392228 388958 385975 382922 379811 376875 374099 371205
53168C71205l141l206l034k781k520k152j518o43J11K67j56m81j89L67M56k2n39
$$ 371205 368064 364858 361824 359043 356523 354371 352853 352210 352321 352588 352432 351951 351762 352129 352585 352563 352024
53151C52024q10r70r56m43M56J076J038O99N16N01M80M68N12O22R42J627K390
$$ 352024 351214 350244 349288 348845 349301 350377 351415 352114 352630 353131 353611 354079 354591 355213 356155 357782 360172
53134C60172K697K518K394K571K658K358J946J752J707J702J796J793J204N3q72
$$ 360172 362869 365387 367781 370352 373010 375368 377314 379066 380773 382475 384271 386064 387268 387321 386449
53119C86449j055r27j023j089o39N5L03j8n06r98j613k172k322k176k184k416
$$ 386449 385394 384467 383444 382355 381716 381771 382074 382056 381550 380552 378939 376767 374445 372269 370085 367669
53103C67669k473k182j783j472j202j018j106j413j634j711j923k359k626k311
$$ 367669 365196 363014 361231 359759 358557 357539 356433 355020 353386 351675 349752 347393 344767 342456
53089C42456j473m50N51J459K039J903Q87o38j925k397k092j551j243j138r24
$$ 342456 340983 340533 341084 342543 344582 346485 347372 346734 344809 342412 340320 338769 337526 336388 335464
53074C35464n79n13j046j815j962j083J73P45L74l07q18j309j759j490k19J038
$$ 335464 334885 334372 333326 331511 329549 328466 328639 329384 329758 329451 328633 327324 325565 324075 323856 324894
53058C24894J121L67O5M21L82m29r50l71O45J119J095J054R08N37N26J239J807
$$ 324894 326015 326382 326447 326868 327250 326821 325871 325500 326145 327264 328359 329413 330321 330858 331384 332623 334430
53041C34430J236P0k78L79Q36L87l17n67n36n12j48P86J643J579P25M5J72Q41
$$ 334430 335666 335736 335458 335837 336673 337060 336743 336176 335640 335128 334980 335766 337409 338988 339713 339758 339930 340771
53023C40771J365J432J306J403J716J757J166K13m78n93k95Q9K75O6m64r12j001
$$ 340771 342136 343568 344874 346277 347993 349750 350916 351129 350651 350058 349763 349852 350127 350193 349729 348817 347816
53006C47816r38j041j243j296j294j422j458j086n98n94r56r36l79n5m29p85j92
$$ 347816 346878 345837 344594 343298 342004 340582 339124 338038 337440 336846 335890 334954 334575 334520 334091 333306 333114
52989C33114J178K215K137J128j46j097j402j039k54O18J291J499J041R9o78o63
$$ 333114 334292 336507 338644 339772 339626 338529 337127 336088 335834 336452 337743 339242 340283 340382 339704 339041
52973C39041J55J190J811J729J020Kq76j230r84m00J28L56K73Ol26n84n65j87
$$ 339041 339196 340386 342197 343926 344946 344948 344072 342842 341858 341458 341586 341942 342215 342221 341895 341311 340746 340559
52955C40559J99M0p14j369j292p40n26r02j319j288j012q59o95j45O49J046O81
$$ 340559 340758 340798 340084 338715 337423 336683 336157 335255 333936 332648 331636 330777 330082 329937 330586 331632 332313
52938C32313k6l32J0N29O13K24j54j94k00o43j360j550p40N25J242J077O71P41
$$ 332313 332287 331955 331965 332494 333107 333331 333177 332983 332783 332140 330780 329230 328490 329015 330257 331334 332005 332746
52920C32746J209J488J388J315J508J531R02r9p23p84q52j376j988j955j046J73
$$ 332746 333955 335443 336831 338146 339654 341185 342087 341988 341265 340481 339629 338253 336265 334310 333264 333437
52904C33437P96L01q64j571j195m25k99o24k55R46J645J002l2k87j68n92r89r2
$$ 333437 334233 334534 333670 332099 330904 330479 330180 329556 329301 330247 331892 332894 332862 332575 332407 331815 330826 330734
52886C30734J647K234J002l97m28K87L02m93j052p56K07J423K335K237J142J99
$$ 330734 332381 334615 335617 335220 334792 335079 335381 334888 333836 333080 333287 334710 337045 339282 340424 340623
52870C40623L11P74K80r93j528p30K01J9r55j589j492j136r12q00p61q04p44l79
$$ 340623 340934 341708 341988 340995 339467 338737 338938 338957 338002 336413 334921 333785 332873 332073 331312 330508 329764 329385
52852C29385M2l5p63j583j746r93L15J526K127K040J681J670K355L576M803N465
$$ 329385 329427 329392 328629 327046 325300 324307 324622 326148 328275 330315 331996 333666 336021 339597 344400 349865
52836C49865N181L938K171N18p33j897l357m824n468m864l570k533k152k183k293
$$ 349865 355046 358984 361155 361673 360940 359043 355686 350862 345394 340530 336960 334427 332275 330092 327799
52821C27799k346k198j686r62n19o54j188j757k139k178j682p67j9J2n24r11o76
$$ 327799 325453 323255 321569 320607 320088 319434 318246 316489 314350 312172 310490 309723 309704 309716 309192 308281 307605
52804C07605p8K61M7m88q98r67q36p26n96j93N70J412J944K029J798J418J032
$$ 307605 307527 307788 307835 307347 306449 305482 304646 303920 303324 303131 303701 305113 307057 309086 310884 312302 313334
52787C13334P64N79J93n99j513j949j662j045n79l14p1P5j09n07o49l75r2j84
$$ 313334 314098 314677 314870 314271 312758 310809 309147 308102 307523 307209 307138 307213 307104 306597 305948 305573 305481 305297
52769C05297l89j25O47J343J495J266J046Q67M64j93p94j082j080q83m47K16Q08
$$ 305297 304908 304783 305430 306773 308268 309534 310580 311447 311911 311718 310924 309842 308762 307879 307432 307648 308456
52752C08456R65P30N16N59O27M79L78P71J524J896J394L30o53j219j276o87M25
$$ 308456 309421 310151 310667 311226 311853 312332 312710 313481 315005 316901 318295 318625 317972 316753 315477 314790 315215
52735C15215J379J525J022N84M65L07n6k79j87j22l39n43l68J08O17R60P91l09
$$ 315215 316594 318119 319141 319725 320190 320497 320441 320162 319975 319853 319514 318971 318603 318711 319328 320288 321079 320770
52717C20770k030l170k899j807j061q72n13M12J445K022K052J720J268R72Q82
$$ 320770 318740 315570 312671 310864 309803 308931 308418 308830 310275 312297 314349 316069 317337 318309 319191
52702C19191O22n4o36m25L56P57M57J21K58M81L16ql9J43J71j5l14p89j385j604
$$ 319191 319813 319759 319123 318698 319054 319811 320268 320389 320647 321128 321444 321436 321397 321540 321711 321696 321382 320593 319208 317604
52682C17604j042n0N79N11Q2k64l95l74k69n2M54J426K660L512L458K642J665
$$ 317604 316562 316512 317091 317602 317684 317420 317025 316651 316382 316330 316784 318210 320870 324382 327840 330482 332147
52665C32147J021R04J298J903K131J577N45k15k20M13J246J869K029J810J592
$$ 332147 333168 334072 335370 337273 339404 340981 341526 341311 341091 341504 342750 344619 346648 348458 350050
52650C50050J666J873J806J330N78m01j617k737l164k719j887j219p64l53j33
$$ 350050 351716 353589 355395 356725 357303 356902 355285 352548 349384 346665 344778 343559 342795 342442 342309
52635C42309l45p72q71n92n21r51j276p54K72O34j41j155j307o63j61l00o98q62
$$ 342309 341964 341192 340321 339729 339208 338257 336981 336227 336499 337133 336992 335837 334530 333867 333706 333406 332708 331846
52617C31846p50n00j67R0k6m45o09j35O19J011Q91N88L19K7k45k87j40k09p93
$$ 331846 331096 330596 330429 330519 330493 330048 329439 329304 329923 330934 331825 332413 332732 332759 332514 332227 332087 331878 331085
52598C31085j546j698q18O62J729J668P01k79o08l86j48j59k13p4K08M42O75J132
$$ 331085 329539 327841 327023 327685 329414 331082 331783 331504 330896 330510 330362 330203 329990 329916 330124 330566 331241 332373
52580C32373J776K104J608M70l77j34R92J919J742N47p74j407j231o97k35J50
$$ 332373 334149 336253 337861 338331 337954 337820 338812 340731 342473 343020 342246 340839 339608 338911 338676 338826
52564C38826O43J111J155O78J43jR0J1k04j45K11L60N0k69q3M07N79K86P2M09
$$ 338826 339469 340580 341735 342413 342556 342555 342645 342656 342452 342307 342518 342878 342928 342659 342576 342983 343562 343848 343920 344329
52544C44329J065J414J282J117J329J665J525Q05N9k36k59m45p95q73l63O03J496
$$ 344329 345394 346808 348090 349207 350536 352201 353726 354531 354590 354354 354095 353650 352855 351982 351619 352222 353718
52527C53718J674R05j56m01M23J277J190O08O54J396J818J511J178J249J022j37
$$ 353718 355392 356297 356141 355740 356163 357440 358630 359238 359892 361288 363106 364617 365795 367044 368066 367929
52511C67929j536j983j415r16j220j940k255j876j201q06r33j361j705j753j455
$$ 367929 366393 364410 362995 362079 360859 358919 356664 354788 353587 352781 351848 350487 348782 347029 345574
52496C45574p59K12R26Q89L54R5L85O86N38J66j8k9N3M58J300K110K259J693Q82
$$ 345574 344815 345027 345953 346842 347196 347291 347676 348362 348900 349066 349048 349019 349072 349530 350830 352940 355199 356892 357774
52477C57774L44M37J154J906J897J117M47M37N82K34l29m94m17o63j146j322j222
$$ 357774 358118 358555 359709 361615 363512 364629 365076 365513 366095 366329 366000 365506 365089 364426 363280 361958 360736
52460C60736j442k068k446k119j357o82l71m75q47j084r15n38j93L35J201J831
$$ 360736 359294 357226 354780 352661 351304 350622 350251 349776 348929 347845 346930 346392 346199 346534 347735 349566
52444C49566J602R97J110J986K443J796P34R9k80q65j296q94J47Q58P31K65K71
$$ 349566 351168 352165 353275 355261 357704 359500 360234 360333 360053 359188 357892 356998 357145 358003 358734 358999 359270
52427C59270R71J861K229J795R35K81R9K74O96J302J872K215K627L558M775N436
$$ 359270 360241 362102 364331 366126 367061 367342 367441 367715 368411 369713 371585 373800 376427 379985 384760 390196
52411C90196N273M959M988M743L401J248o47j843k896m200n210n095l871k533
$$ 390196 395469 400428 405416 410159 413560 414808 414161 412318 409422 405222 400012 394917 391046 388513
52397C88513k127k782l647l777l018j981j217o92j26N16J022J248J141O81L9l40
$$ 388513 386386 383604 379957 376180 373162 371181 369964 369272 369146 369662 370684 371932 373073 373754 373793 373453
52381C73453p0P77J755K461K701K420J698P65j14p57j052r31n39k70m65j009j391
$$ 373453 373383 374160 375915 378376 381077 383497 385195 385960 385846 385089 384037 383106 382567 382297 381832 380823 379432
52364C79432j120j42J098J963K152J913J689J567J319Q82N42N61Q88J334J787
$$ 379432 378312 378170 379268 381231 383383 385296 386985 388552 389871 390753 391295 391856 392744 394078 395865
52349C95865K154K314K211J836J140L09j8O82J958K758K797K910L636M282M030
$$ 395865 398019 400333 402544 404380 405520 405829 405811 406493 408451 411209 414006 416916 420552 424834 428864
52334D28864L308L088L246K798J709J213K010L144L310K531J827J693J744J680
$$ 428864 432172 435260 438506 441304 443013 444226 446236 449380 452690 455221 457048 458741 460485 462165
52320D62165J791K318K895K929K400J992K376L462M481M883M956N330O049O570
$$ 462165 463956 466274 469169 472098 474498 476490 478866 482328 486809 491692 496648 501978 508027 514597
52306E14597O678O817P286P632P339O703O425O523O340N599M910M977N794O762
$$ 514597 521275 528092 535378 543010 550349 557052 563477 570000 576340 581939 586849 591826 597620 604382
52292F04382P329P286O762O142N810N808N906N953N916N659N091M614M806N505
$$ 604382 611711 618997 625759 631901 637711 643519 649425 655378 661294 666953 672044 676658 681464 686969
52278F86969N779N177M410M308M618M560M173M177M747N256N324N193M945M215
$$ 686969 692748 697925 702335 706643 711261 715821 719994 724171 728918 734174 739498 744691 749636 753851
52264G53851L067K318K422K650K125J255J257K415L563L468K251J103R15J497
$$ 753851 756918 759236 761658 764308 766433 767688 768945 771360 774923 778391 780642 781745 782660 784157
52250G84157K081K276K322K475K578K459K493L190M346N193N489N825O661P619
$$ 784157 786238 788514 790836 793311 795889 798348 800841 804031 808377 813570 819059 824884 831545 839164
52236H39164Q149Q369Q689R048R097Q894Q844R066R328R485R586R571R327Q887
$$ 839164 847313 855682 864371 873419 882516 891410 900254 909320 918648 928133 937719 947290 956617 965504
52222I65504Q325P516O379N138M065L121K264J782J864K021J516K90j039j971
$$ 965504 973829 981345 987724 992862 996927 1000048 1002312 1004094 1005958 1007979 1009495 1009785 1008746 1006775
52208A006775k449k521k255k044k324k920l127k577j606p25j35J67K07J18P4J33
$$ 1006775 1004326 1001805 999550 997506 995182 992262 989135 986558 984952 984227 984092 984259 984466 984584 984658 984791
52192I84791L73R91J920K502K154J190M75L37N06R33J842K911L296K719J817J130
$$ 984791 985164 986155 988075 990577 992731 993921 994396 994733 995239 996172 998014 1000925 1004221 1006940 1008757 1009887
52176A009887N88K29M64J154J294M09m37L3J490K377J925Q82K87K71K48k16r77
$$ 1009887 1010475 1010704 1011168 1012322 1013616 1014025 1013588 1013621 1015111 1017488 1019413 1020295 1020582 1020853 1021101 1020885 1019908
52159A019908j508j404r05p74j463k552l248l336l262l392l578l453k914k156
$$ 1019908 1018400 1016996 1016091 1015317 1013854 1011302 1008054 1004718 1001456 998064 994486 991033 988119 985963
52145I85963j394o30K71J267J988K100J824J771K233K899L383L671L928M160M261
$$ 985963 984569 983939 984210 985477 987465 989565 991389 993160 995393 998292 1001675 1005346 1009274 1013434 1017695
52130A017695M125L604K619J447N12j95j095k243l089l257l101l173l560m099
$$ 1017695 1021820 1025424 1028043 1029490 1030002 1029807 1028712 1026469 1023380 1020123 1017022 1013849 1010289 1006190
52116A006190m728n225n064m062k842k092j702j104j95P20J648K930M606O272
$$ 1006190 1001462 996237 991173 987111 984269 982177 980475 979371 979176 979896 981544 984474 989080 995352
52102I95352P595Q541R149R485R740J0000R991R506Q896Q737R043R289R142Q759
$$ 995352 1002947 1011488 1020637 1030122 1039862 1049862 1059853 1069359 1078255 1086992 1096035 1105324 1114466 1123225
52088A123225Q397Q155Q118Q347Q650Q570P767O286M594L454L387M008M194L323
$$ 1123225 1131622 1139777 1147895 1156242 1164892 1173462 1181229 1187515 1192109 1195563 1198950 1202958 1207152 1210475
52074A210475K016J298J263J198O63j23p87j103r25m30k72q15j388j004K85J489
$$ 1210475 1212491 1213789 1215052 1216250 1216913 1216790 1216003 1214900 1213975 1213545 1213273 1212458 1211070 1210066 1210351 1211840
52058A211840K070K298K299J841J281J647L110M365M252L301K807K972K947K383
$$ 1211840 1213910 1216208 1218507 1220348 1221629 1223276 1226386 1230751 1235003 1238304 1241111 1244083 1247030 1249413
52044A249413J880J867J933J555Q74L79J82J8k57m81m23L6R78K417M033N158N384
$$ 1249413 1251293 1253160 1255093 1256648 1257522 1257901 1258083 1258101 1257844 1257363 1256940 1256976 1257954 1260371 1264404 1269562 1274946
52027A274946N228N683O970Q082Q029P125O472O358N943M568K615P55r36k671
$$ 1274946 1280174 1285857 1292827 1300909 1308938 1316063 1322535 1328893 1334836 1339404 1342019 1342774 1341838 1339167
52013A339167m293n517o480p554q760r841j0797j1865j3111j4426j5822j7285
$$ 1339167 1334874 1329357 1322877 1315323 1306563 1296722 1285925 1274060 1260949 1246523 1230701 1213416
52001A213416j8405j8665j8138j7498j7166j6917j6490j6155j6308j6849j7459
$$ 1213416 1195011 1176346 1158208 1140710 1123544 1106627 1090137 1073982 1057674 1040825 1023366
51990A023366j8207j9337k0425k0480j9250j7831j7408j7752j7666j6756j5839
$$ 1023366 1005159 985822 965397 944917 925667 907836 890428 872676 855010 838254 822415
51979H22415j5438j4821j3184j1054r638r067q346o971n623m897m242k888j248
$$ 822415 806977 792156 778972 767918 758280 749213 740867 733896 728273 723376 719134 716246 714998
51966G14998n52j179k093k174j594j355j796k118j551n15j58r08k062k827l211
$$ 714998 714446 713267 711174 709000 707406 706051 704255 702137 700586 700071 699913 699005 696943 694116 690905
51951F90905l554l731l361k520j665r03J01J473K890M053N042O062P119Q023Q486
$$ 690905 687351 683620 680259 677739 676074 675171 675272 676745 679635 683688 688730 694792 701911 709934 718420
51936G18420Q229P221N800M285K603N84j596l715o027q781j1326j2478j2014j1057
$$ 718420 726649 733870 739670 743955 746558 747142 745546 741831 735804 727023 715697 703219 691205 680148
51922F80148j0663j0671j0372r668q925q152p010n462l847k350q72N62J617J976
$$ 680148 669485 658814 648442 638774 629849 621697 614687 609225 605378 603028 602156 602718 604335 606311
51908F06311J656J021N43M47M35n3j230k705l894m512m568m173l481k659j742
$$ 606311 607967 608988 609531 609978 610413 610360 609130 606425 602531 598019 593451 589278 585797 583138 581396
51893E81396p44J40P07J112J613J974J672Q14J64J5k51j017j601j317p39r28j701
$$ 581396 580652 580792 581499 582611 584224 586198 587870 588684 588848 588863 588612 587595 585994 584677 583938 583010 581309
51876E81309j803q04J37k55j886l672m894n643o194o474o244n563m915m732m906
$$ 581309 579506 578702 578839 578584 576698 573026 568132 562489 556295 549821 543577 538014 533099 528367 523461
51861E23461m944m621m206l853l257k189j008j61N77J745L278M558N296N785O179
$$ 523461 518517 513896 509690 505837 502580 500391 499383 499222 499799 501544 504822 509380 514676 520461 526640
51846E26640O170N505M361K947J214p58k471l414l554l238k817k532k517k684
$$ 526640 532810 538315 542676 545623 546837 546079 543608 540194 536640 533402 530585 528053 525536 522852
51832E22852k789k745k685k604k223j390m03K68M64M35O19J361K635L919M595
$$ 522852 520063 517318 514633 512029 509806 508416 508013 508281 508745 509180 509799 511160 513795 517714 522309
51817E22309M655M779N513O552P144P063O921P470Q849J0598J2282J3895J5612
$$ 522309 526964 531743 537256 543808 550952 558015 564936 572406 581255 591853 604135 618030 633642
51804F33642J7256J8267J8218J7169J5280J2304P886K328l263p779j0818j2628
$$ 633642 650898 669165 687383 704552 719832 732136 740022 742350 739087 731308 720490 707862
51792G07862j3711j4547j5375j6009j6018j5306j4330j3603j3116j2421j1178
$$ 707862 694151 679604 664229 648220 632202 616896 602566 588963 575847 563426 552248
51781E52248r471p718o354n503m867m105l266k616k054j111K30J227J242N72p
$$ 552248 542777 535059 528705 523202 518335 514230 510964 508348 506294 505183 505413 506640 507882 508454 508447
51766E08447l46r28j884k638k711k384k199k160j901j410j124j223j256o92M11
$$ 508447 508101 507173 505289 502651 499940 497556 495357 493197 491296 489886 488762 487539 486283 485591 486002
51751D86002J540K321K708K693K283J873K116L063L795L375K087J175J437K487
$$ 486002 487542 489863 492571 495264 497547 499420 501536 504599 508394 511769 513856 515031 516468 518955
51737E18955L476L957L933L633L539M150N245N805N146L875L207L585M548N618
$$ 518955 522431 526388 530321 533954 537493 541643 546888 552693 557839 561714 564921 568506 573054 578672
51723E78672O695P581P921P718P335O757N534L710K173J661J873K033J958J970
$$ 578672 585367 592948 600869 608587 615922 622679 628213 631923 634096 635757 637630 639663 641621 643591
51709F43591J965J305l72k662m924o874q524r783j0472j0678j0875j1430j1983
$$ 643591 645556 646861 646489 643827 638903 632029 623505 613722 603250 592572 581697 570267 558284
51696E58284j1610r872p606o160n885n930n608n224n194n042m068k489j040K51
$$ 558284 546674 536802 529196 523036 517151 511221 505613 500389 495195 490153 486085 483596 482556 482807
51682D82807J860L466M030L498L216M136N506O107O063O376P190P580O930N585
$$ 482807 484667 488133 492163 495661 498877 503013 508519 514626 520689 527065 534255 541835 548765 554350
51668E54350M024K258L04j447k670l406l657l168k021j014q76j319j357n54M55
$$ 554350 558374 560632 560936 559489 556819 553413 549756 546588 544567 543553 542677 541358 540001 539447 539902
51653E39902P04j62j807l700n391o433o423n339l756k502k105k549l456m256m448
$$ 539902 540606 540444 538637 534937 529546 523113 516690 511351 507595 505093 502988 500439 496983 492727 488279
51638D88279m009l546l583l720l068j590l42l2j45r3m23j832l539l983l065k314
$$ 488279 484270 480724 477141 473421 470353 468763 468421 468389 468244 468151 467728 465896 462357 458374 455309 452995
51622D52995k542k678j579J99J347J654J782J908J775J716K366L370L621L006
$$ 452995 450453 447775 446196 446395 447742 449396 451178 453086 454861 456577 458943 462313 465934 468940
51608D68940K864M205O289P598P639P166O986P157P272P051O639O611P573R556
$$ 468940 471804 476009 482298 489896 497535 504701 511687 518844 526116 533167 539806 546417 553990 563546
51594E63546J1843J3629J4732J5503J6150J6463J6124J5009J3097J0354O855K941
$$ 563546 575389 589018 603750 619253 635403 651866 667990 682999 696096 706450 713305 716246
51582G16246r01m314p109q995r438q001m958j395J472L063L577L541L437L635
$$ 716246 715345 711031 703922 694927 685489 677488 672530 671135 672607 675670 679247 682788 686225 689860
51568F89860M319N424O874Q947J2144J6517K1396K5945K9854L3226L5985L7687
$$ 689860 694179 699603 706477 715424 727568 744085 765481 791426 821280 854506 890491 928178
51556I28178L7909L6581L3843K9809K4556J8267J1193L586m184j1473j7570k2212
$$ 928178 966087 1002668 1036511 1066320 1090876 1109143 1120336 1123922 1119738 1108265 1090695 1068483
51544A068483k5822k9042l2018l4241l5187l4937l4053l2874l1194k8726k5695
$$ 1068483 1042661 1013619 981601 947360 912173 877236 843183 810309 779115 750389 724694
51533G24694k2765k0346j8255j6226j4493j3528j3160j2518j1085r461q557q241
$$ 724694 701929 681583 663328 647102 632609 619081 605921 593403 582318 572857 564300 556059
51521E56059p433n629l726k946l377m070m253l951l503l040k578k231k071j958
$$ 556059 548626 542997 539271 536325 532948 528878 524625 520674 517171 514131 511553 509322 507251 505293
51507E05293j619q64L14J671K715K976K373J333N08L24O77R69O79jl75j89l5m85
$$ 505293 503674 502810 503124 504795 507510 510486 512859 514192 514700 515024 515701 516670 517349 517348 516973 516784 516749 516264
51489E16264j173j291p92m10n38p48n26R0Q30J535J894J453K81q29j203j043r23
$$ 516264 515091 513800 513008 512598 512060 511312 510786 510876 511706 513241 515135 516588 516869 516040 514837 513794 512871
51472E12871r63r73r81j033o78O17K616M412N477O152P086Q566J0364J1789J1976
$$ 512871 511908 510935 509954 508921 508243 508860 511476 515888 521365 527517 534603 543169 553533 565322 577298
51457E77298J0583Q296O252M978M292M071M406M890M536K779Q2k743n373p771
$$ 577298 587881 596177 602429 607407 611699 615770 620176 625066 629602 632381 632463 629720 624347 616576
51443F16576r636j0591j0558r641q026o330n570o112o972o852n651m344l560l053
$$ 616576 606940 596349 585791 576150 568124 561794 556224 550112 543140 536288 530637 526293 522733 519680
51429E19680k578k488l096m013m490m206l448k789k600k701k445j499m78l02r11
$$ 519680 517102 514614 511518 507505 503015 498809 495361 492572 489972 487271 484826 483327 482849 482547 481636
51414D81636j244o65K81Q51J170J747K371K361J712J291J780K954M101M738M795
$$ 481636 480392 479727 480008 480859 482029 483776 486147 488508 490220 491511 493291 496245 500346 505084 509879
51399E09879M484M205M411N301O660Q001Q915R412J0031J1399J3594J6074J8445
$$ 509879 514363 518568 522979 528280 534940 542941 551856 561268 571299 582698 596292 612366 630811
51386F30811K1002K4249K8120L2059L5730L9199M2425M5071M6924M8127M8828
$$ 630811 651813 676062 704182 736241 771971 811170 853595 898666 945590 993717 1042545
51375A042545M8879M8003M6015M2700L7687L0676K1789J1662J232q669j7683k5883
$$ 1042545 1091424 1139427 1185442 1228142 1265829 1296505 1318294 1329956 1331188 1322519 1304836 1278953
51363A278953l3215l9133m3004m4856m5404m5353m4951m4200m3071m1436l9094
$$ 1278953 1245738 1206605 1163601 1118745 1073341 1027988 983037 938837 895766 854330 815236
51352H15236l6121l3002l0193k7696k5142k2264j9164j6282j4088j2703j1814
$$ 815236 779115 746113 715920 688224 663082 640818 621654 605372 591284 578581 566767
51341E66767j0958r818q223o198m261l304l658m480m616l971l418l395l389k939
$$ 566767 555809 545991 537768 531570 527309 524005 520347 515867 511251 507280 503862 500467 497078 494139
51327D94139k374k089j809j153m82m73j030j334r05j31L12K26o9j87q4n1l00o20
$$ 494139 491765 489676 487867 486714 486232 485759 484729 483395 482490 482359 482671 482897 482828 482641 482557 482506 482206 481586
51309D81586o09k63l2j83l86j89L27N75Q6j056k207k584j923p69J21O34J141J614
$$ 481586 480977 480714 480682 480499 480113 479924 480251 480826 480912 479856 477649 475065 473142 472373 472494 473128 474269 475883
51291D75883J564J104J172K180L055K484P09p43r76n66l76l77Q0J217K449K952
$$ 475883 477447 478551 479723 481903 484958 487442 488151 487408 486432 485866 485490 485113 485193 486410 488859 491811
51275D91811K430J376O03M88Q05J180J457J471R85P5p36j102j265j485j455p95
$$ 491811 494241 495617 496220 496708 497513 498693 500150 501621 502606 502681 501945 500843 499578 498093 496638 495843
51259D95843J54N88K02n54j060r95m05L13O70P01J047K013K915K900K110J359
$$ 495843 495997 496585 496787 496233 495173 494178 493773 494086 494756 495457 496504 498517 501432 504332 506442 507801
51243E07801R48M74l09j213k108k974l467l150k214j396j107j195j478j854j932
$$ 507801 508749 509223 508914 507701 505593 502619 499152 496002 493788 492392 491285 490090 488612 486758 484826
51228D84826j300k13N95P94N47j01j059j583r00M03P52l00j390j242k46M46M68
$$ 484826 483526 483313 483908 484702 485249 485148 484089 482506 481606 482009 482761 482461 481071 479829 479583 480029 480497
51211D80497K14l1j01K29Q24J068P87O43J002J202O98K34Q45K163K882K606K112
$$ 480497 480711 480680 480579 480808 481632 482700 483487 484130 485132 486334 487032 487266 488111 490274 493156 495762 497874
51194D97874J908J629J009N04O38J352K281L096L443L083K331J850J815J640P37
$$ 497874 499782 501411 502420 502924 503562 504914 507195 510291 513734 516817 519148 520998 522813 524453 525190
51179E25190p50k099k672k398j816j643k083k593k568k069j626j526j674j997
$$ 525190 524440 522341 519669 517271 515455 513812 511729 509136 506568 504499 502873 501347 499673 497676
51165D97676k444k685k308j390m66J09M06N80O64P00P10N48J29j85R0Q91J609
$$ 497676 495232 492547 490239 488849 488383 488492 488898 489478 490142 490842 491552 492100 492229 492044 492134 493025 494634
51148D94634J791J457Q24K04P4O28J195P81n39j487j203l72k16q16j204q68m15
$$ 494634 496425 497882 498706 498910 498984 499612 500807 501588 501049 499562 498359 497987 497771 496955 495751 494883 494468
51131D94468n76j160j409j049o01n67p22m31M12J180J367J320J751K701L471L562
$$ 494468 493892 492732 491323 490274 489673 489106 488384 487953 488365 489545 490912 492232 493983 496684 500155 503717
51115E03717L178K707K226J763J589J826K063J819J236Q86R17Q48K77n55j103
$$ 503717 506895 509602 511828 513591 515180 517006 519069 520888 522124 523010 523927 524775 525052 524497 523394
51100E23394j157r45p31n30k15K68Q18J306J705K109K573K931K878K316J518Q93
$$ 523394 522237 521292 520561 520031 519816 520084 520902 522208 523913 526022 528595 531526 534404 536720 538238 539131
51084E39131N47K51j61n74q95j351k154k928k874j740l41K27k06p91p36q5O57
$$ 539131 539678 539929 539768 539194 538299 536948 534794 531866 528992 527252 526911 527138 526932 526141 525405 525320 525977
51067E25977J306K026K756L127L017K866L116L524L401K530J519J179J684K530
$$ 525977 527283 529309 532065 535192 538209 541075 544191 547715 551116 553646 555165 556344 558028 560558
51053E60558L081L088K803K765L311M220M926N148N078M951M808M821N342O312
$$ 560558 563639 566727 569530 572295 575606 579826 584752 589900 594978 599929 604737 609558 614900 621212
51039F21212P045P072O813O805O707N812M246K786J550l3j863k875k601k017k240
$$ 621212 628257 635329 642142 648947 655654 661466 665712 668498 670048 670015 668152 665277 662676 660659 658419
51024F58419l098l726l949m240m690m864m435l414j939l79O66R87J133J642K274
$$ 658419 655321 651595 647646 643406 638716 633852 629417 626003 624064 623685 624351 625338 626471 628113 630387
51009F30387K594K874L622M574N053N096N365N924O101N609M939M473M040L603
$$ 630387 632981 635855 639477 644051 649104 654200 659565 665489 671590 677199 682138 686611 690651 694254
50995F94254L576M056M455M361M177M500N286O077O555O572O060N354N136N686
$$ 694254 697830 701886 706341 710702 714879 719379 724665 730742 737297 743869 749929 755283 760419 766105
50981G66105O566P415Q516J0054J1377J1823J1935J2907J4834J6423J6720J6395
$$ 766105 772671 780086 788602 798656 810033 821856 833791 846698 861532 877955 894675 911070
50969I11070J6790J8199J9764K0805K1561K2466K3290K3418K2792K2038K1692
$$ 911070 927860 946059 965823 986628 1008189 1030655 1053945 1077363 1100155 1122193 1143885
50958A143885K1595K1238K0414J9397J8635J8462J8838J9265J9033J7809J5845
$$ 1143885 1165480 1186718 1207132 1226529 1245164 1263626 1282464 1301729 1320762 1338571 1354416
50947A354416J3497J0803P792M989L167K661L167M064M625M148K456K44j588l043
$$ 1354416 1367913 1378716 1386508 1391497 1394664 1397325 1400492 1404556 1409181 1413329 1415785 1416029 1414441 1411398
50933A411398m984p889j1159j3899j5983j8008k0418k3014k5159k6329k6527k6328
$$ 1411398 1406414 1398525 1387366 1373467 1357484 1339476 1319058 1296044 1270885 1244556 1218029 1191701
50921A191701k6336k6605k6719k6426k5811k4838k3201k0936j8782j7516j7033
$$ 1191701 1165365 1138760 1112041 1085615 1059804 1034966 1011765 990829 972047 954531 937498
50910I37498j6482j5254j3535j1881j0579r536q611p883p478p229o665n475l964
$$ 937498 921016 905762 892227 880346 869767 860231 851620 843737 836259 829030 822365 816890 812926
50897H12926k825k432k440k157j321l72N2j20k55K43J139J587J127J39o87r26
$$ 812926 810101 807669 805229 803072 801751 801379 801431 801311 801056 801299 802438 804025 805152 805291 804604 803678
50881H03678l80R88K716L869L933L366K876K563K282K406L457N148O624P559Q348
$$ 803678 803298 804286 807002 810871 814804 818170 821046 823609 825891 828297 831754 836902 843526 851085 859433
50866H59433R250J0154J1081J2220J3387J4309J5531J8079K1944K5787K8564L0711
$$ 859433 868683 878837 889918 902138 915525 929834 945365 963444 985388 1011175 1039739 1070450
50854A070450L3253L6490M0113M3943M7846N1336N3937N5651N6656N6943N6619
$$ 1070450 1103703 1140193 1180306 1224249 1272095 1323431 1377368 1433019 1489675 1546618 1603237
50843A603237N6124N5567N4219N1248M6730M1543L6462L1818K7741K4238K1191
$$ 1603237 1659361 1714928 1769147 1820395 1867125 1908668 1945130 1976948 2004689 2028927 2050118
50832B050118J8613J6794J5995J6237J7543J9894K2702K4903K5947K6206K5926
$$ 2050118 2068731 2085525 2101520 2117757 2135300 2155194 2177896 2202799 2228746 2254952 2280878
50821B280878K4440K1090J6337J1143N623q38q287j5932k3121k9844l6164m1764
$$ 2280878 2305318 2326408 2342745 2353888 2359511 2358673 2350386 2334454 2311333 2281489 2245325 2203561
50809B203561m6257m9543n1808n3342n4286n4267n2629m9407m5668m2439l9582
$$ 2203561 2157304 2107761 2055953 2002611 1948325 1894058 1841429 1792022 1746354 1703915 1664333
50798A664333l6324l2478k8417k4180j9555j4896j0923p610m242o25K475M448
$$ 1664333 1628009 1595531 1567114 1542934 1523379 1508483 1497560 1489950 1485708 1485083 1487558 1492006
50786A492006N602O584P634Q646R395R404Q174N831L129O10j755l971n692o860
$$ 1492006 1497608 1504192 1511826 1520472 1529867 1539271 1547445 1553276 1556405 1557015 1555260 1551289 1545597 1538737
50772A538737q149j0304j3289j6429j9086k1034k2425k3665k5051k6419k7301
$$ 1538737 1530588 1520284 1506995 1490566 1471480 1450446 1428021 1404356 1379305 1352886 1325585
50761A325585k7487k7085k6136k4566k2612k0704j8876j6851j4771j3201j2151
$$ 1325585 1298098 1271013 1244877 1220311 1197699 1176995 1158119 1141268 1126497 1113296 1101145
50750A101145j0813q681o338m627l492k210l98J746M028O536R399J2606J6039
$$ 1101145 1090332 1081651 1075313 1070686 1067194 1064984 1064586 1066332 1070360 1076896 1086295 1098901 1114940
50737A114940J9490K2777K5982K9293L2501L4987L6390L6975L7169L7082L6687
$$ 1114940 1134430 1157207 1183189 1212482 1244983 1279970 1316360 1353335 1390504 1427586 1464273
50726A464273L5946L4502L1762K7727K3253J9033J4846J0366O237L484K144J335
$$ 1464273 1500219 1534721 1566483 1594210 1617463 1636496 1651342 1661708 1667945 1671429 1673573 1674908
50714A674908O17N57J766M034O593Q857J0608J1863J2706J3140J2980J2122J0750
$$ 1674908 1675525 1676082 1677848 1681882 1688475 1697332 1707940 1719803 1732509 1745649 1758629 1770751 1781501
50701A781501R068O909L946K30l745p448j0509j2692j4036j4930j5594j5659j4744
$$ 1781501 1790569 1797478 1801424 1801654 1797909 1790461 1779952 1767260 1753224 1738294 1722700 1707041 1692297
50688A692297j3374j2680j3004j3417j2826j1199r320p623n666k671J572O486
$$ 1692297 1678923 1666243 1653239 1639822 1626996 1615797 1606477 1598854 1593188 1590517 1592089 1598575
50676A598575J1405J6412K2128K8467L4143L8000M0423M2634M4738M5490M4141
$$ 1598575 1609980 1626392 1648520 1676987 1711130 1749130 1789553 1832187 1876925 1922415 1966556
50665A966556M1501L8703L5897L2779K9566K6485K2899J8123J2732Q084M435O34
$$ 1966556 2008057 2046760 2082657 2115436 2145002 2171487 2194386 2212509 2225241 2233325 2237760 2238394
50653B238394m147r253j3578j6895j9611k1765k2955k3035k2214k0533j7772j3892
$$ 2238394 2234247 2224994 2211416 2194521 2174910 2153145 2130190 2107155 2084941 2064408 2046636 2032744
50641B032744r222m157J014N964J0393J4381J8398K2643K6503K8816K8675K5831
$$ 2032744 2023522 2019365 2020379 2026343 2036736 2051117 2069515 2092158 2118661 2147477 2176152 2201983
50629B201983K0404J2557K666q298j8786k7271l2893l5736l6645l6678l6460l5890
$$ 2201983 2222387 2234944 2237610 2229312 2210526 2183255 2150362 2114626 2077981 2041303 2004843 1968953
50617A968953l4597l2694l0807k9292k7645k4999k1170j6876j3033r998p520n156
$$ 1968953 1934356 1901662 1870855 1841563 1813918 1788919 1767749 1750873 1737840 1727842 1720322 1715166
50605A715166k739n02J196K332L207L751L141O08l483p860j1751j5439j9243k2559
$$ 1715166 1712427 1711925 1713121 1715453 1718660 1722411 1725552 1726160 1722677 1714817 1703066 1687627 1668384 1645825
50591A645825k4499k5091k5219k5517k5770k5449k4327k2511k0243j7868j5737
$$ 1645825 1621326 1596235 1571016 1545499 1519729 1494280 1469953 1447442 1427199 1409331 1393594
50580A393594j3954j2241j0213p868n799m854n254o101o027m578k561q95M06J722
$$ 1393594 1379640 1367399 1357186 1349318 1343519 1338665 1333411 1327310 1321283 1316705 1314144 1313249 1313655 1315377
50566A315377K852L312L381M026N769Q240J0968J3846J6696J9049K0849K2795
$$ 1315377 1318229 1321541 1324922 1328948 1334717 1342957 1353925 1367771 1384467 1403516 1424365 1447160
50554A447160K5481K8546L1102L2685L3460L3736L3685L3369L2723L1621L0207
$$ 1447160 1472641 1501187 1532289 1564974 1598434 1632170 1665855 1699224 1731947 1763568 1793775
50543A793775K8892K7878K6895K5646K4184K2649K1042J9641J9165K0000K1488
$$ 1793775 1822667 1850545 1877440 1903086 1927270 1949919 1970961 1990602 2009767 2029767 2051255
50532B051255K2554K2934K3363K4734K7483L1619L6740M2036M6814N1069N5154
$$ 2051255 2073809 2096743 2120106 2144840 2172323 2203942 2240682 2282718 2329532 2380601 2435755
50521B435755N8933O1687O2809O2097N9442N4795M8516M1191L2933K3430J2854
$$ 2435755 2494688 2556375 2619184 2681281 2740723 2795518 2844034 2885225 2918158 2941588 2954442
50510B954442K123q133j8281k8818l9197m8110n4863n9816o3507o5813o6292o4938
$$ 2954442 2956565 2948432 2930151 2901333 2862136 2814026 2759163 2699347 2635840 2570027 2503735 2438797
50498B438797o2210n8481n3794m8217m2097l5706k8848k1157j2787m487L103R924
$$ 2438797 2376587 2318106 2264312 2216095 2173998 2138292 2109444 2088287 2075500 2071013 2074116 2084040
50486B084040J6033K1006K4097K4815K3045J8772J2122L576o118j6256k6105l4841
$$ 2084040 2100073 2121079 2145176 2169991 2193036 2211808 2223930 2227506 2221388 2205132 2179027 2144186
50474B144186m1931m7554n2198n5855n8062n8700n8314n7534n6572n5341n3616
$$ 2144186 2102255 2054701 2002503 1946648 1888586 1829886 1771572 1714038 1657466 1602125 1548509
50463A548509n1080m7578m3507l9495l5721l1954k8293k5274k3071k1191j9206
$$ 1548509 1497429 1449851 1406344 1366849 1331128 1299174 1270881 1245607 1222536 1201345 1182139
50452A182139j7288j5669j4082j2215j0325q905p975p120o109n111m489m480m875
$$ 1182139 1164851 1149182 1135100 1122885 1112560 1103655 1095680 1088560 1082451 1077340 1072851 1068371 1063496
50439A063496m875l678j536L10J031J145J728L135N040P111R131J0771J1967J3231
$$ 1063496 1058621 1054943 1053407 1053717 1054748 1055893 1057621 1060756 1065796 1072907 1082038 1092809 1104776 1118007
50425A118007J4906J6513J7495J8323J9910K2139K4073K5580K7620L0588L3403
$$ 1118007 1132913 1149426 1166921 1185244 1205154 1227293 1251366 1276946 1304566 1335154 1368557
50414A368557L4891L5269L5660L6632L7935L9230M0377M1184M1376M0841L9605
$$ 1368557 1403448 1438717 1474377 1511009 1548944 1588174 1628551 1669735 1711111 1751952 1791557
50403A791557L7732L5355L2578K9143K4598J9060J3361Q032K527m017j1520j8994
$$ 1791557 1829289 1864644 1897222 1926365 1950963 1970023 1983384 1991416 1993943 1989926 1978406 1959412
50391A959412k5617l1310l6300m0647m4164m6456m7127m6292m4710m2952m0617
$$ 1959412 1933795 1902485 1866185 1825538 1781374 1734918 1687791 1641499 1596789 1553837 1513220
50380A513220l6936l2106k7314k3400k0044j6478j2491q394m485r59K024M572
$$ 1513220 1476284 1444178 1416864 1393464 1373420 1356942 1344451 1336057 1331572 1330613 1332637 1337209
50368A337209P077R596J1365J1339R236N737J728k413o718j1115j5195j8512k0994
$$ 1337209 1344286 1353882 1365247 1376586 1385822 1391559 1393287 1390874 1384156 1373041 1357846 1339334 1318340
50355A318340k2970k4710k6081k6812k6916k6631k6039k5145k4180k3427k2663
$$ 1318340 1295370 1270660 1244579 1217767 1190851 1164220 1138181 1113036 1088856 1065429 1042766
50344A042766k1349j9473j7687j6323j4900j3017j1178j0115r678r068p928o490
$$ 1042766 1021417 1001944 984257 967934 953034 940017 928839 918724 909046 899978 892050 885560
50332H85560m923l244j800j064q42m30K87N88J1r49j554j638j368p41J76R37J182
$$ 885560 880637 877393 875593 874529 873687 873257 873544 874132 874143 873194 871640 870002 868634 867893 868069 869006 870188
50315H70188J125J178J359J470J635K225L409N095P093R041J0468J1345J2254
$$ 870188 871313 872491 873850 875320 876955 879180 882589 887684 894777 903818 914286 925631 937885
50302I37885J3562J4719J4824J3657J1609Q898N631K549P44L41J80p47k085k820
$$ 937885 951447 966166 980990 994647 1006256 1015154 1020785 1023334 1024078 1024419 1024599 1023852 1021767 1018947
50288A018947k801k907l837n326o612p233p179o629n890n374n251n077m193k646
$$ 1018947 1016146 1013239 1009402 1004076 997464 990231 983052 976423 970533 965159 959908 954831 950638 947992
50274I47992j388j170j585j585q36O0O65J312K379L523M142M144L857L507L227
$$ 947992 946604 945434 943849 942264 941428 941488 942153 943465 945844 949367 953509 957653 961510 965017 968244
50259I68244L225L452L358K578J635J458K212L108L334K714J641O80J77j07q39
$$ 968244 971469 974921 978279 980857 982492 983950 986162 989270 992604 995318 996959 997639 997816 997709 996870
50244I96870k211l428l658l211l147l826m569m733m405l930l487l272l526m031
$$ 996870 994659 991231 987573 984362 981215 977389 972820 968087 963682 959752 956265 952993 949467 945436
50230I45436m200l823l306l030k914k776k541k016r99J24N42R4l80q1Q45J815
$$ 945436 941236 937413 934107 931077 928163 925387 922846 920830 919831 919955 920497 920591 920211 920130 920975 922790
50214I22790K674L689M979O416P728Q528Q526P999P603P494P023N538L062K5l143
$$ 922790 925464 929153 934132 940548 948276 956804 965330 973329 980932 988426 995449 1000987 1004049 1004074 1000931
50199A000931n865p508p995p892p532o683n407m556m707n226n101m313l663l532
$$ 1000931 995066 987558 979563 971671 964139 957456 952049 947493 942786 937560 932459 928146 924483 920951
50185I20951l549l295k669j708o27J44L15J02j81n09p88n13N22J605J818J156
$$ 920951 917402 914107 911438 909730 909103 909247 909562 909664 909483 908974 908186 907673 908195 909800 911618 912774
50169I12774L63rK49J396L375N344O435O877P621Q871R876J0113R823R238Q196
$$ 912774 913137 913128 913377 914773 918148 923492 929927 936804 944425 953296 963172 973285 983108 992346 1000542
50154A000542O711N224L953K585R73m63j290j576j639j643j558j171r8J729L655
$$ 1000542 1007253 1012477 1016430 1019015 1019988 1019525 1018235 1016659 1015020 1013377 1011819 1010648 1010550 1012279 1015934
50139A015934M929N687O713Q287R997J1735J4041J7190K0784K4515K8621L3149
$$ 1015934 1020863 1026550 1033263 1041550 1051547 1063282 1077323 1094513 1115297 1139812 1168433 1201582
50127A201582L7571M1602M5686N0119N4152N6634N7129N5938N3497N0319M7120
$$ 1201582 1239153 1280755 1326441 1376560 1430712 1487346 1544475 1600413 1653910 1704229 1751349
50116A751349M4396M2091M0090L8698L8098L7609L6066L2768K7607K0505J1295
$$ 1751349 1795745 1837836 1877926 1916624 1954722 1992331 2028397 2061165 2088772 2109277 2120572
50105B120572J82j2059k4298l5313m4127n0524n5070n8334o0238o0400n8733n5460
$$ 2120572 2120754 2108695 2084397 2049084 2004957 1954433 1899363 1841029 1780791 1720391 1661658 1606198
50093A606198n0961m6027m1796l8740l6028l2549k8321k4214k0615j7320j4705
$$ 1606198 1555237 1509210 1467414 1428674 1392646 1360097 1331776 1307562 1286947 1269627 1254922
50082A254922j3810j4789j6159j6359j5514j4953j5235j5450j4496j2482j0495
$$ 1254922 1241112 1226323 1210164 1193805 1178291 1163338 1148103 1132653 1118157 1105675 1095180
50071A095180r314q745q124p101n720m016j948K51K115L459M518N412N941O219
$$ 1095180 1085866 1077121 1068997 1061896 1056176 1052160 1050212 1050463 1052578 1056037 1060555 1065967 1071908 1078127
50057A078127P041Q879J0884J1659J1087J0551J1129J2291J2796J2312J1491J0874
$$ 1078127 1085168 1094047 1104931 1116590 1127677 1138228 1149357 1161648 1174444 1186756 1198247 1209121
50045A209121J0349R650Q825Q162P903Q155Q834R655J0441J1314J2455J3719J4801
$$ 1209121 1219470 1229120 1237945 1246107 1254010 1262165 1270999 1280654 1291095 1302409 1314864 1328583 1343384
50032A343384J5716J6811J8204J9515K0325K0625K0671K0552K0188J9687J9503
$$ 1343384 1359100 1375911 1394115 1413630 1433955 1454580 1475251 1495803 1515991 1535678 1555181
50021A555181K0170K1878K4302K6786K8823L0447L2162L4433L7394M1066M5663
$$ 1555181 1575351 1597229 1621531 1648317 1677140 1707587 1739749 1774182 1811576 1852642 1898305
50010A898305N1442N8212O5270P1798P7221Q1184Q3365Q3561Q1887P8915P5573
$$ 1898305 1949747 2007959 2073229 2145027 2222248 2303432 2386797 2470358 2552245 2631160 2706733
49999B706733P2877P1533P1595P2420P2960P2103O8915O2833N3760M1919K7708
$$ 2706733 2779610 2851143 2922738 2995158 3068118 3140221 3209136 3271969 3325729 3367648 3395356
49988C395356J1773m850k1008l5929m9299o0833p0066p6822q1594q5208q8156
$$ 3395356 3407129 3402279 3381271 3345342 3296043 3235210 3165144 3088322 3006728 2921520 2833364
49977B833364r0448r1890r2197r1027q8271q4449q0426p6713p3200o9626o6033
$$ 2833364 2742916 2651026 2558829 2467802 2379531 2295082 2214656 2137943 2064743 1995117 1929084
49966A929084o2624n9435n6378n3462n0740m8064m5105m1767l8440l5680l3587
$$ 1929084 1866460 1807025 1750647 1697185 1646445 1598381 1553276 1511509 1473069 1437389 1403802
49955A403802l1594k9035k5850k2596j9795j7581j5956j5037j4760j4593j3933
$$ 1403802 1372208 1343173 1317323 1294727 1274932 1257351 1241395 1226358 1211598 1197005 1183072
49944A183072j2728j1422j0348r413q345o945n124k985q63R25K503M196N921P111
$$ 1183072 1170344 1158922 1148574 1139161 1130816 1123871 1118747 1115762 1114899 1115824 1118327 1122523 1128444 1135555
49930A135555P456P387P492P723P578O967O376O045N390L680J071j482l385m954
$$ 1135555 1143011 1150398 1157890 1165613 1173191 1180158 1186534 1192579 1197969 1201649 1202720 1201238 1197853 1192899
49916A192899o519p535p212n904n032n465o564p199p057o443n356l603j698o53
$$ 1192899 1186380 1178845 1171633 1165729 1160697 1155232 1148668 1141469 1134412 1127969 1122613 1119010 1117312 1116659
49902A116659o31m98Q80L265N539P226R058J2036J6417K1816K7906L4579M1475
$$ 1116659 1116028 1115530 1116410 1119675 1125214 1132440 1141498 1153534 1169951 1191767 1219673 1254252 1295727
49889A295727M7904N3506N8707O4021O8954P2073P2329O9975O6083O1566N6837
$$ 1295727 1343631 1397137 1455844 1519865 1588819 1660892 1733221 1803196 1869279 1930845 1987682
49878A987682N2056M7350M3109M0047L8529L7566L5087K9699K1720J2154J244
$$ 1987682 2039738 2087088 2130197 2170244 2208773 2246339 2281426 2311125 2332845 2344999 2346243
49867B346243j1230k4826l8483n1321o2587p1132p6070p7944p8181p7346p4894
$$ 2346243 2335013 2310187 2271704 2220383 2157796 2086664 2010594 1932650 1854469 1777123 1702229
$$ [...]
##END NTUPLES=NMR SPECTRUM
##END=
