##TITLE=AC1682_2981_8571508_A8kTSi5g7l
##JCAMPDX= 6.0         $$ Bruker NMR JCAMP-DX V2.0
##DATA TYPE= NMR SPECTRUM
##DATA CLASS= NTUPLES
##ORIGIN= BRUKER
##OWNER= Administrator
$$ 1.72 TOPSPIN		Version 2.1
$$ 2014-04-10 19:25:10.823 -0700  Administrator@X
$$ Compression mode = diff/dup
##.OBSERVE FREQUENCY= 400.02188249412
##.OBSERVE NUCLEUS= ^1H
##.ACQUISITION MODE= SIMULTANEOUS (DQD)
##.ACQUISITION SCHEME= undefined
##.AVERAGES= 8
##.DIGITISER RES= 22
##SPECTROMETER/DATA SYSTEM= spect
##.PULSE SEQUENCE= zg30
##.SOLVENT NAME= COFFEE_meoh
##.SHIFT REFERENCE= INTERNAL, COFFEE_meoh, 1, 14.98509
##AUDIT TRAIL= $$ (NUMBER, WHEN, WHO, WHERE, PROCESS, VERSION, WHAT)
$$ ##TITLE= Audit trail, TOPSPIN		Version 2.1
$$ ##JCAMPDX= 5.01
$$ ##ORIGIN= Bruker BioSpin GmbH
$$ ##OWNER= Administrator
$$ $$ E:\/data/COFFEE/nmr/AC1682_2981_8571508_A8kTSi5g7l/10/pdata/1/auditp.txt
$$ ##AUDIT TRAIL=  $$ (NUMBER, WHEN, WHO, WHERE, PROCESS, VERSION, WHAT)
(   1,<2014-04-10 19:25:03.071 -0700>,<Administrator>,<X>,<go>,<TOPSPIN 2.1>,
      <created by zg
	started at 2014-04-10 19:23:57.328 -0700,
	POWCHK enabled, PULCHK disabled,
       configuration hash MD5:
       C8 4E 4E 5D D3 5C D8 9E 9F 52 82 E0 59 8A DE 15
       data hash MD5: 64K
       1F E6 C0 10 ED 6C 86 0D 6D A3 3F F0 31 0B F8 75>)
(   2,<2014-04-10 19:25:06.290 -0700>,<Administrator>,<X>,<proc1d>,<TOPSPIN 2.1>,
      <Start of raw data processing
       efp LB = 0 FT_mod = 6 PKNL = 1 PHC0 = 0 PHC1 = 0 SI = 32K 
       data hash MD5: 32K
       D5 0A 23 AF 5B 61 14 E5 E5 E7 E8 D9 9D 88 C1 26>)
(   3,<2014-04-10 19:25:06.680 -0700>,<Administrator>,<X>,<proc1d>,<TOPSPIN 2.1>,
      <pk PHC0 = 94.37256 PHC1 = 0 
       data hash MD5: 32K
       D5 0A 02 92 43 F1 7B 7F B0 30 29 48 E9 9C 0C 2E>)
(   4,<2014-04-10 19:25:06.884 -0700>,<Administrator>,<X>,<proc1d>,<TOPSPIN 2.1>,
      <abs ABSG = 1 
       data hash MD5: 32K
       DC 56 EF 8A 15 4C CE 0C 9C C3 42 CC EE 92 82 A6>)
(   5,<2014-04-10 19:25:07.118 -0700>,<Administrator>,<X>,<proc1d>,<TOPSPIN 2.1>,
      <abs ABSG = 2 
       data hash MD5: 32K
       F1 65 BA 85 DF D3 C0 54 05 9C 9D 47 29 12 2F 73>)
(   6,<2014-04-10 19:25:07.290 -0700>,<Administrator>,<X>,<proc1d>,<TOPSPIN 2.1>,
      <abs ABSG = 3 
       data hash MD5: 32K
       C8 6E D8 91 75 0D 4A 7A 6B F1 24 5F 8D 73 AA CD>)
(   7,<2014-04-10 19:25:07.446 -0700>,<Administrator>,<X>,<proc1d>,<TOPSPIN 2.1>,
      <abs ABSG = 4 
       data hash MD5: 32K
       1C B5 81 20 28 5C F1 B5 5F 2B AE 18 BF 66 F1 74>)
(   8,<2014-04-10 19:25:07.524 -0700>,<Administrator>,<X>,<proc1d>,<TOPSPIN 2.1>,
      <abs ABSG = 5 
       data hash MD5: 32K
       93 F8 75 64 30 7C F9 9E DB 16 9C DF 34 7A FA 7D>)
$$ ##END=
$$ 
$$ $$ hash MD5
$$ $$ F1 6D 96 5A 0C D7 3A 5F 03 27 C3 45 E7 02 B5 D8
##$RELAX= 
##$RELAX= 
##$RELAX= 
##$RELAX= 
##$RELAX= 
##$RELAX= 
##$RELAX= 
$$ Bruker specific parameters
$$ --------------------------
##$DU= <E:\>
##$EXPNO= 10
##$NAME= <AC1682_2981_8571508_A8kTSi5g7l>
##$PROCNO= 1
$$ [...]
150 150 150 150 150 150 150 150
##$TP07= 0
##$TPNAME0= <>
##$TPNAME1= <>
##$TPNAME2= <>
##$TPNAME3= <>
##$TPNAME4= <>
##$TPNAME5= <>
##$TPNAME6= <>
##$TPNAME7= <>
##$TPOAL= (0..7)
0.5 0.5 0.5 0.5 0.5 0.5 0.5 0.5
##$TPOFFS= (0..7)
0 0 0 0 0 0 0 0
##$TUNHIN= 0
##$TUNHOUT= 0
##$TUNXOUT= 0
##$USERA1= <user>
##$USERA2= <user>
##$USERA3= <user>
##$USERA4= <user>
##$USERA5= <user>
##$V9= 5
##$VALIST= <valist>
##$VCLIST= <CCCCCCCCCCCCCCC>
##$VD= 0
##$VDLIST= <DDDDDDDDDDDDDDD>
##$VPLIST= <PPPPPPPPPPPPPPP>
##$VTLIST= <TTTTTTTTTTTTTTT>
##$WBST= 1024
##$WBSW= 4
##$XGAIN= (0..3)
0 0 0 0
##$XL= 0
##$YL= 0
##$YMAX_a= 625536
##$YMIN_a= -516342
##$ZGOPTNS= <>
##$ZL1= 120
##$ZL2= 120
##$ZL3= 120
##$ZL4= 120
##$ABSF1= 14.98509
##$ABSF2= -5.573092
##$ABSG= 5
##$ABSL= 3
##$ALPHA= 0
##$AQORDER= 0
##$ASSFAC= 0
##$ASSFACI= 0
##$ASSFACX= 0
##$ASSWID= 0
##$AUNMP= <proc_prof1d_extract_pilot.lims>
##$AXLEFT= 0
##$AXNAME= <>
##$AXNUC= <1H>
##$AXRIGHT= 0
##$AXTYPE= 0
##$AXUNIT= <>
##$AZFE= 0.1
##$AZFW= 0.1
##$BCFW= 0
##$BC_mod= 0
##$BYTORDP= 0
##$COROFFS= 0
##$CY= 15
##$DATMOD= 1
##$DC= 0
##$DFILT= <>
##$DTYPP= 0
##$F1P= 0
##$F2P= 0
##$FCOR= 0.5
##$FTSIZE= 32768
##$FT_mod= 6
##$GAMMA= 0
##$GB= 0
##$INTBC= 1
##$INTSCL= 1
##$ISEN= 128
##$LB= 0
##$LEV0= 0
##$LPBIN= 0
##$MAXI= 10000
##$MC2= 0
##$MEAN= 0
##$ME_mod= 0
##$MI= 0
##$NCOEF= 0
##$NC_proc= -8
##$NLEV= 6
##$NOISF1= 0
##$NOISF2= 0
##$NSP= 0
##$NTH_PI= 0
##$NZP= 0
##$OFFSET= 14.98509
##$PC= 1
##$PHC0= 94.37256
##$PHC1= 0
##$PH_mod= 1
##$PKNL= yes
##$PPARMOD= 0
##$PPDIAG= 0
##$PPIPTYP= 0
##$PPMPNUM= 2147483647
##$PPRESOL= 1
##$PSCAL= 4
##$PSIGN= 0
##$PYNMP= <proc.py>
##$REVERSE= no
##$SF= 400.02
##$SI= 32768
##$SIGF1= 0
##$SIGF2= 0
##$SINO= 400
##$SIOLD= 32768
##$SPECTYP= <>
##$SREGLST= <1H.CDCl3>
##$SSB= 0
##$STSI= 32768
##$STSR= 0
##$SW_p= 8223.68421052631
##$SYMM= 0
##$S_DEV= 0
##$TDeff= 65536
##$TDoff= 0
##$TI= <>
##$TILT= no
##$TM1= 0
##$TM2= 0
##$TOPLEV= 0
##$USERP1= <user>
##$USERP2= <user>
##$USERP3= <user>
##$USERP4= <user>
##$USERP5= <user>
##$WDW= 1
##$XDIM= 32768
##$YMAX_p= 441102934
##$YMIN_p= -736420
##$CURPLOT= <Network HP LaserJet P1505>
##$CURPRIN= <$Network HP LaserJet P1505>
##$DFORMAT= <normdp>
##$LAYOUT= <+/1D_H.xwp>
##$LFORMAT= <normlp>
##$PFORMAT= <normpl>
##$SURQMSG= 1
$$ End of Bruker specific parameters
$$ ---------------------------------
##NTUPLES= NMR SPECTRUM
##VAR_NAME=  FREQUENCY,     SPECTRUM/REAL,   SPECTRUM/IMAG
##SYMBOL=    X,             R,               I
##VAR_TYPE=  INDEPENDENT,   DEPENDENT,       DEPENDENT
##VAR_FORM=  AFFN,          ASDF,            ASDF
##VAR_DIM=   32768,         32768,           32768
##UNITS=     HZ,            ARBITRARY UNITS, ARBITRARY UNITS
##FACTOR=    0.250966925370066, 1,           1
##FIRST=     8223.43324360094, 178999,       -147633
##LAST=      0,             -223627,         -24616
##MIN=       0,             -736420,         0
##MAX=       8223.43324360094, 441102934,    0
$$ Real data points
##PAGE= N=1
##DATA TABLE= (X++(R..R)), XYDATA
$$ [...]
19464B85841a07249k66662h4033C50130b27376A05476b10327G42a7168k94618
$$ 285841 -107249 -373911 -84033 350130 -227376 105476 -210327 742 -17168 -311786
19454c11786a6115l1330A17475f0520B25846C9029h1604I437Q9119c09318J23899
$$ -311786 -16115 -47445 117475 -60520 225846 39029 -81604 9437 98556 -309318 -185419
19443a85419p4846h52j25051I3890a50403j20304a02893B52937l0429h4013l7923
$$ -185419 -260265 -852 -125903 93890 -150403 -270707 -102893 252937 222508 -84013 -121936
19432a21936j22640G3633N2648J02334a59320D0140P8857a0346n9640B4785m730
$$ -121936 -244576 73633 126281 228615 -159320 40140 118997 -10346 -69986 24785 20055
19421B0055j223K48678N2336a59875r044B62849b8611j37454e9317E1872a64619
$$ 20055 18832 267510 319846 -159875 -168919 262849 -28611 -166065 -59317 51872 -164619
19409c01727F7645K39534G081A897P4750a16401q7171c3345P47B13602D5112b16911
$$ -301727 67645 307179 7081 1897 76647 -116401 -203572 -33345 -32598 213602 45112 -216911
19396G1333j5834a2798n4869j47278p1177d0163D479a73906J6865B2557J15808
$$ 71333 55499 -12798 -67667 -214945 -286122 -40163 4479 -173906 -157041 22557 138365
19385A38365g8116l39238a46498E4389i9732d9430j51356A9414a67160m5133F9164
$$ 138365 -78116 -417354 -146498 54389 -99732 -49430 -200786 19414 -167160 -212293 69164
19373d70145a64506G3955a88472k00207i3811a2576k57592E1620f0176B95184
$$ -470145 -164506 73955 -188472 -388679 -93811 -12576 -270168 51620 -60176 295184
19362A31888c45348a60231j49816e782m3272q8689G4461i5181G9802R9041a35293
$$ 131888 -345348 -160231 -310047 -5782 -49054 -137743 74461 -95181 79802 178843 -135293
19350h7144B09059a23698j3681E9764d19191g9695A21808a20779q4757K9130A43443
$$ -87144 209059 -123698 -137379 59764 -419191 -79695 121808 -120779 -205536 -176406 143443
19338h9250a7919P948r9283M1767k71412f4368m2351L3794D4571h2540A2406a87947
$$ -89250 -17919 -9971 -109254 -67487 -338899 -64368 -106719 -72925 44571 -82540 12406 -187947
19325A22448e2561d29k97957B450c54814a7587k57540R0434B1937a44623D5561
$$ 122448 -52561 -429 -298386 2450 -354814 -17587 -275127 -184693 21937 -144623 45561
19313a44097l46114J37234L0500a00266L1432J7996K820j03237f4286j78803F3966
$$ -144097 -490211 -352977 -322477 -100266 -68834 -50838 -48018 -151255 -64286 -243089 63966
19301b28028E5072b56824H2252j4114h0124l6627A52042M7914e5468j49947l2251
$$ -228028 55072 -256824 82252 68138 -80124 -116751 152042 199956 -55468 -205415 -237666
19290b37666A90448o6884b08528j23819c449j4357k8011F0579Q8131c4704C7093
$$ -237666 190448 123564 -208528 -332347 -3449 -17806 -45817 60579 148710 -34704 37093
19278f6037l5386j13727i4072m41728I7441a3403A02500A3588Q2607e7864l46241
$$ -66037 -101423 -215150 -94072 -535800 97441 -13403 102500 13588 96195 -57864 -404105
19267d04105a8705A6647f108k43622R8792A97541p8534a29989K6986B44921a41368
$$ -404105 -18705 16647 -6108 -249730 -150938 197541 119007 -129989 -103003 244921 -141368
19255A88891I3998M5591a86649j51953l314Q5415l8656g8248k53308I1130a1607
$$ 188891 93998 139589 -186649 -338602 -341916 -256501 -295157 -78248 -331556 91130 -11607
19243B2569a04679D1603a8845j04729B05012c89519E5676L820c45685G9437J390
$$ 22569 -104679 41603 -18845 -123574 205012 -389519 55676 59496 -345685 79437 80827
19232H0827a50303C9742K50061A02590a44964A19712J51464c8358l04735r6185
$$ 80827 -150303 39742 289803 102590 -144964 119712 271176 -38358 -343093 -439278
19222d39278A4766a43565j98198f0107B11774c59332A22495d2518A47362b48051
$$ -439278 14766 -143565 -341763 -60107 211774 -359332 122495 -42518 147362 -248051
19211D4853c912k97308E1947a8406C31428m0513i3544k77085Q5290g9085k04154
$$ 44853 -3912 -301220 51947 -18406 331428 290915 -93544 -370629 -285339 -79085 -283239
19200b83239b8599j62481N8071k8104G0989d10874A54486b7383A47005a2711A0437
$$ -283239 -28599 -191080 -133009 -161113 70989 -410874 154486 -27383 147005 -12711 10437
19188H7608n52a8239j41248c3902J6716j55185e0470N168j59100o2773F8220e01794
$$ 87608 87056 -18239 -159487 -33902 -17186 -172371 -50470 -45302 -204402 -267175 68220 -501794
19175A77675E6219K74749a68702r0752P439I8906a52039j10398C8049J46356b7942
$$ 177675 56219 330968 -168702 -259454 -252015 98906 -152039 -262437 38049 184405 -27942
19163a37418o3845B19414a40070j21959J11531e8222B14936c7778m3330n4318
$$ -137418 -201263 219414 -140070 -262029 -150498 -58222 214936 -37778 -81108 -135426
19153a35426q9978a09864L6333G4168O8204E7726b24093i4334A68518O8857A16466
$$ -135426 -225404 -109864 -73531 74168 142372 57726 -224093 -94334 168518 237375 116466
19141b269m47521d2082A2190K59245b95184e4690r8644B14089a35150F210L07916
$$ -2269 -449790 -42082 12190 271435 -295184 -54690 -153334 214089 -135150 6210 314126
19130C14126i0863q2505A85298o8334n5618a34522B5264a98905E52490c87402
$$ 314126 -90863 -173368 185298 116964 61346 -134522 25264 -198905 552490 -387402
19119F151a88878A65238l9298d7131B01222b56300A17708a40858j71829B8623
$$ 6151 -188878 165238 125940 -47131 201222 -256300 117708 -140858 -312687 28623
19108f5460j56500a2721r7070I4906J17674m1023B8762e2284B15554D5530a2247
$$ -65460 -221960 -12721 -109791 94906 212580 171557 28762 -52284 215554 45530 -12247
19096a98171M8991c2768k66862d7121B7879C086J9820g3711K5109l06417c2526
$$ -198171 -149180 -32768 -299630 -47121 27879 3086 22906 -73711 -48602 -355019 -32526
19084b38775f7119j2178j12860e9232o3460B88692b9356j27709A63679i4138B40970
$$ -238775 -67119 -79297 -192157 -59232 -122692 288692 -29356 -157065 163679 -94138 240970
19072f4140A50126a09714k2107j48926F2882Q904K98292A00123a66525k93445
$$ -64140 150126 -109714 -131821 -280747 62882 71786 370078 100123 -166525 -459970
19062d59970C5821J38820F2754a38978k8587F0923f235E220b08014A10788g8126
$$ -459970 35821 174641 62754 -138978 -167565 60923 -6235 5220 -208014 110788 -78126
19050G7272l4257i9033k45344c9501p78A47557b93346j29844c1218A32982D3147
$$ 77272 43015 -99033 -344377 -39501 -40279 147557 -293346 -423190 -31218 132982 43147
19038a60760A39904b44158F1710M5943a07936j31996l2018A67322l2601D1704
$$ -160760 139904 -244158 61710 107653 -107936 -239932 -271950 167322 134721 41704
19027b18072D10571A03395a78897m2989K5778c2565n54928h5917q0009j87896
$$ -218072 410571 103395 -178897 -221886 -196108 -32565 -587493 -85917 -165926 -353822
19017c53822G2998a00591d0228A80519m8694a85258D2369L2043c96262C3243f8148
$$ -353822 72998 -100591 -40228 180519 131825 -185258 42369 74412 -396262 33243 -68148
19005b12248j17246e4280j31581A20978g9812C7334J06071A1580O52a3073D5307
$$ -212248 -329494 -54280 -185861 120978 -79812 37334 143405 11580 12232 -13073 45307
18993a20303C9664L9284c3354k0750B32768F8792d75510g9180A16503a37449f3918
$$ -120303 39664 78948 -33354 -54104 232768 68792 -475510 -79180 116503 -137449 -63918
18981A8813d2743D152a29927k08650A02980D1021b41672D4155M3060k9761a45568
$$ 18813 -42743 4152 -129927 -338577 102980 41021 -241672 44155 87215 57454 -145568
18969C73786C6822b86795f8660j59181E9556a45640J6563e6917j6919B99051d93095
$$ 373786 36822 -286795 -68660 -227841 59556 -145640 -129077 -56917 -73836 299051 -493095
18957c86524C2062P243b13822Q1712I935g1282j01498E8791b5382j6621A5214
$$ -386524 32062 39305 -213822 -132110 9935 -71282 -172780 58791 -25382 -42003 15214
18945c70366B9868I096a09649j18126A9446K84215a89400A15922C8997A5254a04186
$$ -370366 29868 9096 -109649 -227775 19446 303661 -189400 115922 38997 15254 -104186
18933a13030A22204a77509Q2426k1106D7068J35371i6389k39751B25001a27497
$$ -113030 122204 -177509 -95083 -116189 47068 182439 -96389 -336140 225001 -127497
18922h3151p7976C1982b84409g6888A27929a53304O9442K7817J8144j11928B07078
$$ -83151 -161127 31982 -284409 -76888 127929 -153304 -83862 -56045 -37901 -149829 207078
18910A93826h4565A12719b17392k27490J97507Q7550G4488a52502q0283J13685
$$ 193826 -84565 112719 -217392 -444882 -247375 -159825 74488 -152502 -232785 -119100
18900a19100j72759D9997J114c9046m33115h3735G2905c6823E2858j2696a12054
$$ -119100 -291859 49997 51111 -39046 -472161 -83735 72905 -36823 52858 40162 -112054
18888C41277d220A6831c05177N5728D5929a16228E991f843A03637b27909J09758
$$ 341277 -4220 16831 -305177 -249449 45929 -116228 5991 -6843 103637 -227909 -118151
18877a18151e0342j22529f6591A44538o6486J9454c6906k32894b3668q1753K7912
$$ -118151 -50342 -172871 -66591 144538 78052 97506 -36906 -269800 -23668 -105421 -77509
18866g7509A04953J62645B9254A1552J06136b5152m9117B24526b67561A00814
$$ -77509 104953 267598 29254 11552 117688 -25152 -74269 224526 -267561 100814
18855d10791C35619A47297b22328O3631A8886l442b18010M9476a0383A44886g580
$$ -410791 335619 147297 -222328 -158697 18886 15444 -218010 -168534 -10383 144886 -7580
18843b17571k11183G6112H32c33526G0412b96017E294J43936h4823I4267a0244
$$ -217571 -428754 76112 832 -333526 70412 -296017 5294 149230 -84823 94267 -10244
18831c10845Q0207g1925o9511B2541a33482g362I7431h5523L9089l8899r8890
$$ -310845 -230638 -71925 -141436 22541 -133482 -7362 97431 -85523 -46434 -85333 -184223
18820a84223B05921o6742g1469j9767L0296A25812a0867A39198a34164A01537
$$ -184223 205921 139179 -71469 -91236 -60940 125812 -10867 139198 -134164 101537
18809a18554D8616b27290d0597k4288n3857j13966a07183l86217a51495i986l13857
$$ -118554 48616 -227290 -40597 -64885 -118742 -232708 -107183 -493400 -151495 -9986 -323843
18798c23843d7321k57406A23324k9312b17871n3538l1177C7017j3379g4478A06558
$$ -323843 -47321 -304727 123324 94012 -217871 -271409 -302586 37017 23638 -74478 106558
18786F9443K355Q34i3855J028L8280A53946b4829B44694b51055f6363g825m33197
$$ 69443 71798 72632 -93855 -92827 -54547 153946 -24829 244694 -251055 -66363 -7825 -441022
18774d41022B06698b37874C03918a97479K5181O4467B37411a35748K818a7244
$$ -441022 206698 -237874 303918 -197479 -172298 -107831 237411 -135748 -132930 -17244
18763d21361g8026l13083A56382b44639j04680A82160E341a3054H3884m018h6662
$$ -421361 -78026 -391109 156382 -244639 -349319 182160 5341 -13054 83884 79866 -86662
18751h9482C1939b29759O0219E2891b33671K7570R2459p5092A7560J80080a39106
$$ -89482 31939 -229759 -169540 52891 -233671 -206101 -113642 -188734 17560 197640 -139106
18739b11022D4817a26543A62392j5753o8077J24255b09619j12613e889m5268E8272
$$ -211022 44817 -126543 162392 146639 78562 202817 -209619 -322232 -5889 -51157 58272
18727c86688J24679R8102B38452H4052b5353j21902m271e4044C7228j3253g4375
$$ -386688 -262009 -163907 238452 84052 -25353 -147255 -151526 -54044 37228 23975 -74375
18715c22768J55882o6462A39771n4325J1116b24298d3759j40397k0048p2192G9631
$$ -322768 -166886 -233348 139771 85446 96562 -224298 -43759 -184156 -204204 -276396 79631
18703E9318b08681A12674g9960j12508l5233G0869B7631b06589h7544b9985k08877
$$ 59318 -208681 112674 -79960 -192468 -227701 70869 27631 -206589 -87544 -29985 -238862
18692b38862M5791f9676A28945c8044l06371a56892A83849j7613a94412c6731
$$ -238862 -193071 -69676 128945 -38044 -344415 -156892 183849 166236 -194412 -36731
18681b53873g9663E6811a92820a5162I3617b20744e8378k08365g2422A28637a75800
$$ -253873 -79663 56811 -192820 -15162 93617 -220744 -58378 -266743 -72422 128637 -175800
18669a47233j31060j1994f33k53703a05095l4968f1440p284A56106C4319g2476
$$ -147233 -278293 -290287 -633 -254336 -105095 -140063 -61440 -68724 156106 34319 -72476
18657b86647a13446j05639E5899K18593A01595a23780F3211e0085D6295b54767
$$ -286647 -113446 -219085 55899 274492 101595 -123780 63211 -50085 46295 -254767
18646A32565F1998a56405h869n783A96830q5935Q4836a105B7894a7827j64669
$$ 132565 61998 -156405 -8869 -14652 196830 110895 195731 -1105 27894 -17827 -182496
18635a82496r8820a12259C82931j15296e2097j03567a4369k61723b9493n8249
$$ -182496 -281316 -112259 382931 267635 -52097 -155664 -14369 -276092 -29493 -87742
18625h7742K1027j47845B24471j07319a76785o745I1947b00866B66384b93278
$$ -87742 -66715 -214560 224471 117152 -176785 -183530 91947 -200866 266384 -293278
18614a72821E0956e3156k0104D26335a0527j2830q0429B00886g4565l75171K04193
$$ -172821 50956 -53156 -73260 426335 -10527 -23357 -103786 200886 -74565 -449736 -245543
18603b45543a13728R398B0219a8120j90759B68724a46331j37455C68711j51696
$$ -245543 -113728 -104330 20219 -18120 -208879 268724 -146331 -283786 368711 217015
18593B17015p3321L8285j3998d42595c6428A07766K55223A37905b81234k0164
$$ 217015 143694 181979 167981 -442595 -36428 107766 362989 137905 -281234 -301398
18583c01398C5035d058j35769j75734o8899E8149f7488A90283a4819E6720a35644
$$ -301398 35035 -4058 -139827 -315561 -384460 58149 -67488 190283 -14819 56720 -135644
18571d3502n49k52326k57628a4836A70603g712B7782H373J50234a40176k32404
$$ -43502 -44051 -296377 -554005 -14836 170603 -7712 27782 8373 158607 -140176 -372580
18560c72580a25690l0609A75740q5540b22798q1797Q1209J03951F8670A9301c7350
$$ -372580 -125690 -156299 175740 90200 -222798 -304595 -223386 -119435 68670 19301 -37350
18548b942j83779a1069j33286j91355f6114o3263H6081c18493M9033J01711j71710
$$ -2942 -186721 -11069 -144355 -335710 -66114 -129377 86081 -318493 -269460 -167749 -339459
18537c39459J51430A7967b24632Q6569L6831n4026K2318N8932a0722j3202k09965
$$ -339459 -188029 17967 -224632 -138063 -101232 -155258 -132940 -74008 -10722 -23924 -233889
18526b33889A44293K60221b25977O9991K3608L4327c5897l65335a41640A16063
$$ -233889 144293 404514 -225977 -155986 -132378 -98051 -35897 -401232 -141640 116063
18515b19013r4155J6324A46446b15590L652B1268J0835O7149c3467p453l10447
$$ -219013 -313168 -296844 146446 -215590 -211938 21268 32103 99252 -33467 -40920 -351367
18504c51367F067a17321N583p0848P9869M983j26467e3971A10127R7453D6603
$$ -351367 6067 -117321 -111738 -182586 -102717 -97734 -224201 -53971 110127 207580 46603
18492E176b84554a27610b930k74375B2878b45019a20084m30802d2161h426k00073
$$ 5176 -284554 -127610 -2930 -277305 22878 -245019 -120084 -550886 -42161 -8426 -208499
18481b08499d2618A88043H9803i5014r9091A12278a74919F4683L4778O6494g7084
$$ -208499 -42618 188043 89803 -95014 -194105 112278 -174919 64683 99461 165955 -77084
18469D745e6956A99809c01535D5776e2214E5378K16412J94679b17473G5366d3098
$$ 4745 -56956 199809 -301535 45776 -52214 55378 271790 466469 -217473 75366 -43098
18457C4809J407J76918d5999m4681K0086l15782a32757A42802l5783b66989A2838
$$ 34809 36216 213134 -45999 -90680 -70594 -386376 -132757 142802 107019 -266989 12838
18445A76761c37511D14514d53531A74324a17072H6083a8276I5223i0476a3667
$$ 176761 -337511 414514 -453531 174324 -117072 86083 -18276 95223 -90476 -13667
18434A11336d8495A34026i154E6337B1023a33426C67569d43237a81793A31486
$$ 111336 -48495 134026 -9154 56337 21023 -133426 367569 -443237 -181793 131486
18423b67073A27629d23920a39598I3854O4331J85444b59468f2459j06309B75292
$$ -267073 127629 -423920 -139598 93854 158185 343629 -259468 -62459 -168768 275292
18412I6907R9078d5621c310o1016j25304P2323A84313F1843J64988c8331G4258
$$ 96907 195985 -45621 -3310 -64326 -189630 -117307 184313 61843 226831 -38331 74258
18400a47986j5720L1588k26926A23422q071k1164a15093Q864E4776c4134k86108
$$ -147986 -163706 -132118 -359044 123422 115351 94187 -115093 -106229 54776 -34134 -320242
18389c20242a11156c7062F1453c9061A77715a25800M4885j8316k01962j08296
$$ -320242 -111156 -37062 61453 -39061 177715 -125800 -80915 -99231 -301193 -409489
18379d09489J99248C244P5629A9645c63177A52591k7672J58535b0901A0582O7004
$$ -409489 -210241 3244 78873 19645 -363177 152591 124919 283454 -20901 10582 77586
18368G7586J83072f0685B37670B8185e0457A17425m9404a62983A41932F7079a66330
$$ 77586 260658 -60685 237670 28185 -50457 117425 68021 -162983 141932 67079 -166330
18356C219K2185d3065A22267b24491b4936J019I5023A4351J55027g7219C16837
$$ 3219 25404 -43065 122267 -224491 -24936 -23917 95023 14351 169378 -77219 316837
18344E7866a45617M5631c2213k1086A61774F4262K00061A25606N7129b21055J006
$$ 57866 -145617 -99986 -32213 -53299 161774 64262 264323 125606 182735 -221055 -220049
18333b20049M5864j1734A90260B4663b55418P276K492B10387k0764f5095k04164
$$ -220049 -174185 -185919 190260 24663 -255418 -248142 -245650 210387 189623 -65095 -269259
18322b69259A14580c18979I8600a88968B79280A6233M9805J30815c0440B46361
$$ -269259 114580 -318979 98600 -188968 279280 16233 66038 196853 -30440 246361
18311a88759B46487C6943J8243K16372B7932O6658i084j77446a5804H3819L7215
$$ -188759 246487 36943 55186 271558 27932 94590 -9084 -186530 -15804 83819 121034
18300A21034E2619h0388a9789o0965n0128b2878l08235l4472g6916Q895B31114
$$ 121034 52619 -80388 -19789 -80754 -130882 -22878 -331113 -365585 -76916 -68021 231114
18288F6523a67738g8118o7041l7283A51865b8900B74264B1553M39388a96607A85616
$$ 66523 -167738 -78118 -145159 -182442 151865 -28900 274264 21553 460941 -196607 185616
18276A6180L594a38499F3141J7842D377Q9078B5572Q1075N6385q0337A209a00295
$$ 16180 19774 -138499 63141 80983 4377 93455 25572 106647 163032 82695 1209 -100295
18263b26680E620b2329m2268A6327i3585a75q7089B40956H3406J08764a23364
$$ -226680 5620 -22329 -64597 16327 -93585 -175 -87264 240956 83406 192170 -123364
18251i1416j11662D71999F0490J5173a19535K782C1065a09229A04703e8324p4885
$$ -91416 -203078 471999 60490 75663 -119535 -116753 31065 -109229 104703 -58324 -133209
18240a33209k0298A52556J658m9887b153j31338A5834g2821j56027f0030b9088
$$ -133209 -153507 152556 154214 104327 -2153 -133491 15834 -72821 -228848 -60030 -29088
18228C74536e9351A608J58001h9566a036r231C7006J31578C5589L7247K11027
$$ 374536 -59351 1608 159609 -89566 -1036 -10267 37006 168584 35589 72836 283863
18217B83863A13424a22392m6985C34412A27324h9822C64791A26646a40458C5769
$$ 283863 113424 -122392 -169377 334412 127324 -89822 364791 126646 -140458 35769
18206C0754q179a63883A99047K9195b00356k30270A58089p0140Q6313G7449J84978
$$ 30754 22575 -163883 199047 228242 -200356 -430626 158089 87949 174262 77449 262427
18195B62427a34336a8171j6805C19397a20883E796K32468f8903J1120j35478f8232
$$ 262427 -134336 -18171 -34976 319397 -120883 5796 238264 -68903 -57783 -193261 -68232
18183g0358H5501a02549o4753j08835e0835K3404j26663e7992o2563b8629o8407
$$ -70358 85501 -102549 -167302 -276137 -50835 -27431 -154094 -57992 -120555 -28629 -97036
18172i7036A50975h3507B21357q2333b67494a7174H3558b5030j9830O936N969
$$ -97036 150975 -83507 221357 139024 -267494 -17174 83558 -25030 -44860 -37924 -31955
18161c1955A21563d87101g3284j83403B22951C7830j6891M5823K97109A0672L3854
$$ -31955 121563 -487101 -73284 -256687 222951 37830 20939 66762 363871 10672 44526
18150D4526Q5994N3338C9403j4904g3239D8924c37244b651C2441A683J57850R0906
$$ 44526 130520 183858 39403 24499 -73239 48924 -337244 -2651 32441 1683 159533 250439
18138B50439a93356G0736a43816B29774F7211e2419E2528Q6376a68849I7677A4954
$$ 250439 -193356 70736 -143816 229774 67211 -52419 52528 138904 -168849 97677 14954
18126G884J9144Q8425b27422d6000r0746B68167A7206K3708J22791F8246i8815
$$ 7884 27028 115453 -227422 -46000 -136746 268167 17206 40914 163705 68246 -98815
18114g4820m1741E9709P4521b35405e1059C8692K13348A00627J02901a47940O2803
$$ -74820 -116561 59709 134230 -235405 -51059 38692 252040 100627 203528 -147940 -85137
18103h5137j21298j5253C38508F2415A5624J99548l835K05468a97919f3485B48327
$$ -85137 -206435 -221688 338508 62415 15624 215172 211337 416805 -197919 -63485 248327
18091A5629a01698L5238A41798E3140M3320R8743B0786J92456a27343e3846F0605
$$ 15629 -101698 -66460 141798 53140 96460 195203 20786 213242 -127343 -53846 60605
18079f8809B9433d7225H8841P4123k4432a79061h8358B53451j18240l8485N6228
$$ -68809 29433 -47225 88841 162964 138532 -179061 -88358 253451 135211 96726 152954
18068A52954f0410A84029H2492a4741n7623k5800A70111a26131A1610c42741g3953
$$ 152954 -60410 184029 82492 -14741 -72364 -98164 170111 -126131 11610 -342741 -73953
18056d3644B09716q6428J03983I2287N344F000J72520b6844D17303b10548C60325
$$ -43644 209716 123288 227271 92287 97631 6000 178520 -26844 417303 -210548 360325
18044C90758H6298b56437F1899B3804J27753a01595a0417A58035n0097P516B6540
$$ 390758 86298 -256437 61899 23804 151557 -101595 -10417 158035 107938 115454 26540
18032D7488q904M5999b27337L4410I513f0510C8973L32350F3353P4633O7156a72633
$$ 47488 38584 84583 -227337 -192927 9513 -60510 38973 371323 63353 137986 205142 -172633
18019a31925d4558B16013b15278A02986f6834m4595k1686B18716a56472B98689
$$ -131925 -44558 216013 -215278 102986 -66834 -111429 -133115 218716 -156472 298689
18008b19351E8545J60609G1649L60926F6584c3607H9173M5122p833M3649a39971
$$ -219351 58545 219154 71649 432575 66584 -33607 89173 134295 126462 170111 -139971
17996c7751B67900D6171J87562f2977E07i6877d4321G085B749M89281A12331J18443
$$ -37751 267900 46171 233733 -62977 507 -96877 -44321 7085 2749 492030 112331 230774
17984B30774b12385N7789B02838N6894A11758K16684A08692J54751K9184O170
$$ 230774 -212385 -154596 202838 259732 111758 328442 108692 263443 292627 298797
17974B98797q1088L1839H2652M9489l5711a72656B73435j20890M6421O966H2935
$$ 298797 217709 249548 82652 132141 96430 -172656 273435 152545 198966 205932 82935
17962B11289A308a51768B52289Q7542A59677D5421J08644b7174J1542H5424h8650
$$ 211289 1308 -151768 252289 339831 159677 45421 154065 -27174 -15632 85424 -88650
17950e3407J8816D7632J37746q8600J18058f6235E2439J8520J17655r3257j4399
$$ -53407 -34591 47632 185378 96778 214836 -66235 52439 70959 188614 95357 80958
17939H0958a06808K3854A44074b36448D18101j78727F7672J13631J30654A34275
$$ 80958 -106808 -82954 144074 -236448 418101 239374 67672 181303 311957 134275
17928B42839a31331A20956O1692a9116A45231h323k23188A44495C6334j3918L30728
$$ 242839 -131331 120956 182648 -19116 145231 -8323 -231511 144495 36334 22416 353144
17917C53144C0055a6712G8280K23204I4404a14916B68641I8588K65889a4720C18147
$$ 353144 30055 -16712 78280 301484 94404 -114916 268641 98588 364477 -14720 318147
17905b3273C39522G0g9566D78938B31153a37537A44332b92760C58982j31953I1263
$$ -23273 339522 70 -79566 478938 231153 -137537 144332 -292760 358982 227029 91263
17893c3101C98801j44987a40248B23785D147J76106D7181J19946J05929b45812
$$ -33101 398801 253814 -140248 223785 4147 180253 47181 167127 273056 -245812
17882C78392I225a30785o5266D17630G2467K673k4957a3510B2824d3931A85757
$$ 378392 9225 -130785 -196051 417630 72467 75140 50183 -13510 22824 -43931 185757
17870A47866L5269a33331D72558E5458f6746k310A57504G6065N7412b05B68104
$$ 147866 183135 -133331 472558 55458 -66746 -69056 157504 76065 133477 -205 268104
17858a50998m3094B36650h4928B47560j18612c392E3644K53210n552J0296A30618
$$ -150998 -194092 236650 -84928 247560 128948 -3392 53644 306854 301302 311598 130618
17846g9785C01994F0986J36954q1348e1039A70097f1365A04464J14721a657o0867
$$ -79785 301994 60986 197940 116592 -51039 170097 -61365 104464 219185 -1657 -62524
17835f2524A14176N6244a727A11316c19870B36292f7063A08278J06636C2632J9018
$$ -62524 114176 170420 -1727 111316 -319870 236292 -67063 108278 214914 32632 51650
17824E1650g1666B34838e0861A17027m171J6155a16100A74509b7715j94413H8885
$$ 51650 -71666 234838 -50861 117027 112856 129011 -116100 174509 -27715 -222128 88885
17812c0603D9518J91427c7897I1744a42359A84489c3745D4622e3475B15268G4403
$$ -30603 49518 240945 -37897 91744 -142359 184489 -33745 44622 -53475 215268 74403
17800A18370J06945a25234M8162D67145E9418J44153M9838A07296J6617D3989
$$ 118370 225315 -125234 -77072 467145 59418 203571 253409 107296 123913 43989
17789e0915A38066l548d7655j16728A59741J009m7786L10483a74850A42628l8885
$$ -50915 138066 134518 -47655 -164383 159741 160750 112964 423447 -174850 142628 103743
17778A03743l5788L922l2057J543h5738A44952L9605h2316D03558j26244f7820
$$ 103743 67955 71877 39820 41363 -85738 144952 184557 -82316 403558 277314 -67820
17766F57305k89967F4958L95012B27237l1143a15436N0908j290C63568A24251
$$ 657305 367338 64958 459970 227237 196094 -115436 -64528 -65818 363568 124251
17755A46917K83188M8064B25952g8243l0051a8079C17499a2708A85740j3260b21034
$$ 146917 430105 478169 225952 -78243 -108294 -18079 317499 -12708 185740 172480 -221034
17743G05553H3226a03422L3824E52535d4154A20269O5545E8014a8391B97550B8255
$$ 705553 83226 -103422 -69598 552535 -44154 120269 185814 58014 -18391 297550 28255
17731A48313Q0536K10585j68382J68939H4470K80309A24274J15676N4819J17218
$$ 148313 228849 439434 271052 439991 84470 364779 124274 239950 294769 411987
17721D11987j74282C7665J58362a02896F6718J42150a6924A65517D6743a57753
$$ 411987 237705 37665 196027 -102896 66718 208868 -16924 165517 46743 -157753
17710a77947c714l40387C63700a03116j85762A38509J02538O1959B3291a88797
$$ -177947 -3714 -344101 363700 -103116 -288878 138509 241047 303006 23291 -188797
17699E6470b9510B46795h212B56793d0585A73295I323i9607B3477J44973J2303
$$ 56470 -29510 246795 -8212 256793 -40585 173295 9323 -99607 23477 168450 180753
17688A80753J04211E3262P0332n6019K95408R9412C0897O37015A70248a58990
$$ 180753 284964 53262 123594 67575 362983 462395 30897 667912 170248 -158990
17677I5021O478J07190r4346N5918b7028B39444j00634g4898K5746C26268O4391
$$ 95021 101499 208689 114343 170261 -27028 239444 138810 -74898 -49152 326268 390659
17666C90659a09852C63551j08668a55994a6958C9725J82361B8158Q2193C6969
$$ 390659 -109852 363551 254883 -155994 -16958 39725 222086 28158 110351 36969
17655B24873j07524M9143K70411j79608G2056L6196K34071P7115j59079A20497
$$ 224873 117349 166492 436903 257295 72056 108252 342323 419438 260359 120497
17644C43113A8190b12121D25779k07778a08259H3726J12470r0856D4000J64831
$$ 343113 18190 -212121 425779 218001 -108259 83726 196196 105340 44000 208831
17634B08831J5109L0050q3803M13070A50015K05127j13269H4058k4966i578A18342
$$ 208831 223940 253990 170187 583257 150015 355142 241873 84058 59092 -9578 118342
17622i7139c6768G1078K38938a1819I9216l7201c0561I7976k5302K39225q4739
$$ -97139 -36768 71078 310016 -11819 99216 62015 -30561 97976 72674 311899 227160
17611B27160J25263m0919l6426J11816F3346a32651C05151i4228B7415N8232J59682
$$ 227160 352423 311504 275078 386894 63346 -132651 305151 -94228 27415 85647 245329
17600B45329n101H9702K05123A43274O6458C4738i2269c6578D68860j86570c4086
$$ 245329 240228 89702 294825 143274 209732 34738 -92269 -36578 468860 282290 -34086
17588F2616b2905A0773L109c9172E4195a32125A59535B973R5713J58370k733p6457
$$ 62616 -22905 10773 13882 -39172 54195 -132125 159535 2973 98686 257056 254323 177866
17576A77866a87211B23346d6639B59534F2457f6730A86749C3334K42883B6408
$$ 177866 -187211 223346 -46639 259534 62457 -66730 186749 33334 276217 26408
17565h9882A70658n0462J44512Q2950h1345D44710j4102F8510q423b86995H6582
$$ -89882 170658 120196 264708 347658 -81345 444710 430608 68510 60087 -286995 86582
17553A11767L9099b5348A06422a193B65192h6376H9841M9525m7456J06984Q50
$$ 111767 150866 -25348 106422 -1193 265192 -86376 89841 139366 91910 198894 199744
17542A99744L656J58305A16878h2112C60805d9686j55922A50098L5379N7930I9029
$$ 199744 203400 361705 116878 -82112 360805 -49686 -205608 150098 185477 243407 99029
17530D8035J95840g8346k7496A54282Q0067a00590C8620L42846j7908p7805j36942
$$ 48035 243875 -78346 -105842 154282 234349 -100590 38620 381466 363558 285753 148811
17519A48811L21820j97265K4350Q8398j08094R9176r6242J16879d0589E84587
$$ 148811 470631 273366 297716 386114 278020 377196 280954 397833 -40589 584587
17508D22151G843M08886A99865o2001P6454q0352L09634o4990A35777j3311k6563
$$ 422151 7843 416729 199865 137864 214318 133966 443600 378610 135777 122466 95903
17497I5903J2178J21235J76182A70607K04427g9863A19313L04888o8819A16491
$$ 95903 108081 229316 405498 170607 375034 -79863 119313 424201 355382 116491
17486H1265J9093R0569b23689D02963A57673B5336N65325j61306m9547h8859B54948
$$ 81265 100358 190927 -223689 402963 157673 25336 590661 429355 379808 -88859 254948
17474B3588O88210C21500j5101i9673C18542o5107J17728A48332K53643A68316
$$ 23588 711798 321500 306399 -99673 318542 253435 371163 148332 401975 168316
17463B10437m415J02446I6830a23086G31061C50340j72427j333j6158J90271Q5971
$$ 210437 206022 308468 96830 -123086 731061 350340 177913 176580 160422 350693 436664
17452D36664B0504J95078N7395J59955J46606A79984J62867j64420K90322j56418
$$ 436664 20504 215582 272977 432932 579538 179984 342851 178431 468753 312335
17442C12335j16949L1727P3506N7161K06732k58599K7197M59823B42731J24704
$$ 312335 195386 227113 300619 357780 564512 305913 333110 792933 242731 367435
17432C67435J40978n5183n3005K4298Q4483j71487J4732J00535a72124C49034
$$ 367435 508413 453230 400225 424523 509006 337519 352251 452786 -172124 349034
17421A5288K71465J96238j4540K2144j46429q5976p3447R8279J85369B23781M52179
$$ 15288 286753 482991 468451 490595 344166 258190 184743 283022 468391 223781 675960
17410F75960j03146k52306p0054c5003C23041J4443l1500j18476o9603O2416J07706
$$ 675960 572814 320508 250454 -35003 323041 337484 305984 187508 117905 180321 288027
17399B88027j22396K31919D8658J46888K05996p4909j23099Q1820f7474C17912
$$ 288027 165631 397550 48658 195546 401542 326633 203534 285354 -67474 317912
17388B51309C9085J4311L08721a30C44849e1347A58788K72556A58933J8464K25681
$$ 251309 39085 53396 362117 -130 344849 -51347 158788 431344 158933 177397 403078
17377D03078c06586C81351A85837K98090n7517A56741P8341J53294A56269J53057
$$ 403078 -306586 381351 185837 483927 426410 156741 235082 388376 156269 309326
17367C09326O1449P4065A42737N2830J09504j00705N03523B5102K98472n7320
$$ 309326 370775 444840 142737 195567 305071 204366 707889 25102 323574 266254
17357B66254C5502K95590j34638J21309r2855L01629I9642Q7654J81939g372D42707
$$ 266254 35502 331092 196454 317763 224908 526537 99642 187296 369235 -7372 442707
17345C12849H9335k4019K13618q2669G4512K1256Q7493J49031J3621j55004R9792
$$ 312849 89335 65316 278934 196265 74512 95768 183261 332292 345913 190909 290701
17334B90701J42489k15876J43421N4754J27794A3334R1950L45401k3706j65787
$$ 290701 433190 217314 360735 415489 543283 13334 105284 450685 426979 261192
17324B61192J63981q2221b48479E9407K23756j1313J00585Q763A15320M19435
$$ 261192 425173 342952 -248479 59407 283163 271850 372435 381198 115320 534755
17314E34755M0071j64968o9099k502P0942j53503K38594k29426J8728o3696j9476
$$ 534755 574826 409858 340759 338257 409199 255696 494290 264864 283592 219896 200420
17303B00420I2056L50715F4106K05815L89198j82237j37735o983K45358k84498
$$ 200420 92056 442771 64106 269921 659119 476882 339147 332164 577522 293024
17293B93024c2390C39805j24844l2630K45603n9491n5737k8379j4162J45892I8979
$$ 293024 -32390 339805 214961 182331 427934 368443 312706 284327 270165 416057 98979
17281C42654K4j60700J55493E8150K22515q4501n4354J28823K6848I4101K28499
$$ 342654 342678 181978 337471 58150 280665 196164 141810 270633 297481 94101 322600
17270C22600L30512A93904K95183j90904Q6400K52530k49635o1515P1398A53420
$$ 322600 653112 193904 489087 298183 384583 637113 387478 325963 397361 153420
17259D25605B02606J37140M57356C59693R556R9468i2289B99716A2851J08968
$$ 425605 202606 339746 797102 359693 369249 468717 -92289 299716 12851 121819
17249A21819L74202A19103L43059j41936j23207R7099I5439J26604r0606J73769
$$ 121819 496021 119103 462162 320226 197019 294118 95439 222043 131437 305206
17239C05206J6754Q0522j43731Q5025p5264B4438K86170B3556L01251L31350r5500
$$ 305206 321960 402482 258751 343776 268512 24438 310608 23556 324807 656157 560657
17228E60657A88882Q8370M13287k92948o0081O3783o6076B6135L78440J95816
$$ 560657 188882 277252 690539 397591 337510 401293 335217 26135 404575 600391
17218F00391j35338j37133r1618R6627K26750k45137j14272J31432J09870J67115
$$ 600391 465053 327920 236302 332929 559679 314542 200270 331702 441572 608687
17208F08687p5144B58496K45163A76761H5131M32543n5572B12031J28971J49161
$$ 608687 533543 258496 503659 176761 85131 517674 462102 212031 341002 490163
17198D90163J01866k27487r3803K27924o2273J32437j13545K57374j04595j33300
$$ 490163 592029 364542 270739 498663 436390 568827 455282 712656 608061 474761
17188D74761r9142L18719O2441j98226N0577k95760K69377J51006B88462J16936
$$ 474761 375619 694338 756779 558553 609130 313370 582747 733753 288462 405398
17178D05398A63193M50357k00482J34102q6568P960j46771r8424J91555K87461
$$ 405398 163193 613550 413068 547170 460602 468562 321791 223367 414922 702383
17168G02383l06525Q3122o396J04317H9384M38030j54119M03814C23028L3279
$$ 702383 395858 478980 472584 576901 89384 527414 373295 777109 323028 356307
17158C56307K35825J15113L9405l63652J28993r4417L5816B01478M26806k77943
$$ 356307 592132 707245 746650 382998 511991 417574 453390 201478 628284 350341
17148C50341M50193j231j18721r0277J2731j48744J6352n1928J57754j2702R1911
$$ 350341 800534 799303 680582 590305 603036 454292 470644 418716 576470 563768 655679
17137F55679r0514l9886J30077j87350K9794n1224r2968n6470L2995N77554k59413
$$ 655679 565165 525279 655356 468006 497800 446576 353608 297138 330133 907687 648274
17126F48274R2931j80075J17935j95413m022p2019L43969n8328m4677k50529L98404
$$ 648274 741205 561130 679065 483652 479630 407611 751580 693252 648575 398046 796450
17115G96450C89496J74214q693R7725l806j63811r3628L3954P6534J88407J18502
$$ 796450 389496 563710 555017 652742 648936 485125 391497 425451 501985 690392 808894
17104H08894J02476k49497m2730L65177D68053J21824O9777O5409k5755J03362
$$ 808894 911370 661873 619143 984320 468053 589877 659654 725063 699308 802670
17094H02670k57029m1657O1927L24461l76739L52533B78423N16314k68102L36108
$$ 802670 545641 503984 565911 890372 513633 866166 278423 794737 526635 862743
17084H62743l18209O90095l66340Q1684J79538k18538m9391o7949K23184l53343
$$ 862743 544534 1234629 868289 949973 1129511 910973 861582 793633 1016817 663474
17074F63474L25319k08328k06867O88447o05682L96203j45297J50809m0714k32006
$$ 663474 988793 780465 573598 1262045 656363 1052566 907269 1058078 1017364 785358
17064G85358K40126J88904m40872K3631J40567K83976l79370j30786M28580m47418
$$ 785358 1025484 1214388 773516 797147 937714 1221690 842320 711534 1140114 692696
17054F92696O3996P3892j25706M0382K95309j26980n6102J35578m07051Q7828
$$ 692696 756692 830584 704878 745260 1040569 913589 857487 993065 586014 673842
17044F73842M50575l66347j9817r5068J39497j24112M00220m5545j99935o9140
$$ 673842 1124417 758070 738253 643185 782682 658570 1058790 1013245 813310 744170
17034G44170M76R2501K6148m2894P6794k68746R4676J71362J43062k44592J01366
$$ 744170 744646 837147 863295 820401 897195 628449 723125 894487 1037549 792957 894323
17023H94323k55783K91813l1385l1744j34537L85793k81464J62621n7944k48529
$$ 894323 638540 930353 898968 867224 732687 1118480 837016 999637 941693 693164
17013F93164J80514m9819K69113o1811L13942k70392m49755L40433K18717J4420
$$ 693164 873678 823859 1092972 1031161 1345103 1074711 624956 965389 1184106 1198526
17003A198526k11694L6419R2139L6723k87827J33808J3050J42807P3329l98848
$$ 1198526 986832 1023251 1115390 1152113 864286 998094 1011144 1153951 1227280 828432
16993H28432K08590J55821k79371L27137K9337k9894j5391j80458Q9268J57800
$$ 828432 1037022 1192843 913472 1240609 1269946 1240052 1224661 1044203 1133471 1291271
16983A291271j49046K1710J11449j30417j77249p3504M10554O8749j40751j45210
$$ 1291271 1142225 1163935 1275384 1144967 967718 894214 1304768 1373517 1232766 1087556
16973A087556l67254M93365K28932k6095j02365l5050l0783J39619j16820n9654
$$ 1087556 720302 1213667 1442599 1416504 1314139 1279089 1248306 1387925 1271105 1211451
16963A211451p2284M49601j61360J65224m87409M69312l6699J46131m76540m69246
$$ 1211451 1139167 1588768 1427408 1592632 1105223 1574535 1537836 1683967 1207427 738181
16953G38181O75711J97054J26335n643j82732l14787N5241M61932O8857p6162
$$ 738181 1413892 1610946 1737281 1731638 1548906 1234119 1289360 1751292 1820149 1743987
16943A743987J50197n77938L63957j34809k18001M62369j920P0974l66147L48453
$$ 1743987 1894184 1316246 1680203 1545394 1327393 1789762 1787842 1858816 1492669 1841122
16933A841122j47903K7914L03289n67274L70798K8292p0655J18754J39654m9458
$$ 1841122 1693219 1721133 2024422 1457148 1827946 1856238 1785583 1904337 2043991 1994533
16923A994533K53692m68522L2567K43530n5266r9418J64404Q785Q8489j59042
$$ 1994533 2248225 1779703 1812270 2055800 2000534 1901116 2065520 2074305 2162794 2003752
16913B003752j76536K33164j2448L26628o3297j18604J12642j30032J90308O067
$$ 2003752 1827216 2060380 2047932 2374560 2311263 2192659 2305301 2175269 2365577 2371644
16903B371644J33623j87568j93574J28825K85710k69296K77375j13970j45840
$$ 2371644 2505267 2317699 2124125 2252950 2538660 2269364 2546739 2432769 2286929
16894B286929Q8727L62264n6861m66614K86015J428K16026l31187L19798J0360
$$ 2286929 2375656 2737920 2681059 2214445 2500460 2501888 2717914 2386727 2706525 2716885
16884B716885J32308j31692J57988L8940n9417J42443r8204r0750L41692K283
$$ 2716885 2849193 2717501 2875489 2914429 2855012 2997455 2899251 2808501 3150193 3152476
16874C152476j82052K17901j06280K23186j45252J10753L20132m83207L77759
$$ 3152476 2970424 3188325 3082045 3305231 3159979 3270732 3590864 3107657 3485416
16865C485416L1128j3799k6344K29027j16665R5353P4998j46541K80393R4708
$$ 3485416 3516544 3502745 3476401 3705428 3588763 3684116 3759114 3612573 3892966 3987674
16855C987674K735q1475K69429j71173J70325L12235j94359m5455K27173n8218
$$ 3987674 3990409 3908934 4178363 4007190 4177515 4489750 4295391 4249936 4477109 4418891
16845D418891l7867m4698N06049l39038N02058k98758q8263L85322r4780J37841
$$ 4418891 4381024 4336326 4842375 4503337 5005395 4706637 4618374 5003696 4908916 5046757
16835E046757o019K61754q7458K22850L5797J85249p1125q6083j12178M33634
$$ 5046757 5040738 5302492 5215034 5437884 5473681 5658930 5587805 5501722 5389544 5823178
16825E823178J7691N61584k57665J58246J53248J05474J52356N1834K71290R0625
$$ 5823178 5840869 6402453 6144788 6303034 6456282 6561756 6714112 6765946 7037236 7127861
16815G127861K99363J60431k70405j32039K24442L54034J69640M70174J258J54732
$$ 7127861 7427224 7587655 7317250 7185211 7409653 7763687 7933327 8403501 8404759 8559491
16805H559491L56372k33563J23598N3971L3027N24827L71452P2578K33922K55455
$$ 8559491 8915863 8682300 8805898 8859869 8892896 9417723 9789175 9861753 10095675 10351130
16795A0351130P7235N59419N584K86785J78385L09652J99755N48703J12010o1943
$$ 10351130 10428365 10987784 10993368 11280153 11458538 11768190 11967945 12516648 12628658 12566715
16785A2566715O28116L93143J84747M24813M35474K07628J18068O76610N17535
$$ 12566715 13194831 13587974 13772721 14197534 14633008 14840636 14958704 15635314 16152849
16776A6152849J56051R64066K34965L76723J97341L04816Q44070O17772K62346
$$ 16152849 16308900 17272966 17507931 17884654 18081995 18386811 19230881 19848653 20110999
16767B0110999P00397P97412N69080N74747O68584R87934O13354M47388J067436
$$ 20110999 20811396 21608808 22177888 22752635 23421219 24409153 25022507 25469895 26537331
16758B6537331P86211J255639L04101J375182Q14494J053013J006517J376534
$$ 26537331 27323542 28579181 28883282 30258464 31072958 32125971 33132488 34509022
16750C4509022R64705J288416J368146J378998J694133J392870J295673J668412
$$ 34509022 35473727 36762143 38130289 39509287 41203420 42596290 43891963 45560375
16742D5560375J807841J566064J735291K488818J499965K165018K281838J932708
$$ 45560375 47368216 48934280 50669571 53158389 54658354 56823372 59105210 61037918
16734F1037918K413091K588317K549158K375183K739315K974783K716953K794695
$$ 61037918 63451009 66039326 68588484 70963667 73702982 76677765 79394718 82189413
16726H2189413K788293L007526K741962K822648L137196K790340K839784K588255
$$ 82189413 84977706 87985232 90727194 93549842 96687038 99477378 102317162 104905417
16718A04905417K211053K506676K044321K209053K199427J187716J207722R73031
$$ 104905417 107116470 109623146 111667467 113876520 116075947 117263663 118471385 119444416
16710A19444416K8381M93219N099p28430n46289o81762j854010j599712j884777
$$ 119444416 119472797 119966016 119971115 119242685 118696396 118014634 116160624 114560912 112676135
16701A12676135k136346k288091k455124k405645l173070k615699k753912l143680
$$ 112676135 110539789 108251698 105796574 103390929 100217859 97602160 94848248 91704568
16693I1704568k860070k726442l186927k845898k750295k830826k899098k453405
$$ 91704568 88844498 86118056 82931129 80085231 77334936 74504110 71605012 69151607
16685F9151607k781683k192307k166431k847293k039142k402587j964542j592836
$$ 69151607 66369924 64177617 62011186 59163893 57124751 54722164 52757622 51164786
16677E1164786k243618j581906j899574j526919j261880j587374j873648j017795
$$ 51164786 48921168 47339262 45439688 43912769 42650889 41063515 39189867 38172072
16669C8172072j253324j303563j248063j221326q99453j251732j090624j049414
$$ 38172072 36918748 35615185 34367122 33145796 32246343 30994611 29903987 28854573
16661B8854573j053397o78638q91162j067835m44739p90132r35198n49979p41131
$$ 28854573 27801176 27122538 26231376 25163541 24718802 23928670 22993472 22443493 21702362
16652B1702362n90332n89333n29647o57612l08823m83874n88223m74850o68002
$$ 21702362 21112030 20522697 19993050 19335438 19026615 18542741 17954518 17479668 16811666
16643A6811666l61014l16607m96892m67233k29860n77479L8436o70086o6715j80850
$$ 16811666 16450652 16134045 15637153 15169920 14940060 14362581 14401017 13730931 13664216 13483366
16633A3483366o33279k56455r9816l96719l87902m8979k53625n20484j81333k77877
$$ 13483366 12850087 12593632 12493816 12097097 11709195 11660216 11406591 10886107 10704774 10426897
16623A0426897J67102m35586k14833m15191l66104J92894q6527r0261l68276m60744
$$ 10426897 10593999 10158413 9943580 9528389 9162285 9355179 9268652 9178391 8810115 8349371
16613H349371J84615k37519k71515k13181j4538k27461j89089q8842l71879J84683
$$ 8349371 8533986 8296467 8024952 7811771 7797233 7569772 7380683 7291841 6919962 7104645
16603G104645j2845k31489o6242k99055P5112k93378k16082M9959J16748j09444
$$ 7104645 7091800 6860311 6794069 6495014 6570126 6276748 6060666 6110625 6227373 6117929
16593F117929l21624j83711J84716K34699m67567m19755k1030K16220l98761K38442
$$ 6117929 5796305 5612594 5797310 6032009 5564442 5144687 5123657 5339877 4941116 5179558
16583E179558l77407L53963l40341J10991n20093M49191k40371N4091j29256k96220
$$ 5179558 4802151 5156114 4815773 4926764 4406671 4855862 4615491 4669582 4540326 4244106
16573D244106o2819J29029q8371J62581k03189j09595J5141l57005J70517K64305
$$ 4244106 4181287 4310316 4221945 4384526 4181337 4071742 4086883 3729878 3900395 4164700
16563D164700m41350r5910J2803l1708j86358K98367j71905j21927J75336l43690
$$ 4164700 3723350 3627440 3640243 3608535 3422177 3720544 3548639 3426712 3602048 3258358
16553C258358M7770j5944q7098J13583J0739l82194L31527k88610J20766j96852
$$ 3258358 3306128 3290184 3203086 3316669 3327408 2945214 3276741 2988131 3108897 2912045
16543B912045K65771l29364K88246k95008R0640K31925o13823N7991K20810j35644
$$ 2912045 3177816 2848452 3136698 2841690 2932330 3164255 2550432 2608423 2829233 2693589
16533B693589k73712l8665K64870j59474J48849j16383J727n8085J30684j73642
$$ 2693589 2419877 2381212 2646082 2486608 2635457 2519074 2520801 2462716 2593400 2419758
16523B419758J58224J05108k40614j0166j50137j06640L3894K87360j76326r9021
$$ 2419758 2577982 2683090 2442476 2432310 2282173 2175533 2209427 2496787 2320461 2221440
16513B221440p1895m6962k00001K71138k84739K96236k59833P1837L65706p46740
$$ 2221440 2149545 2102583 1902582 2173720 1888981 2185217 1925384 1997221 2362927 1616187
16503A616187M44571o0846j23615Q8148R175Q4472k34441M2319j04123K12883
$$ 1616187 2060758 1999912 1876297 1964445 1973620 2058092 1823651 1865970 1761847 1974730
16493A974730n31264N56904k52065q838k47948K33620K58335M7423M5298k23845
$$ 1974730 1443466 2000370 1748305 1739467 1491519 1725139 1983474 2030897 2076195 1852350
16483A852350j81027J36763k63060p3002L05156o6918J08850L8149m86134m5992
$$ 1852350 1671323 1808086 1545026 1472024 1777180 1710262 1819112 1857261 1371127 1325135
16473A325135K72282O5391k87808K17020o4699j56717k97337J82840O12359j94715
$$ 1325135 1597417 1662808 1375000 1592020 1527321 1370604 1073267 1256107 1868466 1673751
16463A673751J62475k38267k88421K51912k97702P492j39088M60381j05415j57278
$$ 1673751 1836226 1597959 1309538 1561450 1263748 1271240 1132152 1592533 1487118 1329840
16453A329840m6383m7665L13923j38012k99211K6617L58122m67034M8993L91376
$$ 1329840 1283457 1235792 1549715 1411703 1112492 1139109 1497231 1030197 1079190 1470566
16443A470566m41892M12734j77623k44691R671J25203q1201J92224q4968j67041
$$ 1470566 1028674 1441408 1263785 1019094 1028765 1153968 1072767 1264991 1180023 1012982
16433A012982K70792n42408L79859L5835L8608l7062J55392n78708K10219J11977
$$ 1012982 1283774 741366 1121225 1157060 1195668 1158606 1313998 735290 945509 1057486
16423A057486M05591l65177j33200J5591r878q8371L33982l42907J46727J68046
$$ 1057486 1463077 1097900 964700 980291 970413 882042 1216024 873117 1019844 1187890
16413A187890o9646J95674j28200n45652L57392K92591l64073L44367k60912m8626
$$ 1187890 1118244 1313918 1185718 640066 997458 1290049 925976 1270343 1009431 960805
16403I60805J36306l47952J94283J18525L9156k84760J54453j15166J26338l57186
$$ 960805 1097111 749159 943442 1061967 1101123 816363 970816 855650 981988 624802
16393F24802J36580n0615J95526j07861K75476k09246j16185J29804P2051n6529
$$ 624802 761382 710767 906293 798432 1073908 864662 748477 878281 950332 893803
16383H93803k2811k87918N01844q9594m20891L26443Q8175k59042Q9350l1683
$$ 893803 870992 583074 1084918 995324 574433 900876 989051 730009 819359 787676
16373G87676B05813L53540J06311J81009k26474j8211K47096J50274k30036J2315
$$ 787676 205813 559353 665664 846673 620199 601988 849084 999358 769322 781637
16363G81637j06282L44211k17413j88472J39834j20513J40849L74120k20333j08253
$$ 781637 675355 1019566 802153 613681 753515 633002 773851 1147971 927638 819385
16353H19385l4434O7236l03290K52706j36921J26709k0000o4322K62767j56227
$$ 819385 784951 852187 548897 801603 664682 791391 771391 707069 969836 813609
16343H13609C13265N08871J80198j01047l80502J63684j48748L08175l26038O3864
$$ 813609 313265 822136 1002334 901287 520785 684469 535721 843896 517858 581722
16333E81722N5393J51374l80546q6192N26095L5308j05618P9118j46284j06576
$$ 581722 637115 788489 407943 321751 847846 883154 777536 856654 710370 603794
16323F03794J07848j79401N4617J36104k75511J40774j67153O7559P6812M5578
$$ 603794 711642 532241 586858 722962 447451 588225 421072 488631 565443 611021
16313F11021q0543L34073l55573j09257J16998K23292L2947l33985M33228j90773
$$ 611021 530478 864551 508978 399721 516719 740011 772958 438973 872201 681428
16303F81428J26864C48948L7588O700L24119p7002k79043j46429N74456l27398
$$ 681428 808292 348948 386536 393236 717355 640353 361310 214881 789337 461939
16293D61939J86391o9181N7412k1045J30634L16402k55849j02211K43337o764
$$ 461939 648330 579149 636561 615516 746150 1062552 806703 704492 947829 941065
16283I41065j58027k09511O12800m72709C45395K44395j38090J30370K9615L86096
$$ 941065 783038 573527 1186327 713618 345395 589790 451700 582070 611685 997781
16273I97781C88683K3975L11184k24531o1414B3262K86107k0318N74055k13133
$$ 997781 388683 412658 723842 499311 437897 23262 309369 289051 863106 649973
16263F49973j15234m4398B43843M1415L21511B26103L39218k46858K88830L001
$$ 649973 534739 490341 243843 285258 606769 226103 565321 318463 607293 610294
16253F10294G3935L87510r3075R4851r9286o2408r4M83343B93162L38846B20512
$$ 610294 73935 461445 368370 463221 363935 301527 301433 784776 293162 632008 220512
16241C89937Q3843L5781k22696n0149N7878K99706l3914k37682Q5263o9902c7948
$$ 389937 473780 509561 286865 236716 294594 594300 560386 322704 407967 338065 -37948
16229D76214L33525k03136L8769k32594P1542k22983K48878Q2756j89602m9221
$$ 476214 809739 606603 645372 412778 484320 261337 510215 592971 403369 354148
16219C54148L07353k10925n1720J04700n9771A98924K15942K76708c1713A19109
$$ 354148 661501 450576 398856 503556 443785 198924 414866 691574 -31713 119109
16208D44203K96341k46283A66974D2343Q0616K67577j92305M79523A26772K84459
$$ 444203 740544 494261 166974 42343 122959 390536 198231 677754 126772 411231
16198D11231p2939m6224J88382A00133A9686K80486c7985D30252K28234b29776
$$ 411231 338292 292068 480450 100133 19686 300172 -37985 430252 658486 -229776
16187B74422P1725j07824N7167J18525K26128j80313l9751g4964C40643j1391
$$ 274422 346147 238323 295490 414015 640143 459830 420079 -74964 340643 329252
16177C29252K29233M2354B39147A07824O9858L47714A91373E2542B6073M60105
$$ 329252 558485 600839 239147 107824 177682 525396 191373 52542 26073 486178
16167D86178p7549j48064J28201A90004Q2642H4439B6825J32554C7785J73805
$$ 486178 408629 260565 388766 190004 272646 84439 26825 159379 37785 211590
16157B11590K02624J54888G4849J95635J3657l661P4753A00008i66A50890J71731
$$ 211590 414214 569102 74849 270484 284141 280480 355233 100008 -966 150890 322621
16146C22621H3299P0778L2416L0190M90988B42182N2447j03073D083J02295J75859
$$ 322621 83299 154077 186493 216683 707671 242182 294629 191556 4083 106378 282237
16135B82237L9692r7949F2448M02020G0905a24909C06199A00228J92227K37831
$$ 282237 321929 223980 62448 464468 70905 -124909 306199 100228 292455 530286
16125E30286j08541A02379J08828K05247k02624K28388J25184k13629L0608j39630
$$ 530286 421745 102379 211207 416454 213830 442218 567402 353773 384381 244751
16115B44751J57721A88874J7550n6792N1053F2282J1579O4895K69690A89938G5847
$$ 244751 402472 188874 206424 149632 200685 62282 73861 138756 408446 189938 75847
16103B2379N47902I2322d4010A67003M60392B01450o4552K46662L23465C02148
$$ 22379 570281 92322 -44010 167003 627395 201450 136898 383560 707025 302148
16092E74039j79576H2420K52196P021q7927j10326J71805J81804n7345N9992M5709
$$ 574039 394463 82420 334616 341637 253710 143384 315189 496993 439648 499640 545349
16081E45349A79071K01743J19228O5163j69632P84Q7536k39099c11036B94645
$$ 545349 179071 380814 500042 565205 395573 396357 483893 244794 -311036 294645
16070D6598R3406n8232k2718D514K80412E0707R5727d334r2294D9105j821J2552
$$ 46598 140004 81772 59054 4514 284926 50707 146434 -4334 -96628 49105 47284 59836
16058E9836K60042n8081J7605r0609e906C12343K13980A08251K84058L8405P4827
$$ 59836 319878 261797 279402 188793 -5906 312343 526323 108251 392309 430714 505541
16047E05541j24200j61548K21866j71287A26010h1372A34961P9822j5764e7035
$$ 505541 381341 219793 441659 270372 126010 -81372 134961 214783 199019 -57035
16036C57257l0118B3432K93132a08093G2639O1095f2153B6856M041K59923n5581
$$ 357257 327139 23432 316564 -108093 72639 133734 -62153 26856 30897 290820 235239
16025B35239q1405R2898P5407b67852D45015a23279A12395K4037F6328J04218
$$ 235239 153834 246732 322139 -267852 445015 -123279 112395 136432 66328 170546
16015A70546b18A37835D9256K33189i3416C5485P7133A9318J21634o5421K6120
$$ 170546 -218 137835 49256 282445 -93416 35485 112618 19318 140952 75531 101651
16004A01651m5209a28606A46063f0376j08524K309E5624Q8336f9668b8556k84972
$$ 101651 56442 -128606 146063 -60376 -168900 -166591 55624 143960 -69668 -28556 -313528
15993c13528A73511J08167k5653C6931L33934h6783A22642m0988b34171a5137
$$ -313528 173511 281678 256025 36931 370865 -86783 122642 81654 -234171 -15137
15982A59970a84924O6216A47645C2894J93381j08664a94682H0633L25207A17416
$$ 159970 -184924 -118708 147645 32894 226275 117611 -194682 80633 405840 117416
15971b87837A11661c6456B51168e4418o889F1965J54146G1785k9587L6932L02173
$$ -287837 111661 -36456 251168 -54418 -61307 61965 216111 71785 42198 79130 381303
15960C81303n9292H3177B0942N2186L3975L6131b51392Q0810F3224a46125D242
$$ 381303 322011 83177 20942 73128 107103 143234 -251392 -170582 63224 -146125 4242
15948I4158J40230C9005J15457c6616l26026d5712n2381p4616e8721D7534n08
$$ 94158 234388 39005 154462 -36616 -362642 -45712 -98093 -172709 -58721 47534 47026
15937D7026K94472a96800j62151I133e2601J5215A55371b38583d5467B47797I4898
$$ 47026 341498 -196800 -358951 9133 -52601 -37386 155371 -238583 -45467 247797 94898
15925a22688b8258B65266h9089G1212J573d7320F9325O3052c6925j25056I3855
$$ -122688 -28258 265266 -89089 71212 72785 -47320 69325 132377 -36925 -161981 93855
15913B1300b49183E5101J79092d06748A47304a3933o2191F4289a69118B33945
$$ 21300 -249183 55101 234193 -406748 147304 -13933 -76124 64289 -169118 233945
15902B1528J37521G9187O6738g042A98087a06175G4032g3898D8127a5653A1609
$$ 21528 159049 79187 145925 -7042 198087 -106175 74032 -73898 48127 -15653 11609
15890D8347d6567C29445D6732L31693G7685j3864h51A85092g2286G7151b0488
$$ 48347 -46567 329445 46732 378425 77685 63821 -851 185092 -72286 77151 -20488
15878a2282j4947m3270j4688A89669o074J38806G7242K90088i2155D55383i4756
$$ -12282 -27229 -70499 -85187 189669 183595 322401 77242 367330 -92155 455383 -94756
15866A46557J72395a79300C30962D1491J18070J03898D6928P0603A9200R372a10116
$$ 146557 318952 -179300 330962 41491 159561 263459 46928 117531 19200 28572 -110116
15854A91039i9254p089B57684q5359L8342D4806K26567H347i1896j13956B32856
$$ 191039 -99254 -106343 257684 172325 210667 44806 271373 8347 -91896 -205852 232856
15842C7725b12449A37928L22791c87176h6701F6164a6897k74499L8084B33432
$$ 37725 -212449 137928 460719 -387176 -86701 66164 -16897 -291396 -253312 233432
15831B0740R4271A5692K48343a819C9332K51908e288j10821B68694b83831J31938
$$ 20740 115011 15692 264035 -1819 39332 291240 -5288 -116109 268694 -283831 -151893
15820a51893G7210B0250J10531J08219b82561A49280i8204l5782A2295M2180b34605
$$ -151893 77210 20250 130781 239000 -282561 149280 -98204 -133986 12295 54475 -234605
15808A30197h4309p1236d6470A56454p0391K75941A60944E5828J85417b85168
$$ 130197 -84309 -155545 -46470 156454 86063 362004 160944 55828 241245 -285168
15797d96913i070A08169a3351j64817b9755A84486F4858b61147F7120J32238E6610
$$ -496913 -9070 108169 -13351 -178168 -29755 184486 64858 -261147 67120 199358 56610
15785a57915B94206a15539A86415L3558o8184G0176L28222a52870P3303l1423
$$ -157915 294206 -115539 186415 219973 151789 70176 398398 -152870 -79567 -110990
15775a10990B04981D5974Q8894o6395a3711B0599R4540P078i5295G9065h1913
$$ -110990 204981 45974 134868 68473 -13711 20599 115139 122217 -95295 79065 -81913
15763f9815A20208J59025E7800K53533j42473E2545K27674j03382c725B5715M2842
$$ -69815 120208 279233 57800 311333 168860 52545 280219 176837 -3725 25715 68557
15752F8557e3811B82234Q9126c5747A62833L5952a70477H603J43348p3058J12906
$$ 68557 -53811 282234 371360 -35747 162833 198785 -170477 8603 151951 78893 191799
15741A91799d8366A56435J32665G8081K1179b11719j16068a00891B14742B8618
$$ 191799 -48366 156435 289100 78081 99260 -211719 -327787 -100891 214742 28618
15730B52572a30425C6088O5365k4757K14865c5697A4404p157N4487K8784M6519
$$ 252572 -130425 36088 101453 76696 291561 -35697 14404 7247 61734 90518 137037
15719A37037b37246B35388l8462k2766d01380I4416h7472l7575B36823r6841j9430
$$ 137037 -237246 235388 196926 174160 -401380 94416 -87472 -125047 236823 139982 120552
15708A20552m3768J47274k4855J15512A34152k9682B9803J6395A8507e0390a8513
$$ 120552 76784 224058 199203 314715 134152 104470 29803 46198 18507 -50390 -18513
15696a29562B2645h5458r3094C68774A29786D1253K02047p7778N0757d2282A07353
$$ -129562 22645 -85458 -178552 368774 129786 41253 243300 165522 216279 -42282 107353
15684a32632E0866K3953J6371g8112l0887B03335D6755J26744b35323A69049c0278
$$ -132632 50866 74819 91190 -78112 -108999 203335 46755 173499 -235323 169049 -30278
15672B19876a13049J013A09758J28570B3742e0726B7136J67022J50506o7548A27455
$$ 219876 -113049 -112036 109758 238328 23742 -50726 27136 194158 344664 277116 127455
15660H4920k7745A7418K18318b62606C50177j68082j5733c14382e890l4077r6231
$$ 84920 57175 17418 235736 -262606 350177 182095 166362 -314382 -5890 -39967 -136198
15649a36198G9801a08370A26604P0346R6199n3199B4351O5585a32164H0401A8083
$$ -136198 79801 -108370 126604 196950 293149 239950 24351 89936 -132164 80401 18083
15637A21901O4228e8284A21334J85228c3764B33051b56148Q1630A54117P1204
$$ 121901 186129 -58284 121334 306562 -33764 233051 -256148 -174518 154117 225321
15627B25321c0581A26809d2620a6365r9379A96828a38488l8325P3876K4284K4665
$$ 225321 -30581 126809 -42620 -16365 -115744 196828 -138488 -176813 -102937 -78653 -53988
15616e3988o8700H8676Q7233b41283j48037J68790P8409F7765j7010P3651C5367
$$ -53988 -122688 88676 175909 -241283 -389320 -220530 -142121 67765 50755 124406 35367
15604h3280K5116k7943a9989j80090b9438A47116o9479l700K9200L0673L23676
$$ -83280 -58164 -86107 -19989 -200079 -29438 147116 77637 73937 103137 133810 457486
15593D57486F3299L9311L97466A65033n0096R7218M65281a2322A1460J79084n1080
$$ 457486 63299 102610 500076 165033 114937 212155 677436 -12322 11460 190544 139464
15582A39464A8958J04872b1545j22703A22700m8523g40B48332E0410L86787A22371
$$ 139464 18958 123830 -21545 -144248 122700 74177 -740 248332 50410 437197 122371
15570A23227J02441a02557m8077H0395f0211G6205r140a58110d7331A16552b29155
$$ 123227 225668 -102557 -150634 80395 -60211 76205 67065 -158110 -47331 116552 -229155
15558C82116A8513b18826A66014f8407B85271D4200K7763A4492O1991N3223K5449
$$ 382116 18513 -218826 166014 -68407 285271 44200 71963 14492 76483 129706 155155
15547A55155P9744J17652J37747A22376M21934h3741C84340a83913E40570A69844
$$ 155155 234899 352551 490298 122376 544310 -83741 384340 -183913 540570 169844
15536e2507k62082H1590K66003m9620a04668A85001K00463I4237L1667a91333
$$ -52507 -314589 81590 347593 297973 -104668 185001 385464 94237 125904 -191333
15525i2766J4391G3826J10412m4504g5032A59300F3972K22183H8015J82921j20740
$$ -92766 -78375 73826 184238 139734 -75032 159300 63972 286155 88015 270936 150196
15514A50196O242L33760k3204m2565j74079m9592Q1699a46068K5511C83831a27069
$$ 150196 156438 490198 466994 424429 250350 200758 282457 -146068 -120557 383831 -127069
15502C14962G5934L922a69274A50619p4006K27551a75980K8837B62495E9171d7951
$$ 314962 75934 79856 -169274 150619 76613 304164 -175980 -147143 262495 59171 -47951
15490E63319k66732N1795g068B01997k5234J32931A47162L35412c0923E5804P8563
$$ 563319 296587 348382 -7068 201997 176763 309694 147162 482574 -30923 55804 134367
15479A34367l6804l3489L56159A09897M09985D7526d0802B09149C4800O6806J31960
$$ 134367 97563 64074 420233 109897 519882 47526 -40802 209149 34800 101606 233566
15468B33566a87583D35888A82441J15547n3321a58271A09249L0267Q5329j07789
$$ 233566 -187583 435888 182441 297988 244667 -158271 109249 139516 224845 117056
15458A17056K94327A72604D2934J82914p4584K6084E7681K21253C9259d0341C23310
$$ 117056 411383 172604 42934 225848 151264 177348 57681 278934 39259 -40341 323310
15446c2658B96994C7632J37774R4849j07775n8346D9459K32041a6697I9709R4155
$$ -32658 296994 37632 175406 270255 162480 104134 49459 281500 -16697 99709 193864
15435A93864H5077q215b67169e7549A15074K24345M1745k6913e2980A89932D9805
$$ 193864 85077 76862 -267169 -57549 115074 339419 381164 354251 -52980 189932 49805
15423B45995j5113C4704J82409H8560j5635f5034A05261K59874a45339b5041B34558
$$ 245995 230882 34704 217113 88560 72925 -65034 105261 365135 -145339 -25041 234558
15411D31821A28630L646O7271J27274i373r179B37916J96667P5013b26143A28703
$$ 431821 128630 132276 199547 326821 -9373 -18552 237916 434583 509596 -226143 128703
15399A6011a50735C17310a98275D73028A99453e0390B08055b1856B23827B1651
$$ 16011 -150735 317310 -198275 473028 199453 -50390 208055 -21856 223827 21651
15388B40170J62288G8173K52128j30797P5774M8174J58468A13574J84614A42527
$$ 240170 402458 78173 330301 199504 275278 323452 481920 113574 298188 142527
15377F3566M48975G9712O39117l19218J08339A92984M8094L0930L14992A17833
$$ 63566 512541 79712 718829 399611 507950 192984 241078 272008 587000 117833
15366C56699P64G387f2715C30297R3601Q1162B27609J29855f430A13914M04933
$$ 356699 357463 7387 -62715 330297 423898 505060 227609 357464 -6430 113914 518847
15355E18847A89273l0074n3378R0196m2855L6302q5612O3748r384F9101L65198
$$ 518847 189273 159199 105821 196017 153162 189464 103852 167600 158216 69101 434299
15344D34299L8869J34754G8626L42600A07604J10591L86656k02432J72705m4442
$$ 434299 473168 607922 78626 421226 107604 218195 604851 402419 575124 530682
15334E30682B64189j07933K78943j12818O4628j11679j20499J86851J21612c4659
$$ 530682 264189 156256 435199 322381 387009 275330 154831 341682 463294 -34659
15323B69654J781j28745L07146j45378J24696b6632B86861M30391C08512J40695
$$ 269654 271435 142690 449836 304458 429154 -26632 286861 717252 308512 449207
15313D49207m9856j40843N37337C79582K53721m1186O4162C20576M4767l6489
$$ 449207 399351 258508 795845 379582 633303 592117 656279 320576 365343 328854
15303C28854m0836L68384k76252J60660A02980L10589A21128J04233a23648G5221
$$ 328854 288018 656402 380150 540810 102980 413569 121128 225361 -123648 75221
15292A79926J25291P6241j86453K332K21122o4915N0803A88005O0889L6177K06999
$$ 179926 305217 381458 195005 197337 418459 353544 404347 188005 248894 285071 492070
15281D92070A95583Q2340o2203D8776N05154b01346A36891K16528o4563J98820
$$ 492070 195583 277923 215720 48776 553930 -201346 136891 353419 288856 487676
15271D87676J7270k18108k0340j9872j06457o154L86254k58103K6615N7546J64866
$$ 487676 504946 286838 266498 246626 140169 134015 520269 262166 288781 346327 511193
15260E11193P7174k45910M61736k07370p5087j30371J00763R5972Q3002L00867
$$ 511193 588367 342457 804193 596823 521736 391365 492128 588100 671102 971969
15250I71969M80280J0846m76312N34815l82803l27923k89994k11346N7965A19882
$$ 971969 1452249 1463095 986783 1521598 1138795 810872 520878 309532 367497 119882
15239B11309L77426B80156r2104m2257L35610A59399e473D11684d2325C31491
$$ 211309 588735 280156 188052 145795 481405 159399 -5473 411684 -42325 331491
15228B20416M7516j05467n7642a05057C40640r0394k1169K98014B46606J72260
$$ 220416 267932 162465 104823 -105057 340640 250246 229077 527091 246606 418866
15218D18866A54690K26954j84302K31955k10528k9193J70967A0741L56934r0302
$$ 418866 154690 381644 197342 429297 218769 189576 360543 10741 367675 277373
15208B77373Q3996K2316I4583p38J39062L018p706M7910L03139k06228j25651
$$ 277373 361369 383685 94583 93845 232907 235925 228219 276129 579268 373040 247389
15197B47389M856M4068q6707l0392q8743J02635J11859J53495G1750j5247K97513
$$ 247389 252245 296313 209606 179214 90471 193106 304965 458460 71750 56503 354016
15186C54016k9908K56368k64412M4011E6615M8994N68389k14659A54542k050J03278
$$ 354016 324108 580476 316064 360075 56615 105609 673998 459339 154542 152492 255770
15175B55770P7957R2951O3599n7744k12928K32476A70487J73877J34314j24366
$$ 255770 333727 426678 490277 432533 219605 452081 170487 344364 478678 354312
15165C54312q0786J06836K63562k85724K91125k67882P4527m7106m9176L36689
$$ 354312 273526 380362 643924 358200 649325 381443 455970 408864 359688 696377
15155F96377M7197J0405l20803j01149q282l4693p629J85786A94070H1606J23933
$$ 696377 743574 753979 433176 332027 323745 289052 281423 467209 194070 81606 205539
15144B05539M49209k41281J17007o8450B13117M68435l27569J19782n8890A08510
$$ 205539 654748 413467 530474 462024 213117 681552 353983 473765 414875 108510
15133B53618K48336k16527O67655B60703l7603K40516K24270B74711J73429q6848
$$ 253618 501954 285427 953082 260703 223100 463616 687886 274711 448140 361292
15123C61292K63576k87725L19970j98200K21737l16440p4726l8609K48189K75873
$$ 361292 624868 337143 657113 458913 680650 364210 289484 250875 499064 774937
15113G74937l57575p2869M33804r1524p3295J1161I5939L70399L9178J70853j28569
$$ 774937 417362 344493 778297 686773 613478 624639 95939 466338 505516 676369 547800
15102E47800j89940J11848P7101K72779j09517m6787k16000L03895O8602k50874
$$ 547800 357860 469708 546809 819588 710071 663284 447284 751179 819781 568907
15092E68907j55097L489K90125K28886D48039r678j4487Q4807j17369L2003J04471
$$ 568907 413810 417299 707424 936310 448039 438361 423874 508681 391312 423315 527786
15081E27786A91330o9045K93909L06336j53849A41869L72040J36594k10000M2307
$$ 527786 191330 122285 416194 722530 568681 141869 513909 650503 440503 482810
15071D82810n3965J83667B38907J3007N15144l14815L25217l51626Q3256k34195
$$ 482810 428845 612512 238907 251914 767058 452243 777460 425834 509090 274895
15061B74895L34914M8481j59258J36728k2094K99125M8774q8275m0262m6207J59555
$$ 274895 609809 658290 499032 635760 613666 912791 961565 873290 833028 786821 946376
15050I46376L02952k96068k23916r2332K58107l86414J47069N445K94637J60168
$$ 946376 1249328 953260 729344 637012 895119 508705 655774 661219 955856 1116024
15040A116024l00974j96885k15620R3240N776K27534j27211j35299P967K89601
$$ 1116024 815050 618165 402545 495785 501561 729095 601884 466585 474552 764153
15030G64153H9331P72627k63144J10529p559k36793N2566K88090k65042M17017
$$ 764153 89331 861958 598814 709343 701784 464991 517557 805647 540605 957622
15020I57622C08716L58612n4853k52144n7235J81262j32503Q0625J20982K01143
$$ 957622 308716 667328 612475 360331 303096 484358 351855 432480 553462 754605
15010G54605k35572K98097C93823J58614k65764M90259k07999K4792p9429M5442
$$ 754605 519033 817130 393823 552437 286673 776932 568933 593725 514296 559738
15000E59738A97015L52365J72868C46109j69671o5937K88521J52617K65579D03928
$$ 559738 197015 549380 722248 346109 176438 110501 399022 551639 817218 403928
14989D24505P8063J44215Q7668j21129J88867j92095O37351n11574K3236L12255
$$ 424505 502568 646783 734451 613322 802189 610094 1247445 735871 759107 1071362
14979A071362E25837L60858n387l98193L009J11705J65064k0149n5601K34093
$$ 1071362 525837 886695 881308 483115 486124 597829 762893 742744 687143 921236
14969I21236j13395l9146A61983O74543j93124J37600m7126J26065B56419L32255
$$ 921236 807841 768695 161983 836526 643402 781002 733876 859941 256419 588674
14959E88674L19771n4466R3897j53888Q7735k00179K10155J12600l46321L66167
$$ 588674 908445 853979 947876 793988 881723 681544 891699 1004299 657978 1024145
14949A024145q3785l8827j74305K48620k46120J87612n5148J10174O7733L6053
$$ 1024145 940360 901533 727228 975848 729728 917340 862192 972366 1040099 1076152
14939A076152j37043J66914l70719M0920N33104l36562l12990L3795j33184M5162
$$ 1076152 939109 1106023 735304 776224 1309328 972766 659776 693571 560387 605549
14929F05549J27844J61112o2013l21638R0267J32744J72986k42809J9156J65014
$$ 605549 733393 894505 832492 510854 601121 733865 906851 664042 683198 848212
14919H48212j4556J18206j73865J44502k41722J67916N8485j74958p783j32674
$$ 848212 833656 951862 777997 922499 680777 848693 907178 732220 724437 591763
14909E91763K22250C76397L39949L82638k83491j18304k07162k4328M84976m38515
$$ 591763 814013 376397 716346 1098984 815493 697189 490027 465699 950675 512160
14899E12160L20778j23762r8886k8126J94279l43324K08509k65338L46130j54975
$$ 512160 832938 709176 610290 582164 776443 433119 641628 376290 722420 567445
14889E67445J22180j62063p830J96306J40449j29254N8777j51216m4087j16050
$$ 567445 689625 527562 519732 716038 856487 727233 786010 634794 590707 474657
14879D74657Q433L8308J36316K6047j17268K64714p6784Q9437k78189n9573J66991
$$ 474657 483090 521398 657714 683761 566493 831207 754423 843860 565671 506098 673089
14868F73089J3708J439L2611k8933J28592k63985N54111r9637l65997K60944Q2915
$$ 673089 686797 688236 720847 691914 820506 556521 1110632 1010995 644998 905942 988857
14857I88857l05091O4450J47844m43969K01961K47708j20175n0345K90698M0153
$$ 988857 683766 748216 896060 452091 654052 901760 781585 731240 1021938 1062091
14847A062091J44925k06614k28649o7443R0405n1299K21812j81170j54421J32086
$$ 1062091 1207016 1000402 771753 704310 794715 743416 965228 784058 629637 761723
14837G61723j40824K00552J7166K31185E31441j54522K65382Q5565M18079j97497
$$ 761723 620899 821451 838617 1069802 531441 376919 642301 727866 1145945 948448
14827I48448J68865l37075M38815k48100K1963K27921J02059j33236k65813J96443
$$ 948448 1117313 780238 1219053 970953 992916 1220837 1322896 1189660 923847 1120290
14817A120290R537l6388n5734R8275j21816J89736J10033k78581k23879J73561
$$ 1120290 1129827 1093439 1037705 1135980 1014164 1203900 1313933 1035352 811473 985034
14807I85034k80301L56384k19101K38778k25270K57807m6927K41968j23598O8565
$$ 985034 704733 1061117 842016 1080794 855524 1113331 1066404 1308372 1184774 1253339
14797A253339m70082K95715q469r0291J36452K908m22783N71182m1592o6648K51895
$$ 1253339 783257 1078972 1070503 980212 1116664 1119572 696789 1267971 1226379 1159731 1411626
14786A411626k11100L78571k59411k13943K36241j27791j1399J17084j25115l7114
$$ 1411626 1200526 1579097 1319686 1105743 1341984 1214193 1202794 1319878 1194763 1157649
14776A157649k0407r4813K06221J62350j80989k84249K79179K454k0509K39848
$$ 1157649 1137242 1042429 1248650 1411000 1230011 945762 1224941 1227395 1206886 1446734
14766A446734j07438m83698N60163l19833m2871L38567m03830L2982L2054J24864
$$ 1446734 1339296 855598 1415761 1095928 1053057 1391624 987794 1020776 1052830 1177694
14756A177694j89937L3163J03367n271n0100k0392K77109j75656J61330M60441
$$ 1177694 987757 1020920 1124287 1119016 1068916 1048524 1325633 1149977 1311307 1771748
14746A771748n75197K13567O7185M6619l44779l20503J67929j62578j11998O69436
$$ 1771748 1196551 1410118 1477303 1523922 1179143 858640 1026569 863991 751993 1421429
14736A421429m31018k62525N09134m06030J73225P26894p46330J97894O0362k20231
$$ 1421429 990411 727886 1237020 830990 1004215 1731109 984779 1182673 1243035 1022804
14726A022804M04338k63696L50222k6977l37032O5949p5497Q3326n1992j55881
$$ 1022804 1427142 1163446 1513668 1486691 1149659 1215608 1140111 1223437 1171445 1015564
14716A015564k65693L23612k7437O4232K13521l37044K21825j74341J86342q4226
$$ 1015564 749871 1073483 1046046 1110278 1323799 986755 1208580 1034239 1220581 1136355
14706A136355k68188K68097M9334k37829K99864m093J85817j73093J28573j38820
$$ 1136355 868167 1136264 1185598 947769 1247633 1243540 1429357 1256264 1384837 1246017
14696A246017j2402R6154O9221j86060L26555j59942l84356J3194J79980j01210
$$ 1246017 1233615 1329769 1398990 1212930 1539485 1379543 995187 1008381 1188361 1087151
14686A087151J04814N4077j28410J48932l49426K67247k38954K10145J2571n3721
$$ 1087151 1191965 1246042 1117632 1266564 917138 1184385 945431 1155576 1168147 1114426
14676A114426O5074j8039n36026M65213q0882K46016j90398J56125J83384k78883
$$ 1114426 1179500 1161461 625435 1090648 1009766 1255782 1065384 1221509 1404893 1126010
14666A126010k3502j23112P2593J21364k73497L12036r097K9643k83764J87896
$$ 1126010 1102508 979396 1051989 1173353 899856 1211892 1202795 1232438 948674 1136570
14656A136570Q3679n0044R9720l0511Q0582k08613L26226j90600K66448l42674
$$ 1136570 1220249 1170205 1269925 1239414 1319996 1111383 1437609 1247009 1513457 1170783
14646A170783K28562p4017L4627m9962q3903R5702q8682q1705J58778j64603K72047
$$ 1170783 1399345 1325328 1359955 1309993 1226090 1321792 1233110 1151405 1310183 1145580 1417627
14635A417627k00417L684j49363O0093P4450J94364l72952L12971K19974m62367
$$ 1417627 1217210 1220894 1071531 1131624 1206074 1400438 1027486 1340457 1560431 1098064
14625A098064K56612K65462m0813m28617K77677n4164J85375m2865p6557n0265
$$ 1098064 1354676 1620138 1579325 1150708 1428385 1374221 1559596 1516731 1440174 1389909
14615A389909O6608K16033Q1830k62748k40700m5037P04206n62160K92108m58712
$$ 1389909 1456517 1672550 1754380 1491632 1250932 1205895 1910101 1347941 1640049 1181337
14605A181337K26388P5095k46098M32505l27999K45479Q5625l23421K25228j25986
$$ 1181337 1407725 1482820 1236722 1669227 1341228 1586707 1672332 1348911 1574139 1448153
14595A448153K25048q2222k50782J92441J00867J70369l40587R4704K37992n4768
$$ 1448153 1673201 1590979 1340197 1532638 1633505 1803874 1463287 1557991 1795983 1741215
14585A741215j07825r8834M04317J17658p6552m0250Q7739j87814K59346j57772
$$ 1741215 1633390 1534556 1938873 2056531 1979979 1939729 2027468 1839654 2099000 1941228
14575A941228q7220p605Q428K68997j08800k2794M6918Q9580J22396O3261K6150
$$ 1941228 1854008 1846403 1854831 2123828 2015028 1992234 2039152 2128732 2251128 2314389 2340539
14564B340539K59636m08902K80570o0501L62702j72865N59211l33332J69926J18767
$$ 2340539 2600175 2191273 2471843 2411342 2774044 2601179 3160390 2827058 2996984 3115751
14554C115751J32900M54673L39411J093933K030642K733561N874776P068095L811357
$$ 3115751 3248651 3703324 4042735 5136668 7167310 9900871 15775647 22843742 26655099
14545B6655099J85085o603096o724617n638878k866208j463675q90362k23496
$$ 26655099 26840184 20237088 13512471 7873593 5007385 3543710 2653348 2429852
14537B429852k10399k71123n1667J80512J61510k57911R5210L5554k6267J81344
$$ 2429852 2219453 1948330 1896663 2077175 2238685 1980774 2075984 2111538 2085271 2266615
14527B266615j46439j30614Q3784j36566L53731k20264K68480M41362n96056K04832
$$ 2266615 2120176 1989562 2073346 1936780 2290511 2070247 2338727 2780089 2184033 2388865
14517B388865k87742L06794j74877M10544m14971J97700J83635p9127J34660p4400
$$ 2388865 2101123 2407917 2233040 2643584 2228613 2426313 2609948 2530821 2665481 2591081
14507B591081K5821K17048J40691j63266K13229q0743j45943K47893L29297l41292
$$ 2591081 2616902 2833950 2974641 2811375 3024604 2943861 2797918 3045811 3375108 3033816
14497C033816K07918j75435M91478n13614K00906J57769r3488l15080J96953P1293
$$ 3033816 3241734 3066299 3557777 3044163 3245069 3402838 3309350 2994270 3191223 3262516
14487C262516L23201k29142K47854j27283J7396N37087p2592j925k82422L17120
$$ 3262516 3585717 3356575 3604429 3477146 3494542 4031629 3959037 3957112 3674690 3991810
14477C991810n38942O30471o7014L9994j35559j72470J69822L98169j06057p5048
$$ 3991810 3452868 4083339 4016325 4056319 3920760 3748290 3918112 4316281 4210224 4135176
14467D135176j67688J64352J14256N8050J22493r9649l4998K73054q5688J34234
$$ 4135176 3967488 4131840 4246096 4304146 4426639 4326990 4291992 4565046 4479358 4613592
14457D613592j33730L7509M89754j3652K62700n22154N3040L03155k43331K20837
$$ 4613592 4479862 4517371 5007125 4993473 5256173 4734019 4787059 5090214 4846883 5067720
14447E067720j17362K65660J30789o0085K01477J37918M0031j63988L55541k27116
$$ 5067720 4950358 5216018 5346807 5286722 5488199 5626117 5666148 5502160 5857701 5630585
14437E630585K1417J34079M88836m30311O10033l89174M74872j52319P5423J63933
$$ 5630585 5652002 5786081 6274917 5844606 6454639 6065465 6540337 6388018 6463441 6627374
14427F627374K55545n5004L17581j01115k75164L06015L75382q0096j29885J85691
$$ 6627374 6882919 6827915 7145496 7044381 6769217 7075232 7450614 7370518 7240633 7426324
14417G426324L47133J84232k16678j9739K50862L41636K3563J97386M44622K0647
$$ 7426324 7773457 7957689 7741011 7721272 7972134 8313770 8337333 8534719 8979341 8999988
14407H999988N0900j75585K83199K60604J38929J54470R2994k05059N32742J65406
$$ 8999988 9050888 8875303 9158502 9419106 9558035 9712505 9805499 9600440 10133182 10298588
14397A0298588k30008M76053L51687j00345Q0946J00984P53100k59675M44482
$$ 10298588 10068580 10544633 10896320 10795975 10876921 10977905 11731005 11471330 11915812
14388A1915812J46916j6194j66985Q78573k39750M39075K0212N74170M83378k14739
$$ 11915812 12062728 12046534 11879549 12758122 12518372 12957447 12977659 13551829 14035207 13820468
14378A3820468K96688K68864L39271N54935K95145K80572O653M79146P09405J09976
$$ 13820468 14117156 14386020 14725291 15280226 15575371 15855943 15862596 16341742 17051147 17161123
14368A7161123N40258j64720M81467N51970L69190O01636j17459N47585P24932
$$ 17161123 17701381 17536661 18018128 18570098 18939288 19540924 19423465 19971050 20695982
14359B0695982L15890M71538K62014O67552K97646Q90221N50467N12715M34919
$$ 20695982 21011872 21483410 21745424 22412976 22710622 23600843 24151310 24664025 25098944
14350B5098944R91507L31702N04157P98989M54480R90238Q37522M99020O52733
$$ 25098944 26090451 26422153 26926310 27725299 28179779 29170017 30007539 30506559 31159292
14341C1159292J358383O16363J192199Q67184J055815J079448P93984J061685
$$ 31159292 32517675 33134038 34326237 35193421 36249236 37328684 38122668 39184353
14333C9184353J407413J034159J527234J155804J282787J215222J777076J821258
$$ 39184353 40591766 41625925 43153159 44308963 45591750 46806972 48584048 50405306
14325E0405306J481990J630133J697638K118062J979728K520927J791196K096949
$$ 50405306 51887296 53517429 55215067 57333129 59312857 61833784 63624980 65721929
14317F5721929K898513K328341K901014K318008L390918L090059L222838L810892
$$ 65721929 68620442 70948783 73849797 76167805 79558723 82648782 85871620 89682512
14309H9682512L401027L869614M172115M338529M673075N175283M936806N857384
$$ 89682512 93083539 96953153 101125268 105463797 110136872 115312155 120248961 126106345
14301A26106345N491598O497262O470441P463494P286272Q018801Q239912R248937
$$ 126106345 131597943 138095205 144565646 152029140 159315412 167334213 175574125 184823062
14293A84823062R507538R956605J0621786J0923938J2089989J2213183J3216282
$$ 184823062 194330600 204287205 214908991 225832929 237922918 250136101 263352383
14286B63352383J3485091J4094849J4603136J4916415J5083249J5494349J5671667
$$ 263352383 276837474 290932323 305535459 320451874 335535123 351029472 366701139
14279C66701139J5258286J5107659J4405107J2825713R519230N179589K106211
$$ 366701139 381959425 397067084 411472191 424297904 433817134 438996723 441102934
14272D41102934j63563m946952k329325J169027j289513k371185j279236o448084
$$ 441102934 440939371 435992419 433663094 434832121 433542608 431171423 429892187 423444103
14264D23444103q591860j0354218j2102083j3641226j4997947j5738953j5885432
$$ 423444103 414852243 404498025 392395942 378754716 363756769 348017816 332132384
14257C32132384j5987791j5437974j5156571j4300566j3709057j3262051j2875548
$$ 332132384 316144593 300706619 285550048 271249482 257540425 244278374 231402826
14250B31402826j1795649j1344416j0960481r901036r227235q989212q188309
$$ 231402826 219607177 208262761 197302280 187401244 178174009 169184797 160996488
14243A60996488p533110p595907o934667o451092o271517n498167n374197m952354
$$ 160996488 153463378 145867471 138932804 132481712 126210195 120712028 115337831 110385477
14235A10385477m699957m272210m546699l864372l840862l501519l347998l233108
$$ 110385477 105685520 101413310 96866611 93002239 89161377 85659858 82311860 79078752
14227G9078752l078971k556911l004298k962531k340194k387201k090212j832924
$$ 79078752 75999781 73442870 70438572 67476041 65135847 62748646 60658434 58825510
14219E8825510k005982k084430j710001j565312j606466j732806j246699j891446
$$ 58825510 56819528 54735098 53025097 51459785 49853319 48120513 46873814 44982368
14211D4982368j037503j137309j332727j241122q83953r24630j401536q70234
$$ 44982368 43944865 42807556 41474829 40233707 39349754 38425124 37023588 36153354
14203C6153354j037578o52783q70355j076948n41792r61191r68394q11939m94855
$$ 36153354 35115776 34462993 33592638 32515690 31973898 31012707 30044313 29232374 28737519
14194B8737519n79183r08841o30396o86891n97879q41692j84804q86559l78088
$$ 28737519 28158336 27249495 26619099 25932208 25334329 24492637 24307833 23421274 23043186
14185B3043186n71642o24387n35029k07099p28684m16550l50120j32807l59563
$$ 23043186 22471544 21847157 21312128 21105029 20376345 19959795 19609675 19476868 19117305
14176A9117305n17144k48556m96506n19894N5412k76029q24250J90846m07502
$$ 19117305 18600161 18351605 17855099 17335205 17390617 17114588 16290338 16481184 16073682
14167A6073682k56758m28089k15291l33297k73315k5376m60002k72259k70994
$$ 16073682 15816924 15388835 15173544 14840247 14566932 14541556 14081554 13809295 13538301
14158A3538301k3728j92409r5044o59224O7921n36585j53342n8149k11874k95443
$$ 13538301 13514573 13322164 13227120 12567896 12635817 12099232 11945890 11887741 11675867 11380424
14148A1380424L9040K0863o45656L75978o14181k13040N1552m05704J44668o50170
$$ 11380424 11419464 11440327 10794671 11170649 10556468 10343428 10394980 9989276 10133944 9483774
14138I483774L13286n10958O8844O3991l60786l37044j96987L16160j19667n95128
$$ 9483774 9797060 9286102 9354946 9418937 9058151 8721107 8524120 8840280 8720613 8125485
14128H125485J03210k32220K07919m58613K9006j23823L0876q7083k68077q5929
$$ 8125485 8228695 7996475 8204394 7745781 7774787 7650964 7681840 7594757 7326680 7240751
14118G240751j81665J36132m49791L7045J45894k60737l3426K43877j38618n57839
$$ 7240751 7059086 7195218 6745427 6782472 6928366 6667629 6634203 6878080 6739462 6181623
14108F181623K73642j36263j40398n9159P4863j32511J18788l5577o6222k34333
$$ 6181623 6455265 6319002 6178604 6119445 6194308 6061797 6180585 6145008 6078786 5844453
14098E844453P1290m14332J76460l95005L29330j28927k2952L9821n47264K15249
$$ 5844453 5915743 5501411 5677871 5282866 5612196 5483269 5460317 5500138 4952874 5168123
14088E168123o2493m58605M08234o9759l40909L19492m52392J31399P7521l26851
$$ 5168123 5105630 4647025 5055259 4985500 4644591 4964083 4511691 4643090 4720611 4393760
14078D393760J96462N3228l87635O0971N5231l3173k32150J62994l27228q4111
$$ 4393760 4590222 4643450 4255815 4316786 4372017 4338844 4106694 4269688 3942460 3858349
14068C858349K36664k63862K78307m2259k89419m3312n3094R7174P7906O4823
$$ 3858349 4095013 3831151 4109458 4067199 3777780 3734468 3681374 3778548 3856454 3921277
14058C921277n24967K15568k08770K19965j35368n1675q43J03661k54960R637
$$ 3921277 3396310 3611878 3403108 3623073 3487705 3436030 3435187 3538848 3283888 3293525
14048C293525m6479k74173J78378l4180j9014J69217j00639j52484J06315P247
$$ 3293525 3247046 2972873 3151251 3117071 3098057 3267274 3166635 3014151 3120466 3127713
14038C127713o0890J13791k67010r8240m3734J52640R4711k2657k87588K48235
$$ 3127713 3066823 3180614 2913604 2815364 2771630 2924270 3018981 2996324 2708736 2956971
14028B956971j35441J85836m35332M0046k18648J09585Q9501L2189k48408J73168
$$ 2956971 2821530 3007366 2572034 2612080 2393432 2503017 2592518 2624707 2376299 2549467
14018B549467n3576q0028o1461K56305k83266K31490l61924K3412J88989m58753
$$ 2549467 2495891 2415863 2354402 2610707 2327441 2558931 2197007 2220419 2409408 1950655
14008A950655M01317j38657L57290l67951K75214N9113m96789J44943j14252J11962
$$ 1950655 2351972 2213315 2570605 2202654 2477868 2536981 2040192 2185135 2070883 2182845
13998B182845O0962J83029m46760L3576K11541n3678Q8785K26935J534118J727678
$$ 2182845 2243807 2426836 1980076 2013652 2225193 2171515 2260300 2487235 4021353 5749031
13988E749031M009022P506636N285813L488136l484402n538026n253376l877590
$$ 5749031 9758053 17264689 22550502 26038638 22554236 17016210 11762834 7885244
13980G885244k002910j113106p21985l61990j88151l76501m52536J40092m26550
$$ 7885244 5882334 4769228 4047243 3685253 3497102 3120601 2668065 2808157 2381607
13971B381607j45247L7669N9646k55324M70858j84276l32929L932j24550K86988
$$ 2381607 2236360 2274029 2333675 2078351 2549209 2364933 2032004 2035936 1911386 2198374
13961B198374K07308l10207k56320M73327k85765K33129k57497K8424l30900L52715
$$ 2198374 2405682 2095475 1839155 2312482 2026717 2259846 2002349 2030773 1699873 2052588
13951B052588j96558j14038m9740N13543j77160j07941K85085j88693J70781l38786
$$ 2052588 1856030 1741992 1692252 2205795 2028635 1920694 2205779 2017086 2187867 1849081
13941A849081j47460l70182N32031k57891L7244P1012o2596M9139k09264K66557
$$ 1849081 1701621 1331439 1863470 1605579 1642823 1713835 1651239 1700378 1491114 1757671
13931A757671J27191j78666j39297J57Q5325m82682M03616l7624m539J63939j26945
$$ 1757671 1884862 1706196 1566899 1567056 1652381 1169699 1573315 1535691 1531152 1695091 1568146
13920A568146k60844J12887J44448j71079L66524j04350j68047J80695n8463p5036
$$ 1568146 1307302 1420189 1564637 1393558 1760082 1655732 1487685 1668380 1609917 1534881
13910A534881M3443J34539K39977l27035l28290j52951M39407m46047L00623m97656
$$ 1534881 1578324 1712863 1952840 1625805 1297515 1144564 1583971 1137924 1438547 940891
13900I40891L60224J56759k68937L54457j95593k61729P1274n6132J3954K1206
$$ 940891 1301115 1457874 1188937 1543394 1347801 1086072 1157346 1101214 1115168 1136374
13890A136374j52148k4324J36387m3470K22630n24924J62305K12265O4453L02263
$$ 1136374 984226 959902 1096289 1052819 1275449 750525 912830 1125095 1189548 1491811
13880A491811l42945N4548p6229L64570o8806m55852j95295O38793l54950N0431
$$ 1491811 1148866 1203414 1127185 1491755 1422949 967097 771802 1410595 1055645 1106076
13870A106076j57916J66206k47926L38268q2455j46516j2797K0130K7237J14885
$$ 1106076 948160 1114366 866440 1204708 1122253 975737 962940 983070 1010307 1125192
13860A125192q7187L9405O9779L2850j61576m0256k12175L04882L1607j14157
$$ 1125192 1038005 1077410 1147189 1180039 1018463 978207 766032 1070914 1102521 988364
13850I88364K73607J20166k68249k67958J90692j61861Q6532j83252r6823K74420
$$ 988364 1261971 1382137 1113888 845930 1036622 874761 961293 778041 681218 955638
13840I55638q8717k90429L42589q0815j44930M16433m21274K89976R3112k94271
$$ 955638 866921 576492 919081 838266 693336 1109769 688495 978471 1071583 777312
13830G77312j67128K28686J10928L37096m76767l23594R0579K95290Q0482k43713
$$ 777312 610184 838870 949798 1286894 810127 486533 577112 872402 952884 709171
13820G09171L11478k91732Q6306J21720k32972J95065j26555J44974j65961p9990
$$ 709171 1020649 728917 815223 936943 703971 899036 772481 917455 751494 671504
13810F71504P4367P2283J67144k83678j93947Q7550J83870j87677L84729o4657
$$ 671504 745871 818154 985298 701620 507673 595223 779093 591416 976145 911488
13800I11488L9073o7221k56959L42246j15526j49850J43330L8167j03444K44988
$$ 911488 950561 883340 626381 968627 853101 703251 846581 884748 781304 1026292
13790A026292k62191j15298p8270M5005q165K76970l49022j77236K14398J74180
$$ 1026292 764101 648803 570533 615538 607373 884343 535321 358085 572483 746663
13780G46663k65963L20940B97357N32795k62337J2582j22796L40029k02734L4113
$$ 746663 480700 801640 297357 830152 567815 580397 457601 797630 594896 629009
13770F29009K9881q5473R740k7346K16072N7677j07499j12747j59172O6826n4010
$$ 629009 658890 573417 583157 555811 771883 829560 722061 609314 450142 516968 462958
13759D62958N2929O4635J79597r86n1848k02287L7602N543L2290N2942o5298K25158
$$ 462958 515887 580522 760119 759133 707285 504998 542600 548143 580433 633375 568077 793235
13747G93235j93284J10003o1725r5330j89816m3517M22322k8619k32017L30222
$$ 793235 599951 709954 648229 552899 363083 319566 741888 713269 481252 811474
13737H11474A71057N30300n2887j95794J65955k35731j34429J93314J61442J15455
$$ 811474 171057 701357 648470 452676 618631 382900 248471 441785 603227 718682
13727G18682j7688Q424l05351K64094K32903D01755R9392J77890J34931B42685
$$ 718682 700994 709418 404067 668161 901064 401755 501147 679037 813968 242685
13716E30087k58885M57555B33859M95266j34597l5974M2021L65981D05117K20301
$$ 530087 271202 728757 233859 729125 594528 558554 600575 966556 405117 625418
13706F25418J39880k13140A77932K46531J2615K5098q3136N3095j6969R0800L7346
$$ 625418 765298 552158 177932 424463 437078 462176 379040 432135 415166 505966 543312
13695E43312j54944K56587L2722C07147n0200P5638K04006o856L41068C79553
$$ 543312 388368 644955 677677 307147 256947 332585 536591 529735 870803 379553
13684E53712I3288O84346C88183L52868P852k88323A97723M14486j96117L62166
$$ 553712 93288 777634 388183 741051 748903 460580 197723 612209 416092 778258
13674G78258l46327J98393J68203k55305B66325q550K68138k4615P7692j63265
$$ 778258 431931 630324 798527 543222 266325 257775 525913 501298 578990 415725
13664D15725K6619n6585A34284N67294k19077o2059M2389j28324K96118B68014
$$ 415725 442344 385759 134284 701578 482501 420442 462831 334507 630625 268014
13653C26241P1390q5260q3320J63125J58127J33007r3269j73272E7367M13963
$$ 326241 397631 312371 229051 392176 550303 683310 590041 416769 57367 471330
13643D71330k18917Q9849j65834J93735J47956C8390N89640B67741M8283A50520
$$ 471330 252413 342262 176428 370163 518119 38390 628030 267741 316024 150520
13632B12711N56711B56090j20386Q8161J9171J49362J33961k24436j23161L25318
$$ 212711 769422 256090 135704 223865 243036 392398 526359 301923 178762 504080
13622E04080j285p3629k10102J37181M39576A77556R6521K15103q3549J40881
$$ 504080 502795 429166 219064 356245 795821 177556 274077 489180 405631 546512
13612E46512k09026K4005j41597p9783P8620R1498J49494J3572k268A00477L50616
$$ 546512 337486 361491 219894 140111 218731 310229 459723 473295 471027 100477 451093
13601D51093K81805k82700j7348j64090K31440k1849B15482L72365j76707A86434
$$ 451093 732898 450198 432850 268760 500200 478351 215482 587847 411140 186434
13590A5358N19638L5530j51399C9516M0567L68669K7279j8354j70325J76460A78801
$$ 15358 534996 570526 419127 39516 80083 448752 476031 457677 287352 463812 178801
13578B25226D172K57007K10361j96464J43259K5280j28669J53404A65839N07624
$$ 225226 4172 261179 471540 275076 418335 443615 314946 468350 165839 673463
13568F73463B81174q7639J13400L6778r2455E8923M29899A31536l262K69881l773
$$ 673463 281174 193535 306935 343713 251258 58923 488822 131536 128274 398155 394382
13557C94382I1301J68454J32368j39071P6084P1686O11I0796K43301K16018A40278
$$ 394382 91301 259755 392123 253052 329136 400822 401433 90796 334097 550115 140278
13545A42305M84558A88643J08468J96840k31207E1390L96983A11957A3269R872
$$ 142305 626863 188643 297111 493951 262744 51390 448373 111957 13269 23141
13535B3141N20791k07062k7997p395K06097B9794J78986J22284A13290O0228K25658
$$ 23141 543932 336870 308873 301478 507575 29794 208780 331064 113290 173518 399176
13524C99176r2677j05238J36413k0863p8145q02j8518j4366m0840J13463P5470
$$ 399176 306499 201261 337674 316811 238666 237864 219346 204980 164140 277603 353073
13513C53073j12046J50475G7776K14939q9767K4599j06138L50745j57523q6461
$$ 353073 241027 391502 77776 292715 202948 227547 121409 472154 314631 228170
13503B28170D3683J34549K25177a07336k299D32274j97825M6270M5464A40776
$$ 228170 43683 178232 403409 -107336 -109635 432274 234449 280719 326183 140776
13492E86540k87223q1062J0355J43098l1118A25811L4732G1060K35366M7202F5030
$$ 586540 299317 218255 228610 371708 340590 125811 160543 71060 306426 353628 65030
13480E75698k76420M2128m1315F1502O1056J8484Q5570D3983J49363D2115K73218
$$ 575698 299278 341406 300091 61502 122558 141042 226612 43983 193346 42115 315333
13469C15333A27865F1448J39358N6456F2392g4632D77407m4914j34424N6829o5033
$$ 315333 127865 61448 200806 257262 62392 -74632 477407 432493 298069 354898 289865
13458B89865K15320A29905J84692J75693H1697K4977J52497J06932r5864J03475
$$ 289865 505185 129905 314597 490290 81697 106674 259171 366103 270239 373714
13448C73714A32236L88502B15491a60143C82605o8726j12927J22751m716K38012
$$ 373714 132236 520738 215491 -160143 382605 313879 200952 323703 318987 556999
13438E56999a47621M2244A10215a21257A85295N2501k0402m3320R9131N0082q7044
$$ 556999 -147621 -105377 110215 -121257 185295 237796 217394 174074 273205 323287 236243
13427B36243H5768K2725J44020j07697D9228J6289E490L76475j33752a88574B43608
$$ 236243 85768 108493 252513 144816 49228 65517 5490 381965 248213 -188574 243608
13415D10677A06271M29151I0466J75205K76414k66806G9093O06327d6136E1913
$$ 410677 106271 535422 90466 265671 542085 275279 79093 685420 -46136 51913
13404B48132R3135j19564j739r2929a8087o7667A05344D5947O0665j2238j2908
$$ 248132 341267 221703 219964 127035 -18087 -85754 105344 45947 106612 94374 81466
13393H1466i8952A74466m1314m1423J4263k4788J60355Q4799D7121J18379J54785
$$ 81466 -98952 174466 133152 91729 105992 81204 241559 326358 47121 165500 320285
13382C20285K0818M110Q7032C9834J34390O021H6935a93330g8903C53672C0662
$$ 320285 341103 345213 432245 39834 174224 180245 86935 -193330 -78903 353672 30662
13370B31169O2745M2910K2074f819C21378N9735m3734j6800C9068J58796p2049
$$ 231169 293914 336824 358898 -6819 321378 381113 337379 320579 39068 197864 125815
13359A25815O5958L02094k00136H8482a4679B14235j6303C3257L53424G4628J78385
$$ 125815 191773 493867 293731 88482 -14679 214235 197932 33257 386681 74628 253013
13348B53013I3921b1549G1362b9786D1002L61398j69899c9773C12467G1164M00644
$$ 253013 93921 -21549 71362 -29786 41002 402400 232501 -39773 312467 71164 471808
13337D71808J15489B80585N2489a7376C56525j43563L6473K38903k22284J17288
$$ 471808 587297 280585 333074 -17376 356525 212962 249435 488338 266054 383342
13327C83342A1035b9373A80374q3988N82K20492j16894D3142M8784K10709R6991
$$ 383342 11035 -29373 180374 96386 96968 317460 200566 43142 91926 302635 399626
13316C99626A2206K13370J40378j42896l9334Q6751D6740I522J35190K3159b9760
$$ 399626 12206 225576 365954 223058 183724 270475 46740 9522 144712 167871 -29760
13304D48127A68979J4793J1585J4241B5193a7608j50263A37347a12273C13016
$$ 448127 168979 183772 195357 209598 25193 -17608 -167871 137347 -112273 313016
13293A63006a5033A05459a23984A30192L04368a28679M4369K8977A35655K50606
$$ 163006 -15033 105459 -123984 130192 434560 -128679 -84310 -55333 135655 386261
13283C86261a27271A5653K84978K17918c1891A26962P1253J00656e5563A66930
$$ 386261 -127271 15653 300631 518549 -31891 126962 198215 298871 -55563 166930
13272C38110B9261A0699b5769A53865J00341H3571K76776j35989l7036D1901b5148
$$ 338110 29261 10699 -25769 153865 254206 83571 360347 224358 187322 41901 -25148
13260A07081n0141j6418b4160B89147A16164K6802j6629a3794l1599E65425i2099
$$ 107081 56940 40522 -24160 289147 116164 142966 126337 -13794 -45393 565425 -92099
13248b75350D1364M09035k05282J1074A23232A3874i5130j51249K7265E4538J09710
$$ -275350 41364 450399 245117 256191 123232 13874 -95130 -246379 -219114 54538 164248
13237A64248E9239J94324G6662J10792K07351A46784l928C0299a7472H4073k3113
$$ 164248 59239 253563 76662 187454 394805 146784 142856 30299 -17472 84073 60960
13226F0960O3695M5179k513J65707a021A02686L5958a58158j49028I3103f5820
$$ 60960 124655 169834 167321 333028 -1021 102686 138644 -158158 -307186 93103 -65820
13214A00541K6491l8466b38220C34576J65779j32293j21465l3103k6944d6963
$$ 100541 127032 88566 -238220 334576 500355 368062 246597 213494 186550 -46963
13203B10019B6943g4423H0366d2728G38L7275L08072a3240I4835C7728J2209b42122
$$ 210019 26943 -74423 80366 -42728 738 38013 346085 -13240 94835 37728 49937 -242122
13190c7273A14368j2269l3964J45767E4416j6564b1455C19167i1330J5014D2498
$$ -37273 114368 102099 68135 213902 54416 37852 -21455 319167 -91330 -76316 42498
13178C1883b32997C9931d040I8670L2055J84977j43913m7487j6812m6632J03538
$$ 31883 -232997 39931 -4040 98670 130725 315702 171789 124302 107490 60858 164396
13167A64396B6421J48448J9976a43119G9130a07598p3157A47778k0705J12626
$$ 164396 26421 174869 194845 -143119 79130 -107598 -180755 147778 127073 239699
13157B39699g8258A8284K12557J8872a09196M8518A97058E7582J152J20456b0879
$$ 239699 -78258 18284 230841 249713 -109196 -60678 197058 57582 58734 179190 -20879
13145b81610e5098G7536a8338B35458a43146C17719C0951J52789j1101D5735b95025
$$ -281610 -55098 77536 -18338 235458 -143146 317719 30951 183740 172639 45735 -295025
13133d0057B53518p7523G4648R4773H1599J17716c3873A70412E2337O6862c2294
$$ -40057 253518 175995 74648 169421 81599 199315 -33873 170412 52337 119199 -32294
13121b1091A7923L35817F3337O5272L5320b63405C63540A73539C5584J49013J62671
$$ -21091 17923 353740 63337 128609 163929 -263405 363540 173539 35584 184597 347268
13110C47268c7882l0615l2453B71108A06981b0848E843a3684p3025I5873K47783
$$ 347268 -37882 -68497 -100950 271108 106981 -20848 5843 -13684 -86709 95873 343656
13099C43656j54480l7234Q3326b68185i7310c1164A36812h0900D8374h0310A87865
$$ 343656 189176 151942 235268 -268185 -97310 -31164 136812 -80900 48374 -80310 187865
13087i3185I0903K2664D5836j1411N8508b940B8828b6724A41157D3042K22162
$$ -93185 90903 113567 45836 34425 92933 -2940 28828 -26724 141157 43042 265204
13076B65204c52666A60547J71848b3624A24075a43406d5585b936A2961K19974
$$ 265204 -352666 160547 332395 -23624 124075 -143406 -45585 -2936 12961 232935
13066B32935B9963P838a61924A39139Q3626j07300R1912b22425F228K69184E4939
$$ 232935 29963 37801 -161924 139139 222765 115465 207377 -222425 6228 275412 54939
13054a22896C7779d087j24971H9116b36432A00159e2214C0896c8924A75902a08573
$$ -122896 37779 -4087 -129058 89116 -236432 100159 -52214 30896 -38924 175902 -108573
13042e5358J5073A33417l0736Q5445a13491G8422J11161c3841D11398A26766d368
$$ -55358 -40285 133417 102681 188126 -113491 78422 189583 -33841 411398 126766 -4368
13030B83334A37395n4490K63079j13401j07494F0987c2546C4948P3908J75286
$$ 283334 137395 82905 345984 232583 125089 60987 -32546 34948 108856 284142
13020B84142n3564J44568j23392a07959A13910Q4820G4382l390L1482M1766J04926
$$ 284142 230578 375146 251754 -107959 113910 198730 74382 70992 102474 144240 249166
13009B49166C3872P4532K8909J04632b68491O1882A83554O4771c8725J3491k80153
$$ 249166 33872 108404 137313 241945 -268491 -206609 183554 248325 -38725 -25234 -305387
12998c05387B08353a44146A20351i6696n2707D2860i4861D9114J73999b45854
$$ -305387 208353 -144146 120351 -96696 -149403 42860 -94861 49114 223113 -245854
12987f8452j93260m7388B24726C5940J65019B1218g2811H0887K67259i4034C7790
$$ -68452 -261712 -309100 224726 35940 200959 21218 -72811 80887 348146 -94034 37790
12975H6403a95690A38650J57595D876K31874k1160D4339c1044J4554q1347I9845
$$ 86403 -195690 138650 296245 4876 236750 215590 44339 -31044 -16490 -97837 99845
12963B43945I2028a00337d2370k058q5894D53549a68902A39572K12828A28733
$$ 243945 92028 -100337 -42370 -44428 -130322 453549 -168902 139572 352400 128733
12952g2544r6674G655L2870J44963e7973A02640I919K74213a74822C09974d1193
$$ -72544 -169218 7655 40525 185488 -57973 102640 9919 284132 -174822 309974 -41193
12940B12099g0652A64954a10605A46290a07724A40736B709J85484g3504M278J4985
$$ 212099 -70652 164954 -110605 146290 -107724 140736 2709 188193 -73504 -69226 -54241
12929e4241A25071B0059J86986d8050B9739M5235N4650a81473E0991d2290H5182
$$ -54241 125071 20059 207045 -48050 29739 74974 129624 -181473 50991 -42290 85182
12917B7823a2182A45518e9541A76045d8811E6667J46757a31746A64548a34570
$$ 27823 -12182 145518 -59541 176045 -48811 56667 203424 -131746 164548 -134570
12906c20890a00680E0115K61526I2356a72281Q1634B96177I8960a17853m0331
$$ -320890 -100680 50115 311641 92356 -172281 -90647 296177 98960 -117853 -158184
12896a58184j33910c3665A01759g4305k33815A76079e2319H5514A6958f6967B0567
$$ -158184 -292094 -33665 101759 -74305 -308120 176079 -52319 85514 16958 -66967 20567
12884A46430a85869C10444a76889A75427M4768b2042D9908a02393j29103E7303
$$ 146430 -185869 310444 -176889 175427 220195 -22042 49908 -102393 -231496 57303
12873B82090q6188a60390f3714l50509b1198h41r4618L9445C79227A02244g0431
$$ 282090 195902 -160390 -63714 -414223 -21198 -841 -95459 -56014 379227 102244 -70431
12861b07708f8720r871B1367J55173L103b21230R2691m0081C15307a52732G2952
$$ -207708 -68720 -78591 21367 176540 179643 -221230 -128539 -168620 315307 -152732 72952
12849H7588F997P6459R0948q2217a69198A7423L4527Q5074b2405B24855b81433
$$ 87588 6997 83456 174404 92187 -169198 17423 51950 137024 -22405 224855 -281433
12837F0289a68591F6936P1096c0364k59689B12228D6240K09467q8299J98311a34406
$$ 60289 -168591 66936 138032 -30364 -290053 212228 46240 255707 167408 365719 -134406
12825C15412i9274d549A76501G6252N7034c11801A41304B8777b32644b1623A63083
$$ 315412 -99274 -4549 176501 76252 133286 -311801 141304 28777 -232644 -21623 163083
12813b4623B6849P2417i5821p5808B08011j01718j1136J07691i6904p4282C9327
$$ -24623 26849 99266 -95821 -171629 208011 106293 95157 202848 -96904 -171186 39327
12801b02182j24704J03191n8636c9694B3302M2304i400H3711c8704F9826M8319
$$ -202182 -326886 -223695 -282331 -39694 23302 65606 -9400 83711 -38704 69826 118145
12790A18145P318d1473j00061A98182f2305A68910J23311G3842f3702D1220a87140
$$ 118145 125463 -41473 -141534 198182 -62305 168910 292221 73842 -63702 41220 -187140
12778B25913f735q0829j34040B60141A3116K2836L6835e0653J7941A24721b50269
$$ 225913 -6735 -87564 -221604 260141 13116 35952 72787 -50653 -32712 124721 -250269
12766c03036J46302A7054M2974L5367M0148O7231B5365d9788I9520B2893a2231
$$ -303036 -156734 17054 60028 95395 135543 202774 25365 -49788 99520 22893 -12231
12754E3225h9075c5934B4099b94854A20c95451a0882j85539I3964b32920f8355
$$ 53225 -89075 -35934 24099 -294854 120 -395451 -10882 -196421 93964 -232920 -68355
12742a18138l18926A21349J47922i3336A69317n79J60404m1720j00898g5872k6773
$$ -118138 -437064 121349 269271 -93336 169317 168738 329142 287422 186524 -75872 -102645
12731a02645B67106F4927b90044f0433A71284J01383n8964j01256m598k0365E180
$$ -102645 267106 64927 -290044 -60433 171284 272667 213703 112447 107849 87484 5180
12719h9262c8879j72634I0165J38500a84655k13970C5169f605k57986B34907B4244
$$ -89262 -38879 -211513 90165 228665 -184655 -398625 35169 -6605 -264591 234907 24244
12707B49378i1975D97714A51569g4540j3302A33246H972J47587j9230g8505C57934
$$ 249378 -91975 497714 151569 -74540 -87842 133246 8972 156559 137329 -78505 357934
12695B96385b48667Q0166A81791a30911E9115b12615A06884l7824K79918a53678
$$ 296385 -248667 -168501 181791 -130911 59115 -212615 106884 69060 348978 -153678
12684d7752m4775l6831L0390j43407A89989i1424F0296k5727g4709I0962K50913
$$ -47752 -92527 -129358 -98968 -242375 189989 -91424 60296 34569 -74709 90962 341875
12673C41875R8384D7387J83796m7555b13940K9256A40264a61098F6441J35217
$$ 341875 440259 47387 231183 183628 -213940 -184684 140264 -161098 66441 201658
12663B01658F1270a68834F2065e418I798b67889B32598j05340Q6524a66791G3632
$$ 201658 61270 -168834 62065 -5418 9798 -267889 232598 127258 213782 -166791 73632
12651B58139a22328G3528i9060B02888E7754a26226D0692h0835A76339r488R8243
$$ 258139 -122328 73528 -99060 202888 57754 -126226 40692 -80835 176339 166851 265094
12640B65094I0251a90373B57477p1038p2364K97879c9340o2981I4599G693J83439
$$ 265094 90251 -190373 257477 186439 114075 411954 -39340 -102321 94599 7693 191132
12629A91132b13476f9762A19464P1811D1907L10662a28167a2049m6678E8487a74687
$$ 191132 -213476 -69762 119464 191275 41907 352569 -128167 -12049 -58727 58487 -174687
12617a2742A7490L58535A32893a88114k34281M7556A38804a24536B83228o9119
$$ -12742 17490 376025 132893 -188114 -422395 -374839 138804 -124536 283228 214109
12607B14109D0644b57431a23124j4048B95091g6239A82125B9791J78584L90922
$$ 214109 40644 -257431 -123124 -137172 295091 -76239 182125 29791 208375 599297
12597E99297b74545B68262a77284A60586h9896a9139I7685a24931J0739F8150
$$ 599297 -274545 268262 -177284 160586 -89896 -19139 97685 -124931 -114192 68150
12586H9911k9010P8011K68433a43456k0553A16966j9286a24123a6613H5269c5816
$$ 89911 60901 138912 407345 -143456 -164009 116966 97680 -124123 -16613 85269 -35816
12574A73875p9668b92748D1965J94883e0451j55574M1211F3535g0170p8651N4910
$$ 173875 94207 -292748 41965 236848 -50451 -206025 -164814 63535 -70170 -148821 -93911
12563i3911K1974C271a36072C28205A21003a11105j2134A3155b38407B0894d9471
$$ -93911 -71937 3271 -136072 328205 121003 -111105 -123239 13155 -238407 20894 -49471
12551i328q6779k03557F2003d3839j5431k34321C10597B9502J38098F1628K46763
$$ -9328 -96107 -299664 62003 -43839 -59270 -293591 310597 29502 167600 61628 308391
12540C08391j33964D2075a82748b7101q0906B95955b6110B48228j06235D9222
$$ 308391 174427 42075 -182748 -27101 -108007 295955 -26110 248228 141993 49222
12529A7894J7789j1095a52266I8119R2370k4927A4593N6828R0266G4054b42142
$$ 17894 35683 24588 -152266 98119 190489 165562 14593 71421 161687 74054 -242142
12517B19726e7951l07734A28917c4160l06904G6318l5979b45094J20010a7854
$$ 219726 -57951 -365685 128917 -34160 -341064 76318 40339 -245094 -125084 -17854
12506f067B52669i1573D7272K67913F9844J23996R4a9799k07129B67669q7520
$$ -6067 252669 -91573 47272 315185 69844 193840 193934 -19799 -226928 267669 180149
12495A80149M4315N8244c17729A72803d7932j63355i6613A04560d8923G2666a59497
$$ 180149 224464 282708 -317729 172803 -47932 -211287 -96613 104560 -48923 72666 -159497
12483B0407J26233a87440f922n540B5479H801a5717o6511a0704A61139i3000i199
$$ 20407 146640 -187440 -6922 -12462 25479 8801 -15717 -82228 -10704 161139 -93000 -9199
12470D8632J92322a49060C0093K65920D0181J59443m8816D6473K29494f1209A46715
$$ 48632 240954 -149060 30093 296013 40181 199624 150808 46473 275967 -61209 146715
12458E2837L5471a01774j76393A27351A7102N9738c78354J88506B48779C2549
$$ 52837 88308 -101774 -278167 127351 17102 76840 -378354 -189848 248779 32549
12447b2399k62800A77311P3840G392J62259d2978B3129L5623N498C1930O4730
$$ -22399 -285199 177311 251151 7392 169651 -42978 23129 58752 64250 31930 96660
12436I6660J05863h2506k91511J43644B12399E5901J0270d9848D7062a55600d2766
$$ 96660 202523 -82506 -374017 -230373 212399 55901 66171 -49848 47062 -155600 -42766
12424A27612B7581R7748J9511J03732D4956J21391I985b31448j15681b6247j25643
$$ 127612 27581 125329 144840 248572 44956 166347 9985 -231448 -347129 -26247 -151890
12413a51890k83723K13601C9273c81619A18228b52024g3404k46198a55823F6188
$$ -151890 -435613 -222012 39273 -381619 118228 -252024 -73404 -319602 -155823 66188
12402I4536d7161A5568K68931F580a36470l11614a10391m1049P048j15236N2414
$$ 94536 -47161 15568 284499 6580 -136470 -448084 -110391 -151440 -144392 -259628 -207214
12391b07214B23401J54207j07768h5393n8125i109A64161J9044A6837b51479m8613
$$ -207214 223401 377608 269840 -85393 -143518 -9109 164161 183205 16837 -251479 -300092
12380c00092J44492A00224j2868k8828a01978M8703k57460B09075c50408E5894
$$ -300092 -155600 100224 87356 58528 -101978 -53275 -310735 209075 -350408 55894
12369G9971E003b431k20134j00597J32948a8088p4939C14831i9900A0639e6995
$$ 79971 5003 -2431 -222565 -323162 -190214 -18088 -93027 314831 -99900 10639 -56995
12357f84C87382a38230j52064g8978B05674b719B37032Q4291a05386C21148I743
$$ -684 387382 -138230 -290294 -78978 205674 -2719 237032 321323 -105386 321148 9743
12345a9079o1058B86234d9675K2560I718J81288l0963a19587l0545N6048q661
$$ -19079 -80137 286234 -49675 -27115 9718 191006 160043 -119587 -150132 -94084 -102745
12334a02745A36159o4202L1602a26596n3663j75494G4647b46418Q1067A85137
$$ -102745 136159 71957 103559 -126596 -180259 -355753 74647 -246418 -165351 185137
12323b83519H1593b17129R3730k68910B15792q5445f0755A99783d0042C3372A1241
$$ -283519 81593 -217129 -123399 -392309 215792 130347 -60755 199783 -40042 33372 11241
12311i1982A76085c04654A69210l9480g5962A27933c32557A10678a88167j79729
$$ -91982 176085 -304654 169210 129730 -75962 127933 -332557 110678 -188167 -367896
12301c67896A98480E5736J39811a12589j29622B98393d7857B65800j23355b0716
$$ -367896 198480 55736 195547 -112589 -242211 298393 -47857 265800 142445 -20716
12290A36391B8770L1413c1599C17399r8710m9306a49796A93835C2959J70202O3369
$$ 136391 28770 60183 -31599 317399 218689 169383 -149796 193835 32959 203161 266530
12279B66530i6309q1542B42495D3273a96414f6359P187G0374J65811l3360e7900
$$ 266530 -96309 -177851 242495 43273 -196414 -66359 -59172 70374 236185 202825 -57900
12267A49773a50450A65187a29593I870J60057e5940D6467a02056j15614a4914
$$ 149773 -150450 165187 -129593 9870 169927 -55940 46467 -102056 -217670 -14914
12256B12365A7506c195F3668K76638A49274c04965b9352A05291b05832C65710
$$ 212365 17506 -3195 63668 340306 149274 -304965 -29352 105291 -205832 365710
12245D8348K88060k2769j15695G332c30176i974j38153j11703A95387c9538J2847
$$ 48348 336408 313639 197944 7332 -330176 -9974 -148127 -259830 195387 -39538 -26691
12234b6691A21831J9350F5095A9359K27327e0623B35586d1479A41330a1063B34361
$$ -26691 121831 141181 65095 19359 246686 -50623 235586 -41479 141330 -11063 234361
12222D02943j47707I1142J46138A03352J85592J17039j86326G3624Q0330l1264
$$ 402943 255236 91142 237280 103352 288944 405983 219657 73624 153954 122690
12212A22690b12854i5960B0318e8158C5632f3442C9651a48552A83604k2850O5892
$$ 122690 -212854 -95960 20318 -58158 35632 -63442 39651 -148552 183604 160754 226646
12201B26646n8396M847J42200a24733A01413f0955C56258a33634c7414C44222
$$ 226646 168250 173097 315297 -124733 101413 -60955 356258 -133634 -37414 344222
12190H6481J34220f0998j72281d6336h127A74585f3559A47621J19730R8927N2880
$$ 86481 220701 -60998 -233279 -46336 -8127 174585 -63559 147621 267351 366278 419158
12179D19158i3362B48868C4481G56J34330b42747A85918J7284B1161M79443C3057
$$ 419158 -93362 248868 34481 756 135086 -242747 185918 203202 21161 500604 33057
12167B7191J11095O3304i9429B42327L08738d4693B12094A6655J8359a28135G60
$$ 27191 138286 201590 -99429 242327 551065 -44693 212094 16655 35014 -128135 760
12155a14749j26441o2542i1583A97162c22894A87683M1405c33385B467d2373g345
$$ -114749 -241190 -303732 -91583 197162 -322894 187683 229088 -333385 2467 -42373 -7345
12143A4679g5598G3637A8013i3174C75113H0119h0530j66599A04917f8408C40047
$$ 14679 -75598 73637 18013 -93174 375113 80119 -80530 -247129 104917 -68408 340047
12131a27171F4731h2061k23540F3888A7190a60234f1709p3185g196j46889E748
$$ -127171 64731 -82061 -305601 63888 17190 -160234 -61709 -134894 -7196 -154085 5748
12119g48j07254L0139c4042B09080A01232K6669b11089A56152J61346c8354B08695
$$ -748 -108002 -77863 -34042 209080 101232 127901 -211089 156152 317498 -38354 208695
12107a47790A62543a10870M8271a7592l16554g9483D117f5728A60830o858a38297
$$ -147790 162543 -110870 -62599 -17592 -334146 -79483 4117 -65728 160830 153972 -138297
12095a0324k21729A6886O3743J06109a02035L4264j60682O9789C73526j03092
$$ -10324 -232053 16886 80629 186738 -102035 -67771 -228453 -158664 373526 270434
12085B70434r9688i4323C60645A44123C4471a29013A54783e4608p1601K5931F6746
$$ 270434 170746 -94323 360645 144123 34471 -129013 154783 -54608 -126209 -100278 66746
12073A53299l4914J29722B1783e6851k63852a26242A47388b69761D8677J72258
$$ 153299 118385 248107 21783 -56851 -320703 -126242 147388 -269761 48677 220935
12063B20935c37740a1170j9825G1980g0321A89436M8981m705i5985G1857a43099
$$ 220935 -337740 -11170 -30995 71980 -70321 189436 238417 233712 -95985 71857 -143099
12051b12769F4122h8588B5757O5038a86151A79577p288L6364l4214M13596j81865
$$ -212769 64122 -88588 25757 90795 -186151 179577 172289 208653 174439 588035 406170
12040D06170L91866k01400B03717J51721l3494b10213B39378c31428d5545o0372
$$ 406170 798036 596636 203717 355438 321944 -210213 239378 -331428 -45545 -105917
12030a05917B10889h905H615K93686g6337a6476B40267c28451f4062D8372J6563
$$ -105917 210889 -8905 8615 302301 -76337 -16476 240267 -328451 -64062 48372 64935
12019F4935a01108A20232Q6105c82197H8003a31951j02817B7173a49431K5131
$$ 64935 -101108 120232 206337 -382197 88003 -131951 -234768 27173 -149431 -124300
12009a24300q9216B31241q6598l761b1463m0371B08745b85826o7408A87899K5217
$$ -124300 -213516 231241 144643 140882 -21463 -61834 208745 -285826 -353234 187899 213116
11998B13116F3738a98913G4257G17d96988c7332p4804r6555N9553I9855b47330
$$ 213116 63738 -198913 74257 717 -496988 -37332 -112136 -208691 -149138 99855 -247330
11986a40852a4363E3634a78833A26836d9282j21813F4774d8282j1449j786j83783
$$ -140852 -14363 53634 -178833 126836 -49282 -171095 64774 -48282 -59731 -61517 -245300
11975b45300C0410J85721p4696d6191B28852b01216g0051m8026C62675a28871
$$ -245300 30410 216131 141435 -46191 228852 -201216 -70051 -118077 362675 -128871
11964c9076A19614b56802i0423H5570a3D8313A9147c02070j44911g6736B64182
$$ -39076 119614 -256802 -90423 85570 -13 48313 19147 -302070 -446981 -76736 264182
11952B39131c54565b9097B18210A03049H667c023j54392c2593a0585j25424F6842
$$ 239131 -354565 -29097 218210 103049 8667 -3023 -157415 -32593 -10585 -136009 66842
11940E8714M7194J14649a93923C2436b25653H0290b42508k2978p6241g1909j29695
$$ 58714 105908 220557 -193923 32436 -225653 80290 -242508 -265486 -341727 -71909 -201604
11929b01604N1974a5839A31823J9198a11124C8766b2005B9750a15005B72115b9994
$$ -201604 -149630 -15839 131823 151021 -111124 38766 -22005 29750 -115005 272115 -29994
11917B7244b34045B65266a99924i049l30513g3496p2363j78741F1410O2668a18432
$$ 27244 -234045 265266 -199924 -9049 -339562 -73496 -145859 -324600 61410 124078 -118432
11905g5953A57831c41733A79679i3090A98242c9836j90368a7620C0478J17976
$$ -75953 157831 -341733 179679 -93090 198242 -39836 -230204 -17620 30478 148454
11895A48454a42297A90763b8560l510F2280a63071A9629a06021k324C2594a42366
$$ 148454 -142297 190763 -28560 -32070 62280 -163071 19629 -106021 -108345 32594 -142366
11883a17478B31794d05852a35616B49850o5312c792j07115C67757c47889R1811
$$ -117478 231794 -405852 -135616 249850 184538 -3792 -110907 367757 -347889 -256078
11873b56078b4723k66193a5165D9223J051A0355a18431O812e5139b994n6267C31608
$$ -256078 -24723 -290916 -15165 49223 50274 10355 -118431 -111619 -55139 -2994 -59261 331608
11860d5732j52485e2067k09694B00262c56078C04526d7852p773K2507l23151g8367
$$ -45732 -198217 -52067 -261761 200262 -356078 304526 -47852 -55625 -33118 -356269 -78367
11848C50407A15721g1036k39178k8007J67270n7506B59621a33946e1901f281H6017
$$ 350407 115721 -71036 -310214 -338221 -170951 -228457 259621 -133946 -51901 -6281 86017
11836a81787B79581f183j62334j8480B80684q5900b28928A15983a96388K3242
$$ -181787 279581 -6183 -168517 -186997 280684 194784 -228928 115983 -196388 -173146
11826a73146M6235a7512p8839E5020j9028J1848R4203a39744j82256E0704j7291
$$ -173146 -126911 -17512 -96351 55020 35992 47840 142043 -139744 -322000 50704 33413
11815C3413J62326a32847k89335f8327A30285d95051A553e00303D4950e6591r3103
$$ 33413 195739 -132847 -422182 -68327 130285 -495051 1553 -500303 44950 -56591 -149694
11804a49694A08021d8240D3066a07166A95496o9221C5881K79184c22014a3910
$$ -149694 108021 -48240 43066 -107166 195496 126275 35881 315065 -322014 -13910
11793a57573A96889q2121f5195l91535b24988n130a4092A36646C5003d6793C0579
$$ -157573 196889 114768 -65195 -456730 -224988 -230118 -14092 136646 35003 -46793 30579
11781h4152p6084P393A25033a3007B06928a43068A27604a3658j62532b388r0540
$$ -84152 -160236 -152843 125033 -13007 206928 -143068 127604 -13658 -176190 -2388 -92928
11770i2928o595A82824b3272F434a44841A12631c7852l63557a15202a8676q7200
$$ -92928 -99523 182824 -23272 6434 -144841 112631 -37852 -401409 -115202 -18676 -105876
11759a05876n1641f1450B05345E0549L511j5140b47108Q3194j9140K9672M2772
$$ -105876 -157517 -61450 205345 50549 54060 38920 -247108 -163914 -183054 -153382 -110610
11748a10610j92750J17823o6685g5834m5175a2396j40502C01369i3463B53635
$$ -110610 -303360 -185537 -252222 -75834 -121009 -12396 -152898 301369 -93463 253635
11737A84907L6519a03970j35286N5125Q4318A86017a74413k03924h7560A46415
$$ 184907 221426 -103970 -239256 -184131 -99813 186017 -174413 -378337 -87560 146415
11726B33569e9853m516k74885j6570A12216b8507F4596O5475A3153J23199i5072
$$ 233569 -59853 -64369 -339254 -355824 112216 -28507 64596 130071 13153 136352 -95072
11714E6896c3774k8573B51330j18015i0100k5442B93570r1111i4027j4170I4634
$$ 56896 -33774 -62347 251330 133315 -90100 -115542 293570 202459 -94027 -108197 94634
11702d17376h6917A49673K2141i1896F2798P1209a9379j52111L4387e8526G0121
$$ -417376 -86917 149673 171814 -91896 62798 134007 -19379 -171490 -137103 -58526 70121
11690B74562l4099p5681K67712i2269A98597h6281j64811i1637D9000J76915c26430
$$ 274562 240463 164782 432494 -92269 198597 -86281 -251092 -91637 49000 225915 -326430
11678A1513a54541A89486G7616K89182E1662b48892j59136h2717A09274a95142
$$ 11513 -154541 189486 77616 366798 51662 -248892 -408028 -82717 109274 -195142
11667A45931a99075D1939d877A29100b36451j46074G4690c8361D0377a8411G6891
$$ 145931 -199075 41939 -4877 129100 -236451 -382525 74690 -38361 40377 -18411 76891
11655a72762D0747a26187a9123n2114j40212B71885a30798B41172a63358b9091
$$ -172762 40747 -126187 -19123 -71237 -211449 271885 -130798 241172 -163358 -29091
11644B09114a76320D784J47872p3062c5778I382f0276m3066m85B44529h4809A26696
$$ 209114 -176320 4784 152656 79594 -35778 9382 -60276 -103342 -103827 244529 -84809 126696
11631b77434a1766k35076i8931C41907B3853e8719j54495H229b42431K8117A51563
$$ -277434 -11766 -246842 -98931 341907 23853 -58719 -213214 8229 -242431 -214314 151563
11619b10807A28297K150a72792a1837G531O5799A3075b60504P6684D0837b81442
$$ -210807 128297 130447 -172792 -11837 7531 73330 13075 -260504 -183820 40837 -281442
11607i2062A76741h4354A0788b75227a36092R838A95515i657B4934O7365k906
$$ -92062 176741 -84354 10788 -275227 -136092 -126254 195515 -9657 24934 92299 89393
11596H9393O4288h0429G0853d7771n763r1107A48116a69355O9360A68182b5386
$$ 89393 153681 -80429 70853 -47771 -53534 -144641 148116 -169355 -99995 168182 -25386
11584a38458j61480n588J03245A52893a84964I8411L09975a67033b1964k22526
$$ -138458 -299938 -305526 -202281 152893 -184964 98411 408386 -167033 -21964 -244490
11574b44490B94057M630a32783L8707k3825A10035h1822C2949a08718A62985l4285
$$ -244490 294057 298687 -132783 -94076 -117901 110035 -81822 32949 -108718 162985 128700
11563A28700b56736C38916D5934J37120a03535J8944a8055A21051C5551L18030
$$ 128700 -256736 338916 45934 183054 -103535 -84591 -18055 121051 35551 353581
11553C53581B3834i99q3386l405A25550F1017J2172J5742K9K22567D9072j2266
$$ 353581 23834 -999 -84385 -87790 125550 61017 73189 88931 88960 311527 49072 36806
11541C6806b21287A50748a29125j73566d8559H8358j703J34813a2758B24944j11926
$$ 36806 -221287 150748 -129125 -302691 -48559 88358 86655 221468 -12758 224944 113018
11530A13018J02098c6989B21729K525b31466i6645D5729c8187I6543h809B39207
$$ 113018 215116 -36989 221729 224254 -231466 -96645 45729 -38187 96543 -8809 239207
11518B67407a67965B98848A12981a21142j07983C9325b73095C90090A0053K35346
$$ 267407 -167965 298848 112981 -121142 -229125 39325 -273095 390090 10053 245399
11508B45399I7061N6244k0500E5684b7249A22117a58882A18123b63740G7206K52301
$$ 245399 97061 153305 132805 55684 -27249 122117 -158882 118123 -263740 77206 329507
11497C29507L9870c6229o8748E9713R378N0377k9766k8186i410D0353b30081F8472
$$ 329507 369377 -36229 -104977 59713 69091 119468 89702 61516 -9410 40353 -230081 68472
11484B47663J87556E8264K54701B9624a1384I9244k9156a33705k68508a60778
$$ 247663 435219 58264 312965 29624 -11384 99244 70088 -133705 -402213 -160778
11473I4098Q4966C0423L95297d5481J6276k48023A83875P2970i0729C49377d3891
$$ 94098 179064 30423 425720 -45481 -29205 -277228 183875 256845 -90729 349377 -43891
11461b17599B49777a88255A26379b9261H9878J12561J59931f9773K2289B11283
$$ -217599 249777 -188255 126379 -29261 89878 202439 362370 -69773 -47484 211283
11450C44742c3549B50779p5539B858K68064j04709J37883G4676N899B6458J26002
$$ 344742 -33549 250779 175240 2858 270922 166213 304096 74676 80575 26458 152460
11439A52460l7280E7442E352K17435r7468R3927f818j24595A30517j6477c64924
$$ 152460 115180 57442 5352 222787 125319 219246 -6818 -131413 130517 114040 -364924
11427c9076A04799b1045G2481a36636j94450A56862A6886e1694G659a559j9470
$$ -39076 104799 -21045 72481 -136636 -331086 156862 16886 -51694 7659 -1559 -21029
11416b1029E56K95688b51593j38136a52958a3287A10956l7345b50835B24575E0252
$$ -21029 556 296244 -251593 -389729 -152958 -13287 110956 73611 -250835 224575 50252
11404B38157p4244c61150e1460K2257C12769p7129B6307g6198C1889K73738e414
$$ 238157 163913 -361150 -51460 -29203 312769 235640 26307 -76198 31889 305627 -5414
11392e6912B79784D6306P3647h8330m6670E51212c59526A2175R4805f5305A07359
$$ -56912 279784 46306 119953 -88330 -135000 551212 -359526 12175 106980 -65305 107359
11380a24625E7528I242a67130d0706o4876p444n263A17505A9725a37813c903A29951
$$ -124625 57528 9242 -167130 -40706 -105582 -113026 -118289 117505 19725 -137813 -3903 129951
11367a60526G38i17B30720b09363d8535m3202c4663l74658b02233g9732A22519
$$ -160526 738 -917 230720 -209363 -48535 -91737 -34663 -409321 -202233 -79732 122519
11355B75d0766p8964D2967a88232A03228g8811o3631A12117N6023B1852b7398
$$ 275 -40766 -119730 42967 -188232 103228 -78811 -142442 112117 168140 21852 -27398
11343E2295g2476A04636J074A2463J9420a64216f7829m24789c6581j84311G8391
$$ 52295 -72476 104636 105710 12463 31883 -164216 -67829 -492618 -36581 -220892 78391
11331a74400P2954B973M5747J19801b01149N8649k02272e2956B8269a54354D6885
$$ -174400 -101446 2973 48720 168521 -201149 -142500 -344772 -52956 28269 -154354 46885
11319A31141a43182j34450B31181B3776c2761l8203E1804a72039j41163a48311
$$ 131141 -143182 -277632 231181 23776 -32761 -70964 51804 -172039 -313202 -148311
11308a67267C054P838a69512A13779a05690j40823F7517b67591n4688D50609a19698
$$ -167267 3054 10892 -169512 113779 -105690 -246513 67517 -267591 -322279 450609 -119698
11296c0002j94812r3560i7168D6139a92355B3944J85840C7620c37959E5112b13426
$$ -30002 -224814 -318374 -97168 46139 -192355 23944 209784 37620 -337959 55112 -213426
11284B03985a80279H4196d5875F7543a38247A73091k6025g5202l5748A96762K9634
$$ 203985 -180279 84196 -45875 67543 -138247 173091 147066 -75202 -110950 196762 226396
11273B26396A05764n1097R8409g0349q2871A20622i6600o0943A9641b3402A68827
$$ 226396 105764 54667 153076 -70349 -153220 120622 -96600 -157543 19641 -23402 168827
11261b0044A41006b57905D7930k2438b23494Q3401A9013b3863p5601E8768b1825
$$ -20044 141006 -257905 47930 25492 -223494 -140093 19013 -23863 -99464 58768 -21825
11249E0851a26696B69375b36699A34883i1939A34772f4647F6855R7378a68448
$$ 50851 -126696 269375 -236699 134883 -91939 134772 -64647 66855 164233 -168448
11238a02102r679j8856O4218D5825R2837C0554a19670n4908Q5436A3010J26038
$$ -102102 -111781 -130637 -66419 45825 138662 30554 -119670 -174578 -89142 13010 139048
11227A39048b81252b6788k79171N7171A74181a07986F1718J92294A18359a36879
$$ 139048 -281252 -26788 -305959 -248788 174181 -107986 61718 254012 118359 -136879
11216b29487A623b07102c7959o5510D7376f4360l9717A6266b00858i9208D0635
$$ -229487 1623 -207102 -37959 -103469 47376 -64360 -104077 16266 -200858 -99208 40635
11204A0738e3891n8981m0953B36931D6110f3956K4468A31486l2143a06883c6103
$$ 10738 -53891 -112872 -153825 236931 46110 -63956 -39488 131486 99343 -106883 -36103
11192a01818E0716A8161b30534D0570a39F1417c33823p8738B7982b59193B714
$$ -101818 50716 18161 -230534 40570 -139 61417 -333823 -412561 27982 -259193 2714
11180a47767K3261j64228G7414l2730b31816j03195g3311A00977K24671d5352
$$ -147767 -124506 -288734 77414 44684 -231816 -335011 -73311 100977 325648 -45352
11169b95326a03014I127M0643h7331k88670f681j48181J4864L2821L5259C9375
$$ -295326 -103014 9127 49770 -87331 -376001 -6681 -154862 -139998 -107177 -71918 39375
11157d61838C1944Q9578b05230E4005L5332d1956r5226C72240A50909N8631d0574
$$ -461838 31944 121522 -205230 54005 89337 -41956 -137182 372240 150909 209540 -40574
11145a92510Q7600F0687e2244A80789F8120f3227m9016a5900A00088J82422A01983
$$ -192510 -104910 60687 -52244 180789 68120 -63227 -112243 -15900 100088 282510 101983
11133a06909B4318J7027g7981I4034b69954b7420j1229D8864g5463A26789L4597
$$ -106909 24318 41345 -77981 94034 -269954 -27420 -38649 48864 -75463 126789 161386
11122A61386c00037A57411L2291b62178A99639a54749e1394h078B89532c36863
$$ 161386 -300037 157411 189702 -262178 199639 -154749 -51394 -8078 289532 -336863
11111B26418B306i4810A81198b02647B30218b14006e441H8737A3192d9642C8625
$$ 226418 2306 -94810 181198 -202647 230218 -214006 -5441 88737 13192 -49642 38625
11099H3187a6542A13280e4969b2038m5004B93193a55325p9693e5167H3516c7475
$$ 83187 -16542 113280 -54969 -22038 -67042 293193 -155325 -235018 -55167 83516 -37475
11087A9408J00643J07606o0492J8395R9816J24797j35126A3966L10437a84000
$$ 19408 120051 227657 167165 185560 285376 410173 275047 13966 324403 -184000
11076i1399c8277A62124A0161m398L72736N9147m7498A64157B1395P7423K11100
$$ -91399 -38277 162124 10161 5763 378499 437646 390148 164157 21395 98818 309918
11065C09918q0135N5665E0752J03583M216m3600k700J39414m5876K33972P9398
$$ 309918 229783 285448 50752 154335 158551 114951 112251 251665 205789 439761 519159
11054E19159J61167j93225L78970C60717L8774L70797n1242o4406L3971l07623
$$ 519159 680326 487101 866071 360717 399491 770288 719046 654640 688611 380988
11044C80988L94633P2085j88713j88711P1561j61130K16667J43725K0997L9212
$$ 380988 775621 847706 658993 470282 541843 380713 597380 741105 762102 801314
11034H01314C24234P34196r7799l31197J69602k56256j99242M13365j41092J45674
$$ 801314 324234 1058430 960631 629434 799036 542780 343538 756903 615811 761485
11024G61485k03704Q8605k8235p9800L32082m25063L5883j04873J34154r0482
$$ 761485 557781 646386 618151 538351 870433 445370 481253 376380 510534 420052
11014D20052J95803j8019k43306R4791J72998k6427j75999l596j61052K44012
$$ 420052 615855 597836 354530 449321 622319 595892 419893 416297 255245 499257
11004D99257m1491k03360G4590N43201m977J1046k43385J67192p9945N63444l21023
$$ 499257 457766 254406 74590 617791 612814 623860 380475 547667 467722 1031166 710143
10993G10143k87653J9302J7071p2396M05889l82627N9070N0270J99305R311k64
$$ 710143 422490 441792 458863 386467 792356 409729 468799 519069 718374 727685 727421
10982G27421m315L3231l13292O87059j12946J02883k06659Q9476L11739k1975
$$ 727421 723106 756337 443045 1130104 1017158 1120041 913382 1002858 1314597 1292622
10972A292622J22098o9621O07912K7920J85499L12852j05444l8646N03424m04831
$$ 1292622 1414720 1345099 1953011 1980931 2166430 2479282 2373838 2335192 2838616 2433785
10962B433785k20133l13694j38808K4696m59822l32293L40397J57115k95752O9229
$$ 2433785 2213652 1899958 1761150 1785846 1326024 993731 1334128 1491243 1195491 1264720
10952A264720F12920N12514l06196l46663K12752n5131k80300j8319o3638R3278
$$ 1264720 612920 1125434 819238 472575 685327 630196 349896 331577 267939 361217
10942C61217n258Q5898j09071M182F2408j7982N8084N0543P371K40670j67686
$$ 361217 355959 441857 332786 336968 62408 44426 102510 153053 160424 401094 233408
10931B33408H2161C7756a55756B53309g875p3406k22830P7741K3038B16336k6675
$$ 233408 82161 37756 -155756 253309 -7875 -81281 -304111 -226370 -203332 216336 189661
10920A89661R4887C249M67593j89887C810d1584j43697C512J71736O7969b2485
$$ 189661 284548 3249 470842 280955 3810 -41584 -185281 3512 175248 243217 -22485
10908I4041K29945D8430a8732j74631B2920N0603j19a36547a3224A04488a55291
$$ 94041 323986 48430 -18732 -193363 22920 73523 73404 -136547 -13224 104488 -155291
10896a14799E1005e6749F6526a56243j12951A22342a15597k39167J52563d6528
$$ -114799 51005 -56749 66526 -156243 -269194 122342 -115597 -354764 -202201 -46528
10885b52145P0492n630n8854J06900a2795j69601D1093J21462b11971n39P9098
$$ -252145 -181653 -187283 -246137 -139237 -12795 -182396 41093 162555 -211971 -212510 -133412
10874a33412K9326B0444b4276C26045d4431j28232P5960A157b80800A51671a82662
$$ -133412 -104086 20444 -24276 326045 -44431 -172663 -96703 1157 -280800 151671 -182662
10862A02001g6067b0058n1844C70404j70469n5762f3998l15664n8980b03507B75818
$$ 102001 -76067 -20058 -71902 370404 199935 144173 -63998 -379662 -438642 -203507 275818
10850A6308a99106r2270A50749n3473e271j53295r5459G7390k4714c02884a38029
$$ 16308 -199106 -291376 150749 97276 -5271 -158566 -254025 77390 52676 -302884 -138029
10838c03817J9057J39647k0303A75889Q7254d50619J91489g6118k28642A15435
$$ -303817 -284760 -145113 -165416 175889 263143 -450619 -259130 -76118 -304760 115435
10827A6292J85940p6462E3639a15040A27440b28955A96745i4839q0873h1650B36308
$$ 16292 202232 125770 53639 -115040 127440 -228955 196745 -94839 -175712 -81650 236308
10815e2531K2586D5274a14955L9927C6584L39601A9289c458A89831P8647A0701
$$ -52531 -29945 45274 -114955 -75028 36584 376185 19289 -3458 189831 268478 10701
10803b71475K4612r8744f5594k46888B72592F9067a4449A23485a59333d2950A1863
$$ -271475 -246863 -345607 -65594 -312482 272592 69067 -14449 123485 -159333 -42950 11863
10791g3151C82940D2538b1931j02219H5850b83614R1454A08744R5336B9973L4092
$$ -73151 382940 42538 -21931 -124150 85850 -283614 -192160 108744 204080 29973 64065
10780F4065b35430f4019B74162a26508d4828m5880j37864N916A45283Q7763j16194
$$ 64065 -235430 -64019 274162 -126508 -44828 -90708 -228572 -222656 145283 233046 116852
10769A16852K11009E2523M4471k2976a65745e2622j07868A44086J83119D0856
$$ 116852 327861 52523 96994 74018 -165745 -52622 -160490 144086 327205 40856
10758i6222A524b80212a06384O052E5833a91256g8313B20432h6125j42590B46123
$$ -96222 1524 -280212 -106384 -100332 55833 -191256 -78313 220432 -86125 -228715 246123
10746f5268I7478b71165a28490A7780c0561j74277D2985R5753b05632o6757N4663
$$ -65268 97478 -271165 -128490 17780 -30561 -204838 42985 138738 -205632 -272389 -217726
10735b17726a04160j84689g3540o6673A7847c14549a30261B12098d625k811F7211
$$ -217726 -104160 -288849 -73540 -140213 17847 -314549 -130261 212098 -4625 -7436 67211
10723b21847G9613c62294A20074A6634i450C12933H199L37368A54724J54236b13763
$$ -221847 79613 -362294 120074 16634 -9450 312933 8199 345567 154724 308960 -213763
10711G4035a2007k6333B51851q7949N7361a18375q2756B03797b56856a02812j1750
$$ 74035 -12007 -38340 251851 163902 221263 -118375 -201131 203797 -256856 -102812 -114562
10700a14562B8856a57414j23087f6414A57506D2679a63142j30302C34122j18708
$$ -114562 28856 -157414 -280501 -66414 157506 42679 -163142 -293444 334122 215414
10690B15414F6292a25205n93354a9484r3776j40641f5888l8457N874j2958k5747
$$ 215414 66292 -125205 -718559 -19484 -113260 -253901 -65888 -104345 -98471 -111429 -137176
10679a37176A74343h2510b4518j41732D03099i5657d4517m10140B12086b7361
$$ -137176 174343 -82510 -24518 -166250 403099 -95657 -44517 -454657 212086 -27361
10668b541l6130j61379A18929M4139c4442j01299C47288f3737B7521g2011j8983
$$ -2541 -38671 -200050 118929 163068 -34442 -135741 347288 -63737 27521 -72011 -90994
10657i0994j69853E8887F391N30666B41156D0814c92803a67834C9703g2853o1066
$$ -90994 -260847 58887 6391 537057 241156 40814 -392803 -167834 39703 -72853 -133919
10646a33919p7010P6958D5489c54704A9807b14708a0015A8420b91794a41802B80515
$$ -133919 -210929 -133971 45489 -354704 19807 -214708 -10015 18420 -291794 -141802 280515
10634D6612J62537J51411a80414k2875f1143j28122O6981j62632F9901d0431p9951
$$ 46612 209149 360560 -180414 -203289 -61143 -189265 -122284 -284916 69901 -40431 -120382
10623a20382L1312j24139P4118A1257a37949A03014a8944r9885N6329q6032a8104
$$ -120382 -89070 -213209 -139091 11257 -137949 103014 -18944 -118829 -62500 -148532 -18104
10611e1973m1064m9532G5006e5375m2859n9485k65292K10213C32007g3139m44381
$$ -51973 -93037 -142569 75006 -55375 -98234 -157719 -423011 -212798 332007 -73139 -517520
10600e17520e983A11063f5245m4554I1442j718P8771j0757c7554j68405A50913
$$ -517520 -5983 111063 -65245 -109799 91442 89724 168495 157738 -37554 -205959 150913
10588c42594e9200B39315a27075A3018a62930E5675a80840H887i6719D9826b9899
$$ -342594 -59200 239315 -127075 13018 -162930 55675 -180840 8887 -96719 49826 -29899
10576E8956j7075a75115k8460g3909k13087h7034I6448b45231J21506A71074j5951
$$ 58956 41881 -175115 -203575 -73909 -286996 -87034 96448 -245231 -123725 171074 155123
10565A55123a24596k05998a26912e6096k86507h0598A48336J92448d7162o4849
$$ 155123 -124596 -330594 -126912 -56096 -342603 -80598 148336 340784 -47162 -112011
10555a12011N5801B58548b21552D4080O1633g890o35512K18109b6021j63410N79
$$ -112011 -56210 258548 -221552 44080 105713 -7890 -643402 -425293 -26021 -189431 -188852
10544a88852D3142J28584a41640B69441e1770j6399o9752G2796b25412m4625j32163
$$ -188852 43142 171726 -141640 269441 -51770 -68169 -137921 72796 -225412 -270037 -402200
10533d02200b2856j24647A18805b52044B03636p0326n2150a38730m9448B2536
$$ -402200 -22856 -147503 118805 -252044 203636 133310 81160 -138730 -188178 22536
10522a36367A11740a87768E8430c7947A13652c0095j09273K5620A00745J50863
$$ -136367 111740 -187768 58430 -37947 113652 -30095 -139368 -113748 100745 251608
10512B51608a45115a3456m9477J5854p3137A42316d55754J57623A59729c0201
$$ 251608 -145115 -13456 -62933 -47079 -120216 142316 -455754 -298131 159729 -30201
10501a57072c7996A62556a8778k3044B13160I3911D2252K2897E611b89946Q1847
$$ -157072 -37996 162556 -18778 -41822 213160 93911 42252 65149 5611 -289946 -208099
10490b08099J00990M9814A4057J20213b41614n5119C1729K97611I321R6019c04578
$$ -208099 -107109 -57295 14057 134270 -241614 -296733 31729 329340 9321 105340 -304578
10478C46617i6476A05566E2317P5554C6158a6482n1008K5799p2173N0837p5748
$$ 346617 -96476 105566 52317 127871 36158 -16482 -67490 -41691 -113864 -63027 -138775
10467a38775j26707B38920a70693I0313h4211I042J85711a07106A46178a60059
$$ -138775 -265482 238920 -170693 90313 -84211 9042 194753 -107106 146178 -160059
10456b56939a3294A7292K16919g3767L4464a862C99929A6449b80632A4846b5008
$$ -256939 -13294 17292 234211 -73767 -39303 -1862 399929 16449 -280632 14846 -25008
10444c69389A31871g8532r756K3311b2250E0642g9016j43590B082b2181A68412
$$ -369389 131871 -78532 -88288 -64977 -22250 50642 -79016 -222606 2082 -22181 168412
10432g705C8941g2376E6613a20483r1020g0583j69943g1907l3580B01244O2917
$$ -7705 38941 -72376 56613 -120483 -211503 -70583 -240526 -71907 -105487 201244 264161
10421B64161f8479k11036J39054j14182H6234a71664g645p3717C72797g8813A18740
$$ 264161 -68479 -279515 -140461 -254643 86234 -171664 -7645 -81362 372797 -78813 118740
10409B09003i8163A28884N2849b47278B87588e9077C8850K27542a95847e7683
$$ 209003 -98163 128884 181733 -247278 287588 -59077 38850 266392 -195847 -57683
10398A72490J08023D1935O7196M1164b368p9348d0675A94442G1599a71788b8800
$$ 172490 280513 41935 109131 150295 -2368 -81716 -40675 194442 71599 -171788 -28800
10386A16469E7228K06439A29212g5173A13805K7491h5343i094I6613P2254F0892
$$ 116469 57228 263667 129212 -75173 113805 141296 -85343 -9094 96613 168867 60892
10374A38980N4277e1272E4483K10101o4947p8855J60033M073K7013j43390J0433
$$ 138980 193257 -51272 54483 264584 199637 120782 280815 284888 311901 168511 178944
10363A78944J80219J03815D7307f1800D59510A19482L79570A21508A575K89077
$$ 178944 359163 462978 47307 -61800 459510 119482 499052 121508 1575 290652
10353B90652l2133R069L3365G433M153L94382j00108j8758K68362k09381A00288
$$ 290652 258519 267588 300953 7433 11586 405968 305860 287102 555464 346083 100288
10341B09216L17793d8818B91198J71945j40501p6216F0609K71111l8256C500J10305
$$ 209216 527009 -48818 291198 463143 322642 246426 60609 331720 293464 3500 113805
10330A13805R3930i7439E1808a37435B49968a12993F4888a398j8119q5032B83548
$$ 113805 207735 -97439 51808 -137435 249968 -112993 64888 -1398 -19517 -104549 283548
10318a15240F1430J98183A8541a15865E114P5312B8483K78564a354j02105m7784
$$ -115240 61430 259613 18541 -115865 5114 80426 28483 307047 -1354 -103459 -151243
10307a51243A94243a51554E9727J21101q0483e1337A82981a61376b1100o4591
$$ -151243 194243 -151554 59727 180828 100345 -51337 182981 -161376 -21100 -85691
10297h5691H9691b63725M7505J0205F7636P2159b78517B07064D5805J10109g0427
$$ -85691 89691 -263725 -216220 -206015 67636 139795 -278517 207064 45805 155914 -70427
10285B05427a49067b7191j8182C14894i3640n2466G8961i7646e019j31485A10685
$$ 205427 -149067 -27191 -45373 314894 -93640 -146106 78961 -97646 -5019 -136504 110685
10273A7088J39580b0064m0695F8216J45228a8078A79497a04499k33505B46863
$$ 17088 156668 -20064 -60759 68216 213444 -18078 179497 -104499 -338004 246863
10262E8808c62310b6910j6728G8837e2406A98462f2549j65273B79192A07150a28204
$$ 58808 -362310 -26910 -43638 78837 -52406 198462 -62549 -227822 279192 107150 -128204
10250A57361a32780c5647C24268f1684B78487b51794a17607J5877r8398h8569
$$ 157361 -132780 -35647 324268 -61684 278487 -251794 -117607 -101730 -200128 -88569
10239a94790j40910A87717M4480A14688a06250I4830e4634A6035L25080c07274
$$ -194790 -335700 187717 232197 114688 -106250 94830 -54634 16035 341115 -307274
10228b1153j88924D5557c4339A8371b20411B25790b84329O9266B8489M2782B2302
$$ -21153 -210077 45557 -34339 18371 -220411 225790 -284329 -215063 28489 71271 22302
10216c4138j69044O5789H1910j4244b30860c7399C6726N036D687M7330b99602
$$ -34138 -203182 -137393 81910 67666 -230860 -37399 36726 41762 4687 52017 -299602
10204B36990a38801N7290j72268m8577J24846j47795a15344D6602d64146E7587
$$ 236990 -138801 -81511 -253779 -302356 -177510 -325305 -115344 46602 -464146 57587
10193C3850b13532B54408b87130a04760D1790a73435n2552D1972a49999r0078
$$ 33850 -213532 254408 -287130 -104760 41790 -173435 -225987 41972 -149999 -240077
10183b40077R3120D0043c26551C2620M8199c83776A95477c19744A95161b99025
$$ -240077 -146957 40043 -326551 32620 80819 -383776 195477 -319744 195161 -299025
10172E3490a19904G3763C5121b57403a22197j23291Q1055B64464G9649a581D2409
$$ 53490 -119904 73763 35121 -257403 -122197 -245488 -164433 264464 79649 -1581 42409
10160a8078E8790i5492k50491L8148C3360b71982i3602o9348K9702q0923H6120
$$ -18078 58790 -95492 -345983 -307835 33360 -271982 -93602 -162950 -133248 -214171 86120
10148b10931F4893b32458A34443d63850K23924A73135a67669r75C6675d5678B27761
$$ -210931 64893 -232458 134443 -463850 -239926 173135 -167669 -168644 36675 -45678 227761
10136b3526k62705e66C3072P3422C1622a03278A36050a23931E37598c71031e3071
$$ -23526 -286231 -566 33072 106494 31622 -103278 136050 -123931 537598 -371031 -53071
10124f5441j13734p1904B9666h6020j30866j18198I5986P0613m4701e2028k79397
$$ -65441 -179175 -251079 29666 -86020 -216886 -335084 95986 166599 121898 -52028 -331425
10113c31425D034a26057n7594d3314k38581b6470H3761b92571B4496c06390F562
$$ -331425 4034 -126057 -183651 -43314 -281895 -26470 83761 -292571 24496 -306390 6562
10101c26968j1404B36033i3705O181n1637C9162b70439E5995J8345a46689H374
$$ -326968 -338372 236033 -93705 -87524 -139161 39162 -270439 55995 74340 -146689 8374
10089h3570l1243C0819P2744f2843D2784J46753I3270J69556c84268a1644j53494
$$ -83570 -114813 30819 103563 -62843 42784 189537 93270 262826 -384268 -11644 -165138
10078a65138E43241A34595a07847j27790A6698g2049F3273L21790f6392p9933
$$ -165138 543241 134595 -107847 -235637 16698 -72049 63273 385063 -66392 -146325
10068a46325b479r2425D683a40136q4884i6723j44846f5116F5581d1012H7864
$$ -146325 -2479 -94904 4683 -140136 -225020 -96723 -241569 -65116 65581 -41012 87864
10056A83772O0098b10214f7375D0515F273J37395c36734A73428a92845M335N4821
$$ 183772 243870 -210214 -67375 40515 6273 143668 -336734 173428 -192845 -188510 -133689
10045a33689J5763H1256c21270A34658i3321l23185C6773b28114h5065B03550
$$ -133689 -117926 81256 -321270 134658 -93321 -416506 36773 -228114 -85065 203550
10034g5907H2669K3921B9986M4670J260A97J76628l3815b3991j17098q5190g539
$$ -75907 82669 106590 29986 74656 75916 197 176825 143010 -23991 -141089 -226279 -7539
10021b46910Q2829f3842j58716C30461h8004k27590d2852C4700i3271G8785O4574
$$ -246910 -164081 -63842 -222558 330461 -88004 -315594 -42852 34700 -93271 78785 143359
10010A43359n1146a99610k32406b05120g3399j41406a8823l11524l6790j0185
$$ 143359 92213 -199610 -432016 -205120 -73399 -214805 -18823 -330347 -367137 -377322
10000c77322B08546G0972b15806d580C2806b6368p3363K3910k88766k3780I1670
$$ -377322 208546 70972 -215806 -4580 32806 -26368 -99731 -75821 -364587 -388367 91670
9988C15879e5497q634q8187A04921a34861O0321c6398j4442j45326C1898c35831
$$ 315879 -55497 -64131 -152318 104921 -134861 -74540 -36398 -50840 -196166 31898 -335831
9976E8621I271J0059i2979k61006B08721b67387h5794j60016A09177c05445J04944
$$ 58621 9271 19330 -92979 -353985 208721 -267387 -85794 -245810 109177 -305445 -200501
9965b00501j97167i2995G8888d83781a01252j35440C27420a51146F3794B4909
$$ -200501 -397668 -92995 78888 -483781 -101252 -236692 327420 -151146 63794 24909
9954e4937K5214o1455D6270a54141j67349D9956J50968B4967J7092M0653c65494
$$ -54937 -29723 -91178 46270 -154141 -321490 49956 200924 24967 42059 82712 -365494
9942a1856k13860r3913e075m95856P0412B27238a19020k741L5980G0659c77933
$$ -11856 -225716 -319629 -5075 -500931 -430519 227238 -119020 -121761 -85781 70659 -377933
9930a53280b8453A66904b4460k56615a36427r8265G2304b20836j1900o5886a12867
$$ -153280 -28453 166904 -24460 -281075 -136427 -234692 72304 -220836 -232736 -298622 -112867
9918i0788k01522A73012a64515E7484d87537a01737l12060b443q9867j21648k93397
$$ -90788 -292310 173012 -164515 57484 -487537 -101737 -413797 -2443 -92310 -213958 -507355
9907e07355b30899R3796j34056J27631I4234b9263m23190a25530c292k13603K7555
$$ -507355 -230899 -137103 -271159 -143528 94234 -29263 -452453 -125530 -3292 -216895 -189340
9896a89340B34132K3128c41199h1850k9642j27747A91474p5291a64104b8022k47360
$$ -189340 234132 257260 -341199 -81850 -111492 -239239 191474 116183 -164104 -28022 -275382
9885b75382D7990b9574k48265d9445J3739o1610n2117m7281E9341g3332C0419
$$ -275382 47990 -29574 -277839 -49445 -35706 -97316 -149433 -196714 59341 -73332 30419
9873h8400A8759f6164A10162K0432J38003b26984b9016D485P4163b608k3589n0613
$$ -88400 18759 -66164 110162 130594 268597 -226984 -29016 4485 78648 -2608 -26197 -76810
9861g6810b4737B2834g1529k6289A87342c04095A45080b42454c7690q1076Q184
$$ -76810 -24737 22834 -71529 -97818 187342 -304095 145080 -242454 -37690 -118766 -110582
9850a10582J3806r889M6706h950H0418a21048j10586I5536k5664h0253J0621p8434
$$ -110582 -96776 -106665 -59959 -8950 80418 -121048 -231634 95536 69872 -80253 -69632 -148066
9838a48066N5355J7041b8924A11643a26083m9397j45829g5040A78448a50641k8903
$$ -148066 -92711 -75670 -28924 111643 -126083 -175480 -321309 -75040 178448 -150641 -179544
9827a79544A3274a6038m8919P884j28911C6764b67593K1548i5028j97235A61009
$$ -179544 13274 -16038 -64957 -57073 -185984 36764 -267593 -246045 -95028 -292263 161009
9815D2261J01390b86084A2723J6215J36274F3562a76909q1026l236q8576j41141
$$ 42261 143651 -286084 12723 28938 165212 63562 -176909 -257935 -261171 -349747 -490888
9804d90888c4269C09097j06075i2254J1172r2865B46736b77915B22002a64513
$$ -490888 -34269 309097 203022 -92254 -81082 -173947 246736 -277915 222002 -164513
9793D8469K37383e7215n7793H472J02394a11253L2997q0885k01174N3317a6414
$$ 48469 285852 -57215 -115008 8472 110866 -111253 -78256 -159141 -360315 -306998 -16414
9781e3403j9012j80915J1303M143g7725m1908a8050o1102n6669J4220A23913a34669
$$ -53403 -72415 -253330 -242027 -237884 -77725 -119633 -18050 -79152 -135821 -121601 123913 -134669
9768a63070M2190A30249l2125a52759j81652A18324b42986J17079A52762n5374
$$ -163070 -120880 130249 98124 -152759 -334411 118324 -242986 -125907 152762 97388
9758I7388d12500a02168M7185E1168a89155c1905A99964G481O4666b99254J49509
$$ 97388 -412500 -102168 -54983 51168 -189155 -31905 199964 7481 72147 -299254 -149745
9747a49745A69170c96578A48015f457m8453J8513j10365J9732A78947g2977b5163
$$ -149745 169170 -396578 148015 -6457 -54910 -36397 -146762 -127030 178947 -72977 -25163
9735b42289B89937b42965F0648a08881G2548c3261p3633C36294c6403j96466L6259
$$ -242289 289937 -242965 60648 -108881 72548 -33261 -106894 336294 -36403 -232869 -196610
9724a96610A9602a14673p1123R0018C2414c4890A070b17068g9495D460a46486
$$ -196610 19602 -114673 -185796 -95778 32414 -34890 1070 -217068 -79495 4460 -146486
9712b53480d6350A01304J48663c26324A7259J24057a35496k47713b3540j20283
$$ -253480 -46350 101304 249967 -326324 17259 141316 -135496 -383209 -23540 -143823
9702a43823G1928a92957c6094a706B5059a50153l8034P5198A49609C3659a90126
$$ -143823 71928 -192957 -36094 -1706 25059 -150153 -188187 -112989 149609 33659 -190126
9690b13620C7992K17097m9898b65055B26186f0530j1003k4590a8145D5869a62684
$$ -213620 37992 255089 205191 -265055 226186 -60530 -71533 -96123 -18145 45869 -162684
9678I6318e8378B42505c16409J16133N3345r9986a12145A05282d499C2780J19098
$$ 96318 -58378 242505 -316409 -200276 -146931 -246917 -112145 105282 -4499 32780 151878
9667A51878c20206G7193c02684A85746J1300b06585C7182b78987f1624j17989
$$ 151878 -320206 77193 -302684 185746 197046 -206585 37182 -278987 -61624 -179613
9657a79613j82291a41990C03644f1279j50731P0705b4750k7922k33417a39027
$$ -179613 -361904 -141990 303644 -61279 -212010 -141305 -24750 -52672 -286089 -139027
9646A3080a66415j90120j68969f1137K7755B877b5584E9744B6103c7439j05481
$$ 13080 -166415 -356535 -525504 -61137 -33382 2877 -25584 59744 26103 -37439 -142920
9635a42920N7415k75593c5779k21492d3395h932G8864b52926J21062n8449A33090
$$ -142920 -85505 -361098 -35779 -257271 -43395 -8932 78864 -252926 -131864 -190313 133090
9623D3962B0072c08096H3581a0147I0438G534d5738j74663e723B83796a14522
$$ 43962 20072 -308096 83581 -10147 90438 7534 -45738 -220401 -5723 283796 -114522
9611i9008p7380L7224C57633E5801A6172b68347g1078j4507A88967F0837J03633
$$ -99008 -176388 -139164 357633 55801 16172 -268347 -71078 -85585 188967 60837 164470
9600A64470e3407J3843p0686l0891O7247A23367O8518c4418j10373m2164o5769
$$ 164470 -53407 -39564 -110250 -141141 -73894 123367 191885 -34418 -144791 -186955 -252724
9589b52724o4211k1050A6366J7282L9006f8849L3927j61702o4696c9970D34072
$$ -252724 -316935 -337985 16366 33648 72654 -68849 -34922 -196624 -261320 -39970 434072
9577E7898b30207j54550J57854R9080c3266A98168D7574M1792L6085b58603C12352
$$ 57898 -230207 -384757 -226903 -127823 -33266 198168 47574 89366 125451 -258603 312352
9565b9496n2189b4618j98239I6751b07421J03074M7172j89731o1871a44043B0321
$$ -29496 -81685 -24618 -222857 96751 -207421 -104347 -57175 -246906 -308777 -144043 20321
9553C01783b28965N4496L9945L0790d7780A43822a46349A30397d17295a18417
$$ 301783 -228965 -174469 -134524 -103734 -47780 143822 -146349 130397 -417295 -118417
9542c29911a34044A45718b69211l4413A60541a72954k95421L7415a46860b7986
$$ -329911 -134044 145718 -269211 -303624 160541 -172954 -468375 -430960 -146860 -27986
9531a52070C2663a15236k65723A00541b84104F1036a98646c4141B42694I2450
$$ -152070 32663 -115236 -380959 100541 -284104 61036 -198646 -34141 242694 92450
9520B92884j24275a84515o0460p4069H363b41969C93500a64533O6327B45350c31419
$$ 292884 168609 -184515 -244975 -319044 8363 -241969 393500 -164533 -98206 245350 -331419
9508i1489E363g148q6326O406n4222a8318E282L1943a18086m3433G5659L5499
$$ -91489 5363 -7148 -93474 -87068 -141290 -18318 5282 37225 -118086 -161519 75659 111158
9496A11158K34040d885a425B0701e6666j04779c5058E7377J14549a83060B25205
$$ 111158 345198 -4885 -1425 20701 -56666 -161445 -35058 57377 171926 -183060 225205
9484e0569j37360A57572o2551B2131b4300E4145c19988J31954A82290a64326l18289
$$ -50569 -187929 157572 95021 22131 -24300 54145 -319988 -188034 182290 -164326 -482615
9473d82615A37611b44501B54611a81159q2439N1953I013J0458a49597r3889d7050
$$ -482615 137611 -244501 254611 -181159 -263598 -211645 9013 19471 -149597 -243486 -47050
9461A29103b18402b0419A69371e4272j15797k89004J50730j28887a16081N7229
$$ 129103 -218402 -20419 169371 -54272 -170069 -459073 -308343 -437230 -116081 -58852
9451e8852f568A1332Q4220l4757k7604M34019A33173m1291a19096i453k55659
$$ -58852 -6568 11332 95552 60795 33191 467210 133173 91882 -119096 -9453 -265112
9440b65112N6690l6096d8906j37765A8262b3970a0614j32894B24266a04939l19554
$$ -265112 -208422 -244518 -48906 -186671 18262 -23970 -10614 -143508 224266 -104939 -424493
9429d24493H6004b68738J02977P8640j95590E7713J33879a41398j11429L553A12147
$$ -424493 86004 -268738 -165761 -87121 -282711 57713 191592 -141398 -252827 -249274 112147
9417A80582d4975q0512l66983A42892h7386n6987F7747a3001l40830f4704L10
$$ 180582 -44975 -125487 -492470 142892 -87386 -144373 67747 -13001 -353831 -64704 -64394
9406f4394k94822B02402b02845H8771a26058K1070m3552o9652k0007D8011a51806
$$ -64394 -359216 202402 -202845 88771 -126058 -104988 -148540 -218192 -238199 48011 -151806
9394C75K47863f8892G9357g7109j45399G3091b44193k29231K12048m8674c227
$$ 375 248238 -68892 79357 -77109 -222508 73091 -244193 -473424 -261376 -310050 -3227
9382I919a12747j14216B96390i0291B5660a96526J0978J4666j6775O8210K0183
$$ 9919 -112747 -226963 296390 -90291 25660 -196526 -185548 -170882 -187657 -119447 -99264
9371i9264i003F151a62344A8346c29573a30827E335b53960r2559A63282a92274
$$ -99264 -9003 6151 -162344 18346 -329573 -130827 5335 -253960 -346519 163282 -192274
9359e9790j99640B05057H1212b02451H5943a98124k9854A27996b53855k23132
$$ -59790 -259430 205057 81212 -202451 85943 -198124 -227978 127996 -253855 -476987
9349d76987h9891F2883b51623R0273N015p0489O0795D5405f411j65182A42829
$$ -476987 -89891 62883 -251623 -161350 -156335 -226824 -166029 45405 -6411 -171593 142829
9337C96977D2686j4853K8112O9086a79181E3672d73412d9576j8014k48536r4858
$$ 396977 42686 27833 55945 125031 -179181 53672 -473412 -49576 -67590 -316126 -410984
9326d10984J28140J12875N8499k6993k5383N5692B1404d0592E680M6633a13504
$$ -410984 -282844 -169969 -111470 -138463 -163846 -108154 21404 -40592 5680 52313 -113504
9314e8655j24696A5255b09601j57019f5964p5069c1929D1351b56229L1777I3189
$$ -58655 -183351 15255 -209601 -366620 -65964 -141033 -31929 41351 -256229 -224452 93189
9302e42494E4642A1243f2577A75780d03142A33510l7524b97108H5832Q7447J45648
$$ -542494 54642 11243 -62577 175780 -403142 133510 95986 -297108 85832 173279 318927
9291C18927d083o8610b012B6155b9036C6526D730a1480A39162b92839f8227K5043
$$ 318927 -4083 -72693 -2012 26155 -29036 36526 4730 -11480 139162 -292839 -68227 -43184
9279d3184k50759i4348j12557G6811i5035o8792b2279A12537a07399m4101e5773
$$ -43184 -293943 -94348 -206905 76811 -95035 -163827 -22279 112537 -107399 -151500 -55773
9267c50475J57901O666A18611a32000p7165j10823a09690A9939f7718B23223a41543
$$ -350475 -192574 -185908 118611 -132000 -209165 -319988 -109690 19939 -67718 223223 -141543
9255g3344E4050O6084b93437c4620j68904b6026A44892b79792D23784b33074C39142
$$ -73344 54050 120134 -293437 -34620 -203524 -26026 144892 -279792 423784 -233074 339142
9243b89719C0951J95631c0620k59822J32765M2447b71q6513j0187k54837A28609
$$ -289719 30951 226582 -30620 -290442 -157677 -115230 -271 -86784 -96971 -351808 128609
9231i6950B36713a95188B06890L704a43523k06382i7575n8696C7053a25844G7347
$$ -96950 236713 -195188 206890 210594 -143523 -349905 -97575 -156271 37053 -125844 77347
9219H381K1038b83669b7116A7056b02993P6619b1179n1114o6949F1742B0691a51435
$$ 8381 29419 -283669 -27116 17056 -202993 -126374 -21179 -72293 -139242 61742 20691 -151435
9206B15956b06201a01481A11904c06574e9620r7542H2134a65643A67883K7840
$$ 215956 -206201 -101481 111904 -306574 -59620 -157162 82134 -165643 167883 195723
9196A95723f2862A4111a87007h1966D6305a84196h0658j57737O9928f0856k81620
$$ 195723 -62862 14111 -187007 -81966 46305 -184196 -80658 -238395 -168467 -60856 -342476
9185c42476a62523a9170r2383M7548J5200M851m4415b7722l8877k70891a31203
$$ -342476 -162523 -19170 -111553 -64005 -48805 -43954 -88369 -27722 -66599 -337490 -131203
9173a11758l7413L4881j9485E1086J6574g0615G4633a31522j99894f2210j55109
$$ -111758 -149171 -114290 -133775 51086 67660 -70615 74633 -131522 -331416 -62210 -217319
9162b17319i0445k5248p946b6195m67386g4308D4168a16878A5611b57743D60898
$$ -217319 -90445 -115693 -123639 -26195 -493581 -74308 44168 -116878 15611 -257743 460898
9150C50856b34504i8197J0647A93337a01827j80743B7832b02794A12450c2532
$$ 350856 -234504 -98197 -87550 193337 -101827 -282570 27832 -202794 112450 -32532
9139a9870j66827M4692C14657j16822m3355a98654P5911K7552J4531k55091g3267
$$ -19870 -186697 -142005 314657 197835 154480 -198654 -122743 -95191 -80660 -335751 -73267
9127A21849c66846J77460P694K9587A56142d11864a85261f0427J5625A84773A9526
$$ 121849 -366846 -189386 -181692 -152105 156142 -411864 -185261 -60427 -44802 184773 19526
9115d70337A29131c35163b4793n6128B30646a03226p5222c9821l524k7548n9164
$$ -470337 129131 -335163 -24793 -80921 230646 -103226 -178448 -39821 -43345 -70893 -130057
9104a30057E3858a74724k45961K2431B13392f2853G0066Q2703l0001g9691c9256
$$ -130057 53858 -174724 -420685 -398254 213392 -62853 70066 152769 122768 -79691 -39256
9092b06446i2864d483A12967a5172j8123k25308F4579d2786j79220d03A97529
$$ -206446 -92864 -4483 112967 -15172 -33295 -258603 64579 -42786 -222006 -403 197529
9080A11342a17315m780A270a1478A02594k6689k7596P5937n4260K9185b98606
$$ 111342 -117315 -122095 1270 -11478 102594 75905 48309 124246 69986 99171 -298606
9068a80354g2296j63449o3251O2601C4066a55390B45745A3643a31570k38095P6034
$$ -180354 -72296 -235745 -298996 -236395 34066 -155390 245745 13643 -131570 -369665 -293631
9057b93631F2338a5600A20499C3766K86761A02357c02844C4878J37545g8552a6703
$$ -293631 62338 -15600 120499 33766 320527 102357 -302844 34878 172423 -78552 -16703
9045b97712p35h1419o7005B4631c00653a38843D8946c32704j66348J6178k9976
$$ -297712 -298447 -81419 -148424 24631 -300653 -138843 48946 -332704 -499052 -482874 -512850
9034e12850A27556a32046k38921a9799k56399i1631c5603k15746A20113a80998
$$ -512850 127556 -132046 -370967 -19799 -276198 -91631 -35603 -251349 120113 -180998
9023i6280m5679A14888b17683l2564b3055A63533J3467a70297I98a17693J4820
$$ -96280 -141959 114888 -217683 -250247 -23055 163533 177000 -170297 998 -117693 -102873
9012a02873b4038j65847G995b7620k5054j98232A48085a16213C30219I7913a07008
$$ -102873 -24038 -189885 7995 -27620 -52674 -250906 148085 -116213 330219 97913 -107008
9000a72398A95930h232j50568B43507D0980h2118A662J20496b3042C09343b67037
$$ -172398 195930 -8232 -158800 243507 40980 -82118 1662 122158 -23042 309343 -267037
8988e0691b2373B02681K6274b73833G0882N5730a47944O3407E7731b7292A95254
$$ -50691 -22373 202681 228955 -273833 70882 126612 -147944 -84537 57731 -27292 195254
8976a19372E9480a22359C39478A67676a42996g744j33471E742R8218b14472O0671
$$ -119372 59480 -122359 339478 167676 -142996 -7744 -141215 5742 103960 -214472 -153801
8965a53801K5998B86351G2235M7325j5021R081b9272C01743M5416a59211A00732
$$ -153801 -127803 286351 72235 119560 104539 113620 -29272 301743 347159 -159211 100732
8953B49831A05128O3129i9389A3633b84501a18598A6015K6045c92844a82421k6909
$$ 249831 105128 168257 -99389 13633 -284501 -118598 16015 42060 -392844 -182421 -209330
8942b09330P3363E4599c29168B0462c04027A20050Q185o0024R454b54433L8786
$$ -209330 -135967 54599 -329168 20462 -304027 120050 128235 68211 77665 -254433 -215647
8931b15647a1101r5467M9545G1805h6774A64543C4527M80563A59432O49297J553671
$$ -215647 -11101 -106568 -57023 71805 -86774 164543 34527 515090 159432 808729 2362400
8920B362400R93701P11238j473074q83209p54872D72301A24510D5482J49908d3676
$$ 2362400 3356101 4067339 2594265 1711056 956184 472301 124510 45482 195390 -43676
8909D3959K6595a80351A01151l8747Q9215J3536n6160g9368j88027A48792h2305
$$ 43959 70554 -180351 101151 62404 151619 165155 108995 -79368 -267395 148792 -82305
8897a8875D6689a39713E0419A4037a36365A0484g9761B8222O4667J13859D6441
$$ -18875 46689 -139713 50419 14037 -136365 10484 -79761 28222 92889 206748 46441
8885a46196C8792a73626M1883b2329R087G9160N4146a22524j30332f8925C2806
$$ -146196 38792 -173626 -131743 -22329 -13242 79160 133306 -122524 -252856 -68925 32806
8873A09549c7939j88430A88227c30191i0825L7942l29202j43758e2277b335B00646
$$ 109549 -37939 -226369 188227 -330191 -90825 -52883 -382085 -525843 -52277 -2335 200646
8861B31722a25696k8765j61802D9689J26058F141J09754b4715j16525A74932K5785
$$ 231722 -125696 -154461 -316263 49689 175747 6141 115895 -24715 -141240 174932 200717
8850B00717o057J00678a37472f2144l83046A09494b00349C0814d61311a43300
$$ 200717 194660 295338 -137472 -62144 -445190 109494 -200349 30814 -461311 -143300
$$ [...]
##END NTUPLES=NMR SPECTRUM
##END=
