##TITLE=AC1682_2981_8571508_A8kTSi5g7l
##JCAMPDX= 6.0         $$ Bruker NMR JCAMP-DX V2.0
##DATA TYPE= NMR SPECTRUM
##DATA CLASS= NTUPLES
##ORIGIN= BRUKER
##OWNER= Administrator
$$ 1.72 TOPSPIN		Version 2.1
$$ 2014-04-10 19:38:11.732 -0700  Administrator@X
$$ Compression mode = diff/dup
##.OBSERVE FREQUENCY= 400.02188249412
##.OBSERVE NUCLEUS= ^1H
##.ACQUISITION MODE= SIMULTANEOUS (DQD)
##.ACQUISITION SCHEME= undefined
##.AVERAGES= 64
##.DIGITISER RES= 22
##SPECTROMETER/DATA SYSTEM= spect
##.PULSE SEQUENCE= noesygpps1d.comp
##.SOLVENT NAME= COFFEE_meoh
##.SHIFT REFERENCE= INTERNAL, COFFEE_meoh, 1, 14.96245
##AUDIT TRAIL= $$ (NUMBER, WHEN, WHO, WHERE, PROCESS, VERSION, WHAT)
$$ ##TITLE= Audit trail, TOPSPIN		Version 2.1
$$ ##JCAMPDX= 5.01
$$ ##ORIGIN= Bruker BioSpin GmbH
$$ ##OWNER= Administrator
$$ $$ E:\/data/COFFEE/nmr/AC1682_2981_8571508_A8kTSi5g7l/12/pdata/1/auditp.txt
$$ ##AUDIT TRAIL=  $$ (NUMBER, WHEN, WHO, WHERE, PROCESS, VERSION, WHAT)
(   1,<2014-04-10 19:38:05.123 -0700>,<Administrator>,<X>,<go>,<TOPSPIN 2.1>,
      <created by zg
	started at 2014-04-10 19:26:35.698 -0700,
	POWCHK enabled, PULCHK disabled,
       configuration hash MD5:
       C8 4E 4E 5D D3 5C D8 9E 9F 52 82 E0 59 8A DE 15
       data hash MD5: 64K
       6A 4E 28 F4 EC 10 FE F7 27 CD 20 AD 87 FA 26 BB>)
(   2,<2014-04-10 19:38:08.654 -0700>,<Administrator>,<X>,<proc1d>,<TOPSPIN 2.1>,
      <Start of raw data processing
       efp LB = 0.3 FT_mod = 6 PKNL = 1 PHC0 = 0 PHC1 = 0 SI = 128K 
       data hash MD5: 128K
       D7 40 DA 38 2D D0 BB 35 78 79 5D C3 46 41 4C F2>)
(   3,<2014-04-10 19:38:09.920 -0700>,<Administrator>,<X>,<proc1d>,<TOPSPIN 2.1>,
      <pk PHC0 = -82.97974 PHC1 = 0 
       data hash MD5: 128K
       9C 2A 2F 39 A1 AD D6 1C 7C 80 A1 6B 95 37 D2 2C>)
(   4,<2014-04-10 19:38:10.764 -0700>,<Administrator>,<X>,<proc1d>,<TOPSPIN 2.1>,
      <abs ABSG = 1 
       data hash MD5: 128K
       CE 84 55 38 32 75 03 EB B1 A7 9E 2F 8B 2A A2 97>)
(   5,<2014-04-10 19:38:10.889 -0700>,<Administrator>,<X>,<proc1d>,<TOPSPIN 2.1>,
      <abs ABSG = 2 
       data hash MD5: 128K
       FB 84 D6 5F 9D 40 25 F9 91 A9 E9 6A C6 52 94 D8>)
(   6,<2014-04-10 19:38:11.076 -0700>,<Administrator>,<X>,<proc1d>,<TOPSPIN 2.1>,
      <abs ABSG = 3 
       data hash MD5: 128K
       32 E3 15 D3 8E D9 48 E1 41 4E 55 DD AC FB 78 CF>)
(   7,<2014-04-10 19:38:11.248 -0700>,<Administrator>,<X>,<proc1d>,<TOPSPIN 2.1>,
      <abs ABSG = 4 
       data hash MD5: 128K
       49 99 20 99 E1 B3 82 54 E4 E5 F0 2B E8 E6 4F D6>)
(   8,<2014-04-10 19:38:11.404 -0700>,<Administrator>,<X>,<proc1d>,<TOPSPIN 2.1>,
      <abs ABSG = 5 
       data hash MD5: 128K
       00 75 FE B6 E0 24 B4 A3 E5 FD FF E9 11 3E 50 1F>)
$$ ##END=
$$ 
$$ $$ hash MD5
$$ $$ CA 44 AB 53 09 9D 0F 0A DF A6 54 16 A4 80 88 F5
##$RELAX= 
##$RELAX= 
##$RELAX= 
##$RELAX= 
##$RELAX= 
##$RELAX= 
##$RELAX= 
##$RELAX= 
$$ Bruker specific parameters
$$ --------------------------
##$DU= <E:\>
##$EXPNO= 12
$$ [...]
##$TP07= 0
##$TPNAME0= <>
##$TPNAME1= <>
##$TPNAME2= <>
##$TPNAME3= <>
##$TPNAME4= <>
##$TPNAME5= <>
##$TPNAME6= <>
##$TPNAME7= <>
##$TPOAL= (0..7)
0.5 0.5 0.5 0.5 0.5 0.5 0.5 0.5
##$TPOFFS= (0..7)
0 0 0 0 0 0 0 0
##$TUNHIN= 0
##$TUNHOUT= 0
##$TUNXOUT= 0
##$USERA1= <user>
##$USERA2= <user>
##$USERA3= <user>
##$USERA4= <user>
##$USERA5= <user>
##$V9= 5
##$VALIST= <valist>
##$VCLIST= <CCCCCCCCCCCCCCC>
##$VD= 0
##$VDLIST= <DDDDDDDDDDDDDDD>
##$VPLIST= <PPPPPPPPPPPPPPP>
##$VTLIST= <TTTTTTTTTTTTTTT>
##$WBST= 1024
##$WBSW= 4
##$XGAIN= (0..3)
0 0 0 0
##$XL= 0
##$YL= 0
##$YMAX_a= 10423058
##$YMIN_a= -23759425
##$ZGOPTNS= <>
##$ZL1= 120
##$ZL2= 120
##$ZL3= 120
##$ZL4= 120
##$ABSF1= 14.96245
##$ABSF2= -5.595732
##$ABSG= 5
##$ABSL= 3
##$ALPHA= 0
##$AQORDER= 0
##$ASSFAC= 0
##$ASSFACI= 0
##$ASSFACX= 0
##$ASSWID= 0
##$AUNMP= <proc_prof1d_extract.lims>
##$AXLEFT= 0
##$AXNAME= <>
##$AXNUC= <1H>
##$AXRIGHT= 0
##$AXTYPE= 0
##$AXUNIT= <>
##$AZFE= 0.1
##$AZFW= 0.1
##$BCFW= 0
##$BC_mod= 0
##$BYTORDP= 0
##$COROFFS= 0
##$CY= 15
##$DATMOD= 1
##$DC= 0
##$DFILT= <>
##$DTYPP= 0
##$F1P= 0
##$F2P= 0
##$FCOR= 0.5
##$FTSIZE= 131072
##$FT_mod= 6
##$GAMMA= 0
##$GB= 0
##$INTBC= 1
##$INTSCL= 1
##$ISEN= 128
##$LB= 0.3
##$LEV0= 0
##$LPBIN= 0
##$MAXI= 10000
##$MC2= 0
##$MEAN= 0
##$ME_mod= 0
##$MI= 0
##$NCOEF= 0
##$NC_proc= -2
##$NLEV= 6
##$NOISF1= 0
##$NOISF2= 0
##$NSP= 0
##$NTH_PI= 0
##$NZP= 0
##$OFFSET= 14.96245
##$PC= 1
##$PHC0= -82.97974
##$PHC1= 0
##$PH_mod= 1
##$PKNL= yes
##$PPARMOD= 0
##$PPDIAG= 0
##$PPIPTYP= 0
##$PPMPNUM= 2147483647
##$PPRESOL= 1
##$PSCAL= 4
##$PSIGN= 0
##$PYNMP= <proc.py>
##$REVERSE= no
##$SF= 400.020009058334
##$SI= 131072
##$SIGF1= 0
##$SIGF2= 0
##$SINO= 400
##$SIOLD= 131072
##$SPECTYP= <>
##$SREGLST= <1H.CDCl3>
##$SSB= 0
##$STSI= 131072
##$STSR= 0
##$SW_p= 8223.68421052631
##$SYMM= 0
##$S_DEV= 0
##$TDeff= 65536
##$TDoff= 0
##$TI= <>
##$TILT= no
##$TM1= 0
##$TM2= 0
##$TOPLEV= 0
##$USERP1= <user>
##$USERP2= <user>
##$USERP3= <user>
##$USERP4= <user>
##$USERP5= <user>
##$WDW= 1
##$XDIM= 131072
##$YMAX_p= 271583860
##$YMIN_p= -11577
##$CURPLOT= <Network HP LaserJet P1505>
##$CURPRIN= <$Network HP LaserJet P1505>
##$DFORMAT= <normdp>
##$LAYOUT= <+/1D_H.xwp>
##$LFORMAT= <normlp>
##$PFORMAT= <normpl>
##$SURQMSG= 1
$$ End of Bruker specific parameters
$$ ---------------------------------
##NTUPLES= NMR SPECTRUM
##VAR_NAME=  FREQUENCY,     SPECTRUM/REAL,   SPECTRUM/IMAG
##SYMBOL=    X,             R,               I
##VAR_TYPE=  INDEPENDENT,   DEPENDENT,       DEPENDENT
##VAR_FORM=  AFFN,          ASDF,            ASDF
##VAR_DIM=   131072,        131072,          131072
##UNITS=     HZ,            ARBITRARY UNITS, ARBITRARY UNITS
##FACTOR=    0.0627417313425164, 1,          1
##FIRST=     8223.62146879497, 1882,         -71553
##LAST=      0,             4602,            -71725
##MIN=       0,             -11577,          0
##MAX=       8223.62146879497, 271583860,    0
$$ Real data points
##PAGE= N=1
##DATA TABLE= (X++(R..R)), XYDATA
$$ [...]
62953C804203J7237J7813J8401J8128J6890J5499J4849J5107J5786J6395J6766
62942C987074J6819J6398J5498J4400J3354J2289J1011R588Q328P348O325M735
62930D123167K243j114n120r632j4656k0189k6066l2057l8107m4321n0711n7053
62918C826384o3007o8223p2334p5024p6277p6431p5880p4760p2952p0320o6818
62907C034358o2541n7731n2690m7595m2553l7873l3976l0843k7806k4191k0091
62896B596468j6208j3050j0533q275n912l229l99J884L023L346L979N671Q086
62883B564851J0439J2376J3937J5079J5827J6689J8277K0453K2405K3743K5041
62872B759117K6986K9284L0896L1252L0750L0070K9397K8556K7474K6154K4395
$$ plain form
62953 3804203 3821440 3839253 3857654 3875782 3892672 3908171 3923020 3938127 3953913 3970308 3987074
62942 3987074 4003893 4020291 4035789 4050189 4063543 4075832 4086843 4096431 4104759 4112107 4118432 4123167
62930 4123167 4125410 4124296 4119176 4109544 4094888 4074699 4048633 4016576 3978469 3934148 3883437 3826384
62918 3826384 3763377 3695154 3622820 3547796 3471519 3395088 3319208 3244448 3171496 3101176 3034358
62907 3034358 2971817 2914086 2861396 2813801 2771248 2733375 2699399 2668556 2640750 2616559 2596468
62896 2596468 2580260 2567210 2556677 2548402 2542490 2539261 2538862 2540746 2543769 2547115 2551094 2556765 2564851
62883 2564851 2575290 2587666 2601603 2616682 2632509 2649198 2667475 2687928 2710333 2734076 2759117
62872 2759117 2786103 2815387 2846283 2877535 2908285 2938355 2967752 2996308 3023782 3049936 3074331
62861C074331K2056J9572J7709J6641J5760J4601J3491J2902J2578J1882J0707
62850C242230R458Q344P350O779O997P571P467O343M881L590K155L96j039j722
62836C310800k359l713n189n606n036m655m853m802m028l231l024k920k294j567
62822C257523j553k077k166j403l99P4j27o84j324j969k525k737k372j659j301
62807C235301j684k125j429P04L297N318O779Q308J0223J2471J5035J7878K0746
62794C330822K3572K6738L0455L4136L6995L9069M1034M3155M5098M6709M8341
62783C746124N0255N2223N3918N5240N6213N6987N8052N9939O2592O5349O7730
62772D384622O9909P2320P5212P8682Q2802Q7430R2178R6617J00313J02790J03840
$$ plain form
62861 3074331 3096387 3115959 3133668 3150309 3166069 3180670 3194161 3207063 3219641 3231523 3242230
62850 3242230 3251688 3260032 3267382 3274161 3281158 3288729 3296196 3302539 3307420 3311010 3313165 3313561 3312522 3310800
62836 3310800 3308441 3304728 3299539 3293933 3288897 3284242 3279389 3274587 3270559 3267328 3264304 3261384 3259090 3257523
62822 3257523 3255970 3253893 3251727 3250324 3249925 3249999 3249872 3249188 3247864 3245895 3243370 3240633 3238261 3236602 3235301
62807 3235301 3233617 3231492 3230063 3230767 3234064 3239382 3246161 3254469 3264692 3277163 3292198 3310076 3330822
62794 3330822 3354394 3381132 3411587 3445723 3482718 3521787 3562821 3605976 3651074 3697783 3746124
62783 3746124 3796379 3848602 3902520 3957760 4013973 4070960 4129012 4188951 4251543 4316892 4384622
62772 4384622 4454531 4526851 4602063 4680745 4763547 4850977 4943155 5039772 5140085 5242875 5346715
62761E346715J03863J03290J01671R7908R1578Q3392P4092O3487N0997L6562K0533
62750F174088L147j5267l3933n2024o9175q5114r9079j10255j18674j25078j29952
62739E338684j33106j34135j32849j29358j24166j18142j11926j05372r8032r0027
62729D161571q1970p4102o6192n8354n1262m5289l9918l4432k8841k3769j9658
62718C637784j6342j3305j0220p319n258m376m181l868l353l307m122n296o102
62705C550735o405o526o713p026p510q104q569q732q562p952o799n444m553m245
62691C453595l864l007k203k030k121j838j604k506m711p236r436j1781j4805
62678C386453j8057k0694k2606k4440k6759k9621l2660l5229l6715l7127l7166
$$ plain form
62761 5346715 5450578 5553868 5655539 5753447 5845025 5928417 6002509 6065996 6116993 6153555 6174088
62750 6174088 6177235 6161968 6128035 6076011 6006836 5921722 5822643 5712388 5593714 5468636 5338684
62739 5338684 5205578 5071443 4938594 4809236 4685070 4566928 4455002 4349630 4251598 4161571
62729 4161571 4079601 4005499 3939307 3880953 3829691 3784402 3744484 3710052 3681211 3657442 3637784
62718 3637784 3621442 3608137 3597917 3590598 3585340 3580964 3576783 3572915 3569562 3566255 3562133 3556837 3550735
62705 3550735 3544330 3537804 3531091 3524065 3516555 3508451 3499882 3491150 3482588 3474636 3467837 3462393 3457840 3453595
62691 3453595 3449731 3446724 3444521 3442491 3440370 3438532 3436928 3434422 3429711 3422475 3413039 3401258 3386453
62678 3386453 3368396 3347702 3325096 3300656 3273897 3244276 3211616 3176387 3139672 3102545 3065379
62667C065379l7423l7657l7264l6153l4754l3282l1516k9314k6941k4754k2832
62656B713489k1044j9289j7574j5913j4260j2480j0446q252o248m736l617k499
62644B577131j140L09J484K154K382K448K608K931L342L784M165M208L613K500
62630B611919J433Q09M12k42j270k421l540m739o041p126p556p226o538o129o271
62615B555474o554o265n143l588k099q31L10J454K863M784O974Q823J0317J2289
62601B578808J5143J7892J9341J9880K1047K3412K5953K7733K9128L0922L3095
62590B842354L5160L7022L8874M0780M2933M5759M9174N2264N4458N6551N9749
62579C355078O4094O8651P2992P7487Q2290Q6981R1436R6049J00821J04977J07830
$$ plain form
62667 3065379 3027956 2990299 2953035 2916882 2882128 2848846 2817330 2788016 2761075 2736321 2713489
62656 2713489 2692445 2673156 2655582 2639669 2625409 2612929 2602483 2594231 2587983 2583247 2579630 2577131
62644 2577131 2575991 2576300 2577784 2579938 2582320 2584768 2587376 2590307 2593649 2597433 2601598 2605806 2609419 2611919
62630 2611919 2613352 2614161 2614573 2614331 2613061 2610640 2607100 2602361 2596320 2589194 2581638 2574412 2567874 2561745 2555474
62615 2555474 2548920 2542655 2537512 2533924 2531825 2530994 2531304 2532758 2535621 2540405 2547379 2556202 2566519 2578808
62601 2578808 2593951 2611843 2631184 2651064 2672111 2695523 2721476 2749209 2778337 2809259 2842354
62590 2842354 2877514 2914536 2953410 2994190 3037123 3082882 3132056 3184320 3238778 3295329 3355078
62579 3355078 3419172 3487823 3560815 3638302 3720592 3807573 3899009 3995058 4095879 4200856 4308686
62568D308686J09398J09774J08511J05075R9412R1639Q1564O9035N4414L8278
62558E175786K0882K382j6657l5317n2773o8449q1978r3393j03070j11083j16864
62547D519466j19859j20353j19199j16881j13302j08389j02383r5565q8184q0681
62537C454670p3488o6568n9601n2679m6308m0551l4764k8451k1890j5521r252
62526C005597k938K982Q074J2898J8429K4481K9640L3103L5789L8937M2283M4492
62514C293767M5017M4586M3853M2507M0062L6754L3120K9186K4636J9410J3650
62503C666548P290K89o923j3788k0350k6964l3296l8333m1632m3940m6153m8162
62491C354586m9241m9278m8868m8305m7063m4570m1111l7623l4771l2451l0072
$$ plain form
62568 4308686 4418084 4527858 4636369 4741444 4840856 4932495 5014059 5083094 5137508 5175786
62558 5175786 5196668 5199050 5182393 5147076 5094303 5025854 4943876 4850483 4747413 4636330 4519466
62547 4519466 4399607 4279254 4160055 4043174 3929872 3821483 3719100 3623535 3535351 3454670
62537 3454670 3381182 3314614 3255013 3202334 3156026 3115475 3080711 3052260 3030370 3014849 3005597
62526 3005597 3002659 3005641 3013715 3026613 3045042 3069523 3099163 3132266 3168055 3206992 3249275 3293767
62514 3293767 3338784 3383370 3427223 3469730 3509792 3546546 3579666 3608852 3633488 3652898 3666548
62503 3666548 3673838 3674127 3667204 3653416 3633066 3606102 3572806 3534473 3492841 3448901 3402748 3354586
62491 3354586 3305345 3256067 3207199 3158894 3111831 3067261 3026150 2988527 2953756 2921305 2891233
62480B891233k7174k3734k0099j6752j4140j2466j1488j0591r182p120m700k400
62468B731387o80K12N23R80K032L143L380K754K369K951L863M061L539L100L069
62453B766683L028K697K294J966J555J055O70K48n96j634j961j244l17l5j52J4
62437B774271L59L39J13M07J330K205K619K834L086L329L831N156P101Q531Q839
62422B824350Q859R648J1051J2269J3316J4785J6474J7476J7731J8330J9947K1947
62410C006183K3586K5153K7115K8922K9675K9665L0118L1459L2865L3744L4723
62399C333208L6632L9201M1553M3534M5867M8974N2402N5504N8209O0803O3341
62388C879228O5625O7563O9154P0226P0548P0266O9900O9713O9310O8121O6139
$$ plain form
62480 2891233 2864059 2840325 2820226 2803474 2789334 2776868 2765380 2754789 2745607 2738487 2733787 2731387
62468 2731387 2730707 2730919 2731442 2732422 2734454 2737597 2740977 2743731 2746100 2749051 2752914 2756975 2760514 2763614 2766683
62453 2766683 2769711 2772408 2774702 2776668 2778223 2779278 2779948 2780196 2779600 2777966 2776005 2774761 2774444 2774409 2774257 2774271
62437 2774271 2774630 2774969 2775082 2775489 2776819 2779024 2781643 2784477 2787563 2790892 2794723 2799879 2806980 2815511 2824350
62422 2824350 2833209 2842857 2853908 2866177 2879493 2894278 2910752 2928228 2945959 2964289 2984236 3006183
62410 3006183 3029769 3054922 3082037 3110959 3140634 3170299 3200417 3231876 3264741 3298485 3333208
62399 3333208 3369840 3409041 3450594 3494128 3539995 3588969 3641371 3696875 3755084 3815887 3879228
62388 3879228 3944853 4012416 4081570 4151796 4222344 4292610 4362510 4432223 4501533 4569654 4635793
62377D635793O3951O2168O1176O1314O2785O5217O7698O9644P1372P3560P6351
62366E371029P9327Q2153Q4673Q6464Q6867Q5652Q3252Q0061P5906P0456O3797
62355F249637N6080M6886L5493K1786O456r846k7037m5074o3276q0600r6419j10530
62343E983556j22478j31477j37322j40882j43226j44447j43780j40795j35873
62334D743276j29518j21855j13133j04141r5585q7355p9009p0765o3320n6804
62324C821791n0591m4317l8439l3516k9438k5752k2350j9420j7006j5048j3569
62313C512345j2485j1384r962q543p776p780q022q030p869p898q289q957r706
62300C395644j0311j0648j0808j0982j1151j1038j0420r341p990o454m681k676
$$ plain form
62377 4635793 4699744 4761912 4823088 4884402 4947187 5012404 5080102 5149746 5221118 5294678 5371029
62366 5371029 5450356 5532509 5617182 5703646 5790513 5876165 5959417 6039478 6115384 6185840 6249637
62355 6249637 6305717 6352603 6388096 6409882 6416338 6406492 6379455 6334381 6271105 6190505 6094086 5983556
62343 5983556 5861078 5729601 5592279 5451397 5308171 5163724 5019944 4879149 4743276
62334 4743276 4613758 4491903 4378770 4274629 4179044 4091689 4012680 3941915 3878595 3821791
62324 3821791 3771200 3726883 3688444 3654928 3625490 3599738 3577388 3557968 3540962 3525914 3512345
62313 3512345 3499860 3488476 3478514 3469971 3462195 3454415 3446393 3438363 3430494 3422596 3414307 3405350 3395644
62300 3395644 3385333 3374685 3363877 3352895 3341744 3330706 3320286 3310945 3302955 3296501 3291820 3289144
62288C289144o47J037K154K824L334L750L940M038M622O129Q202R884J0444R969
62274C358824R191R019R969J1825J3866J5616J7276J9108K0684K1243K0825K0458
62262C547904K1010K2291K3528K4267K4421K3825K2363K0423J8687J7296J5722
62251C781737J3624J1405R570P877N645K848K74j537k963m586o269p565q702j0328
62237C791030j2290j3515j3437j2818j2708j3122j3376j3232j3001j2762j2196
62226C648573j1150r706p821n563l607k738k689k273q13J119K699L942N323O923
62212C622219Q457R805J1014J1974J2583J3072J3861J5124J6725J8449K0123K1685
62200C795091K3268K5062K7005K8898L0880L3340L6247L9130M1964M5441M9979
$$ plain form
62288 3289144 3288497 3289534 3291688 3294512 3297846 3301596 3305536 3309574 3314196 3320325 3328527 3338411 3348855 3358824
62274 3358824 3368015 3377034 3387003 3398828 3412694 3428310 3445586 3464694 3485378 3506621 3527446 3547904
62262 3547904 3568914 3591205 3614733 3639000 3663421 3687246 3709609 3730032 3748719 3766015 3781737
62251 3781737 3795361 3806766 3816336 3824213 3829858 3832706 3832980 3831443 3828480 3823894 3817625 3810060 3801358 3791030
62237 3791030 3778740 3765225 3751788 3738970 3726262 3713140 3699764 3686532 3673531 3660769 3648573
62226 3648573 3637423 3627717 3619896 3614333 3610726 3607988 3605299 3603026 3602213 3603332 3606031 3609973 3615296 3622219
62212 3622219 3630676 3640481 3651495 3663469 3676052 3689124 3702985 3718109 3734834 3753283 3773406 3795091
62200 3795091 3818359 3843421 3870426 3899324 3930204 3963544 3999791 4038921 4080885 4126326 4176305
62189D176305N5022N9962O5176P1321P8026Q4186Q9470R4667J00417J06457J12207
62178E093216J17372J21672J24699J26369J26867J25767J21896J14662J05019
62169F177539R4292Q2355O7827N0089L0296J0038j0242l0860n1396p0439q6856
62158F262643j00577j11826j20346j26027j29714j32404j33768j32517j28461
62149E147003j23185j18116j12770j05849r7409q8880q1213p4112o7157o0640
62139D217672n4966m9987m5325m0792l6103l0801k4918j9328j4913j1627q732
62128C880180n792k996o71J241L128N286P566R471J0751J1743J2834J3725J3714
62115C960180J2785J1891J1912J2785J3835J4583J4866J4624J4009J3484J3437
$$ plain form
62189 4176305 4231327 4291289 4356465 4427786 4505812 4589998 4679468 4774135 4874552 4981009 5093216
62178 5093216 5210588 5332260 5456959 5583328 5710195 5835962 5957858 6072520 6177539
62169 6177539 6271831 6354186 6422013 6472102 6502398 6512436 6502194 6471334 6419938 6349499 6262643
62158 6262643 6162066 6050240 5929894 5803867 5674153 5541749 5407981 5275464 5147003
62149 5147003 5023818 4905702 4792932 4687083 4589674 4500794 4419581 4345469 4278312 4217672
62139 4217672 4162706 4112719 4067394 4026602 3990499 3959698 3934780 3915452 3900539 3888912 3880180
62128 3880180 3874388 3871392 3870721 3871962 3875090 3880376 3887942 3897413 3908164 3919907 3932741 3946466 3960180
62115 3960180 3972965 3984856 3996768 4009553 4023388 4037971 4052837 4067461 4081470 4094954 4108391
62104D108391J3822J4383J5032J5739J6369J6853J7332J7850J8176J8191J8156
62093D290294J8338J8592J8668J8570J8307J7635J6510J5545J5509J6411J7500
62082D481879J8077J8036J7715J7600J7976J8664J9216J9579K0130K0835K0950
62071D690657K0148J9344J9516K0119J9698J7981J6186J5190J4448J3162J1440
62060D877889R747Q000O020M285L412L165K717J730N54n24j673l040m374n234
62046D902674n513n635o271p725r513j0814j1403j1896j2886j4162j5034j5154
62034D776668j4739j4209j3892j3874j3881j3530j2905j2552j2692j2812j2422
62023D629160j1888j1913j2519j3101j3404j3727j4151j4204j3501j2289j1086
$$ plain form
62104 4108391 4122213 4136596 4151628 4167367 4183736 4200589 4217921 4235771 4253947 4272138 4290294
62093 4290294 4308632 4327224 4345892 4364462 4382769 4400404 4416914 4432459 4447968 4464379 4481879
62082 4481879 4499956 4517992 4535707 4553307 4571283 4589947 4609163 4628742 4648872 4669707 4690657
62071 4690657 4710805 4730149 4749665 4769784 4789482 4807463 4823649 4838839 4853287 4866449 4877889
62060 4877889 4887636 4895636 4901656 4905941 4909353 4912518 4915235 4916965 4917519 4916995 4915322 4912282 4907908 4902674
62046 4902674 4897161 4891526 4885255 4877530 4868017 4857203 4845800 4833904 4821018 4806856 4791822 4776668
62034 4776668 4761929 4747720 4733828 4719954 4706073 4692543 4679638 4667086 4654394 4641582 4629160
62023 4629160 4617272 4605359 4592840 4579739 4566335 4552608 4538457 4524253 4510752 4498463 4487377
62012D487377j0131r307q408p305o161n460n524n932n821m856l568k639k236k230
61998D407799k570l124l494l447l387l915n065o240o921p142p207p281p286p084
61984D333636o619o009n509n250n084m733m118l409k739k072j382q20n20l34J11
61969D285149J004K122L032L490L551L387L157L073L424M308N429O260O508O288
61955D340182N975N905O228O836P469P932Q252Q509Q631Q468Q093P829P953Q510
61941D446772R378J0367J1243J1879J2467J3272J4139J4508J4058J3151J2380
61930D583614J1874J1316J0563R915R734R988J0199R842Q851P870P791Q908J0588
61917D711053J2006J3025J4027J5073J5754J5925J6007J6280J6305J5552J4252
$$ plain form
62012 4487377 4477246 4467939 4459531 4452226 4446065 4440605 4435081 4429149 4423328 4418472 4414904 4412265 4410029 4407799
61998 4407799 4405229 4402105 4398611 4395164 4391777 4387862 4382797 4376557 4369636 4362494 4355287 4348006 4340720 4333636
61984 4333636 4327017 4321008 4315499 4310249 4305165 4300432 4296314 4292905 4290166 4288094 4286712 4285892 4285372 4285038 4285149
61969 4285149 4286153 4288275 4291307 4294797 4298348 4301735 4304892 4307965 4311389 4315697 4321126 4327386 4333894 4340182
61955 4340182 4346157 4352062 4358290 4365126 4372595 4380527 4388779 4397288 4405919 4414387 4422480 4430309 4438262 4446772
61941 4446772 4456150 4466517 4477760 4489639 4502106 4515378 4529517 4544025 4558083 4571234 4583614
61930 4583614 4595488 4606804 4617367 4627282 4637016 4647004 4657203 4667045 4675896 4683766 4691557 4700465 4711053
61917 4711053 4723059 4736084 4750111 4765184 4780938 4796863 4812870 4829150 4845455 4861007 4875259
61906D875259J3025J1802R775O550K777p05l930p529j1585j5309j7893j9393k0559
61893D822285k2032k3802k5438k6666k7624k8476k8821k7895k5474k2383j9820
61882D543854j8264j7289j6196j4545j2191r317o407l761j054K168N583Q312J0204
61869D471097J2196J5011J8149K0726K2765K4990K7655L0346L2712L4719L6301
61858D746667L7401L8352L9621M1147M2529M3680M4645M4887M3620M1050L8452
61847E202051L6643L5017L2510K8970K5084K1494J8386J5618J2841R780O698M197
61835E449289K313L99j843l758m770n368o485q242j0056j1665j3361j5371j7681
61822E353401k0327k3251k5997k8134k9879l1731l3625l5095l6118l7111l8069
$$ plain form
61906 4875259 4888284 4900086 4909861 4916411 4919188 4918483 4914553 4907024 4895439 4880130 4862237 4842844 4822285
61893 4822285 4800253 4776451 4751013 4724347 4696723 4668247 4639426 4611531 4586057 4563674 4543854
61882 4543854 4525590 4508301 4492105 4477560 4465369 4456052 4449645 4445884 4444830 4446998 4452581 4460893 4471097
61869 4471097 4483293 4498304 4516453 4537179 4559944 4584934 4612589 4642935 4675647 4710366 4746667
61858 4746667 4784068 4822420 4862041 4903188 4945717 4989397 5034042 5078929 5122549 5163599 5202051
61847 5202051 5238694 5273711 5306221 5335191 5360275 5381769 5400155 5415773 5428614 5438394 5445092 5449289
61835 5449289 5451602 5452001 5450158 5446400 5441630 5436262 5429777 5421535 5411479 5399814 5386453 5371082 5353401
61822 5353401 5333074 5309823 5283826 5255692 5225813 5194082 5160457 5125362 5089244 5052133 5014064
61811E014064l8505l8291l7811l7149l5812l3613l1184k9242k7816k6492k4996
61800D653153k3178k0910j8326j5903j3927j2202j0472q842p514o428n419m433
61788D505599l258j450J107L716N397N775N330M850M866N394N969N953N062L542
61774D557852J807R1j512k911m145n423o810q078q962r461r774j0098j0571j1183
61760D470822j1661j1751j1625j1745j2139j2238j1590j0448r377q612q034p494
61748D344108o873n992m788l453k212j121j16R05K032L100L535L096K707L831
61734D338759O680R708J1377J1746J1823J2136J2679J3644J5176J6735J7688J8362
61722D496513J9490K0825K1300K0642J9792J9521J9577J9514J9422J9341J8670
$$ plain form
61811 5014064 4975559 4937268 4899457 4862308 4826496 4792883 4761699 4732457 4704641 4678149 4653153
61800 4653153 4629975 4609065 4590739 4574836 4560909 4548707 4538235 4529393 4521879 4515451 4510032 4505599
61788 4505599 4502341 4500891 4501998 4505714 4511111 4516886 4522216 4527066 4531932 4537326 4543295 4549248 4554310 4557852
61774 4557852 4559659 4559750 4558238 4555327 4551182 4545759 4538949 4530871 4521909 4512448 4502674 4492576 4482005 4470822
61760 4470822 4459161 4447410 4435785 4424040 4411901 4399663 4388073 4377625 4368248 4359636 4351602 4344108
61748 4344108 4337235 4331243 4326455 4323002 4320790 4319669 4319553 4320458 4322490 4325590 4329125 4332221 4334928 4338759
61734 4338759 4345439 4355147 4366524 4378270 4390093 4402229 4414908 4428552 4443728 4460463 4478151 4496513
61722 4496513 4516003 4536828 4558128 4578770 4598562 4618083 4637660 4657174 4676596 4695937 4714607
61711D714607J6931J4543J2389J0845R687Q630P529O377N458N236N702O160N982
61698D830076N344M843M662M493M094L523K941K567K609K934K898J925K29j364
61684D871774k306k775l215l752m109l884k896j431j42N30Q45J526K963M808O525
61669D864461Q125J0118J2747J5580J8047K0169K2419K4885K7071K8656L0026
61658E082304L1659L3342L4528L5286L6211L7386L8017L7453L6023L4556L3305
61647E470070L1725K9116K5276K0594J5707J0975O279J426l298p385j0750j3737
61635E575998j6382j8308j9515k0680k2331k4178k5798k7441k9609l2222l4813
61624E304721l7300l9827m2050m3345m3842m4505m5949m7664m8665m8416m6959
$$ plain form
61711 4714607 4731538 4746081 4758470 4769315 4779002 4787632 4795161 4801538 4806996 4812232 4817934 4824094 4830076
61698 4830076 4835420 4840263 4844925 4849418 4853512 4857035 4859976 4862543 4865152 4868086 4870984 4872909 4873138 4871774
61684 4871774 4869468 4866693 4863478 4859726 4855617 4851733 4848837 4847406 4847264 4847794 4848639 4850165 4853128 4857936 4864461
61669 4864461 4872586 4882704 4895451 4911031 4929078 4949247 4971666 4996551 5023622 5052278 5082304
61658 5082304 5113963 5147305 5181833 5217119 5253330 5290716 5328733 5366186 5402209 5436765 5470070
61647 5470070 5501795 5530911 5556187 5576781 5592488 5603463 5609742 5611168 5607870 5600485 5589735 5575998
61635 5575998 5559616 5541308 5521793 5501113 5478782 5454604 5428806 5401365 5371756 5339534 5304721
61624 5304721 5267421 5227594 5185544 5142199 5098357 5053852 5007903 4960239 4911574 4863158 4816199
61613D816199m4524m1411l7970l4447l0901k7371k3930k0571j7253j4183j1686
61602D511952r678p626n155k421L00L012N763Q321J0501J2514J4632J6721J8548
61589D577384K0323K2432K4715K6598K8028K9683L1969L4408L6310L7687L8938
61578D908475M0033M0553M0396L9808L8787L7143L5152L3475L2104L0139K7051
61567E303116K3655K1130J9546J8113J6582J5539J5287J5315J5168J5022J5093
61556E493566J5023J4455J3714J3391J3472J3423J2948J2179J1343J0641J0409
61545E634564J0935J2125J3651J5430J7619K0236K3069K5980K8975L2004L4921
61534E869509L7578L9691M0788M0667L9841L9108L8657L8027L6904L5477L3953
$$ plain form
61613 4816199 4771675 4730264 4692294 4657847 4626946 4599575 4575645 4555074 4537821 4523638 4511952
61602 4511952 4502274 4494648 4489493 4487072 4487372 4490384 4496147 4504468 4514969 4527483 4542115 4558836 4577384
61589 4577384 4597707 4620139 4644854 4671452 4699480 4729163 4761132 4795540 4831850 4869537 4908475
61578 4908475 4948508 4989061 5029457 5069265 5108052 5145195 5180347 5213822 5245926 5276065 5303116
61567 5303116 5326771 5347901 5367447 5385560 5402142 5417681 5432968 5448283 5463451 5478473 5493566
61556 5493566 5508589 5523044 5536758 5550149 5563621 5577044 5589992 5602171 5613514 5624155 5634564
61545 5634564 5645499 5657624 5671275 5686705 5704324 5724560 5747629 5773609 5802584 5834588 5869509
61534 5869509 5907087 5946778 5987566 6028233 6068074 6107182 6145839 6183866 6220770 6256247 6290200
61523F290200L2389L1221L1292L2848L4965L6551L7597L8794M0192M1048M0992
61512F688089M0562M0266L9873L9054L8186L7778L7558L6839L5709L5005L5009
61501G103928L4944L4069L2606L1086K9372K6978K4058K1263J8796J6317J3862
61490G387279J2082J1319J1024J0473R577Q590P334N216J897k341o861j1151j5257
61477G429181j9840k5627l2597l9945m6887n3244n9019o3908o7574p0102p1792
61466F878646p2680p2572p1356o9033o5678o1639n7390n2938m7799m1981l6471
61455F229109l2119k8436k4317j9647j5307j1729q384m724p09L765Q957J4481
61443F110940J9176K2442K5000K7879L1150L4235L6912L9295M1112M1749M0977
$$ plain form
61523 6290200 6322589 6353810 6385102 6417950 6452915 6489466 6527063 6565857 6606049 6647097 6688089
61512 6688089 6728651 6768917 6808790 6847844 6886030 6923808 6961366 6998205 7033914 7068919 7103928
61501 7103928 7138872 7172941 7205547 7236633 7266005 7292983 7317041 7338304 7357100 7373417 7387279
61490 7387279 7399361 7410680 7421704 7432177 7441754 7450344 7457678 7462894 7464791 7462450 7455589 7444438 7429181
61477 7429181 7409341 7383714 7351117 7311172 7264285 7211041 7152022 7088114 7020540 6950438 6878646
61466 6878646 6805966 6733394 6662038 6593005 6527327 6465688 6408298 6355360 6307561 6265580 6229109
61455 6229109 6196990 6168554 6144237 6124590 6109283 6097554 6089170 6084446 6083737 6087502 6096459 6110940
61443 6110940 6130116 6152558 6177558 6205437 6236587 6270822 6307734 6347029 6388141 6429890 6470867
61432F470867L9166L6799L4089L1042K7600K3881K0353J7578J5569J3823J2078
61421F742845J0623R411P550M360N00k821n551q798j3095j7670k1760k5776l0598
61408F649220l6172m1492m5687m8589n0416n1384n1603n0910m8791m4888l9611
61397F139677l3905k8199k1969j4577o335J690Q895J5710K2812L0231L7546M4656
61385F196232N1733N8499O4251O8851P3104P7634Q1783Q4329Q5120Q5291Q5702
61374G012529Q5877Q4859Q2570P9807P7128P4373P1260O7976O4981O2563O0698
61363G824621N9235N8089N7380N7333N7857N8221N7557N5761N3536N1333M8635
61352H439558M4590L9017L2300K4553J5553N428n191j5877k6675l7447m7542n6419
$$ plain form
61432 6470867 6510033 6546832 6580921 6611963 6639563 6663444 6683797 6701375 6716944 6730767 6742845
61421 6742845 6753468 6762879 6770429 6774789 6775289 6772468 6766917 6758119 6745024 6727354 6705594 6679818 6649220
61408 6649220 6613048 6571556 6525869 6477280 6426864 6375480 6323877 6272967 6224176 6179288 6139677
61397 6139677 6105772 6077573 6055604 6041027 6034692 6036382 6045277 6060987 6083799 6114030 6151576 6196232
61385 6196232 6247965 6306464 6370715 6439566 6512670 6590304 6672087 6756416 6841536 6926827 7012529
61374 7012529 7098406 7183265 7265835 7345642 7422770 7497143 7568403 7636379 7701360 7763923 7824621
61363 7824621 7883856 7941945 7999325 8056658 8114515 8172736 8230293 8286054 8339590 8390923 8439558
61352 8439558 8484148 8523165 8555465 8580018 8595571 8600999 8595808 8579931 8553256 8515809 8468267 8411848
61340H411848o4160p0925p6344p9964q1975q2906q2868q1663p9437p6610p3200
61329G561796o8923o3974n9026n4361m9569m4324l8923l3797k9003k4465k0291
61318G075140j6400j2278p512k335K817P970J3411J8957K3980K8293L2558L7511
61306G202112M3043M8250N2429N5654N8298O0146O0438N8799N5724N1873M7261
61295G794027M1540L4720K7089J8678R521L08p992j5202k1840k7770l1891l3536
61283G787652l3395l2403l0422k6724k1321j4957q081n69P584J5957K4044L1486
61271G698851L8021M3589M8384N2435N5356N6862N7296N7142N6267N4181N1010
61260H269394M7646M4993M3401M2720M2521M2451M2802M4562M8438N4057O0610
$$ plain form
61340 8411848 8347688 8276763 8200419 8120455 8038480 7955574 7872706 7791043 7711606 7634996 7561796
61329 7561796 7492873 7428899 7369873 7315512 7265943 7221619 7182696 7148899 7119896 7095431 7075140
61318 7075140 7058740 7046462 7038950 7036615 7039432 7047402 7060813 7079770 7103750 7132043 7164601 7202112
61306 7202112 7245155 7293405 7345834 7401488 7459786 7519932 7580370 7639169 7694893 7746766 7794027
61295 7794027 7835567 7870287 7897376 7916054 7925575 7925883 7917891 7902689 7880849 7853079 7821188 7787652
61283 7787652 7754257 7721854 7691432 7664708 7643387 7628430 7620349 7619780 7627364 7643321 7667365 7698851
61271 7698851 7736872 7780461 7828845 7881280 7936636 7993498 8050794 8107936 8164203 8218384 8269394
61260 8269394 8317040 8362033 8405434 8448154 8490675 8533126 8575928 8620490 8668928 8722985 8783595
61249H783595O7941P6352Q5588R4801J03438J11288J17699J21676J22966J22292
61239I807636J20198J16237J09586R9765Q6542O9925N0789L0964J2093n307k1372
61228A0477056l5911m8357n8307o5704p0780p4129p6514p8314p9455q0085q0844
61217I728656q2075q3331q4269q5626q8614r3464r9227j04967j10456j15571j19631
61206H661425j21812j22037j21028j19533j17666j15107j11631j07279j02111
61197G623221r6169q9832q3815p8533p3708o8916o4237o0000n6122n2368m8996
61186F850525m6406m4143m1115l7020l2758k9070k5503k1166j5818r728k995M234
61174F549037J1403J8013K4279L0753L7520M4223N0575N6402O1471O5739O9536
$$ plain form
61249 8783595 8851536 8927888 9013476 9108277 9211715 9323003 9440702 9562378 9685344 9807636
61239 9807636 9927834 10044071 10153657 10253422 10339964 10409889 10460678 10491642 10503735 10498428 10477056
61228 10477056 10441145 10392788 10334481 10268777 10197997 10123868 10047354 9969040 9889585 9809500 9728656
61217 9728656 9646581 9563250 9478981 9393355 9304741 9211277 9112050 9007083 8896627 8781056 8661425
61206 8661425 8539613 8417576 8296548 8177015 8059349 7944242 7832611 7725332 7623221
61197 7623221 7527052 7437220 7353405 7274872 7201164 7132248 7068011 7008011 6951889 6899521 6850525
61186 6850525 6804119 6759976 6718861 6681841 6649083 6620013 6594510 6573344 6557526 6547798 6544803 6549037
61174 6549037 6560440 6578453 6602732 6633485 6671005 6715228 6765803 6822205 6883676 6949415 7018951
61163G018951P3035P5904P7870P9224Q0163Q0184P8863P6857P5175P3649P1055
61152G860930O6773O1497N6226N1336M6809M2608L8568L4451L0322K6375K2381
61141H338276J7908J3102Q591M473J82m492r045j3185j7302k1564k5381k8390
61129H263173l1294l4864l8574m1119m2053m2233m2650m3566m4757m5984m7045
61118G809034m7853m8668m9961n1865n4010n5929n7456n8622n9447n9991o0394
61107G204838o0657o0366n8904n6019n2141m7977m3787l9256l4136k8690k3301
61096F699604j7945j2444o961j761L346Q609J3552J7300J9906K2392K5250K7665
61084F798513K8821K9068K9088K8659K7283K5501K4373K3865K2978K1593K0946
$$ plain form
61163 7018951 7091986 7167890 7245760 7324984 7405147 7485331 7564194 7641051 7716226 7789875 7860930
61152 7860930 7927703 7989200 8045426 8096762 8143571 8186179 8224747 8259198 8289520 8315895 8338276
61141 8338276 8356184 8369286 8377877 8382350 8382532 8378040 8368995 8355810 8338508 8316944 8291563 8263173
61129 8263173 8231879 8197015 8158441 8117322 8075269 8033036 7990386 7946820 7902063 7856079 7809034
61118 7809034 7761181 7712513 7662552 7610687 7556677 7500748 7443292 7384670 7325223 7265232 7204838
61107 7204838 7144181 7083815 7024911 6968892 6916751 6868774 6824987 6785731 6751595 6722905 6699604
61096 6699604 6681659 6669215 6662254 6660493 6663839 6672448 6686000 6703300 6723206 6745598 6770848 6798513
61084 6798513 6827334 6856402 6885490 6914149 6941432 6966933 6991306 7015171 7038149 7059742 7080688
61073G080688K1877K3622K4961K5772K6840K8657L1137L4087L7273M0288M2967
61062G418169M5716M8991N2611N6121N9622O3709O8697P4489Q1113Q8779R7334
61051H155351J06202J15021J23892J32876J41682J50005J57719J64525J69880
61042I417153J73532J75693J76485J75554J72535J67358J59776J49282J36257
61033A0903625J22663J10628J00415R0737Q1144P3132O8650O8416P2296Q0489
61023A1772195R3446J10854J31591J54689J79967K07941K39832K77660L23434
61014A3491609L77679M38761N03764N69629O33209O90699P38123P73198P96796
61005A9013467Q12211Q22665Q29390Q31244Q24540Q02060P53827O72198N58434
$$ plain form
61073 7080688 7102565 7126187 7151148 7176920 7203760 7232417 7263554 7297641 7334914 7375202 7418169
61062 7418169 7463885 7512876 7565487 7621608 7681230 7744939 7813636 7888125 7969238 8058017 8155351
61051 8155351 8261553 8376574 8500466 8633342 8775024 8925029 9082748 9247273 9417153
61042 9417153 9590685 9766378 9942863 10118417 10290952 10458310 10618086 10767368 10903625
61033 10903625 11026288 11136916 11237331 11328068 11409212 11482344 11550994 11619410 11691706 11772195
61023 11772195 11865641 11976495 12108086 12262775 12442742 12650683 12890515 13168175 13491609
61014 13491609 13869288 14308049 14811813 15381442 16014651 16705350 17443473 18216671 19013467
61005 19013467 19825678 20648343 21477733 22308977 23133517 23935577 24689404 25361602 25920036
60996B5920036M23909K83844J49762K7374q1551j79070k72956l74842m92576o23279
60986B4780651p53964q68750r55924j010607j034066j031986j012521r83874r51836
60977A6177123r18165q80711q35648p80687p17023o48666n80073n14370m53155
60968I848625l97298l47516l04129k66604k33790k04904j80024j59232j41632
60959G613496j25896j11611r9300q9016p9714p0323o0703n1254m2302l4224k7489
60948F821664k1958j6772j1470o693l181q15Q10J519J050k01j894m545q609j3307
60934F735598j7528k1488k6153l1227l5186l7402l8822m0229m1219m1305m0829
60923F364210m0185l9136l7514l5679l3728l1162k7889k4645k1869j9179j6510
$$ plain form
60996 25920036 26343945 26627789 26777551 26804925 26723374 26544304 26271348 25896506 25403930 24780651
60986 24780651 24026687 23157937 22202013 21191406 20157340 19125354 18112833 17128959 16177123
60977 16177123 15258958 14378247 13542599 12761912 12044889 11396223 10816150 10301780 9848625
60968 9848625 9451327 9103811 8799682 8533078 8299288 8094384 7914360 7755128 7613496
60959 7613496 7487600 7375989 7276689 7187673 7107959 7037636 6976933 6925679 6883377 6849153 6821664
60948 6821664 6799706 6782934 6771464 6764771 6761590 6760775 6761585 6763104 6764154 6763953 6762059 6757514 6748905 6735598
60934 6735598 6718070 6696582 6670429 6639202 6604016 6566614 6527792 6487563 6446344 6405039 6364210
60923 6364210 6324025 6284889 6247375 6211696 6177968 6146806 6118917 6094272 6072403 6053224 6036714
60912F036714j4579j3423j1703q650n576l988l141j154K061M860O677Q837J2284
60899F009219J6167J9298K1654K3717K5490K6917K8408L0109L1356L1521L0756
60888F294612K9406K7288K4234K0566J6384J1087M423k508q363j3208j8103k3306
60876F362512k7981l1679l4873l7788l9746m0255l9971l9843l9803l8989l7035
60865E954549l4486l2007k9724k7459k5136k2906k0988j9552j8504j7376j5702
60854E690709j3543j1404r598p930o127m294k670j222J97J418K085K195K128K003
60840E643947J453K20j365k850m346o311q756j1098j2877j4267j5697j7144j8126
60827E532783j8279j7903j7764j8343j9239j9449j8379j6513j4864j3844j2945
$$ plain form
60912 6036714 6022135 6008712 5997009 5988359 5982783 5978795 5975654 5974500 5976561 5981421 5988098 5996935 6009219
60899 6009219 6025386 6044684 6066338 6090055 6115545 6142462 6170870 6200979 6232335 6263856 6294612
60888 6294612 6324018 6351306 6375540 6396106 6412490 6423577 6428000 6425492 6417129 6403921 6385818 6362512
60876 6362512 6334531 6302852 6267979 6230191 6190445 6150190 6110219 6070376 6030573 5991584 5954549
60865 5954549 5920063 5888056 5858332 5830873 5805737 5782831 5761843 5742291 5723787 5706411 5690709
60854 5690709 5677166 5665762 5656164 5648234 5642107 5637813 5635143 5633921 5634118 5635536 5637621 5639816 5641944 5643947
60840 5643947 5645400 5645620 5644255 5641405 5637059 5630748 5621992 5610894 5598017 5583750 5568053 5550909 5532783
60827 5532783 5514504 5496601 5478837 5460494 5441255 5421806 5403427 5386914 5372050 5358206 5345261
60816E345261j1536r731q263p636p617p599p310p026p106p467p761p937q321q954
60802E230997r245q655p557o934p241p933q225p949p545p400p419p098n917l795
60788E128084j259R65K630M068N656P294Q585R356R919J0881J2697J5188J7534
60775E231598J9017J9835K0978K3130K5964K8608L0572L1992L3262L4763L6754
60764E536473L9114M1313M2915M4213M5959M8384N0739N2053N2133N1542N0673
60753F055511M9234M6826M3682M0479L7361L3617K8454K1943J4966Q431K802j810
60741F381496n505q478j0770j2100j2186j1162r407p073m145q90K306N607R719
60728F317412J4937K0659K6083L0974L5412L9318M2720M6166N0184N4472N8171
$$ plain form
60816 5345261 5333725 5323994 5315731 5308095 5300478 5292879 5285569 5278543 5271437 5263970 5256209 5248272 5239951 5230997
60802 5230997 5221752 5213097 5205540 5198606 5191365 5183432 5175207 5167258 5159713 5152313 5144894 5137796 5131879 5128084
60788 5128084 5126825 5127790 5130420 5134488 5140144 5147438 5156023 5165379 5175298 5186179 5198876 5214064 5231598
60775 5231598 5250615 5270450 5291428 5314558 5340522 5369130 5399702 5431694 5464956 5499719 5536473
60764 5536473 5575587 5616900 5659815 5704028 5749987 5798371 5849110 5901163 5953296 6004838 6055511
60753 6055511 6104745 6151571 6195253 6235732 6273093 6306710 6335164 6357107 6372073 6380504 6383306 6381496
60741 6381496 6375991 6367513 6356743 6344643 6332457 6321295 6311888 6304815 6300670 6299780 6302086 6307693 6317412
60728 6317412 6332349 6353008 6379091 6410065 6445477 6484795 6527515 6573681 6623865 6678337 6736508
60717F736508O0986O3553O6582P0087P3661P7123Q0520Q3647Q6012Q7342Q7939
60706G573960Q8258Q8240Q7270Q4853Q1129P6612P1603O6021N9624N2207M3694
60695H373471L4342K4692J5043N281m346j2644j8395k1836k4358k6643k7981k7699
60683H288927k6361k4887k3259k0868j7640j4096j0561p028l500J33M364R571
60671H154795J5421K1249K6886L2660L8820M5515N2989O1181O9417P7120Q4610
60660H680663R2530J00687J08115J14096J18435J21090J22325J22856J22893J21194
60650I824884J16207J08068R8428Q8259P7042O4214N0104L5109J9182K788j2732
60639A0471553k6487l8763m9808n8909o5579p0669p5201p8804q0424q0142p9167
$$ plain form
60717 6736508 6797494 6861047 6927629 6997716 7071377 7148500 7229020 7312667 7398679 7486021 7573960
60706 7573960 7662218 7750458 7837728 7922581 8003710 8080322 8151925 8217946 8277570 8329777 8373471
60695 8373471 8407813 8432505 8447548 8452829 8448483 8435839 8417444 8395608 8371250 8344607 8316626 8288927
60683 8288927 8262566 8237679 8214420 8193552 8175912 8161816 8151255 8144227 8140727 8140860 8145224 8154795
60671 8154795 8170216 8191465 8218351 8251011 8289831 8335346 8388335 8449516 8518933 8596053 8680663
60660 8680663 8773193 8873880 8981995 9096091 9214526 9335616 9457941 9580797 9703690 9824884
60650 9824884 9941091 10049159 10147587 10235846 10312888 10377102 10427206 10462315 10481497 10484285 10471553
60639 10471553 10445066 10406303 10356495 10297586 10232007 10161338 10086137 10007333 9926909 9846767 9767600
60628I767600p8324p7643p7266p7684p9005q0826q2999q5894q9682r3921r7975
60617H846381j01497j04534j07378j10222j12654j13767j13091j11113j08418
60608G863707j04786r9747r3620q7199q0570p3162o4942n6726m9085m1638l3745
60597G078487k5361j6934q813j152N895J2210J8024K3999L0787L8234M5177N0537
60585G251090N4674N8918O3567O7203O8695O8954O9654P0755P0629O8365O4610
60574G977114O0090N4654M8161M1188L4277K7261J9890J2414N093k210r505j6363
60562H252064k2489k7992l2734l6081l7830l8624l8928l8171l5615l1522k6785
60551G885293k1750j6093r579k344N292J2838J9789K6149L2411L8567M3691M7148
$$ plain form
60628 9767600 9689276 9611633 9534367 9456683 9377678 9296852 9213853 9127959 9038277 8944356 8846381
60617 8846381 8744884 8640350 8532972 8422750 8310096 8196329 8083238 7972125 7863707
60608 7863707 7758921 7659174 7565554 7478355 7397785 7324623 7259681 7202955 7153870 7112232 7078487
60597 7078487 7053126 7036192 7027379 7026227 7032122 7044332 7062356 7086355 7117142 7155376 7200553 7251090
60585 7251090 7305764 7364682 7428249 7495452 7564147 7633101 7702755 7773510 7844139 7912504 7977114
60574 7977114 8037204 8091858 8140019 8181207 8215484 8242745 8262635 8275049 8280142 8277932 8268427 8252064
60562 8252064 8229575 8201583 8168849 8132768 8094938 8056314 8017386 7979215 7943600 7912078 7885293
60551 7885293 7863543 7847450 7837871 7835527 7840819 7853657 7873446 7899595 7932006 7970573 8014264 8061412
60539H061412M9574N1789N3194N2419M9300M5068M0585L5570K9835K4166J9364
60528H512276J5238J1162P094L421L13k193l821m372m088l275j720R41M478Q166
60514H543620J1607J5002J8669K2682K6926L1154L4961L8124M0983M4132M7625
60503H875485N0888N3491N5635N7722N9754O1454O2641O3181O2830O1462N9302
60492I523845N6583N3086M8428M2687L6304K9444K1905J3786N745j626q311j4600
60480I807276k0635k6498l2344l8059m3146m7243n0528n3223n5121n6123n6848
60469I327508n7886n8615n7675n4742n0974m7380m3611l8876l3266k7312k0825
60458H836346j3242m952K840R806J7025K5350L4036M1721M8169N4167N9986O5002
$$ plain form
60539 8061412 8110986 8162775 8215969 8268388 8317688 8362756 8403341 8438911 8468746 8492912 8512276
60528 8512276 8527514 8538676 8545770 8549191 8549504 8547311 8543490 8539118 8535030 8531755 8530035 8530976 8535454 8543620
60514 8543620 8555227 8570229 8588898 8611580 8638506 8669660 8704621 8742745 8783728 8827860 8875485
60503 8875485 8926373 8979864 9035499 9093221 9152975 9214429 9277070 9340251 9403081 9464543 9523845
60492 9523845 9580428 9633514 9681942 9724629 9760933 9790377 9812282 9826068 9831813 9830187 9821876 9807276
60480 9807276 9786641 9760143 9727799 9689740 9646594 9599351 9548823 9495600 9440479 9384356 9327508
60469 9327508 9269622 9211007 9153332 9098590 9047616 9000236 8956625 8917749 8884483 8857171 8836346
60458 8836346 8823104 8818152 8820992 8830798 8847823 8873173 8907209 8948930 8997099 9051266 9111252 9176254
60446I176254O8857P1945P4383P5356P4234P1692O8923O6150O2708N8299N3226
60435I922027M7609M1421L5420L0881K7946K5264K1780J8072J5245J3423J2212
60424A0211300J1860J2890J5010J7460K0227K3871K8405L3308L8507M4299N0370
60413A0507507N5919O0849O5890P1424P7124Q2753Q8285R3221R6922R9852J03181
60402A1402927J06881J09395J09726J08510J06425J02905R7428R0748Q3605P5244
60392A2393794O4557N1954L8738K5314J1530j751j3101k2405l0739l8360m4337
60381A2435194m8396n1602n4686n6945n7500n6617n5071n3074n0609m8188m6474
60370A1856032m5500m4888m4574m4817m5763m7400m9798n3023n6988o1538o6541
$$ plain form
60446 9176254 9245111 9317056 9391439 9466795 9541029 9612721 9681644 9747794 9810502 9868801 9922027
60435 9922027 9969636 10011057 10046477 10077358 10105304 10130568 10152348 10170420 10185665 10199088 10211300
60424 10211300 10223160 10236050 10251060 10268520 10288747 10312618 10341023 10374331 10412838 10457137 10507507
60413 10507507 10563426 10624275 10690165 10761589 10838713 10921466 11009751 11102972 11199894 11299746 11402927
60402 11402927 11509808 11619203 11728929 11837439 11943864 12046769 12144197 12234945 12318550 12393794
60392 12393794 12458351 12510305 12549043 12574357 12585887 12584136 12571035 12548630 12517891 12479531 12435194
60381 12435194 12386798 12335196 12280510 12223565 12166065 12109448 12054377 12001303 11950694 11902506 11856032
60370 11856032 11810532 11765644 11721070 11676253 11630490 11583090 11533292 11480269 11423281 11361743 11295202
60359A1295202p1743p6803q1556q5968q9732r2362r3853r4788r5597r6028r5622
60348A0321150r4341r2516r0467q8449q6649q4987q3150q1065p9047p7298p5425
60337I387756p2778o9152o5035o1262n8382n6127n3469m9527m4528l9505l5089
60326H782902l0998k6825k2746j9091j5717j2265q767n563k823n34J246K575L928
60313H645322N885Q418J0855J2669J4056J5531J7215J8799K0146K1563K3160K4289
60301H837908K4084K2584K0747J9209J7551J5117J1918Q201L694j764p227j1260
60289H960762j3610j5366j7363j9323k0719k1533k1720k0774j8463j5422j2488
60278H763981r856p266m469j182K789O935J0140J2006J3426J5336J7514J9308
$$ plain form
60359 11295202 11223459 11146656 11065100 10979132 10889400 10797038 10703185 10608397 10512800 10416772 10321150
60348 10321150 10226809 10134293 10043826 9955377 9868728 9783741 9700591 9619526 9540479 9463181 9387756
60337 9387756 9314978 9245826 9180791 9119529 9061147 9005020 8951551 8902024 8857496 8817991 8782902
60326 8782902 8751904 8725079 8702333 8683242 8667525 8655260 8646493 8640930 8638107 8637573 8638819 8641394 8645322
60313 8645322 8651207 8659625 8670480 8683149 8697205 8712736 8729951 8748750 8768896 8790459 8813619 8837908
60301 8837908 8861992 8884576 8905323 8924532 8942083 8957200 8969118 8977319 8981013 8979249 8972022 8960762
60289 8960762 8947152 8931786 8914423 8895100 8874381 8852848 8831128 8810354 8791891 8776469 8763981
60278 8763981 8754125 8746859 8742390 8741208 8743997 8750932 8761072 8773078 8786504 8801840 8819354 8838662
60266H838662K0905K2959K5420K7749L0017L2764L5873L8446M0040M1212M2746
60255I196793M4916M7582N0421N2989N5088N7104N9472O1868O3540O4394O5087
60244I819254O6040O7046O8025O9287P0805P1958P2485P3095P4683P7398Q0982
60233A0611058Q5482R1096R7547J04303J11323J19155J28265J38569J49590J60846
60223A1797234J72121J83480J95058K06678K17787K27782K36269K43017K47874
60214A3727300K50928K52375K51976K48908K42418K32562K20063K05555J89328
60205A5821413J71647J52914J33379J12949R1641P0159M9705L1066J3995k194
60195A6646674j7531l1198m2635n2360o1298o9511p6180q0799q3889q6408q8960
$$ plain form
60266 8838662 8859567 8882526 8907946 8935695 8965712 8998476 9034349 9072795 9112835 9154047 9196793
60255 9196793 9241709 9289291 9339712 9392701 9447789 9504893 9564365 9626233 9689773 9754167 9819254
60244 9819254 9885294 9952340 10020365 10089652 10160457 10232415 10304900 10377995 10452678 10530076 10611058
60233 10611058 10696540 10787636 10885183 10989486 11100809 11219964 11348229 11486798 11636388 11797234
60223 11797234 11969355 12152835 12347893 12554571 12772358 13000140 13236409 13479426 13727300
60214 13727300 13978228 14230603 14482579 14731487 14973905 15206467 15426530 15632085 15821413
60205 15821413 15993060 16145974 16279353 16392302 16483943 16554102 16603807 16634873 16648868 16646674
60195 16646674 16629143 16597945 16555310 16502950 16441652 16372141 16295961 16215162 16131273 16044865 15955905
60184A5955905r1749r4829r8029j00979j03599j06353j09702j13506j17299j20967
60174A4898893j24740j28638j32389j35905j39345j42542j44798j45562j45040
60165A3659934j43800j41956j39197j35632j32079j29161j26442j22921j18383
60156A2470363j13709j09804j06614j03532j00307r7099r3971r0910q8299q6706
60146A1479412q6148q6062q6183q6970q8770r1092r3087r4481r5575r6559r7299
60135A0477186r7735r7914r7549r5971r2763q8166q2667p6384o9120o0950n2413
60124I565554m4015l5729k7292j8939j1457n328j39M797R327J2510J3775J3469
60112I476533J2092R522N487L94m904j0097j5566k1592k7866l3929l9654m5082
$$ plain form
60184 15955905 15864156 15769327 15671298 15570319 15466720 15360367 15250665 15137159 15019860 14898893
60174 14898893 14774153 14645515 14513126 14377221 14237876 14095334 13950536 13804974 13659934
60165 13659934 13516134 13374178 13234981 13099349 12967270 12838109 12711667 12588746 12470363
60156 12470363 12356654 12246850 12140236 12036704 11936397 11839298 11745327 11654417 11566118 11479412
60146 11479412 11393264 11307202 11221019 11134049 11045279 10954187 10861100 10766619 10671044 10574485 10477186
60135 10477186 10379451 10281537 10183988 10088017 9995254 9907088 9824421 9748037 9678917 9617967 9565554
60124 9565554 9521539 9485810 9458518 9439579 9428122 9422794 9422655 9427452 9436779 9449289 9463064 9476533
60112 9476533 9488625 9498147 9503634 9504028 9499124 9489027 9473461 9451869 9424003 9390074 9350420 9305338
60100I305338n0043n4208n7326n9275o0009n9625n8338n6272n3440n0009m6412
60089H700381m3024l9788l6359l2524k8410k4324k0445j6698j2874q962n255j977
60077H429741J217N036R677J4399J8267K1186K3944K7237L0937L4323L6807L8317
60065H691088L9102L9352L8969L7769L5865L3613L1149K8225K4760K1341J8645
60054I039878J6509J4094J1064Q042N726M093K785J755J088N77R9O3Q81K130K870
60039I111654K797K403K061J585Q01j05j110k580m677p012r280j1696j4359j6617
60025I053865j7726j7891j8034j8643j9341j9553j9108j8127j6790j5321j3856
60014H859475j2212j0040p346m596k204kK608N971R677J2828J4981J6694J8897
$$ plain form
60100 9305338 9255295 9201087 9143761 9084486 9024477 8964852 8906514 8850242 8796802 8746793 8700381
60089 8700381 8657357 8617569 8581210 8548686 8520276 8495952 8475507 8458809 8445935 8436973 8431718 8429741
60077 8429741 8430958 8435994 8445671 8460070 8478337 8499523 8523467 8550704 8581641 8615964 8652771 8691088
60065 8691088 8730190 8769542 8808511 8846280 8882145 8915758 8946907 8975132 8999892 9021233 9039878
60054 9039878 9056387 9070481 9081545 9089587 9095313 9099406 9102191 9103946 9105034 9105611 9105710 9105773 9106654 9108784 9111654
60039 9111654 9114451 9116854 9118915 9120500 9121301 9121196 9120086 9117506 9112829 9105817 9096537 9084841 9070482 9053865
60025 9053865 9036139 9018248 9000214 8981571 8962230 8942677 8923569 8905442 8888652 8873331 8859475
60014 8859475 8847263 8837223 8829877 8825281 8823077 8823075 8825683 8831654 8841331 8854159 8869140 8885834 8904731
60001H904731K1724K4437K6553K8469L0692L3068L5318L7781M0933M4534M8044
59990I276284N1654N5969O0822O5381O9496P3877P8682Q2904Q5670Q7337Q8602
59979A0076678Q9193Q8203Q5295Q0854P5214O8416O0587N1960M2677L3057K3910
59968A0776044J5989R248L135k407o730r270j0037r200o691k356L714J1245J9973
59955A0792657K9690M0196N1261O2533P3644Q4487R5171J05463J14564J21898
59945A1571564J27980J33920J39989J45181J48296J49039J47788J44735J39631
59936A2848123J32149J22070J09191R3520P5594N6377L6622J6469m218k5233m5919
59925A3414745o5577q3822j00378j14831j26789j36226j43403j48358j50762j50349
$$ plain form
60001 8904731 8926455 8950892 8977445 9005914 9036606 9069674 9104992 9142773 9183706 9228240 9276284
59990 9276284 9327938 9383907 9444729 9510110 9579606 9653483 9732165 9815069 9900739 9988076 10076678
59979 10076678 10165871 10254074 10339369 10420223 10495437 10563853 10624440 10676400 10719077 10752134 10776044
59968 10776044 10792033 10801281 10804416 10802009 10795279 10786009 10775972 10766772 10760081 10757725 10761439 10772684 10792657
59955 10792657 10822347 10862543 10913804 10976337 11049981 11134468 11229639 11335102 11449666 11571564
59945 11571564 11699544 11833464 11973453 12118634 12266930 12415969 12563757 12708492 12848123
59936 12848123 12980272 13102342 13211533 13305053 13380647 13437024 13473646 13490115 13485897 13460664 13414745
59925 13414745 13349168 13265346 13164968 13050137 12923348 12787122 12643719 12495361 12344599 12194250
59915A2194250j47248j41700j33701j23126j10145r5343p9464o3074m6359k9150
59905A1224940j1384O412K3450L9600N5583P1789Q7241J00221J09836J16534J21218
59894A1945440J24323J25826J25569J23450J19564J14282J07960J00520R1683
59885A2978617Q1601P0873N9806M8054L5229K1617Q082m606j6248k7237l8092
59874A3217696m8776n8419o6037p1493p5404p8092p9204p8578p6868p4788p2161
59863A2437876o8292o2996n6650m9374m0862l1109k0683r972J384J3916K7446
59852A2140684M1160N4484O7564Q0917R4762J08699J21812J33014J41599J47541
59842A3132236J51156J52388J50738J46024J38945J30352J20214J07906R3649
$$ plain form
59915 12194250 12047002 11905302 11771601 11648475 11538330 11442987 11363523 11300449 11254090 11224940
59905 11224940 11213556 11219968 11243418 11283018 11338601 11410390 11497631 11597852 11707688 11824222 11945440
59894 11945440 12069763 12195589 12321158 12444608 12564172 12678454 12786414 12886934 12978617
59885 12978617 13060218 13131091 13190897 13238951 13274180 13295797 13303879 13299273 13283025 13255788 13217696
59874 13217696 13168920 13110501 13044464 12972971 12897567 12819475 12740271 12661693 12584825 12510037 12437876
59863 12437876 12369584 12306588 12249938 12200564 12159702 12128593 12107910 12097938 12099322 12113238 12140684
59852 12140684 12181844 12236328 12303892 12384809 12479571 12588270 12710082 12843096 12984695 13132236
59842 13132236 13283392 13435780 13586518 13732542 13871487 14001839 14122053 14229959 14323608
59833A4323608P8857O4683N0873L6751K2875J0781J205o519j3213j8889k3299
59822A4527713k6584k8900l0028l0035k9757k9979l0473l0500l0024k9725l0000
59811A4201708l0694l1807l3772l6780m0306m3626m6419m8725n0651n2287n3609
59800A3733032n4225n3452n0824m6394m0515l3496k5567j6874p327L397J5490
59789A3423245K8716M2554N6478P0071Q3018R5114J06203J16046J24411J31177
59779A4277033J36137J38736J38419J35428J30959J26129J20900J14288J05737
59770A5423766R5975Q6347P7462O8816N9878N1289M4602M0828L9602L9911M1115
59759A6069591M2928M4832M6257M7236M8100M8380M6686M1945L4278K4287J1995
$$ plain form
59833 14323608 14402465 14467148 14518021 14554772 14577647 14588428 14589633 14583114 14569901 14551012 14527713
59822 14527713 14501129 14472229 14442201 14412166 14382409 14352430 14321957 14291457 14261433 14231708 14201708
59811 14201708 14171014 14139207 14105435 14068655 14028349 13984723 13938304 13889579 13838928 13786641 13733032
59800 13733032 13678807 13625355 13574531 13528137 13487622 13454126 13428559 13411685 13404358 13407755 13423245
59789 13423245 13451961 13494515 13550993 13621064 13704082 13799196 13905399 14021445 14145856 14277033
59779 14277033 14413170 14551906 14690325 14825753 14956712 15082841 15203741 15318029 15423766
59770 15423766 15519741 15606088 15683550 15752366 15812244 15863533 15908135 15948963 15988565 16028476 16069591
59759 16069591 16112519 16157351 16203608 16250844 16298944 16347324 16394010 16435955 16470233 16494520 16506515
59748A6506515l025k0801m0865o2791q6258j10575j34696j57928j80293k02082
59738A5507201k23092k42429k58989k72122k81937k88898k93124k94172k91623
59729A3060815k85698k77139k66613k54366k40370k24681k07716j90212j72761
59720A0941259j55347j37590j19502j01610q4133o6630m8856l1549j5696j316
59710A0179030J2431K6030L9214N1670O3333P3962Q3221R1485R9775J08407J16310
59699A0944868J22178J25940J28457J30171J30769J29965J27980J25116J21360
59690A2086804J16616J10931J04331R6613Q7556P7256O6205N5057M4390L4650
59680A2880409K6211J9250J3482Q183K826k374o847j0588j4153j7730k0798k3103
$$ plain form
59748 16506515 16503490 16482689 16441824 16379033 16292775 16182200 16047504 15889576 15709283 15507201
59738 15507201 15284109 15041680 14782691 14510569 14228632 13939734 13646610 13352438 13060815
59729 13060815 12775117 12497978 12231365 11976999 11736629 11511948 11304232 11114020 10941259
59720 10941259 10785912 10648322 10528820 10427210 10343077 10276447 10227591 10196042 10180346 10179030
59710 10179030 10191461 10217491 10256705 10308375 10371708 10445670 10528891 10620376 10720151 10828558 10944868
59699 10944868 11067046 11192986 11321443 11451614 11582383 11712348 11840328 11965444 12086804
59690 12086804 12203420 12314351 12418682 12515295 12602851 12680107 12746312 12801369 12845759 12880409
59680 12880409 12906620 12925870 12939352 12947535 12950361 12947987 12941140 12930552 12916399 12898669 12877871 12854768
59668A2854768k5341k8402l2282l6399m0648m5293m9946n3572n5758n7340n9296
59657A2370491o1507o3055o3429o2958o2259o1778o1797o2482o3732o5287o7251
59646A1674956p0303p5068q1283q7825r3726r9059j04591j10766j17256j23410
59636A0711669j28704j32698j35001j35624j35116j34016j32395j30122j27301
59627I520692j23984j19795j14310j07783j00952r4196q7350q0356p3528o6994
59617H551444o0350n3222m5838l8775l2298k6092j9580j2443m967K045P979J2998
59605H280901J7697K2216K6063K8806L0538L1554L1984L1906L1474L0634K9083
59594H592856K6769K4190K1906K0010J8236J6402J4480J2431J0198P798N308K941
$$ plain form
59668 12854768 12829427 12801025 12768743 12732344 12691696 12646403 12596457 12542885 12487127 12429787 12370491
59657 12370491 12308984 12245929 12182500 12119542 12057283 11995505 11933708 11871226 11807494 11742207 11674956
59646 11674956 11604653 11529585 11448302 11360477 11266751 11167692 11063101 10952335 10835079 10711669
59636 10711669 10582965 10450267 10315266 10179642 10044526 9910510 9778115 9647993 9520692
59627 9520692 9396708 9276913 9162603 9054820 8953868 8859672 8772322 8691966 8618438 8551444
59617 8551444 8491094 8437872 8392034 8353259 8320961 8294869 8275289 8262846 8257879 8259924 8267903 8280901
59605 8280901 8298598 8320814 8346877 8375683 8406221 8437775 8469759 8501665 8533139 8563773 8592856
59594 8592856 8619625 8643815 8665721 8685731 8703967 8720369 8734849 8747280 8757478 8765276 8770584 8773525
59582H773525J087l5p89j707k577k501j156O18J903K943M702P608J1292J5310
59568H810223J9495K3685K7719L1747L6007M0258M3829M6321M7911M8948M9534
59557I225677M9578M8878M7143M4114L9813L4580K8898K3231J7778J2281O252
59546I578223m37p443j4484k1523k8232l3893l8381m2627m7501n2646n7213o1207
59534I172636o5223o9033p1605p2466p2142p1184o9705o7955o6320o4486o1612
59523H420905n7612n3318m9023m3938l7647l1072k5148j9510j3386p098j609K908
59511H084452O998J0799J3909J6205J7959J9279K0214K1189K2543K3766K4056
59500H281369K3531K3082K3173K3590K4271K5498K7167K8836L0675L3445L7360
$$ plain form
59582 8773525 8774612 8774577 8773788 8772081 8769504 8767003 8765847 8766465 8768368 8771311 8776013 8783621 8794913 8810223
59568 8810223 8829718 8853403 8881122 8912869 8948876 8989134 9032963 9079284 9127195 9176143 9225677
59557 9225677 9275255 9324133 9371276 9415390 9455203 9489783 9518681 9541912 9559690 9571971 9578223
59546 9578223 9577786 9570343 9555859 9534336 9506104 9472211 9433830 9391203 9343702 9291056 9233843 9172636
59534 9172636 9107413 9038380 8966775 8894309 8822167 8750983 8681278 8613323 8547003 8482517 8420905
59523 8420905 8363293 8309975 8260952 8217014 8179367 8148295 8123147 8103637 8090251 8083153 8081544 8084452
59511 8084452 8091450 8102249 8116158 8132363 8150322 8169601 8189815 8211004 8233547 8257313 8281369
59500 8281369 8304900 8327982 8351155 8374745 8399016 8424514 8451681 8480517 8511192 8544637 8581997
59489H581997M1704M5927N0199N4618N8746O2508O6683P1829P7314Q2114Q6080
59478I279719Q9643R2759R5004R6372R7152R7103R5490R1979Q6887Q0595P3387
59467A0276090O5745N8107N0182M1256L1397K1806J3552O556K02n489r939j3083
59455A0536382j5717j8700k2104k5288k7616k9010k9962l1123l2784l4646l6130
59444A0233302l6816l6672l5883l4683l3211l1459k9272k6534k3341j9883j6124
59433I909424j1772o703j332L693Q216J2813J8134K4150L0178L5636M0501M5090
59421A0108028M9680N4369N9094O3614O7728P1723P6352Q2052Q8252R3761R7801
59410A0912454J00565J02985J06204J11070J17563J24682J31279J36995J42071
$$ plain form
59489 8581997 8623701 8669628 8719827 8774445 8833191 8895699 8962382 9034211 9111525 9193639 9279719
59478 9279719 9369362 9462121 9557125 9653497 9750649 9847752 9943242 10035221 10122108 10202703 10276090
59467 10276090 10341835 10399942 10450124 10491380 10522777 10544583 10558135 10564691 10564893 10559404 10549465 10536382
59455 10536382 10520665 10501965 10479861 10454573 10426957 10397947 10367985 10336862 10304078 10269432 10233302
59444 10233302 10196486 10159814 10123931 10089248 10056037 10024578 9995306 9968772 9945431 9925548 9909424
59433 9909424 9897652 9890949 9889617 9893310 9901526 9914339 9932473 9956623 9986801 10022437 10062938 10108028
59421 10108028 10157708 10212077 10271171 10334785 10402513 10474236 10550588 10632640 10720892 10814653 10912454
59410 10912454 11013019 11116004 11222208 11333278 11450841 11575523 11706802 11843797 11985868
59401A1985868J46213J48377J47880J45162J41061J35850J29491J22337J14787
59392A3217026J06496R6706Q5376P3198O0489M6833L2098J7135L037r818k1549
59381A3707027l2071m1236m9378n7069o4346p0632p5470p8923q1263q2604q2995
59370A2991040q2607q1647q0213p8324p6086p3839p2107p1189p0692o9667o7434
59359A2167235o4180o0590n7139n3860n0595m7089m3100l8768l4740l1482k8634
59348A1657058k5520k2203j9499j7825j6663j5321j3852j2852j2672j3106j3613
59337A1473932j3626j2967j2111j1829j2330j2920j2676j1205q653n267j226L326
59325A1362448Q415J4249K0933K8326L6347M5197N5019O5508P6149Q6673R7079
$$ plain form
59401 11985868 12132081 12280458 12428338 12573500 12714561 12850411 12979902 13102239 13217026
59392 13217026 13323522 13420228 13505604 13578802 13639291 13686124 13718222 13735357 13738394 13728576 13707027
59381 13707027 13674956 13633720 13584342 13527273 13462927 13392295 13316825 13237902 13156639 13074035 12991040
59370 12991040 12908433 12826786 12746573 12668249 12592163 12518324 12446217 12375028 12304336 12234669 12167235
59359 12167235 12103055 12042465 11985326 11931466 11880871 11833782 11790682 11751914 11717174 11685692 11657058
59348 11657058 11631538 11609335 11589836 11572011 11555348 11540027 11526175 11513323 11500651 11487545 11473932
59337 11473932 11460306 11447339 11435228 11423399 11411069 11398149 11385473 11374268 11365615 11360348 11359122 11362448
59325 11362448 11370863 11385112 11406045 11434371 11470718 11515915 11570934 11636442 11712591 11799264 11896343
59314A1896343J07367J17463J27283J36625J45181J52780J59423J64869J68520
59305A3175854J70075J70074J69374J68166J65921J62127J56756J50123J42803
59296A4631273J35597J29108J23319J17845J12578J07577J02488R6630Q9832Q2569
59286A5728816P5023O6505N6210M4174L1033J7104K163j3958l0915m8028o4602
59275A5863525q0103r4237j06968j18350j28276j36464j42643j46728j48912j49582
59265A4611262j49113j47627j45012j41237j36547j31375j26210j21548j17691
59256A3394902j14366j10722j06071j00638r5390r1075q7583q4234q0452p6072
59246A2448299p1246o6300o1613n7397n3487m9483m5140m0498l5609l0330k4530
$$ plain form
59314 11896343 12003710 12121173 12248456 12385081 12530262 12683042 12842465 13007334 13175854
59305 13175854 13345929 13516003 13685377 13853543 14019464 14181591 14338347 14488470 14631273
59296 14631273 14766870 14895978 15019297 15137142 15249720 15357297 15459785 15556415 15646247 15728816
59286 15728816 15803839 15870344 15926554 15970728 16001761 16018865 16021028 16007070 15976155 15928127 15863525
59275 15863525 15783422 15689185 15582217 15463867 15335591 15199127 15056484 14909756 14760844 14611262
59265 14611262 14462149 14314522 14169510 14028273 13891726 13760351 13634141 13512593 13394902
59256 13394902 13280536 13169814 13063743 12963105 12867715 12776640 12689057 12604823 12524371 12448299
59246 12448299 12377053 12310753 12249140 12191743 12138256 12088773 12043633 12003135 11967526 11937196 11912666
59235A1912666j8398j2266o229j03O246J2744J9326K6004L2717L9291M5705N2109
59223A2109812N8484O4496O9929P5038Q0179Q5278Q9915R3839R7149J00035J02584
59212A3026738J04747J06358J07242J07443J07141J06192J04004J00229R5266
59203A3965360Q9693Q3427P5939O7154N7557M7437L6642K5124J3187J112j0906
59192A4451726k2293l2256m0634m8008n4541n9352o1543o1414n9984n7577n3590
59181A3900534m7489l9462k9992j9386p791M666J7931L1937M6396O0852P4965
59170A3993161Q8554J01410J13363J24472J34829J44130J51816J57669J61999
59161A5171403J65100J66908J67442J67258J67077J67060J66874J66491J66585
$$ plain form
59235 11912666 11894268 11882002 11875773 11875670 11881916 11894660 11913986 11939990 11972707 12011998 12057703 12109812
59223 12109812 12168296 12232792 12302721 12377759 12457938 12543216 12633131 12726970 12824119 12924154 13026738
59212 13026738 13131485 13237843 13345085 13452528 13559669 13665861 13769865 13870094 13965360
59203 13965360 14055053 14138480 14214419 14281573 14339130 14386567 14423209 14448333 14461520 14462632 14451726
59192 14451726 14429433 14397177 14356543 14308535 14253994 14194642 14133099 14071685 14011701 13954124 13900534
59181 13900534 13853045 13813583 13783591 13764205 13756414 13761080 13779011 13810948 13857344 13918196 13993161
59170 13993161 14081715 14183125 14296488 14420960 14555789 14699919 14851735 15009404 15171403
59161 15171403 15336503 15503411 15670853 15838111 16005188 16172248 16339122 16505613 16672198
59152A6672198J67871J70333J73401J76773J80701J85400J90479J95113J98490
59143A8310759J99879J98556J94077J86518J76075J62574J45829J26353J04993
59134A9805613Q1737N5656K6499m190l4259o2871r0480j17078j41363j61967j78833
59123A9178464j92873k04618k13640k19180k20921k19094k14226k06966j98002
59114A7288944j87950j77237j66097j54660j43044j31438j20282j10269j01943
59105A5996024r5128q8963q2692p6333p0305o4600n8740n2555m6445m0644l4655
59094A5284964k7751j9833j1425l054N068J2797J9868K6012L1113L5175L8204
59083A5391138M0056M0406L8899L5396K9982K2851J4452N654k756j0810j9176
$$ plain form
59152 16672198 16840069 17010402 17183803 17360576 17541277 17726677 17917156 18112269 18310759
59143 18310759 18510638 18709194 18903271 19089789 19265864 19428438 19574267 19700620 19805613
59134 19805613 19887350 19943006 19969505 19965315 19931056 19868185 19777705 19660627 19519264 19357297 19178464
59123 19178464 18985591 18780973 18567333 18348153 18127232 17908138 17693912 17486946 17288944
59114 17288944 17100994 16923757 16757660 16603000 16459956 16328518 16208236 16097967 15996024
59105 15996024 15900896 15811933 15729241 15652908 15582603 15518003 15459263 15406708 15360263 15319619 15284964
59094 15284964 15257213 15237380 15225955 15222901 15227969 15240766 15260634 15286646 15317759 15352934 15391138
59083 15391138 15431194 15471600 15510499 15545895 15575877 15598728 15613180 15618834 15616078 15605268 15586092
59072A5586092k8099l7058m5658n4229o3021p1396p8499q4465r0285r6650j03521
59061A4833211j10642j17835j24867j31547j37886j43662j48133j50812j52355
59052A3615472j53793j55023j54878j52804j49584j46048j41943j36505j29591
59043A2295303j21773j13721j05809r7976q9844q1338p3128o5845n8846n0716
59033A1436307m1271l2066k4487j8212j2191o194n80M627R453J3387J6262J9193
59021A1364228K3513K8947L4004L7994M1619M5661N0298N5808O2722P0912P9555
59010A1895261Q8413R8235J09436J21326J33203J45402J58429J71757J84363J96078
59000A3301903K07483K18709K29007K37478K43542K46773K46840K43664K37175
$$ plain form
59072 15586092 15557993 15520935 15475277 15421048 15358027 15286631 15208132 15123667 15033382 14936732 14833211
59061 14833211 14722569 14604734 14479867 14348320 14210434 14066772 13918639 13767827 13615472
59052 13615472 13461679 13306656 13151778 12998974 12849390 12703342 12561399 12424894 12295303
59043 12295303 12173530 12059809 11954000 11856024 11766180 11684842 11611714 11545869 11487023 11436307
59033 11436307 11395036 11362970 11338483 11320271 11308080 11301886 11301306 11305933 11315386 11328773 11345035 11364228
59021 11364228 11387741 11416688 11450692 11488686 11530305 11575966 11626264 11682072 11744794 11815706 11895261
59010 11895261 11983674 12081909 12191345 12312671 12445874 12591276 12749705 12921462 13105825 13301903
59000 13301903 13509386 13728095 13957102 14194580 14438122 14684895 14931735 15175399 15412574
58991A5412574K26875K12048J92428J68370J40409J09161P5662M1295P087k6609
58981A6559300n9506r0785j19397j44771j66725j84758j98021k06297k10706k12785
58971A4965549k12977k10565k05363j98823j92876j87990j83070j77236j71021
58962A3225628j65511j60907j56387j51075j44801j38002j31069j23741j15098
58953A1939037j04404r1945p8688o5183n1258l6917k2821r544L066J5244K6450
58942A1523037L5777M2924M8204N1924N4251N5441N5476N3725M9636M3744L7289
58931A2051428L0997K4925J9460J5409J2928J1278J0077J0033J1874J5285J9576
58920A2233270K4898L1972M0873N0870O1306P1995Q2748R3143J02956J12347J21427
$$ plain form
58991 15412574 15639449 15851497 16043925 16212295 16352704 16461865 16537527 16578822 16585909 16559300
58981 16559300 16499794 16409009 16289612 16144841 15978116 15793358 15595337 15389040 15178334 14965549
58971 14965549 14752572 14542007 14336644 14137821 13944945 13756955 13573885 13396649 13225628
58962 13225628 13060117 12899210 12742823 12591748 12446947 12308945 12177876 12054135 11939037
58953 11939037 11834633 11742688 11664000 11598817 11547559 11510642 11487821 11478277 11481343 11496587 11523037
58942 11523037 11558814 11601738 11649942 11701866 11756117 11811558 11867034 11920759 11970395 12014139 12051428
58931 12051428 12082425 12107350 12126810 12142219 12155147 12166425 12176502 12186535 12198409 12213694 12233270
58920 12233270 12258168 12290140 12331013 12381883 12443189 12515184 12597932 12691075 12794031 12906378 13027805
58909A3027805J29819J36744J41438J43599J43637J42326J39830J35236J27484
58900A4267918J16705J04090R0379P5141N7867L9256K0755L107j4027l0891m6830
58889A4683470o1006p3483q5030r5878j05304j12646j18151j22435j25474j26833
58879A3657230j26769j26369j26392j26565j26349j25955j26127j27249j29053
58870A2516402j31067j32888j34182j34876j35365j36144j37233j38161j38514
58861A1297972j38190j37218j35622j33469j30867j27943j24996j22465j20361
58852A0126841j17944j14405j09825j05034j00549r6118r1347q6274q1122p5934
58842I148289p0608o5018n8964n2381m5725l9719l4516k9455k3927j8132j2746
$$ plain form
58909 13027805 13157624 13294368 13435806 13579405 13723042 13865368 14005198 14140434 14267918
58900 14267918 14384623 14488713 14579092 14654233 14712100 14751356 14772111 14775218 14761191 14730300 14683470
58889 14683470 14622464 14548981 14463951 14368073 14262769 14150123 14031972 13909537 13784063 13657230
58879 13657230 13530461 13404092 13277700 13151135 13024786 12898831 12772704 12645455 12516402
58870 12516402 12385335 12252447 12118265 11983389 11848024 11711880 11574647 11436486 11297972
58861 11297972 11159782 11022564 10886942 10753473 10622606 10494663 10369667 10247202 10126841
58852 10126841 10008897 9894492 9784667 9679633 9579084 9482966 9391619 9305345 9224223 9148289
58842 9148289 9077681 9012663 8953699 8901318 8855593 8815874 8781358 8751903 8727976 8709844 8697098
58831H697098q167m340j033K028N074Q003J0374J1939J3022J4153J5561J7192
58819H780904J9018K1005K2982K4812K6597K8541L0847L3825L7731M2307M6839
58808I115408N1069N5643O1240O7641P4089Q0376Q6987R4288J01987J09326J15485
58797A0013539J20096J23675J27185J30678J32798J32270J29552J26140J22599
58788A1158532J18264J12770J06729J00672R4360Q7587Q0719P3889O6507N8141
58778A2058170M9238M0246L0662J9628P019o774k1642l7531n3753o9480q4781
58767A1931002j00394j16345j31477j44527j55105j63527j70186j75218j78347
58758A0595876j78913j76408j71234j64647j57828j51051j43723j35062j24878
$$ plain form
58831 8697098 8688931 8684591 8683558 8685586 8690660 8698663 8709037 8720976 8733998 8748151 8763712 8780904
58819 8780904 8799922 8820927 8843909 8868721 8895318 8923859 8954706 8988531 9026262 9068569 9115408
58808 9115408 9166477 9222120 9283360 9351001 9425090 9505466 9592453 9686741 9788728 9898054 10013539
58797 10013539 10133635 10257310 10384495 10515173 10647971 10780241 10909793 11035933 11158532
58788 11158532 11276796 11389566 11496295 11596967 11691327 11778914 11859633 11933522 12000029 12058170
58778 12058170 12107408 12147654 12178316 12197944 12204963 12198189 12176547 12139016 12085263 12015783 11931002
58767 11931002 11830608 11714263 11582786 11438259 11283154 11119627 10949441 10774223 10595876
58758 10595876 10416963 10240555 10069321 9904674 9746846 9595795 9452072 9317010 9192132
58749I192132j13923j03336r3518q3888p4018o4587n6625n0049m3842l7567l1944
58738H438835k7745k4964k3326k2869k3545k4950k6886k9711l3510l7354m0055
58727H123920m1389m2078m2790m3593m4201m4243m3403m1707l9536l7095l4148
58716G669737l0709k7562k5421k3907k2081j9886j8210j7589j7667j8071j8914
58705G429720k0146k1288k2261k3718k5918k7908k8576k7924k6585k4485k1037
58694G159874j6363j1324o193l32O588J3814K0474K6639L2892L9241M4989M9428
58682G359727N2207N3192N2460N0287M6925M2404L6768L0260K2945J4510M810
58671G766495n496j5370k4414l2992m1350m9156n6078o2305o8112p3197p6895
$$ plain form
58749 9192132 9078209 8974873 8881355 8797467 8723449 8658862 8602237 8552188 8508346 8470779 8438835
58738 8438835 8411090 8386126 8362800 8339931 8316386 8291436 8264550 8234839 8201329 8163975 8123920
58727 8123920 8082531 8040453 7997663 7954070 7909869 7865626 7822223 7780516 7740980 7703885 7669737
58716 7669737 7639028 7611466 7586045 7562138 7540057 7520171 7501961 7484372 7466705 7448634 7429720
58705 7429720 7409574 7388286 7366025 7342307 7316389 7288481 7259905 7231981 7205396 7180911 7159874
58694 7159874 7143511 7132187 7125994 7125662 7132250 7146064 7166538 7193177 7226069 7265310 7310299 7359727
58682 7359727 7411934 7465126 7517586 7567873 7614798 7657202 7693970 7724230 7747175 7761685 7766495
58671 7766495 7760999 7745629 7721215 7688223 7646873 7597717 7541639 7479334 7411222 7338025 7261130
58660G261130p9001q0038q0693q1201q1336q0816p9529p7485p4737p1506o8233
58649F406555o5370o3042o0950n8699n6075n3073m9879m6918m4649m3067m1572
58638E823261l9587l7189l4811l2477k9785k6671k3629k0955j8181j4674j0554
58627E534748o564l116J86L914Q059J2132J5915J9805K4335K9394L4185L8037
58615E711030M1140M4314M8129N2413N6562O0141O3126O5766O8269P0564P2360
58604F353814P3564P4485P5382P5967P5723P4745P3832P3532P3460P2724P0798
58593G168026O7735O3849N9410N4527M9156M3369L7589L2159K6531J9519J0721
58582G632591J225p622j5699k3744l1971l9884m7346n4852o2542o9724p5671q0338
$$ plain form
58660 7261130 7182129 7102091 7021398 6940197 6858861 6778045 6698516 6621031 6546294 6474788 6406555
58649 6406555 6341185 6278143 6217193 6158494 6102419 6049346 5999467 5952549 5907900 5864833 5823261
58638 5823261 5783674 5746485 5711674 5679197 5649412 5622741 5599112 5578157 5559976 5545302 5534748
58627 5534748 5528184 5525068 5525254 5529168 5537227 5549359 5565274 5585079 5609414 5638808 5672993 5711030
58615 5711030 5752170 5796484 5844613 5897026 5953588 6013729 6076855 6142621 6210890 6281454 6353814
58604 6353814 6427378 6501863 6577245 6653212 6728935 6803680 6877512 6951044 7024504 7097228 7168026
58593 7168026 7235761 7299610 7359020 7413547 7462703 7506072 7543661 7575820 7602351 7621870 7632591
58582 7632591 7633816 7626194 7610495 7586751 7554780 7514896 7467550 7412698 7350156 7280432 7204761 7124423
58570G124423q3986q6711q8708r0438r2035r2853r2146r0019q7395q5161q3632
58559F151339q2547q1332p9458p6953p4438p2354p0396o7933o4847o1599n8599
58548E360883n5820n3022m9955m6389m2259l7842l3590k9767k6413k3546k1154
58537D941126j9091j7260j5867j5129j4750j4136j3203j2615j2945j3911j4667
58526D777552j4692j4179j3628j3345j3118j2338j0519p906n405l656k257k21
58514D666288K819O195R060J1341J3636J6374J9359K2088K4250K5837K7015K7994
58502D872256K8985L0045L0986L1446L1128L0031K8466K6783K4978K2637J9418
58491E177159J5585J1820Q493N317J825k042n996r777j3164j5824j7602j8957
$$ plain form
58570 7124423 7040437 6953726 6865018 6774580 6682545 6589692 6497546 6407527 6320132 6234971 6151339
58559 6151339 6068792 5987460 5908002 5831049 5756611 5684257 5613861 5545928 5481081 5419482 5360883
58548 5360883 5305063 5252041 5202086 5155697 5113438 5075596 5042006 5012239 4985826 4962280 4941126
58537 4941126 4922035 4904775 4888908 4873779 4859029 4844893 4831690 4819075 4806130 4792219 4777552
58526 4777552 4762860 4748681 4735053 4721708 4708590 4696252 4685733 4677827 4672422 4668766 4666509 4666288
58514 4666288 4669107 4675302 4684362 4695703 4709339 4725713 4745072 4767160 4791410 4817247 4844262 4872256
58502 4872256 4901241 4931286 4962272 4993718 5024846 5054877 5083343 5110126 5135104 5157741 5177159
58491 5177159 5192744 5204564 5213057 5218374 5220199 5218157 5212161 5202384 5189220 5173396 5155794 5136837
58479E136837k0687k3074k5592k7641k9221l0711l2289l3889l5568l7501l9621
58468D801043m1600m3314m5064m7145m9333n1031n1974n2539n3195n3806n3760
58457D258282n2845n1627n0732n0072m9044m7372m5306m3137m0962l8880l7002
58446C751303l5119l2811l0018k7096k4256k1369j8539j6254j4657j3145j1127
58435C506912q865p056n942n292m949m773m396l646l077l328m061m243l603l034
58421C440647l316m098m566m514m232l783k959j864r62m44Q7J147K740M320N423
58406C423626O184P075Q164Q971R208R306R813J0526J0792J0480J0130J0082J0087
58393C544444R853R446Q970Q314P457O537N470L938K005K50j005k131l484m799
$$ plain form
58479 5136837 5116150 5093076 5067484 5039843 5010622 4979911 4947622 4913733 4878165 4840664 4801043
58468 4801043 4759443 4716129 4671065 4623920 4574587 4523556 4471582 4419043 4365848 4312042 4258282
58457 4258282 4205437 4153810 4103078 4053006 4003962 3956590 3911284 3868147 3827185 3788305 3751303
58446 3751303 3716184 3683373 3653355 3626259 3602003 3580634 3562095 3545841 3531184 3518039 3506912
58435 3506912 3498047 3490991 3485049 3479757 3474808 3470035 3465639 3461993 3458916 3455588 3451527 3447284 3443681 3440647
58421 3440647 3437331 3433233 3428667 3424153 3419921 3416138 3413179 3411315 3410353 3409909 3409996 3411143 3413883 3418203 3423626
58406 3423626 3429810 3436885 3445049 3454020 3463228 3472534 3482347 3492873 3503665 3514145 3524275 3534357 3544444
58393 3544444 3554297 3563743 3572713 3581027 3588484 3595021 3600491 3604429 3606434 3606684 3605679 3603548 3600064 3595265
58379C595265n704o425p457q750r803j0344j0539j0673j0976j1557j2185j2302
58367C478550j1699j0957j0790j1095j1085j0287q997p808o929o022m553k410
58355C375918k07J357K548M508P781J1401J4031J5547J6889J8659K0668K2670
58343C511770K4796K7016K8830K9742K9822K9724L0226L1586L3079L3471L2247
58332C842309L0108K7933K5755K3231K0566J8159J5781J2972R998P451N132K336
58320D041731q46l620n892q419j1295j3430j3948j3265j2332j1650j1344j1418
58308C924272j1471j0873r614q222o685m412j539Q07K104L206M893O783Q435J0418
58294C908102J3183J5854J7383J8144J9201K0605K1756K2847K4553K6552K7856
$$ plain form
58379 3595265 3589561 3583136 3575679 3566929 3557126 3546782 3536243 3525570 3514594 3503037 3490852 3478550
58367 3478550 3466851 3455894 3445104 3434009 3422924 3412637 3403640 3395832 3388903 3382881 3378328 3375918
58355 3375918 3375711 3377068 3379616 3384124 3391905 3403306 3417337 3432884 3449773 3468432 3489100 3511770
58343 3511770 3536566 3563582 3592412 3622154 3651976 3681700 3711926 3743512 3776591 3810062 3842309
58332 3842309 3872417 3900350 3926105 3949336 3969902 3988061 4003842 4016814 4026812 4034263 4039395 4041731
58320 4041731 4040885 4037265 4031373 4022954 4011659 3998229 3984281 3971016 3958684 3947034 3935690 3924272
58308 3924272 3912801 3901928 3892314 3884092 3877407 3872995 3871456 3872263 3874367 3877573 3882466 3889249 3897684 3908102
58294 3908102 3921285 3937139 3954522 3972666 3991867 4012472 4034228 4057075 4081628 4108180 4136036
58283D136036K8563K9863L2156L4432L5832L6744L7948L9561M1282M2938M4407
58272D539762M5534M6444M7463M8567M9396M9899N0480N1461N2894N4866N7404
58261E094170O0136O2643O5172O8367P2234P6085P9559Q2997Q6684R0427R4175
58250E932649R8387J03449J09093J14758J20177J25554J31328J37861J45107J52674
58240G171037J60443J68827J78164J88218J98751K10127K22799K36715K51972
58231H987053K69455K89860L12499L36272L61554L89996M22563M59008M99260
58222A2327520N44174N94817O52151P17549P92781Q79570R80224J098735J240309
58213A9827830J410228J614505J861282K159603K515461K928306L389708L884570
$$ plain form
58283 4136036 4164599 4194462 4226618 4261050 4296882 4333626 4371574 4411135 4452417 4495355 4539762
58272 4539762 4585296 4631740 4679203 4727770 4777166 4827065 4877545 4929006 4981900 5036766 5094170
58261 5094170 5154306 5216949 5282121 5350488 5422722 5498807 5578366 5661363 5748047 5838474 5932649
58250 5932649 6031036 6134485 6243578 6358336 6478513 6604067 6735395 6873256 7018363 7171037
58240 7171037 7331480 7500307 7678471 7866689 8065440 8275567 8498366 8735081 8987053
58231 8987053 9256508 9546368 9858867 10195139 10556693 10946689 11369252 11828260 12327520
58222 12327520 12871694 13466511 14118662 14836211 15628992 16508562 17488786 18587521 19827830
58213 19827830 21238058 22852563 24713845 26873448 29388909 32317215 35706923 39591493
58205C9591493M397147M921248N466323O051999O696933P414417Q215504R108783
58197I1863847J0092228J1143205J2210238J3206914J4018694J4535525J4695454
58190A81766105J4500376J3990206J3208456J2189226J0948546R455859P617395
58183B63676169N328266K579425m76816l571663o432630q868063j0785630j2180918
58175B29268140j3127506j3752273j4177458j4457655j4562447j4418757j3975302
58168A30796742j3240695j2278564j1178000j0025939q893098p829466o863394
58161F0487586o004343n250117m594275m028926l544109l128355k770931k462748
58153B8703782k195551j961868j756020j574075j412699j269005j141331j028821
$$ plain form
58205 39591493 43988640 48909888 54376211 60428210 67125143 74539560 82755064 91863847
58197 91863847 101956075 113099280 125309518 138516432 152535126 167070651 181766105
58190 181766105 196266481 210256687 223465143 235654369 246602915 256058774 263676169
58183 263676169 269004435 271583860 271107044 267535381 261102751 252234688 241449058 229268140
58175 229268140 216140634 202388361 188210903 173753248 159190801 144772044 130796742
58168 130796742 117556047 105277483 94099483 84073544 75180446 67350980 60487586
58161 60487586 54483243 49233126 44638851 40609925 37065816 33937461 31166530 28703782
58153 28703782 26508231 24546363 22790343 21216268 19803569 18534564 17393233 16364412
58145A6364412r29944q42344p64308o95330o35042n82492n36671m96776m61708
58136A0419797m30154m01477l75813l53024l32273l12931k95167k79298k65066
58127G374594k51910k39459k27484k15782k04318j93173j82348j71889j62130
58118E526101j53269j44861j36324j27828j20043j13109j06598j00446r4979q9980
58108D338664q4760p9416p4926p1596o8338o4189n9701n5992n3128n0346m7370
58097C628902m4597m2137l9646l7082l4896l3347l2261l1605l1686l2470l3204
58086C235971l3136l2365l1537l0954l0450l0065l0166l0656l0623k9352k7379
58075B899288k5838k4891k3653k1695j9756j8489j7445j5939j4219j2845j1519
$$ plain form
58145 16364412 15434468 14592124 13827816 13132486 12497444 11914952 11378281 10881505 10419797
58136 10419797 9989643 9588166 9212353 8859329 8527056 8214125 7918958 7639660 7374594
58127 7374594 7122684 6883225 6655741 6439959 6235641 6042468 5860120 5688231 5526101
58118 5526101 5372832 5227971 5091647 4963819 4843776 4730667 4624069 4523623 4428644 4338664
58108 4338664 4253904 4174488 4099562 4027966 3959628 3895439 3835738 3779746 3726618 3676272 3628902
58097 3628902 3584305 3542168 3502522 3465440 3430544 3397197 3364936 3333331 3301645 3269175 3235971
58086 3235971 3202835 3170470 3138933 3107979 3077529 3047464 3017298 2986642 2956019 2926667 2899288
58075 2899288 2873450 2848559 2824906 2803211 2783455 2764966 2747521 2731582 2717363 2704518 2692999
58064B692999r626p633o731p054p356o677n341m057k962k005j430j258r05P5J295
58049B631334K147K671L311M107M624M565M117L824M194N205O171O472O415O768
58035B695925P426P388O379N549N943P090P844Q014Q238Q765R408J0384J2087
58022B800440J4152J5695J6681J8094K0547K3554K6444K9262L2334L5631L9155
58011C071989M3385M8659N4424N9723O4407O9275P4945Q1154Q7362R3622J00318
58000C849263J07242J13504J18506J22581J26267J29272J30689J30037J27509
57991D954870J23141J16465J07274R6065Q3240O8456N1387L2844J4352l191j9841
57980E625062l5715n0398o3279p3826q1517q6080q8044q8523q8090q6280q2457
$$ plain form
58064 2692999 2683373 2675740 2669009 2661955 2654599 2647922 2642581 2638524 2635562 2633557 2632127 2630869 2629964 2630039 2631334
58049 2631334 2633481 2636152 2639463 2643570 2648194 2652759 2656876 2660700 2664894 2670099 2676270 2682742 2689157 2695925
58035 2695925 2703351 2710739 2717118 2722667 2728610 2735700 2743544 2751558 2759796 2768561 2777969 2788353 2800440
58022 2800440 2814592 2830287 2846968 2865062 2885609 2909163 2935607 2964869 2997203 3032834 3071989
58011 3071989 3115374 3164033 3218457 3278180 3342587 3411862 3486807 3567961 3655323 3748945 3849263
58000 3849263 3956505 4070009 4188515 4311096 4437363 4566635 4697324 4827361 4954870
57991 4954870 5078011 5194476 5301750 5397815 5481055 5549511 5600898 5633742 5648094 5644903 5625062
57980 5625062 5589347 5538949 5475670 5401844 5320327 5234247 5146203 5057680 4969590 4883310 4800853
57969D800853p6748o9885o2424n4599m6678l9052l1974k5405j9250j3570q624
57958D352644m617j452J205L487N075N689N664N674N927O099O120O448P323Q218
57944D413504Q555Q676R584J1802J4863J7906K0439K2405K3798K4388K3842K2098
57932D621860J9458J6152J1848N930j620r985j8365k6681l5152m3534n1253n8094
57920D430564o4158o9234p2729p4300p4117p2466o9540o5654o1205n6185n0223
57909C700753m3334l6247k9679k3582j7430j0948m253K456Q861J4406J8661K1843
57897C601507K4586K7230K9581L1264L2011L1626L0053K7421K3785J8937J2942
57886C890943O680J187l659r120j5969k3378k9933l5261m0063m4878m9501n3553
$$ plain form
57969 4800853 4724105 4654220 4591796 4537197 4490519 4451467 4419493 4394088 4374838 4361268 4352644
57958 4352644 4348027 4346575 4347780 4351267 4356342 4362031 4367695 4373369 4379296 4385395 4391515 4397963 4405286 4413504
57944 4413504 4422059 4430735 4440319 4452121 4466984 4484890 4505329 4527734 4551532 4575920 4599762 4621860
57932 4621860 4641318 4657470 4669318 4675248 4673628 4663643 4645278 4618597 4583445 4539911 4488658 4430564
57920 4430564 4366406 4297172 4224443 4150143 4076026 4003560 3934020 3868366 3807161 3750976 3700753
57909 3700753 3657419 3621172 3591493 3567911 3550481 3539533 3535280 3537736 3546597 3561003 3579664 3601507
57897 3601507 3626093 3653323 3682904 3714168 3746179 3777805 3807858 3835279 3859064 3878001 3890943
57886 3890943 3897623 3898810 3895151 3886031 3870062 3846684 3816751 3781490 3741427 3696549 3647048 3593495
57874C593495n6953n9703o1670o2873o3572o3854o3432o2063o0005n7774n5639
57863B925957n3462n0990m8092m4887m1742l9056l6830l4498l1486k7917k4553
57852B492444k1942j9803j7430j4543j1511q822o652n003l890l097k089n77R96
57839B378081J973K437L110M308N580O617P845R671J1741J3512J5135J7069J9129
57826B496208K0782K2226K4282K7147L0026L2362L4561L7175L9948M2212M3701
57815B850630M4445M4256M2902M0574L7658L4152K9718K4154J7507R912J738o279
57803C171367j3507j9923k5746l0751l4401l6671l8186l9371l9904l9278l7553
57792B816076l5339l3098l0756k8026k4993k2243k0294j8947j7414j5259j2968
$$ plain form
57874 3593495 3536542 3476839 3415169 3352296 3288724 3224870 3161438 3099375 3039370 2981596 2925957
57863 2925957 2872495 2821505 2773413 2728526 2686784 2647728 2610898 2576400 2544914 2516997 2492444
57852 2492444 2470502 2450699 2433269 2418726 2407215 2398393 2391741 2386738 2382848 2379751 2377662 2377085 2378081
57839 2378081 2380054 2382491 2385601 2389909 2395489 2402106 2409951 2419622 2431363 2444875 2460010 2477079 2496208
57826 2496208 2516990 2539216 2563498 2590645 2620671 2653033 2687594 2724769 2764717 2806929 2850630
57815 2850630 2895075 2939331 2982233 3022807 3060465 3094617 3124335 3148489 3165996 3175908 3177646 3171367
57803 3171367 3157860 3137937 3112191 3081440 3047039 3010368 2972182 2932811 2892907 2853629 2816076
57792 2816076 2780737 2747639 2716883 2688857 2663864 2641621 2621327 2602380 2584966 2569707 2556739
57781B556739j1383j0724j0535j0437j0472j0744j1131j1521j2025j2734j3436
57770B431597j3793j3741j3583j3675j4005j4119j3590j2620j1938j1855j1688
57759B286990j0501q343o305n247m908m432l410k189j361j179j368j360q45j37
57745B235405J71m5l81o56j302k724m574o082o954p490p970q255q074p307n908
57730B167854l844j267J497M217O943R829J2998J6565K0526K4543K8211L1663
57718B319735L5553M0066M4372M7553M9850N2257N4929N6790N6943N5766N4092
57707B867906N1920M8645M4188L9101L3707K7880K1592J5035Q144Q50o196j1955
57695C140817j6386k0635k5375k9727l2475l3641l4078l4065l3273l1737k9814
$$ plain form
57781 2556739 2545356 2534632 2524097 2513660 2503188 2492444 2481313 2469792 2457767 2445033 2431597
57770 2431597 2417804 2404063 2390480 2376805 2362800 2348681 2335091 2322471 2310533 2298678 2286990
57759 2286990 2276489 2268146 2261841 2256594 2251686 2247254 2243844 2241655 2240294 2239115 2237747 2236387 2235542 2235405
57745 2235405 2235576 2235531 2235150 2234494 2233192 2230468 2225894 2219812 2212858 2205368 2197398 2189143 2181069 2173762 2167854
57730 2167854 2164010 2162743 2164240 2168457 2175400 2185229 2198227 2214792 2235318 2259861 2288072 2319735
57718 2319735 2355288 2395354 2439726 2487279 2537129 2589386 2644315 2701105 2758048 2813814 2867906
57707 2867906 2919826 2968471 3012659 3051760 3085467 3113347 3134939 3149974 3158118 3158968 3152772 3140817
57695 3140817 3124431 3103796 3078421 3048694 3016219 2982578 2948500 2914435 2881162 2849425 2819611
57684B819611k7359k3917j9735j5692j2121q733n742m017l770m094m370n199p320
57671B677542j0437j3981j8235k3673k9672l4989l9278m3038m6172m7780m7595
57660B322692m6583m5786m5294m4765m4107m3134m1293l8413l5221l2475k9996
57649A875625k7259k4550k2598k1339j9864j7762j5679j4277j3329j2201j0751
57638A676016r278q006p008o451o465o824p027o624n424l647k039j400j656j667
57624A602500m53J618L260L692L139K126J003J51l8L34P27R41J310J958K373K161
57608A626802J697J574J798K026K258K712L181L110K326J299O53P61J676L025
57594A654898M037M117L426K654K260K240K501K985L395L303K633J798J281J344
$$ plain form
57684 2819611 2792252 2768335 2748600 2732908 2720787 2712054 2706312 2702295 2698525 2694431 2690061 2684862 2677542
57671 2677542 2667105 2653124 2634889 2611216 2581544 2546555 2507277 2464239 2418067 2370287 2322692
57660 2322692 2276109 2230323 2185029 2140264 2096157 2053023 2011730 1973317 1938096 1905621 1875625
57649 1875625 1848366 1823816 1801218 1779879 1760015 1742253 1726574 1712297 1698968 1686767 1676016
57638 1676016 1666738 1658732 1651724 1645273 1638808 1631984 1624957 1618333 1612909 1609262 1607223 1605823 1604167 1602500
57624 1602500 1602047 1603665 1606925 1610617 1613756 1615882 1616885 1617036 1616998 1617332 1618059 1619000 1620310 1622268 1624641 1626802
57608 1626802 1628499 1630073 1631871 1633897 1636155 1638867 1642048 1645158 1647484 1648783 1649436 1650197 1651873 1654898
57594 1654898 1658935 1663052 1666478 1669132 1671392 1673632 1676133 1679118 1682513 1685816 1688449 1690247 1691528 1692872
57580A692872K024L049L811L849L410L191L496M024M432M624M478L864L109K897
57566A743130L440M135M291L825L068K300J719J427J203P20J97L53J388K497K874
57551A776567K745K872L407L851L910L754L600L518L665M108M498M365L708K871
57537A827439J917P01m92j027p60k87j07m7K68P67J101J180J195J276J454J860
57521A836438K722M102N770P264Q084Q065P628P540Q223R411J0546J1373J2000
57508A939166J2515J2810J2764J2451J2097J1906J1982J2341J2957J3701J4354
57497B079044J4761J4971J5149J5313J5311J5135J5039J5211J5424J5340J4985
57486B245683J4667J4435J3960J2996J1668J0153Q380O358M564L690L860M388
$$ plain form
57580 1692872 1694896 1697945 1701756 1705605 1709015 1712206 1715702 1719726 1724158 1728782 1733260 1737124 1740233 1743130
57566 1743130 1746570 1750705 1754996 1758821 1761889 1764189 1765908 1767335 1768538 1769258 1769455 1769808 1771196 1773693 1776567
57551 1776567 1779312 1782184 1785591 1789442 1793352 1797106 1800706 1804224 1807889 1811997 1816495 1820860 1824568 1827439
57537 1827439 1829356 1830057 1829565 1828538 1827778 1827491 1827384 1827337 1827605 1828372 1829473 1830653 1831848 1833124 1834578 1836438
57521 1836438 1839160 1843262 1849032 1856296 1864380 1872445 1880073 1887613 1895836 1905247 1915793 1927166 1939166
57508 1939166 1951681 1964491 1977255 1989706 2001803 2013709 2025691 2038032 2050989 2064690 2079044
57497 2079044 2093805 2108776 2123925 2139238 2154549 2169684 2184723 2199934 2215358 2230698 2245683
57486 2245683 2260350 2274785 2288745 2301741 2313409 2323562 2331942 2338300 2342864 2346554 2350414 2354802
57474B354802M424L851L384L760M887N892O033N426M819M764N141N462N404N037
57460B423086M588M186L810L516L587M305N485O441O603O139N837O322P551Q995
57446B500451J0087J0531J0368R865R225Q389P162N547L805K136N32r69k076k450
57432B572603k102j468j078j103j196p05P96L089N459P346Q833J0431J2512J4999
57418B628416J7544J9777K1331K1920K1575K0754J9980J9318J8366J6801J4684
57407B840466J2183R214N735K202o71k631m053n242n986n952n219m112k761j229
57393B831944J52J046J727K923M893O978Q348Q934R318R890J0401J0449J0083
57380B917086R817J0081J0815J1576J1941J1831J1528J1442J1791J2369J2716
$$ plain form
57474 2354802 2359226 2363077 2366461 2370221 2375108 2381000 2387033 2392459 2397278 2402042 2407183 2412645 2418049 2423086
57460 2423086 2427674 2431860 2435670 2439186 2442773 2447078 2452563 2459004 2465607 2471746 2477583 2483905 2491456 2500451
57446 2500451 2510538 2521069 2531437 2541302 2550527 2558916 2566078 2571625 2575430 2577566 2578098 2577129 2575053 2572603
57432 2572603 2570501 2569033 2567955 2566852 2565656 2564951 2565747 2568836 2574295 2581641 2590474 2600905 2613417 2628416
57418 2628416 2645960 2665737 2687068 2708988 2730563 2751317 2771297 2790615 2808981 2825782 2840466
57407 2840466 2852649 2861863 2867598 2869800 2869129 2866498 2862445 2857203 2851217 2845265 2840046 2835934 2833173 2831944
57393 2831944 2832096 2833142 2834869 2837792 2842685 2849663 2858011 2866945 2876263 2886153 2896554 2907003 2917086
57380 2917086 2926903 2936984 2947799 2959375 2971316 2983147 2994675 3006117 3017908 3030277 3042993
57369C042993J2643J2501J2773J3446J4047J4302J4472J4902J5514J5973J6184
57358C199750J6341J6611J7013J7561J8291J9160K0002K0632K0914K0850K0755
57347C407880K1085K1982K3013K3597K3550K3095K2468K1874K1686K2254K3358
57336C655842K4139K3821K2472K0986K0347K0831K1834K2532K2776K3239K4507
57325C903326K6239K7493K7866K7888K8196K8695K8862K8690K8909L0139L1988
57314D218291L3336L3556L3162L3030L3214L2982L2039L1043L0667L0647L0252
57303D572219K9373K8473K7690K6661K5377K4521K4615K5168K5077K3820K2008
57292D855002K0764K0694K1489K2491K3427K4447K5529K6289K6484K6370K6352
$$ plain form
57369 3042993 3055636 3068137 3080910 3094356 3108403 3122705 3137177 3152079 3167593 3183566 3199750
57358 3199750 3216091 3232702 3249715 3267276 3285567 3304727 3324729 3345361 3366275 3387125 3407880
57347 3407880 3428965 3450947 3473960 3497557 3521107 3544202 3566670 3588544 3610230 3632484 3655842
57336 3655842 3679981 3703802 3726274 3747260 3767607 3788438 3810272 3832804 3855580 3878819 3903326
57325 3903326 3929565 3957058 3984924 4012812 4041008 4069703 4098565 4127255 4156164 4186303 4218291
57314 4218291 4251627 4285183 4318345 4351375 4384589 4417571 4449610 4480653 4511320 4541967 4572219
57303 4572219 4601592 4630065 4657755 4684416 4709793 4734314 4758929 4784097 4809174 4832994 4855002
57292 4855002 4875766 4896460 4917949 4940440 4963867 4988314 5013843 5040132 5066616 5092986 5119338
57281E119338K6582K7134K8167K9517L0505L0720L0635L0958L1606L1978L1982
57270E449122L2025L2139L1952L1561L1609L2342L3309L4144L4954L5667L5820
57259E814644L5375L5044L5400L6128L6614L6740L6704L6576L6448L6470L6406
57248F212549L5695L4353L3232L2859L2623L1769L0539K9577K8648K6944K4419
57237F553207K1909J9933J8228J6485J4797J3173J1331R229P282N787M576L570
57225F699507L189L776M843N395N112M781N312O534P429P551P615Q363R363R762
57211F788532R758J0287J1294J1582J0698R737R543R310P956N997M804M610M563
57198F898671M256L885L135J392r34k647l525m570o290p989r163j0363j2022j3556
$$ plain form
57281 5119338 5145920 5173054 5201221 5230738 5261243 5291963 5322598 5353556 5385162 5417140 5449122
57270 5449122 5481147 5513286 5545238 5576799 5608408 5640750 5674059 5708203 5743157 5778824 5814644
57259 5814644 5850019 5885063 5920463 5956591 5993205 6029945 6066649 6103225 6139673 6176143 6212549
57248 6212549 6248244 6282597 6315829 6348688 6381311 6413080 6443619 6473196 6501844 6528788 6553207
57237 6553207 6575116 6595049 6613277 6629762 6644559 6657732 6669063 6678292 6685574 6691361 6695937 6699507
57225 6699507 6702696 6706472 6711315 6716710 6721822 6726603 6731915 6738449 6745878 6753429 6761044 6769407 6778770 6788532
57211 6788532 6798290 6808577 6819871 6831453 6842151 6851888 6861431 6870741 6878697 6884694 6889498 6894108 6898671
57198 6898671 6902927 6906812 6909947 6911339 6910405 6907758 6904233 6899663 6893373 6885384 6876221 6865858 6853836 6840280
57184F840280j4460j5362j7107j9448k1557k3297k5106k7030k8673k9866l0687
57173F587687l1081l1073l1107l1563l2123l2187l1718l1142l0632l0130k9872
57162F245059l0223l1143l2337l3958l6468l9828m3399m6717m9871n3034n6145
57151E791936n9148o1869o3516o2861n9430n4123m8314m2664l7181l2056k7705
57140E243069k4076k0547j6835j3543j1437j0446r816r260r482j1445j5409k0872
57128E069901k7135l3611l9723m5037m9456n3018n5366n5700n3435m8723m2279
57117D566418l4924k7319j9867j2625n336K479J1668K3624M0050O2305R0992J26004
57105D823469J66488K10601K55764K99915L42936L86933M35046M89782N51929
$$ plain form
57184 6840280 6825820 6810458 6793351 6773903 6752346 6729049 6703943 6676913 6648240 6618374 6587687
57173 6587687 6556606 6525533 6494426 6462863 6430740 6398553 6366835 6335693 6305061 6274931 6245059
57162 6245059 6214836 6183693 6151356 6117398 6080930 6041102 5997703 5950986 5901115 5848081 5791936
57151 5791936 5732788 5670919 5607403 5544542 5485112 5430989 5382675 5340011 5302830 5270774 5243069
57140 5243069 5218993 5198446 5181611 5168068 5156631 5146185 5136369 5127109 5117627 5106182 5090773 5069901
57128 5069901 5042766 5009155 4969432 4924395 4874939 4821921 4766555 4710855 4657420 4608697 4566418
57117 4566418 4531494 4504175 4484308 4471683 4466347 4468826 4480494 4504118 4544168 4606473 4697465 4823469
57105 4823469 4989957 5200558 5456322 5756237 6099173 6486106 6921152 7410934 7962863
57096G962863O19449O83896P24163P04291N85695L54478M5531k61338m78500n55983
57086A0384545n01450l62608j90032q968J83529L98855O30435Q40391R72121R83285
57076A3330103Q75102O93415M99524L34832K06744J01354M885q6245j69799k45306
57066A5544609l15537l83088m47829n07268n57860n96023o19258o27368o22557
57057A0867821o08109n86736n59936n28609m94150m58839m24834l92865l62343
57048F451400l32904l05358k80837k59585k41052k24776k10516j97884j86426
57039D212062j75919j66061j56077j45330j34216j23822j14643j06185r7881q9817
57029B902111q2486p6277p1228o6869o2296n7063n2037m8788m7966m8717m9734
$$ plain form
57096 7962863 8582312 9266208 9990371 10694662 11280357 11634835 11680366 11419028 10940528 10384545
57086 10384545 9883095 9520487 9330455 9321487 9505016 9903871 10534306 11374697 12346818 13330103
57076 13330103 14205205 14898620 15398144 15732976 15939720 16041074 16045959 15959714 15789915 15544609
57066 15544609 15229072 14845984 14398155 13890887 13333027 12737004 12117746 11490378 10867821
57057 10867821 10259712 9672976 9113040 8584431 8090281 7631442 7206608 6813743 6451400
57048 6451400 6118496 5813138 5532301 5272716 5031664 4806888 4596372 4398488 4212062
57039 4212062 4036143 3870082 3714005 3568675 3434459 3310637 3195994 3089809 2991928 2902111
57029 2902111 2819625 2743348 2672120 2605251 2542955 2485892 2433855 2385067 2337101 2288384 2238650
57018B238650n0305n0177m9195m7457m5498m3820m2580m1686m0864l9485l6969
57007A750614l3651l0641k8517k6703k4499k2135k0187j8558j6776j4951j3637
56996A500359j2880j2065j0729q988p180n538m209l157k104q79K30R31J555K703
56982A438049M233N226N112M331L737L706M089M602M985N071M967N012N371N858
56968A504349O303O851P659Q570R332J0043J1028J2288J3346J3749J3584J3372
56956A630474J3474J3664J3315J2048J0184Q518P661P628Q020Q461Q842R224R656
56943A761169J0148J0792J1833J3442J5370J7002J7897J8161J8125J7748J6618
56932A928305J4550J1912R297P018M981K817Q3l410p225j0428j2337j3199j3905
$$ plain form
57018 2238650 2188345 2138168 2088973 2041516 1996018 1952198 1909618 1867932 1827068 1787583 1750614
57007 1750614 1716963 1686322 1657805 1631102 1606603 1584468 1564281 1545723 1528947 1513996 1500359
56996 1500359 1487479 1475414 1464685 1455697 1448517 1442979 1438770 1435613 1433509 1432630 1432860 1433791 1435346 1438049
56982 1438049 1442282 1447508 1452620 1456951 1460688 1464394 1468483 1473085 1478070 1483141 1488108 1493120 1498491 1504349
56968 1504349 1510652 1517503 1525162 1533732 1543064 1553107 1564135 1576423 1589769 1603518 1617102 1630474
56956 1630474 1643948 1657612 1670927 1682975 1693159 1701677 1709338 1716966 1724986 1733447 1742289 1751513 1761169
56943 1761169 1771317 1782109 1793942 1807384 1822754 1839756 1857653 1875814 1893939 1911687 1928305
56932 1928305 1942855 1954767 1964064 1971082 1976063 1978880 1978963 1975553 1968328 1957900 1945563 1932364 1918459
56919A918459j5018j6307j7232j7655j7882j8155j8414j8600j8880j9379j9852
56908A721085j9968j9867k0147k1094k2169k2490k1733k0387j9093j8019j6939
56897A499179j5678j4302j2898j1378r603p640n818m437l465k534j306J66J501
56884A411787K424L062L697M203L947K464K65j390j643q27J13P23J229J909K801
56869A434764M100O241R201J2179J4314J5536J6362J7069J7589J7997J8556J9176
56857A603084J9230J8166J6015J3213J0172P235M847L457L187L695M530N666P572
56844A720069J0591J4325J7931K1095K4311K7958L1555L4341L6283L7902L9207
56833B015568L9537L8552L6698L4484L1768K8166K3752J8972J4192R715O001L517
$$ plain form
56919 1918459 1903441 1887134 1869902 1852247 1834365 1816210 1797796 1779196 1760316 1740937 1721085
56908 1721085 1701117 1681250 1661103 1640009 1617840 1595350 1573617 1553230 1534137 1516118 1499179
56897 1499179 1483501 1469199 1456301 1444923 1435320 1427680 1421862 1417425 1413960 1411426 1410120 1410286 1411787
56884 1411787 1414211 1417273 1420970 1425173 1429120 1431584 1431849 1430459 1428816 1427989 1428102 1428825 1430054 1431963 1434764
56869 1434764 1438864 1445105 1454306 1466485 1480799 1496335 1512697 1529766 1547355 1565352 1583908 1603084
56857 1603084 1622314 1640480 1656495 1669708 1679880 1687115 1691962 1695419 1698606 1702301 1706831 1712497 1720069
56844 1720069 1730660 1744985 1762916 1784011 1808322 1836280 1867835 1902176 1938459 1976361 2015568
56833 2015568 2055105 2093657 2130355 2164839 2196607 2224773 2248525 2267497 2281689 2291404 2297405 2300922
56821B300922K380K276K674L004L052L333M818P854J1615J4838J6955J8167J8756
56808B410644J8765J8309J7622J6785J5602J3772J1045P341L072q13l487m901
56796B523756n550n701n315m610m122m052l939l195j693K08J971L067L231K696
56782B496752J917R11q14l615p194j0950j4624j8418k2655k7389l2194l6248l8922
56769B286557m0352m1263m2097m2627m2492m1734m0647l9370l7859l6025l3713
56758A848378l0844k7757k5055k2863k0617j7933j5291j3419j2298j1289r999
56747A641013q524o983n421m119l486l464l496l131k362j310l1J290K306K887
56733A605169L337M109N484P416R435J0870J1559J2311J4128J6994J9928K2368
$$ plain form
56821 2300922 2303302 2305578 2308252 2311256 2314308 2317641 2322459 2330313 2341928 2356766 2373721 2391888 2410644
56808 2410644 2429409 2447718 2465340 2482125 2497727 2511499 2522544 2529885 2532957 2532144 2528657 2523756
56796 2523756 2518206 2512505 2507190 2502580 2498458 2494406 2490467 2487272 2485579 2485787 2487758 2490825 2494056 2496752
56782 2496752 2498669 2499580 2498766 2495151 2487957 2477007 2462383 2443965 2421310 2393921 2361727 2325479 2286557
56769 2286557 2246205 2204942 2162845 2120218 2077726 2035992 1995345 1955975 1918116 1882091 1848378
56758 1848378 1817534 1789777 1764722 1741859 1721242 1703309 1688018 1674599 1662301 1651012 1641013
56747 1641013 1632489 1625506 1620085 1615966 1612480 1609016 1605520 1602389 1600027 1598717 1598686 1599976 1602282 1605169
56733 1605169 1608506 1612615 1618099 1625515 1634950 1645820 1657379 1669690 1683818 1700812 1720740 1743108
56721A743108K4827K7975L1693L5539L9564M4037M8651N2738N6228N9865O4349
56710B228574O9581P4822P9314Q2608Q4659Q5704Q6032Q5782Q4949Q3459Q1110
56699C126594P7570P2723O6957O0942N5101M9468M4021L8911L4247K9915K5804
56688C682253K2111J9265J7409J6076J4554J2527J0238P911N353K317r83m188
56676C804843p487j1564j6695k2364k7885l2999l7690m1843m5411m8491n0965
56665C461449n2390n2638n2238n1689n0697m8701m5835m2795l9829l6532l2713
56654B955392k8807k5272k2037j8727j5103j1094o808k649Q80L740O394R097J1367
56641B856373J2570J2776J2742J2975J3030J1966R404O065L095R26j037l506o409
$$ plain form
56721 1743108 1767935 1795910 1827603 1863142 1902706 1946743 1995394 2048132 2104360 2164225 2228574
56710 2228574 2298155 2372977 2452291 2534899 2619558 2705262 2791294 2877076 2962025 3045484 3126594
56699 3126594 3204164 3276887 3343844 3404786 3459887 3509355 3553376 3592287 3626534 3656449 3682253
56688 3682253 3704364 3723629 3741038 3757114 3771668 3784195 3794433 3802344 3807697 3810014 3809031 3804843
56676 3804843 3797356 3785792 3769097 3746733 3718848 3685849 3648159 3606316 3560905 3512414 3461449
56665 3461449 3409059 3356421 3304183 3252494 3201797 3153096 3107261 3064466 3024637 2988105 2955392
56654 2955392 2926585 2901313 2879276 2860549 2845446 2834352 2827544 2824895 2825775 2829515 2835909 2845006 2856373
56641 2856373 2868943 2881719 2894461 2907436 2920466 2932432 2941836 2947901 2950996 2951922 2950885 2947379 2940970
56628B940970r135j1401j3469j5537j7339j8432j8582j7771j6087j3763j1180
56617B778274q639o152l496m50K941O301R288J2034J4929J7832J9937K0706K0590
56604B884095K0294J9767J8517J6649J4819J3240J1556R778Q466P716O751M956
56592C036604K718Q39m44j448k501l858n757q062j0124j1397j2025j2585j3459
56579B958501j4649j5968j7182j8246j9502k1308k3366k4949k5882k6784k8128
56568B722537k9753l1611l4155l7476m0716m3087m4910m6991m9421n1717n3677
56557B259023n5290n6183n6076n5472n5013n4400n2879n0655m8775m7610m6365
56546A680305m4338m1842l9580l7780l6232l4556l2376k9647k6962k4965k3472
$$ plain form
56628 2940970 2931835 2920434 2906965 2891428 2874089 2855657 2837075 2819304 2803217 2789454 2778274
56617 2778274 2769635 2763483 2759987 2759537 2762478 2768779 2778067 2790101 2805030 2822862 2842799 2863505 2884095
56604 2884095 2904389 2924156 2942673 2959322 2974141 2987381 2998937 3008715 3017181 3024897 3031648 3036604
56592 3036604 3039322 3040161 3039717 3038269 3035768 3031910 3026153 3018091 3007967 2996570 2984545 2971960 2958501
56579 2958501 2943852 2927884 2910702 2892456 2872954 2851646 2828280 2803331 2777449 2750665 2722537
56568 2722537 2692784 2661173 2627018 2589542 2548826 2505739 2460829 2413838 2364417 2312700 2259023
56557 2259023 2203733 2147550 2091474 2036002 1980989 1926589 1873710 1823055 1774280 1726670 1680305
56546 1680305 1635967 1594125 1554545 1516765 1480533 1445977 1413601 1383954 1356992 1332027 1308555
56535A308555k1760j9708j7930j6670j5439j3971j2774j2300j2191j1800j0937
56524A143075r809q707q008p994q283q047p107o322o482p286p829p693p165o697
56510A035646o476o316n729m523l329l030l506l697l120k542k678l033k734j874
56496I83059j141o47l6N59N51q2n79k74P71J917K379J676J88r30q72l6O35Q84
56478I88022J118J457J514J103M85p9m52l46N54K049L507M521N080N207M935M584
56462A023259M598N013N511N875N937N279L704J956J191J563J995J640Q69N22
56448A068912P28R81R24O12J57m16j047j554j692j341p17l35m32o22m18m0j06
56431A063594o49j032r60r07j262j705j801j768k123k873l532l780l725l578l375
$$ plain form
56535 1308555 1286795 1267087 1249157 1232487 1217048 1203077 1190303 1178003 1165812 1154012 1143075
56524 1143075 1133266 1124559 1116551 1108557 1100274 1092227 1085120 1078798 1072316 1065030 1057201 1049508 1042343 1035646
56510 1035646 1029170 1022854 1017125 1012602 1009273 1006243 1002737 999040 995920 993378 990700 987667 984933 983059
56496 983059 981918 981271 981235 981794 982345 982263 981684 981410 982181 984098 986477 988153 988341 987411 986539 986503 987138 988022
56478 988022 989140 990597 992111 993214 993699 993620 993168 992822 993376 995425 998932 1003453 1008533 1013740 1018675 1023259
56462 1023259 1027857 1032870 1038381 1044256 1050193 1055472 1059176 1061132 1062323 1063886 1065881 1067521 1068390 1068912
56448 1068912 1069640 1070621 1071545 1072157 1072314 1071898 1070851 1069297 1067605 1066264 1065547 1065212 1064780 1064158 1063740 1063700 1063594
56431 1063594 1062945 1061913 1060953 1060046 1058784 1057079 1055278 1053510 1051387 1048514 1044982 1041202 1037477 1033899 1030524
56416A030524l057k692k560k932l637m048l792l340l407l945m266m110l932m028
56402I80778m076l847l611l558l441l142l004l111k911k140j491j650k099j695
56388I41002k25J326J990J674R35M40O02J251J784J934K138K779L438L548L335
56373I67951L414L637L319K431J803J943K481K913L126L026K366J245K23l71p05
56358I98802q08l78M82R79N91k34p85j105j693k533k969k490j221K00J029Q77
56342I88744J20l79j24N99J328K024K736L125K820K141J887K416L341M135M694
56327A019607N230N807O067N530M285L254L308M095M365L622K767K630K685K027
56313A075279J063J084K349L649L943L532L298L566M090M540M642M299L853L843
$$ plain form
56416 1030524 1027467 1024775 1022215 1019283 1015646 1011598 1007806 1004466 1001059 997114 992848 988738 984806 980778
56402 980778 976702 972855 969244 965686 962245 959103 956099 952988 950077 947937 946446 944796 942697 941002
56388 941002 940777 942103 944093 945767 946702 947142 947744 948995 950779 952713 954851 957630 961068 964616 967951
56373 967951 971365 975002 978321 980752 982555 984498 986979 989892 993018 996044 998410 999655 999878 999507 998802
56358 998802 997994 997616 998098 999077 999668 999434 998649 997544 995851 993318 990349 987859 986638 986838 987867 988744
56342 988744 988864 988485 988361 988960 990288 992312 995048 998173 1000993 1003134 1005021 1007437 1010778 1014913 1019607
56327 1019607 1024837 1030644 1036711 1042241 1046526 1049780 1053088 1057183 1061548 1065170 1067937 1070567 1073252 1075279
56313 1075279 1076342 1077426 1079775 1083424 1087367 1090899 1094197 1097763 1101853 1106393 1111035 1115334 1119187 1123030
56299A123030M307M812N196N672O046N666M481L370K947K851K744L123M233M981
56285A183459M188K431J344J277J025op94l35Q51J595J601J371J185J015J026
56270A201233J501K415L570M859O017O491O190N978O826Q558J0086J0736J0794
56257A285254J0797J0961J1336J1935J2503J2556J1837J0475Q708O812N250M343
56245A402767L706K548P66q05j556k004l080m917o879q567j0131j1587j2429j2247
56231A335585j1354j0521j0217j0354j0614j0738j0526r852q900q163p990q094
56219A218262p810o837n545m437l636l106k990l302l491k910j797j134j297j400
56205A168570n35P89J126lj409j696q75j04j42o55j031j208j425j597j414r56
$$ plain form
56299 1123030 1127337 1132149 1137345 1143017 1149063 1154729 1159210 1162580 1165527 1168378 1171122 1174245 1178478 1183459
56285 1183459 1187647 1190078 1191422 1192699 1193724 1193718 1192924 1192589 1193440 1195035 1196636 1198007 1199192 1200207 1201233
56270 1201233 1202734 1205149 1208719 1213578 1219595 1226086 1232276 1238254 1245080 1253638 1263724 1274460 1285254
56257 1285254 1296051 1307012 1318348 1330283 1342786 1355342 1367179 1377654 1386362 1393174 1398424 1402767
56245 1402767 1406473 1409021 1409787 1408982 1407426 1405422 1402342 1397425 1390546 1381979 1371848 1360261 1347832 1335585
56231 1335585 1324231 1313710 1303493 1293139 1282525 1271787 1261261 1251409 1242509 1234346 1226356 1218262
56219 1218262 1210452 1203615 1198070 1193633 1189997 1186891 1183901 1180599 1177108 1174198 1172401 1171267 1169970 1168570
56205 1168570 1168035 1168824 1169950 1169947 1168538 1166842 1165967 1165863 1165721 1165066 1164035 1162827 1161402 1159805 1158391 1157435
56189A157435o60o59n53l1O45J052J132J074R14O40M70O53J051J324J420J533
56173A167440J689J808K105K876L855M356M231M116M517N194N844O792Q462J0493
56159A233778J2047J2853J3371J4085J5132J6612J8736K1420K4238K6901K9531
56148A438704L2360L5424L8692M2193M5808M9151N1853N3909N5598N7165N8658
56137A959515N9901O0582O0453N9538N7920N5395N1579M6588M1264L6401L1947
56126B521083K7283K2109J6599J0715M102l129j0007j5671k0387k5045k9916l4509
56114B463227l8569m2420m6108m8967n0508n1145n1516n1471n0376m8130m5260
56103A938757m2154l8856l5540l2573l0011k7600k5239k2972k0565j7683j4603
$$ plain form
56189 1157435 1156775 1156116 1155563 1155532 1156177 1157229 1158361 1159435 1160349 1160989 1161459 1162112 1163163 1164487 1165907 1167440
56173 1167440 1169129 1170937 1173042 1175918 1179773 1184129 1188360 1192476 1196993 1202187 1208031 1214823 1223285 1233778
56159 1233778 1245825 1258678 1272049 1286134 1301266 1317878 1336614 1358034 1382272 1409173 1438704
56148 1438704 1471064 1506488 1545180 1587373 1633181 1682332 1734185 1788094 1843692 1900857 1959515
56137 1959515 2019416 2079998 2140451 2199989 2257909 2313304 2364883 2411471 2452735 2489136 2521083
56126 2521083 2548366 2570475 2587074 2597789 2601891 2598762 2588755 2573084 2552697 2527652 2497736 2463227
56114 2463227 2424658 2382238 2336130 2287163 2236655 2185510 2133994 2082523 2032147 1984017 1938757
56103 1938757 1896603 1857747 1822207 1789634 1759623 1732023 1706784 1683812 1663247 1645564 1630961
56092A630961j2074j0290q635o715m962l831k999j886n92L59R10J596K817M355
56078A589014N645O296O484O810P591Q344Q427Q215Q902J0847J2878J3782J3856
56065A707091J4285J5455J6765J7773J8626J9353J9601J9276J8852J8805J9197
56054A905079J9899K0820K1805K2610K3160K3542K3711K3531K3148K3079K3766
56043B154150K5181K6890K8431K9632L0701L1920L3279L4535L5598L6557L7387
56032B504261L8065L9000M0762M3164M5280M6688M8055N0030N2267N4104N5563
56021C017239N7016N8503O0166O2691O6413P0436P3674P6328P9324Q2718Q5889
56010C790397Q9031R3052R7993J02812J06972J11084J15807J21192J27316J34448
$$ plain form
56092 1630961 1618887 1608597 1599962 1593247 1588285 1584454 1581455 1579569 1578977 1579336 1580246 1581842 1584659 1589014
56078 1589014 1594659 1600955 1607439 1614249 1621840 1630184 1638611 1646826 1655728 1666575 1679453 1693235 1707091
56065 1707091 1721376 1736831 1753596 1771369 1789995 1809348 1828949 1848225 1867077 1885882 1905079
56054 1905079 1924978 1945798 1967603 1990213 2013373 2036915 2060626 2084157 2107305 2130384 2154150
56043 2154150 2179331 2206221 2234652 2264284 2294985 2326905 2360184 2394719 2430317 2466874 2504261
56032 2504261 2542326 2581326 2622088 2665252 2710532 2757220 2805275 2855305 2907572 2961676 3017239
56021 3017239 3074255 3132758 3192924 3255615 3322028 3392464 3466138 3542466 3621790 3704508 3790397
56010 3790397 3879428 3972480 4070473 4173285 4280257 4391341 4507148 4628340 4755656 4890104
56000D890104J42216J49591J56206J62916J70721J79900J90390K02139K14819
55991F459002K27991K41959K57634K75373K94745L15687L39002L65435L95104
55982I171932M28165M65317N07469N55687O11588O76943P52986Q41207R44961
55973A4956255J069245J218889J398439J613907J872681K179786K533517K924099
55965B9766818L336682L758726M188914M640432N134375N690109O322574P044726
55957F9883356P864130Q771956R734676J0694180J1572494J2282012J2747277
55950A43550081J2929240J2828379J2463025J1850028J1003316R926453Q581964
55943B23132486O878328M729278K159016o49430l421294n911529p976740r570745
$$ plain form
56000 4890104 5032320 5181911 5338117 5501033 5671754 5851654 6042044 6244183 6459002
55991 6459002 6686993 6928952 7186586 7461959 7756704 8072391 8411393 8776828 9171932
55982 9171932 9600097 10065414 10572883 11128570 11740158 12417101 13170087 14011294 14956255
55973 14956255 16025500 17244389 18642828 20256735 22129416 24309202 26842719 29766818
55965 29766818 33103500 36862226 41051140 45691572 50825947 56516056 62838630 69883356
55957 69883356 77747486 86519442 96254118 106948298 118520792 130802804 143550081
55950 143550081 156479321 169307700 181770725 193620753 204624069 214550522 223132486
55943 223132486 230010814 234740092 236899108 236249678 232828384 226916855 218940115 209369370
55935B09369370j0716718j1493663j2016424j2385642j2635124j2724850j2586531
55928A24810418j2180442j1521860j0670797r705740q701569p718217o797097
55921E7514696n961482n219483m569128m003732l515278l095483k735835k427590
55913B5986685k162051j931268j729039j551007j393660j253695j128631j017300
55905A3820034r18839q31647p53947o84870o23985n70096n21510m77303m37354
55896H000483m01225l67892l36800l08317k82892k60224k39463k19775k00759
55887E383136j82685j66233j51693j38513j25997j14082j03053r2996q4135p7169
55877D146580p2427o9069o5961o3047o1024o0006n9647o0269o2580o6200o9677
$$ plain form
55935 209369370 198652652 187158989 175142565 162756923 150121799 137396949 124810418
55928 124810418 112629976 101108116 90437319 80731579 72030010 64311793 57514696
55921 57514696 51553214 46333731 41764603 37760871 34245593 31150110 28414275 25986685
55913 25986685 23824634 21893366 20164327 18613320 17219660 15965965 14837334 13820034
55905 13820034 12901195 12069548 11315601 10630731 10006746 9436650 8915140 8437837 8000483
55896 8000483 7599258 7231366 6894566 6586249 6303357 6043133 5803670 5583895 5383136
55887 5383136 5200451 5034218 4882525 4744012 4618015 4503933 4400880 4307884 4223749 4146580
55877 4146580 4074153 4005084 3939123 3876076 3815052 3755046 3695399 3635130 3572550 3506350 3436673
55866C436673p2258p4535p7049p9328q0783q1570q1926q1492p9922p7517p4672
55855B575621p1327o7443o3448n9615n5596n1130m6723m2994l9777l6577l3514
55844B007477l1187k9759k8765k7685k6189k4100k1616j9460j8224j7601j6779
55833A746112j5467j4092j3066j2343j1688j0868r502p315m695k543j290m22P27
55820A643548K093L173L995N228P282R746J2001J4041J6404J9385K2703K6019
55808A785618K9474L3583L8678M4554N0603N6342O1938O8163P5644Q4146R2899
55797B421642J01539J10392J19712J29174J38299J46927J54785J61091J65045
55788C648606J66457J65297J61019J52964J41325J26871J09748Q9328O5438L9040
$$ plain form
55866 3436673 3364415 3289880 3212831 3133503 3052720 2971150 2889224 2807732 2727810 2650293 2575621
55855 2575621 2504294 2436851 2373403 2313788 2258192 2207062 2160339 2117345 2077568 2040991 2007477
55844 2007477 1976290 1946531 1917766 1890081 1863892 1839792 1818176 1798716 1780492 1762891 1746112
55833 1746112 1730645 1716553 1703487 1691144 1679456 1668588 1659086 1651771 1647076 1644533 1643243 1642821 1643548
55820 1643548 1645641 1648814 1652809 1658037 1665319 1675065 1687066 1701107 1717511 1736896 1759599 1785618
55808 1785618 1815092 1848675 1887353 1931907 1982510 2038852 2100790 2168953 2244597 2328743 2421642
55797 2421642 2523181 2633573 2753285 2882459 3020758 3167685 3322470 3483561 3648606
55788 3648606 3815063 3980360 4141379 4294343 4435668 4562539 4672287 4761615 4827053 4866093
55778D866093J1459j6416m3851o9859r3619j14874j33465j48809j60319j68057
55768C928283j72490j73840j72175j67941j61861j54382j45728j36371j26943
55759B516552j17614j08109r8530q9629q1972p5185o8501o1855n5985n1445m7926
55748A659801m4669m1248l7720l4297l1203k8764k7269k6603k6198k5444k4065
55737A312321k2187k0208j8629j7701j7173j6552j5693j4866j4193j3395j2301
55726A129423j1251j0628j0269r730q930q134p442o696n829m880l682k055l51
55713A039546O55P30O80J566L514N573O737O975P147P948R117R884J0053J0231
55699A120356J0927J1935J2907J3987J5407J6845J7798J8460J9555K1452K3931
$$ plain form
55778 4866093 4877552 4861136 4817285 4747426 4653807 4538933 4405468 4256659 4096340 3928283
55768 3928283 3755793 3581953 3409778 3241837 3079976 2925594 2779866 2643495 2516552
55759 2516552 2398938 2290829 2192299 2102670 2020698 1945513 1877012 1815157 1759172 1707727 1659801
55748 1659801 1615132 1573884 1536164 1501867 1470664 1441900 1414631 1388028 1361830 1336386 1312321
55737 1312321 1290134 1269926 1251297 1233596 1216423 1199871 1184178 1169312 1155119 1141724 1129423
55726 1129423 1118172 1107544 1097275 1087545 1078615 1070481 1063039 1056343 1050514 1045634 1041952 1039897 1039546
55713 1039546 1040201 1040931 1041611 1043177 1046691 1052264 1059001 1065976 1073123 1081071 1090188 1100072 1110125 1120356
55699 1120356 1131283 1143218 1156125 1170112 1185519 1202364 1220162 1238622 1258177 1279629 1303560
55688A303560K6770K9956L3413L7080M1305M6492N2382N8289O4105P0440P7651
55677A841443Q5459R3689J02612J12218J21863J31179J40731J51153J62078J72427
55667C114852J81484J89163J95451K00090K02648K02586J99375J92857J83377
55658D861883J71383J57071J40621J22476J03287Q3797O4905M7493L2021J8596
55648E803533P455j203q018j4394k1230k8224l4817m1267m8303n6412o6060p7974
55636E413086r2366j08227j24195j39769j54890j68775j80242j89084j95978k00906
55626C858654k02752k00925j96449j90830j84374j76290j66119j54445j42372
55617B244098j30749j19874j09563r9455q9474q0111p2134o5934o1178n7046n2872
$$ plain form
55688 1303560 1330330 1360286 1393699 1430779 1472084 1518576 1570958 1629247 1693352 1763792 1841443
55677 1841443 1926902 2020591 2123203 2235421 2357284 2488463 2629194 2780347 2942425 3114852
55667 3114852 3296336 3485499 3680950 3881040 4083688 4286274 4485649 4678506 4861883
55658 4861883 5033266 5190337 5330958 5453434 5556721 5640518 5705423 5752916 5784937 5803533
55648 5803533 5810988 5809785 5801767 5787373 5766143 5737919 5703102 5661835 5613532 5557120 5491060 5413086
55636 5413086 5320720 5212493 5088298 4948529 4793639 4624864 4444622 4255538 4059560 3858654
55626 3858654 3655902 3454977 3258528 3067698 2883324 2707034 2540915 2386470 2244098
55617 2244098 2113349 1993475 1883912 1784457 1694983 1614872 1542738 1476804 1415626 1358580 1305708
55606A305708m8511m4200m0198l6724l3993l1917k9825k7011k3709k1039j9709
55595I48872j9273j8911j8431j7957j7245j6023j4725j3984j3630j2904j1651
55584G74138j0471r630q624p103n500m444m011l908l894l720l106k073j008j51
55570G06495N85J091R25O6n71O7J948L953N013M944M288L668L381L446L838M621
55554G47758N786P059Q053Q622Q934R289J0038J1581J4104J7260K0454K3496K6691
55541I19125L0350L4514L9206M4489N0183N5934O1767O8123P5139Q2319Q9197
55530A550346R5930J02873J09945J16886J23769J30653J36792J40849J42078J40824
55520B790945J37662J32320J23855J11740R6461P8946N9637L8382J5198r150l3504
$$ plain form
55606 1305708 1257197 1212997 1172799 1136075 1102082 1070165 1040340 1013329 989620 968581 948872
55595 948872 929599 910688 892257 874300 857055 841032 826307 812323 798693 785789 774138
55584 774138 763667 754037 745413 738310 732810 728366 724355 720447 716553 712833 709727 707654 706646 706495
55570 706495 707080 708171 709096 709162 708591 708658 710606 714559 719572 724516 728804 732472 735853 739299 743137 747758
55554 747758 753544 760603 768656 777278 786212 795501 805539 817120 831224 848484 868938 892434 919125
55541 919125 949475 983989 1023195 1067684 1117867 1173801 1235568 1303691 1378830 1461149 1550346
55530 1550346 1646276 1749149 1859094 1975980 2099749 2230402 2367194 2508043 2650121 2790945
55520 2790945 2928607 3060927 3184782 3296522 3392983 3471929 3531566 3569948 3585146 3575996 3542492
55509C542492n7027p9227r9432j16700j30481j41008j48783j53853j55875j54817
55499B305289j51286j46110j39735j32070j22979j12791j02341r2435q3334p4918
55489A147290o7187o0387n4581m9337m4051l8580l3460k9434k6761k4938k3206
55478F95368k1289j9495j8082j6874j5660j4598j3884j3323j2680j2177j2103
55467E25203j2034j1143r389p818p444q238r404j0181j0184r410q199p049o208
55454D08502n633n369n559o013o196n877n368m996m666m172l587l111k850k892
55440C42213l247l614l626l406l402l562l312k552j972k015k277k329k395k628
55426C01876k512j702p78l59q4N07P50k28j720j996o39R30J478J244R34N52o0
$$ plain form
55509 3542492 3485465 3406238 3306806 3190106 3059625 2918617 2769834 2615981 2460106 2305289
55499 2305289 2154003 2007893 1868158 1736088 1613109 1500318 1397977 1305542 1222208 1147290
55489 1147290 1080103 1019716 965135 915798 871747 833167 799707 770273 743512 718574 695368
55478 695368 674079 654584 636502 619628 603968 589370 575486 562163 549483 537306 525203
55467 525203 513169 502026 492637 484819 477375 469137 459733 449552 439368 429958 421759 414710 408502
55454 408502 402869 397500 391941 385928 379732 373855 368487 363491 358825 354653 351066 347955 345105 342213
55440 342213 338966 335352 331726 328320 324918 321356 318044 315492 313520 311505 309228 306899 304504 301876
55426 301876 299364 297662 296884 296525 296441 296948 297698 297470 295750 293754 293115 294045 295523 296767 297701 298253 298193
55409B98193n28n01l40n71j126j596j845j911j835j861k322k877k559j154J35
55394B77302Q2r41j601j423j111j235j568j724j665j375q52n38j064k262l044
55379B56981k679j655q10k47L47P63M77k98o37j65M43M87K29K83N09J96p02j290
55361B52232q94jL68q4p48r61o46r8M55R07J191J294J285J190R55N86K06m7j37
55342B57053j21q2r9j62p0L47R22J179Q02Oo90r60q93q00q34q30n27K8L64Q4n83
55321B54134r24n18K99R05J029Q04L88k40j046j797k145j817q14M39J213J050
55305B50960K71k83j53K41J17p19j629j790j069j49J23m09j036r18o7O41M73k40
55287B44364n82k70N0k51r93j573j739j574j079l48R3k31r37j094m62K07K81m
$$ plain form
55409 298193 297665 297164 296824 296253 295127 293531 291686 289775 287940 286079 283757 280880 278321 277167 277302
55394 277302 277384 276443 274842 273419 272308 271073 269505 267781 266116 264741 263889 263351 262287 260025 256981
55379 256981 254302 252647 251837 251590 251937 252700 253177 252879 252242 252077 252520 253007 253236 253519 254028 254224 253522 252232
55361 252232 251338 251337 251705 251621 250873 249912 249266 249168 249623 250530 251721 253015 254300 255490 256445 257031 257237 257190 257053
55342 257053 256932 256850 256751 256589 256519 256866 257788 258967 259769 259775 259085 258125 257232 256432 255598 254768 254241 254269 254633 254717 254134
55321 254134 253210 252692 252991 253896 254925 255729 256117 255877 254831 253034 250889 249072 248258 248697 249910 250960
55305 250960 251231 250948 250795 251036 251153 250434 248805 247015 245946 245797 245920 245511 244475 243557 243490 244131 244604 244364
55287 244364 243782 243512 243562 243311 242318 240745 239006 237432 236353 236005 236098 235867 234930 233836 233374 233581 233862 233858
55269B33858k21n76j399k293k498j946j293r03m43M27J442J989J729Q29j30m87
55253B28085m7O17O86kp88r68m89J27L66Q9m23p88r06r58r56n92J95Q40Q04L20
55233B25212M0N3l0k22j24J86N6o48j186j055p50q90j217j116o50k97o1M13R78
55214B18692J089O82L37M31P24Q76Q67O78J44o37j139j002n30k87l88m62k50R0
55196B19915K85L49N41R79J455J649J463J031M91p7m75m60K1P60J511K025J971
55179B33434J182R2m77j88M65R05J108J233J112O42K86N30J040J021L18m96j018
55162B41189j356j497j121l03K62N4o14j094j193j103r02n35p6K80M20L21L3k45
55144B32520l05k69n05j052j460j375r93o17k17K60M65J9q08j302j122n99j97
$$ plain form
55269 233858 233637 233061 231662 229369 226871 224925 223632 222729 222286 222713 224155 226144 227873 228702 228572 228085
55253 228085 228038 228655 229341 229339 228551 227583 227094 227221 227587 227676 227253 226465 225559 224601 223645 223053 223248 224088 224892 225212
55233 225212 225252 225305 225275 225053 224929 225115 225171 224523 223337 222282 221532 220642 219425 218309 217659 217362 217301 217714 218692
55214 218692 219781 220463 220800 221231 221955 222831 223698 224376 224520 223883 222744 221742 221212 220925 220537 220075 219825 219915
55196 219915 220200 220549 221090 222069 223524 225173 226636 227667 228158 228081 227606 227146 227167 227927 229438 231463 233434
55179 233434 234616 234708 234231 234043 234508 235413 236521 237754 238866 239508 239794 240324 241364 242385 242703 242207 241189
55162 241189 239833 238336 237215 236912 237174 237228 236614 235520 234327 233224 232322 231787 231711 231991 232411 232732 232765 232520
55144 232520 232215 231946 231441 230389 228929 227554 226561 225944 225727 225987 226452 226471 225663 224361 223239 222640 222443
55127B22443k7P9K70M89N12J85k73l54J11O41O71K63p8j44j61k49k03Q8M37O88
55107B25388Q75R53O84L8n88p92o51n26n73o29m93j69J41J05m69j352j894j530
55089B18518l45R65J644J442P14O2k28l77o90r93q03r6M76L47k23n37l92j86j95
55070B19103j95O0L84M73M12N11P75Q73O58L71K38J41r4l15k54r7k97q52j138
55051B20757p79k41j49l04l4N89P04M2m37J47J266J704J212O51N79O25L43q2l46
55032B26247n42p72p81m53k44n58j009r14l25O9rr7J54M50L52or6L34R69J287
55012B24056J066O49O37J205J725J383J14j278j961j758j041k71K07L48M86R53
54996B26520J443J169o2j289j340j28J354K124J936J111J87k31J96J196K054K312
$$ plain form
55127 222443 222416 222495 222765 223254 223766 223951 223678 223324 223435 224076 224747 225010 224932 224788 224627 224378 224175 224263 224700 225388
55107 225388 226263 227216 227900 227938 227350 226558 225907 225381 224808 224179 223686 223517 223658 223763 223294 221942 220048 218518
55089 218518 218173 219138 220782 222224 222938 223000 222772 222395 221705 220712 219909 219813 220289 220636 220413 219876 219484 219298 219103
55070 219103 218908 218968 219352 219825 220237 220748 221523 222396 223054 223425 223663 223804 223710 223395 223141 223044 222747 221895 220757
55051 220757 219978 219737 219588 219284 219250 219839 220543 220585 220148 220295 221561 223265 224477 225128 225707 226332 226675 226593 226247
55032 226247 225705 224933 224152 223699 223455 222897 221888 220974 220649 220718 220709 220612 220766 221216 221568 221562 221466 221800 222769 224056
55012 224056 225122 225771 226408 227613 229338 230721 230835 229557 227596 225838 224797 224526 224733 225081 225567 226520
54996 226520 227963 229132 229070 227781 226441 226313 227667 229791 231727 232838 233025 232794 232990 234186 236240 238552
54980B38552K091J781J611J626J795K056K389K871L446L741L441K872K795L486
54966B74553M325M579M246L856L738L805L873L808L428K663J775J070M62l20j138
54951C14723j526j507j800k854m076m477l927l258l137l365l366k977k493k169
54937B73791k005j881j685j342q35k23M32J076J551J692J573J522J727K032K271
54922B79696K551K944L220L217L290L798M306L940K579J144M05J42k39q02j307
54907C08884j809k486l095l249l059l028l334l758m117m363m341m048l924m248
54893B60025m394l482j874j030j590k451k278j168j86J89K75L27K59R4n0l25q97
54876B41444j428j457j171j123j189o87L99J123Q37K9n00o96r11j097r71o81o35
$$ plain form
54980 238552 240643 242424 244035 245661 247456 249512 251901 254772 258218 261959 265400 268272 271067 274553
54966 274553 278878 283457 287703 291559 295297 299102 302975 306783 310211 312874 314649 315719 316181 315861 314723
54951 314723 313197 311690 309890 307036 302960 298483 294556 291298 288161 284796 281430 278453 275960 273791
54937 273791 271786 269905 268220 266878 266043 265820 266252 267328 268879 270571 272144 273666 275393 277425 279696
54922 279696 282247 285191 288411 291628 294918 298716 303022 306962 309541 310685 311090 311232 310993 310191 308884
54907 308884 307075 304589 301494 298245 295186 292158 288824 285066 280949 276586 272245 268197 264273 260025
54893 260025 255631 252149 250275 249245 247655 245204 242926 241758 241572 241761 242036 242363 242622 242716 242666 242341 241444
54876 241444 240016 238559 237388 236265 235076 234389 234788 235911 236748 236777 236277 235581 234670 233573 232602 231921 231286
54859B31286q04p44k64M01J070J735K231K177J442L73n21r29q16m32k30m24o93
54842B34858n52j22l8n44j082r99l70K23M52M60N04O80R42J154J170J069J125
54825B38930J413J588J411J229J525K129K381K113J945K408L216L688L543K987
54811B70506K384K158K700L850M722M537L563K750K474K229J585P72J45l81r55
54796C03039j359j372j307j659k395l079l459l549l269k553j734j342j411j488
54782B73063j366j285j317j094m58J48L47M55J004J921K671L048L315L629L784
54767B87865L590L177K766K469K335K413K637K746K436J587M43m19n57k44l30
54752C12914j187k171k463k232k329l001l594l608l373l393l645l799l731l419
$$ plain form
54859 231286 230482 229738 229474 229875 230945 232680 234911 237088 238530 238903 238382 237453 236637 236205 235975 235551 234858
54842 234858 234306 234184 234146 233602 232520 231521 231151 231374 231826 232286 232790 233470 234412 235566 236736 237805 238930
54825 238930 240343 241931 243342 244571 246096 248225 250606 252719 254664 257072 260288 263976 267519 270506
54811 270506 272890 275048 277748 281598 286320 290857 294420 297170 299644 301873 303458 304230 304375 303994 303039
54796 303039 301680 300308 299001 297342 294947 291868 288409 284860 281591 279038 277304 275962 274551 273063
54782 273063 271697 270412 269095 268001 267543 267691 268038 268493 269497 271418 274089 277137 280452 284081 287865
54767 287865 291455 294632 297398 299867 302202 304615 307252 309998 312434 314021 314464 314045 313488 313244 312914
54752 312914 311727 309556 307093 304861 302532 299531 295937 292329 288956 285563 281918 278119 274388 270969
54738B70969k788k030j703k071k633k720k292j762j286p37j73J66K65K57P0m54
54722B51078j124j548j646j606j406q90k96j59n96j122j260r98m94J21N69M96
54706B39119l0m84n47m35m01l65k28j23m8K73Q26J046N52k38o75p02o56n49j55
54687B36180M18Q00R07Q31L67o64j674j643m45Q25J157P90O09Q73J046P21J71
54670B41269p0J57M81L92k75j164j666j484q47j99K23M10L84J76lJ64P34J250
54652B39932J141L83l43l34L61J058J267J120R20O78L10N6K74R36J591J882J798
54635B53030J520J186Q13L49j73m62k21L07M40j2l36N4N85K70p20j139m35N13
54617B55569P27L50R0J09J19N4J2j60n79q73o15m1K19Kk88l48k61j72j76m34r79
$$ plain form
54738 270969 268181 266151 264448 262377 259744 257024 254732 252970 251684 250947 250774 250940 251205 251462 251532 251078
54722 251078 249954 248406 246760 245154 243748 242858 242562 242403 241807 240685 239425 238427 237933 238054 238623 239119
54706 239119 239089 238605 238058 237623 237222 236857 236629 236506 236458 236731 237557 238603 239155 238917 238242 237540 236884 236335 236180
54687 236180 236598 237398 238305 239136 239503 238839 237165 235522 235077 235902 237059 237849 238458 239331 240377 241098 241269
54670 241269 241199 241356 241837 242229 241954 240790 239124 237640 236793 236594 236817 237227 237611 237787 237784 237948 238682 239932
54652 239932 241073 241456 241113 240779 241140 242198 243465 244585 245505 246183 246493 246549 246823 247759 249350 251232 253030
54635 253030 254550 255736 256549 256898 256725 256263 256042 256349 256789 256777 256441 256495 257080 257350 256630 255491 255056 255569
54617 255569 256296 256646 256736 256845 256964 257018 257030 256870 256291 255418 254803 254762 254981 254983 254695 254347 254086 253914 253738 253304 252325
54596B52325j402j208m62K60N38L75q6o22q15m16J67K78k1m6L85N82M9p14r39
54577B48228o54m23l94j91L40P89O72J2o65p51j54N17N29p6m63r6N78Q39O87O16
54557B49940P08O19L07J58L09N05O67J038J520J477N88n69j184j159r57q12n68
54540B52587j25L99Q87J225J210Q01L88M04O82O75L08J11L56O28N01K27L14P24
54522B62302J009R95Q66O21J12l67j62P92J562J309M60K65J125K026J796N72n19
54505B74764p32l28K01Q20J544J952J656J068J030J587J787R99j15m04K99J110
54489B87238J331J136R97R68Q31N12J13l09p33j078j242j169q18k41K36J80m44
54472B87508j169j500j359r06k67L60N71J10p76j522j774j548j075o58n47o81
$$ plain form
54596 252325 250923 249715 249253 249513 250051 250426 250340 249718 248903 248487 248654 248932 248911 248865 249250 249832 249881 249167 248228
54577 248228 247574 247151 246757 246566 246906 247695 248367 248379 247714 246963 246809 247326 247855 247779 247316 247220 247798 248637 249324 249940
54557 249940 250648 251267 251574 251732 252041 252546 253213 254251 255771 257248 257836 257267 256083 254924 253967 253155 252587
54540 252587 252462 252861 253748 254973 256183 256984 257372 257776 258458 259133 259441 259552 259908 260536 261037 261264 261578 262302
54522 262302 263311 264306 265172 265793 265905 265538 265376 266168 267730 269039 269499 269764 270889 272915 274711 275283 274764
54505 274764 274032 273704 273905 274725 276269 278221 279877 280945 281975 283562 285349 286348 286233 285829 286128 287238
54489 287238 288569 289705 290702 291670 292501 293013 293126 292817 292084 291006 289764 288595 287777 287536 287772 287952 287508
54472 287508 286339 284839 283480 282574 282307 282667 283238 283348 282572 281050 279276 277728 276653 275995 275448 274767
54456B74767o88l93j41l35q00j042r66q72p75l00O28J441J539Q99j19j199k075
54439B69569k403k042j256m43J78M66K80j64j89O10J583J631O03m49o23k46j93
54422B66912n86p37k87K82M61M63P69J228J236O62P4j44l26r26j716k028j624
54405B63713q80j69M37Q89J033R29R18J152J318J143Q14O60N87K58l04o39m66
54388B71393m3J82Q8o6j3J74J15m59j246j506q64J04M32l8l73L00J630K408K010
54369B74228J061N62P29J043J166J291J547J598J142M89J97K74K05k42o32m55
54353B84203K58J038J381R15m27k036k769j917o2J381J476M56p43j328j139o78
54337B80009p00j435k221k137j065J88Q25P48L16j99o52r25j064j274j488j212
$$ plain form
54456 274767 274079 273686 273545 273210 272410 271368 270402 269530 268755 268455 269083 270524 272063 272962 272843 271644 269569
54439 269569 267166 265124 263868 263425 263603 264069 264349 264185 263996 264606 266189 267820 268423 267974 267351 267105 266912
54422 266912 266326 265589 265302 265584 266045 266508 267277 268505 269741 270403 270477 270333 270007 269081 267365 265337 263713
54405 263713 262833 262664 263101 263990 265023 265952 266870 268022 269340 270483 271297 271957 272544 272802 272498 271859 271393
54388 271393 271350 271532 271620 271554 271541 271715 271830 271371 270125 268619 267755 267859 268291 268253 267880 268180 269810 272218 274228
54369 274228 275289 275851 276580 277623 278789 280080 281627 283225 284367 284856 285053 285327 285532 285290 284658 284203
54353 284203 284461 285499 286880 287795 287368 285332 282563 280646 280584 281965 283441 283897 283154 281826 280687 280009
54337 280009 279309 277874 275653 273516 272451 272639 273464 274212 274528 274329 273677 272752 271688 270414 268926 267714
54321B67714j58J085J462N73q90j840j750r00K6N02M33J05j33j59m9R1J68Q1k06
54302B66155n39o46m19k3K35J60j36k96n6M01N85K45l44p32p51m41J96J039J634
54283B66267J530Q65K49Jj19l94o98p80o90p08r66j345j568j329n26N09J195J266
54265B62759R79O63L47p3n60j060j603j993j766p89L41R33J009J010R24L70n02
54248B60989r07m37L69P42N89L22K32L22M87M92M2p93j355j064j87M06K65k27
54230B60287n03n46o97r96j087p87m71o39j165j370r04k40oj33j00J65K21m0j23
54211B50866K82P39O94K02l14o36o94l50K82N72O3p35q44o4Q24J083P07N9o22
54192B52114j091j020l92K62L99O0k02P5Q29J504J523Q87K84L50Q84J083N65k63
$$ plain form
54321 267714 267556 268641 270103 270676 269786 267946 266196 265296 265322 265824 266257 266362 266229 266070 266021 266112 266280 266361 266155
54302 266155 265616 264970 264551 264528 264763 264923 264787 264491 264435 264836 265421 265666 265322 264590 263839 263398 263594 264633 266267
54283 266267 267797 268662 268911 268912 268793 268399 267701 266921 266231 265523 264557 263212 261644 260315 259789 260298 261493 262759
54265 262759 263738 264401 264748 264675 264115 263055 261452 259459 257693 256904 257245 258178 259187 260197 261121 261491 260989
54248 260989 260082 259645 260014 260756 261345 261667 261899 262221 262708 263200 263242 262449 261094 260030 259843 260249 260514 260287
54230 260287 259784 259238 258541 257545 256458 255671 255200 254561 253396 252026 251122 250882 250876 250743 250643 250808 251029 250989 250866
54211 250866 251148 251887 252581 252783 252469 251833 251139 250789 251071 251643 251706 250971 250127 250063 250887 251970 252677 252736 252114
54192 252114 251023 250003 249611 249873 250272 250332 250130 250205 251034 252538 254061 254948 255232 255582 256466 257549 258114 257851
54174B57851q74j193j372j418j302j144r96o93j85K68M79O60R97J218R59M11J53
54157B53819M13Q68J179J368J577J744J676J301P28J95l2J26M19M75K19n1l4K16
54139B66206M01L38J30p1k67n38p60o61j55M43P35O97O20O41N88K80j58m08l50
54120B67711k41n43j384k169j989p01O95J143P99O44J004J185O91J1k19j44k65
54103B66228n71p41q05r95j179j069q05p60q42o14r7J64p9m06l08J69N18L05m23
54084B57690j050q56J36R95R52L94K29N54O71L32J07L29M95J46l79m99j79L11
54066B60378R49J697K123J848J149N89L01J01P7M63J057J317J144R75J080J162
54050B76410Q52K39k83m47k36K33P86J241J474J398R79L88L8K19P44J171J375
$$ plain form
54174 257851 256977 255784 254412 252994 251692 250548 249552 248859 248674 248942 249421 250081 251078 252296 253255 253666 253819
54157 253819 254232 255100 256279 257647 259224 260968 262644 263945 264673 264868 264836 264962 265381 265856 266075 266024 265990 266206
54139 266206 266607 266945 267075 267004 266737 266199 265439 264778 264623 265066 265801 266498 267118 267759 268347 268627 268469 268061 267711
54120 267711 267470 266927 265543 263374 261385 260684 261379 262522 263321 263965 264969 266154 266845 266856 266637 266493 266228
54103 266228 265657 264916 264111 263116 261937 260868 260063 259303 258461 257847 257750 257914 257835 257429 257121 257290 257808 258113 257690
54084 257690 256640 255784 255920 256915 257867 258261 258490 259044 259715 260047 260154 260483 260978 261124 260745 260246 260067 260378
54066 260378 261327 263024 265147 266995 268144 268733 269034 269135 269212 269675 270732 272049 273193 274168 275248 276410
54050 276410 277262 277501 277218 276771 276535 276768 277554 278795 280269 281667 282646 283034 283072 283291 284035 285206 286581
54033B86581J616K024K384K507K511K503K302J804J394J591K276K696K375J711
54019C16275J398J488J336M05j087k335k566j553J10J257J025k74j456j775j637
54004C10611j729j938j610o69J59K93j36o91j170j464j412j037o46m30k55j5Q1
53987B97942j52n50q43r81j019q93o08l59k28J1N17J060J306J189P41p4r96j286
53969B94777m75R27J924K115J795J263O52L65R28K238L477M009L894L468K869
53954C24226K246J838J658J435J142J147J584J950J738J122O63O01P86J099J485
53939C44720J827K089K544L391M354M966N190N398N820O368O905P273P170O499
53925D14514N841N983O802P104N975L804J692J81r48j884k471k667k759k913k922
$$ plain form
54033 286581 288197 290221 292605 295112 297623 300126 302428 304232 305626 307217 309493 312189 314564 316275
54019 316275 317673 319161 320497 320902 319815 317480 314914 313361 313471 314728 315753 315479 314023 312248 310611
54004 310611 308882 306944 305334 304665 304824 305117 304981 304290 303120 301656 300244 299207 298561 298131 297876 297861 297942
53987 297942 297790 297240 296397 295416 294397 293504 292896 292537 292309 292320 292837 293897 295203 296392 297133 297059 296063 294777
53969 294777 294302 295229 297153 299268 301063 302326 302978 303343 304271 306509 309986 313995 317889 321357 324226
53954 324226 326472 328310 329968 331403 332545 333692 335276 337226 338964 340086 340749 341350 342136 343235 344720
53939 344720 346547 348636 351180 354571 358925 363891 369081 374479 380299 386667 393572 400845 408015 414514
53925 414514 420355 426338 433140 440244 446219 450023 451715 451896 450948 449064 446593 443926 441167 438254 435332
53910D35332k680k541k875l461l701l384k876k573k503k579k818l094k952k104
53896C95191j036o85j410k537l091k810k245k027k260k621k833k952l235l793
53882C61656m306m270l610k987l147l963m441l880k747k091k224k466k175j530
53868C17819j070r05p76o62q20j291j738j883j719j354r18p04r75j455j433o62
53852B99454J55J28p47j643j858j381n84K20Q37J154J206J175J175J104P58P1
53836C01224p19j108p22K77J236J605J381R09M76K39K61M05L61J11J08O27J188
53819C07859J128O20M68Q95J206Q39J68j24J9J93L12O68J323J852J795J156M23
53802C20800J67M83Q86Q78O31P02J116J212O84J89M82J378K142K506K717K718
$$ plain form
53910 435332 432652 430111 427236 423775 420074 416690 413814 411241 408738 406159 403341 400247 397295 395191
53896 395191 394155 393470 392060 389523 386432 383622 381377 379350 377090 374469 371636 368684 365449 361656
53882 361656 357350 353080 349470 346483 343336 339373 334932 331052 328305 326214 323990 321524 319349 317819
53868 317819 316749 315844 315068 314406 313586 312295 310557 308674 306955 305601 304683 303979 303004 301549 300116 299454
53852 299454 299609 299737 298990 297347 295489 294108 293524 293744 294581 295735 296941 298116 299291 300395 301153 301224
53836 301224 300505 299397 298675 298952 300188 301793 303174 304083 304559 304798 305059 305464 305825 305936 306044 306671 307859
53819 307859 308987 309607 310075 310970 312176 313015 313183 313059 313078 313271 313583 314251 315574 317426 319221 320377 320800
53802 320800 320967 321450 322336 323214 323845 324547 325663 326875 327559 327748 328230 329608 331750 334256 336973 339691
53786C39691K168J291R11J360J921J854J395J268J487J295K76r64j463r49l5N39
53770C52045O11N64P29J017J168J148J125J172J174J136J312J881K638L211L538
53755C74469L935M644N438N895N991O132O486O559N806M510L562L252K829J542
53741D41050k97j847k918m007n231o033o129o051o308o576o277n566n155n213
53727C73442n130m421l391k648k323k111j885j849k083k215j779q54r8l4m35n95
53711C41591j86M19P22O98O13N17K65m4j13Q5K49K80M63Q96J154R23O54J114K273
53692C52573L208L202K535J981J882K077K358K583K450J725P53L45Q81J815K283
53677C82651K079J758J882K395K751K472J515L02n57p07l22P8J67J43L21N64L60
$$ plain form
53786 339691 341859 343150 344061 345421 347342 349196 350591 351859 353346 354641 354917 353953 352490 351541 351506 352045
53770 352045 352656 353220 353949 354966 356134 357282 358407 359579 360753 361889 363201 365082 367720 370931 374469
53755 374469 378404 383048 388486 394381 400372 406504 412990 419549 425355 429865 433427 436679 439508 441050
53741 441050 440753 438906 435988 431981 426750 420717 414588 408537 402229 395653 389376 383810 378655 373442
53727 373442 368312 363891 360500 357852 355529 353418 351533 349684 347601 345386 343607 342753 342655 342621 342186 341591
53711 341591 341405 341824 342546 343244 343857 344374 344639 344595 344482 344567 344816 345096 345559 346455 347609 348532 349186 350300 352573
53692 352573 355781 358983 361518 363499 365381 367458 369816 372399 374849 376574 377327 377672 378553 380368 382651
53677 382651 384730 386488 388370 390765 393516 395988 397503 397805 397248 396541 396219 396297 396464 396607 396928 397492 397852
53660C97852m18j123j001k12L35J23l26k92J14K33q8l09j01J92K08J63M03P39
53642C96492P02K55j46j32K44O98R50Q60O07O47J181J739J722J222R06J055J248
53625D10250J160J090J388J727J519Q04K43K50N43O50N15M27N47P15O45K22l25
53608D22370n64k49L68P86P93O53P09R93J334J632J873K011K053K157K425K662
53592D42006K540K011J361R36J018J795K994L663K903J131q7J38Q77P08l22q97
53576D62775l90M22O42L49O1r4j62k5J47k16j212j965j692q13k78k04q5k0o26
53557D56614j705k054j036M53J090N74l95j134j393j174o23n4L00M57M98L96J88
53540D51002P9J77L43M17M23L73K47K21O20J416K086K192J900J637J564J599J705
$$ plain form
53660 397852 397434 396311 395310 395098 395433 395556 395230 394938 395052 395285 395197 394888 394787 394979 395187 395350 395753 396492
53642 396492 397194 397449 397303 397171 397415 398113 399063 399923 400530 401177 402358 404097 405819 407041 407947 409002 410250
53625 410250 411410 412500 413888 415615 417134 417938 418181 418431 418974 419624 420139 420566 421113 421828 422473 422695 422370
53608 422370 421806 421557 421925 422711 423504 424157 424866 425859 427193 428825 430698 432709 434762 436919 439344 442006
53592 442006 444546 446557 447918 448854 449872 451667 454661 458324 461227 462358 462271 462409 463286 463994 463672 462775
53576 462775 462385 462807 463449 463798 463859 463765 463603 463578 463725 463509 462297 460332 458640 457827 457549 457345 457260 457240 456614
53557 456614 454909 452855 451819 452272 453362 453936 453541 452407 451014 449840 449217 449163 449463 449920 450418 450814 451002
53540 451002 451081 451258 451601 452018 452441 452814 453061 453282 453902 455318 457404 459596 461496 463133 464697 466296 468001
53523D68001J918K191K520L010L653M268M776N365O138O886P368P652P969Q492
53509E40207R374J0615J1723J1973J1387J1030J1821J3367J4465J4526J4035J3760
53497F88283J4060J4917J6125J7426J8742K0174K1517K2046K1304J9919J9037
53486H93550J8996J9135J8890J8509J8484J8823J9079J8816J7946J6882J6343
53475A095453J6669J7292J7276J6397J5268J4456J3949J3507J3008J2324J1411
53464A257010J0671J0635J1066J0943R711Q025O835O177N411M264L082K179J476
53451A347485P37k31j591l347n195o751p928q882r652j0205j0737j1604j2830
53438A259269j3965j4605j4860j5116j5461j5580j5335j5156j5557j6279j6358
$$ plain form
53523 468001 469919 472110 474630 477640 481293 485561 490337 495702 501840 508726 516094 523746 531715 540207
53509 540207 549581 560196 571919 583892 595279 606309 618130 631497 645962 660488 674523 688283
53497 688283 702343 717260 733385 750811 769553 789727 811244 833290 854594 874513 893550
53486 893550 912546 931681 950571 969080 987564 1006387 1025466 1044282 1062228 1079110 1095453
53475 1095453 1112122 1129414 1146690 1163087 1178355 1192811 1206760 1220267 1233275 1245599 1257010
53464 1257010 1267681 1278316 1289382 1300325 1310036 1318061 1324896 1331073 1336484 1340748 1343830 1346009 1347485
53451 1347485 1348222 1347991 1346400 1343053 1337858 1331107 1323179 1314297 1304645 1294440 1283703 1272099 1259269
53438 1259269 1245304 1230699 1215839 1200723 1185262 1169682 1154347 1139191 1123634 1107355 1090997
53427A090997j5238j3541j2407j2243j2466j2337j1573j0291q782p435o397n272
53415I63015l613j709l67K33Q97K318M137N529O267O831P750R265J1319J3518
53401A025390J5273J6341J7032J7758J8652J9830K1546K3665K5475K6540K7406
53390A254908K8876L0866L2569L3553L4082L4530L5120L6106L7571L9030L9900
53379A637111M0335M0968M1832M2258M1974M1554M1440M1274M0577L9584L8856
53368B087763L8383L7604L6104L3950L1463K9022K6865K4858K2559J9764J6775
53357B405110J3956J1261Q440N472K477o48m054p501j0506j3010j5577j8779k2535
53344B354106k6231k9407l2190l4938l7649l9832m1073m1566m1892m2414m3057
$$ plain form
53427 1090997 1075759 1062218 1049811 1037568 1025102 1012765 1001192 990901 982119 974684 968287 963015
53415 963015 959402 957693 957326 957559 958456 960774 964911 970440 976707 983538 991288 1000553 1011872 1025390
53401 1025390 1040663 1057004 1074036 1091794 1110446 1130276 1151822 1175487 1200962 1227502 1254908
53390 1254908 1283784 1314650 1347219 1380772 1414854 1449384 1484504 1520610 1558181 1597211 1637111
53379 1637111 1677446 1718414 1760246 1802504 1844478 1886032 1927472 1968746 2009323 2048907 2087763
53368 2087763 2126146 2163750 2199854 2233804 2265267 2294289 2321154 2346012 2368571 2388335 2405110
53357 2405110 2419066 2430327 2438767 2444239 2446716 2446068 2442014 2434513 2424007 2410997 2395420 2376641 2354106
53344 2354106 2327875 2298468 2266278 2231340 2193691 2153859 2112786 2071220 2029328 1986914 1943857
53333A943857m3678m4264m4708m4699m4013m2778m1328l9969l8873l8048l7227
53322A484272l6063l4533l2994l1706l0565k9405k8249k7060k5572k3673k1753
53311A162699k0246j9016j7564j5764j3952j2374j0923r524q266p111n845m547
53299A017567l703l485l255k198l81J289K198K712L575M924O251P189P962Q947
53285A049592J0129J1224J2183J3229J4372J5272J5703J5972J6531J7289J7679
53274A209175J7443J7016J6923J7052J6859J6219J5687J5744J6113J6005J4975
53263A389211J3280J1487R884Q393O855N329L974K688J021j325l958o060p361
53250A433418q490j0165j2267j4101j5347j6279j7225j8337j9788k1670k3484
$$ plain form
53333 1943857 1900179 1855915 1811207 1766508 1722495 1679717 1638389 1598420 1559547 1521499 1484272
53322 1484272 1448209 1413676 1380682 1348976 1318411 1289006 1260757 1233697 1208125 1184452 1162699
53311 1162699 1142453 1123437 1105873 1090109 1076157 1063783 1052860 1043336 1035070 1027959 1022114 1017567
53299 1017567 1013864 1010379 1007124 1004926 1004545 1005834 1008032 1010744 1014319 1019243 1025494 1032683 1040645 1049592
53285 1049592 1059721 1070945 1083128 1096357 1110729 1126001 1141704 1157676 1174207 1191496 1209175
53274 1209175 1226618 1243634 1260557 1277609 1294468 1310687 1326374 1342118 1358231 1374236 1389211
53263 1389211 1402491 1413978 1423862 1432255 1439110 1444439 1448413 1451101 1452122 1450797 1446839 1440779 1433418
53250 1433418 1424928 1414763 1402496 1388395 1373048 1356769 1339544 1321207 1301419 1279749 1256265
53239A256265k4451k4506k4424k4653k4683k4049k3383k3712k4985k6007k5785
53228I85627k4448k2828k1716k1448k1746k1908k1422k0415j9261j8076j6965
53217G55394j6384j6567j6865j6382j5261j4502j4451j4325j3415j2034j0873
53206E94335j0108r611r423r503r443q948q245p642p029o272n702n681n984o092
53192D84652n939n907o176o428o183n175l612k259j972k837l973m496m366m068
53178D21261l851l686l641l766l891l936m135m492m357l247j779j091j384j823
53164C76182j820j617j470j108m16Q4p4n45o66m03k80m86n66j39M74N61n8o97
53146C66956n45L80J270J526J365J239J172J056J222J943K608K173O38o39m59
$$ plain form
53239 1256265 1231814 1207308 1182884 1158231 1133548 1109499 1086116 1062404 1037419 1011412 985627
53228 985627 961179 938351 916635 895187 873441 851533 830111 809696 790435 772359 755394
53217 755394 739010 722443 705578 689196 673935 659433 644982 630657 617242 605208 594335
53206 594335 584227 574616 565193 555690 546247 537299 529054 521412 514383 508111 502409 496728 490744 484652
53192 484652 478713 472806 466630 460202 454019 448844 445232 442973 441001 438164 434191 429695 425329 421261
53178 421261 417410 413724 410083 406317 402426 398490 394355 389863 385506 382259 380480 379389 378005 376182
53164 376182 374362 372745 371275 370167 369751 369835 369761 369216 368550 368147 367867 367381 366815 366676 367150 367711 367653 366956
53146 366956 366411 366791 368061 369587 370952 372191 373363 374419 375641 377584 380192 382365 383003 382364 381905
53131C81905R19K322L007K998K541J851J289J151J239J054N05M9pj0m60j301j960
53114C97092k077j819j483j144q48q03j079j349j288j129j316j781k030j949j909
53099C75088j993j826j367j165j423j512j057p53j292k055j910r66m56q54j380
53084C55079j350j083j034j041q71p75r10r05n11j42k33n61p00p26q56p84j00
53067C42497Q80J325R23J60m27q06j196j610j831j706j355j009o47K8J023J656
53051C37905J215j4q84p14N6P05J053J216J161R76J006J235J000j2r86q68K02
53034C44252J102J146O00ql59j96N41J312J349O08j32k25K61R39J560J855J540
53017C56145P36N6m0K64M84M23K06q8n20j037j277q19K50J109R11j35q74o51j76
$$ plain form
53131 381905 382824 385146 388153 391151 393692 395543 396832 397983 399222 400276 400781 400830 400823 400813 400353 399052 397092
53114 397092 395015 393196 391713 390569 389721 388918 387839 386490 385202 384073 382757 380976 378946 376997 375088
53099 375088 373095 371269 369902 368737 367314 365802 364745 363992 362700 360645 358735 357769 357313 356459 355079
53084 355079 353729 352646 351612 350571 349700 348925 348015 347110 346599 346457 346224 345663 344963 344237 343381 342597 342497
53067 342497 343377 344702 345625 345785 345358 344552 343356 341746 339915 338209 336854 335845 335198 335226 336249 337905
53051 337905 339120 339106 338222 337508 337564 338269 339322 340538 341699 342675 343681 344916 345916 345904 344918 344050 344252
53034 344252 345354 346500 347100 347092 346733 346537 347078 348390 349739 350347 350215 349990 350251 351190 352750 354605 356145
53017 356145 356881 356937 356897 357161 357645 358068 358274 358186 357666 356629 355352 354533 354783 355892 356803 356668 355794 355143 354967
52998C54967m53j266j525q61p7Q6k21m76n16m15k59k39m90o63k01P45J318J161
52980C50615R57J317J814J703J066M90O0n27j047q54R8R98J125N31l08j050j523
52963C55465j642j487j209p80j18M99N90R8m55o18m74l29k98m23p79j175j077
52946C45788k87N75P51L66K11N64Q27N36O4n8o2m98j149j149k86N16M08k45m76
52927C46396j11J41j22m00o6Q18J770K486K785K385J319K89M6L54K43o21j420
52910C56292j335o82l52n46o82m66k93m84p24n53rN62R26Q97J95j113k257k392
52892C46984j502l25N41R73Q72Q6j044j619j097J3P48P58N04N40R04J182J038
52875C49556O44N58R55J148L66j092j975j640q14n05p00p47m48p7L30Q45J018
$$ plain form
52998 354967 354514 353248 351723 350862 350785 350871 350650 350174 349658 349243 348984 348745 348255 347592 347391 348136 349454 350615
52980 350615 351572 352889 354703 356406 357472 357962 358022 357495 356448 355594 355692 356690 357815 358346 358038 356988 355465
52963 355465 353823 352336 351127 350347 350229 350728 351318 351416 350961 350343 349869 349540 349242 348819 348040 346865 345788
52946 345788 345501 346076 346827 347193 347404 347968 348795 349331 349395 349337 349275 348777 347628 346479 346193 346709 347117 346872 346396
52927 346396 346285 346426 346304 345904 345838 346656 348426 350912 353697 356082 357401 357690 357736 358090 358333 357712 356292
52910 356292 354957 354275 353923 353377 352695 352229 351936 351452 350728 350175 350166 350728 351654 352551 352746 351633 349376 346984
52892 346984 345482 345157 345698 346671 347543 347629 346585 344966 343869 343882 344630 345388 345892 346432 347336 348518 349556
52875 349556 350200 350758 351713 352861 353227 352135 350160 348520 347706 347201 346501 345754 345306 345229 345559 346404 347422
52858C47422K92r57j620j289o61l02J51J058J799J534N49J4M23R82P51j16n81
52841C49449qJ162J968J936J404R72Q82R18O95J1q81j312q43KJ05q96k080k441
52823C51043k145j974k021j805j463j725k601l085k578j775j623k045k274j923
52809C22006j169k37P03J303J267O81j20q34j175r50m30k49o35j083j072o92k40
52792C17074K53O93O80J76j26K68P88O27o6n34o37p60q34m54J48L05P3J70P00
52773C18544R55O56L36J65m84j707k389j659k05P19R71J221J490J135R7p78q02
52756C18265j19P12J247J254Q53N62P44J023P64Q7k29J81Q29J143J057P36K74
52739C29383p9K2N22R36J058J158J274R44J20l90k1M69m3j298j846j036Q7K16
$$ plain form
52858 347422 347714 346757 345137 343848 343187 342885 343036 344094 345893 347427 347976 347990 348413 349395 350146 350030 349449
52841 349449 349441 350603 352571 354507 355911 356883 357765 358683 359378 359389 358508 357196 356353 356355 356460 355564 353484 351043
52823 351043 348898 346924 344903 343098 341635 339910 337309 334224 331646 329871 328248 326203 323929 322006
52809 322006 320837 320600 321303 322606 323873 324554 324434 323600 322425 321475 321045 320796 320161 319078 318006 317314 317074
52792 317074 317327 318020 318700 318876 318750 319018 319806 320433 320367 319833 319196 318436 317602 317148 317296 317601 317674 317844 318544
52773 318544 319499 320155 320491 320656 320172 318465 316076 314417 314212 314931 315902 317123 318613 319748 319845 319067 318265
52756 318265 318146 318858 320105 321359 322212 322774 323518 324541 325305 325392 325163 325344 326173 327316 328373 329109 329383
52739 329383 329304 329326 329848 330784 331842 333000 334274 335218 335338 334948 334927 335396 335353 334055 332209 331173 331260 331476
52721C31476o27j409j452r65m53k23l23n43m49K09J102J534J182M14j21j13K21
52704C29460M28K45j56l30KO47J132J116O30J4l08j13M27Q77R63Q28P84R20J025
52685C38591Q53L37k97o28l96J64N63O13N00K54l90j311j713r93L65J339J580
52668C39431J536J515J338R48O42N85O13O70R17J234J204Q03N97R25J419J561
52652C55938J333R97P20O40Q07Q63L10o45j186j110j155j650j778r34R2L40K81
52635C53863Q97J661J096p81k155j937j085q48r80o31n1k50j389k519k719j869
52619C40303n11N36O13j32p04l23O00R98M95k58m53J11J075J822J807R94J8l94
52601C46597k28o1j96k58K36J165J794J470L28o41m78O32J319M73j336k332j475
$$ plain form
52721 331476 330849 329440 327988 327023 326570 326347 326024 325481 325032 325241 326343 327877 329059 329473 329352 329239 329460
52704 329460 329888 330133 329977 329647 329649 330296 331428 332544 333174 333188 332880 332767 333194 334071 335034 335862 336646 337566 338591
52685 338591 339444 339781 339484 338856 338460 338624 339187 339800 340300 340554 340164 338853 337140 336147 336512 337851 339431
52668 339431 340967 342482 343820 344768 345410 345995 346608 347278 348195 349429 350633 351436 352033 352958 354377 355938
52652 355938 357271 358268 358988 359628 360435 361298 361608 360963 359777 358667 357512 355862 354084 353150 353242 353582 353863
52635 353863 354760 356421 357517 356736 354581 352644 351559 350711 349731 349100 349049 348799 347410 344891 342172 340303
52619 340303 339792 340328 340941 340809 340105 339782 340382 341380 341875 341617 341164 341275 342350 344172 345979 346973 346991 346597
52601 346597 346369 346308 346112 345854 346090 347255 349049 350519 350847 350206 349728 350360 351679 352152 350816 348484 347009
52584C47009L93J463Q36p13j651j158K83J541J888J406N32l59r55r37k86M91Q13
52567C50596O62M89N53O78O46N24M74N10N87P03P63N63J32j41J8K94J43m02o23
52548C57169n4Q32J198Q73M31K52N7m37q00m04N99J339J341J078J158J426J248
52531C67306N00k17k85K40Q44J088R08M53j00o02r02q44l84K67O75N24n4n54n87
52512C68276l15k06l87m14J34R36J208P21J34N0J13m52j589k360k204j674j572
52495C60399j812j611o04P06J572J728J434J130J123J460J863J887J282L01m15
52480C70443l99J42M77J50m83o52o6Q04J264J022K87m64p69m82N8L10P6l99q36
52461C70483j149j219q41j58J90k69j147j545j047j37M55N56N87Q67J108P86L8
$$ plain form
52584 347009 347402 348865 349701 348988 347337 346179 346462 348003 349891 351297 351829 351470 350515 349578 349292 349783 350596
52567 350596 351258 351747 352300 352978 353624 354148 354622 355132 355719 356422 357185 357748 357880 357739 357757 358051 358194 357792 357169
52548 357169 357115 357947 359145 360018 360449 360701 360758 360321 359521 359117 359716 361055 362396 363474 364632 366058 367306
52531 367306 367806 367589 367304 367544 368388 369476 370384 370837 370737 370135 369233 368389 368005 368272 368947 369471 369417 368863 368276
52512 368276 367961 367755 367368 366954 367088 368024 369232 369953 370087 370137 370250 369798 368209 365849 363645 361971 360399
52495 360399 358587 356976 356372 357078 358650 360378 361812 362942 364065 365525 367388 369275 370557 370858 370443
52480 370443 370044 370186 370663 370813 370330 369678 369612 370416 371680 372702 372989 372525 371756 371274 371332 371642 371718 371319 370483
52461 370483 369334 368115 367274 367116 367306 367037 365890 364345 363298 363161 363616 364172 364759 365626 366734 367520 367558
52444C67558k24N63J675J848R16K2O1O62J036J080J059Q28K13k67J4O53O85J03
52426C78485q4M82Q46L34k19L48J681K355J887J263J358J839K034K081K467K983
52410D00140K959K407K040K097J835O45r72k016k232k131k098k003j710j383j183
52395C96395j080j010r08o13k13k49j092k151k370j561n37J02N55R79J088R56
52379C88291J268K048K152R05n40o16M95J347J425J443J673J491P97M84R71J438
52363D05072J136N16L51N15M26O9j48j68j85j21K42P97J279J618J845J897J845
52346D16986J986K336K438K041J584J559J821K008K225K694L083K887K315K158
52332D48121K782L787M590M795M222L135K435K903M144M867M410L461L066L448
$$ plain form
52444 367558 367334 367897 369572 371420 372336 372358 372419 373081 374117 375197 376256 377084 377297 377030 377044 377697 378382 378485
52426 378485 378401 378883 379729 380063 379844 380192 381873 384228 386115 387378 388736 390575 392609 394690 397157 400140
52410 400140 403099 405506 407546 409643 411478 412123 411151 409135 406903 404772 402674 400671 398961 397578 396395
52395 396395 395315 394305 393397 392784 392571 392322 391230 389079 386709 385148 384611 384713 385268 386247 387335 388291
52379 388291 389559 391607 393759 394664 394124 393508 394003 395350 396775 398218 399891 401382 402179 402663 403634 405072
52363 405072 406208 406724 407075 407590 408016 408085 407937 407769 407584 407463 407705 408502 409781 411399 413244 415141 416986
52346 416986 418972 421308 423746 425787 427371 428930 430751 432759 434984 437678 440761 443648 445963 448121
52332 448121 450903 454690 459280 464075 468297 471432 473867 476770 480914 485781 490191 493652 496718 500166
$$ [...]
##END NTUPLES=NMR SPECTRUM
##END=
